##TITLE=1H_Ser Am4-VH
 CDCl3
 8 sc, 
 16.11.2022
##JCAMPDX= 6.0         $$ Bruker NMR JCAMP-DX V2.0
##DATA TYPE= NMR FID
##DATA CLASS= NTUPLES
##ORIGIN= UXNMR, Bruker Analytische Messtechnik GmbH
##OWNER= root
$$ XWIN-NMR		Version 3.5
$$ Wed Nov 16 13:58:07 2022 Russian Standard Time (UT+4h)  she@DPX200
##.OBSERVE FREQUENCY= 200.1313499994
##.OBSERVE NUCLEUS= ^1H
##.DELAY= (6, 6)
##.ACQUISITION MODE= SIMULTANEOUS
##.ACQUISITION SCHEME= undefined
##.AVERAGES= 8
##.DIGITISER RES= 18
##SPECTROMETER/DATA SYSTEM= spect
##.PULSE SEQUENCE= zg30
##.SOLVENT NAME= Acetone
##.SHIFT REFERENCE= (INTERNAL, Acetone, 0, 15.7039)
##AUDIT TRAIL= $$ (NUMBER, WHEN, WHO, WHERE, WHAT)
$$ ##TITLE= Audit trail, XWIN-NMR		Version 3.5
$$ ##JCAMPDX= 5.01
$$ ##ORIGIN= Bruker BioSpin GmbH
$$ ##OWNER= she
$$ F:/spectra/data/she/nmr/H-F/1/audita.txt
$$ ##AUDIT TRAIL=  $$ (NUMBER, WHEN, WHO, WHERE, WHAT)
(   1,<2022-11-16 13:56:53.82 +0400>,<she>,<DPX200>,
      <created by zg, POWCHK disabled, PULCHK disabled
       configuration hash MD5:
       00 E9 B6 7A A2 85 ED C7 34 08 36 98 17 FE 4E 26
       data hash MD5: 16K
       12 81 3C 90 51 75 1E 32 5B 8B 7B 98 0B 25 24 9D>)
$$ ##END=
$$ 
$$ hash MD5
$$ 2A 70 3D 9B 95 E7 01 30 A9 01 86 90 8C EB 8B 75
##$RELAX= 
##$RELAX= 
##$RELAX= 
##$RELAX= 
##$RELAX= 
##$RELAX= 
$$ Bruker specific parameters
$$ --------------------------
##$DU= <F:/spectra>
##$EXPNO= 1
##$NAME= <H-F>
##$PROCNO= 1
##$TYPE= <nmr>
##$USER= <she>
##$AMP= (0..31)
100 100 100 100 100 100 100 100 100 100 100 100 100 100 100 100 100 100 
100 100 100 100 100 100 100 100 100 100 100 100 100 100 
##$AQSEQ= 0
##$AQ_mod= 1
##$AUNM= <au_zg>
##$AUTOPOS= <>
##$BF1= 200.13
##$BF2= 200.13
##$BF3= 200.13
##$BF4= 200.13
##$BF5= 200.13
##$BF6= 200.13
##$BF7= 200.13
##$BF8= 200.13
##$BYTORDA= 1
##$CFDGTYP= 0
##$CFRGTYP= 5
##$CHEMSTR= <none>
##$CNST= (0..31)
1 1 145 1 1 1 1 1 1 1 1 1 1 1 1 1 1 1 1 1 1 1 1 1 1 1 1 1 1 1 1 1 
##$CPDPRG= <>
##$CPDPRG1= <>
##$CPDPRG2= <>
##$CPDPRG3= <>
##$CPDPRG4= <mlev>
##$CPDPRG5= <mlev>
##$CPDPRG6= <mlev>
##$CPDPRG7= <mlev>
##$CPDPRG8= <mlev>
##$CPDPRGB= <>
##$CPDPRGT= <>
##$D= (0..31)
0 1.2 0 0 0 0 0 0 0 0.06 0 0.03 0 0 0 0 0.0002 0 0 0 0 0 0 0 0 0 0 0 0 
0 0 0 
##$DATE= 1668592613
##$DBL= (0..7)
120 120 120 120 120 120 120 120 
##$DBP= (0..7)
150 150 150 150 150 150 150 150 
##$DBP07= 0
##$DBPNAM0= <>
##$DBPNAM1= <>
##$DBPNAM2= <>
##$DBPNAM3= <>
##$DBPNAM4= <>
##$DBPNAM5= <>
##$DBPNAM6= <>
##$DBPNAM7= <>
##$DBPOAL= (0..7)
0.5 0.5 0.5 0.5 0.5 0.5 0.5 0.5 
##$DBPOFFS= (0..7)
0 0 0 0 0 0 0 0 
##$DE= 6
##$DECBNUC= <off>
##$DECIM= 32
##$DECNUC= <off>
##$DECSTAT= 4
##$DIGMOD= 1
##$DIGTYP= 9
##$DL= (0..7)
0 120 120 120 120 120 120 120 
##$DP= (0..7)
150 150 150 150 150 150 150 150 
##$DP07= 0
##$DPNAME0= <>
##$DPNAME1= <>
##$DPNAME2= <>
##$DPNAME3= <>
##$DPNAME4= <>
##$DPNAME5= <>
##$DPNAME6= <>
##$DPNAME7= <>
##$DPOAL= (0..7)
0.5 0.5 0.5 0.5 0.5 0.5 0.5 0.5 
##$DPOFFS= (0..7)
0 0 0 0 0 0 0 0 
##$DQDMODE= 0
##$DR= 18
##$DS= 0
$$ [...]
##$SUBNAM2= <"">
##$SUBNAM3= <"">
##$SUBNAM4= <"">
##$SUBNAM5= <"">
##$SUBNAM6= <"">
##$SUBNAM7= <"">
##$SUBNAM8= <"">
##$SUBNAM9= <"">
##$SW= 18.0517283424941
##$SWIBOX= (0..15)
0 0 2 0 0 0 0 0 0 0 0 0 0 0 0 0 
##$SW_h= 3612.71676300578
##$TD= 16384
##$TD0= 1
##$TE= 0
##$TE2= 300
##$TE3= 300
##$TEG= 300
##$TL= (0..7)
0 120 120 120 120 120 120 120 
##$TP= (0..7)
150 150 150 150 150 150 150 150 
##$TP07= 0
##$TPNAME0= <>
##$TPNAME1= <>
##$TPNAME2= <>
##$TPNAME3= <>
##$TPNAME4= <>
##$TPNAME5= <>
##$TPNAME6= <>
##$TPNAME7= <>
##$TPOAL= (0..7)
0.5 0.5 0.5 0.5 0.5 0.5 0.5 0.5 
##$TPOFFS= (0..7)
0 0 0 0 0 0 0 0 
##$TUNHIN= 0
##$TUNHOUT= 0
##$TUNXOUT= 0
##$USERA1= <user>
##$USERA2= <user>
##$USERA3= <user>
##$USERA4= <user>
##$USERA5= <user>
##$V9= 5
##$VALIST= <valist>
##$VCLIST= <CCCCCCCCCCCCCCC>
##$VD= 0
##$VDLIST= <DDDDDDDDDDDDDDD>
##$VPLIST= <PPPPPPPPPPPPPPP>
##$VTLIST= <TTTTTTTTTTTTTTT>
##$WBST= 1024
##$WBSW= 4
##$XGAIN= (0..3)
0 0 0 0 
##$XL= 0
##$YL= 0
##$YMAX_a= 203621
##$YMIN_a= -347098
##$ZGOPTNS= <>
##$ZL1= 120
##$ZL2= 120
##$ZL3= 120
##$ZL4= 120
##$ABSF1= 10
##$ABSF2= 0
##$ABSG= 5
##$ABSL= 3
##$ALPHA= 0
##$AQORDER= 0
##$ASSFAC= 0
##$ASSFACI= 0
##$ASSFACX= 0
##$ASSWID= 0
##$AUNMP= <proc_1d>
##$AZFE= 0.1
##$AZFW= 0.1
##$BCFW= 1
##$BC_mod= 2
##$BYTORDP= 1
##$COROFFS= 0
##$CY= 11.3945322036743
##$DATMOD= 1
##$DC= 2
##$DFILT= <>
##$DTYPP= 0
##$F1P= 2.36226072786647
##$F2P= -0.459571619588291
##$FCOR= 0.5
##$FTSIZE= 0
##$FT_mod= 4
##$GAMMA= 1
##$GB= 0.15
##$INTBC= 1
##$INTSCL= 1
##$ISEN= 128
##$LB= 0.24
##$LEV0= 0
##$LPBIN= 0
##$MAXI= 10000
##$MC2= 0
##$MEAN= 0
##$ME_mod= 0
##$MI= 1.114404
##$NCOEF= 0
##$NC_proc= 0
##$NLEV= 6
##$NOISF1= 3.799351
##$NOISF2= 2.8
##$NSP= 1
##$NTH_PI= 0
##$NZP= 0
##$OFFSET= 15.70392
##$PC= 1
##$PHC0= -18035.18
##$PHC1= 17.2007
##$PH_mod= 1
##$PKNL= yes
##$PPARMOD= 0
##$PSCAL= 0
##$PSIGN= 0
##$REVERSE= no
##$SF= 200.130013532006
##$SI= 16384
##$SIGF1= 3
##$SIGF2= 2
##$SINO= 400
##$SIOLD= 16384
##$SREGLST= <1H.CDCl3>
##$SSB= 0
##$STSI= 0
##$STSR= 0
##$SW_p= 3612.71676300578
##$SYMM= 0
##$S_DEV= 0
##$TDeff= 0
##$TDoff= 0
##$TI= <>
##$TILT= no
##$TM1= 0
##$TM2= 0
##$TOPLEV= 0
##$USERP1= <user>
##$USERP2= <user>
##$USERP3= <user>
##$USERP4= <user>
##$USERP5= <user>
##$WDW= 1
##$XDIM= 8192
##$YMAX_p= 0
##$YMIN_p= 0
$$ End of Bruker specific parameters
$$ ---------------------------------
##NTUPLES= NMR FID
##VAR_NAME=  TIME,          FID/REAL,        FID/IMAG
##SYMBOL=    X,             R,               I
##VAR_TYPE=  INDEPENDENT,   DEPENDENT,       DEPENDENT
##VAR_FORM=  AFFN,          ASDF,            ASDF
##VAR_DIM=   8192,          8192,            8192
##UNITS=     SECONDS,       ARBITRARY UNITS, ARBITRARY UNITS
##FACTOR=    0.0002768,     1,               1
##FIRST=     0,             0,               0
##LAST=      2.2672688,     0,               0
##MIN=       0,             -347098,         0
##MAX=       2.2672688,     203621,          0
$$ Real data points
##PAGE= N=1
##DATA TABLE= (X++(R..R)), XYDATA
0@%%%%%%%%%%qJ6j6J6j7K5l2M0n5O3p2Q8j04J22j46J76k07K38k71L11l58M08m64
33b47N27n95O70p55Q48r51J063j184J315j459J617j788J978k186K411k658K927
50A533l225L554l916M320m769N273n843O495p249Q131r181J0453j2032J4054j6750
65i152K0552k6345L6356n8456J98175j21208k92549L03750J27540j16954n9806
76A903O7412p1598j2000P6347q308q3015P0970M7148j16773o9080J46937Q4186
88A34129j14386r6859O6964N8915j0852q474l941l1316J2426M1748l675l6883
100G796R347K8675r549j8009J1261n697j3714L0828K4245n8240m8078N9950N5415
113G4230n5505m9681L7346K4939l2946j7092K8040K7485j7227m3909p414M3267
$$ plain form
0 0 0 0 0 0 0 0 0 0 0 0 -8 8 -8 8 -9 16 -16 24 -31 32 -40 48 -56 66 -80 96 -111 127 -144 167 -191 217 -247
33 -247 280 -315 355 -400 448 -503 560 -624 691 -768 849 -939 1039 -1147 1264 -1394 1533
50 1533 -1692 1862 -2054 2266 -2503 2770 -3073 3422 -3827 4304 -4877 5576 -6456 7598 -9152
65 -9152 11400 -14945 21411 -37045 161130 39922 -252627 51123 178663 61709 1903
76 1903 69315 -2283 -14283 62064 53756 -29259 41711 88859 -27914 -96994 49943 134129
88 134129 19743 -77116 -10152 48763 37911 29437 25496 -5820 6606 48354 44679 7796
100 7796 17143 45818 36269 18260 29521 23824 10110 40938 65183 6943 -41135 18815 74230
113 74230 18725 -30956 6390 31329 -1617 -18709 9331 36816 19589 -24320 -31734 11533
125A1533L4901j1988l5912k3689J4058N2064K0635n3020l0367M5718J8475m6670
137d262l37N9585m704p4554j1922O2229J9214l6824j8752N541J945j328K012M458
151B301N117l492j9778j1931K3350L1017m997l1921j3067K3492K0633j0912l357
164F455J7466r395l2975L410M0963K0176k4861l8985j1920K9585L8169r280m2691
177a3883j0563K1530M658q457R263R504k1503k4772J6591L2005p96k0543p626
190a4592N269N068Q386J0460n484j3443L713R589l943J426J1415m958j7017M218
204A07J3456j0633r833J7032N426k3367j1045J0777J0360M675k444j6413j4150
217b6052J1441J9929L349n031p739j4902J01K6573J9982j1866k4272o856J4295
$$ plain form
125 11533 46434 34446 -1466 -25155 -11097 40967 61602 8582 -21785 23933 42408 -4262
137 -4262 -4599 54986 50282 -24272 -36194 26035 45249 8425 -10327 -4786 -2841 -4169 -2157 2301
151 2301 7418 3926 -15852 -27783 -4433 26584 21587 -10334 -23401 91 20724 9812 6455
164 6455 23921 14526 -18449 -15039 25924 46100 21239 -17746 -29666 -81 38088 28808 -13883
177 -13883 -24446 -2916 1742 -6715 2548 12052 -9451 -34223 -17632 14373 13577 -6966 -14592
190 -14592 -9323 -4255 4131 14591 9107 -4336 -623 8966 5023 6449 17864 12906 -4111 107
204 107 13563 2930 -6903 10129 15555 -7812 -18857 -8080 2280 6955 4511 -11902 -26052
217 -26052 -14611 5318 8667 3636 -4103 -19005 -18904 7669 27651 15785 -8487 -15343 -1048
230a048J7301P287p804j5466o995M180R459J0101%j3752j7176m318J8336J9395
244A9500q626k5237p983J4472J2174k687n489k145J003K967j681j002J0466P044
258A2776q483r116L776Q318M811J724k521q026l718M615M123M799J308j1853j3252
273a0719K249J2766O810m248j1821j1150J07J5857J2151o168j4112q180M861J5496
287C899J0889n078j2302o011O118J2227P265k619r868n648J715P100Q403j498
301A4592j2135n368L767K238J321R31l126o789k160K185o24K747O384l583r894
316i514j059N715P056O514j497r004o186N467J1768O540k308r065r435K959J2005
331I956P942j898j2409j2714K335J2671P552l860j1817j0642q00J2539J1209n448
$$ plain form
230 -1048 16253 23540 15736 270 -6725 -2545 6914 17015 17015 3263 -13913 -18231 105 19500
244 19500 10874 -14363 -22346 -7874 4300 1613 -3876 -6021 -5018 -2051 -3732 -4734 5732 12776
258 12776 4293 -4823 -1047 7271 12082 13806 11285 3259 -459 4156 8279 13078 14386 2533 -10719
273 -10719 -8470 4296 11106 6858 -4963 -16113 -16006 -149 12002 5834 -8278 -16458 -11597 3899
287 3899 14788 9710 -2592 -8603 -2485 9742 17007 14388 4520 -1128 587 7687 16090 14592
301 14592 2457 -2911 856 3094 4415 5346 2220 -4569 -6729 -4544 -5168 -2421 3963 380 -9514
316 -9514 -10573 -4858 2198 8712 7215 -1789 -7975 -2508 9260 15800 13492 4427 -5008 -2049 9956
331 9956 17898 16000 3591 -9123 -6788 5883 13435 9575 -2242 -12884 -13684 -1145 10064 4616
345D616j1944n086J801P996R614o09r106m047L911N507M584L388l160o380O73
360A758L803J906L005M07n875m025n01J851K643K086k070q032m070J941L365N130
376C322J570q573q344J693P997R677J814q461j1247J379J4856J0172k954r133
390C768p548J149J0942Q057j778p341p942k308O203R180P79r498r042j801N158
405b022Q429Q74r014o303J858M085K621J054n30q34j679j084J939O084N206k409
421H275n602j544K120N746N055k009o768m525J045M383M267J166o400r919j497
436f207P028P092O19q488r824N58Q626O829L9n589o315j938P695J0494J605p021
452E203o612q4P230P770L33n974n203p44M939L727j507k787j344k219n163J689
$$ plain form
345 4616 -7328 -12414 -10613 -2617 6997 6388 -2718 -6765 -2854 2653 7237 10625 7465 1085 1758
360 1758 5561 7467 10472 10879 5004 979 478 2329 4972 7058 4988 -3044 -7114 -5173 -1808 3322
376 3322 4892 -3681 -12025 -10332 -2335 7342 9156 695 -10552 -9173 5683 15855 12901 3768
390 3768 -3780 -2631 8311 16368 14590 7249 -693 -3001 3202 12382 13161 3663 -5379 -7180 -2022
405 -2022 6407 7281 -1733 -8036 -6178 -2093 528 1582 1052 218 -1461 -2545 -606 5478 10684 8275
421 8275 2673 1129 3249 8995 14050 12041 5273 748 1793 6176 10443 11609 5209 -4710 -6207
436 -6207 821 7913 8532 44 -9780 -9222 -596 6233 6272 683 -5632 -7570 125 10619 12224 5203
452 5203 -1409 -1493 5737 13507 13840 7866 2663 1919 6858 10585 9078 6291 4947 2728 -2435 -746
468g46Q033n41p594m352Q91L110L451M81k176k398R9k82J320O258M319l567o382
485g6k869M611J1780O303j0547j3978K172J2154N000l649n451o636k934O270N030
500G180o79m462m003m398n35O889P827k130j1473o955P938J4165P20j1308m030
515e254O971N241k509j539L902K761l837m122L79M490M679j729o955o258K006
530a774P683J664p365l442K262j779l973M354Q769m047j1849m14Q574M780J052
545D495j430n152m370L701J1113N062p219r014M53O566M463O65k106o102n000
560c875L490N575m78k599k667l920k310L804N685j784n404k739M84M330M323k190
576b75k623J990N83k584K162P748Q40p734r31M617q69l65O478O36j0299o184O279
$$ plain form
468 -746 7287 6746 -848 -5200 -4309 -1199 2252 2733 557 -1841 -1742 -2024 -704 5554 9873 6306 -76
485 -76 -2945 1666 13446 19749 9202 -4776 -2604 9550 14550 10901 5450 -1186 -4120 2150 7180
500 7180 6501 2039 -1964 -6362 -6897 -8 7819 5689 -5784 -12739 -4801 9364 10084 -1224 -5254
515 -5254 1717 6958 4449 2910 6812 9573 5736 1614 1993 6483 11162 9433 2478 -3780 -1774
530 -1774 5909 7573 208 -3234 -972 -2751 -6724 -2370 6399 2352 -9497 -9911 -1337 3443 4495
545 4495 3065 -2087 -6457 -2756 8357 13419 6200 -2814 -2361 4205 8668 9333 7227 1125 -3875
560 -3875 -385 5190 4712 2113 -554 -4474 -6784 -2980 2705 921 -4483 -7222 -6738 -2408 1915 -275
576 -275 -2898 -908 -325 -2909 -747 7001 7841 107 -824 3793 2924 2559 9037 9673 -626 -6810 -531
593e31P371m52m236o101n471M256Q484j73o991l802J960O83L30N974K990o913
609b622o483K949R299O174l430r520k474R688O426n267m131L765n07n202J460
624A25M851L16m431l425j528O56L722J184m157k693J373m92r53L838L541k500
640e73m858m98M318M759K397k877l957l24K736L482L127k04n511n879K069Q286
656F493K399o089n253j115N63J984L958l04o627m164K324L687K276J263m302m432
672g339K413N944J401k261N58P44k211K12M159K866j022l047l057J437M079M62
688E338l299q86O69k821k737K936L985j441n208m548J470O687K967m358m993P2
704f167L262L187K150M43k631l369M93N028N224k88o256l602K649N133K312k775
$$ plain form
593 -531 6840 6388 2152 -3949 -9420 -5164 3320 3147 -3844 -7646 -5686 -5003 -4673 1301 4291 -2622
609 -2622 -9105 -6156 3143 9317 5887 -3633 -6107 3581 10007 4740 609 4374 3867 -1335 125
624 125 4976 5292 861 -2564 -4092 -3436 286 1470 -2687 -5380 -4007 -4499 -5452 -1614 1927 -573
640 -573 -5431 -5929 -1611 3148 5545 2668 -1289 -1613 1123 4605 7732 7528 2017 -3862 -1793 6493
656 6493 8892 2803 -2450 -3565 -3002 -1018 2940 2636 -3991 -8155 -5831 -2144 132 1395 -2907 -7339
672 -7339 -4926 1018 2419 158 716 1460 -751 -539 3620 6486 5464 2417 -640 797 4876 5338
688 5338 2039 1153 1822 -999 -3736 -800 3185 1744 -3464 -8012 -6542 145 3112 -1246 -6239 -6167
704 -6167 -2905 282 2432 2875 244 -3125 -2632 2396 7620 7332 1076 -2526 123 5256 7568 4793
720D793l810k753Q2K442K192m32l329l940k76L089J602j150p50q93j024r3K399
737a851K712O43q64k598o54L730L704o16j161j199j707Q72K786K260o92l183m350
754b168n23M297M010l435n590j935P23L045L052q73m020k786J230L089L130J413
770B659l282m089J302N120K575j84j741k341j11K675K603J31j899k552j646J727
786I47K129o58j453j770j924p2O28Q15R01p93k596j688J593L329J565j170j719
803a936j470J367L647K383J52k572k850K27L761M045m49m429l362M52K812L324
819E102p86m541l318l48K255L003j2l176l755kK892K249L75q30k226o04K352K028
837F58J351K68j112j036M98J946J576J20j088j912q19O14J500N79l56k984k562
$$ plain form
720 4793 983 -1770 -1688 754 2946 2514 -815 -4755 -5031 -1942 -340 -1490 -2240 -3133 -4157 -4250 -1851
737 -1851 861 1504 640 -1958 -2612 1118 4822 4206 3045 1846 139 1011 3797 6057 5365 2182 -2168
754 -2168 -2691 1606 5616 2181 -3409 -5344 -4621 -1576 1476 603 -3417 -6203 -4973 -1884 1246 2659
770 2659 -623 -4712 -3410 1710 4285 4101 2360 19 -92 2583 5186 5317 3418 866 -780 947
786 947 3076 2418 965 -805 -2729 -2801 -2173 -1358 -457 -1250 -3846 -5534 -3941 -612 953 -217 -1936
803 -1936 -3406 -2039 1608 3991 4143 1571 -1279 -1052 2709 6754 6305 1876 -1486 -1034 1778 5102
819 5102 4316 -225 -3543 -3891 -1636 1367 1355 -1821 -5576 -5578 -2686 -437 -62 -892 -3118 -3722 -1370 658
837 658 2009 2277 1165 129 627 2573 4149 4269 3181 1269 450 1064 2564 3143 2787 -197 -2759
854b759J36K000J875n79k972k993L57K996K812o28k086j853m71L602L856K70l023
871E40j680N65K415K939J062k580l071L07J588J865P27j765l394j510J388J654
887A050Q16j653k424j699Q86J956L03M03r08j535r5K002J574J090k75q39j282
904f30N88L133J732j33j670k545j77K966J704m87k450k553o13R78K184P92k297
921E22l409j685J879L437Q34k284k840j174K473M268L94k328j469O56J924J340
937B538J246L9j332j611Q23J243J823k40k418j416n83P74J271K31j991j929o62
954b194O62K46M88J022j507k331J90K320K456L88j627k199L67K753K905K70j535
971B674k478l87L206J822m97q79j880k491L07L172J169k307l315j134P49J821
$$ plain form
854 -2759 -2623 -623 1252 673 -2299 -5292 -4935 -1939 873 245 -1841 -3694 -4165 -563 3293 3563 540
871 540 -1140 -575 1840 4779 5841 3261 190 497 2085 3950 4677 2912 -482 -1992 -604 1050
887 1050 1866 213 -2211 -3910 -3024 -1068 -765 -362 -1270 -2805 -2900 -898 676 1766 1491 652 -630
904 -630 -42 3091 4823 4690 3020 475 298 3264 4968 4481 2031 -522 -1135 -157 2027 2819 522
921 522 -2887 -4572 -2693 744 1578 -706 -3546 -4720 -2247 2021 2415 87 -1382 -726 1198 2538
937 2538 3784 3823 2491 880 1703 2946 4769 4529 2111 695 112 886 2157 2388 397 -1532 -2194
954 -2194 -1532 -1286 -798 224 -1283 -3614 -3424 -1104 1352 1740 113 -2086 -1719 1034 3939 4209 2674
971 2674 196 -191 3015 4837 4340 3461 1581 -910 -603 2569 3738 1431 -1884 -3018 -2269 -448
987d48J274j604j917j188K80K407J930r22j393J8N50P09J638J730j055j831M81
1004F59J492L24L52Q59j688k026l93J947J106o15k128k342K25Q21N78O97l80k680
1022c192j491J691K353N80n23j284j552J063L553J698j741j705l29J339K672P30
1038C862j319j663q54R0J462J413j341k431m93J54m28R02M00j246k057n68J492
1055b625J575n10n25j49l17M35J144J447Q88p71j123k72J577K250Q48j815k201
1072a44q58J862J824L7j606j916j145O16J094Q74o57k525j778O76K416Q75r69
1089a324j122o85Q4K076J897j52j185o54J41K202J666m21j180p10l10J160Q97
1106B380M61j549j423k61q24O56J343o10j932j180L26P42J018P3o25j418k43R98
$$ plain form
987 -448 826 -778 -2695 -3883 -3603 -1196 734 -188 -1581 -1563 -1013 -304 1334 3064 2009 178 659
1004 659 2151 2475 2827 3686 1998 -28 -421 1526 2632 2017 -111 -2453 -2228 -1407 -829 -132 -512 -3192
1022 -3192 -4683 -2992 -639 -59 -582 -1866 -3418 -2355 1198 2896 1155 -550 -879 460 3132 3862
1038 3862 2543 880 26 116 1578 2991 1650 -781 -1274 -1120 -1548 -646 -246 -1492 -3549 -4117 -2625
1055 -2625 -1050 -1560 -2085 -2234 -2551 -2116 -972 475 1363 592 -531 -803 774 3024 3872 2057 -144
1072 -144 -1002 860 2684 2721 1115 -801 -1946 -1330 -236 638 -19 -2544 -4322 -3646 -1230 -355 -1324
1089 -1324 -2446 -3131 -3047 -971 926 774 -411 -1065 -924 1278 2944 2523 1343 633 323 1483 2380
1106 2380 2841 1292 -131 -392 -1216 -560 783 173 -1759 -2939 -2613 -1871 -853 -780 -1405 -2823 -3066 -2068
1124b068J707J361p99j557n2J531J642J150l51j486j371O54K058J120n24k240
1140G75j878M49K084N29j370j932j231L77R32P37j25j061p58p21J119K151O10
1157F87j162p27M68Q33J150N92J94p81l71J32M68J262P73j674j472k83O46M00
1175A135K22p86j909j286O04J216P19m15j697j176Q34J640J144j84j024q89Q50
1192a002J582J410Q6q44j120J33J609J529m73j416j413K77R38N50J1j008j804
1209i55n00N90P03R1n95j668k18K16J545O04p12k73l62N2J144J451Q90o74r01
1228D28j00O01J463P40m36j553o87j18J071J123l58k133j701K00J238R58m27j762
1246a453j467L30R46J433L82j266j047k78J804J600L30p75k42m17P83J620J93
$$ plain form
1124 -2068 -361 1000 201 -1356 -1408 123 1765 2915 2564 1078 -293 361 2419 3539 3015 775
1140 775 -1103 -654 1430 1959 589 -1343 -2574 -2197 -1265 -528 -653 -1714 -2472 -3193 -2074 77 687
1157 687 -475 -1202 -734 99 1249 1841 2035 1254 883 1015 1483 2745 3518 1844 372 89 735 1135
1175 1135 1357 571 -1338 -2624 -2020 -804 -85 -500 -2197 -3373 -2539 -899 245 61 -963 -1852 -1002
1192 -1002 580 1990 2076 1232 112 245 1854 3383 2910 1494 81 358 1296 1846 1857 849 -955
1209 -955 -1455 -865 -162 -71 -666 -2334 -2552 -2336 -791 -187 -899 -1172 -1534 -1482 -338 1113 2003 1329 428
1228 428 328 929 2392 3132 2696 1143 456 338 1409 2532 2174 41 -1660 -1460 -222 736 309 -1453
1246 -1453 -2920 -2590 -1644 -211 171 -1095 -2142 -2420 -616 984 1314 539 297 -120 663 2283 2476
1263B476k35k75p58k28O24P27o19j107o28n48J19Q03J81j241q64o21n1J279J067
1282A01m87j467m57R38J271J108J11p99q22O60J083J222M83j208j314K45J171
1299A839J153k08j551j286n63R37P42n24q36j095q72P39J204N6m99q21m36L29
1317a692J446R63m96j34k91M7J160J452M6n96o80k13N34N50L23l54j035r45m2
1336D3P79M04k25j111j565k51O62J359J3j002r20l49R83J478N48q06j011j38J603
1355D94J309P66r25p58j07N82R98N27q09p21q64J49O74J96n96j164r01J52O45
1374c53j16K5k58j089JN56M89R95o44r7m54L99J439J095k74r86j35K13Q20J019
1394B645N2j432r62m9M13J106k41j338j075m46N23P80L76j101j228l58O41J043
$$ plain form
1263 2476 2241 1966 1208 980 1604 2331 1712 605 -23 -571 -452 351 532 -709 -1573 -2194 -2245 -966 101
1282 101 -386 -1853 -2310 -1372 -101 1007 1118 319 -503 157 1240 2462 2945 1737 423 668 1839
1299 1839 2992 2784 1233 -53 -616 321 1063 539 -297 -1392 -2264 -1525 -321 -265 -764 -1585 -2021 -1692
1317 -1692 -246 717 221 87 -204 -157 1003 2455 2501 1905 1225 1012 1546 2096 2419 2065 1030 85 43
1336 43 822 1226 1001 -110 -1675 -1926 -1264 95 108 -894 -1814 -2163 -1180 298 846 40 -971 -1109 494
1355 494 1803 2569 1644 886 779 1361 2359 2886 2077 1356 492 641 1315 1511 915 -249 -1150 -998 -353
1374 -353 -469 -444 -702 -1791 -1790 -1234 -745 250 -394 -491 -945 -546 893 1988 1714 728 593 806 1626 2645
1394 2645 2697 1265 303 254 667 1773 1532 194 -881 -1327 -804 -24 352 -749 -1977 -2335 -1694 -651
1412f51O14l16p72m06Q22J028P86K35n21n97K61O08J193l19l74p51m91L39J025
1431A713n68l97r63o65J7N01L96l67r13m29k82N88Q11k8l16l68j56N93J341P24
1451A232m82q28Q2P39P61P06o82r46l60Q93M32K24m71j293q37N6J029j24m50o46
1471i65j182K13J187K56k31n96j72J33N30R22K55k45l04M42L2Q91O63n02L6q92
1491D71k7P11O25p0j000q20l74L37M31L12j196j047j89P49J81N54o57n47l61N90
1511a327J183M91m8l40o56Q81R53K89j94j55l91J07P37L27J37j429k61l62L80
1530C22L72l15o01o88l49K46M83j92n3o11j26M11O4Q29L54m48j46M62N67N43N22
1551A646m12n81j41P50O98N1n37q86o15L63L66N12n90j210o81Q0M32P42k29j278
$$ plain form
1412 -651 -37 -353 -1125 -1531 -709 319 1105 1340 819 222 483 1091 2284 1965 1591 840 349 688 1713
1431 1713 1145 748 -215 -880 -863 -362 34 -333 -1246 -1675 -1957 -1369 -558 -586 -902 -1270 -1426 -833 508 1232
1451 1232 750 -78 4 743 1504 2210 1528 582 222 1115 1547 1771 1300 7 -830 -774 255 131 -319 -965
1471 -965 -2147 -1934 -747 -491 -722 -1318 -1490 -1357 -827 95 350 105 -199 243 275 1166 1829 1327 1363 471
1491 471 444 1155 1780 1710 710 -110 -484 -147 284 596 -600 -1647 -1836 -1087 -906 -352 -1009 -1556 -1917 -1327
1511 -1327 -144 347 299 -41 -697 184 1137 1426 1232 1077 686 793 1530 1857 1994 565 304 -58 322
1530 322 694 379 -222 -910 -1259 -1013 -530 -722 -775 -1386 -1512 -1101 -1037 -208 146 -302 -448 14 581 1124 1646
1551 1646 1234 653 512 1262 1960 2011 1474 588 -27 336 702 1214 624 -586 -1267 -1187 -755 -13 -242 -1520
1571a520j54M57K57R58j78l13l52M96O54M14O36m08o39J58P62M98j10K39n48p89
1591E18j73M25K33o9q46q84l46P39J6P1l15n38o25M63R40L90m32k32l04M21R42
1612C94Q43m74l49j53P30L84L83j22p23m19L6O95J5J35j016q06j58qO79O9n33
1633c98r41k56K69O69M21l7n47m66P15Q44M91n8j94m50M66L96N20J71j01p52N4
1654H16k4O78j47m42n73q66j01P42J49k99q32p28L23O00P27l10m24m31J62O34
1674c46P63m2p0n57L28P98M88M03o34m39K0L31L16k49m09m58m06J58R4K01n72
1695b82l06k74n9K80j68N12m78j66j99N73M25M37K14m20m09R93L52K40r4m69l29
1716C73L87P53Nk16m64n94l48M17J20j26o03o90L1J51M12L33p15m96J5J83O80
$$ plain form
1571 -1520 -1674 -1217 -960 -2 -180 -493 -845 -349 305 719 1355 947 308 466 1228 1726 1616 1855 1307 518
1591 518 345 770 1003 934 88 -796 -1142 -403 -387 -316 -631 -1169 -1794 -1331 -391 -1 -433 -665 -969 -548 394
1612 394 1237 763 414 261 991 1375 1758 1636 913 494 530 1225 1240 1375 359 -447 -605 -613 66 135 -398
1633 -398 -1339 -1595 -1326 -657 -236 -273 -820 -1286 -571 273 764 706 512 62 528 924 1444 1615 1514 762 816
1654 816 792 1470 1323 881 308 -558 -659 83 232 -67 -899 -1627 -1304 -704 23 -287 -711 -1142 -980 -346
1674 -346 417 375 305 -252 76 874 1362 1765 1131 692 712 1043 1359 1110 701 243 -163 -5 89 290 -282
1695 -282 -588 -862 -921 -641 -809 -297 -775 -941 -1140 -567 -142 295 509 89 -320 673 1025 1265 1171 702 373
1716 373 760 1513 1518 1302 838 244 -104 313 433 307 -296 -986 -955 -804 -392 -59 -774 -1270 -1255 -1072 -392
1737c92N31l32jj82O86J82M11J03l10r3J34K79L54M8m02p62j6J57K40o7n79m88
1759d99k80J56J3O4j7k50l69K60L56L92K25k32k03j4P11L37M68l22j84J8M84L43
1781A457N4j46o65o73N60L72j57n54n56j88P7J19QQ2p53k07J65L01L44L58k22
1802b24n64M19L29N24J63K52k07j36L68J71N92p0q02l59R2K90O7Lp98m99jJ13
1824b77M73l61m29n87k7L17P46j52r2j89P8L36L99P14j66l58l7K78N21J91J10
1845A488o08k97j56N20P3k75l05m55J22p8J63l98l58l78j36J79K88N56m62k12
1865g29l18M62L61M78R6k29l7M95L65Q5L00o19r9j2K54M01p7o94l11n79N33P8
1887B04J44p76k01k09j85M85O1j16l56N9L1P77K05o4l6J26M8K23O36J11k72k40
$$ plain form
1737 -392 139 -193 -194 -376 310 492 903 1006 696 603 737 1016 1370 1418 1016 254 238 395 635 568 -11 -499
1759 -499 -779 -623 -610 -546 -563 -813 -1182 -922 -566 -174 51 -181 -384 -398 313 650 1118 796 612 630 1114 1457
1781 1457 1511 1365 700 27 587 959 802 248 -308 -496 -419 -300 -292 -210 -963 -1170 -1005 -704 -360 -2 -224
1802 -224 -788 -369 -40 484 647 899 692 556 924 1095 1687 1617 815 456 548 838 905 908 110 -389 -390 -277
1824 -277 196 -165 -594 -1181 -1208 -891 -145 -297 -389 -578 -500 -164 235 949 783 425 388 666 1187 1378 1488
1845 1488 880 583 427 947 1020 745 440 -15 107 29 192 -206 -564 -942 -1078 -899 -611 -55 -517 -729
1865 -729 -1047 -585 -224 254 350 121 84 579 944 1029 1329 710 611 599 853 1254 1177 483 172 -407 126 204
1887 204 348 -428 -629 -838 -1023 -538 -477 -593 -949 -890 -859 -82 123 59 23 149 197 420 1056 1167 895 655
1909F55M9J38M5J86k60l61l66j73%K02p0p13k10l0p4M49K04m42k31J40K15K75
1931c72K29j50K49o9K76M21L36j10j14L5k05N66nn9n53l21j73M70k58p2k76p44
1953h99r9L27l6p5Lj92K1J57L95K49l39q3K95J39O54J45J47o77M59m11N35K67
1975I82J17l64n11q7Q5K37Q6l99p66j41L36j73K58l34l70j71Q0N05M10K67m32
1996c85k38J03P42J44Q7L7m28J70M78L81j63k62j81m96O39K35l79n17J28q85N36
2017b54K3J36m66k70L5k69K54M57p7l36L50k47L33O35M5P4k70O2M55K48K77m48
2039G47l64K28j20K14L42o90l44n00M15Qj59jl85k48K71O8R3K69j11k90k96O54
2061a99K69K50r3k89L3P8Q29K02l21k01J50l40M11N2k98j96n90L92k58J76P8m91
$$ plain form
1909 655 704 842 887 1073 813 452 86 -87 -87 115 45 -668 -878 -908 -982 -533 -329 -771 -1002 -862 -647 -372
1931 -372 -143 -293 -44 -113 163 584 920 810 696 731 526 1092 1087 1028 475 154 -19 451 193 121 -155 -899
1953 -899 -998 -671 -707 -782 -779 -971 -950 -793 -398 -149 -488 -571 -276 -137 517 662 809 132 591 180 715 982
1975 982 1099 735 224 137 222 459 545 146 -620 -761 -425 -598 -340 -674 -1044 -1215 -1135 -630 -220 47 -385
1996 -385 -623 -520 222 366 453 490 62 232 710 1091 928 666 485 -11 628 863 484 -33 95 -790 -254
2017 -254 -231 -95 -561 -831 -796 -1065 -811 -354 -431 -767 -417 -664 -331 304 349 423 153 215 670 918 1195 747
2039 747 383 611 491 705 1047 357 13 -487 -72 -64 -223 -224 -609 -857 -586 -518 -425 -156 -267 -557 -853 -199
2061 -199 70 320 227 -62 -29 49 878 1080 759 558 708 368 779 831 533 337 -253 139 -119 57 135 -356
2083c56l24k5kL2M05k79q7k17K79L50K01M15j59j91K94L40j6K00r9n08K09L54
2105H16J9j91j22m3o38J52K20J6n60k2l06Kr6M28l07k60J67k01K65L99M28j42
2127B4J57q1J34K82M8o5L5l57N00J18L85l89n74l08N65k63L04o78k34j13j78L92
2149b96K7l73J17k05j27L03M75Kj11P4K8qN57l3j85L6K23J4K10K55Ko44k4o6K24
2174D75j18J25l59n24r0L67r3k71M0l92J52j37M64n1J17j03N5K79M46K5J83M9
2196F39l42J48L88j59L20l34k53j84L88j86j3j64n80K38r9r3l2M3n48pJ90K07
2218d33M52m15k28M14p3N97r2L39j11m33J14P83R5m5o9l96Q0r3o5J35k20k21l45
2241b30J81J47j14l18p0l60J69N5M37j80k63L1J79J53K67L02j30m9K0J21N50k01
$$ plain form
2083 -356 -680 -705 -707 -675 -270 -549 -636 -853 -574 -224 -23 392 233 42 336 676 660 860 761 253 462 816
2105 816 835 644 522 479 -159 -7 213 229 -331 -353 -659 -657 -753 -325 -632 -892 -725 -926 -661 -262 166 24
2127 24 181 100 234 516 564 499 534 177 677 795 1180 791 217 -91 474 211 515 -163 -397 -510 -688 -296
2149 -296 -269 -642 -525 -730 -857 -554 -79 -77 -188 -114 -86 -94 463 430 245 281 504 518 728 983 985 341 317 251 475
2174 475 357 482 123 -401 -491 -124 -217 -488 -448 -840 -688 -825 -361 -412 -295 -398 -343 -64 382 407 590 639
2196 639 297 445 833 674 994 660 407 223 611 425 412 248 -332 -94 -193 -286 -318 -275 -823 -830 -640 -433
2218 -433 19 -396 -624 -210 -283 314 222 561 450 17 131 914 1009 964 895 499 579 486 421 556 336 115 -230
2241 -230 -49 98 -16 -334 -404 -764 -595 -540 -103 -283 -546 -515 -336 -183 84 386 256 207 227 348 898 697
2263F97J5m6j68P3QJ14O6n70m23O7J17M4k52J19n38N6K53o0K19o5j88M8L1J94
2287a89K3K40l4P8j96N43K37j48J8j14l6K68n5o4k64m65m1R9K76j86m02j44J29
2310d27j02J64J70l4o00N7M7M31K18j34j01M20l38M84K72p0K34p09L45J12K50
2331F89n1l90P8k69m8m9K51k79l57j56j14M84j23J32k33k28r1J53K09K00J3r3
2353b72kM16K61k7K1m3K74m53N01j50k77j14r1r5Q9Q4j3m07j49j33j07L10j50
2376e27j3j61M31k56J06o0K42k35L5L71n0N89j19R8n0j24P3N13m09j90Qk22N37
2399E87k3o23R7k39M8j54j42J24q3j50k92L53j06K02j5J1k3j60P44K73k10M5k44
2422B0L48J00J90n6M5l19k66L21J3R4m85l5r4j99J37J67k49p7k03M0pJ59N0N9
$$ plain form
2263 697 712 666 498 571 579 693 759 189 -234 -167 -50 -6 -258 -139 -677 -621 -368 -428 -209 -274 -462 -414 -383 -189
2287 -189 -166 74 40 118 -78 465 702 554 572 458 422 690 635 571 307 -158 -199 -100 176 -10 -412 -556 -427
2310 -427 -529 -365 -195 -229 -829 -772 -725 -294 -76 -210 -311 109 -229 255 527 457 691 -18 327 439 689
2331 689 638 248 326 57 9 -40 211 -68 -425 -581 -695 -211 -334 -202 -435 -663 -754 -601 -392 -192 -179 -272
2353 -272 -274 142 403 376 397 354 628 175 676 526 249 135 44 -51 38 122 109 -298 -447 -580 -687 -377 -527
2376 -527 -540 -701 -270 -526 -420 -480 -238 -473 -438 -67 -117 472 353 451 401 277 350 863 454 264 272 50 587
2399 587 564 -59 38 -201 -153 -307 -449 -325 -408 -558 -850 -497 -603 -401 -416 -405 -428 -588 156 429 219 264 20
2422 20 368 468 658 602 647 328 62 383 396 490 5 -30 -124 -323 -186 -19 -268 -345 -548 -508 -515 -356 -306 -247
2446b47q3J80J10J36M4j16l3K80M1L33j68j76J33Q8Q8L1k22k4o22L24k34J71k29
2469a95n7K84o80K00K62k27j26J32J77k23NL64RL22n6k72K51J34O3P8J71j78j69
2492B69L7K16k38j80L7m58L44P1k32j22j24j13J06Q4o7j70J23q9K74p7L18R6l28
2515b23P4K62L05j82J09n2K52j77j18M72k54k35k97K94l16J42N6k88j21j48J64
2536b81pk0j33l7q2K03K63J12j20J30n3O9K29J80j0r6j05n9K83J96J2p1n28J85
2560B60r2L2M1l97J14m78J36K27j43o3M2k04j30M07J90J26k25m5L45r9L8K07J8
2583C07m3J49m56N44M9j60j78j4O0L8m0l66J49k78r4J46n3j33k54K39L1m1J00
2606b98l9J19k32L51j09N20j70J06l2K61j45Q9J00j8m23J69M7jJ66j89k71K8j18
$$ plain form
2446 -247 -330 -150 -40 96 140 24 -9 271 312 645 477 301 434 522 610 641 419 395 -227 97 -137 34 -195
2469 -195 -252 32 -648 -448 -186 -413 -539 -407 -230 -453 -448 -84 -75 247 191 -81 170 304 367 445 616 438 269
2492 269 306 522 284 104 141 -317 27 98 -134 -256 -380 -493 -387 -303 -370 -540 -417 -506 -232 -309 9 105 -223
2515 -223 -149 113 418 236 345 293 545 368 250 722 468 233 -64 230 -86 56 112 -176 -297 -445 -281
2536 -281 -288 -308 -441 -478 -560 -357 -94 18 -102 28 -25 44 273 453 443 347 242 183 466 662 674 603 75 260
2560 260 168 200 241 -156 -42 -520 -384 -157 -300 -363 -321 -525 -655 -248 -58 68 -157 -202 143 44 82 289 307
2583 307 264 413 -43 501 550 390 212 198 258 296 256 -110 39 -239 -333 -187 -240 -373 -627 -388 -357 -398 -298
2606 -298 -337 -218 -450 -99 -208 312 142 248 216 477 332 421 521 503 80 249 296 295 461 272 1 29 -89
2629h9q8j32kn2j50J17L1R8K6K77k48j43K98K10n1J67j47o4j7J36L92N2l57K10
2653D74m23K26K08n84K69K5r6k73J79k75Q6k37m1r2K45j09K70l41l8M30n3P8L6
2676c6K03j47J8K4M44j42m0k09J73R5P6J55m09l03J42K8m0r2n6j58o4J11k01M9
2700c79J53J2j17J0r6K02O6p0O7J36P3K51j25J18j62K70kj7p4j29k55q8L66m36
2724b26M41m02j1k69j25L32J50j50o9j38%MR4K01J89q5p9k72J88P68j52m0j05
2747B44o0J06J75R5k54j87k53N6J76q4l6q7k72oj13K03L1k73R6M2K55p5o6K33
2771e4km8K77k2J1J62L5j30K74J39l67j73L8K30k28N4k36j16j50j00J33Q9O2k72
2795c94L3k17K15N4J88R2j00l5N3j9N19k68o6N3O5J5K73J5O3n62K28j44m0L30
$$ plain form
2629 -89 -177 -309 -311 -363 -513 -396 -365 -267 -241 36 -212 -355 -57 153 102 269 122 58 41 177 569 621 264 474
2653 474 51 277 485 -99 170 195 99 -174 5 -270 -184 -421 -462 -554 -309 -418 -148 -489 -527 -97 -150 -72 -36
2676 -36 167 20 38 62 506 364 324 115 288 383 459 614 205 -98 44 72 32 -60 -116 -274 -338 -227 -428 -379
2700 -379 -226 -214 -331 -321 -417 -215 -149 -219 -152 -16 57 308 183 301 139 409 407 390 316 187 -68 -156 210 -226
2724 -226 215 -187 -198 -467 -592 -260 -110 -260 -329 -467 -467 -463 -369 -168 21 -64 -143 -415 -227 541 389 349 244
2747 244 184 290 465 560 306 119 -134 -78 98 14 -22 -109 -381 -387 -500 -297 -266 -539 -443 -401 -146 -221 -287 -54
2771 -54 -56 -104 173 151 162 324 359 229 503 642 275 102 140 370 142 196 -40 -156 -306 -406 -273 -184 -122 -394
2795 -394 -361 -578 -363 -309 -121 -29 -129 -164 -111 -130 389 121 55 108 173 188 461 476 539 -23 205 61 21 351
2819C51n64L72m78J80J71k30l4r4r9L13p7p0L36k37k28L3L33Q3m3K3L06p9K2N
2843B95O9J90j68k27K28j57O1j7l6k86k67N35l94R5k69L25n28M12Nj42l9L9r4
2866c70n1J89K30K32p1np9J96K03K9qj90J15l24M18j55k70n9k64K93K39m57j10
2889b69L3j67K74l16L86o9k68L24l09K00L8L89l34K29J50j34K49k95J57O0J1k7
2911C12L12l91k77J61K68k96L1Q9Lk24k43k2J41o6k50K80k1p9k6pJ85J00j60Q0
2935a00M81m6l49J69J50k6R9j0P1j78k5j73J29J08j17l02l6p1Q1m0J54P9m11J78
2959a85j30J20l31N90k1l59L89K90l57J12K12k55M6n1J36J17Q5l8k90p2K62m0
2981B30m4n3m05n1LL48k86pJ42q6O7j14k62L54K51k7q0J59J45K1q6L9J78k83J87
$$ plain form
2819 351 -213 159 -319 -139 32 -198 -232 -326 -425 -112 -189 -259 77 -160 -388 -355 -22 61 18 41 347 268 290 295
2843 295 364 554 386 159 387 230 291 274 238 -48 -315 220 -174 -79 -348 -23 -551 -139 -134 -276 -315 -276 -370
2866 -370 -421 -232 -2 230 159 154 75 271 474 503 495 305 420 96 514 359 89 30 -234 59 298 -159 -269
2889 -269 -236 -403 -129 -445 -59 -128 -396 -72 -381 -181 -143 246 -88 141 291 157 406 111 268 328 339 312
2911 312 624 233 -44 117 385 89 120 209 212 -12 -255 -277 -136 -202 -452 -172 -193 -272 -298 -305 -120 -20 -180 -100
2935 -100 381 335 -14 155 305 279 378 368 439 261 236 63 192 300 183 -119 -155 -226 -145 -185 -31 48 -363 -185
2959 -185 -315 -195 -526 64 43 -316 73 363 6 118 330 75 121 70 206 323 408 370 80 8 270 230
2981 230 186 133 -272 -323 -320 28 -258 -265 -123 -209 -142 -256 -518 -164 87 60 -20 139 284 305 219 258 436 153 340
3006C40l09M4NK50q5j53k00M49n21l17K50o4J63m6j19j9K29j30M3J48j30MK94
3029A26k18K00J1Q9p9qK63k22N6L84l80J8N5j25j00J00q7j0r2l0rn7p9N7j15l
3055b55K6J1P7j59L9mL51k21J36J09r7K98l63N04oo6j18q1J55n9m7j52j77K84
3079A85l81L53n7m47J11L3K2K33K62o41O3P2qJ32R0L5j13J14Ko5K78J5j36K39
3103C91j26N6j2l04J31kp0R1j90Lj05m6l1J33M5k1k01J15n6N9J08l1J19j15j77
3128b36J85L02j89m3NJ65p5M9k65N67m35M1qN4N1j34k13J16k09L01k22M6k98K87
3152a58k7P5m7k20L09J05j60K22J28j89k65K07J36M1j93M2J67Q0q4p6r2M6j00
3175e3j96L11J00j58m6j13L6j64J21N0l4P6n2j02J49pR3J72k57p7K01J9j26K48
$$ plain form
3006 340 31 75 80 330 245 92 -108 341 -180 -497 -247 -311 -148 -194 -313 -332 -103 -233 -190 -42 -172 -168 126
3029 126 -92 108 119 208 129 121 384 162 218 602 222 240 295 170 70 170 83 73 -19 -49 -58 -115 -194 -137 -252 -255
3055 -255 -229 -218 -141 -300 -261 -265 86 -135 1 110 13 311 -52 452 446 380 262 181 336 277 230 78 -99 185
3079 185 -196 157 100 -347 -236 -203 -181 52 314 -327 -264 -192 -200 -68 22 57 -56 58 60 -5 273 288 152 391
3103 391 265 321 309 5 136 134 64 155 -35 -32 -137 -183 -214 -81 -36 -57 -258 -143 -199 -140 -32 -63 56 -59 -236
3128 -236 -51 251 62 19 24 189 114 163 -102 465 30 71 63 117 168 34 -179 -63 -272 29 -193 -147 -445 -158
3152 -158 -185 -110 -157 -377 -68 37 -123 99 227 38 -227 -20 116 157 -36 6 173 253 169 93 1 47 -53
3175 -53 -249 62 162 4 -42 -155 -119 -283 -162 -112 -146 -70 -122 -224 -75 -82 11 183 -74 -151 50 69 -57 191
3199A91M9m0K7J76k35k18L64m06L11k31q3J19r4l37J86mL5MK79j29k96J03J2M22
3223B05j79J66M3j55j13N3J94j22jQ7l40J26J9K06j35R5l24M80l09o0j82K90l07
3246b63j47N25k51m3j33J11k7L79k83K68k7j7K09k16R4J28j38j37J55K4k27n5
3268g1Q7j6LK1J19om62J38K9O9j65j01J67P2j20J56k6J89l7m1pK89l69J58J04
3293A80n2k4J01R7k57M88j09l57P8r9P2J39m27K19L2k89o7K84j64J45L7k11J6
3316a68K34l22K48r9J25p3K15n6j32J95r8J26Ok6mJ00o4k41n0J12K1J72k49j10
3340a38K47j85J3J25j03j92K51j89K65j63O7q2m9J93j68K82K00j36k02J02j8k01
3362h1J39k6R3p5K1p7J0k57J49m2K58k07J01j77K4o4K30j90n5L06o6K16m72j6
$$ plain form
3199 191 240 200 227 403 168 -50 314 -92 219 -12 -95 24 -70 -407 -221 -225 -190 -186 93 -36 -332 -229 -217 205
3223 205 26 192 235 80 -33 20 214 92 91 178 -162 -36 -17 189 54 149 -175 305 -4 -64 -246 44 -263
3246 -263 -410 115 -136 -179 -312 -201 -228 151 -132 136 109 92 301 85 179 307 169 32 187 211 -16 -71
3268 -71 16 0 3 24 143 137 -325 -187 -158 -89 -254 -355 -188 -116 -236 -80 -106 83 46 5 -2 287 -82 76 180
3293 180 128 104 205 302 45 533 424 67 145 46 118 257 -170 49 81 -208 -275 9 -155 -10 27 -184 -168
3316 -168 66 -256 -8 -107 18 -55 160 104 -28 167 69 195 201 175 171 271 207 -34 -84 28 49 221 -28 -138
3340 -138 109 -76 -63 62 -41 -233 18 -171 94 -69 -2 -84 -133 60 -108 174 374 238 36 138 120 -81
3362 -81 58 32 125 50 71 -6 4 -253 -104 -146 112 -95 6 -171 -147 -211 19 -171 -226 80 14 230 -242 -258
3386b58L75j66L27j12k28K45N3MP6k40J4K66j17j27r7J2J06j47m04K45K22j7j76
3409a44R9j31J55l61L56j95M2J68N4k73K06L09j92j2J16k7K02m04q9J18j42N67
3431D22l22J1m29M35j89j77Q8KO3j13M5Q8J94k68j2M7j7Q1o1k0J47L5M5J71j31
3456A35j59J41o2QJ84k05K26k93j3J17l60O2K65k62j05K10J70j88K15p7p9j28
3478a98J73P1J13k01N1K88k36k1LJ70l3j15l6n1K06L5q3o0j49J39j03k6Q6L3o9
3503a3l5j71J86M2q5j40l6L84k94J7j12J80O1J60J00k71L49j52j42Q7J09k41J92
3526A75k2%K4j9m3j96j50K56R5k12K56m49j08K73qj05m9K17k20M7P5L29j04j09
3550d7k9J68j18k4M4Q9J02j62j5K08k38J42l19Q8L6MJ24nk18K12j24k41K57J57
$$ plain form
3386 -258 117 -49 278 166 -62 183 236 240 316 76 90 356 239 112 15 27 133 -14 -418 -173 49 32 -144
3409 -144 -45 -176 -21 -382 -26 -221 -179 -11 43 -230 -24 285 93 81 197 170 372 -32 -121 -3 -145 422
3431 422 100 111 -318 117 -72 -249 -161 -159 -96 -209 -164 -76 118 -150 -162 -115 -132 -51 -112 -132 15 50 95 266 135
3456 135 -24 117 55 63 247 42 268 -25 -38 79 -281 -219 46 -216 -321 -111 59 -129 86 9 -70 -198
3478 -198 -25 46 159 -42 9 297 61 40 43 213 180 65 29 -22 184 219 136 76 -73 66 -37 -63 23 56 -13
3503 -13 -48 -219 -33 9 -76 -216 -252 132 -162 -145 -257 -77 -16 144 244 -27 322 170 28 115 224 -17 175
3526 175 153 153 177 158 115 -81 -231 25 120 -92 164 -285 -393 -120 -128 -233 -282 -65 -285 -238 -163 166 62 -47
3550 -47 -76 92 -26 -50 -6 83 185 23 8 216 -22 120 -199 -111 -75 -71 53 48 -170 42 -82 -323 -66 91
3574I1N2j43n7l2P2p2O6L6p9J60J17j44l0J23j12J07O7j37QL8L3j40J34j62k15
3599b19K21k04r2K51L9l81J90L36k32L28m44K80k43K32J07k23J80k38N6m0K85
3620A89l2k32j05L93j0k12q1n6k3K59Q6k60j16M2q7J18J70N6j50L3j27L9K3l7
3644a20M43j54K4k37j37Q0k5L1Q1q5L54j30R2J5j66L2j5o1j23O7j82L40m30K78
3668b8j9m04L61J0K04j55Q4j30P5o6k14M11K1o0j44J71j69J11j84L71j31k85K82
3691A12oK38j94N2m13j01L60j2l4j97K79k95K62j27P9q1k43K74J47j0o6K95k48
3714G1K8nlmK66m95J49q6J25o4J38K4j40k09OJ05j29L59k97K45n2K7j53L3m1o7
3740a69K92l7m8j19N0L9q3J99j26K27K0j91L0Lk64J66J25n5j24P6j70J25n5L96
$$ plain form
3574 91 143 0 -57 -89 -17 -89 -23 13 -66 94 211 67 37 160 48 155 222 85 93 131 164 24 158 -4 -219
3599 -219 2 -202 -294 -43 -4 -385 -195 141 -91 237 -207 73 -170 62 169 -54 126 -112 -56 -96 189
3620 189 157 -75 -180 213 203 -9 -90 -146 -169 90 176 -84 -200 -158 -245 -127 43 99 -51 -18 -145 -106 -83 -120
3644 -120 323 169 193 -44 -181 -101 -126 -95 -14 -99 255 125 217 232 66 98 83 22 -101 -34 -216 124 -306 -28
3668 -28 -47 -451 -90 -80 124 -31 53 -77 -2 -68 -282 129 150 90 -54 117 -52 59 -125 246 115 -170 112
3691 112 106 344 150 202 -211 -312 48 36 2 -195 84 -211 51 -76 3 -78 -321 -47 100 90 24 319 71
3714 71 99 94 91 87 353 -142 7 -79 46 -18 120 144 4 -205 -199 -94 -223 136 -161 84 32 59 -94 -61 -102 -169
3740 -169 123 86 38 -81 -31 8 -75 124 -2 225 245 54 84 87 -177 -11 114 59 -65 11 -159 -34 -89 307
3764C07m56J71j6L5r6J79M9l76M26kl36J01M3r4M08m04J96L9K04r1m21J35O1m9
3788A3k54M08j00o5R9k72K4q3p2K18L6j06K74O0k63J28L0P8j90k19M7J90K85Q
3812B74m1j49k21N48j47N5p7jj24j03J86n67M06j87l7J21l6m9p6L78m97N7L04
3835A7j20L10m06L54j25K0J1K23m59K04l77L55N6J48K1j52j94J12j6k64Q3J28
3857g1J59k10O8l1J19o2K0o3j5J03o9P3j02Q3K8l9J53k34J13j5J34j84L15l06
3881c3J43n0j8J61k41k5J03M4k38J90l51J97J01o7k04J67J5L1j24p5J56J84p3
3904gR2l4N2r4k10K53K88l91K99l50N3k6O6J67j06R5L8l07J81ok37K11j70J80
3928C7j57m1J04k0r5J47R0j67J03Q6j18K27j76J1R7o4j55k0L06n0m6k03K45j2
$$ plain form
3764 307 -149 22 6 41 -55 124 173 -203 223 221 -115 -14 29 -65 343 -61 135 174 378 287 -134 1 62 13
3788 13 -241 167 67 2 101 -171 -147 -230 -302 -84 -48 -154 120 180 -83 45 75 153 -37 -256 -209 -19 266 274
3812 274 233 84 -137 411 264 319 242 241 117 14 200 -367 39 -148 -185 -64 -100 -149 -225 153 -344 -287 17
3835 17 -103 207 -199 155 30 50 61 284 -175 29 -348 7 63 211 232 80 -114 -2 -18 -282 -199 -71
3857 -71 88 -122 -54 -85 34 -28 -8 -71 -86 17 -52 21 -81 2 30 -9 144 -90 23 8 142 -42 273 -33
3881 -33 110 60 42 203 -38 -63 40 84 -154 36 -315 -118 -17 -84 -288 -121 -106 -75 -199 -274 -118 66 -7
3904 -7 85 51 103 9 -201 52 340 -51 248 -102 -49 -75 -9 158 52 147 185 -122 59 53 -184 27 -143 37
3928 37 -120 -161 -57 -77 -172 -25 65 -102 1 87 -31 196 20 31 128 64 -91 -111 195 145 99 -104 141 129
3952A29l12J43K09n37M99l18n5K65LL7O5m72K65k3oJ80n3q6m8L04q6j84K43J24
3976B86k18J7J09J3J45j69j70K07j97L8j77L29m41jPJ10J62L7k10jQkK13m8j36
4001h9K5J04J08k21J93K70j30P3k85j18P0j9n4J28O5l8o0j02o8K12k91Nk0L17
4025G5P5m37J70K2Q0J15J66m34J03N0n1l0J10K4L44l08o8Q6N9p0m7J06l19L64
4049A85j96J78k10K2K8j43J31J5Jq4k1MJ08J69k91o9L46j30j12P6rN9o2K65l52
4074i2J16k00L66k00LJ40k75K34j28k7L3P8k38j7M9J37k5j59K03J3j3j61K71k38
4098a30r2J93N3L13o30J59J94K63m72K40j85NJ01J33j00p7J05Q7K42n03K13l59
4120b47J89k71J90M2Ok38K54J89j59p9J31N3l30M82r1O8m68K47n0K25L5k86L94
$$ plain form
3952 129 -183 -40 169 -368 131 -187 -242 23 26 63 128 -344 -79 -102 -108 72 19 -67 -115 189 103 -81 162 286
3976 286 68 85 194 207 352 183 13 220 23 61 -116 213 -228 -229 -222 -112 50 87 -123 -124 -116 -118 95 47 -89
4001 -89 -64 40 148 -73 120 390 260 333 48 -70 0 -19 -73 55 120 82 22 -80 -148 64 -227 -222 -242 75
4025 75 150 -287 -117 -95 -15 100 266 -168 -65 -15 -66 -96 14 38 382 74 6 92 151 81 34 140 -179 185
4049 185 -11 167 -43 -21 7 -136 -5 10 11 -73 -94 -90 18 187 -104 -173 173 43 -69 7 -2 57 -5 260 -92
4074 -92 24 -176 190 -10 -7 133 -142 92 -36 -63 -30 48 -190 -207 -158 -21 -46 -205 -2 11 -2 -163 108 -130
4098 -130 -222 -29 24 337 -293 -134 60 323 -149 91 -94 -89 12 145 45 -32 73 160 402 -101 112 -247
4120 -247 -58 -329 -139 -97 -91 -329 -75 114 -45 -124 7 60 -270 212 121 189 -279 -32 -82 143 178 -108 286
4143B86j37k50J38j39J69Q9j09k26J27M1k70m1M71k23q7J22O7k39J45k2j2p6K59
4166H3K24p6q2J01j80J3k1j6K2J08k24K1J27Q2k98J58K7n5l56K14J45O9l45K5
4190b34J71p2K03n2p6J59J83k8M4l03NK45j49J82k55j2J44r8k66M18m3l73L34
4213A27k92j2L04j76k16L79j89k19K09k3J12j97J23L00j10P0k09j22K97Qpl40
4235a83L9K29k0J69k01J26K1l34P7P1O4j15L1j41K17k05r1P3K8K63l5j11M7L4
4259E3q1K20k19P4K36k07J15q0j92R9J0L3p4pJ27J67j86rj38l2j7n8L11o1j33
4284d9J22j28J0k04J48l4J33r8P8L3r0K12k26K60k32K04m1j78N9J31N1j72K45
4307B34l10P5J49j99J60l15J96o6K30k10L0P8j49l1J59q2p8J06J71k05L1J40J78
$$ plain form
4143 286 149 -101 37 -102 67 156 47 -179 -52 -11 -281 -322 149 -74 -161 -39 28 -211 -66 -88 -100 -176 83
4166 83 307 231 149 250 70 83 62 46 68 176 -48 -27 100 182 -116 42 69 14 -342 -128 17 86 -259 -234
4190 -234 -63 -135 68 16 -60 99 282 254 298 -5 0 245 96 278 23 11 155 57 -209 209 166 -207 127
4213 127 -165 -177 127 -49 -265 114 -75 -294 -85 -108 4 -193 -70 230 120 190 -19 -141 156 164 157 -183
4235 -183 -144 85 65 234 33 159 180 -154 -77 -6 58 -57 -26 -167 50 -155 -246 -173 -145 118 83 -28 19 53
4259 53 -28 192 -27 47 283 76 191 111 -81 18 28 61 -13 -20 107 274 88 79 -59 -91 -108 -166 145 84 -49
4284 -49 73 -55 -45 -249 -101 -135 -2 -100 -22 11 -79 133 -93 167 -65 139 98 -80 -21 110 161 -11 234
4307 234 -76 -1 148 -51 109 -206 -10 -76 154 -56 -26 52 -97 -128 31 -51 -129 -23 148 -57 -26 114 292
4330B92j33j34J09K96k99p0R7l16L38k26J70j11L6k12J45k8J47o2p1j20J55j67
4352a64k0J79j96K10o6K41j4j89J9K86Q4k18j17L4l6m6o0K85l29J41J55l18P1
4375f8j11K92j09R6J6l6K9j88k52J25K47p5j28L70l21K21J20m57M40l87L33J01
4397B58N0r7q6m9N1J9Q8k29J97l30q6K00P2Q4j64K5K7l71K89k23K02K54r8j38
4421e5m1J3J2O1J50j62R0j32J56q9j23L32l65L98J8j76oq3J14l13K43n6K86j91
4445H1l6j16jk5j19L1o7L24R0l34L02j48j92J66J62K23m28K63j12K9j58O2K57
4468B54r4j91L2r5N7r6K08rm38K02J66J48m33M06k10l9o4K29Jl25K60k4M7O1l9
4493A4J01p6oJ39j54K54m38j28L26J39j37J9nmk12L77l47J5K66k21j32K1n4k1
$$ plain form
4330 292 159 25 134 430 131 61 158 -158 180 -46 124 13 49 -163 -18 -46 101 39 -32 -152 3 -164
4352 -164 -184 -5 -201 9 -57 184 170 -19 0 286 370 152 35 69 33 -13 -73 212 -117 24 179 -139 -68
4375 -68 -179 113 4 100 116 80 109 -79 -331 -206 41 -34 -162 208 -113 108 228 -229 211 -176 157 258
4397 258 308 211 125 76 127 146 234 5 202 -128 -214 -14 58 142 -22 3 30 -341 -52 -275 -73 181 83 -55
4421 -55 -96 -83 -71 -10 140 -22 68 -64 92 3 -120 212 -153 245 263 87 81 -2 112 -201 42 -14 272 81
4445 81 45 -71 -72 -97 -216 -185 -252 72 162 -172 130 -18 -210 -44 118 341 -87 176 64 93 -65 -3 254
4468 254 160 -31 1 -94 -37 -133 75 66 -372 -170 -4 144 -289 117 -93 -132 -196 33 34 -291 -31 -55 -8 53 14
4493 14 115 39 33 172 18 272 -166 -294 32 171 34 53 48 44 -168 209 -138 -123 143 -78 -210 -189 -243 -264
4517b64J05K13M5O9j44r4L3J60o8j3p1L33k26k8p9m8J67j53J62l61Q8J64o3j46
4541b19M98m62P6k7P3J10k97R2M09k06P3N3j62J73j75J01r2j61L99k51L6p0K60
4564B31l00J5j06J52J66l32o4L23J43o1j42k65KM47l40m2K11k9j48L0NN8L65l21
4588bJ56m12L72j99J56p5K9j70K72k13J17O0M0o3j9J49k52N3pL8K7j14P3k16L49
4613A49l54J05K29r9l7l0m5K33k97M83k70LJ07j98J89L14m57J37k12O0L5k16N
4636a66K19l03J97J81k66L43k12J51r9j38O3J24j53L3P9K3j05J49P8k94j30M07
4658A81J20j33j4Q1J53k56l37J96k2R7K9j55K22k40J31j0j82J84j69RK83k86j27
4681b45K94r9j30j2J11K77k00Pj81J26J17p8K17j63k4K77k93r1J08j50K07j52
$$ plain form
4517 -264 -159 54 99 168 24 -70 -37 123 55 42 -29 304 78 50 -29 -77 90 -63 99 -262 -174 -10 -73 -219
4541 -219 279 -183 -107 -134 -61 49 -248 -156 253 47 120 173 11 184 9 110 18 -143 256 5 41 -29 231
4564 231 -69 -54 -160 -8 158 -174 -238 85 228 167 25 -240 -238 209 -131 -173 38 9 -139 -109 -104 -46 319 -2
4588 -2 154 -258 114 -85 71 -4 25 -145 127 -86 31 91 131 68 49 198 -54 -1 -8 30 57 -57 16 -200 149
4613 149 -205 -100 129 30 -7 -37 -82 151 -146 337 67 70 177 -21 168 482 25 162 -50 10 45 -171 -166
4636 -166 53 -250 -53 128 -138 205 -7 144 45 -93 -30 94 -59 -26 53 76 -29 120 198 -96 -226 181
4658 181 301 168 154 235 388 132 -205 -9 -31 66 95 -60 162 -78 53 43 -139 45 -124 -115 168 -118 -245
4681 -245 49 -50 -180 -192 -81 196 -4 3 -178 -52 65 -13 204 41 17 294 1 -90 18 -132 75 -77
4703g7l6L08j46O6l36K23R0j64J24P3r5k13o8K24q6J10L3J41J59j23l35J41j74
4726a61L64o0r4R1l14K19k42J09J14L2k36N1j0j89K20P5J32ll25J84J9P8j7J1
4750D8j23j19L12Pl45K61K71k28o0J54o8R2k13R2mp6M8l20J6J17m1J45j26J11
4774d9m5k52L10J76k35J61J83j62k23J01J60k04M62k94K5k0K5q0k3J20j5K3l95
4797b51K91j16M4J62k66J71Lj60j1j96N12m81K39j88J53j27J66M9N8k2j05L03
4819B28j51K7l14L00L90m71L4J23J65n78L27ln12L07j49M4J88o2l26J87J78rJ34
4842E7K0j08J78J7j76q0K61l15q2M06rj02J55l01K71k29L37k45j06J68o6j16k75
4865c40L46J06m79M57j66Q3P5p7J06j08m3q2L01k03J3K78m75M90l11r4K45j82
$$ plain form
4703 -77 -113 195 49 115 -221 2 92 -72 52 125 30 -183 -251 -27 -113 -3 30 171 330 207 -128 13 -161
4726 -161 203 143 49 140 -174 45 -197 -88 26 58 -178 -127 -137 -326 -106 -31 101 98 -227 -43 -24 54 37 48
4750 48 -75 -194 118 125 -220 41 312 84 24 178 110 202 -11 81 77 1 49 -271 -255 -138 -179 -34 -160 -49
4774 -49 -94 -346 -36 140 -95 66 249 87 -136 -35 125 -79 383 89 114 94 119 39 16 136 121 144 -251
4797 -251 40 -76 -32 130 -136 35 38 -122 -133 -329 183 -298 -59 -247 -94 -221 -55 -6 52 30 -75 228
4819 228 77 104 -210 90 480 9 43 166 331 -247 80 77 -435 -128 -277 -233 -45 -107 -433 -246 -68 -77 57
4842 57 77 -31 147 164 -12 -92 169 -146 -228 178 169 67 222 -79 192 -37 300 55 -51 117 51 -65 -340
4865 -340 6 112 -367 90 -76 7 82 5 111 3 -40 -122 179 -24 -11 267 -208 282 -29 -123 122 -60
4887f0M1p8J8J88k4k06R0P8k93M10l85p0J17J15J9l1o9RL53l54q8J26K2KK60k46
4913e6j1J65n7j57L86P9l00p6L93l45k4K2Lq6j2J73j61n4K85n9j99p7J48k24M83
4938B39r5m0k26J99k91L51l8L7j93L7J74j2j39jJ57l02K50j51K72K7Pk41J43q1
4962H3l02J09j3Q8N1J6l0r6K40j92J25j07o5K07j63L27j63k00L80l06J6l0K25
4985B00k62L05k95Q5P7J28k19j01k94M13j90l4j32M54k42j67J52J36j02l6R2%
5007c2l1j64M43l68Q1J58r6K01Q5j33O1l26L92j86L22l94p1k3N2j83K18J92l32
5030a34K47j42l9k9j83O7K99J76l13j30M2m0J68j0J20O3p2O0j77K14l02L46N3
5053B84j30l46l8J14p8L80j57K5j01j8J30p1J39j61K54k06lq6rK30l3k33J49J9
$$ plain form
4887 -60 -19 -97 -79 109 85 -121 -31 47 -246 164 -221 -291 -174 -59 -40 -71 -140 -131 222 -132 -220 -94 -72 -70 190 -56
4913 -56 -67 98 41 -116 270 349 49 -27 366 21 -3 19 22 -64 -76 97 -64 -118 167 108 -91 -168 -20 -244 239
4938 239 144 104 -122 77 -214 137 99 136 -57 -20 154 142 3 2 159 -143 107 -44 228 255 262 21 164 83
4962 83 -219 -110 -123 -35 16 32 2 -94 146 -46 79 -28 -93 114 -49 278 115 -85 295 -11 5 -25 200
4985 200 -62 243 -52 33 110 238 19 -82 -376 37 -153 -187 -319 135 -107 -274 -122 14 -88 -124 -32 -32
5007 -32 -63 -227 216 -152 -71 87 -9 192 277 144 205 -121 271 85 407 13 -58 -81 -29 -212 6 198 -134
5030 -134 113 -29 -68 -97 -280 -213 86 262 -51 -181 -139 -179 -11 -21 99 162 90 150 -27 187 -115 231 284
5053 284 154 -192 -230 -116 -194 186 29 54 -47 -65 65 -6 133 -28 226 20 17 -69 -78 152 119 -114 35 54
5077E4J4k30J36J94k06m4m3K39p5K76k54Ql5j11OM3K3K2j41K25k48J45J00m67
5101c69L77j18J49q2q5L51m18J84R5jJ58l09K14p7j23L62l22j51J43N8k11J44
5123c1R3j70o7L9J08K75m49K92p1j40Q0J00J3R6k05J53n8k14M47l01J92r3j46
5146e7K61J3j17q4k1K6J15k3k1Mk62J7L68k86PR4r6L1j26J42k28K44j09K42m47
5171c13N42J8m7l5j88K71m5j27j05J88k40q8J18l7J74N9j96O3k29K5o3K25Pj3
5195c6K18j79p3K6K20q3j16K67n0l55J56L6n7J1J25j42J81j81j58K23o6K38k05
5218@k50J82J28o2J66l63L75l33j77J92k5q6J54J94j68q7L41j24N1J10j89j2K97
5241C14r8j3l12K12qP0j25j48P2p5K68m7j41J50q1k18J31R6n1R0m10M55j62J42
$$ plain form
5077 54 68 -162 -26 168 -38 -82 -125 114 39 315 61 69 34 -77 -71 -28 -5 17 -124 101 -147 -2 98 -369
5101 -369 8 -110 39 -43 -128 223 -195 -11 84 83 241 -68 146 69 -54 308 -14 -165 -22 36 -175 -31
5123 -31 62 -108 -175 -136 -28 247 -202 90 19 -121 -41 59 72 168 -37 116 58 -156 291 -10 182 89 -57
5146 -57 204 217 100 16 -5 21 136 113 92 96 -166 -149 219 -67 -60 34 -62 -31 -157 -15 -243 1 -108 134 -313
5171 -313 229 247 200 165 -23 248 203 76 -29 159 -81 -169 -51 -88 86 145 -51 12 -217 -192 -255 -30 -23 -36
5195 -36 182 3 -70 -44 176 93 -23 244 194 -161 -5 31 -26 -15 110 -32 149 -32 -190 33 -33 205 0
5218 0 -250 -68 60 -2 164 -199 176 -157 -334 -142 -167 -253 -99 95 -73 -160 181 57 108 218 29 17 314
5241 314 216 203 -109 103 95 165 40 -108 -36 -111 157 110 -31 119 38 -180 -49 47 -4 86 -324 131 -31 111
5265A11q3O8l8K43j57k1k32L9K82p6K9l43q1L91j17J21j57j04J28j09N0q0K4Q4
5289b8r5J50j45J11j62L29j07M8k59J41K86j93q0J90j13m2J25j31P4l0l3j03J95
5312A28n9l93N86j81n9J21j75K05m40O3J88Q5k79J84L3j73K3J24J38p7m6j69L68
5335A95Kj11K75l43J07q3J15j7n0L9Qo2k1m1J6R0k0j61J45l01J90J18j01J15p8
5360B6l13K61p6J73R1k54J58j9J18j10l3k3k08J48n3J39Q9K9k43j81L39j12J4
5383d0J40j61k04L14p4k15L36j95J76p1J34k02m1L38kk69j07J39O6O5l5r0l3J14
5407H3J0j33J51m6J05k58J03l88L2J80j46K95mm0k7m3K49k65L3k0L40k81N4r4
5431a10j9K34J63j92j41j02K82O7p4j85J80j6o1m7l42L43j54L36p8l60K61O7l71
$$ plain form
5265 111 28 96 58 301 144 123 -109 -70 212 136 165 -178 -259 132 15 136 -21 -125 3 -106 -56 -136 -112 -28
5289 -28 -123 27 -118 -7 -169 160 53 101 -158 -17 269 76 -4 186 73 31 156 25 99 69 36 -67 128
5312 128 69 -324 262 81 22 143 -32 173 -267 -204 -16 69 -210 -26 7 -166 -143 -19 119 42 -4 -173 195
5335 195 197 86 361 18 125 42 157 140 90 129 137 75 54 13 29 119 99 -62 83 -218 -28 90 -11 104 26
5360 26 -287 -26 -102 71 162 -92 66 47 165 55 22 -1 -209 -61 -114 25 114 143 -100 -281 58 -54 -40
5383 -40 100 -61 -265 49 -25 -240 96 -99 77 6 140 -62 -103 235 233 -36 -143 -4 62 127 92 2 -31 83
5407 83 93 -40 111 65 170 -88 15 -373 -341 -161 -307 -12 -16 -56 -83 -126 123 -142 -109 -129 211 -70 -16 -110
5431 -110 -129 105 268 76 -65 -167 115 182 108 -77 103 87 26 -21 -363 -20 -174 162 84 -276 -15 52 -319
5454c19K41p9J80J71p2l05J00q8J61m2L53k63J45R9P3m8k05k23L08k38n8j46K50
5477ek48J77J6k04J76j00P9K07j83pK1K05p2j15k02L1N35k41q0K22k68K53k7k85
5501a15L12o4Kk13K11k46Q0p7J81j15J62p7k7l1r2K54l6p9k12K10R9n6k08n0L87
5526B00j13j10Jj4M6J54n0M1r8j60J51m4n3k95M91j46K0o0Q3m64M35k66J08K33
5550I0j39l1k47M16j25k5L9P2j88N8J74j85p7J31J23j81J95J7M1j28J82Q3m28
5573a33M3K25j69N6J02j33k61K67N2m1r2o4K00O6k96J88J95l33L34lm3j06j24
5596g0Q0q9K39l77J75j70J75q4L0J01k42K59N8j52o5O4j2K00p0j14R5j11J71j16
5620b5R2K08k73J8O0q2L6J19J66j50P0P6o1j39j9n3L0p7n8p9K92l89K28J6l22
$$ plain form
5454 -319 -78 -157 23 194 122 -183 -83 -171 -10 -52 301 38 183 282 355 307 102 -121 187 -51 -109 -255 -5
5477 -5 -253 -76 -60 -264 -88 -188 -109 98 -85 -92 -71 134 62 -53 -255 -224 311 70 -10 212 -56 197 170 -115
5501 -115 197 133 135 -78 133 -113 -33 -110 71 -44 118 41 14 -17 -109 145 109 30 -182 28 127 71 -137 -187 200
5526 200 87 -23 -22 -36 10 164 114 155 57 -103 48 4 -49 -344 147 1 21 -39 44 -420 15 -251 -143 90
5550 90 -49 -80 -327 89 -36 -61 -22 50 -138 -80 94 -91 -168 -37 86 -95 100 117 158 30 212 295 -133
5573 -133 -90 135 -34 22 124 -9 -270 -3 49 8 -84 -148 52 118 -178 10 205 -128 206 203 160 54 -70
5596 -70 10 -79 160 -217 -42 -212 -37 -121 -91 10 -232 27 85 -67 -132 -68 -80 120 50 -64 31 -80 91 -25
5620 -25 67 275 2 20 80 -2 34 153 319 169 239 315 254 115 96 43 73 -4 -62 -141 151 -238 -10 6 -316
5645c16J99k3L9k2R6n0K11k10L36l65r4J85k6N0O7Nl3k5O8j10r4M2j79L15j04
5670c8k43K06J44q2j66K3Ok4r3J8K41k08K04O5m6j35K07k01J82R3j4j2j30nq4
5695i2J97j00j10N2K36l55J45j51L41J51n36J06K54j14L9j43J63j16J40q8k08
5716a89q3K02J50jJ13j60J10n6o2J70j25Q3k87j13J91p1j1j38L52J13r8j02J72
5739A60k46j66M02r1k96M1j61M51k1l05J66J7P8J39k03K2O8O9J78k75R0n0m2K37
5763B62l71M4J26j63J67k49R2J74k05j26M8k4K84j12l3j59K63k10J72R3R0N3k20
5786dk2NJ9J5J02n4K21k81K36j89Mk15P2L7J85k22q5J87p8M7n4j6J7l3N1K73k41
5813b3l7M9K44k99J79k37J80J1k65M99N3m53j09L53J61l30L06M0k97k1J30k30
$$ plain form
5645 -316 -117 -140 -101 -123 -27 -77 134 -76 260 -105 -199 -14 -40 10 77 82 49 24 92 -18 -112 -70 -249 66 -38
5670 -38 -281 -75 69 -13 -179 -156 -150 -174 -267 -249 -8 -216 -12 53 7 -128 79 -122 60 153 139 127 -3 -8 -92
5695 -92 105 5 -105 -53 183 -172 -27 -178 163 314 -222 -116 138 24 63 -80 83 -33 107 19 -189
5716 -189 -272 -70 80 79 192 32 142 86 24 194 69 152 -135 -248 -57 -128 -139 -277 75 188 90 -12 160
5739 160 -86 -252 150 59 -237 -196 -357 94 73 -232 -66 -49 29 168 -35 -13 55 124 302 27 117 67 25 262
5763 262 -109 -65 61 -102 65 -184 -92 82 -123 -249 -201 -225 59 -53 -86 -245 18 -192 -20 73 163 216 -4
5786 -4 -26 -21 -2 13 115 61 282 1 237 48 52 -163 -91 -54 131 -91 -176 11 -67 -20 -74 -90 -73 -106 -55 218 -23
5813 -23 -60 -11 233 -66 113 -124 56 67 -198 301 354 -99 -208 145 306 -24 282 322 25 4 134 -96
5835i6j13L22j41k39K65Q0k44K61j19j65K37m8p1J46m5L0J30n1j53N8P7K5k66
5858a20K98J0J9l62Q9J22MJ21j58k3q0m7J01j47J26j01O9K26j72j48K56N2l31
5881a96N6PJ65k61K22J5nQ9m5Q2j6n6j26J80l60J73k6o7J02L4O5r6k7J56J64m60
5907b31J80k32L62J90l20L83l22Q1j92J59K22k48J10k59J39j2Lk08o3K06J50j65
5929f7P6J51k15M9L2q7L9K8r7P5r4j15K10k2J43j71j6K11r9P1j98J15N9l0J52
5954B00j56j30l0K26k78L16r0n5K50j65j44K48m18J88m2p8L64n03K60J36j10J7
5976Fp4o0K68k33L56j25j3O0k45%Q0j3rj04K05k13L47k63l00O8K21k60K65Qj45
6001a73J27nk25K90LR0j00o2J30l4l9J14Nj8j1m6n3R6j91L04m5j71j53J68m0q7
$$ plain form
5835 -96 -209 113 -28 -267 -2 78 -166 95 -24 -189 48 0 -71 75 30 60 190 139 -14 44 121 146 -120
5858 -120 178 188 207 -155 -66 56 60 181 23 0 -80 -127 -26 -173 -47 -148 -79 147 -25 -173 83 135 -196
5881 -196 -140 -133 32 -229 -7 8 3 92 47 129 113 57 -69 111 -249 -76 -102 -169 -67 -33 32 -64 -91 65 229 -231
5907 -231 -51 -283 79 269 -51 332 10 91 -101 58 280 32 142 -117 22 10 13 -195 -258 -52 98 -67
5929 -67 9 160 -55 -6 26 -61 -22 6 -91 -16 -110 -225 -15 -37 106 -65 -81 130 31 102 -96 19 78 48 200
5954 200 44 -86 -116 110 -168 148 58 3 253 88 -56 192 -226 -38 -80 -158 206 -297 -37 99 -11 6
5976 6 -68 -128 140 -93 263 138 125 185 -60 -60 20 7 -2 -106 99 -114 233 -30 -330 -262 -41 -301 -36 -28 -173
6001 -173 -46 -51 -276 14 17 107 7 -55 75 41 2 116 121 103 92 46 -7 89 -102 202 157 -14 -167 1 -39 -126
6027a26L93l64J00k11K61P4J53l87j19K92j32n0L56j81J2r3J78j91J11k9J71l35
6049a17R7K78j26l55K40j07J04J09k15L7p3mK40k60RQ2JJ25Pj67m6J44p6j65L37
6074I9k13J87m5j09L16n68O05m14J21R1J35k56L4j84K87j66K07o4m8k82K10j37
6096a94J60K00j27P2l77K62m2o1L6K72k82j31J57nK9J69j12j06M9j22K66o5n4
6119fP5j38J76J12k11j37M6L4K60j79j67J51k4Oj01Q2mn3J81k57J05N8J14j71
6143d8P4J19o9j30J15j34J16K5Q4j75k5J54l46K96k96Q8P1j05J06n8J60j07NM2
6167c8pj37N56j88k08J18k72L25o6j35J43M1J25j55p9K4J5n0J81j77J09j95p8
6190a48J17O3k03J00k36J83M7j17K18m8J38k08L13j25J19r4p0J38m45M40Rk75
$$ plain form
6027 -126 267 -97 3 -208 53 127 280 -107 -226 66 -66 -116 240 59 71 -22 156 -35 76 47 218 -117
6049 -117 -20 258 132 -223 17 -90 14 123 -92 -55 -128 -132 108 -152 -143 -61 -60 65 72 -95 -141 3 -73 -238 99
6074 99 -114 73 28 -81 235 -333 272 -142 -21 70 205 -51 -17 -201 86 -80 127 63 15 -267 -57 -194
6096 -194 -34 166 39 111 -266 -4 -46 -107 -71 201 -81 -212 -55 -60 -31 138 26 -80 -31 -153 113 48 -6
6119 -6 69 -69 107 219 8 -129 -83 -49 211 32 -135 16 -8 -2 -103 -21 -25 -78 103 -154 -49 9 123 -48
6143 -48 26 145 76 -54 61 -73 43 68 152 -23 -48 106 -240 56 -240 -152 -81 -186 -80 -138 22 -85 -80 -38
6167 -38 -45 -182 374 186 -22 96 -176 149 83 -52 91 132 257 102 23 47 62 12 193 16 125 -70 -148
6190 -148 -31 32 -171 -71 -307 -124 -77 -194 24 -24 114 -94 219 94 213 119 49 187 -258 182 191 -84
6212h4L08o4j62J14l90K22j87M33l11K18j35l8j25J69o5R3nk47L3J70q7J79N4
6235I3R4J81m25j10K9J33J60r3j76J86n6K72o01K58J77j64ol4l3L1j84K95j18
6258i1K57k71J72J13r0K1k29J12K32k46r8J84j83M30k49m6J73j13j75K7k0m8J62
6281B4jO6j6J5k83K16k02J55J9j56J28J22n0j03L7n5j11M09j57j19L01k94L32
6304B77k67J76j40L62n12J95Qr0J4m6R2K54l60N7j20J70O5k55l5L34j84j36K04
6327F3Nr9j44j47K56J99l5j83J64K5j83J80lP3k05OrJ60p1j92K22K4q6J10j83
6352e3q0j02J74r9K00j40Qj44K27m2k18K15l1J27L22m79J96L1r4O7p9J61m2j37
6376a2m7J16J34j98J3m8k47L63k01J4L06k65o1Q1J31P1j60k7L85m67J94J05o2
$$ plain form
6212 -84 224 160 -2 112 -278 -56 -243 190 -121 97 -38 -76 -201 -32 -97 -4 -9 -256 -223 -53 -140 39 93
6235 93 187 368 -57 -167 -138 -5 155 62 -114 72 16 288 -313 -55 122 -42 -48 -82 -115 -84 -268 27 -91
6258 -91 166 -105 67 180 90 111 -118 -6 226 -20 -118 66 -117 313 64 18 191 78 -97 -70 -90 -138 24
6281 24 23 89 73 88 -195 21 -181 -26 -7 -163 -35 87 37 -66 -29 -84 -195 214 57 -62 239 -55 277
6304 277 10 186 46 408 -104 91 99 9 23 -23 69 323 -37 20 -100 70 135 -120 -155 179 -5 -141 63
6327 63 68 -31 -175 -322 -66 133 98 -85 79 104 -79 101 98 171 -34 -28 -37 123 52 -140 82 106 20 130 -53
6352 -53 -133 -235 -61 -160 40 -100 -92 -236 -9 -51 -269 -54 -85 42 364 -115 81 112 18 85 6 167 125 -12
6376 -12 -59 57 191 -7 6 -42 -289 74 -127 -113 193 -72 -133 -52 79 150 -10 -37 348 -119 75 180 118
6399A18j89P0j33L7J43J79l37L31p4K9j33l5n0N8O3m6o1l1P0q4o7j55J45q0J90
6424d2J00l11J63P4o1P2j22L07j31O7k28J95J02mk70%Q8j06K37j50p3K34j8j85
6448f2k5r6n9K93j75j10K45K9J23m0k57J35j52K9K28m4kR3l64J41J91q2m6k27
6472b34K15J02j90J67J09j05P4J1l73J76k9p2J70p0K5o3K06k76N8J05K7j53K37
6495A17l6j11K18l7k2j04l0o6k64M26j35J33k04K19K12k87m76K64K02r2qj49L49
6518A19k28j87O3J59R2r6M8J13j14qj02L12j75K64l38K06k6m2j56J70j54L22k52
6541a0k4K0l09R9N5K25m1J24k59K46j35N4KJ20k12J20j49J81J13O6m20J52o3R9
6565E4n7j4N7K89j86j04j32K38j61o7l0O2k49J72J67k36L00m14M63k1j77Q0J64
$$ plain form
6399 118 -71 -1 -134 -97 46 225 -112 219 145 174 41 6 -44 14 77 31 -30 -61 9 -75 -142 -297 -152 -232 -42
6424 -42 58 -253 -90 -16 -77 -5 -127 180 49 116 -112 83 185 181 -89 -89 -1 -107 130 -20 -93 141 123 -62
6448 -62 -87 -183 -242 51 -124 -234 11 40 163 123 -134 1 -151 -122 106 62 60 153 -211 -70 121 39 -7 -234
6472 -234 -19 83 -107 60 169 64 138 149 -224 -48 -77 -149 21 -49 -24 -87 119 -157 -99 6 33 -120 117
6495 117 81 -30 188 151 129 25 -5 -71 -335 91 -44 89 -115 104 316 29 -447 -183 19 -73 -81 -230 119
6518 119 -109 -296 -233 -74 18 -78 -30 83 -31 -39 -141 171 -4 260 -78 128 102 60 -96 74 -80 242 -10
6541 -10 -34 -14 -323 -224 -169 56 15 139 -120 126 -9 45 47 167 -45 75 -74 107 220 286 -134 18 -45 54
6565 54 -3 -17 40 329 143 39 -93 145 -16 -83 -113 -51 -300 -128 39 -197 103 -311 152 131 -46 34 198
6588A98j45J44m52N89k94K52j12l07J86K0J4J44j89j48J08O5k53L07k80j01R1
6609a63J14M8JN0k4j25k81L25n1k3N1J45J1O7L7k8l1j69J50J59q8M7k98M5P8j23
6635g6J16L5Ok35K36m64K85l7K1N0J7k5j6L25j83j92K86K3j70q2M8J19j36K52
6659B03l48J50K30k18Q4p8j01Pq3K00j17nJ30o8J36K5k43J30m1Q4j44J93j31q0
6683h5j9pM9K04K6k90J91j12J43k34K71j8j33J62ll45J11O2j54J84j43O9n5K02
6707G6m2j23k07m0J88J80j85m0J33K97k26J40J7k05j26L06j81J90K45l87N6j18
6729e2LQ5J96j52J00j9p5J8k70j72P7L51k2k54k00N14l44jo9L34j13o6M63j78
6753A54k52L4j64R7L35j65Q6m0J68j3k65n2K24j14j56J96l8J42j15j11K35l47
$$ plain form
6588 198 53 197 -255 334 40 292 180 -127 59 79 93 237 48 -100 8 73 -180 127 -153 -254 -163
6609 -163 -49 -1 0 50 26 -99 -380 -55 -106 -129 -78 67 78 145 182 154 123 -46 104 263 175 222 -76 -31 47 -76
6635 -76 40 75 81 -154 82 -382 -97 -134 -113 -63 -46 -71 -87 238 55 -137 149 172 2 -80 -32 87 -49 203
6659 203 -145 5 235 17 101 23 -78 -71 -154 46 -71 -76 54 -14 122 147 -96 34 -7 77 -67 126 -5 -85
6683 -85 -104 -111 -62 142 168 -122 69 -43 100 -134 137 119 -14 148 145 -200 -89 -27 -181 3 -140 -71 -126 76
6707 76 34 -89 -296 -336 -148 32 -153 -193 -60 237 11 151 168 -37 -163 143 -38 152 397 10 66 -52
6729 -52 -49 36 232 80 180 161 86 104 -166 -338 -261 90 68 -186 -386 128 -216 -217 -286 48 -65 -131 332 154
6753 154 -98 -64 -228 -131 204 39 125 85 253 240 -25 -77 147 33 -123 73 35 177 62 -49 186 -161
6775a61J12m6j9J23j7J39j55M8j0K17l43K18k9l04L09j04J12k13K61j51J80j62
6797Ej05K5M1J32k77lj5J43J36N0l59O2J47j58J74j48J62O8L2J35j52j03R7J04
6821A93j06J07j46K3j01RP2j16M06k74k9j70R9Ml02K55k8l0q4J0M62k02j83K23
6845I2j53j54L19J23j85K16j82k59M57k90j25M71o6m58L49l8j42K61m43k0R8j56
6867b85J38J04j89M32j77k80J07L09k13J84l6j29J38j25M8K3J6o1J96m09L23K11
6889C25j70l28M0O4n6P9j61M7O7J30k1j54N6J0j16J12J58k77l0K36j45K56O1l66
6913a83K88Qo8O0J07j50J18j73q6J90J92l55j83M46k44M4K0L8J14j45k84J99P9
6936C2j2j47O6J4Oj97J91J98j97J4K01k2l1j49J72k01j2K49r1j23J17j30M7M4
$$ plain form
6775 -161 -49 -95 -114 9 -8 131 -24 24 14 231 -112 106 77 -227 82 -22 90 -123 138 -13 167 5
6797 5 -100 -75 -34 98 -179 -182 -197 -54 82 132 -227 -165 -18 -176 -2 -150 12 80 112 247 95 -8 89 193
6821 193 87 194 48 71 -30 -21 51 -65 341 67 38 -132 -33 -29 -331 -76 -104 -134 -218 -208 254 52 -131 92
6845 92 -61 -215 104 227 42 258 76 -183 274 -16 -141 330 264 -194 155 117 -25 236 -207 -227 -129 -285
6867 -285 -147 -43 -232 200 23 -257 -150 159 -54 130 94 -35 103 -22 26 49 65 4 200 -209 114 325
6889 325 155 -173 -133 -69 -125 -46 -207 -160 -93 37 16 -138 -82 -72 -188 -76 82 -195 -225 11 -134 122 183 -183
6913 -183 105 113 45 105 212 62 180 7 -79 111 303 -52 -235 211 -33 11 31 69 183 38 -246 -47 32
6936 32 20 -127 -61 -47 -41 -238 -47 151 -46 -32 169 147 116 -33 139 -62 -74 175 84 -39 78 -52 -5 39
6960C9O8l79L59j16J70n57N00j03jj85K81q5J42k4j61n6J17P8J54R1m54K53k15
6983h4J40j27J39j7j7J75l23K64k45J24N1k43J24N1j30J20n6j3K75j47k13J59
7005GL0L2j68J02P1j71J26p3J51j07J25p5K2M4j76L14j19j44m1k9j50J72j72J12
7029a17k1l4L15j65j89R9j2r1J41R8M8k15k37O38l3J0r2o7J3J5m9j5r7J7J04j45
7055h1J27j26R3k76J56j06K30P4J8r7L6j8k6j22n0o4L34n9K9j59K16l2k44J99
7079E2M5O2n2j19J61l8M9k03q5J65j14J29j32n9K58k11K16j51l4o3J57j00LK48
7103A84k66Q2P6M5N0j55j70J47l7q2J06N4l3K31k96J09K72l04j83P8J04k27J7
7126a98K39l6k2J13j9j51J30j15P2m49M78j18J09O8J45j38q5J92l06J40j61M10
$$ plain form
6960 39 107 -272 87 -29 141 -416 84 -19 -20 -205 76 -9 133 109 -52 -108 9 87 241 332 -122 131 -84
6983 -84 56 -71 68 51 34 209 -114 150 -95 29 80 -163 -39 12 -118 2 -54 -67 208 61 -152 7
7005 7 37 69 -99 3 74 -97 29 -44 107 0 125 50 72 116 -60 254 135 -9 -50 -79 -229 -57 -229 -117
7029 -117 -138 -172 143 -22 -211 -112 -124 -215 -74 24 72 -143 -380 258 225 235 143 76 89 104 55 40 -57 -40 64 -81
7055 -81 46 -80 13 -263 -107 -213 17 91 109 12 48 30 4 -118 -168 -232 102 43 72 -87 129 97 -147 52
7079 52 97 159 107 -12 149 111 160 -43 -128 37 -77 52 -80 -139 119 -92 124 -27 -61 -124 33 -67 -64 184
7103 184 -82 0 76 121 171 16 -154 -7 -44 -126 -20 34 1 232 -64 45 317 13 -170 -92 12 -215 -198
7126 -198 41 5 -17 96 77 -74 56 -59 13 -436 42 -76 33 101 246 108 23 215 -91 49 -112 298
7148B98m66K85j78J36K17k91J70j72J28l07L08m23J50J80r9J37k01l8K93r8J1
7169D0j20J26j21j3J67J3K24k14M5j29J7j73L04L8j76m7j03j3j36K24J60l85L90
7192A18k89J2K6R6K55l17L6Q0R2n6l41M45p5K8J72j24J91k73j63K10j80J11L2
7215H6J52m5j52j78J29l4l5J80j65J4j43K23k00J81N6K01k60j13K1K18p6l5K49
7238B74k13J7J23j73q5L19l81M6P5J48j51j35N8PK26J63m26j22J46K05j12k21
7260b12K67j09N3J83l89J50k35L27M4K03l85J3N85l65J92j80n1k35K87j52J51
7281A42l40J75O0j99K48j12Q2k72J42k1Q0r9J2m1K16m8P2j98K6R0n1L19ok11k4
7306D2J82k08N8K13m55M9K89l01K29l34L14j22L57j02j66j23J23p7m84K88L61
$$ plain form
7148 298 -168 117 -61 75 292 1 171 -1 127 -180 128 -295 -145 35 -64 73 -128 -166 127 29 40
7169 40 -80 46 -75 -88 79 92 316 102 147 18 35 -138 166 204 28 -19 -122 -135 -271 -47 113 -272 118
7192 118 -171 -159 -133 -37 218 -99 -63 17 109 53 -288 157 82 110 282 158 349 76 -87 123 -57 54 86
7215 86 238 193 41 -137 -8 -42 -77 103 -62 -48 -191 32 -168 13 69 270 10 -103 -82 136 60 25 274
7238 274 61 78 201 28 -57 262 -119 -73 2 150 -1 -136 -78 -71 155 318 -108 -230 -84 121 9 -212
7260 -212 55 -54 -1 182 -207 -57 -292 35 79 282 -103 -90 495 130 322 142 91 -144 143 -9 142
7281 142 -198 -23 37 -162 86 -26 56 -216 -74 -95 -15 -114 -102 -143 73 25 97 -101 -75 15 -36 283 277 66 42
7306 42 224 16 74 287 -168 -119 170 -131 98 -236 78 -44 313 211 45 -78 45 -32 -516 -228 133
7327A33k56L89l37P4m5k1K70m05K76J52k64K79m40mK26p2L49j47j98R6J31k66
7349h0J08l76J12J98J06j78J73k27K23k87J61J25q8j19K26j37J01J77k32j36K2
7370a28Ql8L09p8M4k04L7J58j36ln1J36m2o2J06k7k93K25k05J02J27r3J09J19
7394A20j96J4L7M1r8K29j10M3k27J68k3J98K07l98J35m15M85n1l43o9J40P3L0
7417a0L9r0J21L4Pmn5k31J21K19l09J00k2L2qK85k34P4n8J91k83j45J81O6R8j28
7443iK39m07K04j94j56L14l06L46N5j32J66Pk10L59j95l1j45L15j53n5J41l69
7465b16L46J46m87J80O2M2O2o6n6q5k11J77M3l8J0k12K50q5L0o6K83o0J03k01
7489d9J03L5n2p0j46R8J0K54n8j95j6J24n6o2RK05j87j06K15n4J3J87j85r1l2
$$ plain form
7327 133 -123 266 -71 3 -42 -63 207 -198 78 230 -34 245 -195 -199 27 -45 304 157 -41 55 186 -80
7349 -80 28 -348 -236 -38 68 -110 63 -164 59 -228 -67 58 -30 -149 77 -60 41 218 -14 -150 -128
7370 -128 -120 -158 151 73 117 -87 -50 108 -28 -31 -82 54 12 -50 56 29 -264 -39 -244 -142 -15 -108 1 120
7394 120 -76 -62 -25 16 -82 147 37 80 -147 21 -2 196 403 5 140 -275 210 159 -184 -253 -113 -40 -10
7417 -10 29 -61 60 94 101 97 42 -189 -68 151 -158 -58 -80 -48 -56 229 -5 69 11 202 -81 -226 -45 21 119 -9
7443 -9 230 -177 27 -167 -323 -9 -315 31 86 -46 120 127 -83 276 81 50 -95 220 67 12 153 -216
7465 -216 130 276 -211 -31 31 73 135 69 13 -72 -283 -106 -63 -101 -91 -303 -53 -138 -108 -174 109 49 152 -49
7489 -49 54 89 37 -33 -179 -81 -71 183 125 -70 -86 38 -18 -80 -71 134 -53 -159 56 2 15 202 17 -74 -106
7514a06L5Q0m4j55kK79l29J06l3J27Q3k55N34k26k05K76j06Q3k68K21k08K62J7
7537A66j77R4k4j18P7J36n2j78n2j5R9j56L20k1j52O0j44j07K78J39l69L59j64
7560aJ4K5j2L0M7j5n5o0L9K71j72k68J69N3k0l08L24j71Q8n1q3L53l5n0k48K58
7586A22j23J47l94L66N7p9k4Oj03O6o6Q0J45p5r5r1Pp1K29k85J85J78j38n8P3
7611E9j31OK0j18K15j57K9l9K79l20J54j27K11l9m6J62nm60M47n8M3on8k8O4j02
7637ep5p8J41j60k8J15J7j48L60j91k16J06J58j4j27J15j43q6J44J42j58J2K83
7660A64j54k5L7k18M25j39j38K63j95RK10k98Q0j27o2K48j68J34q7m2J79j04K04
7683A96k37pQ1N7k63L9J52K48l15r8M31k28Q2R7r7M9l18Q4R3J3j6R3l09K8K74
$$ plain form
7514 -106 -71 9 -35 -190 -192 87 -242 -136 -169 -42 41 -214 320 94 -111 165 59 142 -126 95 -113 149 166
7537 166 -11 83 59 -59 18 154 102 -76 -128 -143 -44 -200 120 99 -53 7 -137 -244 34 173 -196 163 -1
7560 -1 13 38 26 56 103 88 33 -27 12 283 111 -157 12 65 45 -263 61 -110 -22 -73 -156 197 162 112 -136 122
7586 122 -1 146 -248 118 175 96 72 78 -25 41 -25 55 200 125 30 -61 -54 -125 104 -181 4 182 44 -14 59
7611 59 -72 -66 -46 -164 51 -106 -77 -116 163 -157 -3 -130 81 42 -4 158 153 -307 140 82 125 119 61 33 97 -5
7637 -5 -80 -158 -17 -177 -205 -90 -73 -221 139 -52 -268 -162 -4 -18 -145 -30 -173 -259 -115 27 -131 -119 164
7660 164 10 -15 22 -196 229 90 -48 215 20 29 239 -59 21 -106 -168 80 -88 46 -41 -83 96 -8 196
7683 196 -41 -48 33 90 -173 -134 18 266 -49 -147 284 56 138 235 138 187 -131 -47 46 59 43 136 -173 -145 129
7708A29p8k50O5RO3j01L25N0j23o1o4K47q5l80L88j94l1N0l1L95l25j01Q8L2K02
7733B19l46j33R8J58oK46r8k61K3J15j4k40K57L2K19k68j75K95J68j69j15j05
7755a00J7M43p5k97K2K73l03p9J71o8L6l96K37k30N59k91Q4p8J7J00j67J50n0
7778b5J32KQ5k16O8Rj01j58M35j21m9M7k40K32k90N4J81j0j3P5j63J38J30j99
7802Ck27K19k51J30J84o9P2k30J76K12m58L86j83J38%K87m23k4j9L17l03j7K68
7825A88o6O9l80K95QN4m31q2L33j66L03q3Kk16J7Q7K28L5n5k26r2J47J22jn5o8
7851c3p6J74J90l17M4J13K3l18p3K86k3j22J08j02K55m21M00j61K04j0k51M8J2
7874e0j8K25k31Q8j51M1J48J7k61R3K81j67J3j09k43M32k07J1J03j37R4q8J45
$$ plain form
7708 129 51 -199 -134 -125 -62 -163 162 212 89 28 -36 211 126 -254 134 -60 -91 -41 -72 323 -2 -103 -15 17 219
7733 219 -127 -260 -162 -4 -10 236 138 -123 -100 15 1 -239 18 50 269 1 -174 121 289 120 5 -100
7755 -100 -83 360 285 -12 10 283 -20 -99 72 4 40 -356 -119 -349 210 -81 3 -75 -58 42 -125 25 -25
7778 -25 107 109 194 -22 46 55 -46 -204 231 110 61 108 -132 100 -190 -136 45 35 22 97 -66 72 202 3
7802 3 -224 -5 -256 -126 58 -11 61 -169 7 219 -239 147 -36 102 102 389 -34 -58 -77 240 -63 -80 188
7825 188 122 191 -189 106 114 168 -263 -345 -12 -178 125 42 44 -172 -155 -68 160 195 140 -86 -178 -31 91 90 35 -33
7851 -33 -109 65 255 -62 -18 95 118 -200 -273 13 -10 -132 -24 -126 129 -292 108 -53 151 141 -110 -62 -50
7874 -50 -68 157 -74 14 -137 -96 52 69 -192 -99 182 15 28 -81 -324 108 -99 -88 15 -122 -28 -116 29
7897B9j61K05k98Q5K84m25J82O2k9J46k36P8p0J00j28m3J85k0J3L05k40o4K39
7920A99p7M1k72N2J65m2n3L41n56K24n1j89K13r6L60l96K5k6L02k74K48j2J03
7943B29j92K3L7j74L56j12O0p6j88Q0L8J72j65j8J50j20j55nmM8m5j0k5P1j84
7968b09K77j75L0R2k38P1K01j59J87O1j85K27o6j02nJ21j3J26l30L19j66k92J66
7991f2j1n8L3K0L02j84n0j13rN7J29o0q9J21l47J50K37j34J19k07L77j74q8P0
8015B9k5J23j98j57M41j70j70k7R0K06k15Q9j50K20j0jk42K46j2j83J01n4j92
8038b61J78R3J18l59K13j2L0J43p0L4j59j6J46K90o09K76j07J48j7j80JJ34J37
8061A51l16K30l73K65j27K59j28j28p5L6J69Q7P3l11J96Q0k54J83K5j28J81m9
$$ plain form
7897 29 -132 73 -225 -140 144 -281 -99 -37 -66 80 -156 -78 -148 -48 -176 -219 -34 -54 -41 264 24 -40 199
7920 199 122 163 -109 -57 108 66 13 354 -202 22 -29 -218 -5 -101 259 -137 -112 -138 164 -110 138 126 229
7943 229 37 60 97 -77 279 167 227 151 -37 43 81 253 88 70 220 100 -55 -60 -64 -16 -61 -71 -96 -25 -209
7968 -209 68 -107 -77 15 -223 -152 49 -110 77 138 -47 180 114 12 7 128 115 241 -89 230 64 -228 -62
7991 -62 -73 -131 -98 -78 224 40 -10 -123 -132 -75 54 -6 -95 26 -321 -171 66 -68 51 -156 221 47 -41 29
8015 29 4 127 -71 -228 213 43 -127 -154 -64 142 -73 16 -134 86 76 75 -167 79 67 -116 -15 -69 -261
8038 -261 -83 10 128 -231 -18 -30 0 143 73 107 -52 -68 78 368 -241 35 -72 76 59 -121 -120 14 151
8061 151 -165 65 -308 -43 -170 89 -39 -167 -242 -206 -37 50 123 -188 8 88 -166 17 42 -86 95 46
8083D6K13l18j43K48r5l39M60j17p8J29j25r6J99j25J78o6l4J06m4J84j99n5m2
8106a13K00j04j08K46k44J18R1j05j70K09J61l97K83nK9p1k30K19l1rk11L40j80
8129h2j36L02m94L35Q9pK30l27Q5o7K21j53m3R1J65j80J60m43L30k48J09L25m74
8152b12K49Q9k22l0O7JJ88j66m4j97M21j71K00m08J47O4O7r8J70m01J04K64p8
8175DK86k00k60K84j49k23M12q2j81rM12l10r3r6K18p2
$$ plain form
8083 46 259 -59 -202 46 -49 -388 72 -45 -123 6 -119 -215 -16 -141 37 -29 -63 43 -1 183 -16 -71 -113
8106 -113 87 -17 -125 121 -123 -5 86 -19 -189 20 181 -216 67 62 91 20 -210 9 -22 -31 -242 98 -82
8129 -82 -218 84 -410 -75 14 7 237 -90 -5 -72 149 -4 -47 44 209 29 189 -254 76 -172 -63 262 -212
8152 -212 37 126 -96 -126 -59 -58 130 -36 -80 -277 144 -27 173 -235 -88 -24 43 -55 115 -286 -182 82 4
8175 4 290 90 -170 114 -35 -258 154 72 -109 -118 294 -16 -109 -205 13 -59
8191e9
$$ Imaginary data points
##PAGE= N=2
##DATA TABLE= (X++(I..I)), XYDATA
0@%%%%%%%%%%%%%nJ3j6J6j6J7k5L2l7M5n3O1p2Q4r3J06j22J42j65J85k07K35k65
36a40K97l32L71m15M61n12N68o28O93p65Q44r30J024j128J242j368J509j666J843
55I68k044K270k531K841l204L640m182M872n782P043q903J1922j7636L2012j32372
70a11086k36012L51499J99220j85748j03439R5394j8083l0116P7011P104q7068
81d1324L9965N8769r4505n8581J37482P2531j36862r8830R0948P9411l6848l6501
93b4345m74j6384J0547L9699o272l9693P998L4680o895k2061J3791R668r086K0228
107A1401J9432m4498l4812O2088N4605n9026n6110M5049L6217l6056k0757K8693
119F226J8203k6714l8386M700M5233K1687l1310l9829o172K8225M1157N458n3662
$$ plain form
0 0 0 0 0 0 0 0 0 0 0 0 0 0 0 -5 8 -8 8 -8 9 -16 16 -21 24 -29 32 -40 44 -49 57 -65 77 -88 97 -110 125 -140
36 -140 157 -175 196 -219 242 -270 298 -330 363 -402 442 -488 536 -592 650 -718 791 -875 968
55 968 -1076 1194 -1337 1504 -1700 1940 -2242 2630 -3152 3891 -5012 6910 -10726 21286 -111086
70 -111086 -347098 4401 203621 17873 -85566 9828 -8255 -38371 38640 45744 -41324
81 -41324 -1359 57410 -37095 -95676 41806 114337 -22525 -121355 -30407 49004 12156 -24345
93 -24345 -24819 -41203 -30656 9043 2771 -36922 -28924 5756 -1139 -23200 -9409 259 -8827 11401
107 11401 30833 -13665 -48477 13611 68216 9190 -46920 -1871 34346 -1710 -22467 6226
119 6226 24429 -2285 -40671 -35971 9262 30949 -361 -40190 -46362 -18137 23020 28478 -25184
132b5184k7699N1569K8643m1707o361N4136k640o6962j099P2900J7726n0370k1081
145a8129J8660R927k194N90P22k063p255j5120m670K2304K1004j7088l5151n438
159c3901K8940J9760j4995j2758J3403l199k3555J1306M1316Q857l4525l0096
171b9447Q653L8553K8555j9587m3827k579L3300R652j3969O17N011j8672j8513
184b2253J9308K8990j0768k9688o096J1538P681L309K229p679j2969N343J3814
197B759j816k212R110k289j3218O182J7709n352j1114J4669P030k1637q105J8448
211A0164J0688m041r000j3986p261J4268J7799n764j5998q792n990M983K2920
224I990J0031k1390k4266L149K2676J5448j641j3302j2394J532J3019J1544M775
$$ plain form
132 -25184 -52883 -1314 27329 -14378 -20739 33397 30757 -36205 -37304 35596 53322 2952 -18129
145 -18129 531 10458 8264 8854 9576 7513 258 -14862 -19532 2772 23776 6688 -28463 -33901
159 -33901 -4961 14799 -196 -12954 449 -2750 -26305 -14999 26317 35174 649 -29447
171 -29447 -20794 17759 46314 26727 -17100 -19679 13621 23273 9304 9921 14932 -3740 -22253
184 -22253 -2945 26045 15277 -14411 -20507 -8969 -1288 2021 4250 -3429 -16398 -11055 2759
197 2759 943 -1269 7841 5552 -7666 -1484 16225 10873 -241 14428 21458 -179 -8284 10164
211 10164 20852 16811 7811 -6175 -13436 832 18631 12867 -3131 -11923 -17913 -12930 9990
224 9990 20021 -1369 -25635 -22486 190 15638 13997 695 -11699 -10167 2852 14396 19171
237A9171n254j3603q458N764J9644J2674j5314k5522j929J9869J0234r558j0686
250b968k402R84J988j319k182N544L852j0591q245P034J0553K177k304l697m586
265f162J057Q973O448J293j487q776p376R080J3934K812j0816j1996m482N568
279a930J4498M986j4214j5923k448R266J2838K574j2250j3265r17J0815J1684
292E714J300p498q821p48Q060R186M606l640j0372j746R246N615l02r00l142m997
308A561j82M273N95p58J704n742r982O12P499M220k11n809r445k851R023J0992
324E499J129p170q726k656Q462J3856M125p004j0772n329R760J4725L645r193
338A0351j1620m560N985J2415N673j0870j4853j306O470O669L721o010j1222l208
$$ plain form
237 19171 13917 314 -8144 -2380 17264 29938 14624 -10898 -12827 7042 17276 7718 -2968
250 -2968 -5370 -4386 -2398 -3717 -5899 -355 3497 -7094 -15339 -8305 2248 4425 2121 -1576 -6162
265 -6162 -5105 3868 10316 11609 10122 1346 -6030 3050 16984 19796 8980 -3016 -7498 -1930
279 -1930 12568 17554 3340 -12583 -15031 -5765 7073 9647 -2603 -15868 -16785 -5970 5714
292 5714 7014 -484 -9305 -10053 -1993 7193 11799 8159 -2213 -3959 5287 10902 10600 9700 6558 1561
308 1561 1379 5652 6247 5489 7193 1451 -8531 -7919 -420 3800 3589 -2220 -11665 -14516 -5493 5499
324 5499 6628 -542 -9268 -11924 -3462 10394 14519 7515 -3257 -8586 1174 15899 19544 10351
338 10351 -1269 -5829 156 12571 18244 7374 -7479 -8785 -2315 4354 8075 2065 -9157 -12365
352a2365O413O345Q04j092m043m510K895O945K260J014n09l924j669L858M557
367F979K444M84l139n888j247N067L905J095k809r212o545M958Q468L293n293
382B560j0832q169N620J4428N514r618j0595k792O781J1980M939n955q003k739
396f881M208R262P037k735j0285n447M095P985N194k948j0793n475M929M937k06
411B877k740l037k383j730K3J632L649J651m477n798Q16N501N019K729l322o375
427e965k37N524N984K644j790n845n898L276R369M199m237r582o895L859R791
442D197K706o074q309m669J521P328O913l819j0121m367L846Q752N663l078o654
457f165l018L478P303M384k945l217j03Q58r30K205O601j752q971k903L737L408
$$ plain form
352 -12365 -5952 393 1197 105 -3938 -8448 -5553 1392 3652 4666 4157 233 -1436 2422 6979
367 6979 9423 9907 6768 880 -367 4700 8605 9700 6891 -2321 -8866 -3908 4560 7853 2560
382 2560 -8272 -16441 -10821 3607 9121 -497 -11092 -13884 -7103 4877 9816 3861 -4142 -6881
396 -6881 -2673 6589 13626 10891 606 -4841 -746 7239 12433 9485 -1308 -6783 -1854 3083 2877
411 2877 137 -2900 -5283 -7013 -6990 -5358 -1709 -58 -4535 -10333 -9517 -4016 1003 3732 410 -5965
427 -5965 -6202 -678 5306 7950 6160 315 -5583 -2307 7062 11261 7024 -2558 -9453 -5594 4197
442 4197 6903 829 -7480 -12149 -10628 -3300 3613 -206 -10327 -14694 -10848 -2096 3567 489 -6165
457 -6165 -9183 -5705 1598 5982 3037 -180 -283 575 -355 1850 8451 6699 -2272 -5175 -1438 1970
473A970J039k590m316k750QJ434M71K841J268o275n783J190P196Q847J346j2233
489f337r177P349J5565L193p783n310j779K067P744M707l593n846k879r47K606
504d20N728L233o073j1630l089R543J0965m095j4247l457R616N176l776k821L444
519a903K322l106k409L533N685L197k638n886j663N438P914K82p647l447M055
534C727M67k956K721N522n942j1603J164J0096L057m746m543m248j275N751Q488
549E680J191r598p302M538R266M562k379l040l432r91O069O908j876m397j610
564C589j066R9M137L751l854o661k112K844K974J658m118m668J489J230k064R18
580a854N728o71p367j007P089J644j688M773N02q297k210R402P766l128o021l637
$$ plain form
473 1970 3009 419 -3897 -6647 -6639 -5205 -4734 -1893 -625 -6900 -12683 -11493 -4297 4550 5896 -6337
489 -6337 -15514 -8165 7400 10593 2810 -2500 -4279 -2212 5532 10239 6646 800 -2079 -3026 -420
504 -420 5308 8541 2468 -9162 -12251 -2708 8257 4162 -10085 -13542 -3926 1250 -2526 -5347 -1903
519 -1903 419 -2687 -5096 -1563 4122 7319 4681 -1205 -2868 2570 10484 10766 3119 -328 3727
534 3727 4194 1238 3959 9481 3539 -8064 -6900 3196 6253 1507 -3036 -7284 -8559 -2808 5680
549 5680 6871 -2727 -10029 -5491 3775 8337 5958 2918 -514 -1505 4564 11472 9596 5199 3589
564 3589 2523 2622 6759 10510 6656 -5 -2117 727 3701 5359 1241 -3427 -1938 -708 -2772 -1854
580 -1854 3874 3203 -4164 -5171 1918 3562 1874 6647 7149 -1148 -3358 6044 13810 10682 4661 1024
596A024o65N539P189k944r075l309L755J872q67K060K51p996n426N550Q105J289
612F352o442q631J018J0703N626o488n369M679K777l492K302N908m43m711k077
627A712J155K858K600k07m969l198K238L56j123J762R59m169n452N94M746K824
643B686j411m173l433J335M993L079P30k059m049j572M501Q780P62p408m457K753
659A057L711K149J683k318o359k649M040M299p65k861m183l675K907N119p51m461
675c057q72J103j030M45L910J709k530k160l51L071M794J57l397q12K636o81j416
692A519L223L419l293n496j822L059N629p6o531n735J726M064J542r76k139k979
708d866k025K293M824L153k587o171j066N466O034M47l379l112j3K719L809J504
$$ plain form
596 1024 359 5898 13087 10143 1068 -2241 1514 3386 2519 4579 4830 -3166 -8592 -3042 5063 6352
612 6352 -90 -8721 -7703 3000 8626 2138 -3231 1448 4225 733 3035 8943 8500 3789 1712
627 1712 2867 5725 8325 8118 3149 -49 2189 2545 1422 3184 4143 -26 -5478 -4884 -138 2686
643 2686 1275 -2898 -6331 -4996 -3 3076 3806 1747 -2302 -3874 627 9407 10169 2761 -1696 1057
659 1057 4768 6917 8600 6282 -77 -2726 1314 5613 4848 1987 -2196 -5871 -2964 2155 1404 -3057
675 -3057 -3929 -2826 -3856 -3411 499 2208 -322 -2482 -2833 238 5032 5189 1792 980 3616 2935 1519
692 1519 4742 8161 4868 -628 -2450 609 6238 6162 -369 -6104 -4378 -314 1228 252 -1887 -4866
708 -4866 -6891 -4598 226 3379 792 -5379 -6445 -979 5055 5502 2123 -989 -1002 1717 5526 7030
724G030j953l634k013J059L755N40k991j975j119q28O1J604J097j496k607j884
740e354M13L586K692k118j993n64N60K279L305J000j365k276j529J855N669K514
756H674m642n408L67L414K492N80l046m599j528K547K513L11j534l961l478K583
772d715N329O02k595k222j078J286L681K117p99k119m53N03K489K955l38k330
788B313o09l67O18J707K17q87j894k610r43J672K789p76l227k528m76J456L170
805c75Q00k230k499j252K086M206K578j707m074j215L470M182K018j732m227j575
821a546K043L517J592j572m035k901J393L219Q34k219k530k191p9K073J519m97
837a380j365j275n77R94K818J210p15q84p07N85K209J797M66o76k088j290J972
$$ plain form
724 7030 5077 1443 -570 489 4244 4784 1793 -182 -1301 -2129 -2068 -464 633 -863 -3470 -5354
740 -5354 -4941 -1355 1337 -781 -2774 -3338 -2778 -499 2806 3806 2441 165 -1364 491 6160 8674
756 8674 4032 -1376 -1009 2405 4897 5477 2431 -2168 -3696 -1149 1364 1675 141 -3820 -7298 -4715
772 -4715 614 1216 -1379 -3601 -4679 -3393 288 2405 1606 -513 -966 -463 2026 4981 4643 2313
788 2313 1704 1337 1955 3662 3879 2992 1098 -1512 -2455 -783 2006 1230 -1997 -4525 -5001 -3545 -375
805 -375 425 -1805 -4304 -5556 -3470 736 3314 1607 -2467 -3682 -212 3970 5988 4256 29 -1546
821 -1546 497 4014 5606 4034 -1 -2902 -1509 1710 2544 325 -2205 -4396 -4475 -2402 -883 -1380
837 -1380 -2745 -4020 -4597 -3603 -785 425 -290 -1174 -1881 -1296 913 2710 3176 2500 412 -878 1094
854A094K983M70k125k830j782J282K724J201l470l292j010N71K974K240k403l876
870e249j149K555K712J316O4k556j927J860L862J306K02j795k340P63K605K079
886D308p44j723k430l44J675J630r06j503j234j693J76J438N67n39j398j554k58
903d532J308K646R49j414j340j131J675L854J607j530k026n89J209K373J693j52
919D600k874k879M11K686K247j144l745k839K74K811K358j485l840j374J489K088
935a216Q55Q7o44j546m68K109K318J024m88j788k37J419J517J450m47j679j161
952A105J30J308M84q10j44k154k047O75K055Q71j184k638j972J402K578J332r00
969I1k311j483J497L737J801j198j506m95n2J710L372Q05l268k443N71J982J158
$$ plain form
854 1094 4077 4547 2422 -408 -2190 -908 1816 3017 -453 -3745 -4755 -4184 -1210 1030 -1373 -5249
870 -5249 -6398 -3843 -1131 185 249 -2307 -4234 -2374 1488 2794 2996 1201 -1139 -376 2229 4308
886 4308 3564 1841 -589 -933 742 2372 1466 -37 -1271 -2964 -2788 -1350 -783 -1322 -2720 -4274 -4532
903 -4532 -3224 -578 371 -1043 -2383 -3514 -1839 2015 3622 2092 66 -523 686 3059 4752 4600
919 4600 1726 -1153 -742 1944 4191 3047 -698 -3537 -3263 -452 1906 421 -3419 -4793 -3304 -1216
935 -1216 -361 -274 -918 -2464 -2932 -823 1495 2519 2031 243 6 1425 2942 4392 3945 2266 1105
952 1105 1235 2543 3027 2217 2073 -81 -2128 -1453 602 1473 289 -2349 -4321 -2919 -341 991 91
969 91 -2220 -3703 -2206 1531 3332 2134 628 133 81 1791 5163 5968 2700 257 828 2810 3968
986C968M29k204k716k73J031J443M48k210k460j12J216N94L54N74j259j889J347
1003a719K565J08J24M85r87q19J029K797J127j374j615p86Q65J581M39l95j420
1020B005k262p64J662J568q13k108j882l43J088K673L19l021j839Q83J941K461
1036A568l33j650p32P67J513J730Q12r16j961L22J658O7J67L52j553k163L74J558
1054A580O09j553j378o01j39Q5N20K39mj774q59P98J796J651M7k158q16R89K599
1073A631J969r76j736p86N73J531J107J17n69k724j425K073J683l33k461j650
1089a976K9M43R11P89j372j944m92Q25J984J189j180j236J72R59J223J361K25
1106A910j008o86O62N66R49R62p81k122o35J107O60j9q21j217j188m67J293K67
$$ plain form
986 3968 4397 2193 -523 -796 235 1678 2126 -84 -2544 -2656 -1440 -846 -492 82 -1177 -3066 -1719
1003 -1719 846 954 1078 1563 576 -243 786 3583 4710 3336 1721 935 1800 3381 3820 3425 2005
1020 2005 -257 -1021 641 2209 1396 -712 -2594 -2937 -1849 824 1143 -1878 -3717 -2834 -893 1568
1036 1568 1235 -415 -1147 -380 1133 2863 3675 2759 798 1120 2778 2845 3012 3364 1811 -352 22 1580
1054 1580 2189 636 -742 -1343 -1482 -1397 -877 -638 -642 -2416 -3275 -2477 -681 970 1017 -1141 -1957 -968 1631
1073 1631 3600 2624 888 102 675 2206 3313 3430 2861 137 -1288 785 2468 2135 -326 -1976
1089 -1976 -1947 -1504 -593 196 -1176 -3120 -3612 -2787 -803 386 -794 -2030 -1858 -899 324 1685 1910
1106 1910 902 216 878 1444 2393 3355 2574 452 -183 924 1584 1565 744 -473 -1661 -2128 -835 -568
1124e68J25j355j866L28J778J206L31j201j374l0J826K470M29j471j189m23J572
1141E88K846J96k109j194m61J183R65l8q86j715p23l1O42J143p52k227m72P07
1159b338Q18J06K40m41o10O4P39Q31J302L44j301o98J236J601N94K47j297j004
1177D33l97J240J382m15j387j589j068J026J259k67j739j264n42J208J012L66
1193g42n73j168l02Q04J775J069o19j093j50J311J336L40L3r35m55k89J453N08
1211B303k0j267j191o87Q69P43m46j082j036l53j78N34J209m66r33p82N50R73
1229a260J038O22o75p58K59Q50J671J021p33j641m38R46J558O18j244j979j019
1246a164R16J129K01r30j309j361N8J421P20o50j285o77M67J159J014o5p81j49
$$ plain form
1124 -568 -443 -1798 -3664 -3336 -1558 -352 -21 -1222 -2596 -2626 -800 1670 2099 628 -561 -984 588
1141 588 3434 3630 1521 327 -134 1049 2014 1976 1090 -625 -1348 -1379 -737 406 -346 -2573 -3045 -2338
1159 -2338 -1520 -1414 -1174 -1615 -2225 -2161 -1422 -591 711 1055 -246 -944 292 1893 2487 2734 1437 433
1177 433 36 1276 2658 2243 856 -733 -1801 -775 484 217 -1522 -2786 -3328 -2120 -1108 -742
1193 -742 -1315 -2483 -2785 -1981 -206 863 244 -849 -999 312 1648 1988 2021 1086 631 342 1795 2303
1211 2303 2283 1016 -175 -862 7 750 304 -778 -1814 -2167 -2345 -1811 -602 -1068 -2001 -2783 -2233 -1260
1229 -1260 -222 400 -275 -1033 -774 76 1747 2768 2035 394 -44 902 2460 3078 1834 -145 -1164
1246 -1164 -248 881 1082 152 -1157 -2518 -2460 -1039 -319 -969 -2254 -2931 -2464 -1305 -291 -356 -1137 -1286
1264a286J84R58O99J171m50p32j59L12J081L67j81j167p88j61L49P32K10j525
1282c86j614l33J275P50j93r53j502m13J274J323N94p0j662k24Q63K019Q65o76
1300I37p60j97O01J286O09n37j127q62j15Q29J067q53j329r79M3J35P05qp85j049
1320b389J03j20P57Q72K2q41l44N77J150Q12p0K7p76J58P16J088J83k8j107o56
1340A34M7J003O28r39j628o97K58M01P81l38j514j269O99J120J004k68j168j72
1358a918J86J469Q57K22n17o36K97Q87J164J64p86m52j69L89P06m96l25p77n40
1377b75k66K87L62k22j013m63o19O84Q20K57p90n86j02Q56J328J019m95r21j82
1396c21Q54J062J090m23q60j064L52J263P87p06r63j147l03Q76N75k84j070j036
$$ plain form
1264 -1286 -1102 -144 555 1726 1276 544 385 697 1778 2145 1964 797 9 -152 197 929 1139 -386
1282 -386 -2000 -2333 -1058 -308 -501 -1454 -2956 -3369 -2095 -772 -178 -248 -1910 -2134 -1271 748 1613 937
1300 937 177 -20 581 1867 2476 1939 812 -50 -165 664 1731 878 -451 -1430 -1387 -1252 -547 -555 -1340 -2389
1320 -2389 -2286 -2406 -1649 -777 -755 -1596 -1940 -1363 -213 599 529 556 -220 -62 654 1742 1925 1897 790 134
1340 134 181 1184 1812 873 -755 -1452 -1194 -793 -12 -350 -1864 -3133 -2434 -1314 -310 -578 -1746 -1918
1358 -1918 -1732 -263 594 816 299 -337 -40 847 2011 2175 1389 937 768 1157 1863 1367 1042 265 -275
1377 -275 -541 -254 108 -114 -1127 -1590 -2209 -1525 -705 -448 -1238 -1824 -1926 -1070 258 1277 782 -139 -321
1396 -321 533 1595 2685 2262 1402 338 690 1953 2740 2034 1071 -76 -379 497 1072 788 -282 -1318
1414a318n12R04O05O0r11l37j94P64Q01Q17n76R6l01J05J216P50J18p57k36J52
1434A246L80M74R6l55j148n16N2N66J27o55q62m48nN79L14o9j237p24M59J342
1454c84O82Q5j82j115M56J423N88L75o62q39J78J183N07j95n77p61l03J71O01
1473A231j80r07m62m30QK80L29m58q07m25K68M38P88M69l66n70K18L50J192N81
1493A547k70j039O6R01M41M29N0q57r10k13J017L34o24q23p88l52N14M57l18p54
1513a192p54j12O76Q60J51n08j47m6M38Q53N71j32o69Q3O45P05L13k36n79m69
1533D51m8N39N48n69q58p14j04L25L1l9n14p40k86N80N22L05k67m14k08J61R04
1554c95Q71r8l43o77O91P66R31N3o97r25K36L32P34K19j094j138j01K20J51K38
$$ plain form
1414 -1318 -1830 -926 -321 -261 -1172 -1509 -1703 -939 -138 679 103 199 -102 3 1219 1969 2087 1330 1094 1246
1434 1246 1626 2100 2196 1841 693 177 229 795 922 267 -595 -1043 -1048 -469 -155 -224 -1461 -2185 -1726 -384
1454 -384 298 383 201 -914 -458 965 1553 1928 1266 427 605 1788 2295 2100 1523 762 459 630 1231
1473 1231 1051 144 -318 -748 -740 -460 -131 -589 -1396 -1821 -1553 -1115 -327 142 -224 -794 -576 -226 966 1547
1493 1547 1277 238 304 1205 1646 2075 2125 1268 358 145 1162 1496 872 49 -739 -1091 -577 -120 -438 -1192
1513 -1192 -1946 -2058 -1382 -522 -371 -879 -1026 -1072 -634 219 790 658 -11 72 717 1422 1735 1499 920 451
1533 451 403 942 1490 921 63 -651 -755 -430 -399 -438 -952 -1692 -1978 -1398 -876 -571 -838 -1252 -1460 -1299 -395
1554 -395 476 378 35 -642 49 815 1746 1799 1102 177 413 745 1479 1698 604 -534 -635 -415 -264 -26
1574b6n98q13l80L02P10m6N7m03n50L35Q45O94L9k46J80k96M60O58O66m72l28
1595G88n53J83Q06K25n74n44n46o18P07M16k89p31o67j04n8M98N32o61o01K84
1615a507O64Q96J03o03j06R4M21J092L93l93n20l62N52N94K58n58l79o62j08L91
1635B60O49p38o98q08j64N81O04j52n40l00k30K22J036L40l48l46m8K98P16J130
1655A464m75q1m52l02Q48N05n9l51p53j93p6O99K2p86j080K32k51N05J88l23o79
1676a398j15N3P86M15m6n30Q8K69J019L57Jm50Nj7O87j86L33j53n12l16L29P2
1698F91j51j42o38o92k79P11N0k72m79m99J38O05P40k26j39k02o0O23P95K12l69
1719D17j81q9R6R54L30n02l45k90m7N41M92m25j314m12K7L77K56j57n63n92q5
$$ plain form
1574 -26 -624 -1437 -1817 -1515 -805 -851 -794 -1197 -1747 -1412 -567 127 166 -80 100 -196 264 922 1588 1116 788
1595 788 235 418 1224 1449 875 331 -215 -833 -126 290 1 -730 -1397 -1501 -1559 -1061 -529 -1190 -1791 -1507
1615 -1507 -843 53 156 -447 -553 -459 -38 1054 1447 1054 534 172 724 1318 1576 1018 639 -23 -131 260
1635 260 909 171 -527 -1335 -1499 -918 -314 -466 -1006 -1306 -1536 -1314 -278 62 -286 -632 -680 -382 334 1464
1655 1464 989 908 456 154 1002 1507 1448 1097 344 151 75 774 796 10 -1070 -838 -1089 -584 -396 -719 -1398
1676 -1398 -1513 -1460 -674 -259 -305 -835 -747 -478 541 898 899 449 454 437 1124 938 1271 1118 606 290 619 691
1698 691 540 398 -240 -932 -1211 -500 -450 -722 -1201 -1700 -1562 -957 -217 -443 -582 -784 -844 -221 574 786 417
1719 417 236 147 243 1197 1527 1025 680 390 343 884 1376 951 -363 -775 -748 -371 -115 -272 -835 -1427 -1512
1740a512O44K47N9k35m77Q0P09O45J29K29l34j77K49O94L61k43j97l35o5L77J96
1761A044k87m92j28k99k70O80l14l95n91l89L19M34J38J67o03Q0J06N61O51n5
1781C57k12l15L23O44R65m54o78m1J61L50L0n3n25k63l14L10k6O0n78l54k41j35
1803i89M77k16K55m02p5J1M18O20K48j17l98M20L45O68J80l25k38k94K50P58k26
1824A370j24o05k15m59N40J02l15p71k72k58N27K39k46J41n22P6J46P09L62m73
1844d8l43M96M11K23M24p8l19p6K34K50J59n5l08m72pJ95L2l42m29m44p6j60K88
1867d45O3l67m4k00L97L43l4L50n62K52K50O53K68M1n85J43M01P4M82j33l78m43
1889E26j39K01L79m01m57q4o48L6K50L22o44k43j49K04J38M30L46q21J23J55N93
$$ plain form
1740 -1512 -868 -621 -562 -797 -1274 -1194 -485 160 289 518 184 7 256 950 1311 1068 871 536 471 848 1044
1761 1044 757 265 137 -162 -432 248 -66 -461 -1052 -1441 -1122 -688 -550 -383 -986 -906 -800 -239 412 357
1781 357 145 -170 153 797 1762 1308 630 589 750 1100 1130 1077 552 289 -25 285 259 319 -259 -613 -854 -989
1803 -989 -512 -728 -473 -875 -950 -939 -521 99 347 230 -168 252 597 1265 1445 1120 882 588 838 1596 1370
1824 1370 1246 641 426 -33 507 609 294 -477 -749 -1007 -480 -241 -487 -346 -868 -792 -646 63 425 -48
1844 -48 -391 105 516 739 1163 1085 766 690 924 1174 1333 1278 970 498 491 686 718 376 -53 -497 -573 -733 -445
1867 -445 -382 -749 -793 -993 -596 -253 -287 63 -499 -247 3 656 924 965 380 523 924 998 1480 1347 969 526
1889 526 387 588 967 566 109 25 -623 -587 -337 -15 -659 -902 -1051 -847 -709 -279 67 -754 -631 -476 117
1910A17O10Q2m44k56L53J36N08M5j21l88n15K31M24Q7o45k28j63m47N84j27j52
1931c09l41n69PP46j00K9j94j83K08O83N14j45m2k65L34o5N47L69m65j16k73o7
1953C03N13M2j22p60l56n9L33o6n0m76k46J62J4J50K59l04k17j98O79K74L00J34
1975C09l89J84o2N70K56l9j82j58r4R8K38J68l52o38j57R0O2j14k23m06k29J51
1997i17L05J46k54k34l2J28L14K78K57k10K08P5K45P63k39n9l27nJ36L65J3m20
2019E36l59j90J27lm1k92k81n26J34J28N10k37m48k87O63K67O3O7k0O7J9O57o8
2042D86K71j81n6p8J21J58l9j31j53m98J80K67j24j60m73J1l49N16J0l27k11k98
2064a058l8M53M83K59l69j61L94j56O31J41J4k76J72R1l3N71P6m66m49J36JN5
$$ plain form
1910 117 727 809 365 109 462 598 1106 1151 1030 642 127 358 782 869 224 -4 -167 -614 -30 -157 -309
1931 -309 -650 -1219 -1212 -466 -566 -537 -731 -914 -706 -23 491 346 304 39 373 308 855 1224 759 643 370 303
1953 303 816 858 736 -24 -380 -439 -106 -172 -222 -698 -944 -782 -768 -618 -359 -663 -880 -1078 -399 -125 175 309
1975 309 -80 104 42 612 868 829 647 489 395 493 731 899 547 -91 -248 -158 -96 -210 -433 -839 -1068 -917
1997 -917 -612 -466 -720 -954 -986 -858 -544 -266 -9 -219 -11 64 309 1072 833 774 447 442 578 943 956 536
2019 536 177 -13 114 111 70 -222 -503 -1029 -895 -767 -257 -494 -942 -1229 -566 -299 -236 -169 -189 -122 -103 554 486
2042 486 757 576 520 442 563 721 682 551 398 -100 80 347 223 63 -410 -399 -748 -232 -222 -549 -760 -1058
2064 -1058 -1096 -643 -160 99 -270 -431 -37 -193 438 579 593 317 489 580 547 1118 1194 728 279 415 416 471
2086D71k70o9n51j83J60Q2kj81k3m43L91J61o2n7Q8P5n9P26K31J6m09L09K9K59
2110F89K50n4k77l38J85j16P2K43m26k08l10j2J1J34r8m42k85L21MK10J03J31
2132b13k75J15M59J74J97l25L6L7K62L35J3j52k46K9J27J59K37o01n13o5l4O2
2154a82R4o0o01j09J13J24K82P3j58j26o8M20P2N30l67k0K19R3L89K45j31k90
2176E42j54N1M82l03P1l56m79o0J2Q4p0k00k84K47j80P1J54k46O9N1O8M42M8L8
2200I8N8J37j50M74L61l20R4l76K83r1K57o3m70k30J33R2m6j32n10j11K70k22
2222d64J88o2j44J73m38K4N26J64N7p8J2K08J64K55J93l29K29k73J11L78j2l56
2244E26r3l36J64n4J76m28m36L03j49J34Mk50j28O9m6L09j70J59L9j38K00L58
$$ plain form
2086 471 201 132 -419 -602 -442 -360 -362 -543 -566 -1009 -618 -457 -519 -576 -488 -413 -472 254 485 501 92 401 430 689
2110 689 939 885 608 270 455 339 411 654 228 20 -290 -302 -291 -157 -255 -697 -982 -661 -657 -447 -344 -213
2132 -213 -488 -373 86 260 457 132 168 205 467 802 815 663 417 446 573 732 969 368 -145 -210 -244 -182
2154 -182 -88 -148 -749 -858 -745 -621 -339 -266 -424 -550 -618 -198 -126 404 37 17 236 329 718 963 832 542
2176 542 388 439 921 618 689 333 -146 -206 -194 -110 -180 -380 -664 -417 -597 -526 -372 -618 -549 -498 -430 12 60 98
2200 98 156 293 143 617 978 658 752 376 659 568 825 762 292 62 195 287 241 109 -401 -512 -242 -464
2222 -464 -276 -338 -482 -309 -747 -723 -197 -33 24 -54 -42 166 330 585 778 449 678 405 516 894 882 526
2244 526 433 97 261 207 383 -45 -481 -178 -327 -193 -189 -439 -567 -498 -544 -235 -405 -246 -207 -345 -145 213
2266B13L64O8j32m19M93J6P6j0q9l1l04k5N0K13k29k82l15k99L63j32q2k02Q2
2289f13R0K70J7j79q4K85N9K84N42l78m5M7P1l1N81k78M8j15l54K45m0j46O5k41
2313A00n51K50J50J56l31l60M0j97L52J02l6L5j88n7K95J28M98k81J59k7L14o4
2335D87J8J43q1k73p3K71k98p4K76k73k25n5L34m61j46j39MO9L49J92o17J93k53
2358f32K48K30L07n7R3j0J62R6L99rk11j82n4J72r7j0M4k70l12j94N02l61O5k69
2382c50l22J61oR6m1j64J18k20O80P8k2Km09N05L05OL30O2k60n6Q4l6j12k33j77
2407A9K12k89N3K88o01k2o4J3M3P6L4m8m31K9K48K86K0j36J67j87N56J8J46R1
2431E21ol60K85j9mR1j77l12m0L48m8n5l70j18j60o1M1K30j34r8RJ15Q0J24K27
$$ plain form
2266 213 577 645 513 94 587 603 679 669 580 549 245 220 270 483 254 -28 -343 -642 -279 -411 -493 -695 -613
2289 -613 -523 -253 -236 -415 -499 -214 -155 129 671 293 248 295 366 335 916 638 686 571 217 462 422 276 341 100
2313 100 -451 -201 -51 105 -226 -586 -546 -743 -391 -289 -325 -290 -478 -535 -240 -112 386 105 264 237 551 487
2335 487 505 648 567 294 221 492 194 120 396 123 -102 -157 177 -284 -430 -569 -565 -496 -147 45 -572 -379 -632
2358 -632 -384 -154 153 96 189 179 341 437 836 827 616 434 380 552 455 445 489 219 -93 -287 215 -146 -81 -350
2382 -350 -672 -511 -517 -421 -462 -626 -508 -728 -48 30 8 10 -399 106 411 417 747 809 549 493 577 541 429 196 19
2407 19 231 -58 -5 283 -318 -340 -404 -391 -348 -272 -238 -286 -717 -688 -440 -154 -134 -270 -103 -290 266 284 430 521
2431 521 515 155 440 421 417 508 331 19 -21 327 279 224 -146 -264 -424 -485 -444 -214 -348 -446 -437 -322 -242 -118 109
2456A09m12L5K98J87K24L8Kj6j69L0J87J37pk89j31l11N05l75J7l16J12k46Q8
2479c03J24j57l62K92j40L9L62q4k94L92J57N3J3L36r9L7J9l1K82L0l9k66l78
2502a7L83J3P8j85j72l47k11L91K1j80k48%N5k4L53l87L58k51P3L10J74j31r2
2525c6L58j4j7J62K03j61j33l3m5J99k59o1l27N4R0j25q6j39J40p1K4l40L39n0
2549c28o5j54K85L0J54J21j09K72r6P6K61K7L40l30R5j11q9k9J80l00k69j06j44
2572b89K51J61m58k09J40p5R8j71J84pj5K41n0m9L54k49L56k72M57L4O4q5m2O7
2596D36o8P5K10n13j80j69K26j21J05m8k12Rl28K57R0p1l66L46p0l0K04K74l55
2619b99J81O7J70p8J03L82l7j82j13K94J5k1j43j40o62N19L25o28J60l30L2p7
$$ plain form
2456 109 -303 -268 30 217 441 479 481 465 296 326 513 650 643 354 223 -88 417 42 59 -257 -145 -391 -303
2479 -303 -179 -336 -698 -406 -546 -507 -145 -229 -523 -131 26 79 92 428 329 366 385 354 636 666 627 361 -17
2502 -17 366 379 457 272 100 -247 -458 -67 -46 -226 -474 -474 -419 -443 -90 -477 -119 -370 -297 13 187 56 -36
2525 -36 322 308 291 453 656 495 362 329 284 483 224 163 -164 -110 -20 -145 -231 -370 -230 -301 -277 -617 -278 -328
2549 -328 -393 -547 -262 -232 -78 43 -66 206 110 186 447 474 814 484 579 468 379 350 530 230 -39 -145 -289
2572 -289 -38 123 -335 -544 -404 -479 -381 -552 -368 -375 -390 -149 -199 -248 106 -143 213 -59 398 432 496 411 369 436
2596 436 368 443 653 140 -40 -209 17 -104 1 -47 -259 -250 -578 -321 -231 -302 -668 -322 -392 -422 -218 56 -299
2619 -299 -118 -51 119 41 144 526 489 307 194 488 503 482 339 199 -463 56 381 -247 -87 -417 -385 -462
2641d62J04k14J73J8O2j53J67M18j22j60J97m2L63j2j5r9J21R1l0p9j12J70k96
2664H8J35l15K62m17J66q4r6n3J29k26J67n8J2kP8J82k65m8K7K25J43L07Pj51
2688B13n3q6L26L5L7k38J18k67J92l53K73k04k11M23k49k9k89j67J51K4K6M7J
2711b80L7k52K01l6P33k44J0K7r9J90k10L17J70l30J39j17R4j7o3P7n58J56q2
2734a37m8J95k30N3k33J78l9Rp4J67l53L05J62J65J17k95K27J6J14R6j35J76j54
2757B82J2j1J48k91m3l2l54K93M7j08q3O2mm94K81J72m8m40J61J16Q6P1K25O2
2781A10k46L75j4K15J35j17l08K68k31n0k2K79k66k8n13L11o8om0m4j45n9l0K20
2805b74J33j37j28K23k7K54o4j90M8M88L4j09Qo1r5J45j8J38j35J41n22N3J98
$$ plain form
2641 -462 -358 -572 -399 -381 -319 -472 -305 113 -9 -169 28 -14 349 337 322 223 344 435 405 326 214 384 88
2664 88 223 -92 170 -247 -81 -165 -261 -314 -185 -411 -244 -302 -290 -292 -214 -32 -297 -345 -318 -93 50 357 364 213
2688 213 160 74 400 435 472 234 352 85 277 -76 197 -7 -218 205 -44 -73 -362 -529 -378 -354 -328 -281 -280
2711 -280 -243 -495 -294 -330 403 159 169 196 97 287 77 394 564 234 373 256 350 333 270 347 -211 -55 -137
2734 -137 -185 10 -220 -167 -400 -222 -261 -252 -326 -159 -512 -207 -45 120 237 -58 169 185 299 395 260 436 282
2757 282 294 283 431 140 97 65 -289 4 51 -57 -140 -78 -82 -576 -295 -123 -171 -611 -450 -334 -248 -177 48 110
2781 110 -136 239 225 440 575 458 150 418 187 137 115 394 128 100 -413 -102 -170 -176 -216 -260 -405 -464 -494 -274
2805 -274 -141 -278 -406 -183 -210 44 -20 -210 -162 326 360 251 259 198 103 248 230 368 233 374 -148 -95 103
2828A03j42J46Q2k23j51o5Q5J76m15R7J5j54L82l5m1L22m99L03j1M05j8j64m1
2851A57J13k11N47l33Q7l2j32k25Q9R2l8j22J67m63j53K53Q8k23j48L67j19J30
2873a09J24k17J21j66R5K14K6K94m72L57j02J35pk3j3j88L4R6j22J1J35k75M5
2896gj72L3J06j87k48J30O3J01J36l9r5J53J29j98L91k70%K89k80K67K53k17K
2919C40l61L77r8K56l65j7m3p4n7j25l8nJ54j93r5J94L9p1j32J82P0j67M7QL07
2944A33J40k93L76j04j64J50M4j43o1L8K15j39p6p1LmJ93m05R7l66j20L11J43
2967a03k63O7Q1m4N60l78K44j55K08ok02K20L26k42J20k08K65j98l9K4k47J6N5
2990A01m8m2L9k92L56l78j33K51L3m5n0j3K57j71J49J23J28J20m43L04j61k2J59
$$ plain form
2828 103 -39 107 189 -34 -185 -250 -165 11 -404 -307 -292 -446 -64 -99 -140 182 -317 -14 -25 380 362 198 157
2851 157 270 59 606 273 360 328 196 -29 60 152 114 -8 159 -304 -457 -204 -116 -339 -487 -120 -239 -109
2873 -109 15 -202 -81 -247 -152 62 88 382 -90 267 165 300 293 270 257 69 103 199 77 88 223 -52 -7
2896 -7 -179 -146 -40 -227 -475 -345 -282 -181 -45 -84 -179 -26 103 -95 296 26 26 315 35 302 555 338 340
2919 340 -21 356 258 514 149 132 89 15 -42 -167 -205 -210 -56 -249 -344 -150 -111 -182 -314 -132 -62 -229 -182 -174 133
2944 133 273 -20 356 252 88 238 282 139 78 116 331 192 116 45 48 44 237 -168 -71 -437 -557 -246 -103
2967 -103 -366 -299 -218 -262 298 -80 164 9 217 211 9 229 555 313 433 225 490 292 253 277 30 46 101
2990 101 53 11 50 -242 114 -264 -397 -146 -113 -158 -208 -221 36 -135 14 137 265 385 -58 246 85 63 222
3013B22j24N3J26M0J12J09n71R1k1j49p2K22l80L3m9K5L37k80j09J73J9J00M9
3036d4J4RmM6K65k79K30l9j55J74o0J98k19LK3j46K1k76L24q5m19M25j11k31O4
3061b72N4j85K75j71J13j3J6L30k49M9j09J98K35r3K5M0J1j33L73k74n3M3J52
3084C62j84k38K43m93K02R7q5Q5k95K64m20M18j00k32L0L44o4j68M16l02J71J55
3106B06n7j71J25J59J39n2l5P6k21J48j19k45L4j12j56K64m0mO1l40K06o2j58
3129c54L86n1l01K55K73l25kK96j00j13K35K75j22L9k0k31q1K40k4o2Lk61j32
3152a77K06m29L33J9L5j92k82L25K26K9n16J63L16lr1j1N4j84M46j14j15R1J40
3175B69q8O8K7J02j36j51k42N5J4q8J52K8j15P6j08j63J85N7j92P6J70l04M46
$$ plain form
3013 222 98 151 277 317 429 538 -33 58 37 -112 -184 38 -342 -309 -358 -333 4 -276 -385 -212 -193 -93 -44
3036 -44 -30 -21 -25 21 286 7 237 198 43 217 157 355 136 139 162 16 37 -239 85 0 -419 6 -105 -336 -272
3061 -272 -218 -403 -128 -299 -186 -199 -183 147 -102 -53 -162 36 271 178 203 243 254 121 494 220 167 210 362
3084 362 178 -60 183 -310 -108 -11 -96 -11 -306 -42 -462 -44 -144 -376 -346 -2 -66 -234 182 -120 51 206
3106 206 149 -22 103 262 401 349 314 390 169 317 198 -47 -13 -125 -281 -17 -57 -61 0 -340 -134 -196 -354
3129 -354 32 -19 -320 -65 208 -117 -119 177 77 -36 199 474 352 391 371 140 59 299 275 213 216 -45 -177
3152 -177 29 -400 -67 -48 -13 -205 -487 -162 64 93 -423 -260 56 53 -38 -49 5 -179 267 153 38 129 269
3175 269 181 249 276 378 242 91 -151 -96 -82 -170 -18 10 -105 -29 -137 -300 -115 -58 -250 -174 -4 -308 138
3198A38l33L43k03j4K19K29k64R6J26m59L04K20l36L5k5j49K16k99K55l96P4Q8
3220a35J41Ql15K55p1m03R0L70j6L16k59j78K68j00J97Q8J7kl11L62%L3k19j30
3244FN9J28k66J22j31l7P1j96J48R6j65J18j68j27K97mk6k4K0J74k34J16N8J73
3268B08k24L26jo2J65k29J33m83L87l8J69m27k12K64MR1j12j10j20K38k14K35
3290a2l3j55Rq6K26m8J27NJ30l2N6M3j1J97j75o0or3j25J67p0k38N4J57n3k85
3316c11L45k10k6J27k9j80K6J06q4J03J2N8K9n5J55q8rK80K30l80J89m19N3J09
3340C1r9L88j64j59k9j84K63j13j25K42m21M68q9k18J05K39l54J19rK16j21l72
3362c86K96N5N9K58r4J73k27J20Q0j15j1j7K45n59Q4O1qj48K1l1K3k36J43K0j19
$$ plain form
3198 138 -195 148 -55 -69 150 379 115 211 337 -122 182 402 66 101 76 -73 143 -156 99 -297 -223 -135
3220 -135 6 14 -301 -46 -117 -520 -430 -60 -76 240 -19 -197 71 -29 168 256 273 271 -40 322 322 355 136 6
3244 6 65 193 -73 49 -82 -119 -48 -244 -96 0 -165 -47 -215 -342 -45 -49 -75 -99 -79 95 -139 -23 35 208
3268 208 -16 310 309 247 412 183 316 -167 220 182 351 -76 -288 -24 -20 71 -41 -151 -271 -33 -247 -12
3290 -12 -45 -200 -191 -277 -51 -99 28 33 163 131 187 230 219 416 241 181 175 82 -43 124 54 -184 -130 27 -26 -311
3316 -311 34 -176 -202 -75 -104 -284 -258 -152 -236 -133 -121 -63 -34 -89 66 -22 -31 249 479 99 288 -131 -78 31
3340 31 -68 320 156 -3 -32 -216 47 -66 -191 51 -370 98 9 -209 -104 135 -219 -100 -109 107 -14 -386
3362 -386 -90 -35 24 282 188 361 134 254 334 219 208 191 436 -123 -39 22 14 -134 -113 -144 -121 -357 -214 -194 -313
$$ [...]
8191B06
##END NTUPLES=NMR FID
##END=
