##TITLE=1H_Ser Am
 200.13Hz, DCDCl3.
 8 sc
 17.7.2026
##JCAMPDX= 6.0         $$ Bruker NMR JCAMP-DX V2.0
##DATA TYPE= NMR FID
##DATA CLASS= NTUPLES
##ORIGIN= UXNMR, Bruker Analytische Messtechnik GmbH
##OWNER= pz
$$ XWIN-NMR		Version 3.5
$$ Fri Jul 17 14:16:45 2026 Russian Standard Time (UT+4h)  she@DPX200
##.OBSERVE FREQUENCY= 200.1313
##.OBSERVE NUCLEUS= ^1H
##.DELAY= (6, 6)
##.ACQUISITION MODE= SIMULTANEOUS
##.ACQUISITION SCHEME= undefined
##.AVERAGES= 8
##.DIGITISER RES= 18
##SPECTROMETER/DATA SYSTEM= spect
##.PULSE SEQUENCE= zg30
##.SOLVENT NAME= DMSO
##.SHIFT REFERENCE= (INTERNAL, DMSO, 0, 14.3821)
##AUDIT TRAIL= $$ (NUMBER, WHEN, WHO, WHERE, WHAT)
$$ ##TITLE= Audit trail, XWIN-NMR		Version 3.5
$$ ##JCAMPDX= 5.01
$$ ##ORIGIN= Bruker BioSpin GmbH
$$ ##OWNER= she
$$ F:/spectra/data/she/nmr/H-C/1/audita.txt
$$ ##AUDIT TRAIL=  $$ (NUMBER, WHEN, WHO, WHERE, WHAT)
(   1,<2026-07-17 14:14:50.42 +0400>,<she>,<DPX200>,
      <created by zg, POWCHK disabled, PULCHK disabled
       configuration hash MD5:
       00 E9 B6 7A A2 85 ED C7 34 08 36 98 17 FE 4E 26
       data hash MD5: 16K
       C8 3A CC 37 07 75 F8 83 66 D4 32 2F B0 1B 20 57>)
$$ ##END=
$$ 
$$ hash MD5
$$ 8A A2 94 BE F2 D2 5E 48 FF C9 52 51 AC 44 C2 54
##$RELAX= 
##$RELAX= 
##$RELAX= 
##$RELAX= 
##$RELAX= 
##$RELAX= 
$$ Bruker specific parameters
$$ --------------------------
##$DU= <F:/spectra>
##$EXPNO= 1
##$NAME= <H-C>
##$PROCNO= 1
##$TYPE= <nmr>
##$USER= <she>
##$AMP= (0..31)
100 100 100 100 100 100 100 100 100 100 100 100 100 100 100 100 100 100 
100 100 100 100 100 100 100 100 100 100 100 100 100 100 
##$AQSEQ= 0
##$AQ_mod= 1
##$AUNM= <au_zg>
##$AUTOPOS= <>
##$BF1= 200.13
##$BF2= 200.13
##$BF3= 200.13
##$BF4= 200.13
##$BF5= 200.13
##$BF6= 200.13
##$BF7= 200.13
##$BF8= 200.13
##$BYTORDA= 1
##$CFDGTYP= 0
##$CFRGTYP= 5
##$CHEMSTR= <none>
##$CNST= (0..31)
1 1 145 1 1 1 1 1 1 1 1 1 1 1 1 1 1 1 1 1 1 1 1 1 1 1 1 1 1 1 1 1 
##$CPDPRG= <>
##$CPDPRG1= <>
##$CPDPRG2= <>
##$CPDPRG3= <>
##$CPDPRG4= <mlev>
##$CPDPRG5= <mlev>
##$CPDPRG6= <mlev>
##$CPDPRG7= <mlev>
##$CPDPRG8= <mlev>
##$CPDPRGB= <>
##$CPDPRGT= <>
##$D= (0..31)
0 0.7 0 0 0 0 0 0 0 0 0 0.03 0 0 0 0 0 0 0 0 0 0 0 0 0 0 0 0 0 0 0 0 
##$DATE= 1784283289
##$DBL= (0..7)
120 120 120 120 120 120 120 120 
##$DBP= (0..7)
150 150 150 150 150 150 150 150 
##$DBP07= 0
##$DBPNAM0= <>
##$DBPNAM1= <>
##$DBPNAM2= <>
##$DBPNAM3= <>
##$DBPNAM4= <>
##$DBPNAM5= <>
##$DBPNAM6= <>
##$DBPNAM7= <>
##$DBPOAL= (0..7)
0.5 0.5 0.5 0.5 0.5 0.5 0.5 0.5 
##$DBPOFFS= (0..7)
0 0 0 0 0 0 0 0 
##$DE= 6
##$DECBNUC= <off>
##$DECIM= 32
##$DECNUC= <off>
##$DECSTAT= 4
##$DIGMOD= 1
##$DIGTYP= 9
##$DL= (0..7)
0 120 120 120 120 120 120 120 
##$DP= (0..7)
150 150 150 150 150 150 150 150 
##$DP07= 0
##$DPNAME0= <>
##$DPNAME1= <>
##$DPNAME2= <>
##$DPNAME3= <>
##$DPNAME4= <>
##$DPNAME5= <>
##$DPNAME6= <>
##$DPNAME7= <>
##$DPOAL= (0..7)
0.5 0.5 0.5 0.5 0.5 0.5 0.5 0.5 
##$DPOFFS= (0..7)
0 0 0 0 0 0 0 0 
##$DQDMODE= 0
##$DR= 18
##$DS= 0
##$DSLIST= <SSSSSSSSSSSSSSS>
##$DSPFIRM= 0
$$ [...]
##$SUBNAM0= <"">
##$SUBNAM1= <"">
##$SUBNAM2= <"">
##$SUBNAM3= <"">
##$SUBNAM4= <"">
##$SUBNAM5= <"">
##$SUBNAM6= <"">
##$SUBNAM7= <"">
##$SUBNAM8= <"">
##$SUBNAM9= <"">
##$SW= 18.0517328524113
##$SWIBOX= (0..15)
0 0 2 0 0 0 0 0 0 0 0 0 0 0 0 0 
##$SW_h= 3612.71676300578
##$TD= 16384
##$TD0= 1
##$TE= 0
##$TE2= 300
##$TE3= 300
##$TEG= 300
##$TL= (0..7)
0 120 120 120 120 120 120 120 
##$TP= (0..7)
150 150 150 150 150 150 150 150 
##$TP07= 0
##$TPNAME0= <>
##$TPNAME1= <>
##$TPNAME2= <>
##$TPNAME3= <>
##$TPNAME4= <>
##$TPNAME5= <>
##$TPNAME6= <>
##$TPNAME7= <>
##$TPOAL= (0..7)
0.5 0.5 0.5 0.5 0.5 0.5 0.5 0.5 
##$TPOFFS= (0..7)
0 0 0 0 0 0 0 0 
##$TUNHIN= 0
##$TUNHOUT= 0
##$TUNXOUT= 0
##$USERA1= <user>
##$USERA2= <user>
##$USERA3= <user>
##$USERA4= <user>
##$USERA5= <user>
##$V9= 5
##$VALIST= <valist>
##$VCLIST= <CCCCCCCCCCCCCCC>
##$VD= 0
##$VDLIST= <DDDDDDDDDDDDDDD>
##$VPLIST= <PPPPPPPPPPPPPPP>
##$VTLIST= <TTTTTTTTTTTTTTT>
##$WBST= 1024
##$WBSW= 4
##$XGAIN= (0..3)
0 0 0 0 
##$XL= 0
##$YL= 0
##$YMAX_a= 657614
##$YMIN_a= -620249
##$ZGOPTNS= <>
##$ZL1= 120
##$ZL2= 120
##$ZL3= 120
##$ZL4= 120
##$ABSF1= 10
##$ABSF2= 0
##$ABSG= 5
##$ABSL= 3
##$ALPHA= 0
##$AQORDER= 0
##$ASSFAC= 0
##$ASSFACI= 0
##$ASSFACX= 0
##$ASSWID= 0
##$AUNMP= <proc_1d>
##$AZFE= 0.1
##$AZFW= 0.1
##$BCFW= 1
##$BC_mod= 2
##$BYTORDP= 1
##$COROFFS= 0
##$CY= -3
##$DATMOD= 1
##$DC= 2
##$DFILT= <>
##$DTYPP= 0
##$F1P= 0
##$F2P= 0
##$FCOR= 0.5
##$FTSIZE= 0
##$FT_mod= 4
##$GAMMA= 1
##$GB= 0.15
##$INTBC= 1
##$INTSCL= 1
##$ISEN= 128
##$LB= 0.25
##$LEV0= 0
##$LPBIN= 0
##$MAXI= 10000
##$MC2= 0
##$MEAN= 0
##$ME_mod= 0
##$MI= 1.114404
##$NCOEF= 0
##$NC_proc= 0
##$NLEV= 6
##$NOISF1= 3.799351
##$NOISF2= 2.8
##$NSP= 1
##$NTH_PI= 0
##$NZP= 0
##$OFFSET= 14.38212
##$PC= 1
##$PHC0= -4207.295
##$PHC1= -6.807697
##$PH_mod= 1
##$PKNL= yes
##$PPARMOD= 0
##$PSCAL= 0
##$PSIGN= 0
##$REVERSE= no
##$SF= 200.129724274929
##$SI= 16384
##$SIGF1= 3
##$SIGF2= 2
##$SINO= 400
##$SIOLD= 16384
##$SREGLST= <1H.CDCl3>
##$SSB= 0
##$STSI= 0
##$STSR= 0
##$SW_p= 3205.1282051282
##$SYMM= 0
##$S_DEV= 0
##$TDeff= 0
##$TDoff= 0
##$TI= <>
##$TILT= no
##$TM1= 0
##$TM2= 0
##$TOPLEV= 0
##$USERP1= <user>
##$USERP2= <user>
##$USERP3= <user>
##$USERP4= <user>
##$USERP5= <user>
##$WDW= 1
##$XDIM= 8192
##$YMAX_p= 0
##$YMIN_p= 0
$$ End of Bruker specific parameters
$$ ---------------------------------
##NTUPLES= NMR FID
##VAR_NAME=  TIME,          FID/REAL,        FID/IMAG
##SYMBOL=    X,             R,               I
##VAR_TYPE=  INDEPENDENT,   DEPENDENT,       DEPENDENT
##VAR_FORM=  AFFN,          ASDF,            ASDF
##VAR_DIM=   8192,          8192,            8192
##UNITS=     SECONDS,       ARBITRARY UNITS, ARBITRARY UNITS
##FACTOR=    0.0002768,     1,               1
##FIRST=     0,             0,               0
##LAST=      2.2672688,     0,               0
##MIN=       0,             -620249,         0
##MAX=       2.2672688,     657614,          0
$$ Real data points
##PAGE= N=1
##DATA TABLE= (X++(R..R)), XYDATA
$$ [...]
$$ plain form
1941 -168 724 417 -223 -169 582 1154 -1569 -2050 1425 1353 -1588 -1154 686 1261 -771 -1130 1 530 -400
1960 -400 409 518 137 1014 -281 -233 1003 -17 -1895 -394 1740 1075 -1958 -1454 1955 396 -2412
1977 -2412 -795 654 -69 -174 761 1078 92 -634 -141 239 542 242 -628 174 2231 -220 -2945 -521
1995 -521 1940 -741 -1885 554 1835 -180 -980 1097 422 -1352 -225 1166 391 656 626 -306 429
2012 429 1103 -1010 -2464 -205 2255 48 -1917 959 1435 -1261 -1315 442 33 -627 70 1353 1174
2029 1174 173 -672 -243 549 338 -1158 -1686 2117 2160 -1767 -1536 1213 -6 -2860 -1075 2187 395
2046 395 -1418 1236 2535 -980 -2030 98 503 116 199 433 1107 562 -265 -1711 -1300 77 -39 -549
2064 -549 990 1302 -1218 -921 884 -385 -1333 2 1334 890 0 947 1091 -955 -298 707 -931
$$ packed form
1941a68Q92l07o40N4P51N72k723m81L475p2k941M34J840N75k032l59J131N29r30
1960d00Q09J09l81Q77j295M8J236j020j878J501K134o65l033N04L409j559k808
1977b412J617J449p23j05R35L17r86p26M93L80L03l00q70Q02K057k451k725K424
1995e21K461k681j144K439J281k015q00K077o75j774J127J391p75K65l0r32P35
2012D29O74k113j454K259K460k207j965K876M76k696n4J757m09o60O97J283j79
2029A174j001q45M29P92k11j496n28L803M3l927K31K749j219k854J785L262j792
2046C95j813K654J299l515j050K128M05l87Q3K34O74n45q27j446M11J377j16n10
2064e49J539L12k520K97J805j269r48J335J332m44q90R47J44k046O57J005j638
$$ plain form
2081 -931 -1350 1064 1069 -540 -237 798 -441 -2432 -607 1267 -538 -606 2331 1829 -346 -1021 -710 17
2099 17 -15 -245 986 1189 817 -101 -1729 -867 147 -1442 -821 2628 1050 -1344 -501 1014 -438 -2365
2117 -2365 317 2314 -287 -681 1934 884 -1764 -282 473 -856 -1486 329 1107 -231 -317 1228
2133 1228 -223 -1209 -524 -390 -255 485 830 797 930 354 -804 -947 368 366 -1366 311 2754 -617
2151 -617 -2227 380 632 -1822 -1127 1961 1692 -1231 -193 1921 -593 -1900 722 1022 -161 235
2167 235 852 220 -155 -229 -487 -1243 -383 148 -734 53 1391 -69 -900 416 264 -1071 267 1115 257
2186 257 -198 1025 1179 -1619 -623 1512 -556 -1760 854 1624 -1236 -1180 1199 630 -1631 -1103 1187
2203 1187 402 -699 668 1068 70 -429 -392 -135 626 156 -462 265 824 -343 -1709 -47 952 -1015
$$ packed form
2081i31m19K414Nj609L03J035j239j991J825J874j805o8K937n02k175o75L11P27
2099A7l2k30J231K03l72r18j628Q62J014j589O21L449j578k394Q43J515j452j927
2117b365K682J997k601l94K615j050k648J482P55j329o30J815P78j338q6J545
2133A228j451r86O85J34J35P40L45l3J33n76j158j43J315kj732J677K443l371
2151f17j610K607K52k454O95L088k69k923J038K114k514j307K622L00j183L96
2167B35O17o32l75p4k58p56Q60N31q82P87J338j460q31J316j52j335J338Q48q58
2186B57m55J223J54k798R96K135k068j204K614P70k860N6K379n69k261N28K290
2203A187p85j101J367M00r98m99L7K57P61m70o18P27N59j167j366J662R99j967
$$ plain form
2221 -1015 -1431 1587 1098 -1118 -479 1352 -204 -1482 371 1471 131 -498 1056 847 -720 -296
2237 -296 329 -145 -336 -50 159 41 -475 -137 21 -8 -234 -619 77 889 6 -507 525 734 -690 -344
2257 -344 546 441 -609 -4 809 -483 -1180 356 251 -979 -480 747 532 -556 122 740 -14 -527
2275 -527 466 633 -136 -86 499 374 -260 -725 -355 566 -57 -931 103 554 -246 -608 -245 773 7 -897
2295 -897 360 1303 -561 -670 906 609 -583 -626 526 944 -1052 -624 551 139 -709 -191 83 205
2313 205 -399 -386 861 187 -621 68 179 255 -122 -227 515 311 -270 -57 -26 -653 -230 -79 -184 -288 -338
2334 -338 190 271 -318 137 671 -66 -91 194 318 15 -347 267 828 -438 -677 454 306 -249 -655 -106
2354 -106 370 -369 -399 368 237 -307 -138 471 623 -392 -396 487 627 -560 76 367 23 -308 -104 -109 50
$$ packed form
2221a015m16L018m89k216O39J831j556j278J853J100j340o29J554k09j567M24
2237b96O25m74j91K86K09j18n16L38J58k9k26l85O96Q12q83n13J032K09j424L46
2257c44Q90j05j050O05Q13j292o97J536j05j230M99J227k15j088O78O18p54n13
2275e27R93J67p69N0N85j25o34m65L70R21o23q74J034M51q00l62L63J018p66r04
2295h97J257R43j864j09J576k97j192m3J152M18j996M28J175m12q48N18K74J22
2313B05o04J3J247o74q08O89J11P6l77j05P42k04n81K13L1o27M23J51j05j04n0
2334c38N28Q1n89M55N34p37k5K85J24l03l62O14N61j266k39J131j48n55m06N49
2354a06M76p39l0P67j31n44J69O09J52j015mQ83J40j187O36K91l44l31K04nJ59
$$ plain form
2375 50 -458 130 119 -570 -648 326 478 -349 -250 418 428 43 -189 204 -59 21 200 94 215 -533 -540 288 350
2398 350 -842 -661 157 518 -198 -374 120 536 -509 -98 827 -86 -328 349 562 55 -419 -281 41
2417 41 240 -283 -199 -431 38 453 -111 -461 206 274 -97 -129 112 182 -169 286 816 -239 -190 105 110 324
2439 324 -119 -697 -255 635 400 -741 -518 626 504 -530 107 699 102 -487 294 798 -19 -531 253
2458 253 643 -163 -275 -4 180 659 103 -1042 -528 473 106 -504 372 850 -291 -354 534 519 -839
2477 -839 -101 818 414 -449 -283 -16 -290 -200 -136 -777 15 457 -83 -604 -226 467 -560 -693 909 367
2497 367 -498 463 681 -3 -587 -144 180 -129 -11 229 10 -121 510 -103 -1028 90 498 -380 -23 431
2517 431 365 -134 186 563 -116 -691 253 235 -144 414 146 -475 -112 228 -392 -992 115 1001 -57 -420
$$ packed form
2375E0n08N88j1o89p8R74J52q27R9O68J0l85k32L93k63Q0J79j06J21p48pQ28O2
2398C50j192J81Q18L61p16j76M94M16j045M11R25r13k42O77K13n07m74J38L22
2417D1J99n23Q4k32M69M15n64l50O67O8l71l2K41P0l51M55N30j055M9K95NK14
2439C24m43n78M42Q90k35j141K23J144j22j034O37N92n97n89P81N04q17n12P84
2458B53L90q06j12K71J84M79n56j145N14J001l67o10Q76M78j141o3Q88j5j358
2477h39P38R19m04q63J66K67k74R0O4o41P92M42n40n21L78O93j027j33J602n42
2497C67q65R61K18o84n84M43L24l09J18K40k19j31O31o13r25J118M08q78L57M54
2517D31o6m99L20L77o79n75R44j8l79N58k68o21L63L40o20o00J107Q86j058l63
$$ plain form
2537 -420 340 -17 -878 -223 595 -10 -150 657 467 201 -290 -82 -393 -571 -145 15 -135 295 426 -751
2557 -751 -437 -94 -305 -279 156 512 311 -220 583 -109 -770 2 397 -188 244 313 -123 -186 -120 285 -640
2578 -640 -862 -89 341 -568 85 830 293 -139 -508 -188 -100 -247 177 875 472 216 -339 -909 14 -298
2598 -298 -638 136 935 252 -565 -231 86 -477 -946 255 1079 -169 -153 477 -134 -581 -367 36 132 -204
2618 -204 322 237 -370 -35 15 -628 -331 213 -77 -278 408 489 390 -129 9 -74 -261 255 376 -61 310 551
2640 551 -620 -672 -230 -112 -603 27 750 293 -531 394 628 -664 -613 579 446 11 260 763 292 -722
2660 -722 -199 9 -324 -240 -34 77 44 131 -518 -100 253 -393 -560 123 510 72 -418 327 251 -959 -362
2681 -362 456 -126 -511 262 554 -337 -432 346 -100 -412 -125 621 -183 -50 106 335 4 -371 117 313
$$ packed form
2537d20P60l57q61O55Q18o05j40Q07j90k66m91K08l11j78M26J60j50M30J31j177
2557g51L14L43k11K6M35L56k01n31Q03o92o61P72L95n85M32O9m36o3O6M05r25
2578f40k22P73M30r09O53P45n37m32l69L20Q8j47M24O98m03k56n55n70R23l12
2598b98l40P74P99o83q17L34L17n63m69J201Q24j248J6O30o11m47K14M03R6l36
2618b04N26q5o07L35N0o43K97N44k90k01O86Q1r9n19J38q3j87N16J21m37L71K41
2640E51j171n2M42J18m91O30P23m57q24R25K34j292N1J192j33m35K49N03m71j014
2660g22N23K08l33Q4K06J11l3Q7o49M18L53o46j67O83L87m38m90P45p6j210N97
2681c62Q18n82l85P73K92q91r5P78m46l12K87P46q04J33J56K29l31l75M88J96
$$ plain form
2701 313 95 103 70 62 196 -173 -467 82 30 -619 -304 468 -9 -300 -185 549 -92 -479 280 576 -74 -183
2723 -183 541 77 -329 7 454 -263 -275 110 141 -134 -154 34 -187 -179 -184 172 187 168 -122 88 155 -66 -382
2746 -382 230 499 -332 -355 283 199 -489 -425 256 96 -526 -339 226 340 -379 -84 339 108 -175 318 239
2767 239 140 -169 -167 249 106 -21 75 16 119 -32 -145 156 69 -92 -180 58 137 -296 254 316 -212 126 209
2790 209 -25 28 -43 396 5 -167 237 25 -177 -268 -73 -96 -144 -163 282 113 -288 -93 196 272 -43 383
2812 383 116 379 -41 -241 369 37 -223 2 16 88 -217 -263 20 -252 -329 250 157 -216 -78 258 395 72
2834 72 -100 171 215 -518 -131 135 -68 -229 -91 66 81 -70 -133 187 185 -186 -185 289 385 -162 -156 254 -12 -153
2858 -153 257 358 167 -469 -147 -107 207 -342 -227 74 -133 46 -218 -121 -32 -339 74 282 -216 -12 391
$$ packed form
2701C13k18Ql3qJ34l69k94N49n2o49L15P72m77k91J15P34o41l87P59K96o50j09
2723a83P24m64m06L36M47p17j2L85L1k75k0J88k21QnL56J5j9k90K10O7k21l16
2746c82O12K69q31k3O38q4o88O4O81j60o22J87N65J14p19K95M23k31k83M93p9
2767B39r9l09KM16j43j27R6n9J03j51j13L01q7j61q8K38P9m33N50O2n28L38Q3
2790B09k34N3p1M39l91j72M04k12k02r1J95k3m8j9M45j69m01J95K89P6l15M26
2812C83k67K63m20k00O10l32k60K25J4P2l05m6K83k72p7N79r3l73J38L36J37l23
2834G2j72K71M4p33L87K66k03j61J38J57J5j51o3L20kl71JM74R6n47OM10k66j41
2858a53M10J01j91o36L22M0L14n49J15L01k07J79k64R7Q9l07M13K08m98K04M03
$$ plain form
2879 391 -70 28 -116 -274 27 -136 -6 73 -126 189 465 73 -110 -13 223 246 -177 -103 230 108 -190 -157
2901 -157 0 113 39 -10 404 125 -234 -427 229 10 -184 34 103 -40 -218 -329 -141 -297 -292 194 -134 99
2923 99 -75 -64 51 234 -396 -80 343 -196 -136 28 108 180 -109 -343 -93 -205 219 11 132 -204 19 -196
2945 -196 120 -22 -14 -149 -55 -179 244 -193 -228 -6 83 -256 -91 -63 -100 157 -185 15 -31 10 82 196 1
2968 1 222 -94 -77 -243 -41 15 -119 81 -12 -327 91 -40 -354 154 56 116 -136 -12 131 91 118 224 -80
2991 -80 -191 -82 100 -223 -75 -7 -66 -268 125 -294 -198 -3 13 -81 74 -209 292 20 -95 304 -44 169
3013 169 143 325 -131 -51 9 296 -197 -116 62 49 -151 -205 -248 -79 -53 -191 -283 98 211 -105 -71 106 259
3036 259 -48 -305 57 -126 -6 82 148 -171 -49 -357 -393 -36 46 20 -269 202 158 -16 -320 40 -107 -114 -83
$$ packed form
2879C91m61R8j44j58L01j63J30P9j99L15K76l92j83R7K36K3m23P4L33j22k98L3
2901a57J57J13p4m9M14k79l59j93O56k19j94K18O9j43j78j11J88j56NM86l28K33
2923I9j74J1J15J83o30L16M23n39O0J64Q0P2k89k34K50j12M24k08J21l36K23k15
2945a96L16j42Qj35R4j24M23m37l5K22Q9l39J65K8l7K57l42K00m6M1P2J14j95
2968AK21l16J7j66K02N6j34K00r3l15M18j31l14N08r8O0k52J24J43m0K7J06l04
2991h0j11J09J82l23J48O8n9k02L93m19R6J95J6r4J55k83N01k72j15L99l48K13
3013A69k6J82m56Q0O0K87m93Q1J78j3k00n4m3J69K6j38r2L81J13l16L4J77J53
3036B59l07k57L62j83J20Q8O6l19J22l08l6L57Q2k6k89M71m4j74l04L60j47pL1
$$ plain form
3059 -83 291 359 -124 -137 113 -382 -141 307 -123 -108 340 118 66 273 57 7 -416 105 221 -70 191 289
3081 289 309 -121 29 15 -39 -98 -27 -23 175 -98 -138 -59 91 6 67 -240 200 56 204 98 128 -206 -30 -92
3105 -92 155 -21 -78 52 64 -184 -34 -11 -224 10 13 -36 -256 -36 49 -199 -23 161 -156 -156 0 44 170 -119
3129 -119 83 -193 -46 104 71 -105 -44 189 40 -276 -72 45 -71 -149 238 167 47 -20 266 177 -271 -6
3151 -6 212 -302 107 132 -22 320 12 28 38 -176 -275 129 107 -63 136 -262 107 187 134 -13 121 8 85
3174 85 -109 -39 -57 -277 -60 -192 47 23 155 57 81 275 -76 -196 42 -156 -189 -2 62 -110 167 -274 31
3197 31 -28 -29 -57 24 -16 -171 261 -103 -114 117 22 -157 125 145 -270 -22 81 -104 -147 -152 195 -110 -48 -36 -211
3222 -211 54 -112 263 66 6 263 -63 33 -107 57 -163 -20 135 -267 -80 -109 137 -20 -13 -171 -33 -204
$$ packed form
3059h3L74O8m83j3K50m95K41M48m30J5M48k22n2K07k16n0m23N21J16k91K61R8
3081B89K0m30J50j4n4n9P1MJ98k73m0P9J50q5O1l07M40j44J48j06L0l34J76o2
3105i2K47j76n7J30J2k48J50K3k13K34Lm9k20K20Q5k48J76J84l17%J56M4J26k89
3129a19K02k76J47J50l3j76O1K33j49l16K04J17j16p8L87p1j20o7K86q9m48K65
3151fK18n14M09K5j54L42l08J6J0k14r9M04k2j70J99l98L69Q0n3j47J34j13P7
3174H5j94P0j8k20K17j32K39k4J32r8K4J94l51j20K38j98l3J87O4j72K77m41L05
3197C1n9jk8Q1m0j55M32l64j1K31r5j79K82K0m15K48J03j85m3nL47l05O2J2j75
3222b11K65j66L75j97o0K57l26R6j40J64k20J43J55m02J87k9K46j57Pj58J38j71
$$ plain form
3244 -204 4 137 165 -77 76 171 -49 15 385 24 -235 -31 -20 -93 0 85 -206 16 -121 2 -126 353
3266 353 -47 -132 -71 -152 10 255 -13 -115 -106 62 -168 292 -5 -131 54 -158 -56 -122 -105 33 -52 -186 -21
3289 -21 -240 -91 215 237 -162 450 154 96 48 59 118 41 -234 -60 -49 -44 -273 170 -102 75 -65 93 -117
3312 -117 157 -85 -24 23 23 10 -52 83 -43 238 -274 45 139 20 144 -95 -15 273 -75 -62 95 -31 156
3335 156 25 10 -17 87 37 -26 156 106 -10 -75 -194 -285 -86 266 179 -187 -177 -118 158 -198 48 -62 14 198
3359 198 80 72 53 185 104 86 -4 -6 -294 -80 66 38 -263 -82 -61 31 266 169 42 -199 4 117 -224 -181
3383 -181 140 68 -69 -13 -61 -9 -14 217 -251 -171 206 11 236 -72 -135 -120 275 -268 -93 -153 -117 -57 -21 2 -188
3408 -188 95 131 187 -86 -68 -15 146 60 -2 181 218 -75 103 -124 31 115 -111 76 -91 208 313 6 -116
$$ packed form
3244b04K08J33K8k42J53R5k20O4L70l61k59K04J1p3R3Q5k91K22j37J23j28M79
3266C53m00q5O1q1J62K45k68j02RJ68k30M60k97j26J85k12J02o6J7J38q5j34J65
3289b1k19J49L06K2l99O12k96n8m8J1N9p7k75J74J1Nk29M43k72J77j40J58k10
3312a17K74k42O1M7%j3o2J35j26K81n12L19R4j19J24k39Q0K88l48J3J57j26J87
3335A56j31j5k7J04n0o3J82n0j16o5j19r1J99L52q7l66J0N9K76l56K46j10P6J84
3359A98j18qj9J32q1j8r0kk88K14J46k8l01J81K1R2K35r7j27k41K03J13l41M3
3383a81L21p2j37N6m8N2nK31m68Q0L77j95K25l08o3J5L95n43J75o0L6O0L6K3j90
3408a88K83L6N6k73J8N3J61q6o2J83L7k93J78k27J55Q4k26J87j67K99J05l07j22
$$ plain form
3431 -116 175 -102 -221 53 -12 61 -126 -13 98 -91 63 105 -159 -22 -18 25 -100 249 -8 103 4 7 69
3454 69 -61 -240 115 14 -320 -22 -37 -38 -89 -55 -44 15 -44 266 85 -132 56 -16 73 79 164 -153 86 16 -32
3479 -32 153 -142 83 -50 -61 -190 165 99 18 42 45 440 -11 281 -198 169 5 -112 55 195 262 -183 125
3502 125 -184 -114 -43 90 -2 250 194 28 142 59 159 -92 90 2 -5 513 -208 83 45 115 411 -223 98
3525 98 -193 7 156 93 -144 138 169 -39 148 90 211 78 192 98 -136 83 46 105 -212 -79 -75 230 95
3548 95 122 -52 -240 27 287 -37 359 44 -69 -19 -117 -19 17 85 55 122 -98 -131 -44 -180 85 66 -166 102
3572 102 99 -66 22 40 147 51 126 176 -80 -166 29 211 -97 -73 88 -43 -254 -53 234 -89 -93 59 66 -104
3596 -104 -91 138 102 -95 -62 168 -244 276 -131 -235 -13 -45 -135 9 270 229 -51 147 -128 -121 59 288 -45
$$ packed form
3431a16K91k77j19K74o5P3j87J13J11j89J54M2k64J37MM3j25L49k57J11r9LO2
3454F9j30j79L55j01l34K98j5jn1L4J1N9n9L10j81k17J88p2Q9OQ5l17K39p0m8
3479c2J85k95K25j33j1j29L55o6q1K4LL95m51K92m79L67j64j17J67J40O7m45L08
3502A25l09P0P1J33r2K52n6j66J14q3J00k51J82q8pN18p21K91l8P0K96o34L21
3525I8k91K00J49o3k37K82L1k08J87n8J21j33J14r4k34K19l7N9l17J33ML05j35
3548I5K7j74j88K67K60l24L96l15j13N0r8R8L6O8l0O7k20l3Q7j36K65j9k32K68
3572A02lj65Q8J8J07r6P5N0k56q6J95J82l08K4J61j31k11K01K87l23mJ52Pj70
3596a04J3K29l6j97L3K30m12N20m07j04K22l2r0J44K61m1k80J98k75PJ80K29l33
$$ plain form
3619 -45 -59 -141 47 -190 24 61 -174 -5 -78 -113 87 159 -9 -28 -334 -171 100 -84 213 -75 14 98 14 161
3643 161 76 54 92 61 -52 5 187 -7 -48 135 -164 -66 9 -68 -69 82 234 -90 87 159 227 -117 -283 -32
3667 -32 69 -83 -33 -90 93 -102 -200 -171 -53 -10 -38 3 -121 57 153 45 -3 35 -38 -180 47 163 65 51 288
3692 288 -238 203 333 -84 -13 76 67 -182 -22 141 -5 -17 -246 -49 -75 -47 -145 152 0 -104 -24 97 -150
3715 -150 260 131 -409 -120 145 83 194 177 -87 -158 -298 26 -211 -33 66 35 41 -166 -353 117 -48 -113 -124
3738 -124 -189 -27 -68 84 73 203 164 116 8 32 -61 -92 204 286 166 -60 25 -34 336 100 216 -80 -53 -224
3762 -224 114 -68 264 162 -117 94 -255 -45 -41 98 58 88 36 -49 -246 9 135 473 -100 41 165 -193
3784 -193 -259 192 76 -82 -225 -192 122 207 -182 -2 -14 309 34 -85 -84 47 -182 13 -135 -359 -40 -86
$$ packed form
3619d5j4q2J88k37K14L7k35J69p3l5K00P2j68j9l06J63K71j84K97k88Q9Q4q4J47
3643A61q5k2L8l1j13N7J82j94m1J83k99R8P5p7jJ51J52l24J77P2O8l44j66K51
3667c2J01j52N0n7J83j95r8K9J18M3k8M1j24J78R6j08m8L8p3j42K27J16r8j4K37
3692B88n26M41J30m17P1Q9rk49J60J63j46j2k29J97k6K8r8K97j52j04Q0J21k47
3715a50M10j29n40K89K65o2J11j7k64p1j40L24k37J78R9l1Ok07j87M70j65o5j1
3738a24o5J62m1J52j1J30l9m8j08K4r3l1K96Q2j20k26Q5n9L70k36J16k96K7j71
3762b24L38j82L32j02k79K11l49K10MJ39m0L0n2q5j97K55J26L38n73J41J24l58
3784a93o6M51j16j58j43L3L14Q5l89J80j2L23k75j19JJ31k29J95j48k24L19m6
$$ plain form
3806 -86 -113 -43 -48 165 -82 77 -22 37 -151 -28 95 375 -109 -70 150 -216 49 -28 244 -96 -323 -200 183
3829 183 -241 24 -16 237 46 -285 15 37 32 -5 -84 -3 87 -66 121 254 -116 -259 236 84 -172 -70 129
3852 129 -221 93 51 236 48 -107 87 23 24 -74 88 67 -41 24 23 -39 120 -225 158 -124 -231 -54 185
3875 185 -130 89 62 116 -198 213 -151 -126 -79 -84 -118 -118 -94 251 -31 92 90 -17 76 -38 17 114 122 60 72 -293
3901 -293 -219 -34 79 149 31 -147 -16 223 -130 -191 26 158 -1 332 -121 132 66 138 174 -178 53 112
3923 112 337 -291 169 160 75 -113 379 36 -25 22 267 50 -131 -149 229 -114 -18 58 -7 -120 214 -57 -46
3946 -46 -146 -267 -48 47 -174 164 5 41 147 22 20 -39 -72 -113 112 -28 -261 -67 2 -218 -213 32 -57 -53 -63
3971 -63 141 39 -87 -161 -33 217 -59 189 -119 85 310 385 -2 37 38 -138 -175 184 221 0 166 -49 -129
$$ packed form
3806h6k7P0nK13k47J59r9N9j88J23J23K80m84L9K20l66K65p7K72l40k27J23L83
3829A83m24K65m0K53j91l31L00K2nl7p9Q1R0j53J87J33l70j43M95j52k56J02J99
3852A29l50L14m2J85j88j55J94o4Jr8J62k1j08O5jo2J59l45L83k82j07J77K39
3875A85l15K19k7N4l14M11l64K5M7nl4%K4L45k82J23kj07R3j14N5R7Qo2J2l65
3901b93P4J85J13P0j18j78J31K39l53o1K17J32j59L33m53K53o6P2L6l52K31N9
3923A12K25o28M60rq5j88M92l43o1M7K45k17j81j8L78l43R6P6o5j13L34k71J1
3946d6j00j21K19R5k21L38j59L6J06j25kn9l3m1K25j40k33J94O9k20NK45q9Mj0
3971f3K04j02j26p4J28K50k76K48l08K04K25P5l87L9Jj76l7L59L7k21J66k15q0
$$ plain form
3994 -129 8 -333 218 -367 -17 221 -301 -33 -16 134 309 157 -53 -88 -119 -14 -185 101 -312 186 -140
4015 -140 -110 -25 360 228 -65 -164 2 -231 58 175 30 -273 111 -243 32 -113 -4 -14 -53 167 -154 138
4037 138 1 -79 115 -135 18 58 63 200 265 -104 -249 164 -136 -41 45 -217 -14 -197 -40 -190 -239 4 -231
4060 -231 -152 155 -131 -49 -66 -24 12 -156 45 -94 128 0 116 125 10 -49 93 71 70 -144 54 22 104 -41
4084 -41 -186 -279 328 -351 -90 -99 255 35 261 149 81 -153 -133 15 8 -25 159 -103 104 -202 -59 -134 -21
4107 -21 -134 -9 115 216 291 23 -83 184 225 -256 -87 106 -6 -164 188 76 -132 -66 -252 -179 -213 162
4129 162 61 49 -76 18 -200 -276 24 171 170 35 248 -98 -147 17 -49 -143 63 43 -48 -238 -113 -266 -236 25
4153 25 -72 336 212 189 72 -143 4 183 28 -193 144 3 -106 21 -116 -156 -232 -95 70 -343 87 252
$$ packed form
3994a29J37l41N51n85L50K38n22K68J7J50J75j52k10l5l1J05j71K86m13M98l26
4015a40L0Q5L85j32k93r9J66k33K89J17j45l03L84l54K75j45J09j0l9K20l21K92
4037A38j37q0J94k50J53M0NJ37O5l69j45M13l00R5Q6k62K03j83J57j50m9K43k35
4060b31P9L07k86Q2j7M2L6j68K01j39K22j28J16Rj15n9J42k2jk14J98l2Q2j45
4084d1j45r3O07o79K61rL54k20K26j12o8k34K0J48pl3J84k62K07l06J43p5J13
4107b1j13J25J24J01P5k68j06K67M1m81J69J93j12j58L52j12k08O6j86P3l4L75
4129A62j01j2j25R4k18p6L00J47jj35K13l46m9J64o6r4K06k0r1j90J25j53L0K61
4153B5r7M08j24k3j17k15J47J79j55k21L37j41j09J27j37m0p6J37J65m13M30J65
$$ plain form
4175 252 -58 224 184 -18 70 -41 -106 252 -139 -87 388 62 -21 230 -245 85 -240 -135 151 -28 153 192
4197 192 -63 -42 -74 -110 -26 102 -198 -113 -195 80 157 -40 -88 -203 157 -354 119 -102 4 -269 -335 -74 24
4220 24 -214 -96 66 -193 91 -122 158 220 -24 -42 437 233 109 172 152 -92 -342 -85 283 -95 -20 119
4242 119 -359 -141 55 -153 -84 -121 112 136 287 156 -164 -13 124 284 -21 -124 134 53 -149 -141 -59 161
4264 161 -48 16 -283 -31 -129 126 97 -63 203 -6 -262 42 140 230 -48 169 -204 -315 -158 -253 96 -178
4286 -178 -24 138 9 -73 8 66 295 182 142 351 161 -220 -35 20 144 130 1 -118 39 21 1 2 -150
4309 -150 -88 -142 -242 67 29 233 5 -62 64 252 34 -8 -145 -17 -98 -174 -106 -88 -129 -16 -64 25 -6 -49 -43
4334 -43 198 55 -92 -63 90 5 72 114 106 -35 194 150 -113 31 -61 102 -28 -124 51 -121 -163 -110 -4 66
$$ packed form
4175B52l10K82m0k02Q8j11o5L58l91N2M75l26q3K51m75L30l25J05K86j79J81L9
4197A92k55K1l2l6Q4J28l00Q5q2K75P7j97m8j15L60n11M73k21J06k73o6K61R8
4220B4k38J18J62k59K84k13K80O2k44j8M79k04j24O3k0k44k50K57L68l78P5J39
4242A19m78K18J96k08O9l7K33K4J51j31l20J51J37J60l05j03K58q1k02QQ2K20
4264A61k09O4k99K52r8K55k9j60K66k09k56L04R8R0k78K17l73j11J57r5L49k74
4286a78J54J62j29q2Q1N8K29j13m0K09j90l81J85N5J24j4j29j19J57j8k0Jj52
4309a50O2n4j00L09l8K04k28o7J26J88k18m2j37J28q1p6O8J8m1J13m8Q9l1m3O
4334d3K41j43j47K9J53q5O7M2qj41K29m4k63J44r2J63j30r6J75j72m2N3J06P0
$$ plain form
4358 66 -195 385 116 -73 99 -165 133 -151 93 -108 104 78 -80 -123 42 -81 -211 111 -166 32 -118
4379 -118 -134 344 229 -11 307 122 78 -29 -371 11 -160 -218 -53 -69 -96 199 24 32 6 148 -123 -191 125
4402 125 271 129 -71 289 113 55 105 63 104 -166 -80 -123 310 -207 -4 -92 -100 174 -32 88 -138 277 132
4425 132 56 267 8 -77 2 243 -29 237 173 -101 -100 68 -285 56 220 -408 -61 176 191 -48 -2 62 33
4448 33 -147 -21 -54 88 72 -100 -129 256 -67 -169 411 -44 -87 18 90 -105 -335 -40 -16 97 -108 145
4470 145 63 -227 -28 -153 138 87 -4 152 301 12 -3 -71 -148 -197 -302 -70 265 -232 178 -97 69 -40
4492 -40 39 130 39 273 92 483 51 191 -21 -124 9 5 -116 -167 -194 177 172 -139 -55 292 -11 36 92 161 -190
4517 -190 -8 -132 50 133 89 -240 168 89 -44 -165 -286 190 -66 -277 -2 245 -160 220 98 -40 -274
$$ packed form
4358F6k61N80k69j89J72k64K98k84K44k01K12k6j58m3J65j23j30L22k77J98j50
4379a18j6M78j15k40L18j85m4j07l42L82j71n8J65j6k7K95j75Qk6J42k71o8L16
4402A25J46j42k00L60j76n8N0m2M1k70Q6m3M33n17K03q8qK74k06J20k26M15j45
4425A32p6K11k59q5P9K41k72K66o4k74JJ68l53L41J64o28L47K37J5k39M6O4k9
4448C3j80J26l3J42j6j72k9L85l23j02N80m55m3J05P2j95k30K95K4J13k05K53
4470A45q2k90J99j25K91n1r1J56J49k89j5o8p7m9j05K32L35m97M10k75J66j09
4492d0P9R1r1K34j81L91m32J40k12j03J33mj21n1k7L71nl11Q4L47l03M7N6O9l51
4517a90J82j24J82Q3m4l29M08p9j33j21j21M76k56k11K75K47m05L80j22j38k34
$$ plain form
4538 -274 -22 255 -211 -136 159 68 76 288 24 -79 83 -67 194 17 -57 113 -137 -89 -113 -51 -157 7 81
4561 81 72 -73 256 -50 -63 84 120 50 137 -195 -119 28 -20 217 -203 62 236 -228 -145 368 282 21 52 -33
4585 -33 -331 78 192 -44 -223 -51 155 -333 159 144 31 -94 -9 79 52 -167 107 294 -307 -53 110 -230
4607 -230 -158 187 122 -98 -222 254 -80 -104 169 -40 -237 65 210 -531 36 -28 40 60 -27 329 -1 -17 217
4630 217 30 14 -72 11 -272 -7 328 106 -248 -112 -111 -16 -252 185 183 27 119 161 -120 118 171 -30 195 356
4654 356 379 100 -40 166 25 99 5 -264 -293 -137 -87 -44 61 -8 -20 10 -35 295 188 96 462 -91 -368 157
4678 157 72 9 -81 263 380 -80 -44 -196 -279 -172 149 70 -36 -4 96 -86 -79 -152 -126 42 127 -7 99 26
4702 26 212 131 -55 -62 -106 -221 -129 211 -23 -42 -170 -77 318 -188 -285 182 46 310 42 183 33 19 -224
$$ packed form
4538b74K52K77m66P5K95r1QK12k64j03J62j50K61j77p4J70k50M8k4O2j06J64P4
4561H1rj45L29l06j3J47L6p0Q7l32P6J47m8K37m20K65J74m64Q3N13q6k61L1q5
4585c3k98M09J14k36j79J72K06m88M92j5j13j25Q5Q8k7k19K74J87o01K54J63l40
4607b30P2L45o5k20j24M76l34k4K73k09j97L02J45p41N67o4O8K0q7L56l30j6K34
4630B17j87j6q6Q3k83K65L35k22l54J36JR5k36M37kj56R2M2k81K38N3k01K25J61
4654C56K3k79j40K06j41P4r4k69k9J56N0M3J05o9j2L0m5L30j07r2L66n53k77N25
4678A57q5o3r0L44J17m60L6j52q3J07L21p9j06L2J00j82Pp3K6J68Q5j34J06p3
4702B6J86q1j86pm4j15R2L40k34j9j28R3L95n06r7M67j36K64k68J41j50j4k43
$$ plain form
4725 -224 -310 -2 101 -178 -91 316 -1 78 -237 -26 -367 -55 -30 276 131 55 184 11 -116 -212 95 -89
4747 -89 14 299 -273 -28 6 -146 -200 176 266 70 90 85 381 -28 -101 -178 157 290 -151 109 -89 1 21 154
4771 154 186 -103 -5 136 135 233 -106 -204 -23 -323 -45 -184 -112 118 109 122 22 59 99 152 -54 -177 -32 33 -256
4796 -256 221 -3 128 -119 -29 18 -121 199 -37 -241 -159 62 39 -170 -52 30 91 -19 39 22 109 172 -44
4819 -44 -187 27 17 106 179 215 -92 -204 -20 -249 190 105 -40 -162 -192 -130 77 -137 77 -109 -35 5 50 -216
4843 -216 -37 85 -53 -6 -19 95 196 230 241 -66 -99 149 -79 -205 -234 35 21 148 -18 -179 27 29 -97
4866 -97 99 52 -94 135 -29 20 -107 128 59 100 147 16 -305 -51 -206 226 70 13 -162 -33 -151 -256
4888 -256 -125 -236 -352 58 -223 148 -47 -157 265 71 216 -265 180 -148 319 -99 81 -26 377 67
$$ packed form
4725b24q6L08J03k79Q7M07l17P9l15K11l41L12K5L06j45p6J29j73j27r6L07j84
4747h9J03K85n72K45L4j52n4L76R0j96K0nK96m09p3p7L35J33m41K60j98R0K0J33
4771A54L2k89R8J41jR8l39r8J81l00K78j39P2K30rJ3j00L7M0N3k06j23J45O5k89
4796b56M77k24J31k47R0M7j39L20k36k04Q2K21k3k09J18Q2O1j10N8j7Q7O3k16
4819d4j43K14j0Q9P3L6l07j12J84k29M39q5j45j22l0O2K07k14K14j86P4M0M5k66
4843b16J79J22j38M7j3J14J01L4J1l07l3K48k28j26k9K69j4J27j66j61K06Kj26
4866i7J96m7j46K29j64M9j27K35o9M1M7j31l21K54j55M32j56n7j75J29j18j05
4888b56J31j11j16M10k81L71j95j10M22j94J45m81M45l28M67m18J80j07M03l10
$$ plain form
4908 67 70 261 142 -67 -136 47 66 -58 2 145 125 173 -24 -39 162 -127 248 178 -71 -317 96 39 -226 -17
4932 -17 338 28 -293 -143 -47 -35 54 -119 25 -143 195 -220 142 122 224 204 -179 -62 62 119 -162 49
4954 49 -105 80 27 226 337 -63 -133 -6 -191 -304 -178 18 186 329 -89 33 22 96 -3 -163 172 -30
4976 -30 -131 60 -105 -108 85 -91 -169 -34 -57 -196 255 -123 28 304 -19 258 -24 41 3 -147 -69 -47 -249
4999 -249 -129 65 -176 -230 49 -138 -56 -140 -126 117 -201 -39 61 240 -143 -20 21 -142 -84 -74 -65 30 -43 4
5023 4 -269 56 -173 4 313 -50 -64 27 60 27 -237 -223 14 58 -191 -6 215 248 -159 45 310 -17 -22 -113
5047 -113 -240 -12 -50 24 165 -137 28 -70 140 81 -117 -36 27 87 134 42 29 -233 -36 -61 64 -129 -141 -83
5071 -83 -155 -68 -110 188 -60 -124 174 17 -364 21 -51 -66 -98 -52 45 -47 176 50 -169 45 -41 134 12 253
$$ packed form
4908F7LJ91j19k09o9J83J9j24O0J43k0M8j97j5K01k89L75p0k49k46M13n7k65K09
4932a7L55l10l21J50R6J2Q9j73J44j68L38m15L62k0J02k0l83J17J24N7k81K11
4954D9j54J85n3J99J11m00p0J27j85j13J26J96J68J43m18J22j1P4r9j60L35k02
4976c0j01J91j65lJ93j76p8J35k3j39M51l78J51K76l23K77k82O5l8j50P8K2k02
4999b49J20J94k41n4K79j87Q2q4J4K43l18J62J00J79l83J23M1j63N8J0RR5p3M7
5023Dk73L25k29J77L09l63j4R1L3l3k64J4K37M4k49J85K21L3m07K04K65l27nr1
5047a13j27K28l8P4J41l02J65r8K10n9j98Q1O3O0M7r2j3k62J97k5J25j93j2N8
5071h3p2Q7m2K98k48o4K98j57l81L85p2j5l2M6R7r2K23j26k19K14q6J75j22K41
$$ plain form
5095 253 338 -138 26 176 -116 -107 178 2 47 -129 19 -163 -22 283 -130 -455 -114 -108 -70 -199 127 339
5117 339 -34 53 212 199 84 140 100 -93 -182 5 -26 -243 -50 116 -62 -149 97 -14 -198 236 252 -55 -49
5140 -49 -31 -214 -73 -37 236 -42 -258 175 -200 104 115 44 89 71 63 71 -167 72 -69 -184 -253 273 -149 -157 55
5165 55 82 -148 -100 -105 -157 297 -107 107 89 24 -409 -147 -134 192 90 49 71 51 65 -211 -88 50 -208 -67
5189 -67 -11 136 -51 155 63 227 -127 -275 67 12 -113 -26 -59 -192 43 -150 -36 -92 76 -332 94 149 -199
5212 -199 74 -75 20 225 153 176 -70 -145 -37 -20 -44 51 -213 17 -97 111 206 -308 119 -103 -189 152 285
5235 285 -8 103 97 56 -8 -141 -4 165 157 -3 -28 440 196 37 94 176 244 211 -174 -160 226 -81 -1 -209
5259 -209 99 36 -187 84 -56 -139 -370 79 -132 -334 91 65 -128 51 -65 28 217 166 201 -7 -339 97
$$ packed form
5095B53Q5m76J64J50k92RK85j76M5j76J48j82J41L05m13l25L41OL8j29L26K12
5117C39l73Q7J59j3j15N6m0j93q9J87l1k17J93J66j78q7K46j11j84M34J6l07O
5140d9J8j83J41L6K73k78k16M33l75L04J1p1M5j8qQk38K39j41j15o9N26m22qK12
5165E5K7k30M8nn2M54m04K14j8o5m33K62J3L26j02m1K2k0J4k76J23J38k58J41
5189f7N6J47j87K06r2J64l54j48L42n5j25Q7l3j33K35j93J14n6J68m08M26N5l48
5212a99K73j49R5K05p2K3k46p5J08J7k4R5k64K30j14K08R5n14M27k22q6L41J33
5235B85k93J11om1o4j33J37J69qj60k5M68k44j59N7Q2O8l3l85J4L86l07Q0k08
5259b09L08o3k23K71j40q3k31M49k11k02M25k6j93J79j16R3J89n1L5k08l32M36
$$ plain form
5281 97 13 -277 359 121 163 -59 91 -285 72 344 3 182 93 38 76 -150 -319 143 73 -53 126 -55
5303 -55 -91 -43 -105 78 99 147 80 5 -72 -208 -81 233 -44 103 -243 29 66 -97 158 88 194 -74 -201 221
5327 221 224 -44 156 -108 -156 -174 7 -222 -53 1 338 -116 9 152 -132 214 236 67 -167 33 194 -54
5349 -54 138 103 141 -240 168 -80 63 -120 -216 -1 78 58 45 -98 -68 61 -114 70 -129 -84 169 -148 21
5372 21 -58 95 139 -212 -12 -172 -352 -82 54 42 12 20 -83 -75 199 -154 12 4 -376 -120 -53 74 -24 -173
5396 -173 -86 -43 88 82 -35 -92 -102 294 -83 26 25 36 84 106 143 -112 170 129 -79 111 -141 39 132 -113 164
5421 164 -168 26 202 -3 -298 90 140 107 -29 128 144 65 52 363 449 171 163 -38 194 58 43 -214 -11
5444 -11 -181 -127 101 -6 -57 -124 111 90 54 -123 -62 122 -11 -178 -141 156 -30 -48 92 -54 13 -136 -41 180
$$ packed form
5281I7q4k90O36k38M2k22J50l76L57K72l41J79q9n5L8k26j69M62p0j26J79j81
5303e5l6M8o2J83K1M8o7p5p7j36J27L14k77J47l46K72L7j63K55p0J06k68j27M22
5327B21Lk68K00k64m8j8J81k29J69N4L37m54J25J43k84L46K2j69k34K00J61k48
5349e4J92l5L8l81M08k48J43j83r6K15P9k0j3j43L0J29j75J84j99M5K53l17J69
5372B1p9J53M4l51K00j60j80K70J36j2l0Qj03QK74l53J66ql80K56O7J27r8j49
5396a73Q7M3J31oj17n7j0L96l77J09jJ1M8K2L7k55K82m1k08J90k52J80R3k45K77
5421A64l32J94J76k05k95L88N0l3j36J57J6p9j3L11Q6k78qk01K32j36j5k57K03
5444a1j70N4K28j07n1o7K35k1l6j77O1J84j33j67L7K97j86j8J40j46O7j49R5K21
$$ plain form
5468 180 -21 112 131 -226 -38 -196 21 157 -210 -146 64 -211 0 -119 -70 34 191 28 -131 218 134
5489 134 61 -39 -11 -103 118 -22 67 -132 74 -97 -341 29 101 139 48 109 -178 -42 471 -164 -75 -217 -67
5512 -67 -36 53 76 -96 -318 -246 -103 92 -123 435 298 58 -131 -223 -171 -147 26 36 62 187 -181 -92 -119 148
5536 148 -102 -71 263 31 8 -165 -69 -26 50 -14 -95 -134 -28 263 154 -181 -272 229 -128 -114 18 -148 -194 285
5560 285 -78 -49 -304 159 -60 87 13 26 -134 -127 -6 92 -68 -72 -114 6 -105 265 -45 -91 60 -100 -5 71
5584 71 154 -257 10 48 132 -54 7 -64 13 -191 166 144 51 199 162 -174 29 -119 274 -78 4 -37 -226 9
5608 9 -33 -96 -356 37 -15 -182 27 237 98 -67 -88 208 128 108 78 -332 152 -203 116 -218 -11 50 14 196
5632 196 -158 -58 2 64 -211 -228 134 105 134 -91 -164 127 -84 200 77 122 0 -166 -41 -134 28 216 122
$$ packed form
5468A80k01J33J9l57J88j58K17J36l67O4K10k75K11j19M9J04J57j63j59L49q4
5489A34p3j00K8r2K21j40Q9j99K06j71k44L70P2L8r1O1k87J36N13o35Q9j42J50
5512f7L1Q9K3j72k22P2J43J95k15N58j37k40j89r2N2K4J73J0K6J25l68Q9k7K67
5536A48k50L1L34k32k3j73R6M3P6o4q1l9J06K91j09l35r1N01l57J4J32j66m6M79
5560B85l63K9k55M63k19J47p4J3j60PJ21R8j60mm2J20j11L70l10m6J51j60R5P6
5584G1Q3m11K67L8Q4j86O1p1P7k04L57k2r3J48l7l36K03j48L93l52Q2m1j89K35
5608Im2o3k60L93n2j67K09K10j39j65k1K96q0k0l0m10M84l55L19l34K07O1l6J82
5632A96l54J00O0O2k75j7L62k9K9k25p3K91k11K84j23M5j22j66J25r3J62J88r4
$$ plain form
5655 122 -234 -41 -2 56 -16 -2 83 -209 -82 -65 44 57 -29 47 134 -51 187 -94 -135 -47 -218 -180 -276 237 -250
5680 -250 -146 142 23 -201 71 34 175 85 -154 -77 157 87 -196 41 80 -37 -44 -94 271 257 -274 -85 -25
5703 -25 189 12 95 382 108 -48 73 -51 174 -109 -12 -135 -169 115 -96 -181 13 -208 72 156 62 145 -40
5726 -40 -60 -46 126 -217 45 52 -23 -9 -131 71 -173 208 23 -261 70 -229 123 56 -173 191 252 106 -37
5749 -37 362 -117 -214 52 214 -51 30 276 -161 -143 -236 7 50 132 -64 74 -49 39 -126 -8 -50 -34 102
5772 102 -8 -109 52 -158 188 26 19 39 124 -61 -80 110 -34 199 190 -5 215 -232 96 232 135 99 187
5795 187 163 102 79 131 -137 -14 -122 24 -17 -79 -183 -133 80 -138 -52 11 -39 -168 280 172 123 -391 191 155
5819 155 5 -236 57 278 46 -39 -279 21 -63 20 65 -42 151 124 -153 -247 87 94 -157 207 -25 106 183
$$ packed form
5655A22l56J93L9N8p2J4Q5k92J27J7J09J3q6P6Q7j85K38k81m1Q8j71L8r6N13m87
5680b50J04K88j19k24K72l7J41r0k39P7K34p0k83K37L9j17pn0L65j4n31J89O0
5703b5K14j77Q3K87k74j56J21j24K25k83R7j23l4K84k11q5J94k21K80Q4r4Q3j85
5726d0k0J4J72l43K62Pp5J4j22K02k44L81j85k84L31k99L52o7k29L64O1j46j43
5749c7L99m79r7K66J62k65Q1K46m37J8r3K43M3Q2j96J38j23Q8j65J18m2J6J36
5772A02j10j01J61k10L46j62pK0Q5j85j9J90j44K33rj95K20m47L28J36r7l6Q8
5795A87k4o1k3N2k68J23j08J46m1o2j04N0K13k18Q6O3n0j29M48j08m9n14N82l6
5819A55j50k41K93K21k32q5k40L00q4Q3M5j07J93k7k77r4L34Pk51L64k32J31P7
$$ plain form
5842 183 -45 -111 -129 109 32 51 37 -344 51 -100 208 -13 -207 -268 -84 -100 10 136 -112 23 184 79
5864 79 -26 -98 167 -339 -11 -138 -9 -248 -28 -217 1 -155 -43 -110 -257 154 200 -170 11 -43 179 -182
5886 -182 157 -51 -95 -29 128 157 192 -217 -84 27 -25 99 62 -209 92 -47 -73 -51 -209 62 -24 213 19
5909 19 39 -98 51 16 110 -41 -164 -100 -133 -34 -200 -350 95 -72 -223 216 297 -97 -202 -11 32 123 -27
5932 -27 171 -16 212 150 19 -47 -303 73 -74 -171 42 40 -100 69 55 119 362 -6 73 -14 22 -60 -13 -26 14
5957 14 159 91 -122 85 17 -48 55 -34 28 -50 -172 42 90 -82 -64 -168 38 246 -9 -15 -116 -20 35 -290
5981 -290 88 178 42 77 -32 -187 314 -252 -33 -188 330 21 82 -10 75 187 -102 58 -189 -243 137 5
6003 5 -89 -156 -76 -48 -48 -23 -184 -68 -113 163 -161 -29 16 -109 -66 195 143 72 239 95 176 74 109 69 6 -79
$$ packed form
5842A83k28o6j8K38p7J9j4l81L95j51L08k21j94o1J84j6J10J26k48J35J61j05
5864G9j05p2K65n06L28j27J29k39K20j89K18j56J12o7j47M11M6l70J81n4K22l61
5886a82L39k08m4O6J57K9L5m09J33J11n2J24l7k71L01j39k6K2j58K71q6K37j94
5909A9K0j37J49l5R4j51j23O4l3R9j66j50M45j67j51M39Q1l94j05J91M3R1j50
5932b7J98j87K28o2j31o6k56L76j47r7K13kj40J69j4O4K43l68P9q7L6q2M7j3M0
5957A4J45o8k13K07o8o5J03q9O2p8j22K14M8j72J8j04K06K08k55oj01R6N5l25
5981b90L78R0j36L5j09j55N01n66K19j55N18l09O1r2Q5J12k89J60k47n4L80j32
6003Er4o7Q0K8%K5j61J16m5K76l24J32M5j25M3K61n2p1J67j44Q1j02L5m0o3q5
$$ plain form
6029 -79 -8 349 -137 65 -90 124 -251 126 183 222 -13 83 248 -88 153 -66 220 38 82 1 259 204 49
6052 49 -51 -28 -33 70 -76 -61 -72 -203 0 178 146 160 -305 13 -159 103 -106 -106 -78 -75 -191 -35 -92 -31 -1
6077 -1 -48 31 -140 125 198 -185 -27 64 -89 -62 -106 249 -166 158 275 -158 -70 -11 -141 -199 115 -50 35 23
6101 23 17 73 165 -17 -9 340 44 107 49 236 102 115 1 -44 308 -154 40 -152 -23 -52 121 248 -171 194
6125 194 172 -52 72 -144 -16 155 160 71 57 44 -82 154 -116 -192 -229 30 -400 98 128 -98 19 -54 -109 37
6149 37 -97 -54 -18 67 24 -149 -1 137 81 -223 84 163 -13 126 -219 -130 -142 18 8 -270 103 232 207 -18
6173 -18 36 272 -34 69 36 -327 -63 61 -132 247 165 -111 324 -108 -104 101 -307 -14 163 124 90 79 76 192
6197 192 200 -45 309 91 33 42 68 -87 -109 104 -33 7 -116 28 -114 184 71 101 -89 -56 -138 118 -229 -36
$$ packed form
6029g9P1L57m86K02j55K14l75L77N7L9k35R6J65l36K41k19K86j82M4q1K58n5j55
6052D9j00K3nJ03j46J5j1j31K03J78l2J4m65L18j72K62k09%K8Lj16J56n7O1L0
6077am7P9j71K65P3l83J58R1j53K7m4L55m15L24J17m33Q8N9j30n8L14j65Q5j2
6101B3oN6R2j82QL49k96O3n8J87j34J3j14m5L52m62J94j92J29k9J73J27m19L65
6125A94k2k24J24k16J28J71Nq9j4j3j26K36k70p6l7K59m30M98L0k26J17p3n5J46
6149C7j34M3L6Q5m3j73J48J38n6l04L07P9j76J39l45Q9j2J60j0k78L73J29k5k25
6173a8N4K36l06J03l3l63K64J24j93L79q2k76M35m32MK05m08K93J77l9l4j1lJ16
6197A92Qk45L54k18n8RK6j55k2K13j37M0j23J44j42K98j13L0j90L3q2K56l47J93
$$ plain form
6221 -36 -63 -57 123 -183 -57 -5 145 5 -197 6 -35 145 -174 -178 222 192 166 -296 -14 -122 -188 -127 221 34
6245 34 106 62 -76 39 154 230 303 -38 177 -61 -79 40 49 44 103 4 -53 -99 233 -71 -31 137 40 105 -48 57
6271 57 -100 42 -3 71 -2 38 71 -79 -53 -166 -238 66 42 112 -165 -17 30 118 -53 51 208 49 -71 -35
6295 -35 207 -61 -13 130 -126 154 43 118 190 -385 -209 130 77 -108 -17 -51 -205 136 35 61 -155 -45 -140
6318 -140 70 86 122 -134 232 -2 166 50 -91 -14 -242 89 163 173 -91 -26 -116 192 -38 142 -50 82
6340 82 -2 177 -62 -12 -80 1 3 94 124 -95 -66 160 59 64 -103 180 262 18 267 41 57 86 -61 -92 230
6365 230 215 82 -109 -26 -83 -77 -79 -89 -86 258 -71 181 86 12 32 -64 -246 139 -305 105 2 -187 -231 -297 -52
6390 -52 71 -338 -116 133 -308 138 43 -74 378 132 4 -99 -284 -52 -189 8 -7 -387 -89 35 -199
$$ packed form
6221c6k7OJ80l06J26N2J50j40k02K03m1J80l19mM00l0k6m62K82j08o6O1L48j87
6245C4P2m4j38J15J15P6P3l41K15k38j8J19RnN9r9n7m6L32l04M0J68r7O5j53J05
6271E7j57J42m5P4p3M0L3j50K6j13p2L04k4P0k77J48M7Q8j71J04J57j59j20L6
6295c5K42k68M8J43k56K80j11P5P2n75J76L39n3j85R1l4j54L41j01K6k16J10r5
6318a40K10J6L6k56L66k34J68j16j41P7k28L31P4J0k64O5r0L08k30J80j92J32
6340H2q4J79k39N0o8Q1KR1L0k19K9K26j01Nj67K83Q2k44K49k26J6K9j47l1L22
6365B30j5j33j91Q3n7Okj0LL44l29K52r5p4K0r6j82L85m44M10j03j89m4o6K45
6390e2J23m09K22K49m41M46r5j17M52k46j28j03j85K32j37J97j5l80K98J24k34
$$ plain form
6411 -199 166 223 -72 186 33 -309 -82 153 92 39 -69 37 60 -151 -133 -159 331 94 -26 -238 15 -153
6433 -153 -77 139 25 285 -99 152 -67 99 -121 -101 -193 311 3 248 101 -43 64 35 -61 132 -242 226
6455 226 85 -112 11 23 54 67 -235 -79 217 -61 201 78 -177 -76 -86 184 157 -134 -55 -165 -10 202
6477 202 33 -33 72 -118 177 -162 195 37 -264 -31 -206 61 93 -134 -174 -141 139 -77 215 -60 -119 -3
6499 -3 -44 -48 -48 39 -97 55 137 -33 111 85 -33 -151 191 -18 119 -145 204 -140 50 -292 120 50 -72 -65
6523 -65 -101 43 106 85 310 -125 -15 242 130 153 -116 -147 113 17 -256 151 103 204 87 -129 104 37 -43
6546 -43 -160 -41 96 259 -88 -160 -190 -45 -118 -19 175 -93 -116 -14 253 -27 44 -55 75 66 -200 55 -49
6569 -49 -83 100 159 -279 -17 -123 -53 -51 -189 121 109 -124 -58 238 -291 34 46 -120 39 -113 -140 165 30
$$ packed form
6411a99L65N7k95K58j53l42K27K35o1n3j08J06K3k11J8k6M90k37j20k12K53j68
6433a53P6K16j14K60l84K51k19J66k20K0r2N04l08K45j47j44J07k9r6J93l74M68
6455B26j41j97J23J2L1J3l02J56K96k78K62j23k55J01j0K70k7k91P9j10J55K12
6477B02j69o6J05j90K95l39L57j58l01K33j75K67L2k27m0L3K80k16K92k75n9J16
6499cm1m%Q7j36J52Q2j70J44k6j18j18L42k09J37k64L49l44J90l42M12p0j22P
6523f5l6J44O3k1K25m35J10K57j12K3k69l1K60r6k73M07m8J01j17k16K33o7q0
6546d3j17J19J37J63l47p2l0J45p3R9J94k68k3J02K67k80P1r9J30rk66K55j04
6569d9l4J83N9m38K62j06P0Kj38L10j2k33O6K96n29L25J2j66J59j52k7L05j35
$$ plain form
6592 30 217 -75 126 -76 -56 256 185 -75 85 268 -69 -43 28 -180 -97 -12 -246 49 -359 103 118 183 -12
6615 -12 -336 -47 343 -21 -217 191 263 36 336 192 38 157 -2 -41 -86 292 -88 -141 -171 80 117 206 19
6638 19 -86 413 -40 -239 -282 6 -174 42 -207 29 6 -163 127 -5 149 -42 203 96 -72 192 -129
6659 -129 -200 44 -120 36 107 47 77 -83 103 -28 -57 186 -32 31 229 -112 -179 -102 -69 38 75 -38 -96 83
6683 83 151 -179 -79 196 -184 32 -116 107 -110 57 122 -192 -140 -30 -227 -148 -163 114 109 -80 -87 14 -132
6706 -132 -1 -89 -177 -83 177 -70 -401 49 -20 -150 -236 55 -140 -191 -303 -255 162 130 -81 -61 201 -93 -23
6729 -23 123 6 -199 64 -120 60 152 29 221 -7 -118 -122 -186 -45 -50 -233 -196 -137 8 -249 -137 -129 -220 -197
6753 -197 74 -88 18 19 272 -137 -60 126 10 52 -132 38 -284 -28 -5 -108 49 -101 44 -210 -65 -45
$$ packed form
6592C0J87k92K01k02K0L12p1k60J60J83l37K6P1k08Q3Q5k34K95m08M62J5O5j95
6615a2l24K89L90l64j96M08P2k27L00j44j54J19j59l9m5L78l80n3l0K51L7Q9j87
6638A9j05M99m53j99m3K88j80K16k49K36k3j69K90j32J54j91K45j07j68K64l21
6659a29p1K44j64J56P1o0L0j60J86j31k9K43k18O3J98l41o7P7L3J07L7j13n8J79
6683H3O8l30J00K75l80K16j48K23k17J67O5l14N2J10j97P9j5K77nj89pJ01j46
6706a32J31q8q8R4K60k47l31M50o9j30q6K91j95n1j12M8M17l2k11K0K62k94P0
6729b3J46j17k05K63j84J80R2j23J92k28j11mo4J41nj83L7N9J45k57J12Qr1K3
6753a97K71j62J06JK53m09P7J86j16M2j84J70l22K56K3j03J57j50J45k54J45K0
$$ plain form
6775 -45 157 -45 23 61 -290 26 -130 73 -51 -79 115 26 261 -101 -310 -166 -190 -68 -5 -60 79 -209 -67
6798 -67 238 -193 172 -158 31 -66 296 -144 -89 -308 -34 -87 -112 103 140 -7 -206 10 195 274 207 31 104
6821 104 -71 175 312 81 -156 -63 183 29 -183 6 32 29 241 -45 -80 -291 18 303 70 156 -136 69
6843 69 152 129 -145 94 62 35 109 126 -265 41 -99 137 37 -131 -30 55 -68 -361 -102 112 -176 -299 -177
6866 -177 80 -78 138 25 103 -194 136 -194 -282 345 -199 -49 -118 9 -188 135 174 -103 9 65 -165 -117
6888 -117 -136 218 134 23 149 237 -51 -116 80 -236 68 -46 -176 -43 205 54 41 -106 -199 -164 -70 -15 -72
6911 -72 90 -212 -30 212 44 14 16 56 259 -203 -438 98 155 -18 -110 -18 -31 -94 192 34 -51 -67 -146 190
6935 190 220 1 45 -206 -168 14 -119 -15 264 -44 -47 28 129 -130 -223 235 9 -7 -134 45 25 155 84
$$ packed form
6775d5K02k02O8L8l51L16j56K03j24k8J94q9K35l62k09J44k4J22O3n5J39k88J42
6798f7L05m31L65l30J89r7L62m40N5k19K74n3k5K15L7j47j99K16J85P9o7j76P3
6821A04j75K46J37k31k37R3K46j54k12J89K6lK12k86l5k11L09K85k33Q6k92K05
6843F9Q3k3k74K39l2k7P4J7l91L06j40K36j00j68J01Q5j23k93K59K14k88j23J22
6866a77K57j58K16j13P8k97L30l30q8O27n44J50o9J27j97L23L9k77J12N6k30M8
6888a17j9L54q4j11J26Q8k88o5J96l16L04j14j30J33K48j51j3j47r3L5R4N5n7
6911g2J62l02J82K42j68l0KM0K03m62k35N36N7j73r2R2j3o3K86j58q5j6p9L36
6935A90L0k19M4k51L8J82j33J04K79l08lP5J01k59r3M58k26j6j27J79k0J30p1
$$ plain form
6958 84 6 -250 12 101 -24 114 27 -151 -158 -189 -97 -462 -190 -159 -180 -3 43 -249 -66 -346 22 -182 66 104
6982 104 -238 0 -118 214 -180 168 39 -160 -79 -255 -12 211 -18 -171 140 -63 -96 -109 33 182 160
7003 160 275 21 69 135 -256 -188 -213 185 311 25 -58 153 142 125 -190 12 -14 84 31 -121 69 -8 58 322
7027 322 111 78 187 86 92 91 157 -63 -110 265 74 192 98 58 200 -93 231 -213 8 -65 -141 -103 -138 254
7051 254 175 174 187 -55 -238 -34 -39 49 149 -121 288 -104 -74 -134 81 -149 -69 -89 77 40 173 66 17 186
7075 186 -271 134 -162 -34 193 206 -174 -124 166 155 -102 -284 11 -48 72 -20 -78 98 224 -8 -137 -28
7097 -28 81 -133 -25 126 -113 35 38 39 -49 -98 111 -76 -32 154 -234 -12 183 -6 -233 0 32 7 70 120
7121 120 73 87 -130 -6 84 -35 235 -160 93 -119 76 77 359 67 -57 92 2 -13 -106 -26 122 71 246
$$ packed form
6958H4p8k56K62Q9j25J38q7j78pl1R2l65K72L1k1J77M6k92J83k80L68k04K48L8
6982A04l42K38j18L32l94L48j29j99Q1j76K43K23k29j53L11k03l3j3J42J49k2
7003A60J15k54M8O6l91O8k5L98J26k86q3K11j1j7l15K02k6R8n3j52J90p7O6K64
7027C22k11l3J09j01OjO6k20m7L75j91J18r4m0J42k93L24m44K21p3p6L8l5L92
7051B54p9jJ3k42j83K04nQ8J00k70M09l92L0o0K15k30Q0k0J66l7J33j07m9J69
7075A86m57M05k96J28K27J3l80N0K90j1k57j82K95n9J20r2n8J76J26k32j29J09
7097b8J09k14J08J51k39J48LJq8m9K09j87M4J86l88K22J95j89k27K33L2k5O3N0
7121A20m7J4k17J24R0j19K70l95K53k12J95JK82k92j24J49r0j5r3Q0J48n1J75
$$ plain form
7144 246 180 123 -244 127 152 -42 -23 -166 90 -22 120 40 127 -85 35 42 24 106 196 -213 32 -116 -124 214
7168 214 255 -63 -230 36 -102 -111 59 127 -148 13 -106 16 -289 187 151 -1 164 -239 -88 -118 53 76
7190 76 81 58 -16 31 153 -226 226 18 128 151 -2 -122 -3 5 90 154 256 -43 -147 74 -62 -30 126 -54
7214 -54 235 21 71 217 -36 -39 -63 -170 116 -236 -189 16 -92 -165 130 -149 46 59 -287 176 -54 -78 192
7237 192 -210 -84 151 -121 -85 -60 39 -196 -30 -179 145 -106 367 -228 -28 46 15 -16 146 78 8 7 40 5
7261 5 31 28 -102 147 -75 -139 68 67 180 -34 383 45 344 -148 -35 47 -113 91 -76 -156 -42 -19 -342 161
7285 161 -99 -320 -158 44 -2 -221 363 -78 -23 -8 -95 -265 -53 127 212 147 -64 -9 68 135 200 -4 -206
7308 -206 -168 87 -8 -93 -133 33 144 47 -13 3 79 -144 -75 38 -216 144 -142 -139 -17 -129 101 -117 225 123
$$ packed form
7144B46o6n7l67L71K5j94J9j43K56j12J42q0Q7k12J20Pj8Q2R0m09K45j48qL38
7168B14M1l18j67K66j38rJ70O8k75J61j19J22l05M76l6j52J65m03J51l0J71K3
7190G6Nk3p4M7J22l79M52k08J10K3j53j20J19QQ5O4J02k99j04K21j36L2J56j80
7214e4K89k14N0J46k53lk4j07K86l52M7K05j08p3K95k79J95J3l46M63k30k4K70
7237A92m02J26K35k72L6K5R9k35J66j49L24k51M73n95K00P4l1l1J62o8p0jL3l5
7261EK6lj30K49k22o4K07jJ13k14M17l38K99m92J13Q2j60K04j67q0J14K3l23N03
7285A61k60k21J62K02m6k19N84m41N5J5q7j70K12J80Q5o5k11N5P7O7O5k04k02
7308b06L8K55r5q5m0J66J11r7o0J6P6k23O9J13k54L60k86LJ22j12K30k18L42j02
$$ plain form
7332 123 248 -130 -90 25 26 96 -78 247 106 76 -69 71 142 -149 129 31 -241 225 227 165 102 146 -70 58
7356 58 0 -68 112 -105 0 -6 -20 -75 33 -161 212 17 -321 140 144 8 156 -129 65 83 -8 -53 122 4
7380 4 -60 -13 63 -145 -370 162 59 -66 221 -223 -85 -89 21 -125 -54 -60 154 133 -89 -202 -233 -35 138 -228
7404 -228 -323 58 87 -135 -14 59 -214 13 177 145 143 -10 32 -165 -421 -261 -84 51 -172 73 151 140 -155
7427 -155 -60 -286 -122 13 -38 145 -126 61 -23 56 -368 -50 141 -206 -68 88 2 -60 201 54 45 107 108 112
7451 112 -78 -223 293 201 -178 132 -34 127 114 130 96 -17 -115 46 74 169 199 105 155 -23 -20 63 153 200 -200
7476 -200 -175 -67 -3 231 184 131 -11 -5 -118 -291 -67 1 7 127 150 2 -15 -21 183 244 51 -188 181 -76 -2
7501 -2 162 120 -1 67 70 235 -30 132 71 -128 -191 47 109 260 -250 -173 -168 -176 -241 86 207 -32 123 -126 49
$$ packed form
7332A23J25l78M0J15JP0j74L25j41l0j45J40P1k91K78r8k72M66Ko2o3M4k16J28
7356E8n8o8J80k17J05oj4n5J08j94L73j95l38M61Mj36J48k85J94J8r1m5J75j18
7380Do4M7P6k08k25N32j03j25K87m44J38mJ10j46P1oK14k1k22j13l1J98J73l66
7404b28r5L81K9k22J21P3k73K27J64l2kj53M2j97k56J60J77J35k23K45P8j1k95
7427a55R5k26J64J35n1J83k71J87q4P9m24L18J91l47J38J56q6o2K61j47rO2JM
7451A12j90j45N16r2l79L10j66J61j3J6l4j13r8J61K8R5L0r4N0j78LQ3R0M7m00
7476b00K5J08O4K34m7n3j42Oj13j73K24O8OJ20K3j48j7oK04O1j93k39L69k57P4
7501bJ64m2j21O8LJ65k65J62o1j99o3K38O2J51n10P7Nqo5L27J21k39J55k49J75
$$ plain form
7526 49 -15 -79 31 -9 -95 61 -121 -45 -176 -314 -208 26 -153 6 -204 -274 -77 200 174 -48 81 -189 -91
7549 -91 155 105 -138 -268 179 -154 -62 120 -120 -122 -54 -263 -10 52 -75 190 -72 -118 -170 -61 245 16 -165
7572 -165 -127 -70 271 80 -193 112 -250 -216 -10 211 -300 -231 131 -124 175 -327 -280 -16 6 -12 -168 15
7594 15 -68 -60 21 -313 140 13 71 -44 78 -297 -145 -65 81 -37 -211 -170 -55 -243 21 84 88 76 282 45
7618 45 -286 -113 -58 85 159 -42 -129 118 -45 -238 62 146 46 207 -234 60 188 2 -126 18 68 86
7640 86 -124 -235 -252 222 87 19 142 24 159 175 47 112 125 33 123 127 60 45 -49 -102 21 -124 24 63 93
7665 93 60 146 -45 -61 -199 138 -179 -62 -92 -81 60 268 133 -225 100 187 -56 -40 -207 1 131 15 5
7688 5 -146 64 -125 181 -119 -125 -185 161 -208 -75 51 97 -18 -43 104 -127 -256 116 13 -34 -9 -22 -150
$$ packed form
7526D9o4o4J10m0q6J56j82P6j31j38J06K34j79J59k10p0J97K77k6k22J29k70R8
7549i1K46n0k43j30M47l33R2J82k40kO8k09K53O2j27K65k62m6n2J09L06k29j81
7572a65L8N7L41j91k73L05l62L4K06K21n11O9L62k55K99n02M7K64K2j8j56J83
7594A5q3QQ1l34M53j27N8j15J22l75J52Q0J46j18j74M1J15j88K64O3Mj2K06k37
7618D5l31J73N5J43P4k01q7K47j63j93L00Q4j00J61m41K94J28j86j28J44N0J8
7640H6k10j11j7M74j35o8J23j18J35J6j28O5J3r2R0Mo7j5r4n3J23j45J48L9L0
7665I3l3Q6j91j6j38L37l17J17l0J1J41K08j35l58L25Q7k43J6j67K08J30j16j0
7688Ej51K10j89L06l00oo0L46l69J33J26M6j15k5J47k31j29L72j03m7K5j3j28
$$ plain form
7711 -150 -160 -242 236 92 107 123 17 -181 81 -110 39 73 25 -192 40 20 126 -216 -114 -1 -172 254
7733 254 -35 47 56 46 -147 -25 46 -79 -105 41 -50 -80 17 94 31 -26 1 187 -90 151 69 -112 -20 149 161
7758 161 -13 -110 215 -147 -114 113 84 50 -146 -77 -225 297 326 -117 48 -1 88 -21 62 192 108 -117 46
7781 46 95 6 2 -20 -237 -250 -81 68 118 -251 17 -52 105 -93 14 -142 -94 105 -139 -97 -104 -198 96 -4 -11
7806 -11 -27 -65 171 -201 225 -194 -262 -87 202 47 147 112 205 368 -98 -147 138 116 296 194 292 56 -157
7829 -157 -27 364 -62 100 50 -167 -99 -160 56 -182 -64 160 -91 72 21 -219 -189 130 107 -312 -43 78
7851 78 -43 -82 -233 89 342 -370 -109 64 108 -60 -161 176 234 153 -62 261 -224 61 -197 84 15 30
7873 30 136 -256 -64 -145 102 -375 -51 -76 9 -344 -219 -210 22 -35 -20 252 -96 26 119 158 -49 95 82 -73
$$ packed form
7711a50j0q2M78j44J5J6j06j98K62j91J49L4m8k17K32k0J06l42J02J13j71M26
7733B54k89Q2Rj0j93J22P1j25k6J46r1l0R7P7o3n7K7J86k77K41q2j81R2J69J2
7758A61j74r7L25l62L3K27k9l4j96O9j48N22K9m43J65m9Q9j09Q3J30q4k25J63
7781D6M9q9mk2k17j3J69J49N0l69K68o9J57j98J07j56M8J99k44M2pr4K94j00p
7806a1j6l8K36l72M26m19o8J75K89j55J00l5R3J63m66m9K85k2J80j02R8k36k13
7829a57J30L91m26J62n0k17O8o1K16k38J18K24k51J63n1k40L0L19k3m19K69J21
7851G8j21l9j51L22K53p12K61J73M4j68j01L37N8q1k15L23m85K85k58K81o9J5
7873C0J06l92J92q1K47m77L24k5Q5l53J25RK32n7J5K72l48J22R3L9k07J44j3j55
$$ plain form
7897 -73 37 -28 -256 170 -215 -91 94 79 -45 -144 8 23 85 -50 -17 95 -60 190 45 190 -82 209
7919 209 -9 77 176 -408 44 -194 -9 -139 -14 -150 108 117 283 -150 -99 -82 57 -150 23 -3 21 -75 -159
7942 -159 269 113 42 -29 -15 -37 152 50 153 -18 114 -89 0 117 -75 -286 -122 72 72 -122 -37 82 14
7965 14 17 -147 58 -35 -162 60 -295 -196 -137 10 75 -89 -102 69 44 -444 152 161 -75 -466 260 -15 -211 -30
7989 -30 142 89 218 -7 -47 -5 74 32 -124 -94 39 130 102 217 -47 -123 57 -50 10 71 -275 16 -176 -147
8013 -147 -110 -194 20 -41 15 393 124 231 9 -157 5 -115 -24 -65 -101 126 -28 -194 118 -31 2 177 -181
8036 -181 -113 38 -174 253 69 -186 -41 -365 97 208 -175 71 -29 -403 -28 -46 169 -169 84 157 -56
8057 -56 -51 148 78 -204 203 283 -46 50 -116 172 -233 104 82 -165 27 -38 76 -163 -72 -6 46 -94 90 -83
$$ packed form
7897g3J10o5k28M26l85J24J85j5j24r9J52J5O2j35L3J12j55K50j45J45k72K91
7919B09k18Q6R9n84M52k38J85j30J25j36K58RJ66m33N1J7J39k07J73k6K4r6q4
7942a59M28j56p1p1J4k2J89j02J03j71J32k03Q9J17j92k11J64J94%j94Q5J19o8
7965A4Lj64K05r3j27K22l55R9N9J47O5j64j3J71k5m88N96Rk36l91P26k75j96J81
7989c0J72n3J29k25m0M2P9m2j56L0J33R1k8J15k64p6J80j07O0O1l46K91j92K9
8013a47L7q4K14o1N6L78k69J07k22j66J62j20R1m1l6K27j54j66L12j49L3J75l58
8036a81O8J51k12M27j84k55J45l24M62J11l83K46j00l74L75j8K15l38K53P3k13
8057e6NJ99p0k82M07Q0l29R6j66K88m05L37k2k47J92o5J14k39R1O6N2j40J84j73
$$ plain form
8081 -83 -60 -88 -34 -82 -31 -94 88 -29 148 345 -6 -152 -28 -61 -118 -166 -78 -134 17 -68 -73 103 342 264 311 190
8107 190 -288 150 68 -102 46 -4 32 27 266 -87 40 53 -52 28 67 54 251 103 73 -82 -58 283 -127 80
8131 80 -31 -196 -201 -121 -305 62 -287 -54 140 -45 -68 194 -191 -76 51 -11 208 87 -92 84 -136 167
8153 167 -3 -113 203 135 144 243 198 -28 -73 -119 -25 -39 41 130 31 -87 -164 116 248 101 236 63 -88 42
8177 42 31 316 -15 16 -93 -6 -227 -5 -13 -87 186 8 184 -216
$$ packed form
8081h3K3k8N4m8N1o3J82j17J77J97l51j46J24l3n7m8Q8n6J51q5nJ76K39p8M7j21
8107A90m78M38q2j70J48n0L6nK39l53J27J3j05Q0L9j3J97j48l0j55K4L41m10K07
8131H0j11j65nQ0j84L67l49K33J94j85k3K62l85J15J27o2K19j21j79J76k20L03
8153A67j70j10L16o8RR9m5k26m5m6R4j4Q0Q9r9j18p7K80J32j47J35j73j51J30
8177D2j1K85l31L1j09Q7k21K22qp4K73j78J76m00
8191b16
$$ Imaginary data points
##PAGE= N=2
##DATA TABLE= (X++(I..I)), XYDATA
$$ plain form
0 0 0 0 0 0 0 0 -8 8 0 8 -8 16 -16 24 -24 32 -40 48 -64 80 -91 107 -128 152 -176 208 -243 280 -320 370 -423
31 -423 483 -547 619 -698 786 -882 986 -1102 1230 -1366 1518 -1685 1865 -2063 2278 -2514
47 -2514 2770 -3056 3366 -3707 4083 -4503 4969 -5491 6084 -6757 7530 -8434 9498 -10784
61 -10784 12364 -14366 16995 -20611 25921 -34495 50638 -91542 416815 533124 -620249
72 -620249 -474675 276842 441629 -93142 -249710 -100528 21217 106590 255008 12853
82 12853 -366234 -251361 297499 389656 -137141 -470659 -27644 438756 200393 -284265
92 -284265 -250638 81409 178914 42618 -27129 -88718 -124050 81101 262408 -16741 -307384
103 -307384 -74995 229571 78126 -132573 -8890 80314 -74020 -29798 182080 21430
$$ packed form
0@%%%%%%qJ6qQj6K4l2M0m8N6p2Q8j12J44j71J98k35K80l28L84m51N23o00O90p93
31d23R06j030J166j317J484j668J868k088K332k596K884l203L550l928M341m792
47b514N284n826O422p073P790q586R472j0460J1575j2841J4287j5964J7932k0282
61a0784K3148k6730L1361l7606M6532o0416Q5133j42180N08357J16309j153373
72f20249J45574P51517J64787n34771j56568J49182J21745Q5373J48418k42155
82A2853l79087J14873N48860R2157n26797l33518M43015M66400k38363m84658
92b84265L3627L32047R7505j36296o9747o1589l5332K05151J81307k79149k90643
103c07384K32389L04566j51445k10699J23683Q9204j54334M4222K11878j60650
$$ plain form
113 21430 -278013 -86789 287686 175975 -202976 -187367 131004 149294 -99169 -112080 57140
124 57140 27485 -82610 38904 178586 -37057 -281312 -25561 317410 79023 -310426
134 -310426 -120231 280454 168222 -185846 -130196 109354 37332 -78902 53594 78523
144 78523 -113185 -92552 147244 130250 -142858 -174146 79289 150121 -32129 -97745 11605
155 11605 55084 1225 -10465 16567 -26071 -66429 30014 109213 -4512 -106417 -4179
166 -4179 93847 -1535 -92629 2098 71322 -37318 -62823 86667 82978 -104123 -102670 95162
178 95162 106961 -80565 -93532 75335 78102 -51648 -23747 55959 -27774 -93331 33538
189 33538 123329 -20661 -147034 -8143 147719 36541 -130629 -74946 71249 74827 -13816
$$ packed form
113B1430k99443J91224L74475j11711l78951J5609L18371J8290k48463j2911J69220
124E7140k9655j10095J21514J39682k15643k44255K55751L42971k38387l89449
134c10426J90195M00685j12232l54068N5650K39550p2022j16234J32496K4929
144G8523j91708K0633K39796j6994k73108l1288K53435P0832j82250o5616J09350
155A1605M3479n3859j1690K7032m2638m0358R6443P9199j13725j01905J02238
166d179R8026r5382r1094R4727O9224j08640k5505J49490l689j87101J453J97832
178I5162J1799j87526j2967J68867K767j29750K7901P9706q3733o5557J26869
189C3538Q9791j43990j26373J38891J55862j11178j67170N5683J46195L578q8643
$$ plain form
200 -13816 -33738 -7299 -13852 14386 74518 10910 -113123 -54635 120418 108412 -88139 -134923
212 -134923 44211 122607 -8357 -86599 -25860 18809 24535 41282 10084 -75138 -58382 84430
224 84430 103718 -68765 -125972 35383 126531 13146 -95613 -40531 54183 34121 -22119
235 -22119 -16396 -10279 -16267 20022 44591 -8871 -68821 -19267 80017 42756 -73640 -45393
247 -45393 65614 51172 -41456 -40639 31440 26843 -30594 -7205 31838 -14924 -35132 20863
259 20863 28402 -26689 -35562 19944 33642 -23541 -30433 28169 24400 -23636 -15400 23350 20075
272 20075 -19861 -20004 27725 21803 -28364 -16265 22377 9219 -19677 -11006 16121 1940 -23536
285 -23536 8570 26090 -22250 -25184 29298 29140 -23677 -31827 23310 39736 -18168 -33689 14296
$$ packed form
200a3816j9922K6439o553K8238O0132o3608j24033N8488J75053j2006j96551m6784
212a34923J79134P8396j30964p8242O0739M4669N726J6747l1198q5222J6756J42812
224H4430J9288j72483n7207J61355R1148j13385j08759N5082R4714k0062n6240
235b2119N723O117n988L6289K4569n3462n9950M9554R9284l7261j16396K8247
247d5393J11007j4442r2628Q17P2079m597n7437K3389L9043m6762k0208N5995
259B0863P539n5091q873N5506J3698n7183o892N8602l769m8036Q236L8750l275
272B0075l9936j43M7729n922n0167J2099L8642j3158k8896Q671K7127j4181k5476
285b3536L2106J7520m8340k934N4482j58n2817q150N5137J6426n7904j5521M7985
$$ plain form
298 14296 20339 -7810 -10361 -452 -1525 -8815 2958 18010 -12272 -33366 12658 38944 -4330
311 -4330 -37734 -5805 41862 18474 -33790 -12274 26669 8333 -9925 538 1095 -9488 -4881
324 -4881 16283 7042 -30844 -15439 29243 13738 -24042 -18527 13086 22973 -5931 -18603 7166
337 7166 13368 -2039 -398 2588 -1766 -3677 1901 10478 -4405 -19781 4759 17671 -8443 -17483
351 -17483 1694 13096 2099 -12085 -815 10404 -20 822 6041 -5259 -3655 10243 8437
364 8437 -5139 -13816 -288 15082 -501 -16343 -6328 4399 5440 -72 -7574 -4167 -203
377 -203 2815 11337 2270 -14904 -2633 18075 15220 -6636 -17922 1052 17486 3048 -8831
390 -8831 -7079 -5656 3952 11015 904 -15421 -17821 5597 24010 3351 -20094 -9151 12145
$$ packed form
298A4296O043k8149k551R909j073p290J1773J5052l0282k1094M6024K6286m3274
311d330l3404L1929M7667k3388n2264K1516L8943j8336j8258J0463N57j0583M607
324d881K1164r241l7886J5405M4682j5505l7780N515L1613R887k8904j2672K5769
337G166O202j5407J641K986m354j911N578Q577j4883j5376K4540J2912k6114r040
351a7483J9177J1402j0997j4184J1270J1219j0424Q42N219j1300J604J3898j806
364H437j3576q677J3528J5370j5583j5842J0015J0727J041n512p502L407L964
377b03L018Q522r067j7174J2271K0708k855k1856j1286J8974J6434j4438j1879
390h831J752J423R608P063j0111j6325k400K3418J8413k0659k3445J0943K1296
$$ plain form
403 12145 18363 5203 -14818 -15370 3208 21204 18894 -12969 -31494 -1424 28055 12756 -21273
416 -21273 -30276 107 30364 17205 -15468 -25624 -6138 22831 24030 -4808 -25380 -16344 20790
429 20790 44241 3974 -48423 -27891 32292 40676 -12577 -48055 -14376 32322 31425 -3358 -36137
442 -36137 -31178 14911 38476 10541 -23545 -26451 7361 43111 26683 -32078 -56988 -1528
454 -1528 67872 36864 -50013 -50702 19847 46539 8093 -38836 -38844 4998 37681 28348 -10721 -36266
468 -36266 -14530 21785 33850 10216 -43197 -48011 39177 83385 -2345 -83019 -34437 57308
480 57308 45439 -34251 -46592 -1642 24116 30103 11946 -28742 -40041 -6974 37162 43472
492 43472 -13450 -59852 -12195 74609 62318 -57290 -100492 15810 93441 16538 -57464 -30796
$$ packed form
403A2145O218j3160k0021n52J8578J7996k310l1863j8525L0070K9479j5299l4029
416b1273r003L0383L0257j3159l2673j0156J9486K8969J199k8838k0572R036L7134
429B0790K3451m0267n2397K0532O0183Q384n3253l5478L3679M6698q97l4783l2779
442c6137M959M6089K3565k7935l4086k906L3812L5750j6428n8761k4910N5460
454a528O9400l1008q6877o89P0549K6692l8446m6929qM3842L2683r333l9069k5545
468c6266K1736L6315J2065k3634n3413m814Q7188M4208q5730q0674M8582R1745
480E7308j1869p9690j2341M4950K5758N987j8157m0688j1299L3067M4136O310
492D3472n6922m6402M7657Q6804j2291j19608m3202J16302P7631p6903p4002K6668
$$ plain form
504 -30796 18455 30817 14295 -16300 -46338 -33194 34988 64493 8189 -48644 -41586 21404
516 21404 71788 12368 -88613 -56216 73006 95077 -20111 -86712 -17253 46980 18864
527 18864 -15197 -22854 -22605 8923 43425 27463 -21720 -54045 -24824 45269 61770 -13850 -80341
540 -80341 -17094 98066 58867 -78316 -76030 31437 50174 -4597 -19291 -4464 -8972 -1174
552 -1174 38207 23292 -54803 -64250 18046 75385 39443 -47745 -63452 29719 80944 -2476
564 -2476 -86290 -39833 56735 59170 -3376 -24707 -23514 -22583 17097 39263 -16153 -56686 -7944
577 -7944 59518 50750 -22107 -65359 -30014 44325 66287 -13244 -79173 -8977 80339 39338
589 39338 -45700 -48373 -836 21292 16411 5554 -19953 -31899 13731 53755 12951 -51659
$$ packed form
504c0796M9251J2362j6522l0595l0038J3144O8182K9505n6304n6833P058O2990
516B1404N0384n9420j00981L2397J29222K2071j15188o6601O9459O4233k8116
527A8864l4061p657K49L1528L4502j5962m9183l2325K9221P0093J6501p5620o6491
540h0341O3247J15160l9199j37183K286J07467J8737n4771j4694J4827m508P798
552a174L9381j4915p8095r447Q2296N7339l5942q7188j5707R3171N1225q3420
564b476q3814M6457R6568K435o2546k1331J193R31L9680K2166n5416m0533M8742
577g944O7462q768p2857m3252L5345P4339K1962p9531o5929P0196Q9316m1001
589C9338q5038k673M7537K2128m881j0857k5507j1946M5630M0024m0804o4610
$$ plain form
601 -51659 -53149 11681 66164 30183 -49233 -42104 41097 59607 -19428 -66766 -13070 36238
613 36238 18914 4854 3075 -22350 -23518 18895 26118 -23669 -42818 7472 48411 22449 -19571
626 -19571 -27782 -7681 22114 21279 -16926 -24594 11697 27538 6532 -11800 -11332 -9773 -6347 8619
640 8619 10672 -10679 -11949 9564 14318 3943 -7696 -21395 -11671 22150 26465 -8604 -22127
653 -22127 10644 25404 -7112 -21196 -1311 -2236 -5674 17134 17912 -16292 -24857 8314 22882
666 22882 -6965 -27130 -5203 20052 20807 3814 -16902 -11696 13933 10420 -10691 -9521 3400
679 3400 7158 6382 5751 -5184 -20352 -7325 16996 3346 -17303 238 14354 3096 -2812
692 -2812 -828 -4699 -5972 6286 13195 -2004 -7273 8421 4633 -8790 207 1923 -9981 -4992
$$ packed form
601e1659j490O4830N4483l5981p9416P129Q3201J8510p9035m7338N3696M9308
613C6238j7324j4060j779k5425j168M2413P223m9787j9149N0290M0939k5962m2020
626a9571q211K0101K9795q35l8205p668L6291J5841k1006j8332M68J559L426J4966
640H619K053k1351j270K1513M754j0375j1639j3699R724L3821M315l5069j3523
653b2127L2771J4760l2516j4084J9885r25l438K2808P78l4204q565L3171J4568
666B2882k9847k0165K1927K5255P55j6993k0716N206K5629l513k1111J170J2921
679C400L758p76o31j0935j5168J3027K4321j3650k0649J7541J4116j1258n908
692b812J984l871j273J2258O909j5199n269J5694l788j3423Q997J716j1904M989
$$ plain form
706 -4992 8093 6650 -5305 -8409 1570 4104 -320 -305 -6252 -3193 13764 9499 -6567 -3387 2786
721 2786 765 571 561 -3107 -7255 3262 15399 -4082 -21357 66 12656 -2150 -7758 -647
735 -647 5018 5085 880 -527 -3769 -2976 8335 5362 -5341 -807 1802 560 4084 -4163 -9726 333
751 333 6385 694 -8650 -5097 8835 4388 -7503 -745 3085 196 4111 1891 -2457 820 3349
766 3349 3916 -1444 -6151 456 2941 -1226 150 -3653 -4824 4573 2962 -5315 -4271 731 5602
781 5602 3321 -4663 -614 4358 2024 2321 -1732 -2747 3445 1686 -1194 153 -3574 -2807 2205 287
797 287 -2643 -4541 -1693 5795 1658 -6135 -185 4913 3260 195 -2650 1948 5036 -1018 -946 1717
813 1717 -1667 -933 467 -460 -1238 -4458 -1127 4546 -1934 -5824 1030 3723 1599 -1642 -2523 3940
$$ packed form
706d992J3085j443j1955l104R979K534m424J5n947L059J6957m265j6066L180O173
721B786k021j94j0l668m148J0517J2137j9481j7275K1423J2590j4806n608P111
735f47N665O7m205j407l242P93J1311k973j0703M534K609j242L524q247n563J0059
751C33O052n691r344L553J3932m447j1891O758L830k889L915k220m348L277K529
766C349N67n360m707O607K485m167J376l803j171R397j611q277J044N002M871
781E602k281p984M049M972k334K97m053j015O192j759k880J347l727P67N012j918
797B87k930j898K848P488m137p793N950N098j653l065k845M598L088o054P2K663
813A717l384P34J400r27p78l220L331N673o480l890O854K693k124l241q81O463
$$ plain form
829 3940 4264 -1100 163 1343 320 1717 -174 -810 -1256 -3390 108 2701 -3201 -4500 -122 1552
845 1552 1977 -863 -2724 839 2760 3081 1890 -3061 -947 4856 3098 -851 -2793 -2848 1530 2904
861 2904 -1162 -3812 -4638 -1186 5218 2152 -5723 -5439 2096 9105 3413 -7900 -3483 6606 5442
876 5442 861 -1722 -3931 -1344 4802 6613 -3214 -13731 -3398 12765 4515 -11314 -8748 3442
890 3442 9733 2247 -6614 -3668 1693 3541 6146 3051 -4929 -5928 3634 13684 2468 -18912 -9178
905 -9178 15551 10803 -10113 -11924 1599 6982 -280 -1912 -119 -6360 -1876 12315 7829 -6516
919 -6516 -9021 966 12308 7311 -8924 -12357 1568 13847 7314 -12167 -12976 3938 7217 332
933 332 -4388 -7840 -1209 9864 7780 -1461 -8159 -5842 4008 9466 7530 -5311 -15643 5337
$$ packed form
829C940L24n364J263J180j023J397j891o36m46k134L498K593n902j299M378J674
845A552M25k840j861L563J921L21j191m951K114N803j758l949j942n5M378J374
861B904m066k650q26L452O404l066p875K84P535P009n692j1313M417J0089j164
876E442m581k583k209K587O146J811r827j0517J0333J6163q250j5829K566J2190
890C442O291p486q861K946N361J848K605l095p980r99R562J0050j1216k1380R734
905i178K4729m748k0916j811J3523N383p262j632J793o241M484J4191m486j4345
919f516k505R987J1342m997j6235l433J3925J2279o533j9481q09J6914L279o885
933C32m720l452O631J1073k084r241o698K317R850N458j936j2841j0332K0980
$$ plain form
947 5337 25330 -1267 -29225 -9915 19693 12112 -12646 -9549 7425 1726 -5031 5613 2433
960 2433 -11722 -6219 12068 18888 -1197 -22010 -5521 22411 12944 -18143 -22204 9703 23556
973 23556 -4412 -15486 3081 1532 -8353 2716 8550 -6806 -13380 7593 23011 2080 -18156
986 -18156 -8494 4858 11995 8038 -12290 -13443 13004 20011 -5072 -22803 -7542 11008 3472
999 3472 -3813 3021 -1498 -5697 5736 8478 -3024 -13335 -9942 11687 24528 2673 -23025
1012 -23025 -10653 24098 16764 -27509 -24579 19937 18360 -10911 -4236 9692 -7276 -16883 6887
1025 6887 18562 -10730 -21667 11805 27240 3631 -18933 -14871 8111 18591 -2559 -17173
1037 -17173 -919 15127 6808 -7678 -4999 -1764 -10676 -2380 15943 1699 -15214 1244 16563
$$ packed form
947E337J9993k6597k7958J9310K9608p581k4758L097J6974n699o757J0644l180
960B433j4155N503J8287O820k0085k0813J6489K7932r467l1087m061L1907J3853
973B3556k7968j1074J8567j549r885J1069N834j5356o574K0973J5418k0931k0236
986a8156R662J3352P137l957k0328j153K6447P007k5083j7731J5261J8550p536
999C472p285O834m519m199J1433K742j1502j0311L393K1629J2841k1855k5698
1012b3025J2372L4751p334m4273K930M4516j577k9271O675J3928j6968r607K3770
1025F887J1675k9292j0937L3472J5435k3609k2564M062K2982J0480k1150j4614
1037a7173J6254J6046q319j4486K679L235q912Q296J8323j4244j6913J6458J5319
$$ plain form
1050 16563 5473 -9160 -10654 -5221 4256 16089 8920 -14800 -7431 19404 6043 -23418 -12419
1063 -12419 10887 6068 -2903 5662 7775 -10355 -14252 6234 11053 -6553 -11835 4105 19941
1076 19941 11522 -15492 -17352 9473 13782 -9449 -12684 9416 10125 -9329 -3131 14350 -4621
1089 -4621 -24070 1601 20930 -1579 -16599 3577 18646 3765 -9921 -5273 -2125 -1883 6060
1102 6060 6707 -1292 -599 3284 248 -3885 -8171 -7995 1508 9589 6726 -2455 -4548 197 -367 -2138
1118 -2138 887 -1955 -2953 11022 13038 -6924 -12898 3491 8192 -7354 -9256 8092 6271 -8655
1132 -8655 572 11158 -5121 -15709 782 11859 -96 -9862 2881 14083 2252 -7600 -2344
1145 -2344 1940 -792 -3284 1235 7847 1417 -7631 844 6458 -5843 -13279 -65 12896 2164
$$ packed form
1050A6563j1090j4633j494N433R477J1833p169k3720P369K6835j3361k9461J0999
1063a2419K3306m819q971Q565K113j8130l897K0486M819j7606n282J5940J5836
1076A9941q419k7014j860K6825M309k3231l235K2100P09j9454O198J7481j8971
1089d621j9449K5671J9329k2509j5020K0176J5069j4881j3686M648L148K42P943
1102F060O47p999O93L883l036m133m286J76R503Q081k863r181k093M745n64j771
1118b138L025k842r98J3975K016j9962n974J6389M701j5546j902J7348j821j4926
1132h655R227J0586j6279j0588J6491J1077j1955r766J2743J1202j1831r852N256
1145b344M284k732k492M519O612o430r048Q475N614j2301p436J3214J2961j0732
$$ plain form
1159 2164 -8953 3306 10251 -5832 -8449 5565 4349 -6067 -578 11252 5010 -9957 -4227
1172 -4227 6888 -1723 -8593 30 4226 1045 -848 512 1161 -3459 -4473 2280 2960 -735 482
1187 482 2944 5145 66 -5797 140 3533 -3729 -2989 4681 2255 -4869 -2798 4993 719 -10334
1202 -10334 -1588 9723 -1188 -7188 4896 7832 -2778 -6432 3532 6615 -5252 -5250 7778 4923
1216 4923 -5348 -3311 2153 1881 -5092 -5831 4066 5197 -4003 -2729 4451 2955 -4506 -4878 5529
1231 5529 6231 -5490 -1574 8509 1898 -6981 -1631 5191 -71 -6975 171 7453 -2757 -7156
1245 -7156 3174 3488 -4036 -3330 2325 3388 -1618 -2006 4729 2357 -3357 -228 2815 537 -1857
1260 -1857 -1772 2640 1682 -4496 -1802 2777 -954 -3854 -332 2986 381 -3577 1232 5166 -2093 -3757
$$ packed form
1159B164j1117J2259O945j6083k617J4014j216j0416N489J1830o242j4967N730
1172d227J1115q611o870Q623M196l181j893J360O49m620j014O753O80l695J217
1187D82K462K201n079n863N937L393p262P40P670k426p124K071P791m274j1053
1202a0334Q746J1311j0911o000J2084K936j0610l654R964L083j1867KJ3028k855
1216D923j0271K037N464k72o973p39R897J131r200J274P180j496p461l72J0407
1231E529P02j1721L916J0083o611q879N350O822n262o904P146P282j0210m399
1245g156J0330L14p524P06N655J063n006l88O735k372n714L129L043k278k394
1260a857Q5M412r58o178K694M579l731k900L522L318k605l958M809L934p259j664
$$ plain form
1276 -3757 4140 3449 -2715 -1667 3486 2679 -3960 -2921 3884 361 -5556 -595 3233 -770 -3926
1291 -3926 -886 3720 245 -4393 1217 4838 -534 -2481 1681 3210 168 -3431 1162 3976 -2394
1306 -2394 -4008 2167 2499 -2914 -3650 1503 3161 -2638 -3485 2785 2422 -2364 -118 3138 643 -1529
1322 -1529 482 3055 294 -3023 432 2826 -625 -2776 -889 1432 24 -2211 -1058 1146 -758
1337 -758 -1394 1698 1103 -1509 -472 2364 2935 -998 -2477 2042 2419 -1207 -843 349 -287 -260 -217 -81
1355 -81 -1243 -2174 626 1489 -1044 -1155 426 615 1246 635 -657 122 522 986 1625 -1309 -1951 949
1373 949 1079 -80 -2324 -2133 1448 821 -1851 -517 452 -481 438 1103 1355 -576 -1817 2707 4305
1390 4305 -1557 -2756 455 2078 1273 -1737 -2221 664 581 -462 -478 -1964 -732 744 -166 1428 688
$$ packed form
1276c757P897o91o164J048N153q07o639J039O805l523n917M961L828m003l156
1291c926L040M606l475m638N610L621n372j947M162J529l042l599M593K814o370
1306b394j614O175L32n413p36N153J658n799q47O270l63m786K246L256k495k172
1322a529K011K573k761l317L455K394l451k151J887K321j408k235J153K204j904
1337g58o36L092n95k612J037K836N71l933j479M519L77l626L64J192o36K7M3J36
1355h1j162r31K800Q63k533j11J581J89O31o11j292P79M00M64O39k934o42K900
1373I49J30j159k244J91L581o27k672J334R69r33R19O65K52j931j241M524J598
1390D305n862j199L211J623q05l010m84K885q3j043j6j486J232J476r10J594p40
$$ plain form
1407 688 -1956 271 3267 1338 -1476 -2401 1504 3982 -555 -2222 -453 -181 1212 75 -3016 -1285
1423 -1285 767 738 487 -618 -745 -215 -825 2227 2294 -2950 -712 4509 2308 -1271 -2519 -1005 903
1440 903 784 -497 -1564 -1674 1900 1905 -3939 -2547 1806 -449 -518 2838 1902 -1598 -1841 3292 3697 -3381
1458 -3381 -3534 2474 2516 727 -926 -3316 -33 3037 -1431 -4348 -807 2614 384 -1802 2891 3362
1474 3362 -5088 -2515 5605 1121 -4970 -317 5296 3460 -1772 -2542 -936 -1092 948 163 -3645 688
1490 688 5053 -1405 -3577 1671 75 -4515 -221 6130 2321 -4553 743 5974 -516 -4383 -1362
1505 -1362 -181 1516 3421 -1060 -3069 1801 2698 -4375 -5248 3026 2401 -5087 1341 8975 -414 -8056
1521 -8056 1043 6114 -1756 -5397 1367 5009 1408 -769 -1561 -2759 192 703 -3988 -1074 4635
$$ packed form
1407F88k644K227K996j929k814r25L905K478m537j667J769K72J393j137l091J731
1423a285K052k9k51j105j27N30o10L052O7n244K238N221k201l579j248J514J908
1440I03j19j281j067j10L574Nn844J392M353k255o9L356r36l500k43N133M05p078
1458c381j53O008M2j789j653k390L283L070m468k917L541L421k230k186M693M71
1474C362q450K573Q120m484o091M653N613j836n232p70J606j56K040p85l808M333
1490F88M365o458k172N248j596m590M294O351l809o874N296N231o490l867L021
1505a362J181J697J905m481k009M870Q97p073q73Q274o25p488O428P634r389p642
1521h056R099N071p870l641O764L642l601k177p92j198K951N11m691K914N709
$$ plain form
1536 4635 319 -3925 3317 4774 -5565 -6787 4876 6225 -4116 -2458 6956 3397 -3044 -994
1550 -994 -664 -3604 -12 3086 226 -549 2648 262 -4876 -1339 1756 -3540 -2241 7443 5365 -3762
1566 -3762 -2478 3143 452 -3537 -876 2069 780 1595 1834 -2376 -2386 1114 -1904 -3932 2198 2884
1582 2884 -3408 -751 6603 1746 -6881 -2099 6222 -240 -5480 2755 5945 -836 -1612 1793 -1199
1597 -1199 -4359 -2176 1358 1591 811 1029 -488 -781 756 -3654 -4651 3008 5281 -480 -309 3564
1613 3564 481 -4575 -1221 2892 -1311 -2946 3877 3413 -3322 -2097 1231 -1642 -2885 927 1424
1628 1424 -1022 533 3930 999 -3250 417 1449 -2307 -688 2133 985 277 1414 725 -1620
1643 -1620 -2789 -937 -515 -349 2302 860 -1259 1834 1106 -4056 -2218 2905 1914 -1459 1348 4959
$$ packed form
1536D635m316m244P242J457j0339j222J1663J349j0341J658R414l559o441K050
1550i94L30k940L592L098k860p75L197k386n138L537L095n296J299R684k078r127
1566c762J284N621k691l989K661K945j289Q15K39m210j0L500l018k028O130O86
1582B884o292K657P354m857q627M782Q321o462n240Q235L190o781p76L405k992
1597a199l160K183L534K33p80K18j517k93J537m410r97P659K273n761J71L873
1613C564l083n056L354M113m203j635O823m64o735J225L328k873j243L812M97
1628A424k446J555L397k931m249L667J032l756J619K821j148p08J137o89k345
1643a620j169J852M22J66K651j442k119L093p28n162J838N123r91l373K807L611
$$ plain form
1659 4959 -242 -4670 1036 2210 -3932 -2196 3721 2061 -2178 -769 1220 -787 -2957 -214 1542
1674 1542 -339 1135 2030 405 858 -368 -2026 -113 1188 -94 -930 909 2326 -1280 -3135 848
1690 848 711 -3782 -80 3671 -539 -1894 1922 2311 -1819 -2266 2139 1560 -1929 926 3211 -473
1706 -473 -1368 477 -408 -1496 -980 309 718 47 242 -453 -942 313 -77 -1871 783 2342 -350
1723 -350 166 1991 -174 -1716 -217 1654 -576 -1801 1498 1455 -2270 -1142 1630 -982 -2208 619
1739 619 1579 -339 -799 1651 1649 -1285 -381 1252 148 -155 334 455 596 -188 -1210 -161 333 -647
1757 -647 -1358 136 1431 -235 -1893 1016 2019 -1569 -1201 1931 846 -719 -265 2156 627 -2134
1773 -2134 -86 1601 -789 -1666 277 504 -173 -863 -226 204 -114 -844 505 1108 -29 -89 523 1051
$$ packed form
1659D959n201m428N706J174o142J736N917j660m239J409J989k007k170K743J756
1674A542j881J474Q95j625M53j226j658J913J301j282q36J839J417l606j855L983
1690H48j37m493L702L751m210j355L816L89m130m47M405n79l489K855K285l684
1706d73q95J845q85j088N16J289M09o71J95o95m89J255l90j794K654J559k692
1723c50N16J825k165j542J499J871k230j225L299m3l725J128K772k612j226K827
1739F19R60j918m60K450kk934R04J633j104l03M89J21J41p84j022J049M94r80
1757f47p11J494J295j666j658K909J003l588L68L132j085j565M54K421j529k761
1773b134K048J687k390q77J943K27o77o90O37M30l18p30J349O03j137o0O12N28
$$ plain form
1791 1051 378 -1243 329 1428 -738 -1268 662 551 -526 -861 133 262 -1176 -740 1123 381 -966
1808 -966 30 626 414 193 -227 767 453 -236 414 65 -698 391 217 -219 -603 -488 139 207 -979 33
1828 33 756 -102 -675 557 1112 160 -868 640 1837 -499 -1661 681 1519 -827 -1707 -250 1108
1845 1108 -426 -1650 529 1059 -1024 -982 1127 768 -531 -1220 1231 2249 -1091 -1133 798 1037 -130
1862 -130 -877 -72 794 -708 -1132 934 -37 -1370 -75 505 613 -602 -1048 618 771 -261 239 346
1880 346 -778 665 267 24 -425 -622 649 406 -1302 -844 382 -450 -45 -172 -470 217 -690 181
1898 181 1082 -612 -921 868 841 529 -155 -662 1246 678 -1111 -368 117 -477 -164 -82 164 -698 -670 930
1918 930 606 -1148 322 794 233 792 810 62 -314 -370 760 36 -1447 -419 888 -293 -552 -682
$$ packed form
1791A051o73j621J572J099k166n30J930j11j077l35R94J29j438M36J863p42j347
1808i66R96N96k12k21m20R94l14o89O50l49p63J089j74m36l84J15O27O8j186J012
1828C3P23q58n73J232N55r52j028J508J197k336j162K342Q38k346q80J457J358
1845A108j534j224K179N30k083M2K109l59j299o89K451J018l340m2J931K39j167
1862a30p47Q05Q66j502m24K066r71j333J295N80J08j215m46J666J53j032N00J07
1880C46j124J443l98k43m49j97J271k43j708M58J226q32M05j27k98O87r07Q71
1898A81R01j694l09J789k7l12o84n07J908n68j789P43M85n94L13Q2K46q62K8J600
1918I30l24j754J470M72n61N59J8p48l76n6J130p24j483J028J307j181k59j30
$$ plain form
1936 -682 -498 414 -364 -878 285 539 169 -470 435 974 -945 -1453 1619 2095 -1446 -1215 1113 794
1954 794 -1110 -1591 126 293 -652 -200 258 -160 -21 -123 -266 702 390 -1260 267 2335 1193 -1423
1972 -1423 -1163 1748 503 -2683 -913 1456 311 -740 57 146 -404 -1136 -404 243 719 485 42 373
1990 373 2001 -93 -2721 19 2137 54 -1692 365 1761 -498 -1750 230 -95 -1707 -144
2005 -144 1294 223 12 229 -555 -69 765 -516 -1688 899 2598 203 -1561 672 1211 -1553 -1878
2022 -1878 483 347 -647 109 1033 407 -922 -1191 -418 320 470 -376 -756 2011 2238 -2023 -1719 1301
2040 1301 449 -2193 -767 2415 900 -1909 218 1544 -1560 -2769 465 1561 231 -31 739 896
2056 896 199 -898 -1117 -268 744 1200 331 338 1067 -1346 -1745 384 67 -1485 -129 1012 402 -759
$$ packed form
1936f82J84R12p78n14J163K54l70o39R05N39j919n08L072M76l541K31K328l19
1954G94j904m81J717J67r45M52M58m18J39j02j43R68l12j650J527K068j142k616
1972a423K60K911j245l186J770K369j145j051P97Q9n50p32P32O47M76k34m43L31
1990C73J628k094k628K740K118k083j746K057J396k259j252J980l25j612J563
2005a44J438j071k11K17p84M86Q34j281j172K587J699k395j764K233N39k764l25
2022a878K361j36r94P56R24o26j329k69P73P38J50q46l80K767K27m261L04L020
2040A301q52k642J426L182j515k809K127J326l104j209L234J096j330k62P70J57
2056H96o97j097k19Q49J012M56q69PP29k413l99K129l17j552J356J141o10j161
$$ plain form
2074 -759 -101 518 -973 -608 916 73 -640 1999 1373 -759 -575 389 -308 -2004 -830 1736 163
2091 163 -733 1730 868 -1853 -1947 -489 214 665 453 1416 961 270 -561 -1548 -593 732 4 -333 2104
2110 2104 614 -2029 -1102 613 -724 -1955 387 2197 -42 -1083 1325 720 -1847 -417 1242
2125 1242 11 -958 765 1674 141 -670 666 -478 -1801 -106 203 -323 319 723 -101 -60 -411 -915
2143 -915 -947 856 1465 -280 569 2387 -521 -2785 184 1248 -1425 -1157 1844 1384 -1685 -1387 1363
2160 1363 -301 -2266 301 1281 -325 67 944 131 -354 -128 125 -214 146 938 -86 -244 953 -160
2178 -160 -1708 128 95 -995 -240 1121 174 -824 546 654 -1176 -1092 1869 618 -1316 791 2031
2195 2031 -949 -1297 836 474 -1736 -818 1682 806 -1504 -126 655 -519 -827 -542 195 667 700 -175
$$ packed form
2074g59O58O19j491L65J524q43p13K639o26k132J84R64o97j696J174K566j573
2091A63q96K463q62k721r4J458P03M51k12R63m55o91q31r87R55J325p28l37K437
2110B104j490k643R27J715j337j231K342J810k239j041K408o05k567J430J659
2125A242j231r69J723R09j533q11J336j144j323J695L09n26O42M04q24M1l51n04
2143i15l2J803O09j745Q49J818k908k264K969J064k673K68L001m60l069K98K750
2160A363j664j965K567R80j606L92Q77q13m85K26K53l39L60P92j024j58J197j113
2178a60j548J836l3j090P55J361r47r98J370J08j830Q4K961j251j934K107J240
2195B031k980l48K133l62k210R18K500q76k310J378P81j174l08K85P37M72L3q75
$$ plain form
2213 -175 361 1018 -434 -1188 -17 1139 -717 -1133 1660 1019 -1739 -1272 1068 147 -1658 239 1408
2230 1408 41 -967 631 922 -351 -528 1049 296 -156 134 560 59 -318 -228 -131 -122 -383 -459 -265 508
2250 508 -428 -340 413 410 -898 -600 1000 370 -407 334 762 5 -1097 133 669 -567 -777 579 386
2269 386 -844 -419 549 -14 -820 -242 651 -155 -528 614 385 -81 -180 31 833 116 -460 107 829 -277
2289 -277 -588 -491 493 -156 -747 239 962 -427 -819 857 517 -466 -670 763 1152 -782 -494 981 517
2308 517 -618 -456 300 210 -401 -580 247 140 -938 -155 268 110 -328 -210 150 437 -350 -65 580 -114
2328 -114 -80 343 -42 -144 -290 42 374 -613 -651 590 -291 -636 -63 -179 -311 -237 81 797 -106 -577 725
2349 725 734 -217 -565 229 366 98 -888 194 210 -404 -274 206 -189 -528 -36 329 598 -483 -402 308 242
$$ packed form
2213a75N36O57j452p54J171J156j856m16K793o41k758M67K340r21j805J897J169
2230A408j367j008J598K91j273j77J577p53m52K90M26n01l77R0R7Rk61p6J94P73
2250E08r36Q8P53lj308K98J600o30p77P41M28p57j102J230N36j236k10J356j93
2269C86j230M25R68n63q06N78Q93q06l73J142k29m66r9K11Q02p17n76N67P22j106
2289b77l11R7R84o49n91R86P23j389l92J676l40r83k04J433L89j934K88J475m64
2308E17j135J62P56r0o11j79Q27j07j078P83M23j58m38J18L60K87p87K85O45o94
2328a14L4M23l85j02j46L32L32r87l8J241q81l45N73j16j32P4L18P16r03m71J302
2349G25Rr51l48P94J37k68r86J082J6o14J30M80l95l39M92L65K69j081Q1P10o6
$$ plain form
2370 242 -111 344 471 520 -511 -51 513 -371 -476 456 259 -573 -634 -46 361 175 -200 315 239 -270 76
2391 76 565 157 -240 -169 417 552 -452 -498 491 592 -555 -795 -50 274 -387 -496 348 -36 -517 160
2411 160 524 136 -39 -35 412 395 -123 -218 -14 31 650 -309 -734 -126 98 -445 -337 240 287 -325 -147 356
2433 356 181 -253 98 286 408 61 -497 198 712 162 -953 -679 427 248 -545 -387 697 135 -865
2452 -865 58 511 -372 -651 285 644 80 -179 145 168 337 36 -499 -353 495 174 -595 198 392 -313
2472 -313 -749 148 118 -497 -239 851 620 -559 -246 443 -126 -186 381 -93 43 545 -185 -668 -161 194
2492 194 -325 -644 524 447 -533 109 612 -111 -799 -28 420 218 38 488 211 -120 335 -174 -902 -70
2512 -70 472 -191 -163 347 -58 -950 -369 95 -452 -451 833 960 -242 247 414 -323 -46 274 -200 -566 330
$$ packed form
2370B42l53M55J27M9j031M60N64q84j05R32j97q32o1N88M07j86l75N15p6n09L46
2391G6M89m08l97P1N86J35j004m6R89J01j147k40P45L24o61j09Q44l84m81O77
2411A60L64l88j75MM47j7n18r5K04M5O19r59m25O08K24n43J08N77M7o12J78N03
2433C56j75m34L51J88J22l47n58O95N14n50j115K74J106j79p93J58J084n62j000
2452h65R23M53q83k79R36L59n64k59L24K3J69l01n35J46Q48l21p69P93J94p05
2472c13m36Q97l0o15K58J090k31j179L13O89n69o0N67m74J36N02p30m83N07L55
2492A94n19l19J168p7r80O42N03p23o88P71M48k02j80M50k77l31M55n09p28Q32
2512g0N42o63K8N10m05q92N81M64n47JJ284J27j202M89J67p37K77L20m74l66Q96
$$ plain form
2533 330 601 175 -647 143 -21 -957 -548 608 -28 -342 480 409 -261 -431 -149 315 -51 588 394 -37
2553 -37 631 263 -584 -749 -35 141 -306 433 610 -86 -358 -292 175 -621 240 598 276 190 497 179 -240
2574 -240 -216 151 -72 -782 220 682 -445 -288 446 -46 -942 -294 -361 126 116 -21 556 202 -359 -600
2594 -600 -400 251 404 -189 375 725 134 -639 -492 219 -336 -694 494 1009 -314 -605 371 -269 -853
2613 -853 -318 525 102 116 352 508 56 -276 184 -457 -238 327 -45 -191 267 99 6 -566 -229 -21 -334
2634 -334 240 539 61 358 253 -532 -478 318 -256 -296 75 845 282 -794 -283 44 -1000 -840 711 758
2654 758 -259 -232 484 125 -713 -280 556 78 -79 537 260 -298 69 -125 -253 -147 40 -648 131 288
2674 288 -48 -511 282 245 -455 -193 557 542 -444 404 647 -343 -375 387 202 -477 157 225 125 -479 54
$$ packed form
2533C30K71m26q22P90j64r36M09J156o36l14Q22p1o70j70K82M64l66O39j94m31
2553c7O68l68q47j65P14J76m47P39J77o96k72O6M67p96Q61L58l22q6L07l18m19
2574b40K4L67k23p10J002M62j127J57P34m92q96O48o7M87j0j37N77l54n61k41
2594f00K00O51J53n93N64L50n91p73J47P11n55l58J188N15j323k91R76o40n84
2613h53N35Q43m23J4K36J56m52l32M60o41K19N65l72j46M58j68r3n72L37K08l13
2634c34N74K99m78K97j05p85N4P96n74m0L71P70n63j076N11L27j044J60J551M7
2654G58j017K7P16l59q38M33Q36m78j57O16k77n58L67j94j28J06J87o88P79J57
2674B88l36m63P93l7p00K62P50j5r86Q48K43r90l2P62j85o79O34O8j00o04N33
$$ plain form
2695 54 171 -508 -5 -3 77 146 1 31 68 -35 168 -353 132 430 69 -318 443 135 -436 -168 44 -257
2717 -257 -383 224 615 -106 -275 126 90 -449 34 242 -123 153 480 315 -161 -423 85 -78 -243 49
2737 49 -123 244 -240 -212 -333 282 -77 -156 202 274 -46 -113 49 523 -332 -534 216 332 -435 10 351 -54
2759 -54 -489 -321 164 -52 -502 -67 414 270 -28 -53 71 61 -336 -228 254 238 -121 36 106 -260 63 -125
2781 -125 332 -80 -312 17 251 -224 76 91 69 -316 -268 116 356 -71 494 527 -76 -158 -25 93 -378 58
2803 58 -264 369 -265 -263 224 77 -335 291 255 376 51 -60 493 423 -64 -85 94 -31 -40 -501 219 7 -648
2826 -648 18 48 -255 -319 30 117 -16 -497 26 505 -448 81 402 266 20 35 -14 343 -304 -43 235 206
2848 206 -154 75 166 76 64 -77 293 101 -216 6 273 107 -54 56 317 168 -234 -141 132 -92 -191 48
$$ packed form
2695E4J17o79N03KQ0O9j45L0L7j03K03n21M85K98l61l87P61l08n71K68K12l01
2717b57j26O07L91p21j69M01l6n39M83K08l65K76L27j65m76k62N08j63j65K92
2737D9j72L67m84K8j21O15l59p9L58P2l20o7J62M74q55k02P50J16p67M45L41m05
2759e4m35J68M85k16m50M35M81j44k98k5J24j0l97J08M82j6l59J57P0l66L23j88
2781a25M57m12k32L29K34m75L00J5k2l85M8L84K40m27N65L3o03q2J33J18m71M36
2803E8l22O33o34KM87j47m12O26l6J21l25j11N53p0m87k1J79j25rm61P20k12o55
2826f48O66L0l03o4L49Q7j33m81N23M79r53N29L21j36k46J5m9L57o47K61K78k9
2848B06l60K29R1r0j2j41L70j92l17K22K67j66j61J10K61j49m02R3K73k24r9K39
$$ plain form
2870 48 32 89 -158 161 -183 -194 90 -43 -71 -257 -207 67 -83 91 43 -314 -128 -82 581 145 6 -271 107
2893 107 133 -108 -399 -6 107 -304 11 97 151 -96 -286 7 237 -270 145 309 -189 -465 -75 101 7
2914 7 -205 -105 -60 -17 -34 27 -50 -20 302 -178 43 164 42 -43 163 48 96 -254 137 -77 -93 -93 -113 -282 -335
2939 -335 161 -118 -16 -105 203 59 -80 32 2 -36 82 -153 101 -1 -78 58 212 -19 80 90 -361 159
2961 159 106 -125 326 -6 -113 -57 279 -67 -257 129 -227 -90 -154 349 -86 -211 -177 -27 -295 -202 -24 -33
2983 -33 -237 -106 62 -175 2 54 26 -224 147 266 107 -13 103 37 -254 -65 122 -212 44 246 71
3004 71 -9 -2 -129 -206 -149 122 -93 -34 151 316 -183 55 14 -1 -140 48 265 29 -323 84 64 -106 -25 39
3028 39 -266 -121 285 -120 27 -287 87 -41 -200 90 48 110 -44 108 17 61 93 -49 -153 79 404 152
$$ packed form
2870D8j6N7k47L19l44j1K84j33k8j86N0K74j50J74m8l57J86M6O63m36j39k77L78
2893A07K6k41k91L93J13m11L15Q6N4k47j90K93K30n07M15J64m98k76L90J76r4
2914Gk12J00M5M3j7O1p7L0L22m80K21J21j22q5K06j15M8l50L91k14j6%k0j69n3
2939c35M96k79J02q9L08j44j39J12l0l8J18k35K54j02p7J36J54k31R9J0m51N20
2961A59n3k31M51l32j07N6L36l46j90L86l56J37o4N03m35j25L4J50k68R3J78r
2983c3k04J31J68k37J77N2k8k50L71J19j59j20J16o6k91J89J87l34K56K02j75
3004G1q0Pj27p7N7K71k15N9J85J65m99K38m1j5j39J88K17k36l52M07k0j70Q1O4
3028C9l05J45M06m05J47l14L74j28j59K90m2O2j54J52r1M4L2j42j04K32L25k52
$$ plain form
3050 152 -31 195 -185 -301 43 242 -24 -159 252 97 71 -86 197 117 16 162 -56 -46 166 -140 13
3071 13 105 66 -277 -66 125 65 -120 -204 56 -8 -293 -41 43 -273 -22 203 224 323 -103 -8 -87 -118 182 3
3095 3 23 -2 87 -65 -61 167 20 -320 -44 121 203 363 55 230 -46 -57 -83 -229 -60 -214 61 60 68 166 35
3120 35 -306 -126 -40 -114 131 217 96 -90 32 -38 -187 -167 91 -144 77 -39 123 -11 -188 70 -235 -69
3142 -69 135 307 63 63 287 1 -21 13 -78 20 233 -186 74 -158 -130 -44 118 -109 -114 -81 4 188 106 -73 28
3167 28 22 -239 -270 114 102 207 34 218 -119 -107 92 -138 179 -157 187 206 -218 -158 234 1 -64 -3 -46 176
3191 176 154 -215 -33 -109 -191 -134 107 92 52 -25 -149 -141 -22 73 66 -226 9 12 210 57 -349 139 178 -57 -128
3216 -128 405 -36 135 -18 153 -6 -98 -11 73 148 -258 116 -39 52 -107 129 -96 29 -56 -221 66 -178
$$ packed form
3050A52j83K26l80j16L44J99k66j35M11j55k6j57K83q0j01J46k18J0K12l06J53
3071A3R2l9l43K11J91o0j85q4K60o4k85K52Q4l16K51K25K1R9m26R5p9l1L00j79
3095CK0k5Q9j52MK28j47l40K76J65Q2J60l08J75k76j1k6j46J69j54K75jQR8j31
3120C5l41J80Q6p4K45Q6j21j86J22p0j49K0K58k35K21j16J62j34j77K58l05J66
3142f9K04J72k44%K24k86k2L4r1R8K13m19K60k32K8Q6J62k27nL3Q5J84q2j79J01
3167B8ok61l1L84j2J05j73J84l37J2J99k30L17l36L44J9m24O0L92k33o5O1m3K22
3191A76k2l69J82p6q2N7K41j5m0p7j24QJ19R5pk92K35LJ98j53m06M88L9k35p1
3216a28N33m41J71j53J71j59r2Q7Q4P5m06L74j55R1j59K36k25J25q5j65K87k44
$$ plain form
3238 -178 227 44 162 23 20 -38 -107 -206 207 338 -5 101 -134 -34 -31 -61 27 46 -101 31 -88 -254 -40
3261 -40 -7 53 164 -75 -142 107 115 246 124 -226 -42 -67 20 -291 -94 -204 151 -92 148 -235 32 -14 -108
3284 -108 -92 90 -83 3 -98 -89 30 73 -3 -141 -45 75 217 -58 57 -52 168 -148 6 25 -38 44 26 208
3308 208 106 -208 -34 84 -259 154 89 -127 -11 -181 330 84 -314 -10 220 -172 -271 -120 -392 -277 -50
3329 -50 119 -30 46 -121 -78 -75 94 261 -105 -89 183 53 -25 201 -26 76 111 -115 64 42 133 144 -189 81
3353 81 214 75 -137 -174 183 -11 43 42 -181 -119 43 -9 -73 -162 34 -2 131 -59 -8 -16 -71 -267 -177 -119 -154 107
3379 107 47 -84 -131 61 -10 2 -121 125 -216 -56 -201 94 105 -85 31 -73 160 103 256 -13 -253 50
3401 50 191 34 -85 -118 -175 5 239 93 -15 173 -27 162 94 435 173 -193 -13 142 205 105 -2 -207
$$ packed form
3238a78M05j83J18j39ln8o9r9M13J31l43J06k35J00Ll0Q8J9j47J32j19j66K14
3261d0L3O0J11k39o7K49QJ31j22l50J84k5Q7l11J97j10L55k43K40l83K67m6r4
3284a08J6J82j73Q6j01RJ19M3p6j38R6J20J42k75J15j09K20l16J54J9o3Q2j8J82
3308B08j02l14J74J18l43M13o5k16J16j70N11k46l98L04K30l92r9J51k72J15K27
3329e0J69j49P6j67M3LJ69J67l66J6K72j30p8K26k27J02L5k26J79k2R1J1l33K70
3353H1J33j39k12l7L57j94N4jk23O2J62n2o4q9J96l6J33j90N1qn5j96R0N8l5K61
3379A07o0j31m7J92p1J2j23K46l41J60j45K95J1j90J16j04K33n7J53k69k40L03
3401E0J41j57j19l3n7J80K34j46j08J88k00J89o8L41k62l66J80J55O3j00j07k05
$$ plain form
3423 -207 -28 11 -128 -90 169 21 270 252 -21 153 -172 92 -191 -88 249 133 78 131 86 -138 -183 47
3445 47 38 52 21 -258 83 25 51 45 -163 -150 -64 11 97 53 23 85 -126 -113 -270 -276 364 162 36 -53 105 -31 -58
3472 -58 -14 51 62 109 343 189 73 170 -70 82 22 32 60 -74 -122 77 -77 -124 203 -129 -88 130 -34 56
3496 56 -90 -181 43 -170 -68 240 -86 201 -167 262 31 -164 81 40 -181 38 164 -198 -150 -35 358
3517 358 257 155 98 262 85 45 -217 111 199 199 -29 -175 -153 -95 -122 44 -64 -121 172 -1 -77 -183 -48
3540 -48 -192 -383 -84 269 66 95 -13 -126 150 141 108 -28 152 94 70 196 62 -148 73 88 237 123 -87
3563 -87 -9 41 111 187 160 -140 -162 -48 77 97 3 -150 -54 -277 -2 117 -130 -281 52 104 -202 -69 -20 -8
3587 -8 67 295 -42 4 -129 294 -216 -242 166 -14 28 -250 25 209 -196 228 -39 -148 -156 106 441 -292 90
$$ packed form
3423b07J79L9j39L8K59j48K49j8k73J74l25K64k83J03L37j16n5N3m5k24m5K30
3445D7rJ4l1k79L41n8K6ok08J3Q6P5Q6m4l0O2k11J3j57oO40k02j26q9J58j36k7
3472e8M4O5J1M7K34j54j16R7k40J52o0J0K8j34m8J99j54m7L27l32M1K18j64R0
3496E6j46r1K24k13J02L08l26K87l68M29k31j95K45m1k21K19J26l62M8J15L93
3517C58j01j02n7J64j77m0k62L28Q8%k28j46K2N8k7J66j08n7K93j73p6j06J35
3540d8j44j91K99L53k03K9j08j13K76rl3j36J80n8k4J26j34k10K21J5J49j14k10
3563h7P8N0P0P6k7l00k2J14J25K0r4j53R6k23K75J19k47j51L33N2l06J33M9J2
3587hP5K28l37M6j33M23n10k6M08j80M2k78K75J84m05M24k67j09qK62L35p33L82
$$ plain form
3610 90 191 -66 -6 14 -183 -190 169 -29 -170 75 327 162 -44 55 215 187 29 -101 -86 55 46 374 -249
3633 -249 -95 38 312 -29 87 198 -270 -10 -126 -282 98 38 477 114 -226 -53 -350 -211 -143 -150 41
3654 41 1 195 -21 -49 269 -156 -68 -154 257 190 43 -43 46 11 -294 -141 -167 -56 -15 -34 190 81 55 -90
3678 -90 -267 255 -166 104 167 -39 -245 -284 16 -223 -64 234 284 -171 -260 244 67 102 33 129 -76 33 187
3701 187 99 167 68 95 -210 -138 186 22 -68 -88 -30 22 -112 164 -269 -172 318 121 136 -40 84 -105 -51 -58 -142
3726 -142 -34 -123 37 -143 181 -144 -69 -51 27 -47 -10 17 53 205 -9 -103 176 133 69 172 146 -28 21 117 142
3751 142 -263 39 -89 -144 -342 -215 341 -147 -178 102 164 59 277 3 -207 -305 340 11 157 -120 82
3772 82 135 -49 -49 122 -120 53 31 20 -66 14 21 -22 78 51 166 -304 3 -376 -42 -21 189 24 33 47 248
$$ packed form
3610I0J01k57O0K0j97pL59j98j41K45K52j65k06R9J60k8j58j30J5J41rL28o23
3633b49J54J33K74l41J16J11m68K60j16j56L80o0M39l63l40J73k97J39O8pJ91
3654D1m0J94k16k8L18m25Q8q6M11o7j47q6Q9l5l05J53k6J11M1j9K24j09k6j45
3678i0j77N22m21K70O3k06k06l9L00k39J59K98N0m55q9N04j77L5o9R6k05J09J54
3701A87q8O8r9K7l05P2L24j64r0k0N8N2j34K76m33R7M90j97J5j76J24j89N4pq4
3726a42J08q9J60j80L24l25P5J8P8p4L7K7L6J52k14r4K79m3o4J03k6j74M9R6K5
3751A42m05L02j28n5j98J27N56m88l1K80O2j05K18k74k10r8O45l29J46k77K02
3772H2N3j84%J71k42J73k2j1q6Q0Pm3J00k7J15m70L07l79L34K1K10j65RJ4K01
$$ plain form
3797 248 -362 235 130 -47 -308 93 317 278 48 78 176 119 313 -149 131 103 555 -94 234 -80 -74 -225
3819 -225 94 272 -158 -89 33 324 -297 -357 -109 162 125 42 13 170 -3 -87 -45 -209 -254 34 114 -144 -90
3842 -90 9 28 0 -258 -52 -190 260 -169 -14 217 146 119 270 -162 36 -279 -29 -8 -109 97 210 186 -115
3865 -115 -185 -112 -141 -8 -19 219 -17 89 214 111 130 41 16 238 35 -162 32 63 78 5 54 -62 -104 146
3889 146 -11 -331 79 -49 242 160 309 131 -40 29 -31 -313 21 89 -14 -105 114 97 299 139 -142 96
3911 96 -133 -172 305 -59 -204 -155 61 102 -175 178 -28 93 26 -84 170 -145 -133 80 106 -262 -57 -63 -23
3934 -23 -146 123 -221 -242 0 22 2 -1 56 177 -49 211 -5 -15 103 149 -93 81 333 -39 -69 210 20
3957 20 264 138 207 -87 -52 50 270 -8 66 192 171 -73 -96 130 -414 -249 -2 86 -18 38 -110 -89 63
$$ packed form
3797B48o10N97j05j77k61M01K24l9k30L0R8n7J94m62K80k8M52o49L28l14Oj51
3819b25L19J78m30O9J22K91o21o0K48K71l7q3k9J57j73q4M2j64m5K88Q0k58N4
3842i0R9J9k8k58K06j38M50m29J55K31p1k7J51m32J98l15K50K1j01K06J13k4l01
3865a15p0P3k9J33j1K38k36J06J25j03J9q9k5K22k03j97J94L1J5p3M9j16m2K50
3889A46j57l20M10j28K91q2J49j78j71O9o0k82L34O8j03r1K19j7K02j60k81K38
3911I6k29l9M77l64j45M9K16M1k77L53k06J21o7j10K54l15J2K13K6l68K05oM0
3934b3j23K69l44k1K42K2k0lN7J21k26K60k16j0J18M6k42J74K52l72l0K79j90
3957B0K44j26O9k94L5J02K20k78P4J26k1k44k3K26n44J65K47Q8j04N6j48K1J52
$$ plain form
3980 63 -28 203 202 192 -23 -79 37 -20 -29 75 70 11 -256 18 -10 -178 -9 -108 -115 23 -56 -77 171 -139 -294 19
4006 19 86 265 95 -48 70 114 182 199 -2 206 -45 -76 130 43 48 12 335 161 -117 -89 -132 -349 -161 -101
4030 -101 83 83 9 81 180 -49 -123 -76 -66 -100 47 21 -9 69 98 -248 -155 46 -229 -35 -7 393 144 -33 45
4055 45 183 -81 317 296 -26 374 -47 12 -67 69 9 -79 -77 133 -14 -151 79 -186 3 -87 102 76 -174
4078 -174 127 -47 -139 125 165 92 22 211 -353 -34 301 66 -348 -207 108 -36 -3 111 254 285 -35 -6
4100 -6 -33 -116 -79 18 213 111 -105 204 97 14 17 49 -87 -55 -144 -270 166 404 167 -57 -113 172 -28 -193
4124 -193 100 -40 174 11 56 -233 -89 -42 212 85 228 129 -164 -49 86 -49 140 168 -58 -22 -117 293
4146 293 17 -394 -34 137 -52 -37 122 -97 203 -32 89 -24 -417 152 -7 154 -70 87 126 175 51
$$ packed form
3980F3r1K31jj0k15n6J16n7rJ04nn9k67K74k8j68J69r9pJ38p9k1K48l10j55L13
4006A9O7J79j70j43J18M4O8J7k01K08k51l1K06q7Nl6L23j74k78K8m3k17J88O0
4030a01J84%p4P2R9k29p4M7J0l4J47k6l0P8K9l46R3K01k75J94K8M00k49j77P8
4055D5J38k64L98k1l22M00m21N9p9J36o0q8KK10j47j37K30k65J89r0J89k6k50
4078a74L01j74r2K64M0p3p0J89n64L19L35k35m14J41L15j44L3J14J43L1l20K9
4100fk7q3L7R7J95j02k16L09j07q3LL2j36L2q9j26M36K38k37k24n6K85k00j65
4124a93K93j40K14j63M5k89J44M7K54j27J43r9k93J15J35j35J89K8k26L6r5M10
4146B93k76m11L60J71j89J5J59k19L00k35J21j13l93N69j59J61k24J57L9M9j24
$$ plain form
4167 51 -31 174 -104 138 -16 -26 -174 172 -148 143 122 -287 -298 158 -123 -121 111 216 62 251 221 -90 32
4190 32 -15 25 -215 -5 -207 17 -136 -178 135 -20 275 21 45 -96 150 60 51 56 -53 191 -251 -121 95
4213 95 -268 -283 91 -108 41 124 325 46 173 -267 -15 -263 -141 -28 -10 68 315 -53 -54 18 50 -102 -132
4236 -132 -22 4 64 -91 -224 -1 26 -70 -175 -15 58 37 72 -44 148 -66 -110 -192 -144 251 -3 98 225
4259 225 166 -86 38 57 114 92 -18 -126 -139 -390 -268 130 282 51 -112 -14 -22 14 -13 4 91 -109 -149 -112 91
4284 91 -179 -11 185 125 160 -158 -61 226 -149 213 352 103 -126 -103 198 169 201 301 140 228 141 79 99 23
4308 23 -77 96 174 86 -33 65 127 128 -58 97 54 22 -286 13 42 101 132 106 38 -121 138 -107 -130 18 -46
4333 -46 -138 -189 -124 67 48 -190 7 85 -17 49 -62 116 212 208 -166 -23 -81 -124 -6 -8 79 -323 -131 70 -137
$$ packed form
4167E1q2K05k78K42j54j0j48L46l20K91k1m09j1M56k81KK32J05j54J89l0l11J22
4190C2m7M0k40K10k02K24j53m2L13j55K95k54K4j41K46r0rNj09K44m42J30K16
4213I5l63j5L74j99J49Q3K01k79J27m40K52k48J22J13J8P8K47l68jP2L2j52l0
4236a32J10K6O0j55j33K23K7r6j05J60P3k1L5j16J92k14m4q2M8L95k54J01J27
4259B25n9k52J24J9N7k2j10j08j3k51J22L98J52k31j63R8qL6k7J7Q7k00m0L7K03
4284I1k70J68J96o0L5l18R7K87l75L62J39k49k29K3L01k9L2J00j61Q8q7o2K0p6
4308B3j00J73P8q8j19R8O2Jj86J55m3l2l08K99K9N9L1k6o8j59K59k45k3J48o4
4333d6r2n1O5J91j9k38J97P8j02O6j11J78R6ml74J43n8m3J18kQ7m02J92K01k07
$$ plain form
4358 -137 -259 -188 194 49 165 -231 126 -55 -188 -49 -75 214 -54 -53 80 -29 164 -244 152 -147 -269
4379 -269 62 -11 73 -20 43 214 -42 -46 151 253 61 -49 24 4 -353 71 -347 88 25 301 134 95 200
4402 200 -138 -109 -86 -120 -151 -44 -49 -112 -31 54 -117 -30 -163 189 157 -97 -103 -198 -5 -77 -16 20 169 57 -72 -247
4428 -247 -137 185 17 8 369 -43 -76 71 -49 -17 163 -23 -52 -51 -58 -106 -135 -42 114 -399 47 198 54 -90
4452 -90 172 -22 8 -247 296 29 227 -77 200 120 -87 -16 72 -43 60 -150 -262 185 -40 27 -22 -358
4474 -358 -47 117 -23 -10 127 -97 -76 -33 1 14 -62 161 -7 -174 -98 209 73 -26 7 137 78 19 -1 22
4498 22 101 59 -170 -148 -37 152 114 48 112 163 -227 -193 -6 -61 9 12 220 -179 -308 82 -178 87 146 -6 81
4523 81 164 151 -161 -38 120 -126 73 11 40 -168 -14 78 -16 24 -170 167 261 19 31 312 3 291 -215
$$ packed form
4358a37j22P1L82j45J16l96L57j81j33J39k6K89k68JJ33j09J93m08L96k99j22
4379b69L31p3Q4r3O3J71k56mJ97J02j92j10P3k0l57M24m18M35o3K76j67l9J05
4402B00l38K9K3l4l1J07no3Q1Q5j71Q7j33L52l2k54or5J93p2O1L6J49j12j29j75
4428b47J10L22j68rL61m12l3J47j20L2J80j86k9Jpm8k9R3J56n13M46J51j44j44
4452i0K62j94L0k55N43k67J98l04K77q0k07P1Q8j15J03k10j12M47k25O7m9l36
4474c58L11J64j40J3J37k24K1M3L4J3p6K23j68j67P6L07j36r9L3J30n9n9k0K3
4498B2P9m2k29K2J11J89l8o6O4N1l90L4J87n5P0LK08l99j29L90k60K65N9j52Q7
4523H1Q3j3l12J23J58k46J99o2K9k08J54R2r4M0j94L37R4k42J2K81l09K88n06
$$ plain form
4546 -215 -161 13 124 -162 210 -204 110 -18 79 65 -68 -163 168 84 -132 186 -231 -11 -190 192 85 72
4568 72 19 5 -8 16 289 185 -142 85 148 43 -130 -20 33 -285 -81 99 276 37 -199 179 83 130 43
4591 43 -230 -307 78 -39 159 -28 289 92 64 58 -4 -70 -174 452 112 -165 252 -60 -250 -207 -223 29 -191
4614 -191 -15 196 38 -47 158 -117 -131 -53 99 200 268 229 72 -258 -97 206 -224 87 104 -449 27 413
4636 413 -164 -538 -95 352 -133 132 522 27 -161 -56 102 -447 107 -228 -174 46 -133 176 48 -34 100
4657 100 -98 -277 -220 15 -119 42 275 93 21 92 -58 -124 -7 101 161 134 -45 87 -42 -222 283 136
4679 136 -14 162 28 -251 129 -101 -272 -288 23 -97 -327 54 137 12 -94 112 27 -122 247 243 25 -135
4701 -135 46 115 -271 57 112 -62 -23 55 334 100 -145 -31 229 -191 -285 -86 -65 72 -113 -54 78 -22
$$ packed form
4546b15N4J74J11k86L72m14L14j28R7j4j33r5L31q4k16L18m17K20j79L82j07j3
4568G2n3j4j3K4K73j04l27K27O3j05j73J10N3l18K04J80J77k39k36L78r6M7q7
4591D3k73p7L85j17J98j87L17j97k8oo2o6j04O26l40k77M17l12j90M3j6K52k20
4614a91J76K11j58q5K05k75j4P8J52J01O8l9j57l30J61L03m30L11J7n53M76L86
4636D13n77l74M43M47m85K65L90m95j88J05J58n49N54l35N4K20j79L09j28q2J34
4657A00j98j79N7K35j34J61K33j82p2P1j50o6J17J08O0k7j79J32j29j80N05j47
4679A36j50J76j34k79L80k30j71j6L11j20k30L81Q3j25j06K06q5j49L69mk18j60
4701a35J81O9l86L28N5j74L9P8K79k34k45J14K60m20r4J99K1J37j85N9J32j00
$$ plain form
4723 -22 49 44 251 151 60 -153 104 294 -170 -229 -145 -72 -220 -192 -75 24 186 -111 85 -58 63 -307 248
4746 248 154 231 -20 -205 89 -12 -53 97 -59 -101 -67 68 -101 -160 -207 105 194 -4 246 55 104 -212 40
4769 40 256 44 170 215 89 31 -285 -267 -131 -195 -241 -5 66 25 85 6 -72 -84 -54 188 161 90 -173 109 -146
4794 -146 -145 -8 -16 -20 -158 23 -205 -279 -182 -82 220 -156 -14 61 -89 203 -31 240 22 -3 439 53 92 -105
4818 -105 63 -53 -42 -101 97 89 -84 -221 -77 -19 54 181 25 -11 -29 -31 5 104 328 -55 134 -2 105 -69
4842 -69 95 -43 -105 359 -116 -296 -52 -122 -58 -360 -141 69 123 -136 79 123 -288 17 -169 -5 95 -103
4864 -103 -92 195 -246 -83 225 37 213 -34 -1 -84 -148 -74 -80 101 -49 45 422 143 -66 -84 88 13 -87
4887 -87 37 99 62 -67 -297 70 338 91 -24 222 188 95 -142 -10 -20 87 22 -6 113 -70 58 146 -157
$$ packed form
4723b2P1nK07j00r1k13K57J90m64n9Q4P3j48K8J17R9J62k97J96j43J21l70N55
4746B48r4P7k51j85K94j01m1J50j56m2L4J35j69n9m7L12Q9j98K50j91M9l16K52
4769D0K16k12J26M5j26n8l16J8J36o4m6K36P1m1O0p9p8j2L0K42k7p1k63K82k55
4794a46JJ37qmj38J81k28p4R7J00L02l76J42P5j50K92k34K71k18k5M42l86L9j97
4818a05J68j16J1n9J98qj73j37J44N8P3J27j56l6j8kL6R9K24l83J89j36J07j74
4842f9J64j38o2M64m75j80K44p0O4l02K19K10N4k59K15M4m11L05j86J64J00j98
4864a03J1K87m41J63L08j88J76k47L3q3o4P4oJ81j50R4L77k79k09j8J72p5j00
4887h7J24O2l7j29k30L67K68k47j15K46l4r3k37J32j0J07o5k8J19j83J28Q8l03
$$ plain form
4910 -157 22 -281 155 58 -208 89 61 -187 -100 16 -240 -128 2 -101 33 -7 99 74 249 -356 76 150
4932 150 306 -104 120 -84 54 -102 -192 14 -218 124 -70 -280 158 182 258 42 -35 4 337 -163 -155 -61 134
4955 134 -50 9 -16 -68 -183 9 164 -107 83 -142 264 204 174 19 188 -199 -129 198 97 88 3 -240 -40
4978 -40 -265 -138 -157 21 46 -239 -169 -349 -135 65 19 -33 162 -63 64 -115 -35 257 201 208 -187 -147 227 -75
5002 -75 6 -110 132 19 31 -77 240 265 -58 12 113 146 133 -20 37 -80 126 181 -36 52 -131 -88 -110 -155
5026 -155 -86 -196 -62 133 -166 227 -119 -255 -170 25 -117 40 160 -250 41 218 179 -147 -19 -68 -139 27
5048 27 -34 91 -64 82 149 -182 222 -221 -5 90 2 295 187 69 -23 62 -381 -97 -27 -215 -244 -149 -172 -82
5072 -82 32 174 124 -300 -68 24 -36 -56 -62 305 -147 -243 -186 159 -51 281 -210 -112 -37 131 -295 -54 109 -59
$$ packed form
4910a57J79l03M36r7k66K97k8k48Q7J16k56J12J30j03J34m0J06k5J75o05M32P4
4932A50J56m10K24k04J38j56r0K06k32L42j94k10M38K4P6k16p7L9L33n00QR4J95
4955A34j84N9k5n2j15J92J55k71J90k25M06o0l0j55J69l87P0L27j01rq5k43K00
4978d0k25J27j9J78K5k85P0j80K14K00m6n2J95k25J27j79Q0K92n6Pl95M0L74l02
5002g5Q1j16K42j13J2j08L17K5l23P0J01L3j3j53N7j17K06N5k17Q8j83M3k2m5
5026a55O9j10J34J95k99L93l46j36Q5J95j42J57J20m10K91J77l9l26J28m9p1J66
5048B7o1J25j55J46O7l31M04m43K16R5q8K93j08j18r2Q5m43K84P0j88k9R5k3R0
5072h2J14J42n0m24K32R2o0k0oL67m52r6N7L45k10L32m91R8P5J68m26K41J63j68
$$ plain form
5096 -59 -267 -105 150 -108 34 -312 -95 -365 75 73 161 372 -263 17 17 33 161 -311 142 -180 -322 174
5118 174 74 -126 -138 74 230 -13 87 239 -209 5 37 -54 -98 -182 247 -24 62 92 226 -303 -205 216 190
5141 190 71 415 147 -163 -108 101 140 187 -2 261 267 42 207 241 290 29 -197 -16 207 60 -128 -62 -175
5164 -175 75 -269 45 349 48 -62 205 227 -47 120 -16 -104 -55 132 -30 -260 127 -98 -141 -315 -88
5185 -88 -129 9 -223 -71 22 38 -277 -111 72 123 -173 60 275 73 -98 -345 6 48 -47 -34 137 17 -194
5208 -194 59 -38 -3 49 -176 38 -37 -118 33 -38 198 -21 22 111 37 64 -57 -141 270 -98 33 2 162 -65
5232 -65 64 180 293 -52 97 -133 187 1 -14 -64 182 75 233 -45 79 -75 172 192 -127 186 -125
5253 -125 44 -100 150 173 31 103 199 -171 22 -101 -147 -18 -121 132 -131 216 -98 -25 -153 -141 -93 -202
$$ packed form
5096e9k08J62K55k58J42l46K17k70M40kQ8K11o35K80%J6J28m72M53l22j42M96
5118A74j00k00j2K12J56k43J00J52m48K14L2r1m4q4M29k71Q6L0J34n29R8M21k6
5141A90j19L44k68l10N5K09L9M7j89K63Ok25J65L4M9k61k26J81K23j47j88O6j13
5164a75K50l44L14L04l01j10K67K2k74J67j36q8M9J87j62k30L87k25m3j74K27
5185h8m1J38k32J52R3J6l15J66J83N1k96K33K15k02j71k47L51M2r5J3J71j20k11
5208a94K53r7L5N2k25K14p5q1J51p1K36k19M3Q9p4K7j21q4M11l68J31l1J60k27
5232f5J29J16J13l45J49k30L20j86j5n0K46j07J58k78J24j54K47K0l19L13l11
5253a25J69j44K50K3j42P2R6l70J93j23m6J29j03K53k63L47l14P3j28J2M8j09
$$ plain form
5275 -202 -387 53 78 201 96 203 148 -274 -102 -65 16 -37 227 1 -65 47 60 133 -85 -37 -241 36 114
5298 114 -96 -39 115 37 73 -179 -182 -19 93 -75 -139 -56 -120 -107 202 -157 -152 61 69 -2 2 -301 94 -199 -64
5323 -64 -275 -127 155 -191 -56 -38 51 -94 86 -84 58 180 197 78 -116 68 -2 47 -38 139 248 -73
$$ packed form
5275b02j85M40K5J23j05J07n5m22J72L7Q1n3K64k26o6J12J3P3k18M8k04K77P8
5298A14k10N7J54p8L6k52lJ63J12j68o4Q3o4J3L09l59NK13Qp1Ml03L95k93J35
5323f4k11J48K82l46J35J8Q9j45J80j70J42J22J7j19j94J84p0M9q5J77J09l21
$$ [...]
8191E9
##END NTUPLES=NMR FID
##END=
