##TITLE=1H_Ser Am-iBu
 CDCl3, 8 sc, 
 31.8.2021
##JCAMPDX= 6.0         $$ Bruker NMR JCAMP-DX V2.0
##DATA TYPE= NMR FID
##DATA CLASS= NTUPLES
##ORIGIN= UXNMR, Bruker Analytische Messtechnik GmbH
##OWNER= root
$$ XWIN-NMR		Version 3.5
$$ Wed Sep  1 08:37:31 2021 Russian Standard Time (UT+4h)  she@DPX200
##.OBSERVE FREQUENCY= 200.131506
##.OBSERVE NUCLEUS= ^1H
##.DELAY= (6, 6)
##.ACQUISITION MODE= SIMULTANEOUS
##.ACQUISITION SCHEME= undefined
##.AVERAGES= 8
##.DIGITISER RES= 18
##SPECTROMETER/DATA SYSTEM= spect
##.PULSE SEQUENCE= zg30
##.SOLVENT NAME= CDCl3
##.SHIFT REFERENCE= (INTERNAL, CDCl3, 0, 15.7039)
##AUDIT TRAIL= $$ (NUMBER, WHEN, WHO, WHERE, WHAT)
$$ ##TITLE= Audit trail, XWIN-NMR		Version 3.5
$$ ##JCAMPDX= 5.01
$$ ##ORIGIN= Bruker BioSpin GmbH
$$ ##OWNER= she
$$ F:/spectra/data/she/nmr/H-F/1/audita.txt
$$ ##AUDIT TRAIL=  $$ (NUMBER, WHEN, WHO, WHERE, WHAT)
(   1,<2021-09-01 08:36:14.90 +0400>,<she>,<DPX200>,
      <created by zg, POWCHK disabled, PULCHK disabled
       configuration hash MD5:
       00 E9 B6 7A A2 85 ED C7 34 08 36 98 17 FE 4E 26
       data hash MD5: 16K
       D6 07 5D E0 78 8F 70 4F EB 56 82 3B 81 D7 BC 73>)
$$ ##END=
$$ 
$$ hash MD5
$$ A6 7F 36 EB E8 77 94 4E 76 33 71 50 CD 95 EF BE
##$RELAX= 
##$RELAX= 
##$RELAX= 
##$RELAX= 
##$RELAX= 
##$RELAX= 
$$ Bruker specific parameters
$$ --------------------------
##$DU= <F:/spectra>
##$EXPNO= 1
##$NAME= <H-F>
##$PROCNO= 1
##$TYPE= <nmr>
##$USER= <she>
##$AMP= (0..31)
100 100 100 100 100 100 100 100 100 100 100 100 100 100 100 100 100 100 
100 100 100 100 100 100 100 100 100 100 100 100 100 100 
##$AQSEQ= 0
##$AQ_mod= 1
##$AUNM= <au_zg>
##$AUTOPOS= <>
##$BF1= 200.13
##$BF2= 200.13
##$BF3= 200.13
##$BF4= 200.13
##$BF5= 200.13
##$BF6= 200.13
##$BF7= 200.13
##$BF8= 200.13
##$BYTORDA= 1
##$CFDGTYP= 0
##$CFRGTYP= 5
##$CHEMSTR= <none>
##$CNST= (0..31)
1 1 145 1 1 1 1 1 1 1 1 1 1 1 1 1 1 1 1 1 1 1 1 1 1 1 1 1 1 1 1 1 
##$CPDPRG= <>
##$CPDPRG1= <>
##$CPDPRG2= <>
##$CPDPRG3= <>
##$CPDPRG4= <mlev>
##$CPDPRG5= <mlev>
##$CPDPRG6= <mlev>
##$CPDPRG7= <mlev>
##$CPDPRG8= <mlev>
##$CPDPRGB= <>
##$CPDPRGT= <>
##$D= (0..31)
0 1.2 0 0 0 0 0 0 0 0.06 0 0.03 0 0 0 0 0.0002 0 0 0 0 0 0 0 0 0 0 0 0 
0 0 0 
##$DATE= 1630470974
##$DBL= (0..7)
120 120 120 120 120 120 120 120 
##$DBP= (0..7)
150 150 150 150 150 150 150 150 
##$DBP07= 0
##$DBPNAM0= <>
##$DBPNAM1= <>
##$DBPNAM2= <>
##$DBPNAM3= <>
##$DBPNAM4= <>
##$DBPNAM5= <>
##$DBPNAM6= <>
##$DBPNAM7= <>
##$DBPOAL= (0..7)
0.5 0.5 0.5 0.5 0.5 0.5 0.5 0.5 
##$DBPOFFS= (0..7)
0 0 0 0 0 0 0 0 
##$DE= 6
##$DECBNUC= <off>
##$DECIM= 32
##$DECNUC= <off>
##$DECSTAT= 4
##$DIGMOD= 1
##$DIGTYP= 9
##$DL= (0..7)
0 120 120 120 120 120 120 120 
##$DP= (0..7)
150 150 150 150 150 150 150 150 
##$DP07= 0
##$DPNAME0= <>
##$DPNAME1= <>
##$DPNAME2= <>
##$DPNAME3= <>
##$DPNAME4= <>
##$DPNAME5= <>
##$DPNAME6= <>
##$DPNAME7= <>
##$DPOAL= (0..7)
0.5 0.5 0.5 0.5 0.5 0.5 0.5 0.5 
##$DPOFFS= (0..7)
0 0 0 0 0 0 0 0 
##$DQDMODE= 0
##$DR= 18
##$DS= 0
##$DSLIST= <SSSSSSSSSSSSSSS>
$$ [...]
##$SUBNAM2= <"">
##$SUBNAM3= <"">
##$SUBNAM4= <"">
##$SUBNAM5= <"">
##$SUBNAM6= <"">
##$SUBNAM7= <"">
##$SUBNAM8= <"">
##$SUBNAM9= <"">
##$SW= 20.0188882624521
##$SWIBOX= (0..15)
0 0 2 0 0 0 0 0 0 0 0 0 0 0 0 0 
##$SW_h= 4006.41025641026
##$TD= 16384
##$TD0= 1
##$TE= 0
##$TE2= 300
##$TE3= 300
##$TEG= 300
##$TL= (0..7)
0 120 120 120 120 120 120 120 
##$TP= (0..7)
150 150 150 150 150 150 150 150 
##$TP07= 0
##$TPNAME0= <>
##$TPNAME1= <>
##$TPNAME2= <>
##$TPNAME3= <>
##$TPNAME4= <>
##$TPNAME5= <>
##$TPNAME6= <>
##$TPNAME7= <>
##$TPOAL= (0..7)
0.5 0.5 0.5 0.5 0.5 0.5 0.5 0.5 
##$TPOFFS= (0..7)
0 0 0 0 0 0 0 0 
##$TUNHIN= 0
##$TUNHOUT= 0
##$TUNXOUT= 0
##$USERA1= <user>
##$USERA2= <user>
##$USERA3= <user>
##$USERA4= <user>
##$USERA5= <user>
##$V9= 5
##$VALIST= <valist>
##$VCLIST= <CCCCCCCCCCCCCCC>
##$VD= 0
##$VDLIST= <DDDDDDDDDDDDDDD>
##$VPLIST= <PPPPPPPPPPPPPPP>
##$VTLIST= <TTTTTTTTTTTTTTT>
##$WBST= 1024
##$WBSW= 4
##$XGAIN= (0..3)
0 0 0 0 
##$XL= 0
##$YL= 0
##$YMAX_a= 564148
##$YMIN_a= -745260
##$ZGOPTNS= <>
##$ZL1= 120
##$ZL2= 120
##$ZL3= 120
##$ZL4= 120
##$ABSF1= 10
##$ABSF2= 0
##$ABSG= 5
##$ABSL= 3
##$ALPHA= 0
##$AQORDER= 0
##$ASSFAC= 0
##$ASSFACI= 0
##$ASSFACX= 0
##$ASSWID= 0
##$AUNMP= <proc_1d>
##$AZFE= 0.1
##$AZFW= 0.1
##$BCFW= 1
##$BC_mod= 2
##$BYTORDP= 1
##$COROFFS= 0
##$CY= 11.3945322036743
##$DATMOD= 1
##$DC= 2
##$DFILT= <>
##$DTYPP= 0
##$F1P= 2.36226072786647
##$F2P= -0.459571619588291
##$FCOR= 0.5
##$FTSIZE= 0
##$FT_mod= 4
##$GAMMA= 1
##$GB= 0.15
##$INTBC= 1
##$INTSCL= 1
##$ISEN= 128
##$LB= 0.24
##$LEV0= 0
##$LPBIN= 0
##$MAXI= 10000
##$MC2= 0
##$MEAN= 0
##$ME_mod= 0
##$MI= 1.114404
##$NCOEF= 0
##$NC_proc= 0
##$NLEV= 6
##$NOISF1= 3.799351
##$NOISF2= 2.8
##$NSP= 1
##$NTH_PI= 0
##$NZP= 0
##$OFFSET= 15.70392
##$PC= 1
##$PHC0= -13362.03
##$PHC1= 14.80098
##$PH_mod= 1
##$PKNL= yes
##$PPARMOD= 0
##$PSCAL= 0
##$PSIGN= 0
##$REVERSE= no
##$SF= 200.130013532006
##$SI= 16384
##$SIGF1= 3
##$SIGF2= 2
##$SINO= 400
##$SIOLD= 16384
##$SREGLST= <1H.CDCl3>
##$SSB= 0
##$STSI= 0
##$STSR= 0
##$SW_p= 3612.71676300578
##$SYMM= 0
##$S_DEV= 0
##$TDeff= 0
##$TDoff= 0
##$TI= <>
##$TILT= no
##$TM1= 0
##$TM2= 0
##$TOPLEV= 0
##$USERP1= <user>
##$USERP2= <user>
##$USERP3= <user>
##$USERP4= <user>
##$USERP5= <user>
##$WDW= 1
##$XDIM= 8192
##$YMAX_p= 0
##$YMIN_p= 0
$$ End of Bruker specific parameters
$$ ---------------------------------
##NTUPLES= NMR FID
##VAR_NAME=  TIME,          FID/REAL,        FID/IMAG
##SYMBOL=    X,             R,               I
##VAR_TYPE=  INDEPENDENT,   DEPENDENT,       DEPENDENT
##VAR_FORM=  AFFN,          ASDF,            ASDF
##VAR_DIM=   8192,          8192,            8192
##UNITS=     SECONDS,       ARBITRARY UNITS, ARBITRARY UNITS
##FACTOR=    0.0002496,     1,               1
##FIRST=     0,             0,               0
##LAST=      2.0444736,     0,               0
##MIN=       0,             -745260,         0
##MAX=       2.0444736,     564148,          0
$$ Real data points
##PAGE= N=1
##DATA TABLE= (X++(R..R)), XYDATA
0@%%%%%%%Qj6J6j6J6k4L2m0N6p2Q8j04J22j46J76k10K50k95L45m03M67n38O19
30C31p12Q14r24J050j191J343j510J695j896K116k360K627k917L231l578L958
46B077m369M820n314N857o453P107p831Q637r535J0541j1678J2978j4475J6222
60H584j8297K0803k3902K7852l3084M0381n1340O9835j08826L30314n25249m49074
72g12003J037482J23728o80453l4744N40983j74672l47140J59461K83191r2699
82A03134j19910j07865m5439K32452K64545l16535l67904K96606L61337k88636
92A1785k16294K80731O8677l04649K7745K74627j9038j73606k7081j5744O7658
103b5189K09091o0340l40038M5805L54691o1765k85931J35407J88621k23113j20100
$$ y = [0, 0, 0, 0, 0, 0, 0, 0, 8, -8, 8, -8, 8, -16, 16, -24, 32, -40, 48, -56, 66, -80, 96, -114, 136, -159, 186, -217, 250, -288, 331, -381, 433, -491, 559, -632, 711, -799, 896, -1000, 1116, -1244, 1383, -1534, 1697, -1881, 2077, -2292, 2528, -2786, 3071, -3382, 3725, -4106, 4531, -5004, 5537, -6141, 6837, -7638, 8584, -9713, 11090, -12812, 15040, -18044, 22337, -29003, 40832, -67994, 262320, -262929, -712003, 325479, 449207, -231246, -265990, 274993, 100321, -246819, -87358, 195833, 103134, -16776, -124641, -170080, 62372, 326917, 10382, -357522, -60916, 300421, 11785, -204509, 76222, 144899, -159750, -132005, 142622, 123584, -50022, -77103, -92847, -25189, 183902, 123562, -216476, -170671, 184020, 122255, -163676, -28269, 160352, -62761, -182861]
114a82861K59541R0658j97771p4659N7710M0653R6665J2569j97985m7653K25653
125H2520K1328k02470P5635J73690k07169j54860L13008J27145l49015n1097L16128
136A44843q7325k44224K54454J73568l87414j15849M38080N7084m00400K2841
146a44342L13205j19902k24001J98722J61369k19415j16659J67414O4562o4405
156A6548M443m3783p0107J16779R7096j47242o3733J53581j6993j61532J05085
167i858J72662j60555j67151J65686J21407j36591l6418J00964o0209p6686J27660
178D0911N4499j38833j9872R9372l5469m1501R3670k245j27600K0326J15912k7052
190C2118o1283L7878q130n7798N8733P1434p5718n5814O7170K171n2709P4735
$$ y = [-182861, 76680, 167338, -30433, -105092, -47382, -6729, 89936, 102505, -95480, -143133, 82520, 103848, -98622, -22987, 150703, -56466, -211326, 101682, 228827, -120188, -171285, 144843, 57518, -186706, 67748, 241316, -146098, -261947, 176133, 233217, -167183, -144342, 168863, 48961, -175040, 23682, 185051, -34364, -151023, 16391, 80953, 16548, 20991, -22792, -92899, 23880, 120976, -26266, -89999, 63582, 46589, -114943, -9858, 162804, 2249, -164902, 784, 122191, -14400, -50818, 50146, -10063, -86749, 40911, 95410, -43423, -63295, 36077, 608, -40893, 52777, 50532, -77068, -56742, 59170, 32118, -29165, 8713, 583, -57215, 1518, 72952, -2766, -58580, 8590, 10761, -41948, 32787]
202C2787M1888j42531k8627J75270k520j68888O0442J40880j33672j11705J95441
213E8765R0132k17624p0712J95824M3980j45958o674R4355k6321n7025L5829L3786
225B8357r489j2747m1643j4291R4612M4069j27682n9622J36513M7714j28797j0618
237e3624J18473l3380j10564O2813R6993o5091o6405M7349J4395k1578M3480J237
249C4098q5804J1636R7316k4832q1139M5270N2233o8502l0090Q0746K1506p0850
261a8412k2600L8428K0138L558q775m1200k497O1531J26o5972K0795O3683n5074
274f271o3154Q5301O2399r7691n3568Q7350L0822o3799J542M0194l1907k3697
286c2479M5835J2375l9448K246J8872k2755L032M1218j3703m9486J4582M1305
$$ y = [32787, 74675, -67856, -96483, 78787, 76267, -92621, -32179, 108701, -24971, -136676, 58765, 148897, -68727, -139439, 56385, 100365, -45593, -52267, 42088, 15767, -41258, -5429, 28357, 18868, 6121, -35522, -49813, 44799, 88868, -38814, -98436, 38077, 85791, -43006, -53624, 64849, 31469, -79095, -16282, 80711, 15620, -50785, -3436, 10959, -10619, 32861, 34098, -51706, -40070, 57246, 32414, -48725, -3455, 48778, -19724, -49814, 30932, 52438, -18412, -41012, -2584, 17554, 21112, 12337, -28863, -31360, 30171, 30297, -35675, -14880, 48803, -6271, -69425, 15876, 78275, -19416, -72984, 14366, 45188, -18611, -17069, 23125, -8782, -32479, 13356, 25731, -13717, -11471, 7401, -15354, -12322, 28896, 15193, -34293, -19711, 21594]
298B1594j3210j7730J5013q834j9624K7189J9910l1652q375K8489j5178k5422
310b7830M4012K5825o4975k4546P0352J6870o0702k72M6624k0454l4165L4435
322E174K7067l3523k0418J8299J0880K302K035j7041j2956K2779J5397k3208n331
335h544K3230j0799k6832K3831L2148k8858l1709K5785K0549k0151r46J5024j8005
348e277j3391K8019R603k6538q35J7993j4050r175K8027L908l3177l580K7051
361H578K544j4720K169K073r404M660J3222n835r317M085q78n378J2440J0162
375A4401k0608j4357K2312J2112j9127k512J4869r157j3887J8356J3655j9197
387c140j1856J4188M896n854M328K2j0783J550J1432m46o204K486j350p308O665
$$ y = [21594, 8384, -9346, 5667, -3167, -22791, 4398, 24308, -7344, -15719, 12770, -2408, -27830, 16182, 42007, -22968, -47514, 22838, 39708, -20994, -21266, 25358, 4904, -29261, 5174, 32241, -1282, -21700, -3401, 7479, 9781, 11816, -5225, -18181, 4598, 19995, -3213, -8544, 14686, 3887, -22945, 886, 33034, 4176, -27533, -1748, 18801, -1350, -2296, 12728, -5277, -18668, 9351, 18954, -7584, -8419, 9574, -4476, -13651, 14376, 18284, -14893, -18473, 8578, 11122, -3598, -1429, 644, -8760, -4100, 9122, 3287, -6030, -1945, -2823, -8201, 4239, 14401, -6207, -20564, 1748, 13860, -5267, -7779, 7090, -2067, -15954, 2402, 16057, -3140, -14996, -808, 4088, -1766, 2562, 2584, -8199, -6649, 4783, 4337, -1867, 619, -731, -8039, -1374]
402a374J2661o456j4151K793J1178M44m185L05k945k262O812K309n671K064L501
417E023r808m132J9126P043k4072r576K2328J0705j6556r286J0490P345p726p942
431g038O968J3342o903k0877L880K7020J602k9221q191K6881J2688k4551j2778
444a7178K2865J0428k2999r787K3330J0572k0748j2673J2593J4908k301j5311
456f301p395J3157J2992j1348j3869R515J4255j0353j5625J0890J8759r373k1726
469a6422N025K2573n52j9102k986J3647L074p525j841M233m56j202J244k535O09
484b216P685k290j2758J549J7230K786j9773o923J8722J0730j5253j2050J2396
497a65J0524r092q207L996Q089M778j0290j5480J3188K7448j4459l7650J2514
$$ y = [-1374, 11287, 4831, -9320, -6527, 4651, 5095, 910, 1215, -1730, -3992, 2820, 5129, -542, 1522, 5023, -4785, -8917, 10209, 17252, -6820, -16396, 5932, 16637, 81, -9205, 1285, 8630, 904, -7038, -70, 13272, 6369, -14508, -10628, 16392, 17994, -11227, -19418, 7463, 20151, -4400, -17178, 5687, 16115, -6884, -16671, 6659, 17231, -3517, -16190, -3597, 11311, 9010, -6301, -13696, -539, 12453, 1105, -12764, -3249, 11006, 653, -14972, -4082, 14677, 5304, -16422, -11397, 11176, 10624, -8478, -11464, 2183, 5257, -2268, -4109, 124, -332, -1534, -290, -2825, -2216, 5469, 3179, -9579, -8030, 9200, 11986, -7787, -14710, 4012, 14742, -511, -12561, -165, 10359, 1267, -6940, -2944, 5145, 9923, -367, -15847, -2659, 24789, 10330, -27320, -14806]
510a4806M5810r352n0947P104N4122n685n7354O238N9070o150n7772L259N2647
523B6184J928m3203q638L1214J3648j8559j7989O555K2340L042k7546j1952L3131
536A0155K0927l8636l0015M1867L7049m2105m0866L8838M1766l5480m0396L2668
548d228L6236k9922l1574K5679K5879j7944k1094R487J4230j19p808o321N86J0764
562C851M963j3375r494J6914J2470k2672j2144K8228R368l0619m540K9334j860
575A0424k4501R988J8493j9272j2327K8334P634l6674k758M5184m547n0264J3108
588a7178N2608k1001n1561K6417M7855k6844m1394K3402L3137j7555k3144J0189
600e069J3096k051l434p213m976J8378J1586l0427j5685L9724J9927m6739k2881
$$ y = [-14806, 31004, 21652, -29295, -22191, 31931, 26246, -31108, -24870, 34200, 28050, -29722, -26463, 26184, 28112, -15091, -23729, 7485, 21133, 2574, -15415, -8860, 13480, 16522, -11024, -22976, 10155, 31082, -7554, -37569, 4298, 41347, -758, -41624, -2786, 38980, 3500, -36896, -4228, 32008, 2086, -29488, -3809, 22070, 4126, -16968, -7481, 6749, 6630, -1178, -7499, -6913, 3851, 8814, -4561, -14055, 2859, 15329, -7343, -19487, 8741, 18109, -12510, -17050, 12284, 10424, -14077, -4089, 14404, -4868, -17195, 11139, 18773, -17901, -20659, 24525, 19978, -30286, -17178, 35430, 14429, -37132, -10715, 37140, 10296, -31098, -7696, 25441, 7886, -15258, -5069, 8027, 5976, 2542, -4671, -9647, 8731, 20317, -10110, -25795, 13929, 33856, -12883, -35764]
613c5764M9096K5838m9634k6841M7450K6765m4264k6154L8988K5317l1900k4532
625b5635K2297K3936j1874k3742K633K1680M265j7415j1191J2720J7201q409k4044
638a7578N613L0437m201l6576M235L9458m785l9444O331L6955r227l2678J2734
651h726K8293j8134k1449K2792J2205k4647k597K5105p036k4501J6126K2320k1900
664b149j9297K4828J5392k4523j0290K2029M616j6390J35R054k554m37L338q807
678e055j190J5820O28k2197M14K6016J62k7917q31K8338J757k7159k957K5321
692A1150L770k0978p453J6709J2740j2438j7974Q245K2318n688k3590K587K3328
705A2726K19k1229m189J8606R224j6880j5305J6253J9557j4572k3578J2596K5952
$$ y = [-35764, 13332, 39170, -10464, -37305, 10145, 36910, -7354, -33508, 5480, 30797, -1103, -25635, -3338, 20598, 8724, -15018, -12385, 9295, 13560, -3855, -15046, -2326, 14875, 6466, -17578, -11965, 18472, 14271, -22305, -18070, 21388, 16603, -22841, -16510, 20445, 11218, -21460, -8726, 19567, 1433, -20016, 2776, 14981, -9666, -12263, 12842, 5806, -18695, -2569, 19751, -2149, -21446, 3382, 18774, -5749, -16039, 5990, 10606, -5784, -5649, 3405, 851, 414, 3752, -5055, -6245, 9575, 10203, -11994, -11580, 14436, 14598, -13319, -14150, 14188, 15945, -11214, -14171, 11150, 14920, -6058, -13511, 3198, 15938, 3500, -14474, -6229, 16089, 10401, -13189, -10602, 12726, 12945, -8284, -12473, 6133, 15357, -1523, -16828, -575, 18982, 4410, -19168, -6572, 19380]
718A9380j0822k7479R704K7795j0304k6363J0619K3868j1161j9509R813J4566
730A0107p807r118M608L429j433J046j425m467M553O287q256o177J0828M912j1448
745d361l071R833K284p774o58M233K01r20p07q57J169K464j658l744K432N576
761D442m298n516N919M797p109k641P054P77o510J891M765l003k447L203K30j997
777d43R40J184j441o29J369M67j024K75l7o78J777M59k692J21L238j554l904L370
795G98L685n183k757N967J963o781j229P315l85p533K075P021l531n821L499M314
811C417k561l274J313K066M46j880k138K062K808l277k868L910L122m277l429
826d560M215L257m222k486L837J432l735LL165j017k466K218Q63k367J060J962
$$ y = [19380, 8558, -18921, -9217, 18578, 8274, -18089, -7470, 16398, 5237, -14272, -4459, 10107, 2300, -6818, -2210, 1219, -214, 832, -593, -5060, -507, 5780, -2476, -8653, 2175, 7087, -4361, -7432, 2401, 4685, -3089, -3747, 486, 687, -233, -940, -1797, -628, 1836, 178, -3566, -1134, 4442, 144, -5372, 547, 5344, -1765, -4406, 2648, 3425, -3085, -1194, 3571, 568, -1879, 1324, 1554, -443, 497, 1681, 240, -389, 980, 1447, 423, 698, 661, -17, 1760, 2219, -473, -352, 2886, 1332, -2572, 798, 4483, -700, -3457, 2510, 4473, -2308, -3537, 3778, 3393, -4140, -2065, 4956, 1425, -4396, -897, 3417, 856, -2418, -1105, 961, 1407, -473, -2611, -549, 2259, -1018, -3886, 24, 3146, -1131, -4560, -345, 2912, -1310, -3796, 41, 1473, -2262, -2259, 906, -111, -2577, -359, 504, -1863, -803, 1159]
842A159j930j959K804J738l210q53K604K27j262Q0l58R27J249j714j018K224J596
859B304k958j096L039Q40k578m89K061M83j871P7J764n90j570J961j06j790J375
876H56J742k784j253L828P80m318l8L382o5k766k38K455j44j646p18J481J136
893A690q67k244M90L562q77m118J017M029j181m793J701N091k470n101K992M230
909C151k891l606K354K664j842j917R52R65P46j282k178K125K856k696l428L015
925a012L823l166l657L449K838k872k460K693K050k171j354J303M31L50k26j386
941a367l21L228O8m144O21M864j194m494J795L603j384k731J508J157l94K6q56
958a5r05K033J514l072j512L549J219l429p74L342M9k619M41J844j395L53J076
$$ y = [1159, -771, -2730, 74, 1812, -1398, -2251, 353, 580, -682, -602, -960, -33, 1216, -498, -1516, 708, 2304, -654, -1750, 1289, 2129, -449, -938, 1123, 1606, -265, -188, 1576, 986, -584, 1377, 1271, -519, 856, 2598, -186, -1439, 2389, 3169, -1149, -1187, 2195, 2130, -636, -874, 1581, 1437, -209, -927, 554, 1690, 823, -1421, -931, 2631, 1754, -2364, -1347, 2682, 1501, -3292, -1591, 3500, 1030, -4071, -1079, 3151, 260, -3346, -992, 1672, -170, -2087, -1135, -170, 576, -706, -2884, -759, 2097, -599, -4027, -1012, 2811, -355, -4012, -563, 2275, -597, -3057, -364, 1686, -485, -1839, -536, -105, 245, 19, -1367, -1688, 1540, 1608, -2536, -1915, 2949, 1755, -2739, -944, 2659, 1275, -1456, 52, 1209, 815, 841, -15, -920, 1113, 2627, -445, -1957, 1592, 2811, -618, -1392, 1950, 1999, -620, -179, 1665, 270, 623, 1699]
975A699k147j143M050Q16n924m0P119j216p157J863O522k706m953J854L589q72
991A354k147n24L97K504M49m371j176N987Q92o370j328O967Q55o772n92N608N74
1008B307m030j083K444J003J53k492j613L572L007n021l327O692K107o793j019
1023d093O480q05m768K591K689m083L64M950l757m627O686L825q275k852J0112
1038D437R46j0366J200Q871k880o199L733L330l828N05L496m775j320P453n39
1053D064r553K530J1197m526j1603N809J0767n969r488N131Q214l482o843J193
1067b559N533J294m804m112M403O299m493p015L871P173k862p599J934O555Q4
1082C702n388k439L535N645l141q831L243J1519l905j3983N220J4995p321j3477
$$ y = [1699, -448, -1591, 2459, 3275, -2649, -2689, 4430, 3214, -3943, -2080, 4442, 1736, -3217, -1363, 2226, 1354, -793, -1317, -920, 1584, 2033, -2338, -3514, 2473, 3365, -3005, -4333, 2634, 3489, -3283, -3875, 1733, 2307, -1723, -2806, -362, 641, 794, -1698, -3311, 261, 3268, -1753, -5080, 1612, 3719, -3074, -4093, 2387, 1582, -3186, -595, 2094, -1989, -1625, 3325, -432, -5059, 1627, 5452, -2823, -5675, 4437, 5383, -4983, -3783, 5088, 2208, -3991, -258, 3072, -756, -251, 3245, -1530, -2850, 4603, 4064, -5489, -2959, 8238, 3712, -7891, -2082, 8685, 2716, -6772, -1641, 6573, 3091, -3752, -2559, 2974, 4268, -536, -4648, -245, 6054, 1561, -5454, -1583, 5590, 2728, -4871, -2937, 3618, 3702, -1686, -4125, -590, 5055, 1914, -6917, -3674, 7845, 3940, -10043, -4823, 10172, 2851, -10626]
1096a0626Q462J1525r862q028R858L713r175J268O529n067l613Q962m27j1710
1110h191N345J1713r031j0686J2377P805j3989l889J3805J60j2346M033R493p137
1124e38n376R065J178j0150L542R515o736q027Q827N927q667m144Q163K334o078
1139a165j386L444J752j263k197n62K352K844l596l606M118L687l866l343K672
1154a15K997j396j897j659K081N056l674p884N339J0487q239j1299J0485J1067
1168A1349j2652r254J3492O508j4124k479J2253r35r706M258N418o825q9P686
1182D900m998o924R399M616j2803j913J4788j663j5055N447J3224q654r679J0158
1196H43N830j0635j311R221k441o283N021L016o033J63N729k732m622N136K360
$$ y = [-10626, -2164, 9361, -501, -8529, 1329, 5042, -4133, -2865, 3664, -1403, -5016, 3946, 3519, -8191, -2846, 8867, -164, -10850, 1527, 9332, -4657, -8546, 5259, 5419, -6927, -2894, 6599, -538, -5914, 3151, 4329, -5821, -2279, 7236, 500, -7527, 1300, 7227, -1440, -5584, 2579, 4913, -1165, -2551, 893, 2645, 1382, -815, -1377, 975, 3819, 223, -3383, 735, 4422, 556, -2787, -115, 2882, 1486, -411, -2070, 11, 5067, 1393, -6491, -1152, 9335, 1096, -10203, 282, 11349, -1303, -10557, 2935, 9443, -4681, -7160, 5093, 4158, -5548, -1290, 4128, -2697, -2786, 4900, -98, -7022, 2377, 6993, -5810, -7723, 7065, 5402, -9653, -4206, 9018, 364, -9315, 843, 6673, -3962, -5273, 3948, 1507, -4776, 245, 3261, -2772, -2609, 3120, 388, -4234, 902, 3262]
1211C262n795r1N439j992m364M393K167n261N47M750k172l713L956J402m101R58
1227f15K354j694p00K599j909k329M745Q36o468J155P539l767p249O126O183q123
1243a317l718R120M64q565K322O836m786l974O137N75o655L263N295o070l575
1258d648Q445j8r162K991Q355n855o028P308L219p757l61P275k632n292M819K208
1274B867n933M94O353l815n024O257K176p479J088O956l738n489N670L583p063
1289c097n01O634j774n689L954L514m809r89M974j416l966L651J935m995J252
1304a322M411l337k994M990J282n752P84N606k795m912M625L015n099q09N488
1319C181j726m584M215K615n541q8N728k766m649N005K569n655m26N668k185m433
$$ y = [3262, -2533, -2624, 2815, 823, -3541, 852, 3019, -2242, -1695, 3055, 883, -2830, 1126, 2528, -1573, -615, 1739, 45, -655, 1944, 35, -2294, 2451, 3287, -3181, -2026, 5513, 1746, -5503, 623, 6806, -1317, -5035, 4085, 4549, -4016, -1694, 5142, 356, -3618, 2519, 3094, -3561, -298, 4997, -1073, -4648, 3797, 3779, -5383, -2392, 5963, 108, -5920, 1388, 4607, -3150, -3511, 3764, 1132, -4160, 659, 2867, -3066, -2572, 3781, -34, -5058, 1199, 3375, -4104, -3016, 3940, 202, -5287, 383, 3966, -3097, -3598, 3036, 1262, -4427, -473, 3041, -1768, -2757, 2217, 801, -3165, 486, 2421, -2574, -1322, 3089, -248, -3242, 1748, 3030, -2722, -1938, 3668, 873, -4039, 586, 3601, -1498, -2307, 3181, 1455, -3129, 1086, 3701, -1840, -1928, 3800, 1034, -3615, 1390, 3959, -1696, -2122, 3546, 1361, -3072]
1335c072M051K284m494m47M988k244m202M214K639n921O3N907k691n025M396L206
1351C652n290j433N734r32m814K849K998m293r27M298k97n050K878L765m497j931
1367c290N445m29n298K664L006l293j251L985r12l363K371K206l309r01M084n37
1383A178m095K156L574l955j599M383j80m322J944L471l177k126M564m16l778
1398b378K067K929l391j336L468J81l387J741K372k407j561L388j17l256K096
1413D09K310l620r36M397o17m078K161K840k869k149M143J56l620J056K647j739
1429D91k301K876O32l057J251K822k917k092M091K60m105J182L370k474k381L309
1445I57O17l045M12K618j655j569K237R13l254O44K761j911k012K702P76k819
$$ y = [-3072, 979, 3263, -1231, -1678, 3310, 1066, -3136, 1078, 3717, -2204, -2141, 3766, 1075, -3950, 446, 3652, -1638, -3071, 2663, 1731, -3083, -234, 2764, -1529, -2456, 1842, 1545, -3505, -627, 3138, -1359, -3290, 2155, 1726, -3572, -908, 2098, -1195, -2446, 1539, 627, -2736, -365, 1841, -1468, -2369, 1715, 1178, -2917, -761, 2813, -1142, -2741, 1642, 1462, -2860, -916, 2555, -622, -2748, 1816, 1400, -2378, -311, 2618, -773, -2109, 1359, 1540, -1847, -106, 2266, -141, -1702, 1686, 1569, -1687, 409, 2719, -901, -1837, 2560, 1943, -2135, 26, 2866, -3, -2152, 1991, 2147, -1473, -417, 2230, 491, -1810, 1066, 1698, -1359, -108, 2714, -203, -2295, 1796, 2056, -2049, -867, 2503, 29, -2352, 957, 1574, -1471, -1059, 1559, -96, -1665, 572, 1485, -1769, -1125, 1636, -275, -2287, 415, 1191, -1628]
1461a628pL193j692k349K447J613k802l24K562o69j896J149J158j724J25J575
1477G31j169q62J535L45k032P55K293k102j117K461J23k139O36J997j263j485
1493a293K136J44j715O6K265j168j877K483M69k419K19K488j247k136K494Q00
1509A709k186j20K233q26j578J593Q67k282k33K513q01k115J239J523j554j276
1525a294K303K7j630k3J660r50o27J085k28j036N92O14p78n53J331r6j129L18
1543d14Q50n04o13N74J83k97q3J72q20R57K25r65l76J720m66j398L42J975p87
1562B75j488P85J082j247m75J281n7r73N76P85j217j27J455l13j333N99J453p05
1580C56j568J407R01j663j59J345L97j200j79J049k79m91M68M28q89J9J041l63
$$ y = [-1628, -1635, 1558, -134, -2483, -36, 1577, -1225, -1549, 1013, 344, -1552, -403, 755, -969, -844, 731, -438, -1300, 235, 580, -1452, -697, 1596, -506, -1623, 838, 961, -1178, -542, 1455, 192, -1293, 843, 987, -728, -662, 1603, 435, -1442, 1041, 1510, -909, -690, 1798, 551, -1585, 909, 1709, -477, -597, 1636, 810, -768, 825, 1692, -590, -823, 1690, 889, -1226, 13, 1536, -18, -1294, 1009, 1036, -594, -617, 1043, 93, -534, 551, 323, -713, -121, 493, -285, -838, 493, 397, -732, -414, 436, -68, -681, -107, 76, -221, -304, -132, -952, 5, 230, -735, -1111, 609, 143, -1255, -913, 1062, 275, -1213, -428, 654, -593, -1068, 213, 156, -817, -241, 544, -673, -800, 655, 342, -991, -392, 1061, 356, -1212, 195, 1096, -567, -726, 619, 1016, -184, -363, 686, 407, -84, 384, 812, -77, -58, 983, 620]
1598F20j162N86J173q10j215J271J053j342p40P84R87r30r63Q22R18q25q93J008
1616C42M38r37j53P23j61o67P04n3r80N57R53n75j405Q64J568j618j257J374J581
1635A298j742j233K113L91j641o96J930O3j895O39J129p10q34J077M90j325M38
1652e08J002p69j433J478J020j458p86J608Q68k060L0K236m43j999P45J824j420
1669f5j071J708M30j810K90J677l84j897J180J592j711j135J657Q07j516m87J652
1686I17J98j591J84J451o29j249J060O00q55j88J107l48j256P12J101j144r68
1703h98J373J058j858o41J819K47j960j4J950m28j576L96J463q23j165J092N00
1720E35j006k32R17r4o92N26O04r54p27J431J46j708K39J800o39j772J222J072
$$ y = [620, -542, 44, 1217, 407, -808, 463, 1516, 174, -566, 218, 1205, 275, -688, 134, 1052, 227, -666, 342, 780, -157, -310, 413, 252, -415, 289, 236, -744, -187, 766, 191, -1214, -350, 1218, -400, -1657, -283, 1298, -444, -1677, 436, 827, -814, -1510, 420, 483, -1412, -773, 356, -354, -1188, -111, 379, -946, -508, 494, -275, -1708, -230, 790, -668, -1454, 154, 1022, -1038, -1008, 1228, 785, -1214, -469, 1355, -65, -1136, 572, 1002, -808, -518, 1159, 775, -1122, 58, 1650, -61, -1196, 461, 1268, -248, -735, 917, 1115, -476, -292, 1159, 530, -719, 341, 941, 86, -102, 1005, 657, -599, 113, 1214, 70, -898, 475, 1533, -325, -966, 853, 1100, -860, -874, 1076, 648, -928, -532, 931, 108, -1057, 35, 535, -471, -703, 214, 120, -572, -46, 558, -396, -1123, 308, 454, -1254, -1015, 785, 146, -1626, -404, 668]
1738F68j119n39Q64P95j300o73J435J24j446O51J156p54j023J193M93j110j08
1755f93J360l64r86N22M82n80k18Q92J52q25J4J040m78p31M41N75m86m33O95K79
1775F58o09k49J164k03q62j49Q30l4p88O20L15m31m6K59K07n18k77P63k50q47
1795d47K12R03n66k64N07P1m38m26O91K63j125L76P07m23q68Q51L37p86r4P04
1815A85l16n94N96M46p03l08N34J31m40j65O71m6o69M43K94o92J04M23Rn60J77
1836d80M64J52l42j21L02p6k34L70K84n41j68N99q1j26j61K92j97J04pK19k9j87
1858C6k00N17r3m95M38J67k52k19N57Q8n10L12O5O3o66L63O17l75r77J125L80
1879I41j127K76L54k58k03K06L36l79l70P51k93l69j72Q06l20n76N12J2o25K64
$$ y = [668, -451, -990, -126, 669, -631, -1304, 131, 255, -1191, -540, 616, -138, -1161, 32, 525, -585, -693, 667, 303, -683, -161, 321, -259, -477, 415, 567, -258, -244, 796, 318, -413, 28, 603, 117, -316, 379, 658, 49, -200, 964, 761, -101, -250, 580, 546, -242, 378, 693, 262, 216, 475, 682, 164, -113, 650, 400, -447, -235, 668, 102, -162, 345, 416, -22, -448, 243, 506, -619, -243, 464, 41, -827, 24, 361, -425, -519, 185, -131, -725, -129, 317, -386, -694, -160, -29, -469, -634, 37, -9, -678, -235, 59, -633, -529, -106, -97, -657, -480, -16, 136, -206, -327, -25, -101, -335, 35, 319, -222, -390, 209, 128, 2, -159, 133, -64, 40, 33, 252, 223, 36, -164, 353, 260, -235, 203, 370, 118, -101, 456, 544, 34, 346, 411, 474, -192, 171, 788, 413, -564, 561, 941, -186, 90, 444, 186, -17, 189, 525, 146, -224, 527, 234, -135, -307, 499, 179, -397, 115, 127, -498, -234]
1899b34P12l76o61L64M47m41l46K03M46j05k68J6J5j04k2J65k3j06J16J24n55
1920f33L68oK7R7l97O01j52j30j70M23k47r1J67L64k09k86k4O95k20n74M40L08
1942C51k25l76N84j16l42Q3M93n05J06P2O1nk66L59L56o64N7M97o4l64J69K68
1964E29l34R2K58q0l29M03K6k58j71m5L06m02j94M12J3o79L54K49j73p1k3Q9M8
1987B0Mj22P0K61l65j31J77r3l0j07m3J03j12K65J72n17L3j2M82n97k1O57j54
2010f0n15L61K38k24m8K39J70o74K22O77k12o26M46P86r86K5O16j77l77j7L89
2031B53l71p7L16K46l59k59N85J32n82k09Q65k23o07P05R3k76j98M17k19l2K33
2052D33p3k8m48L54K42m34J9O0L71j91o02M60J41k10j42K62K48o69l15N89Q5m88
$$ y = [-234, 478, 102, -559, -195, 252, -189, -535, -332, 114, 9, -259, -243, -228, -332, -354, -189, -212, -318, -202, -78, -633, -265, -271, -244, -147, -544, 57, -95, -225, -395, 28, -219, -310, -143, 221, 12, -274, -298, 397, 177, -397, 43, 351, 126, -250, 334, 218, -124, -41, 452, -53, 53, 125, 186, 181, -85, 274, 630, -34, 23, 520, 456, 92, 261, 529, 195, 287, 545, 465, 136, 539, 565, 307, 136, 91, 397, -5, -199, 213, 226, -453, -99, 150, -23, -94, -117, -28, 20, 24, -98, -28, 233, -132, -263, -86, -179, -209, -316, -359, -256, -368, -103, 69, -448, -415, -427, 55, -542, -563, 94, -60, -575, -214, 24, -200, -248, -9, 161, -513, -291, 386, 174, -452, -6, 780, -206, -181, 435, 258, -119, -136, 253, -118, -195, 121, 367, 8, -251, 334, 466, -116, -325, 540, 317, -290, 415, 508, 232, 34, 451, 232, 200, 433, 360, 332, -116, 238, 480, 46, 65, 125, 496, 305, -297, 163, 304, 94, -48, 214, 462, -207, -522, 67, 152, -336]
2074c36M59L13p50k39Q46J48r46J29N04j10n01L75N19n17n19P14J54p69J36P48
2094C58o00n46N30P53j039j60P55K49j109L77Q73m59n14M46M02n58n1L72o7p14
2114g02L89P02m19m42N31L99o61O1K97J69n65N2O02l1n37L02O0pj66mN98n60m25
2137c57M64J66j75k65N73M0n62J05M65j32o54O51K50l25o19P25J35j007M92L98
2157C68r4j007O86Q20j011RP03M2r32q4J028m96o82Q50K91j066J93Q40k62j351
2177a155P58O72k46p07O24K85n95k11N88k4n05J31N25j44o34N45K12m02Q8J40
2197e5J70n35Q0K20J50k52o6M55k81j19p3M63L2m39j3N10k38l21P15q5m18J74
2219G4M46j51o56N90L24o10m29P72j46m18J26Q33l59r25Q02M50n94k47P02j45
$$ y = [-336, 123, 436, -314, -553, 293, 441, -505, -376, 128, 18, -483, -108, 411, -106, -625, 89, 243, -526, -390, 358, -242, -788, -258, 495, -544, -704, 51, 300, -809, -432, 441, -18, -532, -86, 316, -242, -293, 79, 12, -702, -313, 389, -30, -472, 59, 458, -203, -142, 155, 324, -241, -189, 413, 382, -155, 147, 207, 200, 34, 30, 628, 68, -357, 107, 273, 98, -167, 406, 446, -116, -11, 454, 322, -332, 319, 569, 244, -375, 350, 485, -522, -30, 368, 274, -733, -47, 773, -238, -229, 474, 516, -416, -500, 528, 32, -650, 200, 491, -575, -382, 458, 196, -1155, -397, 275, 29, -678, -54, 231, -364, -575, 13, -11, -516, -385, 140, -4, -638, -93, 119, -283, -195, -55, 115, -420, -340, -120, 30, -222, -288, 167, -114, -233, -306, 157, 189, -250, -263, 247, 9, -312, 403, 318, -100, 74, 520, 369, -287, 303, 627, 17, -412, 360, 214, -204, -78, 755, 396, -529, 273, 723, 129, -118, 584, 439]
2239D39m50q3O51m12l90P21j04p39K92O58j51o59L89L79o47p0K43P3o11P7M63
2260F9l42l75M95K86m34K49J48L8j16l46L01k59J76j47k04J62J84j24j81L69k43
2281b94j20L28K74q32N56L91m88n90O67N16q33J58O35j90p50L73Q98p37l17M22
2301F7M15p63J61P76o02n44O69K92p17PQ55m71o40O63O59r62p3Q43j28p42M70
2322B35O35r40k86P44J3m25K0M86m38l01O82J33p55L10K87l93p5K39J59q64N43
2343IJ0n23K71N68k94l96O91q4q87M35P68o16m92N61L50r68j60J379p42p17R36
2364I9N71j342j39J360o17p38O58O48q88l49J099J46j268L68R32q43j65Q50J60
2383E42j118K23R92j041k46J165l34n63m3P42l96l33L45M83n86J50N52n32j10
$$ y = [439, -11, -94, 557, 145, -245, 476, 372, -367, -75, 583, 432, -227, 162, 541, -106, -176, 67, 140, -471, -394, 69, -273, -648, -153, 133, -301, -52, 96, 134, 18, -328, -27, -286, -110, -257, -461, -299, -115, -239, -420, -51, -294, -414, -86, 188, -644, -88, 303, -185, -775, -108, 408, -425, -267, 368, 178, -572, -199, 699, -38, -355, 67, 482, -281, -120, 656, 54, -490, 179, 471, -246, -239, 616, 145, -495, 168, 827, -135, -208, 635, 507, -235, 235, 870, -70, -356, 388, 401, -24, -4, 482, 44, -257, 425, 558, -197, 113, 400, 7, -68, 171, 330, -534, 9, 19, -504, -233, 335, 41, -355, 336, 252, -635, -200, 568, -48, -540, 21, 371, -597, -757, 622, -120, -837, 99, 670, -672, -811, 549, -68, -806, -148, 500, -388, -737, 362, 508, -760, -392, 540, -303, -468, 382, 542, -576, -353, 639, -402, -648, 517, 183, -380, -423, 319, -77, -410, -65, 418, -168, -18, 534, 2, -108]
2402a08M73J50p87J88M22n16q1J163q07n48O64K72o74N3P04k22p46P20L59r11
2422b32j01J034l76r54P53P47j211l4R35p0j409Q73P62j092r0R77q2q30J21R40
2442F61p85o12J068K97j174L3J091p45o89Q57L53p78K9O47n52l79P68J40n43l27
2462f40Q96k24o95O90L01p67J42O27n82m46Q38J74p88L13N36n68l35R75k45m66
2482b64J55N12p76l8P82J84q38J30O36l36p45R24o6p02L03J187r60o83Q49M17
2502F71j125K35J137n43q18Q20L91q57k65J051m76p05O91L95m99m31R04k40o68
2521c32O33L5o18J70L91q4p43N09N57r32K52L96j99n60M39K67p57L48N07m53n54
2542g28P21M07r13K07Q38o93l41P91p1p94K23Q98n17p84P60N89r41J63P75o14
$$ y = [-108, 365, 515, -272, -84, 338, -178, -259, 904, 97, -451, 213, 485, -189, -136, 568, 346, -400, 320, 679, -232, -333, 701, 325, -629, 124, 871, -340, -374, 561, 491, -918, -45, 717, -375, -465, 512, 430, -400, -279, 661, -124, -736, 332, 629, -545, -512, 579, -166, -855, 2, 355, -423, -394, 253, -299, -678, 90, 230, -313, -640, 256, 32, -663, 27, 328, -439, -297, 330, -252, -698, 140, 314, -474, -161, 375, -193, -528, 447, 202, -264, -109, 403, -373, -411, 371, 555, -283, -153, 483, 147, -598, 326, 260, -442, -139, 1048, 88, -595, 254, 671, -454, -219, 918, 375, -443, 377, 768, -89, -354, 697, 221, -484, 207, 602, 103, -328, 576, 336, -332, 301, 336, -282, -112, 279, 195, -548, -39, 518, -414, -162, 234, 35, -525, -86, 181, -576, -228, 279, -174, -728, -7, 400, -513, -306, 532, -161, -502, 289, 218, -576, -353, 545, 28, -756, 4, 593, -348, -185, 590, -24]
2562b4n02O52L39j057k07J276k79r14O12J103j197l22R47j68p93N31N89n71m86
2581d71Q65j26n72L72O27o02k24N58k76n97Q06K3k04j74M60j87m36K65k7q4j67
2602a71Q42m76o28M42M20r53K16Q68n51j99O02K3j029L90P13l77p97M80N90p26
2622c21k51O97J26p68L36Q70r08l90P78J90o85j4P20o54j18M95J55q18N0R83k47
2643B26r20O21L32q59j21R20j69m76J52M62l28J59K6J89n93L42K09k47L8J36r
2664I0m26O14m38J2M97k22m80M46R0K1m69M28Ll80L80J10j19n32O29K29n31m63
2686e11J073k75p79M92R22j071k97R30r3q46K56Q14o84r9N01L3n22k23Q59m00
2706H0m69M66J94n44m7N05o4p44P09K62n96m23Q31M4m77K74K35l80n3K43j58j4
$$ y = [-24, -526, 126, 465, -592, -799, 477, 198, -716, -104, 999, -198, -520, 427, 259, -534, -3, 586, 15, -471, 394, 268, -304, 68, 695, 93, -131, 427, 151, -446, 360, 383, 179, 5, 465, 278, -158, 107, 80, -4, -171, 671, 195, -433, 9, 429, -524, -308, 560, 9, -190, 412, 435, -594, -204, 509, 132, -665, -185, 405, -321, -572, 125, 251, -517, -181, 689, -219, -609, 169, 359, -326, -340, 380, -274, -392, 103, 258, -560, -510, 473, 226, -694, -73, 259, -600, -721, 199, 30, -446, -294, 168, -160, -1, 25, 214, -379, -37, 172, -75, -37, 99, 90, -336, 278, -160, -148, 349, 127, -353, 93, 183, 204, -265, 163, 166, -214, 166, 276, 157, -375, 254, 483, -48, -511, 562, 287, -492, 0, 922, -149, -446, 484, 391, -455, -199, 615, -69, -168, 333, 366, -156, -379, 480, 80, -389, 77, 271, -273, -320, 185, 121, -623, 86, 348, -248, -671, 160, 204, -273, 1, 236, -144, -197, 46, -112, -126]
2728a26j14L72m04Q1M25p76L19K46l16M43n1k58J15M2L52m78L0K54R0o31J25L38
2750G8p5M2K3K84m40q8O06j12m87l3N93k02k77L03j63j36k45M34L3l31M04J43
2772C54n87J42L59K63o50L86J97m57n3J43P1k40K91Q9n66K98J12J57j88Q7nqj82
2795A3J51o9J25k59M02l62j67L9n4L72l34K90k79K82l45K68P0r2L3k68m9pK36
2818dj42J22j50j6J12J17k8j0l3Q9lj01J3k93J82J81l04J06L8K20k17R9K53l37
2842a06q1K63k03j66M14J05K8k11k26O81l24r5J98L53n71j85M65l52J45J93k96
2863B9j49K34R5j91N4m5L55m03O9L09j10j44k65K31J75k91k7K94l15P8q9J25R9
2886A18r7j65J77j25j37L40j76j10R7M5j67MK52j09R7l99M27J03l00J00O0k57
$$ y = [-126, -240, 132, -272, -191, 234, -542, -223, 23, -293, 150, 99, -159, -44, -2, 350, -128, -98, 156, 246, -385, -260, 78, 3, 45, 68, 352, -88, -176, 430, 318, -169, -202, 391, 189, -88, 215, 52, -84, -329, 105, 138, -193, 211, 354, -233, -91, 268, 531, -119, 267, 464, 7, -46, 97, 168, -72, 219, 308, -258, 40, 152, 309, 121, 208, 203, 195, 13, 164, 95, 220, -39, 363, 1, -166, -127, -181, 191, -143, 147, -132, 150, -195, 73, 143, 51, 84, -184, -233, -240, -4, -146, -24, -174, -190, -78, 39, 11, 1, -32, 57, 54, -47, -34, -327, -145, 36, -268, -162, -124, 96, -121, -22, 231, -106, -187, 76, -127, -293, 121, 226, 254, 43, -183, 498, 174, 79, 277, 630, 59, -126, 339, -13, 132, 325, 29, -120, 114, 209, 18, 72, 27, 382, -21, 48, 357, 247, 103, -162, 69, 244, -47, -74, 220, -95, -17, -106, 19, 118, 21, -144, 33, -92, -229, 111, -65, -175, -78, -33, -200, -196, 56, -53, 44, -355, 72, 175, -125, -25, 35, -222]
2908b22j24L51J12l51J88J70j11m01N79k85J06j87K05N0j52J41j79J0j20M26k10
2929dn7k18L09p5m07N48j65q8K78k12M80j21l25O4Q0K7P4j1J11l35ML64j19l3
2953A69k68M39j84J1o6L56n45J87J37Rm74L5O01m57j33N45P5o72Q0L45K8m23K30
2976B5K87m60j58P00Q4q48k9O36r0l87N9L04m79L86K6q3l68J46O48o38k17N19
2998F3L17o72j23N76J00o64L08K86j08k21K71j73j16J15K1jm7j37J77M81p57K09
3020i5J59J89k74J25lQl17L31J49j70n17M06M33n30k25O50m43j70M28L14k39k67
3042e8N80m87l19K39N51K1j083O57M68n99k2L01J55o32J61L20k89k28J07L45l21
3063a33j93K95K97o86M06L87m91k19L25J82l55K36J86l00j69o5M11l23K8Nk67
$$ y = [-222, -346, 5, 117, -234, -46, 124, 13, -388, 191, -94, 12, -175, 30, 80, -72, 69, -110, -100, -220, 206, -4, -61, -279, 30, -45, -452, 96, -69, -157, 121, -91, 389, 268, -57, 7, 87, 114, 188, 177, 288, -47, -43, 321, 202, 169, -99, 340, 156, 167, 101, 457, -88, 99, 236, 245, -229, -194, 407, -50, -183, 362, 437, -235, -155, 190, 218, -205, 25, 312, -148, -306, 394, 478, -370, -399, 237, 147, -240, -181, 123, -356, 30, 56, -27, -395, -249, 399, -239, -456, 63, 380, -292, -415, 161, 261, -403, -95, 191, 83, -138, 133, -40, -156, -41, -20, -21, -68, -205, -28, 453, -304, -95, 64, 253, -21, 104, 101, 109, -208, 123, 272, 102, -415, -9, 424, -106, -331, 319, -124, -294, 134, 448, 209, -58, 522, 35, -284, -45, 506, 527, -556, 101, 569, -30, -52, 249, 404, -228, -67, 253, -36, -264, -157, 188, -133, -326, -31, 266, -420, -14, 373, -118, -337, -12, 170, -185, 51, 237, -63, -232, -297, 114, -209, -181, -176, -443]
3084d43L25r6K73m4j93l5L90j21k3k8J21L5k13k08L22l17j84M44J09k74l11O44
3106A73j30k90J3M78k86k31L6P37n50j96N74j30m61J02N08l07o4K40J77n43j85
3127c35N06J82o14L43M3j13k1M15L5m37j87J70K70l82N08m87P8j09P0L02k83K6
3149b0J9Q9k5R2k59M65q21M81K68k96l33L38L27m37q5K01M0j93q5K61k6m96M10
3172h5J12k22j06L09J17l81J63K13j08k87K62J4k8k88M28L3m53K32L26o2p14O47
3194A22J77k29l57M81R3l22R4M51l55l80K38L38m82j50N51p4j55j13J90K06m20
3215i6L71j47j96j07J64O33n99J04K79j7n84J18N38l19j87R2J31n19K83r8K85
3236A29j85J5M78k37j60k09O66q43K00M91k61n44J42P30l39m20j97O81l9n64L11
$$ y = [-443, -118, -214, 59, 15, -178, -213, 177, 56, 33, 5, 126, 161, -52, -260, 62, -255, -439, 5, 114, -160, -471, 173, 43, -247, -234, 244, -42, -273, -237, 500, -50, -246, 328, 198, -263, -161, 347, 40, -24, 216, 393, -150, -335, 171, 353, -261, 82, 125, 12, -9, 406, 441, 4, -183, -13, 257, -125, 383, -104, -26, -135, -65, 237, -46, -20, -1, 88, 63, 155, -104, 361, -460, 21, 289, -7, -340, -2, 325, -112, -197, 4, 44, -149, -234, 27, 1, -495, -85, 27, -195, -301, 8, 125, -256, -93, 120, 12, -275, -13, 1, -27, -315, 113, 146, -307, -75, 251, 189, -525, 122, 299, 70, -287, 194, 287, -35, 59, 510, 155, -225, 13, 351, -131, -281, 270, 196, 41, -72, 118, 324, -96, 275, 128, -68, -175, -11, 622, 23, 127, 406, 389, -195, -77, 461, 142, -45, 47, 178, -341, -58, -156, 129, -56, -41, 437, 200, 40, -169, 497, -346, -146, 345, 84, -460, -318, 412, 73, -347, -544, 137, 98, -466, -155]
3257a55K60l37p4N04m1o18K33M82k19k60M16K03n91j37N18J95q16M74L82l90p68
3278g39O19M0p1j64O36q0n47K27L98m49j48L74L12n29J10L04r0l60j26N12j46
3299H3j09K74J29n15J30J52K59l56n3L48m26j28J56K25l95J6K86J07m25K77M03
3320D38m16j32J71j55r6L98l70M87o89M3L49J52m91K27K9O8l22L89jk62m4o2K05
3343h4k1J53r8l38J90K67j71k16k1O34m07k59L42K33k51pJ54j15J57l80K41R4
3365I7k93K48J71l85N3j02L95j45j47K99j14l9N1k08N6k5K11J27k75n2N8m1n9
3388a19K13J11k83RK93j06k72K61J69j22j90L10j74q4K2R8j87L2n1J38K22m42
3410a52K4P4RJ30K4l22M23j73P4j02j6NL16l53J72l83L15J84m79M11p9j71j93
$$ y = [-155, 105, -232, -306, 198, 157, -461, -228, 254, 35, -225, 191, 394, -197, -334, 184, 379, -437, 37, 419, 29, -739, -120, -80, -151, -315, 321, 241, -306, -79, 319, -130, -278, 96, 408, -121, -11, 293, 203, -157, -283, 229, 83, -26, 248, 377, -138, -8, 144, 403, 47, -6, 342, -84, -212, -56, 169, -226, -210, 76, 183, -242, 35, 438, 22, -110, 61, -94, -190, 208, -162, 325, -364, -321, 28, 180, -311, -84, -55, 13, -309, 80, 79, -183, -227, -289, -84, -105, 48, -50, -388, -198, 69, -102, -318, -339, 295, -112, -371, -29, 204, -47, -54, 100, -15, 142, -238, 3, 97, -196, 52, 223, -162, -109, -211, 184, 39, -108, 191, 77, 38, 89, -119, -63, -88, 123, 250, -25, -77, -19, -60, -119, 94, 205, -78, -69, 224, 118, -154, 107, 276, 154, -36, 274, 100, 16, 38, 136, -51, -19, -70, 68, 290, -152, -128, -54, -45, 85, 109, -213, 210, 37, 111, 9, -7, -2, 314, -39, 133, -250, 65, 249, -230, 181, 102, -69, -262]
3433b62K39J33j45j03L90k12m12L11J44l75p3L93J31l86K39J79k86j7J36O1Mk14
3455a25J24j07j34J33M18n15p6K12K98n03L33M8l72l9L81J21l05J06l8M1Pn1K20
3478A77N0k46J38j32r3J75K74m91j06O63l37j04Q1K8N5r3K61n96L00J94m54K34
3500b2K85j76J17k73J61j23k02L23J35l72o3L06r1k08J84J21p4J80k87r3J82J40
3522A50l12Qk81M53J38l68P3O33p72m3M06N5p01M34K23J40o87M33J54m84L04K9
3544a5K45m65J08K71j21k62L01r2NQ0J95n30L04L9j51J23J59j52J44l4p9l9qJ8
3568D4lk0j58J39M8k36P0K48k89J63K04j01o6J75q9r8J09J75m38J67K53m1l73
3591a17K81J58l17q5J70q0k67K3N82k55j67J91O2l81j4M87k28j67NJ41J22m33
$$ y = [-262, -23, 110, -35, -138, 252, 40, -372, -61, 83, -292, -365, 28, 159, -227, 12, 191, -95, -112, 24, 85, 89, -125, -1, -108, -242, -109, 309, -206, -282, -70, 228, -275, 58, 106, -266, -305, 76, 197, -108, -2, -40, 1, 8, -43, 177, 227, -19, 119, -13, -106, 69, 343, -148, -254, 409, 72, -32, 49, 77, 132, 39, 300, -296, 4, 198, -256, -22, 263, 87, 204, -69, 92, -31, -233, 90, 225, -147, -210, 96, 5, -203, -19, 102, 28, 208, -79, -172, 10, 150, -162, -154, -435, 18, 156, -212, -139, 494, -278, -321, 85, 140, -561, -127, 96, 236, -451, -18, 136, -348, -44, -15, 230, -235, -127, 144, 23, -239, 62, -30, -25, 55, 250, -280, 24, 63, -88, 35, 194, 42, 186, 152, 73, 34, 26, 44, 41, 21, -137, 2, 50, -186, -116, 132, -157, 6, 210, 109, 43, 218, 129, 31, 140, 315, -123, 44, 297, 256, -117, 164, 322, 5, -80, 90, 10, -257, -234, 348, 93, -74, 117, 179, -202, -216, 271, 43, -124, -119, 22, 144, -289]
3613b89L83M7k17q5K49l37j05K68K23n33L67K16l29LJ77n8k72L36m6q3k01L79
3635I3J36l05j54K34Lq1K67k27l83M89N7j33k16K59K05k62l7J82j83R5O4J74m69
3658a92M28J6k68j43K62j90o5M42J4m61J11M21l3p21J63L78n30L00K17L6l38%
3680a53M46l84M7M27l90j78J68J79j4k13L04j53n65O00J53l82k25M19L2k67mL02
3702A49r8j59K4k62J14J45K82R3p25N51N7l06J76J06j86k84J29J44m21K72K95
3723I6k05r7L34j70k31M80m47R5N6N5K1j74M65J15o29K3J40J11O5j11L37k53k91
3746b15M59K20n12J26N1l8m23N61K65m47k58N34k45l21K53L71m09j21K1L56j80
3767D8l05N38J9k20J11J2r7l83L41L9r5J94k58p4J66j87j5P1K8j69L68o0k2o2
$$ y = [-289, 94, 141, -76, -161, 88, -249, -354, -86, 137, -396, -29, 187, -142, -139, 38, -20, -292, 44, -2, -85, -286, 93, 229, -76, -230, 4, 7, -74, 193, -34, -417, 72, 129, -4, -220, 39, 244, -18, -55, 127, -56, 39, 103, 277, -192, 236, 252, -16, -159, 103, -87, -152, 290, 304, -157, -46, 375, 342, -379, -216, 162, -368, -68, 149, 185, -153, -153, 293, -91, -44, 383, -7, -185, -17, 162, 148, -65, 239, 86, -479, 121, 274, -108, -333, 86, 118, -149, -153, 149, 51, -108, -84, -346, -232, -87, 195, 288, -437, 114, 171, -135, 41, 147, -39, -323, -194, -50, -471, -199, 96, -109, -206, 128, -42, -273, 207, -240, -145, -89, -34, -13, -187, 278, 393, -236, -213, -73, 38, 103, -8, 329, 76, -215, 244, 464, -48, 78, 129, 91, -332, 229, 494, 47, -211, 323, 78, -243, 10, 381, -28, -149, -128, 228, 48, -257, 281, 300, 80, 191, 203, 106, -277, 64, 103, 8, 202, -56, -130, 36, -151, -166, -95, -67, -236, 132, 72, 50, -12]
3791a2j96P2J56R0m3k57k25J29L10j04J03j1K00l73o5M52j93l61M14r8n23L52
3813a83K98j1n25N08R6n38j6N88j20k78J82R5l39M6K11J27l50J78J95J04o55L22
3835f5L94l22k3K34j31l70L38J92k57o0K0K48k74K54k33J15p1J75K68n47J72l6
3857B1j95K27j61J59L8n1L5m7l2r5J70j73q4J08M2K44m5k65N8K17l97J91L52k56
3881F1k15%n3K51j21L2K36m43J30j05M08k65O6L01j28j88J09j55k00R1K31k26
3903a83l7J66L12k49j44J31j04P0K5K25k71%M3J4K8j5n3j73K34O8J0Lm44M17L4
3928A07j24P8r6J28j08R5N0K15j44j31M7o9L0q2K40n32L32m7P5M1j39M1J04j35
3952b4o7J79M5k47m5Q1pJ35n0m7M9j10M2L0L01m47M4j3J44J56l81m2L08p3k69
$$ y = [-12, -208, -136, 20, 110, 67, -190, -415, -286, 24, -80, 23, 12, 212, -161, -226, 226, 33, -328, 86, -12, -535, -183, 115, 104, -421, 87, 183, -355, -371, 217, 97, -181, 1, 96, -243, -197, 14, 141, -209, -31, 164, 268, -387, -65, 329, 7, -16, 218, 87, -283, 55, 247, -10, -70, -50, 198, -76, 178, -55, 60, -11, 164, 432, -115, 57, 21, -174, 53, -108, 51, 89, 38, 73, 26, -6, -101, 69, -104, -188, -80, -38, 206, 161, -104, -46, 171, -226, -35, 317, 61, -154, -154, -207, 44, -77, -45, 191, -252, -122, -227, 181, -84, -18, 283, 155, -33, 76, -79, -279, -188, 43, -183, -220, -54, 258, 9, -135, -4, -108, -38, -13, 212, -59, -59, -16, -2, 26, 11, -42, -215, 19, 87, 97, 100, -344, 73, 107, -17, 61, -35, 93, -15, 80, 130, 345, 201, 70, 117, 48, 78, -4, 236, -296, 36, -11, 64, 105, -34, 7, 111, -24, -91, 88, 133, -114, -159, -78, -85, 50, 0, -47, 2, -108, -66, -36, 265, -182, -138, -151, -7, 149, -232, -274, 34, -39, -308]
3977c08L62rN4Q2m50K72k05M8J00J98j95M3N1n9j91K62j27P6j85n6K46m9k65M71
4001A66j42k36J7L78n8k11k2j84M28k23J8M2J21k66R9L1r8K12k48L33k15P2Jj79
4025a64L46j25J76l55J05J59O1l52J93K3M0j84N3K08p0JQk18q0L09n4k70j01M32
4049A41J09l61L4M36l15k99O6J97n5Q9n9J40l97K56q5P2m29L56K41l11K51r4K03
4072A86k43k57L15K8Nk19K61Q6m02Q7K1j51M7L74k24o8l5O4j56L12j6j97J31j83
4096b34R7p0l1K90K2j52J03K8m3p1j3qm3M57m04J52J06L7J07l19o6P8q4J22k12
4121a51M35j59k01Q7R5j98N7K65p7j84o0L22k50K21o7j11J08k84k00L82k6j99
4143a95J05P5l17K07K65l35p5L3J49J41P9q5K65l56jQM8K0k20L59j42k80Q1J57
$$ y = [-308, 54, 45, 99, 181, -269, 3, -202, -154, -54, 144, -51, -8, 43, -16, -207, 55, -72, 4, -181, -237, 9, -40, -305, 166, 24, -212, -195, 183, 125, -86, -108, -292, 136, -87, -69, -27, 94, -172, -73, -42, -140, 72, -176, 157, -58, 14, 15, -164, 182, 57, 233, -122, -17, 142, 203, -149, 44, 67, 107, -77, -24, 184, 114, 115, 123, -95, -175, 134, 80, -190, -291, 141, 250, -111, -77, 359, 44, -255, -189, 8, -47, 42, -17, 123, -274, -18, -103, -31, -460, -104, 137, -174, 77, -17, 186, -57, -314, 1, 29, 34, -185, 76, 162, -240, -153, -132, -283, -236, 138, -86, -154, -189, -125, -281, 31, 15, -182, -51, -234, -137, -207, -238, 52, 74, -78, 25, 53, 10, -61, -74, -82, -125, 332, -72, 80, 186, 223, 330, 11, -55, 23, -61, 61, -151, 284, 125, -76, 11, 106, -92, -35, 230, 153, -31, -91, 231, -19, 202, 135, 24, 132, -152, -352, 30, 4, -195, -90, -15, -332, -125, 140, -195, -270, -237, -88, 53, 132, 47, 312, -44, -45, -37, 11, 31, -189, 170, 28, -252, -171, -14]
4167a4J0j0p8R9j26j41M86j5l82j24P3K09J5J92j89k59K12r8K25l30K6K23O0k90
4191b26K1J35j00J99J42j50K3L46l32L1J62k88m7J80J19k27M52n70L19l18L74
4212B45j96j73Q6j2k7o3Q9L18m81M32j11K35n58L5J82j80J73O7P4k91j33L96J31
4235B38l93L48k04K85m56J18l44L30J06p1p3M2K11l52k65N22lJ4l7k99M57m85
4257c11L70m3Oj54K62n0j97L06m0k34K64l41L14m36M01k07j16J38J52J22p8j24
4279Dj63J61L41k13l07LN6L03p4k87J15J11P6lp5k94M89r4j55p7P2L04l31K80
4303B42j78Ml75L77J91k66J96N8rk95L23k73j89J83J12j66L9J05o0jJ51q5k03
4326a19K75j34M2m1qR5j67ml0K21j46j51m2J68l7k23pJ18J39J74o5l58N53m02
$$ y = [-14, -4, -14, -92, 7, -119, -260, 226, 211, -171, -295, -222, -13, 2, 194, 5, -254, -42, -140, 85, -245, -219, 4, 64, -226, -205, -70, -170, 29, 171, 21, 44, 390, 58, 89, 251, -37, -84, 96, 215, -12, 440, -130, 189, -129, 245, 49, -124, -38, -50, -77, -140, -51, 267, -214, 218, 107, 342, -216, -181, 1, -179, -6, 61, 135, -156, -289, 107, 238, -155, 193, -11, 274, -182, -64, -408, -78, 28, -43, -116, -74, 137, -215, -480, 42, 39, 53, 16, -283, 174, -311, 59, 16, 22, -132, 130, 80, -117, 189, 149, -85, 179, -162, 152, -284, 117, -90, -206, -68, 84, 206, 128, 4, -159, 2, 343, 130, -177, -174, -118, 185, 111, -176, -61, 50, 126, 123, 48, -246, 243, 149, -6, -83, -11, 293, -38, 242, 64, 68, -307, 70, 261, -5, 191, 249, 240, -55, 268, -5, -194, -11, 101, -65, -26, 79, 19, 18, 169, 84, -119, 156, 22, 64, 23, 15, 110, -57, -61, -91, 130, -16, -167, -209, -41, -78, -301, -308, -190, -51, 123, 58, -300, 253, -149]
4350a49J4P4M7J0J49q2j13l7L41k14Ok72Q7N7j90J9L46k58K9K06m0L3k68K06K2
4375B3k62J34J45K71m01NQ5J68j9l15M4J8L65k11j86M10n5k8l69K04N2q7K26n0
4399A67k11k0M4J70n1J9L2o0J18k2k16K86k56O2j73J25Q6J0n3k22K81j20m5k15
4423b64K63J82m4j69k04n4J76m3L46k44qM6j13L76l07l06N82l15m6L8L65k53l5
4446c1k39L60K3k01k32N34k31J32K17j01q8J51k71l5K21k66L56m26L27k62j51
4467b13J50L21j81q2j17N6J1J40Q7j15J84k12m5k20Q6K15p4K28m07M64n06L11
4489H1l6J17J37j83J26k66K50O8m26J49J99k07J21Qk25j18l9K65J67r4P0N4k87
4512f9N1l0m8J86o4k37J13l1K59j30p0k47L47k62Q2M7L9M8j33R8J23j59P1l2L91
$$ y = [-149, -135, -61, -14, -4, 145, 63, -50, -87, 254, 40, 46, -226, -139, -82, -272, -253, 93, -165, -136, 70, 30, 63, -205, 1, 23, -239, -105, 40, 311, -90, -85, 0, 168, 149, -166, -122, -104, 261, 50, -136, 274, 219, 191, -178, 26, 78, -9, 217, 167, -44, -64, -20, 150, 99, 118, 150, 90, 208, 186, -30, 256, 0, 62, -111, 14, 100, 110, 57, -165, 116, -4, -49, -264, -1, 181, 137, -32, -236, -290, -114, -157, 189, -55, -63, -17, -130, 246, -61, -367, 215, -100, -146, -108, 257, 4, -31, -270, 90, 113, -88, -320, 214, -17, 115, 332, 231, 143, 294, 23, -12, 209, -57, 299, -127, 200, -62, -213, -63, 258, 77, -5, -122, -66, -55, 85, 172, 57, 241, 29, -16, -236, -150, 65, -9, 219, -188, 276, -230, 81, 45, 162, 299, 116, 242, -24, 226, 294, -132, 17, 216, 9, 130, 138, -87, -205, -244, 21, 188, 94, 164, 218, -69, -18, -48, -96, 90, 26, -211, -98, -129, 130, 0, -70, -317, 30, -232, -150, -103, -64, -16, -149, -51, 72, -87, -16, -48, 343]
4537C43n50J47J69j98J88j14M0K39j86j10j09P2m5J18K4M6Q4j71n3j71L11j35
4559f1J90n48K28K17O4O1k17q2J80O2J38m22L41J00j11Lj64k87N48l7l66M35m34
4582a62K53K96p25K84J49M0j6k26n8J95k57K17J73j71j29L5J41l29K48J34m1K3
4604G4j9J43k05J73M1n91N7K24K45n5k94J0J89N6o0J11j06J28k59k98L82k17M2
4627b29J35M7J42J14j98k65J17l8L09J96j45m3k06J80M7k99J80j63K99j17j09
4648d6J08Rk59L75l8k6k14K34o3M1l2k80K95j9k66L83j25j77K38k47J00j4r2K53
4672A38J13k55j99M22k36K05j56J77J8m25K13N3j95K6k01K60n3K24j14k55K8J55
4694e7J94j94j69K12j8M0LJ13q4j32n7J55P2j69o2Q2j4lk23J81k81L81j67J75
$$ y = [343, -207, -60, 109, -89, 99, -15, 25, 264, 78, -32, -141, -69, -114, 4, 28, 74, 158, -13, -66, -237, 74, -61, 129, -419, -191, 26, 90, 151, -66, -148, 32, 94, 232, -190, 151, 251, 140, 143, -21, -308, 240, 203, -163, 272, -162, 91, 387, -338, -54, 95, 135, 119, -107, -165, 30, -227, -10, 163, -8, -137, -102, 39, -290, -42, 92, 51, 74, 55, 198, -7, 166, 207, -384, -327, -103, 142, 87, -207, -197, -8, 48, -12, 99, -7, 121, -138, -436, -54, -271, -229, -94, -47, 95, 209, 11, -254, -137, -175, 134, 330, 185, 142, -64, 116, 163, -136, 44, -119, 180, 63, -46, 62, 71, -188, 187, 149, 123, -91, 143, 80, 121, 89, -191, 104, 85, -181, 202, 77, -100, 138, -109, -9, -23, -115, 138, 251, -4, -203, 219, -17, 188, 32, 209, 227, -198, 15, 68, -127, -101, -302, -42, -95, 129, 15, -240, -212, -57, 137, -57, -226, -14, -32, 8, 11, 124, 40, -92, -149, 6, 78, -91, -153, -71, -85, -88, -311, -130, -411, -30, -197, -22]
4718b2J3q1r8K30j82J0J47j88J17j35K39j42J98j2J61k05j37J52k44M0K04n1o9
4741e5M7K29k99M1j44K05o3J48j28j82K52J2Q3q3J77k79N4j01J88m14K05P4N1
4764A8J31k96K31o8o4J19l1j83L42L8k08l53J47l8K1L52p9J32K7o5l92J52l16
4787c83L47k1j3m9L6Q9j31p0K25p7Q9j14k7L23j81l4o1l09M14l3j20P7o4k5j82
4812b94M72k37p3o4M6J80k21P6j15K58k8j13P9J04k30L67j84o7J14J8j03J94n0
4835A29l94N9M68l01l4L6m9L64Om77P9L08j10K54k5k13p4J50k29K63l53M6L10
4858B13J7j20pKk6p4j3RJ03O5n01L87j73J80k24P3J34j59O5J97L1l39q0L32r8
4883fL47k96q8j08j12J32K68j30oJ9N3j85J48l6j04J82j38l9j8r4J51n8J69m18
$$ y = [-22, -9, -90, -188, 42, -140, -130, 17, -171, -54, -189, 50, -92, 106, 94, 255, 50, -87, 65, -179, -139, 65, 14, -55, -8, 221, -78, -37, -181, 24, -39, 109, -19, -201, 51, 63, 146, 63, 240, -39, 15, -86, 102, -312, -107, -33, 18, 149, -147, 84, 16, -48, 71, 40, -143, 199, 237, 29, -324, -177, -215, -194, 158, 79, 211, 238, 173, -219, -67, -383, -36, -57, -70, -119, -83, 6, -125, -195, 30, -47, 42, -72, -99, 224, 43, 9, -52, -361, 53, 20, -100, -23, -87, -112, -294, 178, -59, -132, -196, -150, 30, -191, -115, -230, 28, 0, -113, -34, 70, -160, 207, 23, -44, 70, 88, -15, 179, 129, -265, -206, 262, -39, -73, -37, -86, 278, 284, -193, -114, 194, 84, 338, 313, 100, 26, 176, -53, 210, -143, -97, 213, 230, 110, 103, 105, 79, 5, -8, 1, 104, 169, -332, 55, -118, 62, -162, -89, 45, -114, -49, 148, 179, -160, -240, 92, -6, 341, 45, -43, -151, -263, -131, 137, 7, 1, 20, 73, -112, 36, 0, -104, 78, -60, -99, -117, -211, -60, -118, 51, -367]
4907c67O6N26p3J25l46L28l18J31K12l02j9K04j77j5q7r4J40j33J61L39k15r8
4929a2J24p6J05j57K40j85J36j19q5J07r3k59K79K09k58J42j52K61k34J44K8k03
4951e8J8j2J04q2j11L38m1l22K4m2R5J4P4k4jk8J41N4p5j88j05%J77j14J5J14
4977c5l8J21MJ12k94Q0R6l8k5j56Q1J19j27R6j78K58l48M32R2l34M0n9K10n1j83
5002a25J20Q4j1J51l9j96J24J0j49rJ66M2l37P4L53J7k34K9j92J95K21k99j2j75
5026a92J73J10k13L38k93J31M3q4K23j39j19j89K88k17k3J2j14M26p5j45J80q9
5048C2J25k60l7J4J17qj72K53q5J31n0l05J53M7J6R8j30J9l6j15L6l4o4k2K60
5073a7L7J58k96j11J89k07L38q4M6O3KJ1J33m78K24N9l14K56J03l22L21k0J8p
$$ y = [-367, -301, 225, 152, 277, -69, 259, -59, 72, 284, -18, -37, 167, -10, -25, -112, -206, -66, -199, -38, 301, 86, -12, 112, 36, 141, -16, 224, 39, 175, 56, -29, 78, -15, -274, 5, 214, -44, 98, -54, 207, -27, 117, 145, -58, -40, -52, 52, -30, -141, 197, 156, -166, -142, -184, -89, -75, -1, -25, -26, -54, 87, 141, 66, -122, -227, -227, -50, -164, -149, -35, -73, 48, 52, 164, -130, -50, 46, 8, -17, -173, -92, 27, -100, -4, -182, 76, -272, 160, 252, -82, -42, -101, 109, 58, -125, -5, 79, 68, 219, 180, -16, 108, 118, -31, -40, 126, 168, -169, -95, 258, 275, 41, 70, -122, 73, 294, -5, -17, -192, -19, 91, -122, 216, -77, 54, 97, 13, 236, 97, -22, -211, 77, -140, -163, -151, -265, 161, 86, -59, 121, 32, 157, -103, -140, -126, -9, -17, -189, 64, -21, 110, 60, -245, -92, -45, -29, 69, -61, -42, -78, -193, -157, -191, -255, -277, -17, 20, 178, -118, -229, -40, -247, 91, 7, 53, 116, 118, 129, 262, -216, 8, 67, -247, 9, 112, -210, 111, 91, 109, 102]
5097A02k23J39L0j9M5k5k17K5K76o4L2j35L61k16N7N4j56J62p1m0J4J09k37J11
5121A14n3J35lk34J51Q7P3j57N7l08j4PJ9K75J00l01K61l35J14j59K00nJ35k57
5145i8K80k72mj19M38j54k74J14L7P8j54m2K10k90R4O1pJ74j18q9J84n35L55R9
5169c2K85m28j7M02k19K24k39M2l28M75l2p5qp3L6j23M1j40K74j70j38K15J49
5192A21J04M3o9l08L5J01m7k0K79k29P8n0q3J39J57k32R3K96l32k35J68L26k41
5215I4J53k61n3p4K70k70O0o9o2j72K65P2Q8K8r0K12j84K47j5l32J52j84o0M0
5239a45J67j7k18N12l73j75Q4K83j00j54q2J13K15l13Jj42J99j42K71J64j14m8
5261a4J28l21L1n9L2k0K04k3j09L09l91J00N8J69j29Q%R7J91j30l31J53J37k35
$$ y = [102, -121, 18, 48, 29, 74, 49, -168, -143, 133, 69, 101, -34, 327, 111, 168, 222, 66, 228, 157, 117, 131, 240, 3, 114, 61, 196, 193, -41, 110, 197, 270, 113, 170, -138, -152, -145, -126, 149, 249, -52, 209, -126, -12, -171, 29, 24, 159, -98, 182, -90, -94, -213, 225, 71, -203, -89, -52, 26, -128, -170, 40, -250, -156, -95, -102, 72, -46, -135, 49, -486, -131, -32, 253, -175, -192, 210, -9, 215, -24, 18, -310, 165, 133, 58, 50, -23, 13, -110, -69, -209, 65, -105, -243, -28, 121, 225, 268, 199, -109, -74, 27, -20, -40, 239, 10, 88, 38, -45, 94, 251, 19, 112, 408, 76, -159, 9, 335, 94, 247, -14, -67, -141, 129, -141, -81, -150, -212, -384, -119, -47, 41, 69, -21, 191, 7, 254, 239, -93, 59, -125, -185, -145, 22, 5, -213, 299, -74, -249, -165, 118, 18, -136, -218, -105, 110, -203, -202, -344, -145, -287, -16, 148, 34, -14, 114, -207, -176, -235, -203, -223, -19, -42, -151, 158, -233, -133, -75, 94, -35, -27, -27, 70, 261, 131, -200, -47, 90, -145]
5285a45L52L9k75l5K8j98L13J0K30l75m6L57l64Q1J20j18j61L74j62L6m2k4k7
5308c2J13Nj36m5L47j30J3j26k2Q0J1k19L09q9l00J06M8K05k56j07J61r4J44j34
5332a48J68m52J59JK93j71J18j41L4K48j98J4Q3J20j34m6O8j81MJ42O8M1m7N4
5356I7j88J12r8K3q6J08j87RO5N0K7K19j63KL08k09L8K5J7M0j1k70J82j09J5m5
5382b9j83J65L87o23L95Q3k38R9Mm8M5k30K49J9j52M4K5J41r3j00j1K95k20k3
5406AL3r3NK35k50k80L08k5j83K92o3K29J7m30K57k00K00j6k54j3Q3L41q7K0j84
5431e7K63l99J83j10L46l59Q8j7j74P8L35j89l44L69J30j09j37K74k80N5j63J52
5453f5J08j51q7L0J52J02o7n7K27Ll06K10J03k56J96J21l79j67K78Q8r2K67k35
$$ y = [-145, 207, 246, -29, -64, -36, -234, 79, 89, 319, -56, -102, 255, -109, -28, 92, -26, -187, 187, 25, 61, 19, -5, -32, 81, 86, -50, -95, 252, 122, 135, 9, -13, 67, 78, -141, 168, 79, -221, -115, -67, 138, -118, -225, -64, -158, -14, -148, 20, -432, -273, -272, 21, -150, -32, -173, -139, 109, -89, -75, 8, 128, -6, -52, 16, -165, -161, -19, 49, 90, 43, 97, -91, 21, -77, -54, -140, -32, -219, -210, -145, -95, -68, 151, -12, -10, 298, 89, 127, 152, 169, 209, 198, -72, 110, 1, 16, -29, -212, -47, 340, -283, 112, 195, -43, 56, 60, 12, 57, -173, 76, 95, -57, -13, 12, 153, 60, -40, -51, 244, 24, 1, 34, -59, -54, 181, -69, -349, -41, -66, -249, 43, -20, 209, 226, -204, 53, -147, 53, 37, -217, -230, -147, 194, 107, 127, -57, 206, -193, -10, -120, 226, -133, -45, -62, -236, -158, 177, -12, -356, 13, 143, 34, -103, 171, -109, -54, -217, -65, 43, -108, -195, -165, -13, 89, 22, -35, 192, 195, -111, 99, 202, -54, 142, 263, -116, -283, -5, 83, -9, 258, 23]
5476B3N1P2k74L65m20N15r1k06l17O5M02j28Q1j7k05K40j91j61M7j21R8L69r1
5499A06k55K54j66o9n0K00J88K7l73K8L38l37k8N9J69K48n37O6M5J54k66O9J74
5522D4l68K28P3q0o2J10j63K46J15K6l93J62K42l56J2K36j48rp1L38L7j75qP3
5546A09J13m65L12K1n7j07K3k8l0K97j26J37n65L53j06K66P9l49j01K67p6J67
5568A34k44L5K9j8J48k6l5P9k4m2j29Oo8R6J24j44n7K86j68J25K35l44K08l10
5592a04K10k55J11j71K33j07k5J29j65L9J87L2j00K30r3L0j17j4N3j84MK2J19
5615F4J57k27j26n6j11J84J64j7j24j26K93k02l4R3K31L2j63J29j64N2j34j0J70
5638G5p0k87L67j72L71k90r1J04J84j55m6N5o1Q6M6q6j4j33K90j2l2l83K82J28
$$ y = [23, 74, 146, -128, 237, -183, 332, 241, 35, -282, -217, 185, 57, 138, 121, -84, 156, -35, -196, -149, -270, -172, 197, 106, -149, 105, -61, -130, -180, 20, 208, 235, -138, -110, 228, -109, -137, -78, 91, 339, -198, -132, -87, 67, -199, -130, 44, -324, -96, -23, -103, -165, -55, -218, 28, 143, 169, -224, -62, 180, -176, -164, 72, -76, -85, -156, 182, 219, 44, 36, 109, 222, -243, 69, 90, 33, -74, -51, -79, -109, 188, 62, 199, -366, -13, -119, 147, 226, -123, -224, 43, -33, 134, -110, -75, -46, -64, 84, 58, 23, 102, 78, 36, -93, -87, -155, -59, 65, -79, -136, 150, -18, 107, 342, -2, 206, -104, 106, -149, -38, -209, 24, -83, -108, 21, -144, -105, 82, 114, 14, 244, 151, 181, 64, 50, 103, -81, -77, -55, 64, 221, -6, -132, -188, -299, -115, 49, 32, -92, -218, 75, -127, -161, -68, 163, 195, 32, 161, -3, 49, -85, -95, 75, 5, -282, 85, -87, 284, -6, -97, 7, 191, 36, -10, 45, -16, 70, 116, 30, 16, -117, 173, 161, 129, -254, 28, 156]
5662A56n1j08l00M42p5j28K26k6l9j8J30K0L7m62K46L1k01p4K37j76J11K67l38
5685i3K37j70R6k63M38l30k8L8n3J44j46j40J58l7K18j34j31M65j65l93K19l3
5707a03j64K18K2J15L8j94k48K74k9K28j17j54P5K17j90Lk25J32K48O4k96O6n8
5730g8K07j18R8R6m14K30KJ64J2j23j40K39k1n5Jn32M98k12K6K33n8r0Q5m5K62
5755B67p0j16k00J2K87j08r7m6J78l17L35l5j18R0k70K02LJ17j04k47L21o8l3
5778a7M6K30j43l4j81K10k89j8L80j25J52k27R3l65J65K91k90j25k1O5n9J60m6
5801a48J55k3j67j8J58m5R6j90J11pj90K10K5R3R7m1J0O1k82L13j14kk20r8K43
5826B7k02J58J55k79l3L75q1k73n4J75j89N21Pr6j27l36L09k16J10K1J1M8j33
$$ y = [156, 105, -3, -303, 139, 64, -64, 162, 136, 97, 79, 209, 229, 266, -196, 50, 81, -120, -194, 43, -133, -22, 245, -93, 144, -26, 70, -193, 245, -85, -113, -75, -128, 16, -130, -270, -112, -149, 69, -65, -196, 269, 104, -289, -70, -103, -267, -49, -27, 88, 126, -68, -316, -42, -71, 157, 40, -114, -39, 178, -12, -9, -234, -102, 146, 210, -86, -20, -78, 129, 11, 109, 205, -209, 21, 23, 187, 199, 76, -64, 175, 154, 99, 100, -432, 66, -146, -120, 113, 55, -35, 50, 5, 267, 197, 81, -119, -107, 180, 72, -25, -71, 107, -210, 125, 90, -28, 62, -208, -6, -3, 114, 10, -237, 84, 16, -17, 29, 259, 116, 82, -99, 111, -178, -196, 184, 59, 211, -16, 77, -288, -123, 168, -122, -247, -268, -203, -262, -102, -148, 7, -16, -183, -201, -43, -88, 8, -182, -71, -78, -268, -58, -33, 60, 157, 116, 126, 187, -95, 218, 104, 102, -118, -216, 27, -175, -17, 138, -141, -174, 201, 120, -153, -207, -32, -221, 300, 307, 211, 84, -252, 57, -159, -49, -28, -17, 31, -102]
5849a02L26l28K27P4k30J02R4N3q6j10q4o7J01l4J75j27K61r2j51J63j78q9K80
5872A78k66P6J10k7p9k4nQ1l6r9j00K65Kj92j88J33N8p4Q4l18K92J14P4Q7j24
5897B2k42K21P0r2O3k61K84K10k30N4j8L6N5j19k15J39p9Rq8J72R5k44JK93l58
5922b22K42J61k22L2q3K92l62K30k02L18q0k99J0L22l6j68J09p0m5M8j5R5o4j87
5946a96oK02K09l50L15o2J1o1J16l0J12j82O3Oj93k6Q6k7J52r0j21K37j10m51
5970c96L49M0L4j72mn0K06J46l59J19L66k77%j06j11L5M8K43j12j95M15k74j10
5993a65J44j3J34k49L8J60L4K8l55K12K3J22j67L8P3j00J94o7j15r9J29L0q6K8
6017b9RR1j03p7J76q6np7K34ro0k4J91l68M1k0J16R0r9o1M9j25K48r7K75j69k74
$$ y = [-102, 224, -104, 123, 197, -33, 69, 163, 216, 130, 20, -64, -131, -30, -64, 111, -16, 245, 153, 2, 165, -13, -102, 178, -88, -12, 98, 71, -8, -32, -37, 44, 8, -91, -191, 74, 76, -116, -304, -171, -113, -187, -103, -421, -129, -15, 59, 146, 22, -220, 1, 71, -21, 42, -219, 65, 275, 45, 99, 81, 117, 172, 53, -162, -23, -102, -93, -181, -9, 86, -158, -157, 136, -222, 20, 181, -41, -9, -92, 200, -162, 68, -134, 184, 104, -195, -185, 137, 101, -67, 42, -28, -73, -25, -40, 55, -9, -196, -202, 0, 209, -141, 174, 112, 123, 62, 178, 148, 260, 78, 141, 147, -46, -72, 14, -13, 139, 49, -72, 165, 55, -396, -47, -7, 27, -145, -149, -199, 7, 153, -206, -87, 279, 2, 2, -104, -215, -180, -132, 111, -1, -196, 219, -55, -165, -21, -34, 100, -149, -111, 49, 83, 111, -244, -32, -9, 113, -54, -16, 57, -43, 151, 84, -31, -130, -1, 29, -57, -29, -20, 71, -32, -109, 67, -19, -24, -101, 133, 124, 64, 40, 231, -137, -96, -116, 0, 90, -9, -70, -21, -146, 102, 5, 280, 111, -163]
6044a63O0k7n1K15j64L7K4j8K36j98M7N0q6J07M4n3P2k84J02J10j26J79K07j90
6068A30m09K46k9N0J33j88%J48J10k44K25m00M66k73M8l9k50M05J74k30J5q7J41
6091A42j29R9k57P0M8k24J83l40L09K63j58j34K34j56J55j7P3M8m89M99j88m6
6113a5J66k5m8k09J98k19J91j40J5J36N5m5J47j24m6l1K58m71K98j0o6k5l3J2
6137c1K1R1J05k32k8J13J50j6q4j86K13m7k84K22j89J86J20O9j40j83k2K09j58
6160a01L9J2L8o2k12m9L75J90k57R8k36M7J83r9J7J23j67P4k62K51j31PR1k01
6184b32M86k92jj8P7J20J46j44k22nm8K6J72Q6J5m6l52K54j4q9q7M30j93Nk2n7
6210eJ38mj12P5j63N6K56j9j53qr2M9k82L2L95k91J92j57K19K7j03k14J17J34
$$ y = [-163, -103, -130, -181, 34, -130, -93, -69, -87, 149, -49, -2, 48, -38, 69, 113, 60, 132, -152, -50, 60, -66, 113, 320, 130, -279, -33, -62, -12, 121, -67, -67, 81, 191, -53, 172, -228, 238, -35, 13, -26, -276, 129, 303, 73, 88, 1, 142, 13, 112, -145, -75, -27, -251, -68, -408, -99, 164, 6, -128, 106, -50, 105, 88, 161, 209, -280, 219, 31, -15, 151, 126, 78, -131, 67, -152, 39, -101, -86, 50, 105, 60, 207, 83, 37, 6, 264, -207, 91, 81, 15, -10, -43, -31, -10, 81, 186, -46, -74, 39, 189, 173, 89, -97, 116, 69, -215, 7, -182, 4, 124, 193, 53, -130, -152, 57, -101, -62, -50, -12, -74, -286, -335, 40, 230, -27, 71, -165, -118, 65, -34, -17, 106, -61, 13, -249, 2, -129, -122, -31, -232, 254, -38, -39, -57, 20, 140, 286, 142, -80, -85, -133, -107, 65, 151, 166, 120, -232, 22, 8, -81, -168, 262, 69, 74, 52, -5, 133, 129, 17, 92, -71, -15, 241, 222, 69, 61, -31, 18, -264, -232, 163, -128, 64, -93, 126, 153, 50, -164, -47, 87]
6234H7r6M7k76L95m83L65p9o8N4l5l8J09o2p3L37J3j76K32r7k11Q6R1k41n5J08
6259f6J0j99J29L8K61l02nJ69m5M5K09l14K24ml23L36r8o2J5J4q5J68K6j55ro4
6285h7J43J2m1J11R3l16K31K59k18l25K23k60J14J02l67L27Kj38L60M1l0n24K92
6308DJ49l03K58J47l13K69l6r7J45k51M1o4Q2k63J46K69r5J6r5j18j15L26j97
6331i5J92j21q7L6P8p0J37L02o63R9M59k41o9K01l40K92r6P5r7o5K03N0k25q3
6355a28L82k43q3p4J73o1M6NO0k99N17j01k63J57N0l99L44R6j81J1J43L9j26j32
6379f7j37K15n7J07lj04J23J64k52Q5Q2j20N1k30K65k26K84o8j24r8J9J91k8M0
6403A12l35M64l92J95l08J92K30J64m28K4P6J70j19l0l84L61l5j22N59l30n3m5
$$ y = [87, -9, 38, -238, 157, -326, 39, -40, -108, -54, -89, -127, -18, -80, -153, 184, 197, 21, 253, 156, -55, 31, 122, -119, -174, -66, -56, -255, -126, -88, 173, -129, -134, 35, -10, 35, 244, -70, 154, 150, -173, 163, 65, 3, 18, 32, -53, 115, 141, -14, -23, -87, 56, 68, 27, 138, 231, -85, 146, 405, 187, -138, 85, -175, -61, 41, -326, 1, 3, -135, 225, 266, 236, -288, 4, 153, -150, 108, 255, -58, 211, 175, 78, 223, -28, 13, -51, 31, -232, -86, 183, 88, 104, 9, -109, -224, 102, -95, 97, -24, -111, -75, 3, -67, 70, 372, -291, -192, 267, 26, -43, 158, -182, 110, 14, 89, -8, -73, 130, 180, -45, -128, 254, 11, -72, -146, 27, -34, 12, 17, 77, -222, 295, 194, -69, 88, 138, -261, 83, 179, -2, 9, 152, 191, 65, -67, -204, 11, -46, 61, 58, -46, 77, 241, -11, 74, 156, 36, 87, -143, 122, -104, 180, 112, -12, -110, -91, 100, 72, 112, -223, 241, -151, 44, -264, -72, 158, 322, -106, -82, -6, 164, 45, 15, -369, -8, -43, -165, 394, 64, 11, -34]
6425c4Lm7JJ00J64k97qj37M46l68N6J41J00k40L1K41j74J62N7k77J07P1M7k26
6449h1J09J22J93l91k0k0J70j30k29K09j0R6L00m20J23J39o2p2J65k31j98J79
6471e9l3J62K83m27j3O7j89J19Q4J44k0j00L26o33K91n0j11J15q6J64q0M7R9j79
6495g9o7JJ32j94M46l23J32pj52kR7j06K2J24J44j21l15M99l88M20j05k51L19
6518B26j25j60L4L9M5j69L95m89J19Q8j16j42J72K52j99L6j9J42j28k00J81k23
6540b41J24PJ81P4k08J22J34j31j12K29k54K03j11l1K10k05n6j30K87q4O4N5O4
6563A91k08k2p3j4J24j89L44k82L24j45l0O0K21q7j61j10L3O1O3k09k5L23j85
6586DJ02l14R3R2n0M0qj97J66j26Q0n6K12j61J89j97L34l9k65L24k99m4L53l39
$$ y = [-34, -31, -78, -77, 23, 187, -110, -118, -255, 191, -177, -121, 20, 120, -120, -89, 152, -22, 140, 197, -80, 27, 98, 145, -81, 28, 150, 343, -48, -68, -88, 82, -48, -277, -68, -78, 18, 318, -102, 21, 160, 98, 26, 191, -40, -238, -59, -92, 70, 353, -74, -87, -20, -209, -90, -6, 138, 118, 18, 344, -289, 2, -48, -159, -44, -130, 34, -46, 1, 100, -79, -146, -145, -13, -207, 239, -84, 48, 41, -111, -113, -16, -122, -100, 24, 168, 47, -268, 231, -157, 263, 158, -93, 226, 101, -59, -25, 14, 59, -110, 285, -204, -85, 3, -113, -255, -83, 169, -30, 6, -13, 129, 1, -199, -18, -241, -117, -110, 71, 145, -63, 59, 193, 62, -50, 179, -75, 128, 17, -14, 196, -9, -65, -195, 92, 8, 72, 127, 191, -17, -39, -112, -126, -2, -191, 153, -129, 195, 50, 20, 80, 301, 214, 53, -57, -24, 37, 100, -109, -134, 189, 4, 106, -208, -115, -23, -73, -33, -41, -238, -72, -198, -118, -174, 38, -123, 66, -131, 203, 164, -101, 223, -76, -120, 233, -106]
6610a06K74k40K92k34J83j71j18K52j42j7K07k57J2O5k56L69p5P8j42J12k96J88
6632b2q7n0q6L86k45J21j59l6Q9M46k77j36K5KO3L4k32L07k38J60n4m2N7p6Q5
6657C5k67M37k19kQ8p6k7p8M9N9J24r7k33K77j13R5K7o7J11k83P5R4j12o1J70
6682Fk81J45J19K44l14L05m48L57L5J0l54L17k6k04J98l57J66j7J99k23J71r3
6704d5j1J15m5j88J43J26j14J41j95j7J55m2M3K42k80m1n6L90k35j35oJ97L0j4
6728A58k14L7P1j30J83m74L02N4K04l62L85j95M4J44m73K14J45L43m11jn5K75
6750B44k40j59j5M0K13n3kJ26k67N8P0K55k42j41J41J99k48KJ80k7R6k24K82m17
6774a29L07j18j72J45N8k94J82L1L4l6k91L26L7M2j77J45j78P0K76j00p9j48K08
$$ y = [-106, 168, -72, 220, -14, 169, -2, -120, 132, -10, -27, 180, -77, -65, 0, -256, 113, 38, 116, -26, 86, -210, -22, -109, -159, -245, 141, -104, 17, -142, -178, -89, 357, 80, -56, -31, -29, 34, 68, -164, 143, -95, 65, 11, -31, 26, -50, 35, -232, 205, -14, -16, 72, -4, -31, -109, -60, -1, 123, 26, -207, 70, -43, 52, 79, 12, 123, -160, -85, 9, -103, -164, 6, -275, -130, -11, 233, -81, 224, -224, 133, 168, 178, -176, 141, 115, -89, 109, -248, -82, -99, 100, -123, 48, -45, -56, 59, 14, -174, -31, 95, -19, 122, -73, -90, 65, 23, 66, 308, 28, -13, -69, 321, 86, -49, -55, 142, 172, 158, -56, -19, 52, -78, 105, -369, -67, -13, 191, -171, 214, 19, 63, 207, -266, -52, 93, 436, 25, 24, -31, 244, 4, -155, -170, -130, 83, 30, 28, 154, -113, -55, 15, 270, 28, -113, 28, 227, -21, -19, 161, 134, 230, 6, 288, -129, 178, 60, -112, 33, 91, -203, -21, 10, 44, 8, -283, 43, 80, 122, -55, 90, -88, -18, 258, 158, 79, -69, 139]
6797A39l53K35j22l2j40L04j74l4R7k0J34L3q9r0k7K17J24N0l63O1J71q2M9l40
6821b52J21J24O0Q1J18p2j45qJ27k72K30j17j67Q1l12O16k38P0k2j42J68J09J08
6844B66k99j19K0q1J23pJ30k53l3K80J89m2j13j99J56P9j80J57m04L93N9K0k14
6867g2m5L2N1J84j76jM5M6q9J15j97j70K75j19O4R2j99K30l9K8j22K00m8J25k58
6892d8r1L8j19M74k08k33K25J01j50J52j82q7J91j51J40Rk89J50Jj3RL08n04L66
6916H9n4K43n52M20k57K13l24L62o5l41M19k49J94J08k60q4L20j77J33k06k6p5
6938a69L2J60J33Rk62J55j80K34j18j62J45j1L56k63r2J59j79l8J54l5r5o6L89
6961B56j44k35K38k21K89j5j94k15L42o0j8j82K77l5k4j27JJ60j87k4o3R6N2p9
$$ y = [139, -214, 21, -101, -133, -273, 31, -143, -177, -80, -100, 34, 67, -22, -112, -139, 78, 202, 252, -111, -50, 121, 39, 88, -252, -131, -7, 53, 134, 252, 180, 35, 27, 154, -118, 112, -5, -172, -91, -403, 213, -25, 45, 23, -119, 49, 158, 266, -33, -152, -132, -213, -90, -97, 33, -220, -253, 27, 216, 174, 61, -138, 18, 97, -83, 74, -330, 63, 122, 142, -72, -117, -85, -34, 150, -26, -27, 18, 64, -25, 90, -107, -277, -2, -121, -57, 35, -164, 66, 27, 55, -67, 133, 85, 210, -48, -139, -101, -220, 254, 46, -187, 38, 139, -11, 141, -41, -128, 63, -88, 52, 61, -228, -78, -77, -90, -81, 227, -277, 89, 35, 278, -274, 146, -111, 102, -222, 140, 75, -266, 153, -96, 98, 206, -54, -138, 182, 5, 138, -68, -94, -169, -137, 23, 156, 165, -97, 58, -122, 112, -6, -168, -23, -34, 322, 59, -33, 126, -53, -91, 63, 28, -67, -133, 256, 112, -123, 115, -106, 183, 168, -26, -241, 101, 41, 23, -159, 118, 83, 59, -68, -67, 93, -94, -118, -181, -85, -33, -112]
6985a12pJ03PKk51J25L6J01J6K7l02K04L20m28%M3P9M7p4j84J05n7L64p6l07L43
7011A24J34l40O2j60J79Q3K20l41K11l59N70l84R1N1k73K89j06J51l88M34k37
7032A1K31o4J29k06J26Mk31L80m12K93l81K72k19J67L1j57o1j1k1K76j05k40L17
7055A29L3o0n6M3j34q6O6K93k85n9m1M38q5q5J24m58L61j75k2j98L58j66mJ05
7079C6l02K08K15n2k49J63k50K00J41M1J8k45J43k96M22j32j12L8j21q3L24k34
7101a27LJ22q5K49J55l76J52p3r0J54j69J72k24r4K80L0J23j60p0j81L37kJ39
7124B65j24o8K5k04J65m50N72k28J88l47J08K89j67J65nj13K30p6k15k9q9J21
7146A3l02L69j61L24j56J24j92j18K27O5j53j2n7K18l25J69k83j7K06r8J39k54
$$ y = [-112, -119, -16, -9, -7, -258, -133, -97, 4, 20, 47, -255, -51, 269, -159, -159, -116, -37, 10, -64, -248, -143, -200, 164, 88, -219, 124, 258, -82, -20, -180, -1, 82, 302, -39, 172, -187, 383, -1, 90, 141, -132, 157, 51, 202, -186, 248, 11, 242, 178, 307, 101, 227, 231, 0, 380, -32, 261, -120, 152, -67, 100, 131, -26, -87, -98, -119, 157, 52, -188, 129, 162, 102, 46, 89, -45, -131, -65, 228, -57, -116, -157, 281, 196, 111, 235, -223, 138, -37, -59, -257, 101, -65, -69, 36, -266, -58, 157, 105, -144, 19, -231, -31, 110, 151, 169, -76, 67, -229, 193, 61, -51, -13, -134, -217, 107, -127, -124, -2, -87, 162, 317, -59, 93, 20, -70, 84, -85, 87, -137, -231, 49, 79, 202, 42, -28, -209, 128, 126, 265, 141, 73, 98, -106, 59, -391, 181, -47, 141, -206, -98, 191, 24, 189, 184, 71, 301, 225, 10, -19, -108, 13, -289, 80, -81, 243, 87, 211, 19, -99, 128, 193, 40, 28, -29, 189, -136, 33, -250, -267, -61, -159, -20, -274]
7168b74K86K04l36J18j43L85m27J65J27L7j43O6j93J85k1J7R4M5k15K98l56K14
7190A33Nj59J2M0K46l30o8L13K8j51m0j3p3Q1Kk4K3j18O9J28n9j61J08Nn4qrJ29
7218E5m4j74N0M05o1j11k01n5j74L61n9l7J26k04J43o0r9M82k52op0j76J8L12
7242A69j49L74l88j13L4q1K65o1q1j04J12k75M26k12nN7P9n0m4J10n8j92J53K98
7266B64k44J00k02m6M80l38r3J47k27L65l53J35Q1L7q3o0J55n1J25j14j25N4K8
7289C5M1L6j07j17n1J31L12j40K05j23k95k09K05N0Q4q0N2L0k2j70K88q5l3k30
7313a93L34J2J2l51K26j74lJ30R0J7j15o5j28J71oQ7ok2JJ0L2K4j38LK9k9K39
7340A87l23J92p2J83j43j97K33K29l94n2K49O5j12L5R7l78J98j23K71k71L23k46
$$ y = [-274, 12, 216, -120, -2, -145, 240, -187, -22, 105, 142, -1, 65, -128, 57, 36, 53, 147, 192, -23, 275, -81, 133, 138, -21, -9, 31, 277, -53, -121, 192, 220, 69, 29, 16, -57, 24, 26, 2, 25, -93, -24, 104, 45, -116, -8, -3, -57, -65, -74, 55, 11, -163, -113, 292, 231, 120, -81, -136, -310, 51, -8, -45, 81, -123, 20, -40, -139, 343, 91, 85, 15, -161, -143, 169, 20, 394, 6, -107, -73, -154, 111, 50, -31, -135, -23, -298, 128, -84, -89, -32, 47, -3, -47, 63, 5, -187, -34, 264, 20, 120, -82, -128, 352, 14, -79, 68, -159, 206, -147, -12, 69, 106, 23, -37, 118, 67, 192, 78, -47, 7, 35, 76, 112, 5, -112, -163, -32, 280, 140, 345, 222, -73, -282, -77, -27, 57, -23, 29, 59, 37, -133, 155, 70, 37, -193, 141, 153, 165, -186, 40, -134, -137, -7, 83, 100, -15, -80, -208, -37, -43, 44, 38, 16, 17, 27, 59, 83, -55, -52, -23, -52, 187, -136, 56, -16, 167, 24, -173, 60, 289, -105, -157, 92, 157, 45, 80, 177, -201, -3, -126, 145, -126, 197, -49]
7362d9Q9J52l28K62j36Jl8N6J89l93J59N2R2j10l9N8j68j41J32J42Q4P5m9j13
7386b1n4k5j18L70k19l0p8K54J17m75L37J6j56J43j69k02M95j42k39J06K11j01
7408B0p5k08L72j32m4K59L0j08p6J09Mj63K23k83K49l22K85K16n17K12j12j84
7430b45K84j52n7K36J24m38K35l5L8k23L67o8k41J66m7K13l61J12J21j24J5M8
7452c2j00Q6J73k59N9J81Rj39k70J84K72n8l9j56K61j94O1lN2j03M8r1J00o1R9
7477H0j20J52p0K18m80K99k87Q8L35k52P6J09m3j21L34k30P6k24N0J73J47l64
7499e4j31K56l1q0k5MJ7K01o4j01N7m2o6j04J70J54j68n9K21j23l75J69K47K93
7523C66k74l15M94k48M8P1k61J27j21K34l67L19r9Q8O3q7J12l01J05L7j28M08
$$ y = [-49, 40, 192, -136, 126, -10, -9, -47, 9, 198, -195, -36, 16, 108, -2, -41, 17, -151, -292, -160, -18, 66, 141, 92, -21, -75, -100, -218, 152, -67, -97, -175, 79, 196, -279, 58, 74, -82, 61, -108, -310, 185, 43, -196, -90, 121, 20, -55, -263, 109, -23, -67, 192, 222, 114, 38, 147, 151, -12, 211, -72, 177, -145, 140, 356, -161, 51, -61, -245, 39, -113, -170, 66, 190, -248, -13, -48, -10, -233, 134, 66, -175, -9, -56, 157, -204, -92, 29, -95, -80, -32, -132, -46, 127, -132, -73, 108, 117, -22, -292, -108, 164, 106, 67, -89, 172, -22, 39, 36, 88, -15, 33, -58, 42, -19, 80, -40, 112, 42, 260, -220, 79, -208, -120, 215, -37, 39, 148, 105, -16, 318, 88, 164, -60, -10, 163, 310, -54, -185, 71, 40, -40, -65, -61, -44, 157, 93, -8, 49, 7, -59, -163, 7, 161, -7, -66, 155, 32, -343, -174, 73, 366, 92, -223, 271, 23, 71, 142, -119, 8, -113, 121, -246, 73, -26, 62, 125, 38, 150, -151, -46, -9, -137, 271]
7545B71j76J26n6j07m0P7j05J3j08o1M3Q3L46l39p5mK77k52K08j51J32r4Q4j97
7569a05R5Q4o5J14q1J91m50MJ68K72j51j77K83j39j13P1N1J5j68l5L50k91M6J82
7593A51J29l82L17j41j88nK98j55R6r5M2J25j66K3L1J48l27o1KJ92j43L4M0j31
7617a66J67n1l07J64p9M21m7j12O4LJ99m56J22j57M44k9j27k35K16j25N4K1J55
7640A39k24O1M5op4J12r4J82l24K59j58o4K42K1j91r3N5M19m5l50p6J64K83%m20
7665a37K21j93R7P5p1n1J09k66K52j22L8O0j49J39O5q6k26K91l18L80k17k0J00
7688b9q0J17L51m02J53j96j21M31j98j18J21N9J37k73l42M51k76L85M8or5P1j03
7711H5j60n0J81j45J11r5o9K97r6j65l4O0K64j98L6j48P6J50k31L1J27q8J0j94
$$ y = [271, 95, 221, 165, 58, 18, 95, -10, 3, -105, -166, -123, -40, 306, -33, -108, -112, 165, -87, 121, -30, 102, 8, 92, -105, -10, 74, 9, 123, 42, 233, -217, -213, -45, 227, 76, -101, 182, 43, -70, 1, 52, 67, -101, -136, 214, -77, -31, 151, 280, -102, 215, 74, -114, -119, 179, 24, 120, 25, 67, 192, 26, 49, 80, 228, -99, -160, -158, 34, -109, -75, -35, -166, 1, -50, -357, -193, -272, 149, 102, -10, 54, 57, 256, -200, -78, -235, 209, 180, 53, -182, 34, -91, -37, -16, 139, -85, -24, 21, 15, -59, 53, -41, 141, -183, 76, -82, -146, 96, 117, -74, -167, -112, 307, 262, -88, -164, 0, 283, 283, -137, 84, -109, -12, 63, -8, -59, 50, -216, 36, -86, -48, 12, -137, 2, 67, -19, -245, 46, -272, 108, -109, -129, -29, -109, 8, 359, -43, 110, -86, -207, 224, 26, -92, 29, 88, 225, -48, -390, 61, -215, 170, 218, 212, 117, 188, 85, -75, -125, 56, -89, 22, -73, -142, 155, 59, -106, -140, -80, 184, -14, 22, -126, -50, 100, -131, -100, 27, -61, -51, -245]
7735b45L95j88k82N08k07J6k9K15k91K37r0q4mK60l28L50k33L5J07j20j83L06
7757A45j13K5N8k94K00k08O7k2K30L7J54k96J58j16k03J3K8j6K71k61L4P6K4J3
7781Dj23M02m21Q2r0L19J0l10J17K89r5k39K54m39J83rJ5J96qj56J18o6J26L0
7805A89J28k79K41k0l22q6K90j04j16J50j0k20Q1P8O3k76K7K17o5Q7q9J27J56
7828B47k99j12qK60r3K38j48lj68m3L73j74q8P7l6l46J54L55j23k11M02L0k25
7851E9P8j16q9o6J70M8P9o8k10J67q4O0j43K45j63M4K58p3l91J64m1o7K47O0k19
7876e1L2j61k7L21j60j9J8j03J49J14l0Jk6j07N4O0j24J67J79l42M9M0r8L11j68
7901G9P2l87J59N8J28l8j65o4P8J13k04N69m87J28lk6Q3k59K89K29q0l40J34k23
$$ y = [-245, 150, -38, -320, 188, -19, -3, -32, 183, -108, 129, 39, -45, -49, 211, -117, 233, 0, 35, 142, 22, -161, 145, 32, 57, 115, -179, 21, -187, -120, -142, 88, 125, 279, -17, 141, 25, -178, -165, -137, -153, 118, -143, -109, -33, -9, 4, -119, 283, -138, -56, -146, 173, 183, -127, -10, 279, 184, -55, 199, -240, -57, -66, -51, 145, 137, -19, 99, 33, 159, 189, 317, 38, 279, 259, -63, -149, 141, 37, -79, 71, 61, -159, -78, 0, 63, -213, -186, 31, -34, 53, -36, 91, 247, -52, -164, -172, 88, -5, 233, 85, 82, -86, -129, 244, 70, -18, 59, 23, -323, -169, 186, 63, -148, 254, 284, 59, 137, 21, -68, -134, 36, 84, 163, 95, -115, 52, -32, 28, -115, 130, -33, 11, 269, 196, -195, -31, -72, -139, 108, 168, -51, -19, -180, -207, 114, -46, -65, -47, -150, -1, 113, 83, 84, 58, -49, 5, 65, -59, 108, 287, -55, -6, 34, -64, 247, 79, 151, -236, -77, -19, 109, 71, -94, -158, -80, 33, -171, 398, -89, 39, 36, 10, 93, -166, 123, 352, 272, -68, 66, -157]
7925a57K06J17p3j50Q0j33R8k49K91J81l13j03J33K38j93J98j47J17k50K56k54
7946a07J55J21j95R9O4q2l3Q4J04j05J80m02K47j60k62K01L20l82K66j27J58p3
7968G1J75l53J92M8k33L8J92k08o5Q3K06k01J12L10n52j63N47j34p3l2L4J64k25
7991f7K25k05Q2k56K29j75J9J79J64k45j45O9L18k95J23p3J84ol0k02j2L67l01
8014e3J90j68l5J26j72J05J7q3k19K82p5J35N7j45o9K3nJ59j69J18j82M8R1J75
8038A51M6q4M5k61j69n6L39j26K48lMj96Q7N1J92m22J80n7M9j99K56j0J29k21
8062b7j09J33j23Q9q0J05J65j3j64j6K55j12l53M38l13j53R6J36Q0o6K70k79P1
8085C0k25L3J81J23k02L20l75J33J68l96K36l7K70l12o8r0K62J21j51Np0J30r0
$$ y = [-157, 49, 166, 93, -57, 23, -110, -12, -261, 30, 211, -102, -205, -72, 166, -27, 171, 24, 141, -109, 147, -107, 48, 169, -26, 73, 137, 55, 22, 106, 210, 105, 285, -117, 130, -30, -292, -91, 229, -153, 113, -14, 144, 71, 246, -107, 85, 133, -100, -62, 130, -78, -143, -60, 146, -55, 57, 367, -185, -348, 199, 65, -8, -40, -6, 158, -67, 158, -47, 35, -221, 8, -167, -148, 31, 195, -50, -195, -126, 192, -103, 20, -53, 131, 125, 95, -107, -119, 248, -53, 137, -31, -66, 60, -112, -7, 10, -73, -292, -10, -85, 50, 107, -38, -107, -84, -89, 70, -99, 19, -163, -115, -24, 151, 197, 113, 158, -103, -272, -328, 11, -115, 133, 130, 134, -62, 25, 76, 268, -154, 26, -31, 18, -181, 75, 65, 194, -27, -136, -3, -126, -37, -117, -12, 153, 140, -24, -40, 215, 103, -250, 188, -125, -278, -182, -46, 34, -32, 238, -41, 30, -195, -162, 19, 142, -60, 260, -115, 18, 186, -210, 26, -11, 259, -53, -121, -211, 51, 172, 21, 26, -44, 86, -4]
8108dO5p9j9n0P4M3L0J21r2j49P6N6j05j72K80p2J46l61L8Q1K37J7n7o3P6j58
8134d1j63L12k37J5l2J22N8m6MJ4J66j74k4J24j15Jj74K74k35O0J15P6M3m33J77
8159a13M8j11j3K79j21j20JJ79J26r5k03Q7jJ31j90M65k81l48K23M1pQj31K99
8183A53j14j15J70j28n7oJ18k35
$$ y = [-4, 61, -18, -37, -87, -13, 30, 60, 181, 89, -60, 16, 72, -33, -205, 75, 3, 149, -212, -174, -93, 144, 161, 104, 41, 117, -41, -204, 108, -129, -114, -146, -24, 34, -12, -8, 6, 172, -2, -26, 98, -17, -16, -190, 84, -151, -91, 24, 100, 143, -290, -113, -65, -176, -189, 90, -31, -151, -150, 29, 155, 60, -143, -56, -57, 74, -116, 349, 68, -280, -57, -16, -23, -15, -146, 153, 39, -76, 94, -34, -91, -97, 21, -214]
8191b14
$$ Imaginary data points
##PAGE= N=2
##DATA TABLE= (X++(I..I)), XYDATA
0@%%%%%%%%%jRj6J6j6K4l5M3n6O6p4Q8j11J35j54J80k12K45k82L24l74M29m87
32b59N52o25P07p96Q92r97J113j241J382j533J698j882K082k297K533k793L079
49A615l392L735m117M539n008N536o133O812p596Q511r592J0894j2499J4536j7210
64i369K0890k6290L4973n1145R0848l55470m49697J080309K29099q22188j10377
75c68417O25339r8553m20387J71508L25909j50134j99240j3350M9815J72506J65094
86B60090k90674l26865L08258L86364k94748k95159K78533J41203k95873o162
96a35033K95876l0764k37089j344Q4763N3474J15425o7445k88037N2505L61045
107B03376m6356l28521R3939K35977j80689j49284K52288J01970k41842q2788
$$ y = [0, 0, 0, 0, 0, 0, 0, 0, 0, 0, -1, 8, -8, 8, -8, 16, -19, 24, -32, 34, -40, 48, -63, 72, -82, 98, -114, 131, -151, 173, -201, 228, -259, 293, -332, 375, -421, 471, -526, 587, -654, 728, -805, 893, -989, 1093, -1204, 1329, -1464, 1615, -1777, 1958, -2159, 2380, -2628, 2908, -3225, 3587, -4009, 4502, -5090, 5804, -6695, 7841, -9369, 11521, -14769, 20204, -30941, 59907, -295563, -745260, 335049, 564148, -258040, -368417, 256922, 158369, -262018, -90510, 235399, 85265, -113975, -127325, -77510, 94996, 260090, -30584, -357449, -49191, 337173, 42425, -252734, 25799, 167002, -128871, -135033, 160843, 130079, -107010, -108354, -23591, 29883, 145308, 77863, -210174, -157669, 203376, 157020, -171501, -77562, 158415, -22274, -171558, 80730, 182700, -59142, -141930]
117a41930J34336O0826K2718j4670j56365l5411K20758M3913k17553K0062J86547
128A23231j40887j63090K66292J45189l40994r6834L39969j1750k82168J70948
138I906K06831l29153j43227M24390Q8367m28872k0536L59756p1345k66159J63867
149f175J89172k18158j38588K02237R2395j19786l1760Q110m0491Q5753R0775
160A13484j36956q8171J51428K7057j56586O2683J67812j38843j74083J69261
170b914J49669j53681q2777J18012j3035q7471R9781O6724j41085l9648J23984
181C7559n959p0261O5918J6500j15333J4123J28078k3805r2637L1430K6313m7324
193c5398L7131O7279p1116o8036P3188L3535n9627L5270M7153j11566l6491J64297
$$ y = [-141930, -7594, 53232, 75950, 61280, -95085, -130496, 90262, 134175, -83378, -63316, 123231, -17656, -180746, 85546, 230735, -110259, -207093, 132876, 121126, -161042, 9906, 216737, -112416, -255643, 168747, 257114, -171758, -192294, 167462, 96117, -170042, -6175, 182997, -35161, -173749, 28488, 120883, 1097, -30663, -22553, -63044, 22709, 113484, -23472, -111643, 39785, 66842, -89744, -27061, 140751, 1908, -172175, -2914, 146755, -6926, -89703, 28309, 15274, -72197, 27584, 94308, -46777, -86425, 37559, 31600, -38661, 27257, 43757, -71576, -57453, 70625, 46820, -45817, -14387, 11926, -35398, 1733, 69012, -2104, -70140, 3048, 36583, -23044, 12226, 59379, -52187, -88678, 75619]
205G5619J6489j76322K8162J56298r6087j25416J67706J00204k12385q0656K11628
216F5240N8759j72476k5833J18703j1335p3341L4793M4353k6813k3892j4174q4
228b6100O9649K9482j14571n4544J35399N6813j33858l1544J23290j2192j14261
239g2437N0479J05134o7130q4843N8081M2567l4634J4835J0537o7976N651R5075
251E5339j7242r2157L4043O7061n7562l9457P6809K3752p8567k2420N7224K2272
263B9095j7774j5164k4053K309N3822L623o5330Q143O4962l7079o2939P1819O3125
276G4559r4310n9734R5333M4038p6633j4706N1017j7638l1090M1146J8431m5212
288a4799n364K9857j1728o675L2631r979m7149J5111M7996j3494l0977J3782L801
$$ y = [75619, 92108, -84214, -56052, 100246, 4159, -121257, 46449, 146653, -65732, -146388, 65240, 123999, -48477, -74310, 44393, 33058, -40283, -5490, 38863, 12050, -11842, -26016, -26100, 43549, 73031, -41540, -96084, 39315, 96128, -37730, -69274, 54016, 41824, -72437, -21958, 83176, 16046, -68797, -10716, 31851, -2783, 12052, 22589, -45387, -39736, 55339, 38097, -54060, -20017, 47044, -10518, -49975, 26834, 50586, -27981, -50401, 6823, 29095, 11321, -3843, -27896, -25587, 28235, 31858, -33472, -25329, 39633, 2554, -60385, 11434, 74559, -19751, -79485, 15848, 59886, -16747, -31453, 19564, 1926, -29164, 11982, 30413, -14799, -20163, 9694, -2034, -8709, 23922, 13943, -33206, -18095, 29901, 16407, -14570, -788, 3013]
301C013j7030J9857K0456l0715j5874L0602j778k7014K9784K5843n6295k5886
313d5037O9757K1752o6559r789N3508j0085l9565K8811L0067l5946k4142K7008
325b20J6234p846m905j0637q615K1181J5161k3300j1553K2533k757k4452J8210
338i66K9715k7611l3412K8118K7569k2978j1737J7019q958j4136K4258J2233k8733
351i619n962K2342n999j3263K1396O017l1896l690L1455L569k1404o45P977n496
365e218J997J1914n509j2118M669M921m240P489P305j7338j2686K2389J4391k0955
379b989q238J7128l329j3952J4450J4268j9836j3741J7969Q462r504n0K279q056
393e139J006J2201q54r302R02K422m517M559R994o783j4054M403J3373l90q442
$$ y = [3013, -14017, 5840, 26296, -4419, -20293, 10309, 8531, -18483, 11301, 37144, -19151, -45037, 24720, 46472, -20087, -29876, 23632, 13547, -26018, 2793, 32860, -3086, -27228, -220, 16014, 8168, 3263, -7374, -15989, 5192, 20353, -2947, -14500, 8033, 5276, -19176, -966, 28749, 1138, -32274, -4156, 23413, 435, -11302, 5717, -3241, -17377, 6881, 19114, -9619, -15581, 6761, 762, -12501, 8895, 14912, -16984, -20674, 10781, 14350, -7054, -7699, 278, -5218, -3221, 8693, 3184, -8934, -4265, 656, -3584, 3905, 11210, -6128, -18814, 3575, 17966, -2989, -11227, 5901, 2572, -11380, 3070, 17338, -2498, -16239, 1730, 10192, 688, 638, 2917, -5139, -4133, 8068, 7214, -2088, -1186, 1236, -3281, 1278, 11272, 4489, -9565, -5162, 8211, 7821, -621]
408f21l68K88j018M970K859o721p02M432n867l342J4586N327k2447q284K3519
423F611J0521j9502j0351J2898Q357q889p507P632R505o946j6801N381K4432j482
437A3859k8793n377K8613J0773k5692j3166K3371J1637k2706r932K3612R607k2523
450f717j1452J7108J4100p446j5148l003J4540J0498j2074j3696J0194J4230r871
463A263j4827J1003J6882r829k0748P552K2697k393k1149j633J6877L268j0527
476a564k344N846mk424J354k95n48N155j822j0559K678J5364Q9j8631m764J9328
492F859R306j7180j1576J3771J1640j1361r143O952P736l51q639j0023J1860K1726
506B1577j4442l3028J3537M2431j0945m9288Q153N2692n919n6441N864N8763o391
$$ y = [-621, -989, -701, -1719, 3251, 6110, -611, -1313, 3119, -2748, -6090, 8496, 13823, -8624, -16908, 6611, 17132, -2370, -12721, 177, 8534, -355, -7862, -230, 9275, 2329, -14472, -9091, 15341, 13859, -14934, -20311, 8302, 19075, -6617, -19783, 3588, 15225, -7481, -17413, 6199, 15806, -6717, -18169, -1061, 13039, 5593, -9555, -12558, 1982, 12480, 406, -13290, -3096, 11134, 1263, -13564, -2561, 14321, 4492, -16256, -8704, 13993, 11600, -9549, -11182, 5695, 8963, -1564, -3908, 1938, 1934, -490, 864, 569, 21, 5176, 3354, -7205, -4527, 10837, 10926, -7705, -12469, 6859, 16165, -1015, -12591, 1180, 12820, 1459, -7684, -732, 7004, 6653, -1986, -12009, -149, 21577, 7135, -25893, -12356, 30075, 19130, -30158, -22005, 30687, 24768, -31673, -25809, 32954, 26563]
519B6563n9242M968N5769q74m8421n339L6958J1636k4743j6576J2809K0265k166
532A1607k4507p496L0126J6223l5967k5785M0987L3700m2592l9164M0757M1841
544C9730l7266m1261L3917L8384l1297l3667K8127K8702k1931k3752J3907J7981
556A1574m734j0923l382M448Q841K130j1650p880J5094J1838j9776j2652K5529
569H457J1350l0162p159L0846J585k7259N846K1430j4824j5065K3870R889l2470
582a3666n338M0842k02m7975Q553N1911j7591n2570K4356M9966k7015m4973K5523
595h179L7467k1009k7913J3696J7834n877q273k628o36J2208Q281k4556j3850
608b3435L5816J7517m3944k1172M8304K4048m9639k6417M8743K6777m6002k6476
$$ y = [26563, -32679, -27711, 28058, 27184, -21237, -26576, 10382, 22018, -2725, -19301, -6492, 13773, 11607, -12900, -20396, 9730, 25953, -10014, -35799, 5188, 38888, -3704, -42868, -2111, 39730, 2464, -38797, -4880, 33504, 2207, -31460, -3333, 25369, 3438, -20314, -6407, 11574, 6840, -4083, -7465, -3017, 5824, 7954, -3696, -11576, 3518, 15356, -4420, -17072, 8457, 19807, -10355, -17514, 13332, 14917, -12342, -6496, 14934, 110, -14955, 8915, 18804, -13666, -19004, 21838, 21636, -26339, -17786, 34125, 16534, -36036, -11680, 38286, 11271, -33702, -8179, 29288, 8279, -19634, -5938, 11896, 6019, -2254, -4882, -5518, 6690, 14971, -9585, -23435, 12381, 29898, -14046, -35218, 13086, 37134, -12505, -38922, 9821, 36598, -9404, -35880]
620c5880M1580K5696l5614k5017K7215K4257j6791k4201P141K2839J115j9794
632g454p738J5256J3741j0241k0384P010K7263m725l3747M127L8093m182l9552
645b2533N447L8510p674l4885J0896L0539j5087k4798K0339J7048k3843p571K5506
658A1894k268k5018J1547K3672j9061k1139K3985J7490k4938j3162K3647P755
670A4404j9810k153J3132j608n181L828m655k296J2875N73j9623J57K4594m58
684A3779k7040o09K8024J558k7985k245K6192L340k3580n792J9115J0015j4247
697E25j5859J0177K0445o632k3681M051K3931j670k2193k091J9661O731j7894
710d499j2374J6641J7665j5890k1631J3877K5101j1903k7248J0554K7617r713
$$ y = [-35880, 5700, 31396, -4218, -29235, -2020, 22237, 5446, -18755, -11614, 11225, 12340, -7454, -15192, 64, 13805, 3564, -16820, -9810, 17453, 12728, -21019, -16892, 21201, 17019, -22533, -17086, 21424, 13750, -21135, -10239, 20300, 5213, -19585, 754, 17802, -6041, -13612, 11894, 9626, -15392, -3845, 19827, 766, -20373, 3612, 21102, -3836, -16998, 6649, 14404, -5406, -7559, 5573, 3965, -1216, 2612, -2043, -4339, 8536, 9109, -10514, -10357, 14237, 13779, -13261, -13870, 14154, 15712, -12273, -14518, 11674, 15014, -8566, -14358, 4757, 14772, 525, -15334, -5157, 15288, 8656, -15025, -10974, 12957, 11287, -10906, -12997, 6664, 13395, -4499, -16873, -232, 17433, 1543, -20088, -6211, 18890, 6987, -20261, -9707, 17910, 8197]
722H197k7119J0149K5258j0735k2226J0655J7590q858j1744O279O232l107j116
735e45j13k745L110N919o629o549R457N807j0941l984J0954K351q542j190N956
750B316M97k662n05O6Q94K061j630k998J924M958l546n843N304N500o420m025
766d109P133J793p071P13N456k886l358L339J374k779J55J848j035j472J585P47
782A433j472j16K27p78J326N02k468n3L015r70l580K692L314m377l123N483K571
799C626o641j395O699O34p540J353P488l139o750L768N229l154l819J969K407
814G35j88j857j253J911K587k792k906M109K622l997l164M303L518m345k918L970
830C35K397m150l38L207k20k941J608J857k295K88K080j403k064K689J592l113
$$ y = [8197, -18922, -8773, 16485, 5750, -16476, -5821, 11769, 2911, -8833, -2554, 3678, 571, -545, -658, -3403, -293, 5626, -1003, -7552, 1905, 7712, -3229, -7213, 3741, 6092, -2450, -3640, 2316, 2813, 151, -354, -288, 606, 2667, 1037, -1961, -37, 4921, 1375, -4468, 836, 6336, -84, -4109, 3024, 4817, -2254, -1541, 3915, 1029, -2329, 1010, 2384, -395, -240, 1608, 573, -899, 686, 1433, -39, -155, 72, -706, 620, 1122, -1346, -1399, 1616, 646, -2934, -242, 3072, -1305, -4428, 1055, 3626, -3015, -4410, 2289, 2923, -4617, -3264, 4224, 1085, -5665, -1897, 3332, 178, -3641, -1672, 735, 547, -1310, -2563, -652, 1935, -857, -3763, 346, 2968, -1029, -4193, 110, 3628, -717, -3635, 335, 2732, -1418, -1756, 1451, 1231, -1710, -102, 1755, -540, -252, 1828, 425, -1639, 1050, 2642, -471]
846d71q19K461R21j777m44N30O34M53j188j173K100J003k354j236K935J139l014
863c00q10K401P76k500J14J728n11j526J358N59k157P28K058k343j686L394Q84
880B167l979n91L872k35l137N48K231q8j994l37J537P88r09k122M42L245o04l828
898b994O50M336j124m677J607N068k144n153K636M711k693l964K589L027j815
913F0k336J502J480Q5j147j669J914K346k011l278K535L833k842l500L041L615
929C628l290k754K734K583k542j886J929J028n39q6r87j74K827l42l714O0M604
946C079l32n160J345M499j854k988J524J526p39m09k70m45J255J129k794j359
962a993L377J168l800q97L548M42l300K67K382j287l62J092j414q86K595J633
$$ y = [-471, -1290, 1171, 2092, 315, -129, 401, 1035, 1488, 300, -873, 1227, 2230, -124, -1360, 1575, 2714, -300, -1110, 1291, 2067, -433, -319, 1409, 898, -628, 730, 1289, -868, -140, 1918, -425, -2111, 1283, 2167, -1812, -2403, 1469, 1234, -1903, -1355, 876, 788, -1206, -1543, -6, 782, -127, -2249, -1807, 1438, 834, -2994, -2344, 1992, 868, -3809, -2202, 2866, 722, -4431, -1795, 2916, 223, -3741, -1152, 1875, 60, -2276, -774, 706, 791, -356, -2025, -111, 2235, 224, -3054, -519, 3314, 472, -3028, 13, 3628, 338, -2416, 318, 2901, 359, -1527, 402, 1430, 891, 805, -182, -356, 2471, 2129, -1585, -1525, 3079, 2747, -2413, -1068, 3431, 1577, -1411, 113, 1639, 900, 491, 221, -224, 1031, 2160, -634, -1993, 1384, 2552, -1248, -2145, 1403, 1845, -1455, -1188, 1194, -93, -455, 637, -777, -1663, 932, 2565]
978B565n515n87O471m17p419J685O992k248o099K345M713j850l150Q06J143J235
994F70M88l440r56N053J124o120j111O498J014o720n52O524O68n384o43L327J425
1011A865j256j865n88K555K901m657k850N728K886o631j715O857K25n961J722
1026g84L724l038r78M331k071m686M875M289p473l170R310J548j0168J71J0132
1041F012k335q155L355N016l896j402L717k324k685O108O80r143J597J0713l674
1056C584j1688N339J1237n911j0628O067Q719m677p364K609N977j35n018k923
1070d812M613N058m386o579M031P067l059p676K359P212j218n604j257M407L960
1085D116l146p456L286J0346l356j3390M807J4821o580j4469Q035J3146r687r863
$$ y = [2565, -2950, -3537, 2934, 2517, -4902, -3217, 3775, 1527, -4572, -2227, 2486, 636, -2514, -1708, -565, 670, 1158, -2282, -3238, 1815, 2939, -3181, -4292, 2206, 3220, -3500, -4052, 2472, 3140, -2244, -2887, 440, 1865, 609, -1256, -1844, 711, 3612, -1045, -3895, 1833, 4719, -1912, -3627, 3230, 3455, -2506, -784, 2940, -98, -1076, 3255, 1184, -3502, 1373, 5662, -1811, -4981, 4329, 5877, -4291, -4120, 6012, 3677, -4478, -1123, 3893, -3, -1405, 2312, -12, -2697, 3411, 4091, -5052, -3455, 7258, 3584, -8104, -2765, 8472, 2561, -8067, -2000, 6719, 2042, -5322, -2713, 3264, 3129, -1889, -4812, -199, 4859, 473, -6106, -2075, 4992, 1933, -5743, -3384, 3828, 2610, -2994, -4251, 156, 4116, 970, -6486, -3200, 7146, 3790, -9600, -4793, 10028, 3448, -11021, -2986, 10160, 473, -9390]
1099i390R913O311r876j436Q704l629n088P464J820j0574K760J2095p717j1156
1113i799J1029R132j2973n861J3691K274j3043J686J1224n542p813Q303L501r800
1127c991J303R647n216q912Q179O851r468m290Q470K937o929k055M933J516k724
1142B51j601K11K304J634k885l648M146L653m341l599L390L433k222k567L5K019
1158B13L241k949o614M363R431o871j0857R029J1519j1964j0278J3602Q149j4302
1172d288m690J3706P06j1444K834P528n821k682P625k458p572P338O409j1571
1186d380l323J3709M67j5228L463J4642o957j1708R756P522j0451l350J0081o09
1200C634q065L761M876n521j322O111j681n621M492L863n751j470O172j362n163
$$ y = [-9390, 523, 6834, -3042, -4478, 4226, 597, -4491, 2973, 4793, -5781, -3021, 9074, 1357, -9799, 1230, 10362, -2611, -8472, 5219, 7493, -5550, -3864, 7360, 1818, -5995, 2308, 5809, -3991, -2688, 6959, 1743, -7169, 1010, 7861, -1607, -5897, 2573, 5510, -1419, -3474, 1459, 2975, 251, -1350, -1139, 1165, 2799, -86, -3734, 412, 4065, -276, -3875, -485, 2948, 726, -1841, -1806, 213, 3454, 505, -6109, -1746, 7685, 814, -10043, -1014, 10505, -1459, -11737, 1865, 10014, -4288, -8978, 4728, 5434, -6010, -3176, 4352, -1469, -4151, 3474, 1016, -6556, 782, 7191, -4380, -7703, 6006, 6473, -8755, -5292, 9350, 2393, -9315, 441, 7963, -2488, -5838, 4243, 3634, -4431, -670, 4206, -1315, -2637, 3474, 1793, -3828, 664, 4527, -1224, -2694, 3478, 2116, -3047]
1215c047L655K939n059m52N118j350m525L483K426l941n70L249j177k007K549
1230A291n56k586L024J859n708J51P002k555p374M923O889p448n036Q747K092
1245D715r021R93P934l666n782N524K445o703J344O571n222m510P603J883r344
1260e236J521R033m640p357O805N055p791j960P926j507o397M163M107n849j110
1275c237O570k692n012M892L552o878n02P289k274o491M882M421o513j642O720
1290C085o40n938K669M849m264k654N489n31m595K919K703m302n58N135k172m196
1306c001M426K252n666k96O344k286n341L956M085n274j743M975k87m929K999
1321B14L567n187r27N461j533n180L676L591n052j497N430j187m726K941L292
$$ y = [-3047, 608, 3547, -1512, -1964, 3154, 1804, -2721, 762, 3188, -753, -1323, 1926, 749, -1258, 1291, 735, -1851, 1173, 3032, -2676, -2525, 4477, 1922, -5452, -529, 6360, -1088, -6124, 2623, 4715, -4306, -3313, 4621, 955, -4827, 697, 3142, -3561, -2217, 4354, -868, -5378, 2225, 4108, -5236, -3715, 5318, 678, -6679, 126, 5181, -2610, -4570, 3356, 1849, -4548, -385, 3722, -2127, -3237, 3333, 641, -4371, 521, 4073, -2805, -3307, 3982, 1708, -4783, 99, 4520, -1993, -3635, 3085, 2445, -3493, -824, 4025, -239, -2893, 2596, 2065, -2530, 389, 3092, -1210, -1768, 3367, 1195, -3001, 1425, 3677, -1989, -2285, 4059, 1773, -3568, 388, 4473, -801, -2544, 2431, 2144, -2785, 214, 3781, -1406, -2333, 3128, 1595, -3585, 91, 3682, -1370, -2867, 2563, 1376, -3350, -409, 2883]
1336B883m019j535M861r84m878L483L516n183j751O622j457n764L488M254n036
1351a500k369N793J47n535K018M023l693k045M542M07m938J690M583l727k927
1366c531N192O31m959J468L951l210k185M151j89l387J607K884k976j450L935
1381A932m1m113J477L738k911k749M521Q09m658R74M191k855k564L824O61m086
1397a850J080L725k839k129L248J081l699O25L019j793k305L127M90l645J418
1412d47L320l269j684L990K33m489J193M070k802k683L410J195l673J19L230j216
1428D97k944K874J141l317N57L110k106k331L314J045m227P06L859k089k994L039
1444A34J589l565J07K950j061k346K056J518k821k81L226j214k600K434J655l331
$$ y = [2883, -1136, -2671, 2190, 1206, -3672, -189, 3327, -1856, -3607, 3015, 1558, -4206, -718, 3536, -1500, -3869, 1924, 2071, -3464, -1446, 2577, -1116, -3161, 1381, 1788, -3150, -1460, 3123, -604, -3531, 1661, 2292, -2667, -1199, 2752, -458, -2643, 1508, 1319, -2068, -461, 2423, -553, -2003, 1932, 1891, -2222, -745, 2993, 82, -2667, 1854, 2663, -1995, -1021, 3170, 315, -2249, 1575, 2236, -1850, -770, 2955, 116, -2013, 1235, 2316, -1383, -758, 2261, 468, -1837, 1290, 1780, -1865, -447, 2873, -396, -2080, 1910, 2143, -2346, -1153, 2917, 115, -2568, 842, 2037, -1636, -1517, 1713, 497, -2447, 427, 1568, -1749, -1192, 1918, -188, -2519, 795, 1840, -2387, -1681, 2178, 89, -2905, 134, 1723, -1842, -1735, 1215, 154, -2192, -136, 1382, -1439, -1720, 1506, 292, -2308, 126, 1781, -1550]
1460a550k31L385q65k681J817K206k877q16K742q8k324J014J630j601k83J704
1476A182n29j575J602Q25j939K36J745j060j758J885R12k199J47K070r07j477
1492h40J430P20j885K28J847p05k165J955J058k531K5K299o19k212J415J668k072
1509c84r78K637n43k129J442J087j761p91K416l35k470J401J932j772j760K158
1525A50P68k126J26J637m45j208P73L57r38L96P30o28n15J217L0j588O85J088
1543E09q04n69Q46L53o02R2J10k79K56O14j091m23J754q6j773P15J625q40j680
1562a273J168J213j009r43J532j08q87O21N55o22o19J269P8j859N51J655p36j368
1580g82J102J044j526o05J484J90j217K71Q52l42n43N44K67p62k86J088n19q40
$$ y = [-1550, -1781, 1604, 739, -1942, -125, 2081, -796, -1612, 1130, 1042, -1282, -268, 1362, -239, -522, 1182, 653, -922, 680, 1505, -434, -198, 1547, 487, -1271, 614, 1526, -673, -526, 1544, 637, -840, 590, 1310, -575, -347, 1500, 795, -1370, 585, 1643, -888, -863, 1436, 817, -1395, 20, 1688, -384, -1362, 1275, 732, -1397, 45, 1132, -629, -1420, 996, 661, -1809, -408, 1524, -248, -2008, 150, 918, -1208, -1082, 555, 110, -1098, -325, 32, -906, -510, 220, -408, -923, 294, 324, -1264, -579, 509, -295, -864, -18, 335, -267, -175, -65, -344, -88, 526, -565, -988, 766, 680, -1093, -378, 1247, 407, -1273, -105, 1108, 99, -844, 688, 580, -307, 314, 869, 247, -372, 897, 975, -884, -333, 1322, 586, -782, 320, 1364, -162, -767, 717, 907, -310, -39, 813, 471, -72, 472, 739, -23, -309, 779, 260, -580]
1598e80N61R48o22j350J141J124j455q30P45J020q84q14R53O89p53q80Q68N84
1616D65p25n17N39J35o23K83M50q07K62O78n3j221Q01J060r47j409J596J425j880
1635d88j117J503J535k094r36K169K72j804M40J159m17j157J415L93j372R4J395
1652I90q54q67Q28J272j343j041J870P10j981l63K118m03j797P77J716j328r93
1669f89J421Q02j813j37J640n41j416Q69J231j169j097J239R23j508o29J581K91
1686I98j727j03J669m57j498J078P19j072l53J304j86j224Q59P34q30j279J570
1703B02N61j216o44J193P17j811k06J929m81j345J59J491m93j006Q10O43j108
1720f05P1O94L8q83M40J113j368m61J285K94j461PJ751l81j870P36J871j188j111
$$ y = [-580, -19, 929, 307, -1043, 98, 1222, -233, -1063, -318, 702, -182, -996, -43, 646, -107, -987, -119, 465, -260, -777, -238, -103, -726, -443, 7, -800, -538, 140, 87, -1134, -333, 727, -220, -1629, -33, 1392, -488, -1605, -102, 1433, -661, -1597, 572, 844, -960, -520, 639, 222, -935, 480, 873, -499, -405, 990, 136, -731, 97, 1369, 26, -1015, 855, 1565, -416, -779, 1339, 936, -861, -84, 1632, 304, -689, 732, 1534, -279, -416, 1224, 683, -733, 136, 1367, 198, -899, 340, 1263, -245, -874, 707, 998, -729, -832, 837, 380, -1118, -40, 679, -393, -746, 558, 372, -852, 7, 741, -89, -1368, 202, 763, -453, -1097, 96, 813, -998, -1204, 725, 244, -1101, -942, 549, 56, -950, -140, 503, -605, -534, 160, 198, -685, -245, 868, -500, -961, 324, 618, -843, -836, 915, 534, -1336, -600, 1271, 83, -1028]
1739a028J445M57j074m54J264J25j382P94R51p16r08P76R15j416p4J188j36j248
1757e21O57R20r74k95P62R1m15n19J060j38r13M19Q37o32q48N61Q24r18n27R21
1777C52J21o23n3Q35k13o89K20M30l61o19N43K66m85m19J048j01q97L16K18k56
1797c67m12P04J68m71m09P52p0n58m9R83m96o34N18N38p90N1P18L2r66O20K48
1818A10J59o86K05P11q94k43R13R1r61K83N01n6n33P40o8k82K54M53n04k36K65
1839B22L17k82l99M70R0j83k66K78Jj05j81L72j55n9N1J55L03l47m69N82j2k80
1861A03p9J84K40k72K6N7j20l50O01n7o13K31O40m29p40N91M77j101K08O30j91
1882C6m97pN78j61l16J54L42p81J88N79k22k89J18M97n44l40P11k17n43Q82j58
$$ y = [-1028, 417, 874, -200, -654, 610, 735, -647, 147, 1098, 382, -526, 250, 1165, -251, -325, 863, 727, -521, 136, 1056, 82, -213, 549, 640, 225, -294, 766, 628, -285, 134, 971, 339, -509, 52, 876, -42, -569, 352, 473, -150, -203, 632, 419, -270, -50, 380, 19, -600, -57, 209, -276, -695, 353, 252, -645, -329, -111, -367, -779, -75, 93, -378, -787, -35, -105, -663, -712, 271, -225, -859, -341, 197, -593, -542, 176, 208, -758, -138, 110, 269, -417, -212, 499, -395, -638, 275, 366, -595, -312, 189, 133, -400, 340, 272, -10, 244, 697, 193, -43, 222, 539, 257, -142, 328, 418, 235, -31, 247, 248, 143, -38, 334, 179, 120, 171, 326, 629, 282, -187, 395, 383, 103, 24, 208, 448, 176, 202, 259, 139, -211, 390, 333, -280, -49, 591, 162, -578, 13, 490, -611, -403, 227, 36, -461, -468, 110, -51, -367, -213, 129, -652, -464, 115, -107, -396, -278, 219, -325, -665, 46, -171, -714, 168, 10]
1903A0o9n45K82N17k15l71J22O86n90R0K63k30k86N68n0m69N08ok49O8n4R0L27
1926C97k55j04J72L8j02m9K73N0l36K7K80l9j68n1L38l27m72N07L47n62J54J51
1948B69j42j83L09K87n01n0K17L61n78k46P06m16n70N00J74j07r3L25l10l71L48
1969g1k0j49J09K5J38m30PL22j9l67J55J18j01k2L21K5l74j40K71K2J97n88J63
1992d08K88j96k5J94J2J26k50K0J39L2K9%L03n12P3K97jl72L23R0k73j30K65Q4
2016A08j38J80K54n3o11M10M73o01k04N81K15q13J26M43j01n92P20K12k64l58
2036a3K97J32n13L32L70l39n09N43J75p10m7P56m18p6L27N0k84m11L32J2Q4l61
2058b71L95R0j91k08L39j13k88RO8K41n64J68L19j54l43O6O95m04j54K42L47n93
$$ y = [10, -59, -604, -322, 195, -20, -391, -269, 417, -173, -83, 180, -50, -336, 232, 182, -287, 221, 215, -34, 34, -20, 70, 397, 142, 38, 210, 248, 146, 97, 370, 420, 84, 111, 391, 352, 184, 133, 471, 144, -328, 179, 526, -36, 118, 269, 127, -56, 253, 540, 39, -11, 206, 567, -11, -257, 449, 33, -537, -37, 137, 30, -63, 262, -48, -419, -71, -91, -240, -131, -106, 32, -398, -391, -69, -88, -455, -300, -182, -283, -305, 16, 41, -333, -473, -202, -180, 17, -571, -408, -120, -316, -341, -147, -135, -9, -259, -239, -100, -68, -39, -39, 264, -248, -175, 122, 121, -251, 72, 162, -111, -241, 24, 108, -30, 150, 404, 351, -260, 150, 623, 22, -182, 399, 614, -199, -73, 370, 269, -323, 397, 609, 345, -13, 284, 416, -97, 235, 605, 266, -243, 300, 475, -235, -282, 474, 56, -20, 307, 357, 73, -338, -6, 6, 90, -271, 124, 214, 23, -185, 154, 41, -247, -238, -170, 71, -493, -325, -6, -160, -503, -437, 258, -146, -300, -58, 289, -304]
2080c04k16Q22l53n69N03L02l65l32Q10J23j033J81J053m88q46R49J78p10k98
2099e93Q41K22r45L98N21j52o69L28P23o00m91R28jj000O55N19n30m52N89K93
2119E84n12l28N76J16o89L21L68k6m34R0O29l11n09K65L32q3l45o4K39m14j01
2140b96N61J49p20MO86k63p59L59P78p49l66N47L59o88q6M73M7q40M22O14m49
2161b17m71P14J80o68J59P55n08n68O12M45p75m19Q96J51q94J98Q11l08p40P48
2181A01P1o06K4O69K12p26J69L66j97k15J81L02m90R0L43J59n28L2L80k48k04
2202a15N8K53K18m61J07R7M1k67L32K05m83j85O38Q3p23K12L15J16m22M81j36
2223C64l21n48R34o6o67P2M51K9p57O43M97n73m31O98K27j022L06O06m93l30M71
$$ y = [-304, -520, 302, -51, -620, -117, 185, -180, -512, 298, 421, -612, -431, 622, 134, -712, 237, 415, -295, -593, 248, 470, -475, -77, 444, 292, -377, -49, 674, 74, -417, 511, 510, -490, 165, 684, 154, -298, 291, 584, 72, -256, 320, 436, -253, 68, 436, 410, -24, 66, 695, 384, -125, 140, 472, 389, 44, -20, 219, -195, -296, 265, 414, -306, -302, 384, 121, -638, -279, 499, -250, -616, -69, 290, -398, -484, -11, 36, -804, -382, 232, -217, -688, 26, 206, -462, -303, 452, -56, -624, -12, 433, -342, -761, 135, 286, -608, -410, 401, 93, -647, 101, 172, -434, -410, 259, 471, -255, -86, 280, 83, -132, 49, 351, -139, -49, 294, 453, -75, -43, 337, 89, -115, -57, 196, 414, -47, 60, 157, 198, -69, 263, 468, -15, -200, 438, 521, -202, 10, 325, 441, 19, 500, 364, 43, -505, 429, 363, -304, -232, 219, 248, -509, 134, 631, 58, -373, 325, 552, -470, -164, 442, -51, -381, 90]
2244I0M23q17l03J060k99p83K40P45m10n08N22O9o29K45M29k48m69N88q9q3k47
2265d74N77j11j82P4J06j93rm0K55J4lK8j80M16l07k13M77J24n31Q7M87k23m52
2288b73N39L23m96m67R45j58n16J8P56k86p44O43J93m57n2O95m10n68O02N55p89
2309E3k05R98m64q93N05P05q44l69O67J95o48j8Q82o12k30N62M2q28L15L87j94
2330Fl30N14k71j72RK86j32l57N68J19p08J24L82l36o2P39p34k48M69K36n47K21
2352b24N52l15p11O60N19q75j96R35o38l78P33N76j059n7Q08J9j100P23P48o93
2372B7p31J005L87r82L35Q47o19j015J206J98j057L14Q20n55o01O76O20j205L30
2391@N80k87n17L70L09n97j30P59k20n54M75K19m74N9N09o82O3N58m12k23J17
$$ y = [90, 513, -304, -607, 453, 154, -629, -389, 356, -54, -562, -40, 29, -600, -355, 74, -174, -643, -55, -144, -227, -474, 103, -8, -190, -116, -10, -203, -212, -252, 3, 17, 14, 42, -138, 278, -29, -242, 235, 359, -172, -85, 402, 179, -273, 266, 589, 93, -374, 571, 413, -103, -85, 671, 385, -359, 284, 477, 20, -32, 663, 253, -315, 287, 842, 53, -152, 846, 382, -511, -6, 699, -145, -514, 153, 348, -300, -318, 564, -48, -278, 284, 326, -502, -187, 200, 6, -324, 190, -81, -253, -244, 42, -90, -447, 121, 240, -468, -344, 38, -298, -360, 379, -355, -603, -134, 102, -445, -224, 328, 13, -698, -38, 481, -394, -590, 345, -293, -671, 62, 638, -421, -478, 330, 349, -751, -28, 720, 27, -704, 301, 688, -294, 41, 888, 269, -746, 460, 658, -399, -85, 735, 180, -421, 255, 875, -330, 0, 580, 293, -224, 146, 455, -142, -272, 487, 267, -287, 188, 407, -67, -8, 501, -181, -118, 440, 28, -195, -78]
2412g8M43o09k31Q84l57k36J24M83r43q6Q18l0r41M15R71r73m64J356k20j339
2432a013P83Q37q15o36J019L65j236J76J290p33q03O82N64j234N98P49k01j133
2450g41P95O72j240p6J165n79n63N41O09o45l73O18j46o56Q03M76o79m76Q43n3
2470B95n67M27L46o06j57Q45n10l52N26J03m72l2P67m56p24J075J69r35J69P15
2490F26m89n40P29L79j185K19R43n90q60Q50P85j190j6P12j96r97N26J287j101
2509a08o27J100j08r54P32L61r48j96J047o1j089L98R45j125Q6P12M5q16M10K89
2529I3n12J4N31J4o26M11L89q28J49O65m19m25M99N40r97K83Q48l64p23O99K19
2550D60m37l32Q07k3r62M27Q98j071k27J070j51q82M96Q26j197k27J235n17p34
$$ y = [-78, 365, -244, -475, 409, 52, -184, -60, 423, -520, -606, 212, 182, -759, -344, 627, -346, -810, 546, 326, -1013, -230, 607, -208, -844, 175, 540, -696, -520, 770, 37, -766, -84, 480, -754, -156, 593, 392, -741, 54, 726, -514, -590, 575, -4, -567, -26, 583, -62, -435, 183, 37, -619, 184, 660, -19, -495, 348, 295, -272, 155, 501, -105, -262, 583, 73, -279, 247, 350, -122, -154, 613, 157, -567, 508, 677, -258, -89, 626, 137, -403, 326, 705, -480, -261, 682, 92, -768, 82, 867, -323, -339, 373, 177, -820, -294, 993, -108, -735, 365, 257, -697, 35, 396, -552, -748, 299, 238, -851, -453, 492, -633, -547, 165, 210, -606, -196, 93, -419, -405, 126, 140, -486, -75, 314, -514, -365, 300, -119, -544, -45, 495, -502, -219, 629, 265, -458, 241, 460, 23, -309, 498, 475, -487, -60, 838, -233, -460, 610, 459, -423, 73, 899, -298, -525, 710, 193, -541]
2569e41O88N92n62q31J120L72j147J57J083q29o41Q39L99r03Q7N56l26o55Q97
2588C55m87j22Q9O64n20j94M53k7q44N85L17n80J69K68Q2n50L96M40j079j21J013
2609C07j72q16O83J43o95k85R14J78q84M09P24p54o20J105J8p44J27Q43q79l93
2629g91R08M10j263M23R21p96m24Q07L19o61l4N99r7p56N42M74p06j2N94m5o49
2650b37M86K81o95k2M41r9j15K12J32l70m9L69l78j08K89k0k15K02O8k67j2L58
2672B51j85n34O96q9l56J70M54j79m76K88K47k40n76R69j82q71M74M33m43m75
2692f24Q28J53r60K61P62m28o20P77J21n53l86J088k63m90L78jm73k17Q82j66
2712F9k22N8M63m15n41P20nl46n8N71m13k16M18R8m62P4nJ61K5l63M13k10K28
$$ y = [-541, 147, 739, 177, -654, 466, 838, -309, -152, 931, 102, -539, 300, 699, -204, -117, 439, 113, -542, 355, -132, -254, -165, 499, -21, -215, 238, 211, -633, -48, 269, -311, -142, 126, 208, -342, 54, 494, -585, -706, 307, 135, -681, 2, 145, -550, -835, 79, 257, -627, -218, 506, -248, -868, 237, 255, -489, -362, 481, -398, -791, 117, 527, -736, -313, 608, -188, -612, 195, 514, -147, -181, 418, 321, -435, 107, 581, -125, -137, 457, 412, -237, 249, 530, -165, -187, 254, 155, 40, 252, 384, 14, -35, 334, -44, -152, 137, 117, -98, 104, 172, -95, -107, 251, 66, -468, 228, 139, -217, -47, 407, 228, -248, 40, 287, 47, -529, 440, 258, -613, -139, 294, -149, -624, 204, 357, -603, -342, 420, -8, -628, 149, 270, -283, -669, 419, 156, -334, 44, 43, -430, -647, 235, 69, -153, -95, 368, -47, -588, 132, 127, -219, -277, 294, -119, -335, 83, 181, -281, -207, -212, -51, -26, -389, 24, -186, 42]
2735D2J2l73M27ol7J16R3k14l34L34J39l91J67M32k69m78M02K19k34j95N58n2
2757C58n33J66L89m64L7L50P7l84j80P71n02l87L92L93o53n9K56J99k72m8M65
$$ y = [42, 54, -319, 108, 102, 65, 181, 274, 60, -274, 60, 199, -192, -25, 407, 138, -340, 62, 281, 47, -148, 410, 358, -175, -9, 380, -84, -47, 303, 380, -4, -184, 587, 85, -302, 90, 483, -170, -229, 27, 226, -46, -94, 371]
$$ [...]
8191B37
##END NTUPLES=NMR FID
##END=
