##TITLE=1H_Ser Am-V
 CDCl3
 8 sc, 
 10.11.2021
##JCAMPDX= 6.0         $$ Bruker NMR JCAMP-DX V2.0
##DATA TYPE= NMR FID
##DATA CLASS= NTUPLES
##ORIGIN= UXNMR, Bruker Analytische Messtechnik GmbH
##OWNER= root
$$ XWIN-NMR		Version 3.5
$$ Wed Nov 10 10:26:41 2021 Russian Standard Time (UT+4h)  she@DPX200
##.OBSERVE FREQUENCY= 200.1313468511
##.OBSERVE NUCLEUS= ^1H
##.DELAY= (6, 6)
##.ACQUISITION MODE= SIMULTANEOUS
##.ACQUISITION SCHEME= undefined
##.AVERAGES= 8
##.DIGITISER RES= 18
##SPECTROMETER/DATA SYSTEM= spect
##.PULSE SEQUENCE= zg30
##.SOLVENT NAME= CDCl3
##.SHIFT REFERENCE= (INTERNAL, CDCl3, 0, 15.7039)
##AUDIT TRAIL= $$ (NUMBER, WHEN, WHO, WHERE, WHAT)
$$ ##TITLE= Audit trail, XWIN-NMR		Version 3.5
$$ ##JCAMPDX= 5.01
$$ ##ORIGIN= Bruker BioSpin GmbH
$$ ##OWNER= she
$$ F:/spectra/data/she/nmr/H-F/1/audita.txt
$$ ##AUDIT TRAIL=  $$ (NUMBER, WHEN, WHO, WHERE, WHAT)
(   1,<2021-11-10 10:25:25.10 +0400>,<she>,<DPX200>,
      <created by zg, POWCHK disabled, PULCHK disabled
       configuration hash MD5:
       00 E9 B6 7A A2 85 ED C7 34 08 36 98 17 FE 4E 26
       data hash MD5: 16K
       02 46 4F 72 7A F3 24 A9 8D 0A AE D7 21 97 54 A8>)
$$ ##END=
$$ 
$$ hash MD5
$$ CC 7D D2 9D 32 0A 8D 24 0B FE DD 0A 52 62 6E E1
##$RELAX= 
##$RELAX= 
##$RELAX= 
##$RELAX= 
##$RELAX= 
##$RELAX= 
$$ Bruker specific parameters
$$ --------------------------
##$DU= <F:/spectra>
##$EXPNO= 1
##$NAME= <H-F>
##$PROCNO= 1
##$TYPE= <nmr>
##$USER= <she>
##$AMP= (0..31)
100 100 100 100 100 100 100 100 100 100 100 100 100 100 100 100 100 100 
100 100 100 100 100 100 100 100 100 100 100 100 100 100 
##$AQSEQ= 0
##$AQ_mod= 1
##$AUNM= <au_zg>
##$AUTOPOS= <>
##$BF1= 200.13
##$BF2= 200.13
##$BF3= 200.13
##$BF4= 200.13
##$BF5= 200.13
##$BF6= 200.13
##$BF7= 200.13
##$BF8= 200.13
##$BYTORDA= 1
##$CFDGTYP= 0
##$CFRGTYP= 5
##$CHEMSTR= <none>
##$CNST= (0..31)
1 1 145 1 1 1 1 1 1 1 1 1 1 1 1 1 1 1 1 1 1 1 1 1 1 1 1 1 1 1 1 1 
##$CPDPRG= <>
##$CPDPRG1= <>
##$CPDPRG2= <>
##$CPDPRG3= <>
##$CPDPRG4= <mlev>
##$CPDPRG5= <mlev>
##$CPDPRG6= <mlev>
##$CPDPRG7= <mlev>
##$CPDPRG8= <mlev>
##$CPDPRGB= <>
##$CPDPRGT= <>
##$D= (0..31)
0 1.2 0 0 0 0 0 0 0 0.06 0 0.03 0 0 0 0 0.0002 0 0 0 0 0 0 0 0 0 0 0 0 
0 0 0 
##$DATE= 1636525524
##$DBL= (0..7)
120 120 120 120 120 120 120 120 
##$DBP= (0..7)
150 150 150 150 150 150 150 150 
##$DBP07= 0
##$DBPNAM0= <>
##$DBPNAM1= <>
##$DBPNAM2= <>
##$DBPNAM3= <>
##$DBPNAM4= <>
##$DBPNAM5= <>
##$DBPNAM6= <>
##$DBPNAM7= <>
##$DBPOAL= (0..7)
0.5 0.5 0.5 0.5 0.5 0.5 0.5 0.5 
##$DBPOFFS= (0..7)
0 0 0 0 0 0 0 0 
##$DE= 6
##$DECBNUC= <off>
##$DECIM= 32
##$DECNUC= <off>
##$DECSTAT= 4
##$DIGMOD= 1
##$DIGTYP= 9
##$DL= (0..7)
0 120 120 120 120 120 120 120 
##$DP= (0..7)
150 150 150 150 150 150 150 150 
##$DP07= 0
##$DPNAME0= <>
##$DPNAME1= <>
##$DPNAME2= <>
##$DPNAME3= <>
##$DPNAME4= <>
##$DPNAME5= <>
##$DPNAME6= <>
##$DPNAME7= <>
##$DPOAL= (0..7)
0.5 0.5 0.5 0.5 0.5 0.5 0.5 0.5 
##$DPOFFS= (0..7)
0 0 0 0 0 0 0 0 
##$DQDMODE= 0
##$DR= 18
##$DS= 0
##$DSLIST= <SSSSSSSSSSSSSSS>
$$ [...]
##$SUBNAM2= <"">
##$SUBNAM3= <"">
##$SUBNAM4= <"">
##$SUBNAM5= <"">
##$SUBNAM6= <"">
##$SUBNAM7= <"">
##$SUBNAM8= <"">
##$SUBNAM9= <"">
##$SW= 18.0517286264689
##$SWIBOX= (0..15)
0 0 2 0 0 0 0 0 0 0 0 0 0 0 0 0 
##$SW_h= 3612.71676300578
##$TD= 16384
##$TD0= 1
##$TE= 0
##$TE2= 300
##$TE3= 300
##$TEG= 300
##$TL= (0..7)
0 120 120 120 120 120 120 120 
##$TP= (0..7)
150 150 150 150 150 150 150 150 
##$TP07= 0
##$TPNAME0= <>
##$TPNAME1= <>
##$TPNAME2= <>
##$TPNAME3= <>
##$TPNAME4= <>
##$TPNAME5= <>
##$TPNAME6= <>
##$TPNAME7= <>
##$TPOAL= (0..7)
0.5 0.5 0.5 0.5 0.5 0.5 0.5 0.5 
##$TPOFFS= (0..7)
0 0 0 0 0 0 0 0 
##$TUNHIN= 0
##$TUNHOUT= 0
##$TUNXOUT= 0
##$USERA1= <user>
##$USERA2= <user>
##$USERA3= <user>
##$USERA4= <user>
##$USERA5= <user>
##$V9= 5
##$VALIST= <valist>
##$VCLIST= <CCCCCCCCCCCCCCC>
##$VD= 0
##$VDLIST= <DDDDDDDDDDDDDDD>
##$VPLIST= <PPPPPPPPPPPPPPP>
##$VTLIST= <TTTTTTTTTTTTTTT>
##$WBST= 1024
##$WBSW= 4
##$XGAIN= (0..3)
0 0 0 0 
##$XL= 0
##$YL= 0
##$YMAX_a= 231929
##$YMIN_a= -305513
##$ZGOPTNS= <>
##$ZL1= 120
##$ZL2= 120
##$ZL3= 120
##$ZL4= 120
##$ABSF1= 10
##$ABSF2= 0
##$ABSG= 5
##$ABSL= 3
##$ALPHA= 0
##$AQORDER= 0
##$ASSFAC= 0
##$ASSFACI= 0
##$ASSFACX= 0
##$ASSWID= 0
##$AUNMP= <proc_1d>
##$AZFE= 0.1
##$AZFW= 0.1
##$BCFW= 1
##$BC_mod= 2
##$BYTORDP= 1
##$COROFFS= 0
##$CY= 11.3945322036743
##$DATMOD= 1
##$DC= 2
##$DFILT= <>
##$DTYPP= 0
##$F1P= 2.36226072786647
##$F2P= -0.459571619588291
##$FCOR= 0.5
##$FTSIZE= 0
##$FT_mod= 4
##$GAMMA= 1
##$GB= 0.15
##$INTBC= 1
##$INTSCL= 1
##$ISEN= 128
##$LB= 0.24
##$LEV0= 0
##$LPBIN= 0
##$MAXI= 10000
##$MC2= 0
##$MEAN= 0
##$ME_mod= 0
##$MI= 1.114404
##$NCOEF= 0
##$NC_proc= 0
##$NLEV= 6
##$NOISF1= 3.799351
##$NOISF2= 2.8
##$NSP= 1
##$NTH_PI= 0
##$NZP= 0
##$OFFSET= 15.70392
##$PC= 1
##$PHC0= -15503.72
##$PHC1= 0.4008207
##$PH_mod= 1
##$PKNL= yes
##$PPARMOD= 0
##$PSCAL= 0
##$PSIGN= 0
##$REVERSE= no
##$SF= 200.130013532006
##$SI= 16384
##$SIGF1= 3
##$SIGF2= 2
##$SINO= 400
##$SIOLD= 16384
##$SREGLST= <1H.CDCl3>
##$SSB= 0
##$STSI= 0
##$STSR= 0
##$SW_p= 3612.71676300578
##$SYMM= 0
##$S_DEV= 0
##$TDeff= 0
##$TDoff= 0
##$TI= <>
##$TILT= no
##$TM1= 0
##$TM2= 0
##$TOPLEV= 0
##$USERP1= <user>
##$USERP2= <user>
##$USERP3= <user>
##$USERP4= <user>
##$USERP5= <user>
##$WDW= 1
##$XDIM= 8192
##$YMAX_p= 0
##$YMIN_p= 0
$$ End of Bruker specific parameters
$$ ---------------------------------
##NTUPLES= NMR FID
##VAR_NAME=  TIME,          FID/REAL,        FID/IMAG
##SYMBOL=    X,             R,               I
##VAR_TYPE=  INDEPENDENT,   DEPENDENT,       DEPENDENT
##VAR_FORM=  AFFN,          ASDF,            ASDF
##VAR_DIM=   8192,          8192,            8192
##UNITS=     SECONDS,       ARBITRARY UNITS, ARBITRARY UNITS
##FACTOR=    0.0002768,     1,               1
##FIRST=     0,             0,               0
##LAST=      2.2672688,     0,               0
##MIN=       0,             -305513,         0
##MAX=       2.2672688,     231929,          0
$$ Real data points
##PAGE= N=1
##DATA TABLE= (X++(R..R)), XYDATA
0 0 0 0 0 0 0 0 0 0 0 0 -8 8 -8 8 -9 16 -16 24 -27 32 -40 48 -56 66 -80 96 -107 127 -144 168 -191 216 -245
33 -245 278 -313 353 -395 443 -497 555 -616 685 -763 843 -931 1030 -1137 1253 -1382 1522
50 1522 -1675 1848 -2036 2246 -2481 2747 -3051 3396 -3800 4274 -4842 5539 -6417 7557 -9112
65 -9112 11368 -14948 21525 -37628 166737 91703 -231151 -2359 158665 75524 -31423
76 -31423 88238 107759 -22621 -104738 -48936 -16222 34786 65086 -13783 -157625 -120731 50087
88 50087 79126 -55036 -70635 20313 35567 -11274 4161 36126 24184 25648 59759 20735
100 20735 -24325 37286 82110 -9162 -80088 -7378 67384 3639 -73614 -57723 -37393 -42369
112 -42369 -18301 -11686 -48001 -52430 -9435 -18201 -71832 -22726 83911 50064 -55682 -35247
124 -35247 44947 24942 -10132 66220 98939 -29510 -93020 22462 84050 -3679 -38719 37159
136 37159 27961 -90206 -91348 38006 77602 -3470 -60305 -47044 -14958 17338 46559 28340
148 28340 -15526 -554 31805 8696 -272 54952 76033 576 -52754 8139 66588 29229
160 29229 -14397 -12837 -13022 -17899 2740 19162 -9952 -37795 -17893 -5677 -18096 -509 25821
173 25821 5632 -32131 -24175 14731 23712 15349 18753 -886 -28113 -8270 25187 12133 -13235
186 -13235 3995 14480 -39135 -62950 6232 48035 -5875 -53279 -24049 5901 -21187 -26336
198 -26336 24299 38269 -7843 -38753 -21296 17085 39775 35099 4469 -27666 -14306 20587
210 20587 19209 5283 12993 9014 -26238 -41500 3245 41780 11760 -28085 -26737 -12705 437
223 437 18642 27680 2464 -27378 -11193 23589 26044 16904 14587 4000 -10012 -5538 20176
236 20176 29668 11878 -6076 -20170 -24393 570 24749 10574 -23632 -30901 -7157 -2490 -12962
249 -12962 2674 17279 -2311 -25529 -16082 10539 17883 11162 13145 2691 -15329 -7322 14320
262 14320 21231 10867 -811 -7398 -17339 -14160 7454 14416 1438 -12208 -22712 -23923 -8264
275 -8264 17610 21743 -10346 -31261 -12099 8977 13134 13472 13716 1433 -18683 -10615 21902 31712
289 31712 13750 -7131 -17830 -10596 8527 22662 14420 -11931 -22277 -13302 -4596 6919 14432
302 14432 2150 -20085 -27021 -6008 14776 12673 4399 -3660 -14377 -12256 5336 21094 15807
315 15807 -2834 -8449 -4768 -3220 5667 14514 9222 -4242 -13603 -9390 -1437 4138 10242 3895
329 3895 -11601 -14857 -6392 2183 6700 7449 4798 -8141 -16264 -2414 14055 16778 8164 -4177
343 -4177 -9588 -6245 6685 21602 17076 -1732 -11951 -10201 2665 15083 16653 5287 -14218
356 -14218 -19945 -3805 11315 14926 6148 -10920 -20412 -13750 5874 19345 10104 -7635 -16470
369 -16470 -13996 1037 15452 15607 2009 -14967 -15535 -502 9446 11490 4836 -7333 -14208 -11902
383 -11902 -1699 8852 5743 -4410 -14068 -17468 -6191 5750 5404 -2422 -8458 -6013 -4001 -4463
397 -4463 3514 12212 8505 -2304 -9588 -2982 10505 14746 10569 1129 -6601 -4528 1448 7939 11114
412 11114 4713 -5072 -12239 -10395 3694 13993 10405 -2318 -14984 -11727 4586 18053 18084 3649
426 3649 -9282 -6791 4180 17458 21271 9739 -4440 -9438 -2856 8449 12675 9535 -1268
439 -1268 -17136 -20328 -5512 10865 9947 -10290 -23992 -16764 -3627 4778 4601 -2804 -7790 -7495
453 -7495 -2633 2166 3714 10412 11500 -3773 -15254 -4609 15674 17057 -4987 -17263 -6522
466 -6522 2189 -4002 -11379 -5195 3270 -6041 -19557 -17169 -2724 9918 7283 -6224 -12596 -6152
480 -6152 8506 17268 11844 4708 4285 5818 5815 6201 14806 22442 8596 -12406 -12797 6110 18623
495 18623 9195 -7264 -13604 -13582 -5804 6380 9423 -87 -12680 -12501 -215 7172 9272 12278 6728
510 6728 -5211 -7903 7255 22630 16531 2083 -4550 -6710 -2464 8163 12326 333 -18409
523 -18409 -18589 -2107 866 -10723 -12379 -2543 -2524 -18969 -21146 2220 15443 1246 -15049 -11071
537 -11071 5065 10335 4270 1988 3203 3853 1865 -2703 -1760 4988 10523 5026 -13501 -20588 -1666
552 -1666 14626 5830 -13358 -15617 -1989 1300 -3503 1818 9457 5576 -6745 -9578 5364 19365
566 19365 17630 6221 -6164 -7257 6528 19576 16515 -409 -9195 -2316 2318 606 3795 7350
580 7350 591 -14077 -15030 3043 14021 4968 -6619 -7149 -1965 -444 2712 11530 8797 -6072
594 -6072 -10620 216 9644 5731 -2560 -2601 -2111 -7151 -7185 -1399 2925 -616 -8690 -10543 -8036 -3434
610 -3434 3880 3626 -4712 -7990 -2857 3161 2326 1330 6585 5386 -4177 -7710 -687 9673 9869 -839
626 -839 -8670 -9483 -3733 4243 5446 -357 -6919 -9655 -5208 150 4596 8333 3741 -5576 -7968 1259
642 1259 15426 17099 4369 -4883 -2735 6100 10414 8152 6460 1413 -8404 -9003 1705 9063 3677
657 3677 -8935 -12179 -6760 -2705 682 2462 176 -4699 -8075 -2990 5989 8365 5991 1371 -2856
672 -2856 767 6275 7872 4896 1427 812 -1860 -5407 -1821 2464 903 -4758 -10019 -9775 -6350 -3045
688 -3045 632 -1682 -7266 -7830 -4440 574 4075 5291 5110 521 -3749 1236 9717 13453 8684 -1645
704 -1645 -5463 -1052 6058 8491 2090 -4377 -6787 -8031 -5037 1928 4241 -1366 -11304 -12179 -2706
719 -2706 4774 6060 2791 -3287 -4934 -1199 6601 11752 7559 1089 -1751 -676 3482 7616 6473
734 6473 1722 -4538 -5752 -3233 -169 2561 213 -7089 -9268 -5647 -917 243 -1586 -913 -684 -3720
750 -3720 -2705 2620 6654 6096 1117 -361 414 2252 5006 6271 3413 -206 -3490 -3480 -100 3267
766 3267 3543 -2085 -7725 -6902 -2707 1859 3703 945 -3749 -7011 -3534 4763 7850 4501 -44 -3690
782 -3690 -2495 2465 7489 8665 1507 -5513 -5243 -291 4462 5099 -306 -5553 -7850 -5387 922 3144
798 3144 994 -3108 -7110 -5443 277 4597 4249 -805 -3564 -2014 75 3137 5180 2878 -1008
813 -1008 -3817 -1888 2098 2041 607 -752 -3394 -3941 -2805 -741 1648 850 -1542 -3438 -3461 -39 3504
830 3504 3774 2754 159 -949 415 2742 6445 6795 2277 -1686 -2244 1143 5143 5116 1671 -3074
846 -3074 -5894 -3109 1960 4131 1962 -3799 -6442 -4356 598 5142 4396 -524 -3981 -3740 1356 5999
862 5999 6002 2974 -1667 -4158 -711 3532 5278 2430 -3399 -6342 -4155 -488 2222 -210 -4629 -6145
878 -6145 -5795 -3018 -924 -110 -118 -3444 -5172 -2594 1073 3477 3079 -53 -911 -143 1254 3389 3143
895 3143 2058 1316 -791 -1631 -873 1466 3238 378 -3396 -4406 -3272 380 2274 1281 -1169 -3535
911 -3535 -2745 1252 3672 4741 3273 -233 -958 581 4707 8298 5931 571 -2664 -1334 4266 6907
927 6907 3730 -1400 -4687 -3484 92 1239 1819 -793 -4651 -5611 -3676 768 3200 1095 -2762 -4878
943 -4878 -3621 2529 5348 2353 -1915 -3250 263 1564 31 1649 1687 -1655 -4359 -3678 112 1213
959 1213 -1039 -2655 -4274 -4918 -1752 467 -256 -1853 -2371 -1057 -1187 -1585 1821 4046 2375 -1245
975 -1245 -2472 948 3940 3460 3143 723 -1760 -1134 1055 3587 3727 -266 -2568 -2743 -674 2239
991 2239 2824 2463 -100 -3971 -2423 3009 5923 4026 -788 -2275 -392 1963 5042 5190 880 -2807
1007 -2807 -2395 1369 2617 746 1079 -211 -4663 -5116 278 4563 1004 -4771 -4580 -1057 51 898
1023 898 1361 138 -1881 -1966 17 1312 453 1459 1002 -2289 -3224 -703 2739 1190 -2727 -2810 -1796
1040 -1796 -2001 -1931 -1096 131 -288 -2712 -3729 -1512 1413 2633 1303 -647 -754 -452 1779 4733 4091
1057 4091 1344 -1243 -842 1913 2713 3007 2142 -1165 -3497 -2031 1942 3262 -349 -2434 -2555 -3298
1073 -3298 -1048 3213 3944 -476 -4233 -1223 3097 3351 2715 2982 598 -909 -269 3064 4569 1871
1089 1871 -405 -1655 -2324 -622 1764 1263 -2414 -4981 -3061 -834 -1361 -1302 -825 -1480 -2448 -2408 -579
1106 -579 1531 1945 998 -858 -768 1297 2526 2077 1930 957 43 -743 -620 1369 1513 -385 -1583 -3177
1124 -3177 -2760 -1079 665 532 -2306 -3586 -2022 -417 894 2539 1250 -653 -2095 411 3886
1139 3886 3797 2399 940 -633 -381 1643 3817 3238 -724 -2589 -1577 -320 1231 1747 -805 -3308
1155 -3308 -4081 -1255 1306 497 -365 -879 -2280 -1151 1129 2806 2315 20 -618 -259 713 2303 2453
1172 2453 773 -442 -985 -180 678 426 376 -451 -2463 -2429 -1043 -94 -29 -591 -827 -1373 -1750 216 1473
1191 1473 1177 1306 129 -965 -37 1504 3323 1874 -319 -762 -902 416 1752 1766 182 -2418 -2753
1208 -2753 -853 806 1235 333 -1589 -3075 -1887 973 2649 1129 -839 -1695 -1294 693 3016 2501
1224 2501 809 -1824 -1842 284 1407 1872 627 -1935 -2671 -1402 361 1226 -446 -1762 -1892 -1720 -598
1241 -598 921 1000 225 -970 -733 499 952 1891 1932 305 -208 131 854 1246 876 584 -20 -1165 -1152
1260 -1152 -439 91 675 -29 -1495 -1960 -1268 841 1480 452 -348 -855 -213 988 2481 3006 1147 -816
1278 -816 -320 1026 2011 2693 1052 -969 -2322 -1289 949 1221 -232 -1583 -3122 -3020 -930 439
1294 439 405 -1732 -2689 -1825 -786 1085 1997 693 -934 -1167 305 2381 2374 1224 589 -1135 -997 677
1312 677 982 625 -686 -2105 -1691 -1696 -828 -100 -907 -1831 -1880 -1328 -273 143 921 721 -160 166 954 1441
1332 1441 2533 2327 1956 965 401 1545 2099 1787 1496 -9 -1285 -979 2 1286 282 -1452 -1952
1349 -1952 -2190 -1167 771 1552 239 -1304 -1789 356 1947 2135 2069 415 -757 -60 1534 3013 2061
1366 2061 -211 -1323 -1509 -500 1028 876 -1102 -2626 -2903 -1554 -798 -406 -861 -1963 -2194 -1466 -286
1383 -286 972 774 65 -495 -730 626 1722 1435 785 66 -258 -72 356 782 444 -452 -1156 -1063 -735
1402 -735 -530 130 457 -416 -1420 -672 334 965 1339 814 204 -32 -99 1687 2198 1793 852 -108 -533
1421 -533 500 1762 1558 29 -1725 -1710 -430 680 1048 8 -1065 -1509 -802 571 1536 826 74
1438 74 -1033 -975 1118 1590 1542 520 -904 -871 -186 814 980 -456 -1670 -1921 -1398 -752 -406 -513 -1024
1457 -1024 -2180 -1665 -172 270 513 157 -350 -173 209 1116 1825 1208 992 271 135 703 640 489 693
1476 693 -232 -1486 -1448 -928 -93 -502 -764 -1375 -1838 -1105 312 1298 1097 224 -151 563 1406 2175 2860 2280
1496 2280 699 -151 1123 2597 1955 485 -402 -1327 -1015 -222 167 -26 -1910 -2415 -2117 -1203 -295 -47
1514 -47 -646 -1223 -1377 -103 1637 1707 894 566 410 1159 1711 1389 1358 210 -147 -448 -371 55 -317 -1530
1534 -1530 -1851 -2100 -2022 -1793 -1067 -772 -1583 -1816 -917 -633 -217 588 870 1062 166 490 2002 1860 1666 1638
1554 1638 920 30 -164 870 1729 156 -1305 -1346 -1201 -868 -1 -34 -805 -2090 -2141 -350 589 891 438
1573 438 -327 -318 591 1599 2486 1600 559 493 460 1058 1469 962 232 -1230 -1243 -440 -222 128 -433 -1970
1593 -1970 -1814 -1271 -298 -179 -581 -458 -619 -760 328 1077 632 702 351 262 333 561 1322 597 -410 -436
1613 -436 -298 -204 -329 -231 -146 -581 -1807 -793 -203 -584 -22 186 -465 -928 -391 930 1353 620 442 -184
1633 -184 66 774 1327 1543 46 -794 -553 -134 335 365 -196 -1261 -1489 -724 471 154 -151 -675 -1187
1652 -1187 -588 764 1195 853 -48 -258 38 176 988 1569 640 -591 -518 -114 402 -157 -135 -360 -1628
1671 -1628 -1243 -78 -336 -430 -434 -546 -719 -423 585 1034 316 240 297 387 653 605 1361 987 45 187 88 410
1693 410 458 4 -151 -810 -1377 -430 -52 -116 -249 -751 -898 -1007 214 887 626 18 90 -412 398 1456
1713 1456 1314 361 -121 -120 108 720 731 482 -716 -1122 -867 -345 110 -571 -871 -1139 -1405 -843 340 -61
1733 -61 -430 -747 -404 184 375 806 636 553 -47 631 908 1166 616 446 16 -610 72 405 96 53 -352
1754 -352 -630 -596 -500 -251 56 -449 -308 -439 -292 139 499 890 541 73 281 513 1012 1162 711 194 -87
1775 -87 152 663 617 229 113 -692 -733 -167 172 292 -301 -1459 -779 -672 -107 436 -45 -330 -676 -263 787
1796 787 359 460 171 -383 -103 511 384 373 -311 -632 -803 -363 64 -56 -370 -555 -797 -585 -59 -125 162
1817 162 -75 -476 5 98 208 331 306 229 175 80 384 699 640 297 58 -43 -91 -32 375 315 -193 -416 -472
1840 -472 -55 252 325 262 -205 -517 166 618 434 676 265 86 91 480 898 1034 156 -177 -454 72 75 -132
1862 -132 -120 -746 -889 -860 -359 -121 120 -794 -585 -436 -240 503 296 436 -85 -291 115 684 611 145 90
1883 90 -109 68 -111 45 300 -275 -585 -439 -443 -330 -474 -607 -518 -755 -573 -28 257 225 369 230 260 234
1905 234 733 1457 1128 1082 609 310 730 699 643 396 -346 -421 -496 -241 -13 -523 -824 -1077 -1101 -484 -24 -102
1927 -102 -235 -393 -224 164 752 900 599 386 502 748 905 1119 831 276 -72 -122 205 -29 -119 -502 -1117
1948 -1117 -1394 -955 -731 -754 -1051 -991 -653 -536 -527 93 403 265 298 415 932 781 833 940 714 624 355 252
1970 252 438 369 -37 -342 -765 -807 -795 -591 -268 -580 -1005 -815 -235 -175 237 299 101 72 124 875 889 1077 585
1993 585 325 669 868 990 645 309 -369 -466 -272 -101 -54 -567 -1111 -786 -1002 -347 -185 -374 -542 -407 -301
2014 -301 299 230 521 582 244 285 373 644 576 391 58 -60 -56 -180 -240 -410 -257 -887 -572 -562 -618 -136 -272
2037 -272 -167 -80 -342 157 315 461 715 342 339 147 572 624 714 348 17 -321 -27 80 69 -265 -557 -875
2059 -875 -573 -328 -153 44 -264 -353 -165 118 512 499 187 231 90 421 510 519 90 61 -128 -59 -262 124 -179
2082 -179 -515 -680 -561 -461 -814 -591 -443 -515 -422 21 214 249 318 411 431 522 358 691 765 664 361 176 314
2105 314 32 -188 -67 -190 -746 -468 -863 -513 -234 -551 -568 -322 -549 196 248 257 350 282 306 631 856 1036
2127 1036 777 76 458 573 510 456 85 -655 -695 -587 -194 -440 -599 -486 -949 -820 -730 -123 -144 -290 -132
2148 -132 -68 99 501 875 606 313 282 536 713 348 375 397 85 -147 -59 -249 -164 -523 -532 -593 -756 -472 -457
2171 -457 -513 -387 -110 -99 143 335 386 545 440 332 533 709 849 784 615 208 5 291 38 -127 -277
2192 -277 -579 -717 -767 -559 -262 -347 -441 -475 -382 -461 296 300 398 136 42 347 583 454 495 231 153 291 126 178
2216 178 124 -235 -119 -258 -529 -299 -538 -489 -475 -303 -445 -306 -189 79 -26 -161 70 166 286 205 266 637
2238 637 149 215 361 308 135 267 -289 -173 -316 -309 -58 -98 -275 -193 -577 -168 24 183 156 108 -221 328 119
2261 119 416 437 394 217 -39 279 263 321 167 -162 -222 98 -115 280 -410 -444 -565 -264 -273 -56 70 -26 -332
2284 -332 -5 -35 137 502 425 186 -28 288 469 383 179 129 36 -171 -21 -134 -304 -200 -260 -522 -276 -446
2306 -446 -608 -57 -370 -8 -105 68 184 388 368 537 279 400 557 371 416 405 193 -33 257 245 72 -44
2328 -44 -186 -380 -595 -357 -329 -44 -223 -357 -319 -126 56 25 136 22 215 8 439 662 508 112 223
2349 223 258 334 475 302 96 -127 -112 -145 -486 -95 -351 -402 -472 -459 -169 -187 -321 -175 -161 -321 -56 178 49
2372 49 435 128 360 475 85 261 550 37 47 -153 -232 -247 -77 23 -315 -575 -452 -285 -206 -92 -285 -322
2394 -322 -358 -289 171 200 511 74 -174 425 514 429 464 261 -92 -35 -11 439 330 81 -14 -529 205 -178 -283
2417 -283 -93 -74 -447 -451 -149 -151 -53 -282 -65 98 -52 289 248 273 77 268 261 150 295 123 -25 -114 -18 -269
2441 -269 -199 0 -204 -109 -382 -175 -314 -120 -78 188 11 -122 79 4 339 102 75 7 80 180 201 237 341
2464 341 -100 -52 -133 -181 38 109 -324 -568 -81 -269 0 -107 -12 -232 -217 298 394 530 229 331 94 235
2486 235 274 312 320 13 -341 -108 4 5 -176 -123 -266 -154 -342 -286 -101 -218 -171 -297 -125 247 37 192 275
2509 275 124 32 107 501 241 189 319 -15 -108 -219 -245 -81 -150 -180 -548 -695 93 -228 -106 -116 -395 -93 91
2532 91 215 463 267 262 263 183 435 503 339 78 37 -266 160 57 73 -242 -417 -340 -213 -207 -181 -228 -369 -509 -254
2557 -254 32 179 -159 -61 -157 202 442 535 355 261 203 137 283 99 334 75 -21 -83 -91 -338 -84 -295 -394 -146
2581 -146 -238 -244 -294 -27 -56 -122 214 20 141 279 526 413 280 203 122 583 459 590 -102 -194 -115 -98 15 -48
2605 -48 -216 -309 -536 -396 120 19 -2 -210 -342 -299 140 320 384 177 -247 -22 162 408 386 261 -24 -206
2627 -206 43 364 289 -255 -296 -429 -207 -155 87 -92 -135 -280 -220 -57 -124 -77 5 65 -29 74 192 356 318 65
2651 65 -124 -29 20 127 235 134 85 -367 -151 -158 73 -45 26 -118 -67 -349 84 137 148 89 210 135 243 360
2675 360 209 35 12 -144 274 364 139 -6 -123 -282 -102 -22 59 -73 -14 -337 -211 -260 63 -35 73 -226
2697 -226 -91 -66 67 251 169 -176 -86 -12 127 317 -23 -208 -305 -294 42 -277 -314 -159 -382 -292 -374 -114 25
2720 25 -101 -6 40 36 56 119 369 409 486 286 19 263 146 345 199 147 -385 -304 30 -174 174 -206 -408 -423
2744 -423 -80 289 177 -119 -199 -187 124 274 374 176 186 6 252 493 537 177 -5 -196 -6 59 199 147
2766 147 -292 -337 -488 -347 -124 -9 -273 -540 -280 -351 -116 19 215 61 -144 -19 145 422 133 136 234 148
2788 148 -21 216 138 212 -60 -157 -214 -610 -339 -146 -301 -95 -334 65 -236 -201 14 -97 -154 -185 -55 358
2810 358 477 473 188 -174 -220 355 517 646 160 -253 -35 -91 145 122 -51 -327 -480 -293 246 131 2 -160
2832 -160 -367 -78 148 409 276 24 -88 278 431 473 584 137 2 113 143 66 240 -125 -30 -359 -382 -7
2854 -7 45 -362 49 -218 -430 -166 34 -147 122 77 226 193 -33 167 489 461 121 -307 -322 -53 216 67
2876 67 17 -53 -234 -547 -134 187 15 -116 -475 -400 119 86 291 -23 -98 -192 129 505 504 12 -55 -76 163 330
2900 330 139 -38 -191 -432 -293 24 -78 103 -51 -547 -77 35 -7 310 4 82 89 16 369 276 8 -3
2922 -3 -30 -103 79 263 290 -348 -84 4 -293 -214 -159 -185 -330 -276 -168 -300 52 -88 58 208 -78 -249 90
2945 90 489 370 465 18 -68 -151 334 271 -26 -196 -504 -122 -150 69 142 -454 -286 -434 179 52 -88 -105 -295
2968 -295 -426 -187 152 246 513 -68 -6 324 549 476 323 -85 119 -316 -54 350 -188 125 -241 -455 -321
2989 -321 -164 -73 -25 -225 -131 -215 169 -117 112 270 55 97 -17 219 76 426 132 33 -77 79 126 19
3011 19 -56 -151 -71 -238 -180 75 -20 -45 -69 -270 -119 -12 420 258 -199 -287 -52 247 400 361 126 -79 -227
3034 -227 8 356 359 -84 -326 -53 -57 323 140 -213 -337 -355 -310 -187 288 -186 -84 103 -67 104 238 256
3056 256 71 137 -30 -34 59 229 -199 -138 117 -229 4 162 91 -255 -349 -172 -292 98 -124 -32 147 -261 -30
3079 -30 -185 -154 414 216 136 -136 -55 188 224 235 86 54 -273 -109 405 265 2 -198 -423 -148 86 272
3101 272 -36 -173 -178 -183 174 340 277 225 -191 -108 1 265 307 -164 -214 -473 -276 349 164 67 -253 -516 -324
3124 -324 -237 -29 -273 -400 -294 59 -147 36 83 154 -33 -108 -153 103 317 45 148 -24 47 -67 127 221
3146 221 -106 172 -32 -431 -478 -98 -196 69 -132 -68 -116 -336 -59 310 -56 -88 29 174 168 274 385 142
3168 142 91 305 210 380 131 98 -154 -331 -230 -4 152 -298 -571 -549 -117 30 79 27 -140 -173 83 320
3190 320 209 336 -28 16 53 149 161 374 -55 -155 -9 -45 -123 -39 -45 -266 -424 -400 -140 49 -17 -490 -140 -151
3214 -151 -138 92 9 41 89 -48 -10 -16 87 626 44 178 -124 -159 137 288 45 301 3 -505 -127 -34 162
3237 162 -199 -326 -375 -240 75 182 64 27 -297 -149 291 436 410 -91 -132 -306 179 685 183 -3 -137
3258 -137 -127 -32 225 210 69 -307 -53 -177 92 224 26 -131 -368 -274 176 230 -77 -126 -59 -89 57 154 194
3281 194 145 -203 -243 -47 -113 -68 126 56 -208 -119 -211 -321 -20 -89 -161 -155 -69 273 29 197 26 192 -81 4
3305 4 -133 370 538 288 31 -342 -10 286 -102 84 -89 -242 -73 -74 17 -13 -79 -414 -5 153 296 82
3327 82 149 -267 -220 111 228 193 33 -329 -113 139 178 127 50 -269 -318 -162 -174 199 -38 -343 -201 -322 -210
3350 -210 208 3 18 -119 48 -4 65 6 -31 170 293 133 22 -135 -84 58 247 -149 -278 -320 -419 155 -115
3373 -115 -199 -288 -290 171 86 101 117 -149 -48 232 278 369 479 65 -79 125 214 213 48 249 -246 14 18 109 -72
3398 -72 -194 -159 -164 -334 201 224 -78 -169 -174 -116 287 156 187 27 58 251 239 87 79 390 146 25 51 108 -211
3423 -211 -56 -367 -229 -400 -194 -78 -163 -288 -228 -255 -137 -12 -1 315 257 127 -177 145 129 410 -42 163
3445 163 -15 32 84 439 332 -69 -230 -356 -192 -112 57 -362 -438 -298 -512 68 71 202 -156 -359 -199 47
3467 47 282 193 172 34 -65 -32 425 687 55 -238 -243 -134 151 200 -357 -17 -300 -294 82 8 225 -58 -193 419
3491 419 209 104 166 16 179 25 -44 -140 52 140 -301 -147 27 -195 -40 -35 33 18 -156 -105 -71 -69 -21 317
3515 317 83 -241 -139 18 204 186 20 -32 -68 60 203 176 210 -267 -301 51 80 216 -138 -157 -582 -344 226
3538 226 19 53 -215 -367 -161 -169 35 303 219 -270 -174 49 379 180 60 -63 -96 33 -275 -120 3 -395
3560 -395 -345 -490 -2 18 -60 97 -91 -144 -104 -4 199 -191 -59 196 188 126 161 134 198 180 -99 29 -54 -23 142
3585 142 -92 -195 -174 -168 -213 106 134 68 -337 -216 -53 -7 206 10 82 -169 220 281 274 13 -181 144 115 429
3609 429 186 105 -4 -387 -272 -49 -41 -208 -121 -417 -307 -59 -50 96 -344 -213 -174 -241 103 90 244 12 4 189
3633 189 257 34 47 104 226 -164 -352 118 -16 24 -77 -394 -88 57 -135 55 18 -108 69 -152 -18 41
3655 41 289 213 77 -54 215 226 94 293 75 2 42 205 221 -80 -132 -217 -210 -55 143 60 121 -394 -400 -58 152
3680 152 134 310 1 -189 128 89 89 27 -74 -230 -229 87 216 65 -226 -298 -282 -87 106 -32 -208 -396 -206
3703 -206 -96 95 204 -41 -223 -172 -91 -33 -54 68 96 30 -40 150 -54 -125 65 -160 90 -42 158 -130 43
3726 43 -43 -21 -173 -33 -216 213 354 7 173 -45 113 270 115 419 437 -109 -381 -73 200 179 215 -372
3748 -372 -204 85 -49 214 -5 -203 -175 -477 -196 177 -112 -355 -413 -157 238 199 27 171 -212 22 80
3769 80 150 548 230 77 -109 -171 -26 -95 -75 -238 -72 -190 -157 -420 73 -176 -278 -17 -165 52 192 -47
3791 -47 -11 250 128 216 81 330 229 297 -41 18 90 18 131 169 164 -253 -197 -49 -165 -108 -226 -475 -423 -126
3815 -126 47 131 6 -38 67 19 243 395 420 78 28 -80 326 160 118 -23 -120 229 127 119 5 -249 -359
3838 -359 -321 -161 -166 112 -311 -471 -124 125 -110 141 34 134 80 164 119 242 338 331 487 50 -68 344 -65
3861 -65 -156 -111 -30 -287 -33 -186 -84 54 -144 -3 -122 -48 -210 284 -40 -173 -22 177 121 268 673 -201
3883 -201 37 -149 280 288 95 51 -106 -322 21 -98 -75 141 -276 -178 -162 170 227 -187 -152 242 -19 186 -73
3906 -73 282 168 -61 178 213 61 272 52 -138 213 -172 -72 58 -31 -185 -299 -201 -106 53 -292 -50 -231
3928 -231 -75 -181 -47 109 220 258 203 174 -45 165 332 178 353 -311 -74 -296 64 49 34 -350 -110 -140
3950 -140 59 -33 18 -55 -188 152 -104 140 207 192 95 -71 -206 343 278 2 -300 -67 -269 179 87 -371 -232
3973 -232 -96 -293 -203 130 -59 -126 28 -186 7 162 349 -225 4 -128 342 102 266 167 158 -97 42 75
3995 75 23 224 -170 -181 -143 -262 -173 -73 -157 168 -140 -150 -92 38 15 279 191 68 -42 350 377 161 499 -51
4019 -51 24 184 56 269 2 -228 -250 -328 -172 -230 -323 -369 -530 -208 -288 65 10 88 -31 -25 132 171 244 244 204 67
4045 67 -39 112 315 -55 -209 -25 -204 25 -47 -20 -185 -248 -294 -41 218 -140 25 -43 -274 146 -65 165
4067 165 -23 39 287 197 236 422 88 5 194 196 -57 214 14 -52 58 -147 -130 -333 -219 -120 67 -193 -127
4090 -127 -246 -171 266 276 94 186 95 -258 207 469 258 -22 32 -182 190 108 312 -211 -367 -234 -113 -179
4112 -179 -93 -363 -194 -272 -390 -76 -225 156 -39 62 -141 234 114 259 151 84 98 58 104 22 240 -140
4134 -140 126 -112 -235 24 -168 -370 -56 -123 185 -85 -23 -42 -194 65 -152 11 40 297 273 121 275 138
4156 138 33 -23 179 135 154 -2 67 108 92 -86 -35 -261 -146 168 212 21 -128 -73 -104 41 337 383 -34 209
4180 209 306 363 399 36 37 109 -235 26 -77 248 150 -278 -338 -457 -230 108 -82 -285 -12 -46 -242 -57 219
4203 219 14 -100 177 135 66 -27 307 4 148 -106 179 -131 -133 -355 -32 -81 -243 -250 -191 -276 -5 -368 -231
4226 -231 -91 -184 256 529 98 -61 182 292 153 179 94 188 -75 227 12 485 398 -47 -66 -126 -250 -78
4248 -78 -195 -198 -473 -113 -51 -26 36 44 -103 87 275 122 -64 -150 349 120 174 369 247 2 172 92 -123 -88
4272 -88 -116 -9 106 -220 -74 -466 226 40 -175 -56 -113 20 -106 -39 -47 316 178 146 158 242 55 349 156
4295 156 343 155 -6 -91 -49 -118 -27 -215 -248 -37 -55 -225 -201 -81 -162 -135 230 -229 67 82 271 15 277
4318 277 357 137 -159 -34 55 46 53 136 10 92 -49 -377 -71 -87 -202 -276 91 -207 -76 -215 76 -64 89
4341 89 71 -72 355 37 216 199 87 -7 62 3 32 -184 -30 -29 -173 -269 89 -173 -88 63 -268 -355 -302 53
4365 53 19 165 86 38 85 186 222 -2 153 86 -50 259 4 59 -75 -236 -213 -37 -136 7 -203 -337 -197
4388 -197 -363 2 -121 112 -114 -33 93 362 190 108 88 67 119 -142 268 4 -138 182 -72 115 121 32 6
4411 6 -274 -361 -410 -102 -480 -202 -113 -293 199 -17 -190 172 32 74 74 108 388 205 -123 99 118 337 188
4434 188 11 -71 -84 -35 -51 -301 -30 -82 34 208 -387 -27 -165 -32 17 52 204 102 56 292 303 290 105
4457 105 122 72 -179 225 -64 24 -37 -311 30 189 -78 -293 -376 -303 -112 -130 -47 -145 108 -80 346 82 223
4480 223 209 37 319 304 476 227 44 248 -115 -60 -241 -145 93 -151 22 -46 -267 -6 -143 -132 -181 33
4502 33 -93 22 -209 143 109 245 24 356 159 406 240 86 265 7 210 92 55 50 -284 -247 8 -161
4524 -161 -45 -92 -264 -90 17 -189 -272 10 -9 77 23 193 196 52 274 20 176 -3 -13 191 -45 -120 0
4547 0 -239 -117 -124 -48 13 -230 -60 -202 -133 148 -120 285 308 70 180 60 76 112 -79 242 32 90 -235 -86
4571 -86 -60 152 -203 -66 -63 -128 9 -210 -33 -295 -3 -131 -165 116 12 -49 -19 214 258 -67 159 279 156
4594 156 23 41 -52 170 -177 62 -155 -179 157 -303 -392 -276 -128 -30 313 -156 -229 -100 -171 60 80 267 227
4617 227 158 74 110 179 67 -126 3 83 -57 104 -254 -304 -156 -98 -117 -226 -36 -201 -103 -183 -50 92 -54
4640 -54 37 -11 308 217 171 344 346 267 24 282 -7 196 -2 -36 335 133 36 -91 -216 1 -63 -89 -281 -334
4664 -334 -43 -228 -143 239 8 -20 91 49 38 70 266 245 -110 -8 147 94 15 -183 -250 120 -218 25 -144
4687 -144 -312 -254 -234 -91 55 -203 -7 -121 -207 63 244 140 229 172 -77 61 114 452 30 71 160 74 -55
4710 -55 57 59 -132 -229 -74 117 -58 -98 -86 -24 -154 -118 -32 -286 -73 -80 330 32 269 203 76 176 162 -90
4734 -90 46 -71 20 -322 10 -124 -43 -99 80 -7 -60 -185 -15 -69 -179 -163 154 -5 -302 20 94 -82 62
4757 62 177 84 51 209 67 -97 154 163 -96 77 -293 -138 93 -145 -142 -63 318 63 111 -31 43 138 -45 202
4781 202 155 180 467 337 242 36 143 58 144 -88 -265 129 26 -236 -361 70 -29 -133 -118 -34 -174 163 132
4804 132 -54 -84 229 -14 55 289 247 0 22 -60 55 274 -137 89 82 183 83 -258 -208 -175 -361 -280 -248 -44
4828 -44 -143 21 -10 143 29 -10 -51 14 76 126 202 298 93 44 93 85 257 -16 -146 -198 32 51 -229 -86 14
4853 14 68 -185 -374 -188 -266 42 -120 70 123 -125 27 99 107 152 107 289 135 -183 8 -196 34 -1 -138
4876 -138 -54 -252 70 4 47 -243 -496 -111 -143 -147 -174 -73 -50 16 126 80 458 316 102 197 352 178 233 157
4900 157 -36 24 -94 -248 161 -328 6 -61 -282 -52 -274 -23 -155 20 -27 -74 -82 -239 100 120 76 81 151 339
4924 339 85 70 -4 13 -6 113 -63 256 -163 -10 29 176 -101 196 -257 -205 122 -170 -124 -7 -14 -62 54
4947 54 51 263 13 205 237 110 -7 -297 316 251 33 -44 -354 -303 -102 -34 -338 27 -189 121 257 191 -23
4970 -23 60 181 -97 80 -14 198 196 270 -129 151 277 245 106 217 91 404 -122 -102 118 -285 212 11 -120
4993 -120 -124 -356 32 157 73 161 67 324 152 -74 -118 3 60 181 -135 139 142 -109 -354 19 -23 -102 51 -294
5017 -294 -76 -153 172 66 -136 -263 132 291 -46 -41 328 75 25 -32 86 -115 -45 223 55 -157 -221 49
5039 49 -322 -29 -68 -233 -299 73 31 -192 -225 -157 -159 -246 241 55 -51 -12 97 146 278 101 105 135 178 67 190
5064 190 103 57 21 -300 -97 -306 -246 -222 -236 -237 -173 -231 57 39 -129 -35 286 80 190 -61 32 204 317 338 -41
5089 -41 135 214 108 82 -45 -87 -56 -158 -240 -227 -357 -270 -185 -290 -155 -5 -5 139 -45 17 280 298 167 13
5113 13 199 220 -238 315 -21 12 42 100 125 -245 2 125 232 -184 -167 -196 -57 -246 -78 64 -68 35 -169
5136 -169 -6 13 378 138 -56 -43 80 -114 161 155 329 60 -128 -64 93 11 194 -89 -137 -70 -243 -64 -152
5159 -152 -224 55 256 27 52 123 139 -188 -6 115 209 158 145 -27 -53 205 85 -203 -130 -164 224 91 47 -266
5183 -266 122 83 -232 -116 -332 51 122 -10 149 -32 276 110 109 108 117 -1 -69 -21 -189 -245 -52 -170 84 -179
5207 -179 -404 33 -55 -71 -296 -104 -91 -58 82 361 213 113 -19 -60 190 58 280 94 68 6 236 -378
5229 -378 267 -101 145 -7 74 -32 -76 -101 -88 -43 -182 -95 202 -342 101 272 157 195 72 188 130 132 156 -51
5253 -51 -134 183 -114 -10 -259 -171 -274 4 -45 330 83 -358 -14 -22 -52 -396 -204 279 -158 -56 61 -85
5275 -85 173 397 91 187 362 136 361 100 12 -178 22 -266 -264 -126 -105 -70 -108 -164 -103 -55 -196 -25 38 115
5299 115 314 59 149 115 150 165 72 45 101 -7 216 -73 -33 41 86 -125 -192 55 -192 -107 -113 -252 -239 122 -98
5324 -98 -41 -212 -319 111 -271 -129 31 -53 -108 61 156 116 -95 -62 20 57 37 -48 7 161 -146 -269 -131 -35
5348 -35 -45 -229 -143 -16 35 -18 97 44 44 57 96 169 265 90 292 277 66 -43 -197 -108 96 77 21 -52 20 129
5374 129 175 36 -67 -127 -30 -249 -51 146 29 60 -24 59 222 108 -129 128 209 264 135 -140 -141 -8 -125
5397 -125 128 -146 -137 204 -88 148 -60 -67 -51 41 13 42 237 187 145 250 -105 22 143 4 238 295 123 160
5421 160 173 -154 -41 -141 -175 -128 -73 -4 176 -72 -111 140 -283 6 131 -118 135 258 304 229 -87 69 105
5444 105 -36 102 61 -166 198 -48 -48 -330 2 -237 -347 -15 -174 13 254 28 -271 -137 97 -30 -61
5465 -61 -78 246 -25 157 63 71 247 153 26 64 32 -110 -165 -46 -42 70 -26 -187 -296 -279 33 -115 -40 -164 230
5490 230 -141 -33 199 354 278 230 19 36 166 -4 73 74 -50 -73 -62 -36 -67 -206 42 -142 154 -301 -115
5513 -115 -17 -246 -148 175 -6 -11 -195 -36 -60 -63 123 41 110 80 21 -52 -1 3 -159 -34 -128 -77 -178 89 -18 -104
5539 -104 -1 -80 -127 71 -134 18 -330 -16 74 6 158 112 123 -13 148 163 265 14 53 172 48 121 0
5562 0 93 -186 2 -3 -126 -189 -306 99 15 -54 91 140 82 236 23 120 99 164 -98 192 363 10 184 79
5586 79 41 -46 -285 35 -232 54 183 49 -203 -42 -184 26 194 178 -82 -57 157 137 268 20 220 241
5608 241 133 74 136 -180 -53 9 133 -144 234 55 -133 -192 -81 -103 116 -92 51 94 -43 14 352 -7
5630 -7 149 -141 110 -112 -63 -21 26 271 -28 114 24 115 0 -68 -292 56 -70 -14 -116 29 104 21 -99 -7
5654 -7 132 105 135 -82 69 118 -144 107 -168 -10 239 351 63 -65 18 -268 -70 -104 -142 -83 -7 -420 -47
5677 -47 -22 -65 -183 1 18 -132 -100 -260 121 31 92 109 -143 235 -94 174 190 -140 151 85 -25 -147 -168 -98
5701 -98 -198 25 36 1 -111 124 -124 120 124 -313 64 74 -107 49 77 166 84 9 -169 85 99 -272 68 95
5725 95 30 155 -41 -65 66 28 -193 -179 -35 -192 178 -132 -47 -3 102 -114 109 42 -123 184 73 -90 233
5748 233 -115 -31 85 53 45 122 13 -16 -102 97 -74 -29 -12 -144 -122 69 -72 -72 84 -38 -84 -141 215 158 64
5773 64 173 -110 92 58 75 -55 139 30 138 -109 89 -161 -175 79 80 113 -145 -168 149 -57 -189 -117 -96
5796 -96 3 -122 16 -43 27 147 32 37 -242 63 -54 122 45 -63 136 -41 -69 -118 125 -55 154 -20 130
5819 130 47 123 -41 184 172 -245 86 -40 223 29 98 -41 -128 -127 -7 -13 -297 -168 27 -93 -93 -74 129 -147
5843 -147 420 38 46 22 166 -6 118 -139 40 194 15 164 136 -132 62 38 -84 144 77 8 -52 -123 -51
5866 -51 -331 -169 194 -65 -269 -263 79 -60 57 -50 172 59 -60 77 -9 228 27 10 -21 91 -88 105
5888 105 2 -16 -211 -57 -132 159 -135 -246 -174 37 -26 -96 -69 -62 120 -197 222 89 296 -112 -30 123 -136
5911 -136 142 43 174 78 200 262 139 -136 -109 -113 -35 11 -93 128 -41 109 55 -45 47 121 -24 107 282 -174
5935 -174 73 137 -105 25 213 112 -51 -45 -260 -111 34 65 126 10 1 -79 -147 -272 -151 133 -96 -137 -92 88
5959 88 95 -40 -109 21 136 34 23 134 40 252 83 -245 -260 115 70 -159 65 -77 -76 -105 45 137 -121 -163
5983 -163 177 110 -24 37 -104 -63 204 -217 16 28 5 109 21 -38 -139 -95 -71 263 64 -56 44 21 115 34
6007 34 -114 20 256 -44 89 27 -31 -120 6 -34 -7 203 -151 -64 -107 180 -12 -190 271 -47 368 117 -296
6030 -296 -18 -78 -139 -90 63 -65 135 -102 -54 52 -173 94 86 -82 -202 -56 177 55 -82 -64 -3 73 125
6053 125 -16 -87 -35 3 93 -99 -129 90 32 172 -181 18 -78 -15 -112 184 143 69 211 -82 -105 165 0 -15
6077 -15 63 244 46 41 80 -28 -40 -58 -111 -224 11 -28 10 -63 101 30 -154 44 111 77 109 203 -156 13 -96
6102 -96 97 121 -49 95 -355 -12 -272 69 -110 219 134 -322 -123 -100 137 -177 -228 53 -200 38 -56 96
6124 96 33 76 -97 -34 86 81 72 32 175 -21 182 71 -44 -65 27 -115 -78 -90 -305 2 269 -150 -248 -140 187
6149 187 5 54 -146 -54 293 97 126 -100 209 30 45 -85 -200 195 171 -178 258 46 -80 71 48 92
6171 92 38 -93 -242 97 30 -257 -19 -37 372 -158 -41 133 -74 -47 158 -10 -216 -335 -32 69 -165 92
6193 92 14 77 39 -109 -103 -133 -111 97 -144 172 -224 267 284 -247 129 -271 -61 164 -82 -291 68 -9 25 -34
6217 -34 -15 174 198 -38 -14 -181 -45 -150 -180 233 -226 189 72 12 -42 71 45 183 -112 -117 -96 -123 287 218
6241 218 57 -476 -5 159 -183 -101 3 -119 -15 4 38 36 -79 15 33 -121 -128 46 20 250 -14 27 13 268
6265 268 301 -25 11 104 -67 -12 -68 -42 -309 174 -32 -253 -152 -35 94 -255 152 182 168 -212 203 93 105
6288 105 -81 189 18 91 -6 -99 92 -38 29 25 -173 27 -226 -37 204 -69 -318 -213 251 237 -161 15
6310 15 -21 56 34 82 -140 171 -298 -61 52 226 119 80 49 223 45 188 -189 131 -65 -47 -132 -150 -115 -168
6334 -168 60 -139 -136 44 -27 -44 142 231 -67 150 199 269 -21 -125 174 -130 143 407 12 -72 -58 -115 -43 -49
6358 -49 -44 -72 -56 71 -175 -204 -410 0 -71 82 -195 -48 15 42 -28 16 44 15 29 -138 -86 160 -42 -68 -91 -187
6384 -187 209 -35 -123 -83 136 -20 -135 -89 56 84 -125 35 263 -79 -126 118 -92 60 111 -116 174 -145
6406 -145 -25 -9 -65 147 -209 -47 212 -201 -209 97 -50 119 -42 23 20 44 -107 202 -2 12 34 134 8
6429 8 89 193 -1 -174 4 74 -86 -138 32 34 -65 -196 24 5 14 105 -339 -65 26 1 78 -186 329 78 -82
6454 -82 257 156 30 -146 -225 176 203 259 -167 -134 231 -6 86 6 -59 -117 -280 77 114 -29 48 16 -21 -105 148
6479 148 -179 -203 159 176 -143 63 136 -69 109 -55 -1 252 -121 192 147 -264 -70 57 59 28 -52 74 -9
6502 -9 0 55 -134 -185 253 126 -3 455 -147 -145 -84 114 109 -16 121 150 -245 56 195 -53 90 -115 -70 -10 -120
6527 -120 -13 26 -329 30 8 112 279 -253 8 -139 -159 184 -112 -4 65 -149 -144 12 18 -35 -29 65 77 -153
6551 -153 -265 -268 -144 78 186 89 85 277 303 166 238 67 -8 -175 64 -16 -211 -79 193 -118 51 225 -70
6574 -70 58 39 236 144 47 240 -113 -226 -107 32 -70 -35 -123 -217 8 -213 -189 -200 171 -149 -269 196 35
6597 35 -102 26 -77 101 48 -256 66 215 -11 -196 -172 160 224 269 113 5 -156 6 -74 -140 -255 161
6619 161 -321 -279 -207 -310 -91 -172 -266 -42 256 40 108 168 2 107 28 -68 -79 63 -213 -26 -117 4 77 -43
6643 -43 -17 54 -213 -83 129 166 96 16 -37 250 -127 70 -64 74 136 167 65 -158 78 -119 82 -258 62
6666 62 53 -100 54 7 46 -47 87 75 -142 -139 -25 -172 69 -43 177 224 -44 -126 -14 -150 -61 52 64 105 -40
6691 -40 -91 -166 162 18 -179 -6 123 -64 279 -65 -59 -207 104 61 -112 -72 161 186 16 -86 74 -218 -36
6714 -36 -80 3 -8 -188 -54 3 -79 97 79 27 -159 60 200 72 316 32 193 -59 38 -46 40 22 -147 -75
6738 -75 99 -200 -156 -27 -223 -192 -128 168 -100 24 105 -58 60 -120 -258 160 -27 -85 148 -100 -135 -36 87
6761 87 4 -220 75 -37 83 89 56 -45 -23 -132 -255 267 104 -31 301 152 -111 73 -112 -258 -267 -27 108
6784 108 114 78 -130 -230 -112 97 -36 188 -2 -153 14 40 50 -33 127 148 -89 -112 202 96 -86 368 77
6807 77 252 -9 -282 -42 -155 161 189 -48 -8 217 -96 28 100 -205 -31 19 -146 55 66 -328 33 16
6829 16 91 10 -179 -81 -31 -118 37 -18 -120 185 64 -130 184 -150 -10 152 161 104 19 22 7 -17 318 256 -126
6854 -126 -34 -17 -51 93 -8 17 130 92 11 -37 90 -13 165 -188 -131 162 1 45 -129 87 -76 -57 -109 114
6878 114 -61 -252 -46 116 325 -79 400 105 -138 -388 19 -289 250 -221 -185 27 243 -69 -120 430 109
6899 109 79 88 26 -84 -189 78 27 137 182 -64 100 201 -51 51 3 -40 26 313 -1 112 -8 54 -105
6922 -105 78 80 122 92 -84 -301 47 254 -50 -121 -269 -45 -44 -106 -146 23 114 -42 79 -200 -62 -91 -36 -16
6946 -16 -256 159 88 66 118 -113 132 41 -132 121 101 15 108 10 98 -82 181 -205 -33 124 18 -222 120
6969 120 -25 193 90 -152 -14 39 87 -73 169 100 -137 -202 -20 123 -118 -121 148 -78 155 49 -16 -137
6991 -137 -33 168 86 164 77 -180 -10 -8 -159 -120 175 38 -109 240 -88 -196 171 101 87 67 -94 125 125 34
7015 34 136 -169 -85 -114 -65 118 57 112 -178 -105 -106 1 -10 60 208 381 98 77 -160 104 -203 -2 -83 -32 -41
7040 -41 92 180 -146 -98 -7 -187 -25 -35 -129 -60 136 -80 210 36 -56 -7 396 -74 -62 40 -254 149 39
7063 39 -102 -115 -332 4 -185 42 -101 -21 -65 8 16 146 46 -99 173 64 20 90 137 -110 143 60 -13 -65
7087 -65 -160 -46 88 -237 -81 5 46 25 27 105 -138 -36 129 -335 48 125 -61 28 -67 157 162 50 134 -122 -49
7112 -49 -399 72 74 -97 24 92 9 34 28 -125 -26 -58 -103 -38 101 98 -222 17 76 127 78 -78 13 20 -106 -100 29
7139 29 -119 53 39 130 210 79 200 -84 -62 -139 -14 230 49 -96 21 -243 9 -141 148 88 -130 -93 -85
7162 -85 -154 -219 11 -57 5 -177 108 -67 79 145 -406 -4 54 46 -110 -195 213 -13 313 23 112 -44 -140 75
7186 75 7 145 -139 72 149 -220 -80 -257 3 49 371 -210 162 -99 -3 -79 31 -169 98 115 98 31 -81
7209 -81 -134 101 -54 105 143 -18 -104 73 -190 -116 -118 -205 -163 -16 130 -42 75 -59 -2 -220 -3 369 137
7232 137 -226 27 -75 241 153 197 58 -135 46 49 -56 -74 -112 -24 111 -316 105 -38 310 -90 318 -74
7254 -74 -76 14 -86 6 9 -53 -308 138 227 -131 9 156 -9 -8 28 21 -54 -195 18 43 230 -43 171 82 209 -18
7280 -18 257 77 -342 -198 -46 -21 -245 -272 167 -5 131 12 -178 165 -70 2 -82 123 186 -60 13 -213
7302 -213 -30 278 -309 -13 70 -123 -59 -75 83 93 -21 -247 79 133 133 -200 -47 -45 160 113 88 115 -114 33
7326 33 210 80 -30 86 108 -105 149 -72 -162 117 -83 15 -122 -53 -250 -26 -93 -167 -182 106 138 -127 -1
7349 -1 72 115 109 319 -78 65 -132 -118 89 263 -151 4 153 8 -203 1 48 138 -62 34 6 97 -210 41
7373 41 66 -91 -124 141 28 71 64 -75 -378 111 190 -322 -16 -13 9 68 63 -116 -2 38 -51 -76 127 -90 93
7398 93 -116 53 134 192 109 -71 233 -12 -240 -166 125 -56 22 -67 58 338 3 70 -96 122 54 -258 85
7421 85 -5 -100 32 -120 62 138 -107 -162 -69 -1 -92 111 118 -73 135 -105 30 -138 -298 6 96 91 94 240 15
7446 15 115 9 102 -64 -92 -124 -37 141 115 128 69 25 244 -78 142 63 -63 26 167 -318 91 194 -58 -22
7470 -22 75 -46 12 96 -113 114 287 -91 145 -165 6 -7 102 2 -109 150 -114 -203 86 271 64 333
7492 333 -109 205 5 -35 204 -68 -156 -212 34 135 207 121 25 -62 -237 27 40 -200 -91 52 158 -10 75
7515 75 -9 -76 -152 -102 58 147 39 48 -33 26 37 -23 -97 -161 88 -42 106 113 -172 -292 -91 -181 -247 -293 -17 -54 -27
7542 -27 166 -41 9 -199 152 -229 -84 -144 147 52 -29 133 -60 101 -209 -79 -117 -82 -60 26 391 3 -25
7565 -25 242 62 71 -112 177 -105 125 -76 76 -40 35 -16 182 12 -223 -25 -147 -263 -61 103 275 -5
7587 -5 -15 10 165 41 -124 -66 -240 -137 -219 47 -112 -89 184 23 70 72 62 -40 137 -235 -240 114 -244 -135
7611 -135 40 -42 -2 95 -20 -91 -50 39 -228 66 -176 57 -11 -140 242 -91 -71 -124 66 -170 -28 -167 -129
7634 -129 -32 -192 -111 -29 202 210 -302 57 53 116 -190 -111 8 73 -18 -141 -127 -82 -208 143 -124 85 -100 -195 135
7659 135 -19 191 15 239 -88 -132 -36 -19 -260 -34 -1 78 -27 107 -51 60 -167 -85 -58 -79 -355 -44 -98
7682 -98 49 59 -20 56 53 18 -11 37 -269 80 118 68 190 -207 65 3 246 -95 -173 25 -103 -49 -58 85 192
7707 192 -50 -88 183 33 259 169 81 -44 14 -48 119 20 320 36 8 83 -11 -19 -101 142 -40 -22 -109 -154 79
7732 79 -48 140 -96 -15 -171 149 316 -40 143 -80 -56 -136 258 -52 -307 28 -131 152 -184 -98 -276 -57
7754 -57 -53 -127 -38 68 29 255 9 48 120 318 -184 179 -55 -10 -35 -7 32 -40 48 -290 75 -43 79 393 193
7779 193 -24 -121 -179 -55 221 125 -145 -186 40 -6 -138 -30 2 -82 -168 96 -30 100 78 102 -210 -17 48 123
7803 123 -137 -83 -165 167 9 -64 -134 -112 78 60 -110 -17 -31 -2 -77 -74 -41 -37 -104 210 29 -131 384 -103 -6 -121
7829 -121 -70 -126 62 13 126 246 65 123 94 72 31 37 42 -91 -10 -149 264 81 359 -164 -226 82 -86 -64 83
7854 83 30 -24 -13 -5 -16 -90 -164 133 29 -25 -142 12 51 -82 -226 101 57 210 58 25 189 119 232 -38 258
7879 258 -255 13 134 -70 190 -44 174 15 -108 14 -29 214 149 -74 193 -113 -367 -106 134 -75 32
7900 32 -17 47 -318 11 -151 95 -66 324 96 -11 131 252 116 269 -21 -88 -79 54 -12 -104 19 4 -67
7923 -67 -244 -186 -18 183 -178 58 -67 71 54 209 -190 45 178 109 52 36 -75 5 43 70 -161 4 15
7946 15 221 -28 -25 -95 68 66 13 -137 168 6 56 -21 45 287 55 328 82 25 -47 96 144 62 -50 -17 -36
7971 -36 -41 -112 64 -60 155 -177 -19 -5 195 -91 -61 171 19 33 33 84 -80 41 132 -93 240 -224 234 88
7995 88 -36 -52 37 16 171 -180 37 -105 36 283 109 16 204 -16 91 -105 -42 -5 65 36 -41 48 -189 -241
8019 -241 22 96 -136 -229 -2 24 -24 -88 21 -239 -35 68 -242 -211 20 -130 5 281 20 -119 201 -208
8041 -208 -47 8 109 -9 20 -13 -85 144 20 164 319 276 111 68 179 -96 66 -98 69 -93 36 -372
8063 -372 59 55 181 -13 -152 157 -183 -6 193 -90 67 -141 -102 51 -28 164 -171 -76 -158 -51 -65 -101 137
8086 137 -72 21 -78 -141 -78 -151 -87 -153 19 -10 -242 -24 153 -59 186 -44 -7 -39 10 -49 -132 81 102 -133 58
8111 58 36 99 68 76 -239 -184 8 -189 -153 8 -84 -160 31 93 -205 21 -196 -104 31 59 52 -46 -249 -46 58
8136 58 202 45 -245 219 -31 84 -139 32 -115 9 194 -170 157 -1 330 -110 231 -26 87 200
8156 200 107 261 116 179 27 -51 103 38 -67 134 130 -93 73 -17 97 -78 -284 -103 -119 237 -171 135 23
8179 23 -296 -124 198 -132 -187 -53 47 -25 157 -128 -165 102
8191A02
$$ Imaginary data points
##PAGE= N=2
##DATA TABLE= (X++(I..I)), XYDATA
0 0 0 0 0 0 0 0 0 0 0 0 0 0 0 -8 8 -8 8 -8 8 -16 16 -17 24 -28 32 -39 43 -48 56 -65 75 -86 96 -108 124 -138
36 -138 155 -173 194 -215 238 -267 292 -325 361 -396 437 -483 531 -584 645 -710 784 -867 959
55 959 -1063 1181 -1320 1483 -1676 1912 -2204 2580 -3085 3793 -4867 6669 -10261 20114 -103641
70 -103641 -305513 20384 231929 62515 -99948 29822 128143 33259 -32043 37259 70687
81 70687 75812 84503 17127 -94001 -59363 85911 88547 -62514 -89803 4348 4236 -63285 -42575
94 -42575 15981 7947 -19437 -3516 -12518 -23740 52746 101824 8154 -59934 30674 126085 69954
107 69954 -18562 -4889 24237 13692 29721 39106 -9532 -45727 -28278 -27877 -57159 -16693 55211
120 55211 -9627 -131118 -92082 28968 31464 -25555 6348 31425 -60281 -83611 58596 119441
132 119441 1132 -59044 25436 51778 -39095 -44061 63707 70684 -35149 -76810 -28937 6504
144 6504 3246 -3769 -20614 -45416 -24661 7570 -20188 -36684 20875 52680 -8698 -54613 6087
157 6087 68375 34466 -4138 13883 20430 5299 16172 36833 19574 -10502 -3440 3154 -13268
170 -13268 2644 30790 4609 -43568 -39249 7330 27134 13939 6938 -12865 -36340 -5948
182 -5948 44071 39628 4606 940 7645 -21678 -23046 48376 72322 -10619 -70268 -25882 27431
195 27431 8144 -17825 4368 3140 -41631 -49055 -6770 25136 17057 -10894 -29577 -28990 1844
208 1844 32826 15640 -12689 -299 14611 -3736 -17290 11494 35437 3566 -29269 -14157
220 -14157 2110 -2391 -1078 4265 -8863 -29191 -17565 8546 4352 -5205 3200 1954 -12286
233 -12286 -10265 15346 32422 19231 753 -8679 -9881 15072 41625 27118 -10523 -23135 -4043
246 -4043 6942 1785 13306 17326 -16927 -44326 -23056 17366 25437 2901 -13097 -22013 -24074
259 -24074 1879 32326 26890 -1406 -18086 -9588 4919 16761 27324 15913 -10633 -16518 -5412
272 -5412 4794 11556 11932 -401 -25359 -29331 980 15626 -1433 -14077 -9340 -5452 -11843 -7336
286 -7336 13026 14289 -2834 -8540 -4475 3534 12439 16349 10588 -3401 -7179 1979 4428 7149
300 7149 14455 6514 -13173 -20952 -5391 12730 10146 378 -7437 -19914 -19369 1599 19865 14827
314 14827 -8079 -19195 -12270 -2310 13800 23969 9967 -13182 -21539 -5896 15137 20753 13170
327 13170 -5642 -23632 -16184 7467 18108 10122 -6159 -16161 -16937 -9196 9727 16775 827
340 827 -15806 -17507 -5667 7309 11288 9005 -2558 -13757 -7078 6598 12839 11046 3586 -2782
354 -2782 -6119 -2492 10055 13480 6182 212 -4918 -6311 -1000 7010 11733 4006 -7460 -8931 -6478
369 -6478 837 10554 10670 1300 -10587 -11948 587 10201 12946 9757 -3011 -12019 -8558 4888
383 4888 18887 15263 -1579 -15519 -17263 -1298 15658 12883 -3824 -17915 -17732 -7850 173 7630
397 7630 6746 -9512 -22847 -18497 1049 17278 10767 -7088 -16499 -12106 4000 14965 11774 2125
411 2125 -8133 -9462 -1718 5695 10444 6696 -5663 -12917 -10984 -1574 7782 6230 -2996 -11505 -11943
426 -11943 -2074 6316 7473 6001 73 -3153 719 6077 11311 13189 11925 8588 -1050 -3865 7678
441 7678 19203 16798 180 -12376 -7083 2039 5617 5453 -1237 -8706 -12572 -10827 -2804 4442 9181
456 9181 4789 -13628 -21549 -1141 24579 23459 -2985 -18005 -3633 11958 11468 5113 4235 2490
470 2490 -10015 -17550 -5202 9895 8329 -9606 -26616 -24313 -6275 6905 3593 -13190 -22204
483 -22204 -12081 732 4606 1341 1327 5698 667 -6903 2197 17984 19527 4511 -6822 -1040
497 -1040 5738 6875 7139 3731 -4095 -9521 -7449 3 41 -3603 150 -254 -9580 -11899 884 14718
513 14718 11952 416 -1973 83 4787 16555 22290 12733 -3625 -4712 10168 14796 5120 3155
527 3155 6697 -1411 -18139 -15887 10122 18626 -6579 -28528 -21298 938 9659 872 -6916 -8360
541 -8360 -7549 -2353 2558 6294 8436 5037 -3055 -10528 -5753 14428 20736 -466 -21174 -14659 6298
556 6298 9350 -5827 -10694 -5501 -6148 -11200 -10118 53 5587 -1642 -9005 -9760 -3646 7239 12004
571 12004 5434 -4238 -4100 7195 10054 2619 3532 9821 6106 -6050 -8802 5059 13479 3687 -6234
586 -6234 -5958 -2636 -2308 603 9635 8530 -6729 -12081 348 12671 11620 3321 1274 175 -3508
601 -3508 763 11305 13712 3487 -9666 -10907 -1667 6560 9356 861 -13329 -15893 -4429 5986
615 5986 4635 -3506 -4911 -5140 -7405 -2541 7408 10525 2866 -8362 -8188 1661 8576 8066 802 -6963
631 -6963 -7600 -3073 1653 715 -3573 -4281 -5603 -9039 -8331 -2545 4152 2558 -6679 -8501 -1236 5146
647 5146 5670 3310 4860 6097 -326 -1601 6945 13448 8895 -1039 -4247 -383 1049 2143 4398
662 4398 1453 -6286 -12167 -8059 2540 5913 1463 -5902 -10691 -5705 4520 9612 7323 1432 -1719
677 -1719 -945 1896 10215 14745 7129 -3054 -6448 -767 7437 8093 2553 -6065 -12613 -8751 -509
692 -509 2030 -1756 -7963 -9620 -7899 -5533 657 4609 1767 -3458 -5873 -926 7116 10114 6484
707 6484 711 -870 3515 4241 3076 4245 4055 -175 -6112 -6366 -586 1832 -1291 -3987 -6697 -7968
723 -7968 -5786 -1335 3258 1600 -3227 -3963 -2626 1302 7054 8569 5057 -694 -2298 1833 6873
738 6873 10023 6899 -2738 -7296 -3088 2930 5012 802 -3906 -7201 -9565 -5071 2984 4765 -1241
753 -1241 -8964 -8789 -1240 4906 6748 3822 -2779 -3755 -438 4811 8307 6195 1152 -3286 -4117 1760
769 1760 5749 3665 -561 -4780 -5813 -3292 -248 2604 428 -4214 -4901 -2645 -292 2159 3134 2776
785 2776 237 -2491 573 4063 5283 4935 2185 -401 -868 -295 2911 4017 2088 -1185 -5342 -5299
801 -5299 -753 2626 2702 -1948 -5896 -5197 -2470 2092 5566 2787 -2975 -5762 -2665 4756 6724 3584
817 3584 -714 -4823 -4362 715 4357 4978 -636 -6947 -7334 -3669 2429 3776 -1309 -6413 -7283 -4025
833 -4025 1419 3234 2112 -836 -4524 -2691 2073 5779 5618 1654 -1315 -656 846 3914 5047 2693
849 2693 -363 -2653 -2191 687 1618 1503 -571 -3037 -3394 -2028 318 2293 1716 -12 -837 -1998 740
866 740 3951 5478 4533 664 -1172 602 3366 6093 4866 408 -2329 -2889 -1003 2072 2697 464
882 464 -4364 -8002 -5003 131 2401 257 -5026 -7387 -4747 -47 3788 3001 -1001 -3405 -3379 200
898 200 4157 5044 3160 -2150 -5022 -1539 2835 4233 1426 -3667 -5496 -4199 -979 1892 51 -3108
914 -3108 -4910 -4101 -1714 221 1238 1584 -505 -2132 -702 2140 5005 5185 2049 384 982 2946
930 2946 4542 3283 2954 2225 -80 -1406 -510 1807 3299 1477 -2206 -3901 -3446 1091 3989 1242
946 1242 -2385 -2754 -887 894 1172 3583 4330 -451 -3761 -1356 4098 6435 2617 -1799 -3747 -3348
962 -3348 1292 3918 1454 -3573 -5936 -4139 -1414 -587 725 -489 -4702 -6445 -3685 1834 3693
977 3693 85 -3327 -3353 -2156 1628 3217 2330 88 -2645 -2395 816 2454 1699 -450 -1524 -1281 -2298
994 -2298 -1036 1888 1938 -833 -2876 -2089 770 1278 1761 2507 234 -906 378 2844 3127 1902 2842
1011 2842 3038 -1211 -2561 2659 6232 2982 -3139 -3020 86 433 863 1993 452 -2906 -3322 -1316
1027 -1316 2188 2266 1982 109 -3372 -3041 2237 5943 3478 -2211 -3599 -610 1239 2100 1760 -285
1043 -285 -2755 -4403 -3238 526 1614 -533 -4286 -5600 -2533 -121 895 720 -1593 -3247 -2207
1058 -2207 645 3340 2028 -38 167 50 -237 1576 3243 2260 -871 -1736 282 -162 -1043 1123 990
1075 990 -2356 -4274 -1808 1254 -120 -1038 543 81 -1736 -1014 2022 4258 2931 681 499 234
1091 234 1916 5063 4622 1329 -1857 -1051 1583 1378 1397 1053 -1812 -3996 -3506 -216 2022 539 -3135
1108 -3135 -4691 -3724 627 2833 1356 -677 -1871 -1342 708 2707 3808 2209 -1064 -1390 206 1657
1124 1657 2866 1406 -1084 -2983 -2904 399 1011 -1064 -1693 -2537 -3382 -2735 -667 1097 -371 -2293 -1025
1141 -1025 -430 213 1746 2537 1993 197 -159 1528 1926 2199 2443 1389 -943 -1451 27 1611 760
1158 760 -626 -1177 -2387 -3117 -617 1290 844 -1341 -2779 -1777 -427 1905 2881 917 -1291 -1185
1174 -1185 227 2668 3180 2256 45 -2319 -1509 1288 2790 1599 -1112 -2838 -2254 -1414 1390 1597
1190 1597 -1090 -2691 -2827 -1354 851 1797 1400 -822 -2244 -398 1639 2128 1929 716 -564 -778
1206 -778 262 1973 1802 -22 -700 -1069 -953 -117 698 877 -1106 -2115 -1067 -669 -192 987 890 212
1224 212 -974 -762 578 1671 1758 1516 13 -1042 -204 932 2097 1012 -701 -1708 -1888 -773 1081
1241 1081 1048 -472 -2513 -2947 -1381 369 1387 884 -1773 -2521 -846 1091 2502 1690 75 -1213
1257 -1213 -1293 944 2839 2054 389 -1398 -1997 -383 875 1535 -81 -2615 -2413 -1089 142 625 223
1274 223 -700 -1774 -1459 641 1839 1526 1189 476 148 860 1976 2555 1879 597 462 312 14 955
1292 955 899 260 -1126 -1872 -1420 -867 -667 237 -830 -2016 -2344 -963 366 1166 572 62 -1025 -1010 1355
1311 1355 2776 2390 830 -489 -681 76 1534 1968 497 -1774 -2802 -2049 -36 543 -412 -2397 -3785
1328 -3785 -2883 -926 228 232 -924 -1932 -1777 -241 2153 2806 1242 -195 -148 933 2016 2616 1993
1345 1993 619 -935 -106 744 838 730 -200 -1448 -1852 -1153 276 327 -719 -661 -833 -842 124 887 1540 1659
1365 1659 549 584 976 1282 2542 2469 1331 88 -316 297 782 967 346 -936 -1823 -1480 -915 362
1383 362 79 -1620 -2332 -2560 -886 896 472 11 -1245 -1336 -383 1200 2047 1329 -653 -1581 -250 279
1401 279 1252 982 -282 -2021 -2442 -848 526 291 -860 -1892 -2391 -1036 100 711 821 -726 -767
1418 -767 137 938 1596 1486 995 190 -123 595 1668 1219 568 -393 -536 -315 -55 157 399 -217 -235 -1045
1438 -1045 -861 585 964 972 716 -282 -139 687 1563 2470 1182 224 -179 48 647 1084 894 -122 -1752
1457 -1752 -2016 -602 250 31 -905 -2203 -2168 -1459 97 974 107 -1121 -1341 -473 1131 1913 1305 774
1475 774 -281 -420 498 1513 1708 -162 -1649 -1397 -1002 -297 38 -1176 -2005 -2232 -2026 -459 -57 -742
1493 -742 -783 -793 -571 38 1059 1993 1473 815 1354 1431 1662 2131 1964 1403 420 -331 201 181 265 -183 -829
1514 -829 -1690 -1860 -1510 -1 -162 -655 -1174 -1553 -541 430 998 1662 680 -30 744 1128 2832 2476 987
1533 987 45 6 200 686 1106 186 -1343 -2471 -1702 -569 -947 -1020 -1728 -2466 -2313 -1188 101 764 -802
1552 -802 -952 61 627 1302 1887 1706 659 -330 1096 1640 1209 775 178 -592 -950 -540 106 -420 -1121
1571 -1121 -1380 -1439 -1412 -811 -615 178 -281 -812 79 411 663 1407 1496 1054 845 585 1112 1619 1487 1040 -241
1592 -241 -833 -83 42 140 42 -1017 -1512 -1469 -527 324 -229 -669 -941 -925 -290 679 1425 763 -431 -109 534
1613 534 1430 1491 1176 416 -547 -912 405 1097 62 -705 -1125 -1042 -860 -229 351 -318 -1274 -868 -254 -27
1633 -27 894 661 439 169 -311 990 947 715 805 184 -323 -134 315 333 -144 -544 -552 -711 -1203 -51 66
1654 66 -221 -844 -731 -517 -64 526 1093 498 -444 46 373 900 769 666 408 -642 -737 345 863 355
1674 355 -829 -1112 -1073 -1139 -47 502 -712 -1612 -1290 -634 413 515 606 -42 -762 104 1354 1437 1047 591
1694 591 80 93 355 1350 1113 -81 -483 -515 -478 -136 0 -352 -828 -1498 -565 -327 -260 205 74 -489 -132
1715 -132 154 822 759 737 949 601 87 373 910 1016 561 60 39 -529 -417 186 -116 -693 -1245 -1228 -710
1736 -710 -711 -268 -38 -728 -1523 -528 -62 574 475 -95 63 -375 242 1199 1152 461 -103 -538 75 353 401 281
1758 281 -661 -1027 -629 -113 92 94 -757 -784 -822 -149 306 199 188 -89 -359 178 716 1071 859 191 181 531
1780 531 201 819 412 422 -38 -156 -179 139 -47 -73 -156 -631 -723 -504 -27 89 207 -279 -155 -247 327 269
1802 269 608 141 -236 -59 -20 302 694 380 -288 -362 -578 205 472 -95 -547 -1024 -976 -280 -110 -319 -495
1823 -495 -760 -709 -244 80 449 153 -228 -117 1 489 590 461 36 -336 -258 -32 393 207 -148 -321 -251
1844 -251 -64 81 385 87 -452 -569 -224 282 486 500 383 164 270 466 514 535 711 427 296 221 191 339
1866 339 283 310 -7 -554 -314 -321 -259 -64 -489 -673 -645 -587 413 156 336 12 -630 -15 425 891 906 230
1888 230 -126 281 609 727 314 -300 -617 -888 -599 46 -257 -800 -924 -1387 -783 -333 159 300 -549 -808
1908 -808 -143 243 780 767 293 713 583 532 993 1064 1236 374 24 165 346 170 -254 -446 -563 -722 -786
1929 -786 -476 -612 -516 -734 -493 -288 109 177 775 809 506 559 686 1114 1177 1120 1136 404 -136 465 694 224
1951 224 -209 -794 -878 -859 -874 -339 -600 -1071 -1106 -1351 -653 23 -227 -247 -229 -72 327 840 932 1052 298 674
1973 674 605 837 1123 534 -78 -179 -416 -121 -292 -581 -1188 -1042 -794 -729 -899 -368 -213 -602 -208 -105 331
1994 331 685 577 509 401 358 486 882 839 776 484 411 426 -251 231 327 -265 -495 -810 -788 -632 -483 -253 -127
2017 -127 -530 -307 -228 224 524 92 132 292 583 944 487 666 336 -31 -58 169 214 130 -404 -760 -654 -587
2039 -587 -436 -216 -586 -780 -651 -78 107 202 271 4 32 581 370 660 496 354 -24 4 -100 208 458
2060 458 -286 -446 -466 -452 -390 -665 -379 -507 -523 -546 -312 -121 226 276 223 253 263 557 569 546 882 339 -113 291
2084 291 129 127 7 -626 -204 -635 -832 -447 -375 -322 -469 -490 -362 -121 440 377 198 -3 241 796 853 640
2106 640 684 401 10 215 454 261 -35 -269 -409 -544 -496 -425 -371 -856 -669 -813 -497 -303 153 -104 -189 64
2128 64 261 562 400 678 734 735 430 293 365 353 107 289 -361 -403 -147 -141 -369 -621 -885 -609 -746 -588 19
2151 19 -271 -425 -71 65 422 535 608 693 320 193 701 765 671 507 -55 6 35 -26 -23 -176 -485 -679 -730 -530
2175 -530 -334 -458 -583 -769 -544 -304 -43 314 219 224 257 143 714 633 688 216 326 155 390 597 299 376
2197 376 -83 -252 -242 -374 -279 106 -603 -357 -256 -261 -73 -20 290 192 258 350 268 583 802 519 542 125 167 622
2221 622 240 127 -17 -387 -291 -188 -204 -288 -394 -672 -296 -455 -440 -52 -470 -452 -282 93 360 237 401 448
2243 448 -246 179 211 335 229 -127 -383 -49 -225 -107 -73 -289 -427 -427 -421 -123 -430 -338 45 -261 104 -47
2265 -47 294 369 213 313 194 148 316 409 530 234 -214 -4 -25 -22 -127 202 -230 -480 -584 -417 -373 151 -16
2288 -16 -104 -344 88 307 237 210 258 254 162 233 398 722 -70 -32 -64 106 49 -92 -21 -475 -567 -254 -259 -152 -353
2313 -353 -613 -227 -255 -72 -21 147 -111 -268 66 372 578 265 651 113 154 102 304 325 -58 183 -252 -182
2335 -182 -147 -311 -466 -309 -242 -422 -310 -57 -62 -205 85 383 -224 -10 325 416 330 594 429 260 289 456
2357 456 656 278 -11 -40 -21 -59 37 -58 -560 -649 -849 -253 -12 -475 -289 -159 7 -235 22 103 165 138 12
2380 12 242 307 420 207 35 28 75 362 92 267 -282 -394 -175 -222 -41 -222 -310 -261 -357 -213 -139 -150 -27 -43
2404 -43 23 63 180 169 326 595 269 245 224 238 367 423 298 -54 -253 -253 4 22 173 -108 -280 -149 -275 -67
2428 -67 27 -103 -148 61 -81 154 364 305 275 28 86 160 565 335 77 -324 14 17 114 100 -71 -30 -307 25
2452 25 1 -134 -10 -201 -342 218 19 164 200 86 -211 69 153 342 141 21 207 -120 -177 168 -36 158
2474 158 -237 -100 -222 -318 -267 -181 -102 -52 -160 -38 165 237 305 422 16 -76 -135 160 336 386 189 -55 -222
2497 -222 -40 334 -61 -200 -375 -436 -288 -148 -9 -125 -208 -331 -282 47 336 208 182 198 -136 91 349 211
2519 211 -16 -20 14 -26 106 79 -131 -484 -347 -497 -247 -259 -327 -195 -356 -368 -51 -65 -72 112 212 272 144 163
2543 163 370 320 424 168 -7 207 410 437 269 -194 -149 -193 -441 43 -508 -116 -249 -510 -352 -75 128
2564 128 -156 -115 -144 -36 258 475 434 161 -92 342 67 199 579 277 -18 -197 -100 -187 -106 -93 -452 -460 -614
2587 -614 -348 -325 -95 -344 -398 -223 5 122 178 203 -3 167 158 406 539 306 365 18 314 77 69 380 -45
2610 -45 -228 -4 -313 -242 -372 -374 -150 -590 -183 -169 -115 74 479 258 -21 32 285 340 608 403 279 -188 23
2633 23 451 377 60 -95 -297 -441 -167 34 111 -413 -481 -298 -341 -46 -5 207 -284 -227 183 178 434 367 253
2656 253 129 -33 -21 179 321 28 -248 -211 -511 162 229 74 -258 -361 -171 -51 -48 -155 86 33 57 91 294
2679 294 172 154 292 0 254 306 89 213 311 -81 -206 -239 -109 -162 -326 103 -54 -450 -167 102 508 -89
2701 -89 0 -235 -30 -18 254 383 209 -4 -243 182 479 46 144 -121 -56 16 111 151 -201 -258 -792 -296 -244
2724 -244 -155 -239 -332 -232 -81 217 141 126 71 -33 -81 128 433 636 358 21 -157 -149 107 -56 -223 -103 -328
2747 -328 -166 -174 -250 28 -243 -310 -255 -416 -75 308 215 -110 165 216 281 466 617 415 507 -46 244 -14 179
2770 179 260 54 -290 -370 -270 -249 -30 165 -146 -480 -555 34 46 229 228 10 56 100 382 358 239 107 -286
2793 -286 309 350 67 238 -114 -153 -266 -140 71 74 -406 -675 -404 -387 -80 68 -220 -419 -176 -59 173 55
2815 55 -17 53 46 317 365 197 574 211 255 78 -313 -174 -18 158 -24 -123 -132 -250 -143 122 -121 -348 -42
2838 -42 -335 9 40 253 108 -169 -197 37 181 345 612 -1 -281 -179 172 -115 107 -25 -73 -254 -266 33
2860 33 164 -244 -269 -310 -89 394 141 280 -30 14 27 348 44 226 -46 -113 44 36 175 -27 -57 20 -458
2883 -458 -58 -32 34 -177 -274 -49 52 -92 314 18 16 160 -181 -114 259 115 576 250 162 59 -310 21
2905 21 -144 199 322 -161 -192 -235 7 121 -7 -271 -78 15 82 92 250 -70 43 -287 141 572 252 -44
2927 -44 -244 -190 274 362 236 173 -157 -183 -248 -236 95 -142 -306 -363 -492 -63 89 54 -368 -180 -100 -196 214 241
2951 241 75 133 -286 283 202 159 41 212 -56 30 -83 -131 171 -78 -246 -31 -432 -314 -6 -363 -29 -285
2973 -285 -187 -116 30 89 109 350 49 147 76 392 462 56 183 -108 -20 134 -27 225 -61 -306 -176 -215 -165
2996 -165 165 -99 -384 -280 -216 275 306 -36 -113 -51 259 390 161 110 66 -12 130 118 386 269 142 -32 7
3019 7 -5 12 -103 -218 -218 -338 -48 -52 141 -73 165 -155 -296 -245 95 432 276 -117 80 453 103 580 100
3042 100 -39 52 -412 41 -9 -223 305 45 -381 -282 -308 242 15 -173 93 -353 207 199 383 312 59 -21 -30
3065 -30 224 197 81 178 -187 -270 198 377 100 -229 -232 -274 -209 -161 237 55 -249 -503 -50 153 203 53 118 127
3089 127 -130 112 246 153 -91 229 -201 -28 169 312 -119 -218 -165 -210 46 63 -54 34 -96 -258 21 190
3111 190 -37 131 -158 9 163 -139 396 195 165 115 -80 -66 166 -21 295 -43 -300 -448 -540 -82 15 -281
3133 -281 -172 3 -406 -51 102 73 -51 -433 -1 331 410 229 262 -42 -33 210 639 276 176 -127 -425 25
3155 25 15 55 146 -89 -539 -420 -95 101 -80 -317 -358 -345 -47 297 345 144 401 -170 227 219 -76 582 72
3178 72 170 10 13 85 214 -71 -179 -32 -333 0 -195 6 -258 -351 -111 -191 77 -167 92 -114 148 -128
3200 -128 -155 306 568 411 248 -290 76 329 131 25 -198 -357 -428 -77 237 47 -396 -409 -447 -228 162
3221 162 -50 37 -398 -284 -166 185 356 -183 197 -16 -132 94 451 240 184 106 -133 -18 49 26 89 -241
3243 -241 -230 -150 -145 32 -95 -29 -111 -76 -139 278 157 184 48 11 -42 -1 323 493 296 -95 96 -129 -28 14
3267 14 41 -90 -161 -321 -112 -7 43 91 -178 -432 -213 318 486 236 -131 -259 -160 169 -137 276 87 -277
3289 -277 -90 12 23 309 -48 -134 -353 -137 28 -6 8 -333 -229 -229 225 173 18 -292 27 -49 252 90 191
3312 191 33 -196 268 -92 133 86 9 -73 -290 -72 -44 -49 81 3 48 -49 -41 -206 86 147 83 190 85 184 255
3337 255 340 417 189 190 10 199 -27 364 -213 -107 -205 -130 -64 -27 162 -363 -213 -141 171 260 -89 -123 -29 -290
3361 -290 171 361 373 291 158 -95 158 264 102 -65 -150 -294 -117 150 25 323 -506 -433 -223 -299 126 -30
3383 -30 129 -34 -221 -27 200 206 232 44 169 232 304 279 448 250 442 57 139 -123 173 232 198 -240 -31
3406 -31 -500 -250 -33 -63 -226 -297 -214 -253 77 144 202 -261 -118 -317 66 152 72 70 -58 -41 126 378 40 -129
3430 -129 -418 -409 135 71 1 -342 -243 -319 -40 347 -4 239 -212 -132 271 236 280 -126 64 183 120 420 166
3453 166 57 237 -58 49 -197 -186 -23 -180 -106 -200 -453 -123 -181 133 -254 -332 -61 194 282 -28 -67 262
3475 262 230 72 198 45 71 180 90 337 38 -177 153 231 -290 -272 -254 -501 20 281 -75 -338 -402 -147
3497 -147 211 261 149 -111 -245 -51 198 312 61 12 -135 -132 -121 90 47 43 -264 -210 -54 230 19 -33 3 -205
3521 -205 -173 -93 114 72 -24 -108 6 72 88 264 158 26 182 120 64 -225 -492 -57 25 -68 98 -110 -63 -21
3545 -21 -81 -151 -204 -21 -195 36 274 -99 7 -86 177 52 260 88 -41 -224 -40 274 80 88 -258 -208 -424
3568 -424 -238 18 -108 -258 -199 -88 6 79 35 159 -319 79 239 -28 197 148 -6 -173 131 211 54 218
3590 218 -201 -156 36 -71 -19 -176 -210 -147 -192 -49 161 42 -151 1 16 -2 -74 20 260 84 76 100 133 107 239
3615 239 212 126 -167 -183 -57 -72 191 -159 -164 -478 -174 -137 -61 36 -147 -294 -311 312 227 229 98 -261 -127 257
3639 257 64 452 190 -49 -33 -198 145 273 71 -57 -276 -400 275 76 -146 -360 -277 -263 -134 166 33
3660 33 203 -169 -244 452 236 157 284 62 175 150 134 7 189 -91 -121 -30 -236 108 258 237 -50 10 -147
3683 -147 15 -88 -13 416 142 195 8 -95 34 229 239 109 -87 168 167 -54 -29 -139 -94 -174 -234 -254 30
3706 30 -549 -118 -340 -100 243 -31 44 -131 -269 23 -2 319 115 80 -35 -113 34 284 15 -119 -154 -249
3728 -249 5 284 66 -100 -299 -295 -217 174 -274 -165 -273 -98 9 79 49 187 20 -30 191 270 194 245 269
3751 269 360 74 -114 10 -73 -161 -268 32 -15 -227 -172 93 105 74 18 80 -89 -252 236 269 -6 -126 111
3774 111 535 325 126 265 -295 23 44 2 25 59 -182 -343 -295 332 190 40 -294 -364 -292 -25 67 -112 -69
3797 -69 -164 122 35 153 282 197 13 -140 153 367 227 49 16 -106 -139 132 36 1 -286 -119 -110 -426 -282
3820 -282 -187 -24 193 -252 -63 185 32 106 351 1 259 227 48 254 214 232 42 -144 -50 78 -153 -209
3842 -209 -450 -308 -396 -121 41 32 -23 -59 -239 -69 64 195 117 18 128 145 370 309 231 155 -122 -105 144 178
3866 178 -137 -54 -119 -24 222 -94 179 -64 -305 -219 -95 25 10 -24 -110 32 62 -48 442 116 97 71 116 -48
3890 -48 -74 437 -19 -46 -133 -163 16 -93 -37 36 -232 -239 -226 -188 -97 -204 -8 -304 7 -60 118 120 170 -17 65 98
3916 98 -51 463 342 -98 -376 -48 241 131 -55 -184 -243 -561 52 65 95 15 -227 -204 -32 76 330 155
3938 155 -106 -142 29 295 296 167 207 -228 72 219 106 -20 -153 -78 -101 -232 34 -138 -183 -112 34 106 -34
3961 -34 226 -26 75 135 324 61 137 -20 229 396 21 -179 -294 9 276 -161 -121 -262 -333 -157 -85 -96
3983 -96 35 -134 -151 -288 277 150 242 178 -82 230 51 373 423 77 45 67 169 195 162 -50 -209 -439 -180
4006 -180 -164 -220 11 -264 -355 -143 -353 147 -19 -161 29 56 201 241 348 339 240 53 -4 27 420 -134 79
4029 79 64 -58 -61 -39 -54 -298 -169 -196 -190 -278 -5 -255 10 -187 -202 41 -32 99 399 -31 -50 -14 -13 385 160
4054 160 20 101 -123 -195 78 -205 -202 -295 -519 -445 -105 -348 -149 -267 -161 -18 -145 277 -204 -121 72 18 365
4077 365 280 354 448 198 -36 -95 115 251 -159 -319 -57 -364 -349 -259 -377 -146 105 -437 341 -14 -152 -12
4099 -12 -314 138 8 220 67 186 342 555 -103 241 94 -41 267 -171 153 -202 76 -154 -69 -88 -135
4120 -135 -167 -146 -323 -206 315 8 -169 -33 -33 170 231 157 105 33 -39 163 300 -52 -129 -67 -204 42 -11 -52
4144 -52 -231 -87 -682 -280 -119 48 91 -53 -313 63 -29 182 133 217 268 182 134 207 88 113 125 62 -84 249
4168 249 -89 -102 -306 19 -136 -243 -452 -216 30 -262 -29 32 55 177 235 217 30 3 374 20 70 -91
4190 -91 254 125 229 -24 146 -158 -169 -88 -262 -172 -128 -12 -150 -173 -503 111 64 58 204 48 -148 76 186
4213 186 104 221 89 198 -172 1 171 -74 -22 -313 -222 -353 102 -18 -448 -161 -310 -448 -323 -104 -161
4234 -161 -237 -128 22 -56 452 256 244 198 126 307 389 661 418 -107 7 119 -162 56 -71 -143 -364 -300 -335
4257 -335 -234 -202 16 -43 81 -54 -105 -184 31 50 46 -8 115 346 232 285 44 82 50 -83 56 136 -8 -314
4281 -314 -223 -330 -391 -236 -223 -193 -454 -123 -75 110 79 287 108 97 335 213 426 111 -76 40 -166 92
4303 92 313 -92 -61 -73 -382 55 -83 -134 -85 -338 -239 -106 -137 65 -43 123 86 -113 79 102 -9 226 362
4326 362 86 220 52 74 148 106 210 -298 -46 -26 -145 179 -143 -228 -160 -112 -77 152 121 -62 -110 -66 42 184
4350 184 84 15 59 72 297 83 228 73 49 151 135 -70 30 -172 -190 -23 -36 195 200 -179 22 -221 -251
4373 -251 17 166 90 -236 -31 101 143 -44 92 101 11 283 -96 160 -238 -39 -2 -426 -180 -209 -141 132 57
4396 57 108 60 -41 176 -75 51 128 89 151 -63 -127 91 150 -214 -53 -57 2 2 63 13 -131 -223 -430 -163 -187 -186
4422 -186 -263 -65 -160 57 23 125 -16 73 26 264 343 253 155 98 62 238 120 91 -78 -216 -249 -348 -198 -46
4446 -46 -226 -137 -206 -225 -334 -111 -149 -71 0 -149 -17 147 30 179 260 234 317 401 96 287 288 170 62 -139
4470 -139 -179 -194 -274 -62 -129 -287 -243 -1 42 -178 -155 59 -25 -192 0 219 90 -7 -41 332 116 188 248 -41
4494 -41 -14 -133 62 95 158 -149 -489 -131 -262 -47 -60 -127 -388 -238 11 -15 180 -131 -67 120 26 189 232
4517 232 317 235 -12 -103 324 300 72 147 -55 36 99 -40 -127 -203 -278 -116 -135 -18 56 86 237 151 -128 115 27
4542 27 55 217 224 16 -204 201 -24 218 -66 64 -25 -75 20 -173 -64 -132 -56 -310 -287 -125 -34 99 50 50 149
4567 149 198 349 -109 313 54 62 23 98 -59 -89 -103 -222 60 12 134 -203 -163 -139 26 77 7 0 -82 -118 5
4592 5 109 45 90 244 35 -97 289 65 132 92 102 250 -101 -135 -94 -216 -57 -119 14 -257 -280 -153 17 222
4616 222 -86 -199 52 94 57 196 279 65 171 214 89 180 60 -263 -144 1 -19 5 -27 -376 -87 -235 -290
4639 -290 -129 121 -252 -330 -182 -101 75 197 62 -175 -46 399 296 438 173 161 224 286 210 7 212 160
4661 160 -147 -26 -75 -27 -150 -157 -69 201 -20 -99 -72 105 -173 92 26 230 216 94 460 97 146 302 126
4684 126 253 16 56 146 -238 21 -275 -19 -57 -130 -490 -386 -219 -94 15 -118 211 252 -13 378 -22 -120
4706 -120 -97 10 278 124 213 133 -37 84 -289 -121 103 86 -201 -321 -83 -176 -103 107 -228 -71 -137 -221 -27
4729 -27 48 -187 143 179 38 66 -45 175 28 26 -59 150 292 135 80 -375 -158 -129 -96 -12 -1 -248 -127 87
4753 87 -160 63 63 33 139 12 -65 108 284 70 216 120 -127 58 72 181 73 154 -229 -206 -160 -60 1 -20
4777 -20 -208 -140 -69 -39 67 -77 -65 186 -255 104 37 -56 5 -91 50 -106 412 156 148 -175 -36 110 -218 -159
4801 -159 -20 -177 -42 50 -144 -246 111 7 52 -181 98 315 141 43 100 284 -100 362 187 72 76 162
4823 162 64 -257 194 -117 -39 1 -245 -247 -204 -102 -1 79 248 -279 -54 187 130 249 333 302 262 61 167 56
4847 56 327 432 37 1 66 -29 -162 -120 -87 -402 -192 -118 -160 3 -296 84 -215 17 31 68 11 -141 196 383
4871 383 69 211 156 255 -57 290 213 125 18 110 -4 -51 129 -229 68 -110 -123 -201 -173 -45 -177 76 -165
4894 -165 -104 10 -57 119 198 149 185 332 281 460 60 12 406 -66 45 -289 -154 -189 -91 -175 -239 -14 -276 -310
4918 -310 46 78 -249 -37 128 272 112 226 -6 20 71 -194 164 122 230 86 40 114 -64 -119 211 -99
4940 -99 -98 -38 -128 -210 -127 -130 -146 -201 -93 -62 -161 -64 1 18 57 393 61 -78 12 -132 -54 110 60 -86 86 -3 -294
4967 -294 -75 -402 -79 104 -103 -202 30 90 -132 -16 89 -93 -93 -36 179 258 -297 45 -86 -5 -84 -141 -80
4990 -80 -367 107 -121 -121 -189 -52 -268 -223 -201 2 -16 -216 -28 12 260 -23 303 224 202 -86 264 150 168 131
5014 131 75 -78 -269 -90 36 96 -237 -102 -102 -79 191 -157 -224 -32 -26 229 245 -76 183 159 228 500 396 236
5038 236 134 260 -86 28 -64 52 -27 -327 -134 -85 -119 -169 -139 -349 -239 147 -93 -109 235 20 162 22
5060 22 260 111 220 56 22 230 -132 134 -150 -46 27 -12 -63 -296 -91 -90 88 -270 -213 -472 -372 -415 46
5083 46 -97 -68 -154 -66 237 -50 3 33 53 97 21 293 179 120 72 -146 -171 -69 -121 -119 49 -218 -42 -117 -176 120
5109 120 19 -94 37 19 -114 -193 -38 93 318 187 167 78 135 173 200 -24 115 -70 -160 -145 -206 -34 17 -251
5133 -251 56 165 62 -104 34 -178 -125 -240 -30 -128 70 214 -1 -96 137 189 48 -24 41 144 121 -124
5155 -124 109 28 -16 -29 -2 -102 -3 -41 -148 -158 -139 -320 -19 -55 162 -50 106 103 -48 60 21 -162 18 -131
5179 -131 145 84 212 77 81 113 -69 -88 -22 22 -259 -74 -88 -2 0 34 -40 -34 -65 67 84 78 79 120 -163 -145 -96 67
5207 67 22 4 49 -17 27 -173 -87 -236 -165 -80 -90 -53 142 131 91 -90 39 143 49 320 -82 20 237 3 314
5232 314 102 -188 326 -224 -184 -140 -71 -238 24 -13 -238 -22 -179 -196 -3 61 -147 -55 -24 133 49 -72 -23
5255 -23 26 260 231 221 126 212 -175 183 -86 52 -136 -207 94 -251 -54 -174 -225 -31 -84 14 -21 -74 126 26
5279 26 245 72 23 141 202 -49 255 -49 130 223 -191 -45 -279 95 -70 179 -74 -225 -36 -89 -64 -273
5301 -273 -231 -173 -35 -29 -147 55 208 191 7 103 -36 178 146 -55 -6 138 78 84 91 -28 -173 62 10 -219 -14
5326 -14 136 -397 4 -108 -88 -101 -239 75 184 24 -272 87 17 -1 19 61 -103 213 -29 -37 40 143 -116
5349 -116 -152 64 -445 86 -89 125 161 -195 -126 -269 -29 103 -53 37 -305 82 232 -32 -116 -251 -171 393
5371 393 -64 99 190 264 29 35 -85 42 170 -12 29 -187 -175 -39 -2 37 -331 30 -46 232 -188 8 17 88
5395 88 109 -122 130 -70 86 -61 -317 21 -142 -162 -221 -25 227 -50 -162 -72 173 212 -48 54 -83 33
5417 33 138 -141 99 98 79 228 80 -18 223 -38 -36 75 -111 -10 -42 -97 -119 0 -183 147 0 -214 -14
5440 -14 -141 87 93 -18 159 33 -245 143 -10 -20 67 153 -3 207 17 -27 -222 -44 -24 -111 -164 -284 -267 -153
5464 -153 7 117 -13 59 166 91 102 68 95 -135 73 65 221 8 118 99 57 -19 47 207 52 -121 -214 -178
5488 -178 -53 -100 -370 -7 -212 -206 -118 27 16 314 45 -101 -63 93 -73 219 455 122 284 338 138 -159
5510 -159 243 -42 84 93 37 -230 129 -92 18 -238 -2 7 -21 2 -429 55 -81 113 71 262 -35 267 -27
5533 -27 259 66 187 -102 151 -114 -150 73 108 98 -190 -85 -166 -196 -123 -98 -161 -269 -273 87 -157 316 -42 251
5557 251 127 17 -211 173 309 301 -22 -79 77 180 301 54 137 -115 -34 -222 208 72 -218 -38 -245 -71
5579 -71 -177 86 -24 131 -17 -10 -226 -153 176 195 -167 8 -81 38 -35 -330 89 -67 42 -36 -112 -55 192
5602 192 83 74 15 44 313 21 -5 -146 118 111 232 -63 61 -199 5 -239 -450 -20 -132 25 -6 -222 -8
5625 -8 117 -251 -85 -1 -45 161 -11 -127 -128 -165 143 137 233 -48 -12 -54 206 266 -67 -94 6 94 -207 -26 3
5650 3 -4 -3 98 -174 -48 -42 -285 230 -87 -36 -44 50 132 32 -99 93 -59 31 127 36 -165 -149 220 259 10 -162
5676 -162 -432 -299 -93 -103 -102 -274 -7 160 -33 -177 -10 -1 -13 65 192 -12 193 68 306 19 176 142 80
5699 80 226 160 107 -33 110 -108 39 -204 -267 -202 137 -276 -132 -25 -63 360 168 219 70 87 157 114 361
5722 361 303 13 238 41 145 16 79 -136 -17 6 -232 -93 81 -39 -41 -184 -85 -46 -41 59 -16 -46 -43 46 237
5747 237 47 -25 198 157 283 58 -8 -183 206 -42 8 142 -122 -225 53 271 -197 -268 -191 -219 -34 -24 -246
5770 -246 -67 -143 9 -80 -122 51 94 -222 95 8 -28 -35 34 101 31 72 -207 183 4 93 -30 116 -44 -50 -82
5795 -82 -29 -5 3 122 20 134 27 -43 -205 -171 62 49 -136 -39 -153 -26 223 116 35 -12 -37 -93 -368 -121
5819 -121 11 31 160 -48 -153 207 -89 136 -126 49 343 253 -209 -24 -1 48 36 -230 38 209 12 266
5841 266 -19 -51 25 -187 -127 141 -6 25 4 -87 139 41 241 196 -199 24 234 209 -22 103 329 -66 40
5864 40 278 -92 -139 -16 2 13 -26 -126 15 15 -26 -87 20 68 -176 82 207 72 -27 -82 181 68 197 162
5888 162 -99 163 208 -254 235 -140 -196 50 29 -88 -30 -366 -132 33 8 118 -201 -102 -142 98 211 215 -164
5911 -164 55 -131 165 -11 -68 155 88 420 -41 -168 119 -156 -15 -175 -176 81 -9 -233 90 -152 -258 -111
5933 -111 125 -164 150 245 -21 -195 -81 148 130 189 266 58 2 440 22 61 137 137 55 -198 45 35 133 99
5957 99 -219 103 84 -181 -116 -73 -122 88 -56 -304 136 -6 -34 96 168 136 84 192 65 -17 -68 -22 -239 -108
5981 -108 -24 -134 250 -246 -108 117 -285 -132 111 -174 -115 26 -7 233 -34 133 51 157 11 -65 41 -128
6003 -128 30 25 -84 0 -144 58 -54 47 28 186 -154 80 -37 -213 80 134 42 216 163 23 2 -34 99
6026 99 -25 103 -11 -66 -76 -85 42 -90 14 -110 -85 -35 -155 32 -149 150 49 -9 256 133 -154 138 50
6049 50 167 -126 21 20 117 -166 -254 44 -135 -61 61 31 -223 -252 -99 -11 102 -82 188 1 36 -53 21 178
6073 178 -69 12 109 164 -111 166 197 193 73 201 33 110 55 -213 -142 -109 98 -209 53 9 -139 -21 102 -76
6097 -76 85 151 -219 -3 101 9 253 14 368 16 -11 53 231 -99 112 126 -141 -25 -77 -327 -323 -43 -9
6120 -9 -74 28 219 -89 196 -133 -10 -190 62 0 -125 235 226 142 112 87 -43 38 -45 35 -92 -134 -223 -235 -28
6145 -28 -69 -35 -182 0 -50 127 -54 -115 -153 -20 68 -41 235 -6 89 200 159 222 -165 164 430 2 -9 82
6169 82 19 -166 -153 142 167 16 -257 -218 -74 213 -234 -52 66 173 -10 -35 3 -87 91 197 11 82 -40
6192 -40 195 117 -29 165 100 14 -124 125 103 -61 -236 -189 -215 129 -11 240 -71 -75 -105 101 150 88 -76 73
6216 73 -15 -47 152 -91 14 -83 45 -53 -163 -47 -4 105 -152 12 76 -421 2 -76 -145 217 120 123 228 -159
6240 -159 -67 91 56 -24 -115 0 -88 -63 -72 11 242 77 -36 -41 -38 -103 143 12 -164 -8 -297 1 -1 112 127 -209
6266 -209 -32 26 21 51 -138 -30 45 -80 -285 4 183 -109 36 -73 18 -163 -305 -123 45 -206 37 6
6288 6 -388 82 21 24 224 4 -137 9 297 113 58 84 -4 -158 -51 34 -160 -180 9 282 69 -259 90
6311 90 -42 -28 -56 -104 14 133 92 -149 86 58 -184 104 84 -101 -40 154 198 -17 -14 -23 24 -155 -103 123 -117
6336 -117 -30 -59 -140 129 -107 48 226 41 -109 -253 38 -39 -96 168 -164 87 -4 -38 1 147 17 221 125
6359 125 -79 16 54 -42 -106 41 -156 272 157 177 12 -160 -74 -79 -9 20 -125 105 -123 75 119 182 -226 110
6383 110 76 41 -7 19 41 1 19 -81 4 59 -52 -194 70 -1 239 -192 192 86 -247 -335 24 -54 125 154
6407 154 -53 230 237 94 162 42 -51 78 -25 187 267 107 -174 37 46 54 -73 360 46 -41 -26 -30 26 153 87
6432 87 -31 -71 -272 -114 46 -232 106 -177 366 51 -78 -128 -32 -30 -166 -55 27 26 -81 -68 196 48 105 279
6456 279 -146 -55 -161 75 284 -166 -243 74 31 38 7 111 -78 -104 -134 -82 174 -173 -164 -44 239 452 50 -88
6480 -88 -63 100 117 48 244 -68 99 93 123 192 77 70 -76 260 -147 -142 148 60 -111 -169 10 115 133 41 -31 39
6506 39 -173 -74 -28 119 -169 -93 19 25 -209 93 -91 97 -77 233 114 195 19 15 139 245 -5 42 -24 211
6530 211 -32 -278 -102 -133 -135 138 63 -260 -3 -168 147 130 -214 164 10 89 146 -133 78 56 67 146 5
6553 5 14 30 53 56 -134 -217 -96 -34 17 -114 -178 100 83 79 -149 54 -20 4 -35 -94 123 -25 -54 6 120 -14 61
6580 61 274 82 -243 175 -55 108 -79 -129 122 -114 146 -71 -75 -195 45 63 -92 147 54 205 12 -33
6602 -33 -108 -48 -128 -219 -4 -221 189 112 -148 -9 51 101 -131 -29 149 187 -1 171 13 -142 -13 177 -1
6625 -1 -170 146 -298 -140 -31 23 -46 -77 181 112 -67 41 123 -12 -35 -106 9 34 5 -58 -6 -45 150 113 -37
6650 -37 99 155 -29 59 70 340 102 -70 -49 230 74 300 -224 4 136 135 159 -259 56 -19 183 153 14
6673 14 -280 -1 130 32 250 -30 4 237 -14 138 84 137 17 131 79 -62 -75 37 -283 -31 119 89 -65
6696 -65 101 -29 81 -61 163 175 -272 112 101 -48 -116 -4 12 -45 185 -259 19 63 132 133 -85 -62 -183 -174
6720 -174 -170 -26 17 125 -90 -188 -121 129 223 142 24 311 -6 -92 -92 -7 0 -54 -164 -94 -141 169 56 9 -57 -47
6746 -47 -147 123 -58 -246 -361 163 -49 -61 -162 -338 266 -169 -42 80 191 -37 124 353 121 -88 94
6767 94 53 -84 197 110 46 -54 100 118 13 -187 -90 -61 1 -178 210 -265 73 -190 69 116 -41 39 16 47
6791 47 236 -75 131 24 -100 74 139 177 49 215 -161 167 128 97 13 -1 -81 -105 -275 -44 -130 -26 0 93
6815 93 172 76 -59 30 -84 -167 20 -49 27 -132 -44 169 144 195 -31 141 4 -139 -17 -198 -231 -135 -140 -117 159
6840 159 5 -42 -207 119 35 -85 124 111 -164 183 -151 -51 199 -66 -116 -114 108 -46 -103 -3 99 -54
6862 -54 -117 -101 -43 -3 -225 -40 -279 -108 -236 -51 34 152 250 -36 -65 -102 127 -310 -38 -148 -183 -58 -38 2
6886 2 118 51 4 -47 47 -50 -42 47 41 -59 -75 -210 13 241 -44 59 -141 -99 247 51 43 258 6 125 222 -322
6912 -322 22 -93 19 -134 -116 -206 60 223 -17 276 -67 -27 -97 161 -45 -6 213 95 188 35 -184 96
6934 96 77 32 96 -103 19 43 -16 -252 -88 -53 -52 -128 88 -104 76 -91 104 -129 134 95 -321 -48 47 -166
6958 -166 193 33 -81 -170 82 109 -278 3 37 -315 -122 51 -58 197 120 78 -49 -40 185 70 89 284 -230
6981 -230 -44 -66 202 98 -141 131 53 161 -18 -216 185 -224 -148 16 176 -46 -172 103 47 33 79 72 -243
7004 -243 114 -135 83 1 67 -27 -89 61 -198 381 -19 -179 -31 -198 -22 -7 -28 -293 -83 174 -113 -241
7026 -241 134 192 99 -242 -2 -4 175 24 128 -64 127 142 -176 -230 69 229 -224 151 64 -41 -84 -409 -6
7049 -6 -22 135 145 -64 43 75 143 106 64 286 190 -126 145 -130 -93 -175 42 23 22 -241 99 96 248 21 81 -7
7075 -7 -20 -104 81 -101 93 89 -57 81 -169 -156 102 77 62 -60 -225 -70 170 -71 45 -13 -158 106 -18
7098 -18 -12 -25 9 439 13 -108 -28 -56 345 72 -14 2 152 65 109 124 -279 -35 42 115 -18 58 -64 66 -33
7123 -33 19 8 -33 -179 -218 -173 -159 276 67 -19 -93 -9 -252 -136 8 -92 -77 52 111 -108 80 143 56 -81 13
7148 13 -6 -80 -49 -70 220 72 -201 119 -190 177 -205 -59 -12 -57 -131 -167 36 -151 49 247 -65 57 -97
7171 -97 -31 112 73 -102 177 -5 183 143 -116 206 39 -207 -336 -42 163 -165 210 41 -157 -108 52 35
7193 35 102 451 -59 -292 149 20 -104 30 319 26 -26 23 -171 -20 69 23 -38 103 -172 -78 -35 -28 -53 -167
7217 -167 -143 -36 -27 -221 -18 -194 174 -87 -323 -95 125 43 35 86 85 134 167 45 -4 -59 55 -163 99 42 -79
7242 -79 -44 168 -27 110 185 156 -38 125 -98 338 114 89 58 93 -50 23 137 -30 -140 32 197 97 -91
7265 -91 -92 -31 -244 -159 -32 95 -29 -14 -29 50 36 -92 4 283 117 -52 -18 127 -63 131 287 165 273 -64
7289 -64 -101 22 99 -215 1 166 -99 -71 -176 -124 -35 -16 -32 33 5 -128 24 -93 -219 196 -135 31 134
7312 134 25 -235 113 -127 -12 313 68 65 -206 -113 -36 201 132 97 205 -76 -42 181 -44 14 -130 9 -130
7335 -130 -58 -252 -27 -131 163 -126 82 -110 58 48 -65 -91 -205 -99 -34 -15 13 -193 67 154 -159 150
7357 150 -27 243 37 -22 -36 -35 -254 78 6 18 166 -141 -15 -28 58 155 -46 -71 -154 25 40 88 161 55 -312
7382 -312 -111 88 -186 84 -85 123 -82 -31 -88 44 -69 223 95 -10 122 -44 193 91 144 56 -160
7403 -160 -169 -54 -175 -98 -83 -129 6 -40 338 61 -15 -114 81 64 117 87 -160 -63 138 284 -172 163 -248 92
7427 92 -67 -166 152 -35 -41 78 -175 -134 178 -123 -23 171 -40 -71 37 159 -53 219 224 -63 82 281 -116
7450 -116 5 125 231 48 -88 80 -270 -91 -110 -122 -128 5 194 76 6 14 386 -5 -211 213 120 -128 163
7473 163 -198 6 251 44 -255 -26 -32 -97 -13 58 -87 -70 208 -50 82 -79 49 92 100 167 21 42 265 -265
7497 -265 -237 45 58 129 -367 150 70 -172 -11 65 -2 -96 -34 217 -70 45 44 -5 89 -70 3 -98 122 -148
7521 -148 -227 -137 168 100 176 144 148 21 73 155 -325 185 93 254 -337 225 38 -169 -72 -117 -22 -79 -180 174 -25
7546 -25 85 14 -47 -115 -80 -167 108 205 -85 -51 105 275 100 -52 79 -197 -170 -54 5 114 -98 100 12 -177
7570 -177 -98 -182 -58 -12 -119 132 26 180 -127 -64 21 -100 -18 14 62 96 -254 1 368 228 -48 -215 182
7593 182 208 202 11 295 10 -161 -121 -66 231 -115 -86 57 -215 -50 -43 -88 -153 110 -111 -99 84 -161 -161 378
7617 378 82 100 53 -41 256 6 -43 101 113 -60 -7 46 79 122 -137 120 144 57 15 46 -198 132 -89 -356
7641 -356 -77 -107 105 84 14 -60 186 -27 -104 138 -163 153 14 -149 -71 -209 -15 98 115 245 -28 154
7663 154 -39 26 218 -137 -107 -159 -64 -100 28 1 25 -114 -162 -162 -92 -76 156 -3 111 -58 15 88 261 -58 81
7688 81 -67 20 38 43 -30 -4 120 117 36 -268 -128 -30 359 -33 40 -79 -24 120 83 -42 -70 291 22 87 -141
7713 -141 53 -129 -147 -114 -113 213 -121 -99 186 -80 160 -107 -18 -83 356 140 -49 -6 -209 -52 -148 -339 -51
7736 -51 -195 72 -107 -103 -6 -97 -37 17 133 199 97 -173 64 207 -7 190 -52 -100 -39 -117 -159 -135 3 87 99
7761 99 -103 -248 5 -19 -3 233 -237 214 -140 78 30 139 155 85 -82 -35 259 20 46 186 221 -1 -123
7784 -123 -16 6 -24 5 -152 -201 -24 -134 -105 -62 46 61 88 13 -204 -161 -197 -78 -196 -45 -145 139 103 93
7808 93 22 -33 -226 -13 -102 59 269 174 -81 151 -160 -19 -292 -115 41 -58 152 -73 91 29 147 112 14
7831 14 127 -82 99 -162 20 63 -140 -68 -22 -100 -143 160 -37 134 -79 80 32 48 -173 -23 201 -109 -31
7854 -31 -230 178 144 4 -150 13 160 160 59 93 72 -135 140 251 36 -138 -147 30 85 43 -59 -52 -72 67
7878 67 -131 57 -11 -172 60 -151 -206 -65 -44 -11 203 -116 -14 -81 -92 7 -226 -185 -38 201 240 -87 -51 333
7902 333 -33 112 -156 -19 43 -79 -109 98 -203 62 -58 6 45 -230 -244 -206 25 -33 -11 263 -30 9 -134
7925 -134 -25 -98 -184 124 -80 79 78 349 34 -123 -134 166 58 -16 112 -55 -77 -36 115 -128 22 -9 46
7948 46 113 -65 175 -185 -254 172 -2 46 41 -348 103 19 -104 -297 -41 -61 -209 53 190 39 96 -91 -142
7971 -142 47 -83 -45 59 -61 119 -102 -303 -102 333 111 209 -182 37 -90 200 122 33 -168 6 -171
7992 -171 -21 203 101 200 -148 10 65 158 90 -10 53 99 169 -43 -242 97 353 44 -183 -176 -83 99 49 26
8016 26 174 143 -143 6 -116 -26 32 108 -82 206 -1 -168 58 -46 -176 229 88 -91 -323 -300 286 -14
8038 -14 -82 143 -67 3 111 82 -27 -159 96 93 138 -140 -6 44 -189 237 -94 77 -248 -4 276 185 -380
8061 -380 289 75 163 -200 -56 -78 -124 -38 -162 25 100 170 -210 69 209 316 -79 -109 -27 -367 13 72 -25
8084 -25 -164 48 -55 -25 -83 -6 55 197 73 -22 43 -132 -217 73 87 44 249 -180 40 -198 105 223 -129
8107 -129 12 -73 -99 -26 -97 -131 -206 -37 161 177 -214 -31 32 121 146 -82 97 -92 -268 206 -21 90 -219
8130 -219 334 4 216 -209 177 132 26 -41 -37 214 -268 161 78 44 -75 28 -82 -66 133 -101 13 76 23
8153 23 -189 199 -34 -53 174 25 -39 172 -128 -149 125 -68 100 33 -51 -66 -11 -213 -58 -114 -121 -187 -168 100
8177 100 127 122 76 -6 27 109 50 -202 -270 39 51 -260 32 -109
8191a09
##END NTUPLES=NMR FID
##END=
