##TITLE=1H_Ser Am-S-NH2
 CDCl3
 8 sc, 
 3.10.2024
##JCAMPDX= 6.0         $$ Bruker NMR JCAMP-DX V2.0
##DATA TYPE= NMR FID
##DATA CLASS= NTUPLES
##ORIGIN= UXNMR, Bruker Analytische Messtechnik GmbH
##OWNER= root
$$ XWIN-NMR		Version 3.5
$$ Thu Oct  3 16:22:18 2024 Russian Standard Time (UT+4h)  she@DPX200
##.OBSERVE FREQUENCY= 200.1318
##.OBSERVE NUCLEUS= ^1H
##.DELAY= (6, 6)
##.ACQUISITION MODE= SIMULTANEOUS
##.ACQUISITION SCHEME= undefined
##.AVERAGES= 8
##.DIGITISER RES= 18
##SPECTROMETER/DATA SYSTEM= spect
##.PULSE SEQUENCE= zg30
##.SOLVENT NAME= CDCl3
##.SHIFT REFERENCE= (INTERNAL, CDCl3, 0, 15.7039)
##AUDIT TRAIL= $$ (NUMBER, WHEN, WHO, WHERE, WHAT)
$$ ##TITLE= Audit trail, XWIN-NMR		Version 3.5
$$ ##JCAMPDX= 5.01
$$ ##ORIGIN= Bruker BioSpin GmbH
$$ ##OWNER= she
$$ F:/spectra/data/she/nmr/H-F/1/audita.txt
$$ ##AUDIT TRAIL=  $$ (NUMBER, WHEN, WHO, WHERE, WHAT)
(   1,<2024-10-03 16:21:00.00 +0400>,<she>,<DPX200>,
      <created by zg, POWCHK disabled, PULCHK disabled
       configuration hash MD5:
       00 E9 B6 7A A2 85 ED C7 34 08 36 98 17 FE 4E 26
       data hash MD5: 16K
       41 B5 49 D7 42 C4 82 10 6C 3C 33 A5 C1 24 47 46>)
$$ ##END=
$$ 
$$ hash MD5
$$ 88 55 59 1C B2 8D 91 0A 6A 3B E3 E7 9E B2 19 E7
##$RELAX= 
##$RELAX= 
##$RELAX= 
##$RELAX= 
##$RELAX= 
##$RELAX= 
$$ Bruker specific parameters
$$ --------------------------
##$DU= <F:/spectra>
##$EXPNO= 1
##$NAME= <H-F>
##$PROCNO= 1
##$TYPE= <nmr>
##$USER= <she>
##$AMP= (0..31)
100 100 100 100 100 100 100 100 100 100 100 100 100 100 100 100 100 100 
100 100 100 100 100 100 100 100 100 100 100 100 100 100 
##$AQSEQ= 0
##$AQ_mod= 1
##$AUNM= <au_zg>
##$AUTOPOS= <>
##$BF1= 200.13
##$BF2= 200.13
##$BF3= 200.13
##$BF4= 200.13
##$BF5= 200.13
##$BF6= 200.13
##$BF7= 200.13
##$BF8= 200.13
##$BYTORDA= 1
##$CFDGTYP= 0
##$CFRGTYP= 5
##$CHEMSTR= <none>
##$CNST= (0..31)
1 1 145 1 1 1 1 1 1 1 1 1 1 1 1 1 1 1 1 1 1 1 1 1 1 1 1 1 1 1 1 1 
##$CPDPRG= <>
##$CPDPRG1= <>
##$CPDPRG2= <>
##$CPDPRG3= <>
##$CPDPRG4= <mlev>
##$CPDPRG5= <mlev>
##$CPDPRG6= <mlev>
##$CPDPRG7= <mlev>
##$CPDPRG8= <mlev>
##$CPDPRGB= <>
##$CPDPRGT= <>
##$D= (0..31)
0 1.2 0 0 0 0 0 0 0 0.06 0 0.03 0 0 0 0 0.0002 0 0 0 0 0 0 0 0 0 0 0 0 
0 0 0 
##$DATE= 1727958059
##$DBL= (0..7)
120 120 120 120 120 120 120 120 
##$DBP= (0..7)
150 150 150 150 150 150 150 150 
##$DBP07= 0
##$DBPNAM0= <>
##$DBPNAM1= <>
##$DBPNAM2= <>
##$DBPNAM3= <>
##$DBPNAM4= <>
##$DBPNAM5= <>
##$DBPNAM6= <>
##$DBPNAM7= <>
##$DBPOAL= (0..7)
0.5 0.5 0.5 0.5 0.5 0.5 0.5 0.5 
##$DBPOFFS= (0..7)
0 0 0 0 0 0 0 0 
##$DE= 6
##$DECBNUC= <off>
##$DECIM= 24
##$DECNUC= <off>
##$DECSTAT= 4
##$DIGMOD= 1
##$DIGTYP= 9
##$DL= (0..7)
0 120 120 120 120 120 120 120 
##$DP= (0..7)
150 150 150 150 150 150 150 150 
##$DP07= 0
##$DPNAME0= <>
##$DPNAME1= <>
##$DPNAME2= <>
##$DPNAME3= <>
##$DPNAME4= <>
##$DPNAME5= <>
##$DPNAME6= <>
##$DPNAME7= <>
##$DPOAL= (0..7)
0.5 0.5 0.5 0.5 0.5 0.5 0.5 0.5 
##$DPOFFS= (0..7)
0 0 0 0 0 0 0 0 
##$DQDMODE= 0
##$DR= 18
##$DS= 0
##$DSLIST= <SSSSSSSSSSSSSSS>
$$ [...]
##$SUBNAM2= <"">
##$SUBNAM3= <"">
##$SUBNAM4= <"">
##$SUBNAM5= <"">
##$SUBNAM6= <"">
##$SUBNAM7= <"">
##$SUBNAM8= <"">
##$SUBNAM9= <"">
##$SW= 24.0689170037331
##$SWIBOX= (0..15)
0 0 2 0 0 0 0 0 0 0 0 0 0 0 0 0 
##$SW_h= 4816.95568400771
##$TD= 16384
##$TD0= 1
##$TE= 0
##$TE2= 300
##$TE3= 300
##$TEG= 300
##$TL= (0..7)
0 120 120 120 120 120 120 120 
##$TP= (0..7)
150 150 150 150 150 150 150 150 
##$TP07= 0
##$TPNAME0= <>
##$TPNAME1= <>
##$TPNAME2= <>
##$TPNAME3= <>
##$TPNAME4= <>
##$TPNAME5= <>
##$TPNAME6= <>
##$TPNAME7= <>
##$TPOAL= (0..7)
0.5 0.5 0.5 0.5 0.5 0.5 0.5 0.5 
##$TPOFFS= (0..7)
0 0 0 0 0 0 0 0 
##$TUNHIN= 0
##$TUNHOUT= 0
##$TUNXOUT= 0
##$USERA1= <user>
##$USERA2= <user>
##$USERA3= <user>
##$USERA4= <user>
##$USERA5= <user>
##$V9= 5
##$VALIST= <valist>
##$VCLIST= <CCCCCCCCCCCCCCC>
##$VD= 0
##$VDLIST= <DDDDDDDDDDDDDDD>
##$VPLIST= <PPPPPPPPPPPPPPP>
##$VTLIST= <TTTTTTTTTTTTTTT>
##$WBST= 1024
##$WBSW= 4
##$XGAIN= (0..3)
0 0 0 0 
##$XL= 0
##$YL= 0
##$YMAX_a= 570234
##$YMIN_a= -551969
##$ZGOPTNS= <>
##$ZL1= 120
##$ZL2= 120
##$ZL3= 120
##$ZL4= 120
##$ABSF1= 10
##$ABSF2= 0
##$ABSG= 5
##$ABSL= 3
##$ALPHA= 0
##$AQORDER= 0
##$ASSFAC= 0
##$ASSFACI= 0
##$ASSFACX= 0
##$ASSWID= 0
##$AUNMP= <proc_1d>
##$AZFE= 0.1
##$AZFW= 0.1
##$BCFW= 1
##$BC_mod= 2
##$BYTORDP= 1
##$COROFFS= 0
##$CY= 11.3945322036743
##$DATMOD= 1
##$DC= 2
##$DFILT= <>
##$DTYPP= 0
##$F1P= 15.6554695791079
##$F2P= 12.8336369535428
##$FCOR= 0.5
##$FTSIZE= 0
##$FT_mod= 4
##$GAMMA= 1
##$GB= 0.15
##$INTBC= 1
##$INTSCL= 1
##$ISEN= 128
##$LB= 0.24
##$LEV0= 0
##$LPBIN= 0
##$MAXI= 10000
##$MC2= 0
##$MEAN= 0
##$ME_mod= 0
##$MI= 1.114404
##$NCOEF= 0
##$NC_proc= 0
##$NLEV= 6
##$NOISF1= 3.799351
##$NOISF2= 2.8
##$NSP= 1
##$NTH_PI= 0
##$NZP= 0
##$OFFSET= 15.70392
##$PC= 1
##$PHC0= -26355.3
##$PHC1= 9.38747
##$PH_mod= 1
##$PKNL= yes
##$PPARMOD= 0
##$PSCAL= 0
##$PSIGN= 0
##$REVERSE= no
##$SF= 200.130013532006
##$SI= 16384
##$SIGF1= 3
##$SIGF2= 2
##$SINO= 400
##$SIOLD= 16384
##$SREGLST= <1H.CDCl3>
##$SSB= 0
##$STSI= 0
##$STSR= 0
##$SW_p= 3612.71676300578
##$SYMM= 0
##$S_DEV= 0
##$TDeff= 0
##$TDoff= 0
##$TI= <>
##$TILT= no
##$TM1= 0
##$TM2= 0
##$TOPLEV= 0
##$USERP1= <user>
##$USERP2= <user>
##$USERP3= <user>
##$USERP4= <user>
##$USERP5= <user>
##$WDW= 1
##$XDIM= 8192
##$YMAX_p= 0
##$YMIN_p= 0
$$ End of Bruker specific parameters
$$ ---------------------------------
##NTUPLES= NMR FID
##VAR_NAME=  TIME,          FID/REAL,        FID/IMAG
##SYMBOL=    X,             R,               I
##VAR_TYPE=  INDEPENDENT,   DEPENDENT,       DEPENDENT
##VAR_FORM=  AFFN,          ASDF,            ASDF
##VAR_DIM=   8192,          8192,            8192
##UNITS=     SECONDS,       ARBITRARY UNITS, ARBITRARY UNITS
##FACTOR=    0.0002076,     1,               1
##FIRST=     0,             0,               0
##LAST=      1.7004516,     0,               0
##MIN=       0,             -551969,         0
##MAX=       1.7004516,     570234,          0
$$ Real data points
##PAGE= N=1
##DATA TABLE= (X++(R..R)), XYDATA
$$ [...]
2405A084l501K274J592l179L390q39j133K938l287M34J442l846K895r40k110L629
2421H43j662O0K738k905K368M2k134L078k776j248K893l480Q69J360k438L116
2437G24n68r15L295k413M07J864l376J881p13k327K459j741m0K279k804K425J256
2454A693k644L550j600j309K227k872L34R60k865K369q24j277M010k001j33K825
2470B443k338J174K70k762K253k611l13K564k998J484J349k036K888k27j191K516
2486B465k182N5J138l328J720O8k369K938j086j044K881j739J544O81k051K474
2502B165k168j171K877l573M05J682k700K444J99j368L205j864K85J995l405K133
2518A141k92k596K395j934l81K482k837K105J457k652L292q69k018L237k741m15
$$ plain form
2405 1084 -2417 -143 1449 -1730 1660 821 -312 2626 -661 -227 1215 -2631 264 -676 -2786 843
2421 843 -819 -759 1979 -926 1442 1484 -650 2428 -348 -1596 1297 -2183 -1314 46 -2392 724
2437 724 156 -759 2536 123 530 2394 -982 899 186 -2141 318 -1423 -1463 816 -1988 437 1693
2454 1693 -951 2599 999 -310 1917 -955 -621 339 -2526 -157 -981 -2258 1752 -249 -382 2443
2470 2443 105 1279 1549 -1213 1040 -1571 -1884 680 -2318 -834 515 -1521 1367 1140 -51 2465
2486 2465 283 338 1476 -1852 -132 -64 -2433 505 -581 -1625 1256 -483 1061 1742 -309 2165
2502 2165 -3 -1174 1703 -1870 -1465 217 -2483 -39 160 -1208 1997 133 418 2413 -992 1141
2518 1141 849 -1747 648 -1286 -1667 815 -2022 83 1540 -1112 2180 1311 -707 2530 -211 -626
2534f26J331k831K000j28j967L491j879L4L021k859J788N98l036K547j561j537
2550a614K594l257J480J429k747K537M36j423L196k373J52J607l612K375m08k929
2566b557L241j729m52K974k762J695J195k487L047j576j435K919l928Q79J860
2581H84l610L101o60j389L850k536L79K535l661K434M40l395K320j338j157L063
2597A260l695K332Q83k574L906j247j790L652l176J31J803l592K569j094j886
2612b518L608j902K30K788l363K436K57k455K948k615l43K965m211J806J035l286
2628b620L312m19j551L249k450J275J120k723K018j245k252L843k961n6K523l183
2644b120K805M59k120L214k003p72L399l700Q85N91k787K863j268q97L006l255
$$ plain form
2534 -626 705 -2126 -126 -254 -2221 1270 -609 -575 2446 -413 1375 1973 -1063 1484 -77 -1614
2550 -1614 980 -2277 -797 632 -2115 422 858 -565 2631 258 410 2017 -1595 780 372 -2557
2566 -2557 684 -1045 -1497 1477 -1285 410 1605 -882 2165 589 -846 2073 -1855 -976 884
2581 884 -2726 375 -285 -1674 2176 -360 19 2554 -1107 1327 1767 -1628 692 -646 -1803 1260
2597 1260 -2435 -103 780 -1794 2112 865 -925 2727 -449 -318 1485 -2107 462 -632 -2518
2612 -2518 1090 -812 -582 2206 -1157 1279 1536 -919 2029 -586 -929 2036 -2175 -369 666 -2620
2628 -2620 692 273 -1278 1971 -479 796 1916 -807 1211 -34 -2286 1557 -1404 -1460 1063 -2120
2644 -2120 685 1144 -976 2238 235 -537 2862 -838 47 638 -2149 714 -554 -1451 1555 -1700
2660a700J898J727l493L590j033k420L078k230m83K074l136K053K79j922L286
2675A568k053k53K951k946J860L44l312L038j633j434L265l333O06K691k864K654
2691A149l75j562K976j952M6R83l584K591J56k768L103j987l57L780l262J871
2707H08M00k238K920j370j511K534k806M62J085k354K705r17q84L350k222K61
2723B23K227l776J992K86k702K554j864k99J623j722J759Q20k222K578l54r61
2739A62K022k953M19J383k639J962j169k083L628r36p8J885k138J114Q44j525
2755a02J450k273L2J833k736J238P35k315K871j13j056K282j627K67J099k386
2771h01J324m90k024K312j340L3J564j743J824L29j330K559j631j284K205k357
$$ plain form
2660 -1700 198 1925 -1568 2022 989 -1431 1647 -583 -1066 1008 -2128 -75 204 -1718 1568
2675 1568 -485 -738 2213 -733 1127 1471 -1841 1197 -436 -1870 1395 -1938 -1332 1359 -1505 1149
2691 1149 774 -788 2188 236 282 1265 -2319 272 428 -2340 763 -1224 -1581 2199 -1063 808
2707 808 1208 -1030 1890 520 -991 1543 -1263 -801 284 -2070 635 -282 -1166 2184 -38 223
2723 223 2450 -1326 666 952 -1750 804 -1060 -1359 264 -1458 301 1121 -1101 1477 1123 162
2739 162 2184 -769 -350 1033 -1606 356 -813 -2896 732 -204 -282 1603 -535 579 1423 -102
2755 -102 1348 -925 -893 940 -1796 -558 177 -2138 733 620 -436 1846 219 486 1585 -801
2771 -801 523 33 -1991 321 -1019 -986 578 -1165 659 988 -342 2217 586 -698 1507 -850
2787h50M19P57j972R32L90m80J659j448N31J965k163J743l20k660J915j329j82
2804a093J627k473J142J443j626K355m98j281J909j336J35M49k162J301m44j207
2820a759K333j586K5K417j592R44R89k260J970j201j189J775k198lJ645j747J621
2837A84j2j199K554j393O82J221k894J472k25k388K379j133j347K510j248O59
2853a78J532k212K118k82j203J835j867n01J599k433J382n5j496K590j247r3K476
2870A965k239P06J026k617K098j237j102J848j965P82R92j793K522l58j294K673
2886B007j619k14J313k825J188K65k184K373j368J51K099k055J392R25j712J782
2902A518j254j043K065k959J216J120l004K286L84j355K618j917N53J466k247
$$ plain form
2787 -850 -431 326 -1646 -714 -324 -804 855 -593 -62 1903 -260 1483 1163 -1497 418 -911 -1093
2804 -1093 534 -1939 -797 646 -980 1375 877 -404 1505 169 304 753 -1409 -108 -552 -1759
2820 -1759 574 -1012 -987 1430 -162 782 1771 -489 1481 280 -909 866 -1332 -1335 310 -1437 184
2837 184 172 -1027 1527 134 816 2037 -857 615 390 -1998 381 -752 -2099 411 -837 -178
2853 -178 1354 -858 1260 978 -225 1610 -257 -758 841 -1592 -210 -265 -1761 829 -418 -511 1965
2870 1965 -274 432 1458 -1159 939 -298 -1400 448 -1517 -735 257 -1536 986 628 -666 2007
2886 2007 388 174 1487 -1338 -150 115 -2069 304 -1064 -913 1186 -869 523 1448 -264 1518
2902 1518 264 -779 1286 -1673 -457 663 -2341 -55 329 -1026 1592 -325 228 1694 -553
2917e53J369O6k478K520j685p99K132k171J334Q86j616K591r59j208K798k571
2933c44L15J163k662J365l50j042K527k049J049J607k570K231J2j967J975j431
2949a71n56J526k456J335L51k121L208r04j156K923k322N88J354k582J968j143
2965a58j326K513k129j69K155k663K172O44j632K225j325m10J835k938J435M30
2981F59k799K749j091m40J976j792R65J208k102K074p18j634K433j945k88J220
2997D75k032J669j28j192K252j420K19J957k601J620J8k012J769r16j151K402
3013I29k093R42J046k115K340m16j120J922j529k67J214k083J386j22j691K116
3029D59j093k98J985j633J002P97j736J748j163j257K150k053M46J010j971J735
$$ plain form
2917 -553 816 882 -1596 924 -761 -1560 572 -1599 -265 621 -995 1596 637 -571 2227 -344
2933 -344 -29 1134 -1528 -163 -513 -1555 972 -1077 -28 1579 -991 1240 1252 -715 1260 -171
2949 -171 -727 799 -1657 -322 29 -2092 1116 212 -944 1979 -343 245 1599 -983 985 -158
2965 -158 -1484 1029 -1100 -1269 886 -1777 395 1039 -593 1632 307 -103 1732 -1206 229 659
2981 659 -2140 609 -482 -922 1054 -738 227 1435 -667 1407 689 -945 1488 -457 -745 475
2997 475 -1557 112 -16 -1208 1044 -376 -157 1800 -801 819 837 -1175 594 -322 -1473 929
3013 929 -1164 -222 824 -1291 1049 633 -487 1435 -94 -361 853 -1230 156 34 -1657 459
3029 459 -634 -932 1053 -580 422 1219 -517 1231 68 -1189 961 -1092 -646 364 -1607 128
3045A28P9q51K127j560M92J022k056J169J82j758J723j633l51J557j343J355M32
3062G14j346J826q42l91J152j416R7P38j976J396j65j250J843r62N54J577j982
3079d33J152N09j809J574q74r23R89j531Q86N65j446J709L90q79J678j635N02
3096D24O23j552O39l16j086J589r34l46J803j445Q80Q08j049J280o57r03R75j540
3114h07N03M82j813J367k17l53J665p26K32J025j671J402k18j461R29o80m62R85
3132A82j103M24P42p54J637k61j191J732j355R9M87j604P31P0j042J247q38O4
3150g33J851j190M65P15j219R03n68o66P54j240M63J03j260J703J27r77K002p94
3168D39k35Q71j492P90J22j758J717j256m56J541q14N43O28q37J196L0j176J106
$$ plain form
3045 128 207 -644 1483 -77 415 1437 -619 550 732 -1026 697 -936 -1287 270 -1073 282 714
3062 714 -632 1194 352 -39 1113 -303 -206 532 -1444 -48 -213 -1463 380 -582 -28 1549 -433
3079 -433 719 1228 -581 993 119 -804 185 -1346 -460 105 -1341 368 758 -121 1557 -78 424
3096 424 1047 -505 134 -182 -1268 321 -613 -959 844 -601 279 1087 38 1318 661 -242 733 -807
3114 -807 -304 178 -1635 -268 -485 -838 827 101 333 1358 -313 1089 871 -590 339 -341 -803 182
3132 182 -921 -497 245 -509 1128 867 -324 1408 53 152 639 -965 -234 -164 -1206 41 -797 -733
3150 -733 1118 -72 393 1108 -111 792 224 -442 312 -928 -465 -362 -1622 81 208 -769 1233 439
3168 439 204 1075 -417 373 495 -1263 454 -802 -1258 283 -531 12 640 -197 999 1029 -147 959
3186I59j417J78M80j581J122K36j450J946p05L5J528j883J205M53j537J244j069
3203b56r47J573j002jJ057j243J534k18p75J819j310l14J377k128P36L00j422
3220a220J549r20o08K196j411Q32P45j487J491j027l79Q56j310J17Q22j804J529
3237b9K1j000K079j041N4J329j736R12j27j695J834j476k95J865j746J134N13
3254E96j220J515k69q07J371j610K65J115k051Q98L5j275J811r15N09J165j801
3271f68J770l31j420J682r72r03J610j778L52Q50j255J973r06m70J510j155J48
3288C7Q25j707J200o68o53J471r40k20J248j482R92O80j183J664j176k90J287
3305A085j566L72M94j854J641k96p25J740j510P16J373j933J569l82j473J550
$$ plain form
3186 959 -458 -280 200 -1381 -259 -23 -1473 473 -232 -197 1331 -552 653 1106 -431 813 -256
3203 -256 -1203 370 -632 -633 424 -819 715 497 -278 1541 231 -83 1294 -834 -98 202 -1220
3220 -1220 329 -591 -1199 997 -414 418 1163 -324 1167 140 -239 617 -693 -576 246 -1558 -29
3237 -29 -8 -1008 1071 30 84 1413 -323 589 462 -1233 601 -875 -1170 695 -1051 83 596
3254 596 -624 891 622 -185 1186 -424 -159 956 -1095 -197 -162 -1437 374 -541 -32 1133 -668
3271 -668 1102 771 -649 1033 61 -842 768 -1010 -658 192 -1063 910 4 -466 1044 -111 37
3288 37 862 -845 355 -313 -966 505 -435 -655 593 -889 103 783 -400 1264 88 -202 1085
3305 1085 -481 -109 385 -1469 172 -124 -849 891 -619 97 1470 -463 1106 724 -749 801
3321H01j181k22P54j342Q27K75l34J342q40k95J812k118R16L36j810J530j34j085
3339g68J025j017M4J201r34J354o09o74J488j229J35M04j618Q96N34j283J449
3356C98q93j78J652j071L16P54j186P16l84k78O27j361M04N04j259J468o7n05
3374c43J232n50k63R63j214N76O0j193J054r47n6Q93n22M25L11j089J428l05l57
3393A03R86j457l08J475j443K10M14j112R92J59l7N49q01P21J22j017J201p90
3411c3p77R74r11N75L50j035J222L38o73N20n53K05O06j028K18l67o65R59p81
3430h56J65J062j188P05J205j119Q44l00m63J1n16j27M38o47K69P46q53J216m02
3449A90l11J132r76M20M8j389J198m45j010J224n92j41R42o79O41K70k93P88p48
$$ plain form
3321 801 -380 -602 152 -1190 -363 -88 -422 920 80 -215 1597 -521 395 731 -1079 451 317 -768
3339 -768 257 -760 -716 485 -449 905 296 -378 1110 -119 16 420 -1198 -302 232 -1051 398
3356 398 -495 -673 979 -92 224 978 -208 508 124 -154 473 -888 -484 20 -1239 229 162 -343
3374 -343 889 339 76 1039 -175 401 461 -732 322 -625 -681 212 -310 115 426 -663 765 460 103
3393 103 1089 -368 -676 799 -644 -434 -20 -1132 -140 19 -18 531 -270 451 573 -444 757 -33
3411 -33 -810 164 -747 -172 178 -857 365 703 30 550 -3 202 808 -220 -2 -369 -1034 -75 -856
3430 -856 -691 371 -817 -112 1093 -26 818 518 55 66 -450 -577 -139 -786 -517 229 -624 592 190
3449 190 -121 1011 35 455 503 -886 312 -133 -1143 81 -511 -652 290 -389 252 522 229 1017 269
3468B69n2M85j731Q59L01q79Q23l69k26Q89r3q5Q07j297P39m18l28P19r31m20
3488i38Q96p12J022K28j051J294m34m19R34k99n65M54j308O49l09m62J069o75
3506f26N28Q83j265J002L30j117R79j036k40Q02j149M49J05r29J361k40K08P79
3524H24p95Q34j94j083P62l63j148J705j286L45Q29j200J063K99r41J469q97n51
3542c28J319j649M20N51j458J195m08K72Q94j428P50Q85j250R02l31r94J454j088
3560b92q6J97r29J179l86m03J505p40K00Q41j447O08L39j404P75m27l79J326j417
3579i40P09R07j465J695j57j076J316j229J2Q08j720Q08L31r20J354m67k63J486
3597A189j430R27o6r57Q94n10m72P40j375N88P80j288J187J29n60J197q73J65
$$ plain form
3468 269 217 702 -1029 -170 131 -748 75 -294 -520 369 276 191 998 -299 440 22 -306 413 -518 -938
3488 -938 -42 -754 268 496 -555 739 305 -114 820 521 -44 410 -898 -249 -558 -1020 49 -626
3506 -626 -98 785 -480 522 852 -265 714 -322 -562 240 -909 -460 -355 -1284 77 -163 45 824
3524 824 29 863 669 -414 348 -15 -1163 542 -744 -399 430 -770 293 592 -349 1120 223 -328
3542 -328 991 -658 -238 313 -1145 50 -358 -86 808 -620 130 1015 -235 667 336 -658 796 -292
3560 -292 -378 -181 -1110 69 -317 -720 785 45 245 1086 -361 247 586 -818 -43 -470 -849 477 -940
3579 -940 -231 676 -789 906 749 -327 989 -240 -228 580 -1140 -332 -1 -921 433 -34 -297 1189
3597 1189 -241 686 620 -337 557 47 -425 315 -1060 -472 308 -980 207 336 -224 973 100 265
3615B65N83j464Q75j08j027J002j051K81J140j341J143K59r13J395o89n57Q25
3632F18j283K12L43j065J502n37o27J670r98K29P14j012J100m30q19R80r83j86
3650e72J239j837R46M00j050J658l38k65J241j946P18L97j567J484q75l98J077
3667C12j001M04O56p72Q57l05l88J254j258J31P71j433O88L35j068J100n71oJ292
3686I98j442N98L68q28P26m16p27P74r21L63O15p42P85j60m41J264q50j62P13
3705E15p96N57j60j066Q14n45l7Q44o62N15N39p62R70k57o46O82q83m7O17j020
3725h28O22L56m43N27j05l6M65p90O90j19o93P83Mp39K69r05L73O34m63P11l8
3746B75k04O96p10k48Q66j236M14K45o71O54m23j9N93n85N13Q09r00L74j48n13
$$ plain form
3615 265 848 -616 259 151 -876 126 -925 -644 496 -845 298 557 -356 1039 350 -207 618
3632 618 -665 -453 -110 -1175 327 -210 -837 833 -165 64 778 -234 866 436 -383 597 -386 -572
3650 -572 667 -1170 -224 176 -874 784 446 181 1422 -524 194 591 -976 508 -367 -765 312
3667 312 -689 -285 371 -401 456 151 -237 1017 -241 -110 661 -772 -84 251 -817 283 -288 -294 998
3686 998 -444 154 522 -306 420 4 -723 51 -870 -507 108 -634 151 -9 -450 814 -36 -198 515
3705 515 -281 276 116 -950 -136 -681 -718 126 -536 -21 518 -244 726 469 -177 505 -378 -425 192 -828
3725 -828 -206 150 -293 234 129 93 558 -232 458 339 -354 429 433 -306 -37 -942 -569 65 -398 313 275
3746 275 71 767 57 -191 675 -561 -147 98 -573 81 -342 -361 232 -353 160 969 69 443 295 -218
3766b18N03l17l87M25o95M29L08o27J128m36K2J044r11j61J57q60P20k91k61P01
3786B73o78k55J212r26P71J07o25P89p81J77O22j448O03K31j081J101l36r6O95
3805C55m06O12k04n74N11l27l26N73p60p8O04m14N51K55p02J118l95k38O77j232
3825d00K81M67r94M05l09p1R29o87L73P14p82P48J62j203R07n43n70J016j318
3844h75N00O2o24J300k12n17J014m48L58j41q41O48m46l44P35j002J39R53o87
3863d28O56J79q72J336o44j34L94p56L30L53j300Q44l61o8Q33p67M57P35j061
3882b74J111n75j195J655r40k58M52o91O72M7k75R44k94n93J169j150L70J99j203
3901h29J035n41n60R08m61N22K87r04J105l14m37P19n38k21P04j187M41J78o29
$$ plain form
3766 -218 285 -32 -419 6 -689 -260 48 -579 549 113 135 1179 268 107 264 -596 124 -167 -428 273
3786 273 -405 -660 552 -374 397 504 -121 668 -113 64 686 -762 -159 72 -1009 92 -244 -340 355
3805 355 -51 561 357 -217 294 -33 -359 214 -546 -624 -20 -434 117 372 -330 788 393 155 832 -400
3825 -400 -119 348 -646 -241 -550 -621 308 -379 -6 708 -74 674 836 -367 540 -3 -573 443 -875
3844 -875 -375 -313 -937 363 151 -366 648 200 558 417 -424 224 -222 -566 169 -833 -694 259 -428
3863 -428 228 407 -465 871 227 93 487 -269 61 414 -886 -42 -403 -471 362 -405 52 787 -274
3882 -274 837 262 -933 722 -218 -476 -24 -715 -43 4 -271 673 379 -214 955 -195 175 374 -829
3901 -829 206 -335 -895 13 -448 74 361 -543 562 248 -189 530 -8 -229 475 -712 -271 -93 -722
3920g22J109l39l76Q85j208P76O00j033Q84p69q7P44r29L99K58r84J279mm73P21
3940G31r63N62J76j267R99o91m85J387q75j66Q82m40M56N45r76R43p72k25P64
3959E85j096O35j47q76Q39l02j58J081q33K26R13j281P29n5n83L84m16j60P56
3978B41j216R42N00j199J284m70l14J085p19p2L17q76P04n14n62J239q05L71N60
3997D96o22N03k53m64J066p67r6L89j036R34k19m29Q61n88o6P24p09N82L52q12
4017a54N54l49m93Q53r07J28N63n92L20l2k61Q28k23l05O21q06M57J43j085Q37
4037I7n90L3Q31r24P10J33q25J065j73m97N02n17jL53n16J62L08n82P59n81jN81
4059C27m76N99K5p00N00n10j69M63l70r0O41l36J35K16l36P05n97J08K01o19L82
$$ plain form
3920 -722 387 48 -328 557 -651 125 725 -308 576 -193 -280 464 -465 -66 192 -792 487 483 10 731
3940 731 -232 330 506 -761 238 -453 -938 449 -426 -592 290 -150 306 851 -125 818 46 -179 585
3959 585 -511 124 -23 -899 -60 -362 -520 561 -272 -46 867 -414 315 260 -323 61 -355 -515 241
3978 241 -975 -33 467 -732 552 82 -232 853 134 62 379 -497 207 -307 -869 370 -435 -64 496
3997 496 -126 377 124 -340 726 -41 -137 252 -784 150 -69 -498 363 -225 -291 433 -276 306 658 -154
4017 -154 400 51 -442 411 -496 -368 195 -397 -77 -109 -370 458 235 -70 551 -255 202 345 -740 97
4037 97 -493 -460 371 -553 157 290 -535 530 357 -140 362 -155 -156 197 -319 -157 151 -431 328 -253 -254 327
4059 327 -149 450 475 -225 275 -235 -404 59 -311 -401 240 -96 39 255 -81 624 27 135 336 -283 99
4080I9%r91P22p3j20Q58o14J71O14q98O86p3q14P06l49j23N5m01L89J86l01J029
4102G58n50j72P37o75J69J17o49Q5L57n76M65l40L1O85q31Q02j93QL11k28q5J04
4124C30p66J89j09k95Q56P8m47M87pk02P18r22L72R2j005Q81o57q9N26o75J076
4145D31k79l08N63k84J11J38p64K07L51j000Q31m00j11Q23o38J47R08p90N17J75
4165F28o50N45k04o61M46p54L74N05j009J292m78J78N41p55J42L63q70M72j81
4184g6o11P62p98L81O29o64N70J63n00P97k65n33N22q69K89K06r40Q72m4n05J172
4205E58l26m78O17o59N19J49o17O93j144J96N50q88P69J00k05R00p92J8P01q33
4225a72K61J21q22P99o05j55O94o74N94N13p59P03J10p24P32n92lL10q67N65r8
$$ plain form
4080 99 99 -892 -170 -243 -363 495 -119 52 666 -232 454 381 -433 273 -76 -199 -144 -545 -156 30 -271 758
4102 758 208 36 773 98 267 384 -265 -180 177 -399 66 -274 -243 442 -389 413 220 228 539 311 226 330
4124 330 -436 -247 -356 -651 205 283 -164 323 316 114 832 -90 282 374 -631 250 -407 -496 30 -645 431
4145 431 152 -156 407 123 234 372 -392 -185 166 -834 -3 -403 -514 309 -329 -182 726 -64 453 628
4165 628 -22 523 319 -342 104 -650 -276 229 -780 512 34 212 753 -2 140 503 -367 105 -76
4184 -76 -687 75 -723 -342 287 -377 193 356 -144 653 388 -145 377 -492 -203 3 -937 -65 -109 -614 558
4205 558 232 -246 371 -288 231 380 -237 456 -688 -492 58 -830 -61 39 -166 734 -58 -40 661 -172
4225 -172 89 210 -612 187 -418 -573 121 -553 41 554 -205 498 608 -116 616 24 21 331 -536 29 -69
4246f9l19O57l57j99J014j030O16l0p34P10n24k31O04p62N28K20n50N20M83o86
4266a39R14n41k76O68q07M45l81n12Q39n56O8O41p29P49p3o1N06o91k21O76j102
4287e83K35M86j021J066j68l30P81m00K16K73n33L83k57n56P97p21n8M27o30O47
4307E4L34q11O21l68K01P15j220M65L37o16K64j50m41P20n70J63P45l80O04m76
4327A91l07P43m22k93K83p65K75K05m70Q26j44l17P75m44K37O5m90K95k18k34
4347b09M45p11L40K77n89M96J36k46O86o64Q2N39q27K01j1n42R14m63j23L90o13
4368d92O42L60n90O08j48p38N60l90j43N74q11N63R4j65L83m73J59K83m68M13
4388B21K51q83M45j25l63L09k03p3R13p71N50R0l76N4j86J81K54p03N02p4l08
$$ plain form
4246 -69 -388 269 -88 -287 727 -303 313 283 -451 259 -265 -496 108 -654 -126 94 -456 64 547 -139
4266 -139 775 234 -42 626 -181 264 -117 -629 210 -346 -278 363 -366 383 310 249 755 64 -157 519 -583
4287 -583 -348 138 -883 183 15 -315 466 66 282 555 22 405 148 -408 389 -332 -390 37 -593 54
4307 54 388 -423 198 -170 31 746 -474 -9 328 -288 -24 -174 -615 105 -465 -302 443 63 667 191
4327 191 -116 627 205 -88 195 -570 -295 -90 -560 266 122 -195 580 136 373 438 -52 243 25 -209
4347 -209 236 -475 -135 142 -447 49 185 -61 625 -39 43 582 -245 -44 -55 -597 317 -146 -269 121 -492
4368 -492 150 510 -80 528 380 -358 202 -188 -331 243 -568 -5 89 -76 307 -166 -7 276 -192 221
4388 221 472 -411 34 -91 -454 -145 -348 -421 492 -279 271 361 -15 39 -147 34 288 -415 87 13 -295
4409b95L22k91r4O46l40J40K59m98N69kp83N57l39j55M35n90L47K08k92O56k45
4430B15n3N15r89L65Jl2k26R5j97L61j66P7L87n47L36k5q1N78m52J0j22k02JN3
4454i8k09M00j2m32P39l50P0M32p94K82o0n00P08o91K11L50n93M89L75k76L14
4475C55J98k17j01l07N7O4n65M52m33j03P88r4k97M91l57L42j07m22N95l13m24
4496c98M94m63j46O93l20J33K22k30P75n65j30J13l66J38k09m24O53m48L06o8
4516b40qM04J30o54Q28l68j15O51q97N4M7m07K84J78j58J081j031O92l8o83O50
4537D00l99l05M02n60J2O37q90L92M91m71P55p8k06M06o61J58k28m52P78o01R6
4558c24O41n81k5P44q72R78k35m57Q25p51j97L99o50K83R5n15Q27l66J28Q13p39
$$ plain form
4409 -295 27 -264 -358 288 -52 88 347 -151 418 416 -367 190 -149 -304 131 -459 -112 96 -196 460 215
4430 215 162 677 -312 53 54 22 -204 -109 -306 55 -111 -34 353 -194 142 117 36 614 162 172 50 -152 -151 -98
4454 -98 -307 93 81 -351 388 38 108 540 -254 28 -32 -532 176 -515 -304 46 -547 -58 317 41 355
4475 355 553 336 235 -72 -15 49 -516 -64 -497 -600 188 94 -203 288 -69 273 166 -256 339 26 -398
4496 -398 96 -367 -513 180 -140 -7 215 -15 760 195 65 178 -188 -50 -259 -683 -30 -478 -172 -240
4516 -240 -248 156 286 -368 460 92 -23 628 -269 -215 -168 -575 -291 -113 -271 810 -221 471 433 -250 400
4537 400 1 -304 98 -462 -450 187 -703 -311 180 -291 464 386 180 586 -75 83 -145 -597 181 -420 -324
4558 -324 317 -264 -289 455 -417 561 326 -131 694 -57 -254 145 -505 -222 -127 -642 185 -181 -53 760 21
4579B1K43M05j226Q82n97k99O55q98L24P22n82P50k60m28R37m86n5K37o11M12
4599A46k42m88O94m12n4O19o07L89J74m58N50n88K26J81n81K70L44o71O17k10
4619a01m14J095o35J23M86l97M13q22k42N48l29j55O42n07L52K1j92O38l53k16
4639d5M86n42p6M50o48N53L8n31L05j93M36P6m25L35J32o52L43Q4k93O3l88L02
4661a90k3l65P05k52L26J50j58j73K98n48M65J2l36K63n64p9M60l15L24J91m29
4682b38N99m3m6L1l71l6J11m02L14j34j82Q01j55N4J28l99L04j74k59N27o43K29
4704A6K17q33N37J20m03O99m22n7Q41p78N6Q1l62L53q9m70O52m43j84P89o88M66
4726I8K79n13L07p7m3r0J2J0k41J97O1j89L8J59J91l04K47l14O32j07j92j01m69
$$ plain form
4579 21 264 669 -557 325 -272 -571 84 -814 -490 232 -350 400 140 -288 649 163 108 345 -266 146
4599 146 -96 -584 110 -302 -356 263 -344 45 219 -239 311 -277 -51 130 -451 -181 163 -508 109 -101
4619 -101 -515 580 -55 68 554 157 570 -252 -494 54 -275 -430 212 -295 57 78 -114 524 171 -45
4639 -45 441 -101 -177 273 -375 178 216 -315 -10 -203 233 309 -116 219 351 -301 42 126 -167 -104 -492 -190
4661 -190 -213 -578 127 -125 201 351 193 20 318 -230 235 247 -89 174 -390 -469 -9 -324 0 191 -238
4682 -238 361 318 272 303 -68 -104 7 -395 -81 -215 -397 404 249 303 431 32 336 162 -97 430 -213 16
4704 16 233 -600 -63 57 -346 353 -69 -126 715 -63 -7 74 -288 65 -24 -494 158 -285 -469 320 -368 98
4726 98 377 -136 171 94 51 -39 -27 -17 -258 -61 0 -189 -151 8 199 -105 142 -172 460 353 161 60 -409
4749d09J71K81l15N14J44n42M62l42k72M77n01K77l5k03q0K41j73L45l06J47M00
4770B81q9L1L32n13L56R2q29N99p60K9M82j62N56n06l83Q29l08l0M12n48j5K80
4792A36l29M70p12K01K40j13K77M27q32L81L43n47N99n60J19m0j50J62l94k44
4812e66M90qKN71n29K88J10q67R90o87k12N97l49j52M46k07J77r2J34K56p10O93
4834C75k48m82P39m04m74N64m44J26O00n48K10L03m06O11m81j29N72p09L47k08
4854h6m33Q29p23K72N32n57N05J33o95M75k91m67O89p06M9K97j42O17k23l21Q67
4875F21n38p5M52n83Q1n9k05L01k23o05J034l50K17J73n20O23j7k63N75j067L81
4896d7l4p27P36j89m02R10k61P0j05O9O3L70m69N47r4o86M39m27K66j71k39P76
$$ plain form
4749 -409 -238 43 -272 242 386 -156 306 -36 -308 169 -332 -55 -90 -293 -373 -132 -305 40 -266 -119 281
4770 281 192 223 555 42 398 490 -339 260 -500 -471 11 -151 405 -101 -484 345 37 7 419 -129 -144 136
4792 136 -193 277 -435 -234 6 -107 170 597 -235 146 489 -58 541 -19 100 60 -90 72 -322 -566
4812 -566 -76 -84 -82 489 -40 248 358 -509 481 -206 -418 179 -170 -322 124 -83 94 2 136 392 -318 375
4834 375 127 -355 384 -20 -494 70 -374 -248 352 -196 14 317 -89 522 41 -88 484 -225 122 -86
4854 -86 -519 310 -413 -141 391 -166 339 472 -223 252 -39 -506 183 -523 -474 -177 -319 298 75 -246 621
4875 621 83 8 460 -123 -42 -101 -306 -5 -228 -833 201 -149 68 241 -279 344 327 64 639 -428 -47
4896 -47 -81 -808 -72 -261 -663 247 -14 56 -49 20 83 453 -16 531 437 -249 190 -237 29 -142 -381 395
4918C95n32L1M57o08L68K09m10nK97p23O26n08J65N58j74Q0M93p11M46k80n71
4939c97M27l85L73l0o80O54o5l06J029o60P1L47p28N83l74j69K59j45k70O55m98
4960c09J05M37l80M04k82m0K90o17K38L36o64L69M6m27M02j16L32L71l60J73k7
4981B81j58N67p49l14P50o12M1Q3j97N33j21k40Q09n23o2N25r00L50Q7m61M28
5002A17m46l5M36m53M12j14J6M42k73Q7P4m96K06J11l59M49k63j34N43o9l07M92
5024D36l81L89m7j49o4m47j46K88p6K31Q3m66L88J12p0L28l53k49M15n30N28m74
5046b54k22N56j84k25M53l44J45K88k81N77n24j30J83m28K99K99o01N51j73o3
5066g8M17m56J9L89j06o2l8l34m8K69j54rJ27Q9K9k00K90n5l34O14k31k95M80
$$ plain form
4918 395 -137 -106 351 -257 111 320 -90 -95 202 -521 105 -403 -238 320 146 226 719 8 454 174 -397
4939 -397 30 -355 18 -12 -692 -38 -103 -409 620 -40 31 378 -350 233 -141 -310 -51 -196 -466 189 -309
4960 -309 -204 233 -147 257 -25 -65 225 -392 -154 182 -482 -113 -67 -494 -92 -208 124 495 135 308 281
4981 281 123 690 -59 -373 377 -235 -194 -111 -308 225 104 -136 673 150 88 613 -287 63 150 -311 117
5002 117 -329 -364 72 -381 31 -83 -67 375 102 189 263 -233 -27 84 -275 174 -89 -223 320 251 -56 436
5024 436 55 444 397 248 184 -263 -409 -121 -197 34 117 -349 39 151 81 409 56 -193 222 -308 220 -254
5046 -254 -476 80 -104 -329 124 -220 -75 213 -68 509 -15 -145 38 -390 -91 208 -393 158 -15 -78
5066 -78 339 -117 -98 291 185 123 85 -249 -297 -28 -182 -191 -64 25 54 -146 144 89 -245 369 138 -157 323
5089C23o78L98j45l65O17j61l81Q34k04L87k57l40Q5p2OK47q19J48J65k01O82
5110B69q2k36N36n06o9M56n97L28J34m47K5K1n38J106n92J84N17m69M34N8q46
5131c14P00o46P8L84l99J28j24k72O01j81m5M35o29L65J44n58P77p82q1N16m23
5152c26L62J04m15N89n16J58M22k36j48M23p66M82l85k15O45n29q4O93m95O29
5172C92N8n87P63l79m87P02q16NJ47k20L40l27K32M02l96K66L28o55L87j4m80
5193c39M59n49J30P29j108N95K10l55O97m41J93J97n61L30j66k86K74j99j08N09
5213B11m83K90J67n08O59kj94L25n88r9N16r11Q68l29l48N68K2J07J63m61N41
5234E14k59q75R37m93j57K53k52J5K41j44N49j32k60P83q20j46Q65r92L60j7m23
$$ plain form
5089 323 -355 43 -102 -467 150 -11 -392 442 238 625 368 28 113 41 47 294 -525 -377 -212 -413 269
5110 269 187 -49 487 -19 -88 368 -229 99 233 -214 -189 -168 -706 400 -192 -8 509 40 474 532 -314
5131 -314 386 -260 -182 202 -197 -69 -193 -465 136 -45 -90 345 -284 81 225 -333 444 -338 -419 97 -326
5152 -326 36 140 -275 314 -202 -44 378 142 -6 417 -349 133 -252 -467 178 -351 -435 258 -237 392
5172 392 450 -137 626 247 -240 462 -354 -349 -202 -422 -82 -409 -177 225 -171 95 423 -232 155 141 -339
5193 -339 120 -429 -299 430 -678 -83 127 -228 469 28 221 418 -143 187 21 -265 9 -190 -298 211
5213 211 -272 18 185 -323 336 334 140 465 -123 -222 294 -617 251 -78 -426 142 164 271 434 -27 514
5234 514 255 -620 317 -176 -333 -80 -332 -317 -76 -220 329 197 -63 720 -100 -246 619 -373 -13 -30 -453
5255d53M14k24m1O81p05M74K84q30Q60l91l81N99o39j4N31q79R44pk91K11K28
5276C71m5K68p31N32n4q60P67n53j36M57l75K99J17J00L57k60k22L35l60J31P3
5297B11m52J92r6k74N39j57J13K44k14O5M5m7Nr4l97L17l52Q3J31O4K50l93J59
5320e8M08j65Q0j29k20j39L64m58L59m30rM76qK18j71o6M70j88l51ql97K51K74
5343A03l53J53J32l97Q69k71k50K77L1j38Q3p27M76n05N84q3k86j8L00j09J87
5364E8k76L43M06o34O0J73m4J72j39n24K04L10k26L10k35K11Rj8L47k99m4O9m69
5387b36J61K03o04N25K46l45L26n23J72J83K92j20k30o45L76K43j57J11l26M53
5407A05j12O8P3j36k08N77k40j81J04k07J54M7k39L10Lo3L13o04M99J6o66O68
$$ plain form
5255 -453 -39 -263 -304 377 -328 146 430 -400 460 69 -312 287 -352 -366 165 -714 230 223 -68 143 371
5276 371 326 594 -137 395 341 -519 248 -305 -441 16 -359 -60 57 157 514 254 32 367 7 138 211
5297 211 -241 -49 -145 -419 120 -37 76 320 106 171 216 169 174 80 -317 0 -352 -269 -138 -74 176 -217 -58
5320 -58 350 185 265 136 -84 -223 141 -317 42 -388 -397 79 71 289 118 52 522 334 -17 -25 -422 -171 103
5343 103 -250 -97 35 -362 507 236 -14 263 294 156 239 -488 -12 -517 67 -16 -302 -320 -20 -129 58
5364 58 -218 125 531 -103 -43 130 86 258 119 -405 -201 109 -117 193 -42 169 178 160 507 208 164 233 -236
5387 -236 -75 128 -476 49 295 -50 276 -247 -75 108 400 280 50 -595 -219 24 -133 -22 -348 105
5407 105 -7 61 134 -2 -210 367 127 -54 50 -157 -3 44 -195 115 118 55 368 -236 263 279 -387 281
5429B81l90o7L54m40l0P08p15M45k24k55L85J70k20L56p14N12Jo02M27m17J48
5450b87R1N5K34K43m19K07m3o2M31n63k25M40l66K34k04qM14l89K88M06p00N20
5472B97K57p58N31j49n11N57n12N4K41m25O69l25p6N62m59Q3L37p34L88M3n35
5493d65M15mn91J058n09J17K89m86N94m14p7L07o55M87j46n50N29L4k03O77m03
5514DL93o2m85J46j55l95Q00m44p2J61j13j30M62k44O89n30j52O26o73NP08p75
5536b36J96k70k53O43j88J25L33l93J77J97j042J168n59m14P20o63K12l7j9O05
5556C02n02L0P52m65LM45j009N80j14l12N36r55M89K81q22R64J39l74O11m59p9
5577D1N4n97O68k60k22M07m34J56M52k46N8J88l12M61m17k33L88k57K3Jo26N01
$$ plain form
5429 281 -109 -176 178 -262 -292 416 -299 146 -78 -333 52 222 2 358 -356 156 157 -445 -18 -435 -287
5450 -287 -196 -141 93 336 -83 124 81 19 450 -113 -338 102 -264 -30 -234 -242 172 -217 71 477 -223 297
5472 297 554 -204 327 178 -333 224 -288 -234 7 -418 251 -74 -150 412 -47 36 373 -361 27 70 -465
5493 -465 -50 -54 -645 413 -96 21 310 -176 418 4 -73 234 -421 66 -80 -630 -101 -67 -270 407 4
5514 4 397 335 -150 -4 -159 -554 246 -198 -270 -109 -222 -352 110 -134 555 25 -127 499 -174 -169 539 -236
5536 -236 -40 -310 -563 80 -108 17 350 -43 134 331 -711 457 -102 -516 204 -459 -247 -284 -303 302
5556 302 -200 -170 582 117 120 565 -444 136 22 -290 246 -709 -220 61 -761 203 342 -32 579 120 41
5577 41 95 -502 166 -94 -316 91 -343 -187 265 19 77 265 -47 414 -3 -236 152 -105 -82 -81 -707 -206
5599b06J30j62N80m89N34P3o51K79M40r29J91O4l63O58m64Q23n68q8P94n89j89
5620a32N35k97l3kn99M43J08m61P14o11L92M67l48J55Om27L62l33r2K30l13J92
5642d4j6j01K73n5j68K45j66M65l36m35L08n0j54J48j62K46M6j66Q0oK02J84l64
5665b6k03N26m90j07L64p96N10j94O8P70m59L01Q4n81N83l35l59N04o78K79J90
5686d9k43K16M19m16L21O5p5K4Pk23J41k49m12M73j98R4j0M8L07j44Q6j7m09K98
5710E4mo7J85m29K17J65o70M53J51L35m27K66j80L19l46j04k9J27k43J32j16L1
5732a80K19k1k24K47k7M92o86M58m40K34J87l95j34q3J59K21K03j87L30n05M45
5753C13j93j8R4j18n76N15l42l2M73o04O78p1k27M85k17k0kn60J67L09o69O39
$$ plain form
5599 -206 -76 -238 342 -147 387 460 -191 88 528 -401 -210 -146 -509 149 -315 508 -60 -148 646 57 -132
5620 -132 403 106 73 71 -528 -85 23 -438 276 -335 57 524 176 331 337 -90 272 -61 -153 77 -236 -44
5642 -44 -60 -161 112 57 -111 134 -32 433 97 -338 -30 -80 -234 -86 -248 -2 44 -122 -42 -48 154 338 -26
5665 -26 -229 297 -193 -300 64 -732 -222 -416 -348 422 -37 264 348 -233 350 15 -344 160 -518 -239 -49
5686 -49 -292 -76 343 -73 248 313 238 262 269 46 187 -62 -474 -1 -199 -105 -115 -67 240 96 182 165 -244 54
5710 54 50 -17 168 -261 -44 121 -549 -96 55 390 -37 229 49 368 22 -82 -111 16 -227 -95 -211 -180
5732 -180 39 18 -206 41 14 506 -180 278 -162 72 259 -136 -270 -353 -194 27 230 43 373 -132 313
5753 313 120 102 196 78 -498 17 -325 -357 116 -488 190 119 -108 377 160 140 138 -422 -255 54 -615 24
5775B4k06l66O71k51JL30k05M15J37m74L40p27K33j31k78N55k50j02N42l2n43
5796c17P88o51J63K29k41N01p20l54P17k05l3K27k6J97k91RP4J1K4Km18J90J16
5819hl70J06O6J7O23n67k56N93j48L33k16n0pl55L32j51l59L12K92l83O13l50
5841F7lL77k92j21j14k44N83n03j19M32m01K41L27k27K82j15Q5J42m61K13Q8k93
5863e6k1Q9o47R97l86m7J31l91N59R6n35L59r3l33Q2k14L20k05O0L42m62L97P78
5886H20r16Q2Q21j253M84k7n03O55j98k65M43k20K29J65p43R50l59r5K07n15M93
5907B55k18m76P01l68j14N81m05M60l9l09L65k63o77P19n57L01J42k06K44k37
5927a01k58Q41m47K85j9l08ll33l4M43n51N09J6j39J71K23l24M74j44l63J68j06
$$ plain form
5775 24 -182 -548 123 -128 -127 203 -2 413 550 76 416 -311 -78 -209 -487 68 -182 -284 258 226 -317
5796 -317 471 -180 -17 212 -29 472 -248 -602 115 -90 -123 104 78 275 -16 -7 67 78 102 104 -314 -124 -8
5819 -8 -378 -272 -206 -189 434 -133 -389 204 56 389 173 123 116 -239 93 -58 -417 -105 187 -196 417 67
5841 67 64 441 149 28 -86 -330 253 -250 -369 63 -338 -97 230 3 285 170 255 397 -64 149 237 -56
5863 -56 -77 12 -635 362 -24 -71 60 -331 228 324 -211 148 55 -278 -196 -410 -90 -295 -235 107 -355 42 820
5886 820 -96 -14 807 -446 38 11 -492 163 -35 -300 143 -77 152 317 -426 524 165 70 277 -238 255
5907 255 37 -439 262 -106 -220 361 -44 416 377 68 433 170 -507 212 -345 -44 98 -108 136 -101
5927 -101 -359 482 35 320 301 -7 -10 -343 -377 66 -485 24 40 -99 72 295 -29 445 301 -62 106 0
5949@K2Q6k65j68L11l90P56p07N65J61l48K70K32m28k1l17k4K27l30M23k75k61
5971d81L67J50j5M01k88J94o8k73J66j58k46J52j93Q9M96j34j23J83j44L43k29
5992A89n32L71Ok56p2k01P05m84j05O77k35M0K65l70RL5r1q1k58J66K08l77M50
6015E9J52m97L74K83j50J46m13j79N76q01L09j00J80J53l63K19K55k49L9J10p1
6036C2Q3Q6k89j21P4J47j03n11M11P2KJ53J6k35P13l99l1k99K81J04m91j23N98
6059A70m4k74K78j61R1m0J35K4k5l02M32p19L93k44N8M41m66j87P06k90K94j92
6081G8k41M89m91k28M15k85J39p2J59j90N58n06N96k68j58M18q1o49L90l01K80
6102E2j40j02N83m63J03J58k23j4M30k26n7l57j22K68k30O18n81r8L34L11k28
$$ plain form
5949 0 22 108 -157 -325 -14 -404 352 -355 210 371 23 293 525 97 76 -241 -265 -38 -368 55 -220 -481
5971 -481 -114 36 21 422 134 328 260 -13 153 -5 -251 -99 -292 -203 293 159 36 219 75 418 189
5992 189 -343 28 34 -222 -294 -495 210 -274 -379 298 63 103 368 -2 7 42 -49 -130 -388 -222 -14 -391 59
6015 59 211 -286 88 371 221 367 -46 -225 351 -450 -141 -241 -61 92 -271 -52 203 -46 -7 103 32
6036 32 115 201 -88 -209 -135 12 -91 -602 -191 -119 -117 36 52 -183 530 131 100 -199 82 186 -305 -428 170
6059 170 126 -148 130 -31 60 20 155 179 154 -148 284 -435 -42 -286 -228 213 -253 -440 266 -24 270 78
6081 78 -163 326 -165 -393 22 -263 -124 -196 -37 -227 331 -175 421 153 -5 413 332 -317 73 -228 52
6102 52 -88 -190 393 -70 33 191 -32 -46 384 158 101 -256 -378 -110 -340 278 -303 -401 -67 244 16
6123A6K90j89N1j80j94N5P8k28L58l43L04J04l83O34l74N1L40m56o01J097o61
6144b31O5J40j67L37m30L77Q4j34K24M57n94L82m13p38N77m37N55jm05P48l38
6165E8k34M54l37K2M79n77J90J12k77K4j80KN46n89J90J58o1K58l17L3L61m6k02
6188F7K9m75L28k00j18M77o2O9K94m89K89P2o74M42l48m5N02p45N52o5O1K71k77
6211d5J0N92k94j26J20l64K08j88j88M49l22j81M37m81M33J73j20L84j86j89p8
6232D4r9n4J55m21M85l14nK69j36J18L16m43J17o4p5L73p39K13J0l01O86j43r9
6255a07J32K84k25K62m57L16L5n10N32l48m67N94l52L29j72N2P2Q0p0L52m89j16
6277b73M08p92O81o25K99K56J0m7M22j98q4R9k41L71k99k11J76k69K76p2K7K22
$$ plain form
6123 16 306 117 168 -12 -206 -151 -73 -301 57 -286 18 122 -261 373 -1 50 390 -66 -667 430 -231
6144 -231 -166 -26 -193 144 -286 91 175 41 265 722 128 510 97 -641 -64 -501 54 53 -352 396 58
6165 58 -176 278 -59 -37 442 -135 55 167 -110 -86 -266 -264 282 -307 -117 41 -20 238 -79 -46 315 269 67
6188 67 96 -379 -51 -251 -369 108 46 115 409 -80 209 281 -393 49 -299 -344 158 -587 -35 -100 -39 232 -45
6211 -45 -35 557 263 137 257 -107 101 -87 -275 174 -148 -329 108 -373 60 233 113 497 311 122 44
6232 44 -55 -109 46 -375 110 -204 -209 60 -76 42 358 -85 32 -32 -107 266 -473 -260 -250 -551 135 -8 -107
6255 -107 25 309 84 346 -111 205 240 -270 262 -86 -553 41 -311 18 -154 -102 -30 50 -20 332 -157 -273
6277 -273 135 -657 24 -601 -302 -46 -36 -83 339 141 57 156 -85 286 -13 -224 -48 -317 -41 -113 -86 136
6299A36M32k67K79o16L57j83j23K17l09r5J80l05K12J4K9J17J37K2j49R4j81M74
6321D72o54J09q1m29N12P1M2j7L75k46J07k71L94m46j24K45n70L23K79k51L7J68
6343D5j84J53J91m07L86l70K72l9q2L6Q4j26P3p5K20O3k39K53J98n91L18k56k28
6366c05M65l08J5m5j56L39n1j54N14j89J6rk09J19j2m32N57l00m92N55J23j86
6388a45K53k27P3K89l9K30m96r0J70l40K51n1k7J68jN6J58l67J66R6n11M48R1
6411A55o01N70n19J26M64p6k93K97r1K50Qo08N14pm13M51n55L35l0J76O4j29J66
6434B54J33n27r4N16k77J41j64m83M39j67Q7K05l13N66j32l97M77m97L45k9m96
6455d13P68m98k89Q40p47L31K98o40Q37l72k54M62m07n2L66o71L31qk84K33J65
$$ plain form
6299 136 568 301 580 -36 321 138 15 232 -77 -172 8 -297 -85 -71 -42 75 212 234 85 179 -2 472
6321 472 -182 -73 -154 -583 -71 0 42 25 400 154 261 -10 384 -62 -186 59 -511 -188 91 -160 -123 45
6343 45 -139 14 205 -202 184 -186 86 47 -35 1 85 -41 32 -43 177 240 1 254 452 -139 179 -77 -305
6366 -305 160 -148 -133 -178 -334 5 -46 -200 314 125 141 132 -77 42 30 -402 155 -145 -637 -82 41 -145
6388 -145 108 -119 -46 243 204 434 -62 -152 18 -322 -71 -122 -149 19 18 74 232 -135 31 127 -384 64 155
6411 155 -446 124 -395 -269 195 119 -174 123 32 282 290 -318 196 189 -224 227 -328 7 -23 153 217 88 254
6434 254 387 -140 -234 282 5 146 -18 -501 -62 -229 -142 63 -250 316 184 -213 264 -233 112 83 -413
6455 -413 355 -143 -432 408 -339 -8 290 -350 487 115 -139 323 -84 -136 230 -441 -110 -118 -402 -169 -4
6476dK91m9l58L89J31m27K71O2k93J51l46j79L56r9N32m72n1Q20j070L40K25l73
6498a53K93Q0n42K59k23j6M44k74K54j32j5j8L24k71M79o77L04N3n5j5l5l53L32
6521D3l78K78M73l62J51J18m42N35p46n1O00q16J70L96k21L74K20k80K50r3K31
6542D50j93o88M60l82J86L05m71K00L06n49M13n8J66M59n99j55N41o78J71%l51
6563d67M55J69l56M79k80N46k80m51N17q4n03M24k40l77M61k29L63l67M23k75
6583g2K59m28M27l67M99n8p24P19m97M1M11l46K57J38k46L59N4l54Q2j86k10p3
6605c15K70K0q1k13K82N3l08P83l80O2l5l91L05l33j49L88j18J45k22J62J52K2
6627I9k34L88l52J34J29l21o1J85j13J90l12QL55l5K18O7m81N44l73L06M4n17
$$ plain form
6476 -4 287 238 -120 269 400 -27 244 306 13 164 -182 -361 -5 -104 428 -44 -95 725 -345 -5 220 -153
6498 -153 140 220 -322 -63 -286 -302 142 -132 122 -10 -25 -43 281 10 489 -188 116 169 114 99 64 -289 43
6521 43 -335 -57 416 54 205 323 -119 416 -330 -381 219 -597 -427 -31 -252 122 342 62 312 219 450
6542 450 257 -431 29 -353 -167 138 -333 -133 173 -376 37 -21 145 604 5 -150 391 -287 -116 -116 -467
6563 -467 -12 157 -199 280 0 546 266 -185 332 248 -255 169 -71 -448 13 -216 147 -220 203 -72
6583 -72 187 -241 186 -181 318 260 -464 255 -242 -201 210 -136 121 259 13 372 426 72 154 -32 -242 -315
6605 -315 -45 -25 -106 -319 -37 16 -292 491 111 173 138 -253 52 -281 -430 -42 -160 -15 -237 -75 77 99
6627 99 -135 253 -99 35 164 -157 -218 -33 -146 44 -268 -260 95 60 278 345 -136 408 35 341 385 -132
6649a32m3R7J00N0J53l47L92j77J62O6j02p4o1j29o0k17L99J73l01k02L69o7J15
6672A64k9l49N31k33k12K9r0j36J27Q5L58l89K5L00j35O0P4k85M5N2j37L84l40
6695a01j91K72j50J22K80j69M76m63j60M4K12k32J28l34K23R9j68lj03J66O9j5
6717BR0L90p69L47j15m5o2QN8mq3J40J45k76N38n87Q43m50k89K11q0j8J20l10
6741a96J41K0j81K57O9j26N69n78N3j11J93k80q4j3R2R2m49P92k27K09l9j96J59
6764A66k24q8K22k03j85M87J46o58L49k2K00l03L44q4n06M28M5k67L06j58p8J85
6786A02l22L8L48m35N59l32NM27l21l06N55q78K14M87n89M92n98N16J78j58J34
6807A16K1k11K89L2n93J83j2j40M75m78L62j4p4L89l69K84J94q45J83ML4J32j59
$$ plain form
6649 -132 -175 -78 22 72 225 -122 270 93 255 321 219 145 84 -45 -105 -322 77 250 -51 -253 116 49 164
6672 164 135 -214 317 84 -128 -99 -189 -325 -198 -113 245 -144 -119 181 46 106 180 -105 -60 -8 -145 239 -101
6695 -101 -292 -20 -170 -48 232 63 539 76 -84 -40 172 -60 68 -266 -43 56 -112 -115 -218 -52 17 2
6717 2 92 482 -287 60 -55 -100 -162 -154 -96 -100 -183 -43 102 -174 364 -223 620 170 -119 92 12 -6 114 -196
6741 -196 -55 -35 -216 41 110 -16 553 -25 28 -83 110 -170 -254 -267 -175 -83 -532 260 33 242 203 7 166
6764 166 -58 -146 76 -127 -312 175 321 -337 12 -10 190 -113 231 147 -359 69 114 -153 153 -5 -83 102
6786 102 -220 -182 166 -269 290 -42 -37 390 69 -237 318 -560 -346 141 -448 44 -554 -38 140 -18 116
6807 116 137 -74 215 247 -346 -163 -175 -315 160 -318 44 30 -44 345 -24 260 454 -391 -208 -204 -170 -38 -197
6830a97k77P26j87p0k9l90P36J38l37J52n94M70l12m88N50M3l29L89KJ82J52m33
6852a03O1O11q62O04j45m54K96l64M27k60j29O49k58j71K07k82J67k54J81P5k72
6873b76N5J94j33O9J82k55L75K4P2J51o47%K59l18K26Q6l90L99l74J78N67o56
6895b12J38L57n69J38j21O1K64k46j4J41l69O29j63j7M24n49P7J35j61L30l90
6916a17j71L28m0Qm5j45L95q7R3k17J1n8K53n26M30j25k58J91r6nK65l7k06L75
6940B16k07J96K89q08L28k96N0M28m43L90J4l43K08K31j93J07K51k01J14k32k73
6961a74N1RK08j38k1J64k39L70M0n70L01K24l41J21m1k01m6J0L37j7n5K82L0O2
6985C66k99k53M64k23k34J38j75j9O6j29M50r1j28K59J48r1r4m37j56j37Q2K86
$$ plain form
6830 -197 -474 252 65 -5 -34 -424 312 450 113 265 -329 141 -171 -659 -109 -66 -395 -6 -4 178 330 -103
6852 -103 -42 569 -293 311 166 -288 8 -356 71 -189 -318 331 73 -98 109 -173 -6 -260 -79 -4 -276
6873 -276 -221 -27 -160 -91 91 -164 211 235 307 458 -189 -189 70 -248 -22 64 -326 73 -301 -123 444 -212
6895 -212 -74 283 -286 -148 -269 -208 56 -190 -204 -63 -432 197 34 17 441 -108 -31 104 -57 273 -117
6916 -117 -288 40 0 8 -37 -182 213 126 219 2 13 -45 208 -318 112 -13 -271 -80 -176 -181 84 47 -159 216
6940 216 9 205 494 -314 14 -282 -232 196 -247 143 157 -186 22 253 60 167 418 217 331 99 -174
6961 -174 -123 -114 94 -44 -65 99 -140 230 270 -300 1 225 -116 5 -36 -237 -283 -273 64 47 -8 274 304 366
6985 366 67 -186 278 55 -179 -41 -216 -235 -169 -298 152 61 -67 192 340 249 155 -282 -438 -575 -493 -207
7007b07K53m19L11K43m83O52j80m97N66J24m74J18k96J20p9J8K00m75K84L73q3
7028F9L9J77p9J47l68p7J64l61L26L5n39O48l78J81L64o38M04n5o0Q2k30J49K37
7051B37n64jK53j51N75l99K67o7r9J01Nn77M89j75l19L12J99N7K03o10M35j10
7073F1j13L78j59j26J10n3J21m3m77L52j35l11Q88m52k91M23P3R8l30p5J15j06
7095e2j40K44l74N14o5k39K73o7k23J86l81M76L4m35J27k2j20J11k60M98J42j79
7117D8jJ10n17N28o88P88k41m09M01O1k49K39j91O0K34k54L19J90n27O5p6R4O5
7140D9r5j27M51o98L06J92J81j50o0J49j07m60K94j07JN20k96J3Kk92M03R9n32
7163b64N55J38m96J66R9m92K70k44J33o9j14M63R2l47L87l35N37p98K62L34m77
$$ plain form
7007 -207 46 -373 -62 181 -302 350 170 -327 239 363 -111 7 -289 -169 -248 -230 -30 -505 -221 152 69
7028 69 108 285 206 353 -15 -92 72 -289 37 72 -467 181 -197 -16 348 -290 114 59 -1 81 -149 0 237
7051 237 -327 -328 -75 -226 349 -50 217 150 51 152 157 -420 69 -106 -425 -113 86 143 346 -264 171 61
7073 61 -52 326 167 41 151 98 219 176 -301 51 -84 -395 493 41 -250 173 246 344 14 -61 54 -52
7095 -52 -192 52 -322 192 127 -112 161 94 -129 57 -324 152 186 -249 -122 -144 -264 -153 -413 85 227 48
7117 48 47 157 -360 168 -520 268 27 -382 19 80 -169 70 -121 -61 173 -81 238 428 -99 -34 -110 -16 49
7140 49 -46 -173 278 -420 -114 78 259 109 49 198 91 -369 -75 -182 -181 339 43 56 58 -234 169 268 -264
7163 -264 291 429 -67 99 198 -294 -24 -268 -135 -204 -318 145 237 -110 277 -58 479 -319 -57 277 -200
7184b00k63M98k69P1K44l23N51j98j08L4j65QK95m77M27j65k11K96l56N45j87
7205D7R5K51n3j40k86J11j69K49l70L80j14l2L36n07K39n9J79M3j53k20N58o06
7227b21J63M9k77K44j72J1L63km8L25k78k11K95m57R6q1k10K57J6J63j14m02N81
7250I0K99o56L84N2m57N89k14k50K25m33K64j1J12j64o0N5M39m76J30L44l05k01
7272b44K22j94l9K23k4m8rM5J3l0j66L15j36J86j93kM7k68J43K07k43L93n14L44
7296B8j2k44L05J87m28J43k8k52M78k61l6J54q9J29N3m07M04l00Q5L1Q4j89J93
7319B8m76K28L7J34L99l49L71k6n43L16j18L26l29qK0J19l10k6K36r0N77n03l3
7342b0L7L45n62J7NJ03L45n98M52k44L13J88l93O3K0j7r1j42j65L8K89k20J91
$$ plain form
7184 -200 -463 35 -234 -163 81 -242 309 111 3 37 -128 -120 175 -302 125 -40 -251 45 -311 234 47
7205 47 142 393 340 200 -86 25 -144 105 -265 115 1 -31 305 -202 37 -22 157 200 47 -173 385 -221
7227 -221 -58 -9 -286 -42 -214 -203 160 158 110 435 157 -54 241 -216 -120 -201 -411 -154 -138 25 -89 -491 90
7250 90 389 -267 117 169 -288 301 87 -163 62 -371 -107 -118 -6 -170 -230 -175 264 -212 -82 262 -43 -244
7272 -244 -22 -216 -255 -32 -56 -104 -113 -68 -55 -85 -251 64 -72 114 -79 -81 -34 -302 -159 48 -195 198 -316 28
7296 28 16 -228 77 264 -164 -21 -49 -301 177 -84 -120 34 -55 74 127 -280 124 -176 -91 -60 24 -165 28
7319 28 -448 -220 -183 -49 350 1 372 346 -197 119 1 327 -2 -10 10 129 -181 -207 29 -61 516 13 -20
7342 -20 17 362 -200 -183 -178 -75 270 -328 124 -120 193 381 -12 51 71 54 -37 -179 -344 -306 -17 -237 -46
7365d6L64p7O1l10K36k23K08p7k97M0j18j0R0K5NJ96j29K77p9K39k44k60n1J18
7389f2l36M69m53J78R6mJ56j42J92L27j4l67j4pK72j17m68KK71k74K44j72q0R28
7413F25o01Rj31O1M82n20J73j03j88K62j58k91M43j72K55J36j64k0M3o4j5O3l54
7436b29M15l55P9M7L7l7M08n26K54j5P0j78N5l65O56k85j34K47l07K02M5j72P45
7459F57q01N86m29l42N19p06K99L17j48j79L27m94P35k50k2R4N7K1k48n5k54J57
7481a59j53M35l27M16k93J32M8J67m99O32l05j88N1j80K19J24q7k72J51k19O34
7502C27n53K2O57l43K53j82p41N92k22K60J70o33K59K31N2l23L18k52K90l6k7
7523A19j96k66N94m66K03j20j21L54K42n06M37N9o61O40k27l24L01j48q7J97l82
$$ plain form
7365 -46 318 241 302 -8 228 5 213 136 -161 -121 -239 -249 -159 -134 -129 67 -62 215 136 375 131 -129 -180 -62
7389 -62 -398 71 -382 -204 -108 -112 44 -98 94 421 407 40 26 19 291 174 -294 -292 -21 -295 -51 -223 -303 625
7413 625 24 33 -98 -37 445 -75 98 -5 -193 69 -89 -380 63 -109 146 282 118 98 141 77 62 125 -229
7436 -229 186 -169 -90 -43 -6 -43 365 -161 93 78 148 -30 25 -340 316 31 -103 144 -163 39 84 -88 657
7459 657 -144 442 13 -329 190 -516 -217 100 -48 -227 100 -394 341 91 69 163 220 241 -7 -62 -316 -159
7481 -159 -312 123 -204 212 -81 51 99 266 -233 399 94 -94 -43 -223 -4 120 33 -239 -88 -307 327
7502 327 -226 -204 453 110 363 181 -560 32 -190 70 240 -393 -134 97 149 -174 144 -108 182 146 119
7523 119 -77 -343 251 -215 -12 -132 -253 101 343 -163 274 333 -328 312 85 -239 62 -86 -173 24 -358
7544c58M40M8m25Q42p37M05K73m38M41n13k97M57k90j20J35K40j97N1J88l0q9
7565B6kJ9j36K2L9j80N07l04j25M4P5J69k46J35J3J3j49L62n31O7J51k54K11j69
7589b43L56l16J13j76K06%K47k44j51K86m17L68J7k5j28L71m01J46K15M2j08l37
7611a79J66R1l50L15l80L13l92L49k53M00j4K97K2k28j15M0j7j97Q0J84p3l42
7633b83L65k49L38k54M57k72j1n94L23M24o99M43j88k08N12J43m26K7L17J30J42
7654D37p34K45Op1L5j08K05ol03K81K9N9K46j58j74Pl9j86j19nK39j15Q0L59k67
7679e7N2J04m38N42L3k41j62p7o7K05P2K4j44P0M4J12k3J59j38L7Q4j48k24R7
7703h4j32M00l64J45N1k2R4L24l39m2O9j23o4j33K88p3K26l14N0L6M70r4j29M3
$$ plain form
7544 -358 82 130 -295 547 -190 215 488 50 491 -22 -319 138 -152 -272 -137 103 -94 -43 145 115 26
7565 26 24 43 -93 -71 -32 -212 295 -9 -134 -90 -15 154 -92 43 56 69 -80 282 -249 -182 -31 -285 -74 -243
7589 -243 113 -203 -90 -266 -60 -60 187 -57 -208 78 -339 29 46 21 -107 264 -137 9 224 266 158 -179
7611 -179 -13 78 -272 43 -337 -24 -416 -67 -320 80 66 363 385 157 42 82 65 -132 -52 132 59 -283
7633 -283 82 -167 171 -83 374 102 91 -503 -180 244 -455 -12 -200 -408 104 247 -179 -152 165 295 437
7654 437 -297 -52 -46 -117 -82 -190 15 9 -294 -13 16 75 321 163 -11 -4 -43 -229 -348 -353 -114 -229 -149 210 -57
7679 -57 -5 99 -339 203 236 -5 -167 -244 -311 -106 -34 -10 -154 -84 -40 72 49 208 70 107 191 43 -181 -84
7703 -84 -216 184 -180 -35 16 -6 88 412 73 31 100 -23 -87 -220 68 -5 221 -93 -43 -7 463 369 240 283
7727B83l32J74r2j75K14k98L72k5n50J23J05K00L35q3j56K17l2j09K0n18J44k
7749a85j73L70l08L05O2j50J19N3j28j6q6K37k05k12M94n23Q8K42l27M83k35n0
7771a45K91k94O6m0J79P5l08k59J42K22k85K08R2J74J11Qj11K03m32K51k07P8
7793A9R8j61k70K50Q5J72J06q15N02m1L17o0k98M4k0j80L40j69p1M09k60J08j37
7816c2j04O33n78J38J70k05k4q2n4K27j38J35Oj84o1L61l95L96m39j77K19k15
7838d03N45M5m04K00p2J0N63m06l29L80j95J62m62J03L66l32J03M15k45k3K92
7859C13j66o1M1l3j13Jj17K38k92K09Q8j92L71m40K34o4j21J29l2j05K62l74k91
7882e15N56j37r1n7j2O9J52J48J17k88K16l1J04l42Q5J25k30RM2k05J01P3L48
$$ plain form
7727 283 -49 125 33 -142 72 -226 146 121 -429 -306 -201 -1 334 251 95 312 280 171 191 -327 -183 -185
7749 -185 -358 12 -296 9 71 -79 40 93 -35 -51 -137 100 -105 -317 177 -346 -258 -16 -343 140 -95 -145
7771 -145 146 -148 -82 -122 57 132 -176 -435 -293 -71 -356 -148 -56 118 229 237 126 329 -103 148 -59 19
7793 19 117 -44 -314 -64 21 193 299 -516 -14 -55 262 202 -96 -52 -72 -252 88 -81 -152 257 -3 105 -32
7816 -32 -136 497 -81 57 227 22 -2 -84 -138 89 -49 86 92 -92 -153 208 -187 209 -230 -407 -188 -403
7838 -403 142 187 -217 -17 -89 -79 484 78 -251 129 -66 96 -366 -263 103 -229 -126 289 44 21 313
7859 313 147 86 127 94 -19 -18 -135 103 -189 20 108 -84 287 -153 81 17 -104 25 -7 -112 150 -224 -515
7882 -515 41 -96 -187 -244 -256 -187 -35 113 230 -58 158 127 231 -111 -26 99 -131 -122 -80 -285 -184 -111 237
7905B37j32o7k8r6J00N0l5k74N8M77m58J54P2J14k21L25j50k97L14k64J18j81
7927a84j11J80m4L71j63j9K56j92Q8j83J2K3J34l89J37Kk91P0J75R8j33K57O8
7950A62m9m35K67j40K41l1K15k38j05l7j12K40k55N52q4J5j32O2k75K29l19L52
7972A23l26J0Q0l3L09k45L29l58K82k7l20k6m9J12J22K8j63K4j42M30m72K53O2
7995CK58l88o9j0J52n8J0j5K43j59k0J00L32l89J13K74m55J20j51N0P6k90K47
8018b6m9l0J36j34MM40l2j15j51j62J01q8k54K56j90L4L18j59K31K4o5N44n56
8041G7j25J77l28M29n54M00k12J01O9M0K96j58l8l00L08q4m0J0k67n7K92k46J23
8064h7R4P6j40J10Jk2K9QM28m69Kl88K30K1k8K05j24j83M53J23k34J76j78l4j04
$$ plain form
7905 237 105 38 10 -86 14 64 29 -245 -187 290 -168 -14 58 172 -49 276 126 -171 143 -121 -3 -184
7927 -184 -295 -115 -159 212 49 30 286 94 182 -1 11 34 168 -221 -84 -82 -373 -303 -128 -30 -163 94 162
7950 162 113 -322 -55 -195 46 15 230 -8 -113 -150 -262 -22 -277 275 191 206 74 136 -139 90 -229 123
7972 123 -203 -193 -113 -146 163 -82 247 -111 171 144 -176 -202 -251 -139 -17 11 -152 -128 -270 160 -312 -59 3
7995 3 261 -127 -196 -206 -54 -112 -102 -117 126 -33 -53 47 379 -10 103 377 -78 42 -109 -59 17 -273 -26
8018 -26 -75 -105 31 -103 -99 341 309 194 43 -119 -18 -106 -360 -104 -294 -260 58 -101 130 154 89 633 77
8041 77 -48 129 -199 230 -324 76 -136 -35 34 74 370 212 174 -126 182 98 58 68 -199 -256 36 -210 -87
8064 -87 7 83 -57 53 54 32 61 69 497 28 30 -358 -128 -107 -135 70 -54 -237 216 339 105 281 103 69 -35
8089c5q1l8L5K80j22o4o9N90n36M7L69o29M86l51j28K34k00K89k65K78J87K2j83
8112A16J40o1k80K45k27J96k92j15N15j84j42j2j52P28l43L3k84K51Q7m21r3J40
8134a55l4k56N70j81o2l0K03J04k09O9L28n79L09k05J91k78J27p7L11k8qo8pL8
8158G3m8j75J79r3O14m86j02j6q4R1L2J1l45M12q3k67N12m63M39q2j40m5J73m2
8182F5j70j73N02n1nl64J72j2K05
$$ plain form
8089 -35 -116 -154 -119 161 39 -25 -94 496 -40 7 376 -253 233 -118 -246 -12 -212 77 -188 90 277 299 116
8112 116 256 195 -85 160 -67 129 -163 -278 237 53 -89 -101 -253 475 132 165 -119 132 219 -202 -295 -155
8134 -155 -189 -445 125 -56 -118 -148 55 159 -50 19 347 -232 77 -128 63 -215 -88 -165 146 118 110 42 35 73
8158 73 25 -150 29 -64 550 64 -38 -54 -138 -47 -15 -4 -349 63 -20 -287 225 -238 201 119 -21 -66 107 65
8182 65 -105 -278 224 173 168 -196 -24 -36 169
8191A69
$$ Imaginary data points
##PAGE= N=2
##DATA TABLE= (X++(I..I)), XYDATA
0@%%%qJ6j6K4l2M0n6P2r6J20j44J78k18K64l12L68m40N20o03O96q05R31j066J210
27F43j376J566j774J997k243K518k819L148l507L902m336M811n333N907o541P242
43C805q018Q884r850J0934j2168J3584j5222J7144j9437K2229k5717L0214l6258
56a9876M4861n8151Q1514j34132M44240k9053q81372O40124K47232l89244k02099
67b55956K52407J35520k36068m4479K46807q8814M1718o6490r9342L12686p8214
78A19775l27796K39759J08804j48456j49148O1690K91723k46677k58811M66497
88A57360M8073l27027O9192J54503M0565j75155r3190K03264q0809p3113P1992
99d345j02753J75419K6915k93429K33259J58992k50082J9675Q9389l303n0117
$$ plain form
0 0 0 0 0 -8 8 -8 16 -16 24 -32 40 -56 64 -80 98 -120 144 -168 200 -240 280 -323 373 -432 499 -567 643
27 643 -733 833 -941 1056 -1187 1331 -1488 1660 -1847 2055 -2281 2530 -2803 3104 -3437 3805
43 3805 -4213 4671 -5179 5755 -6413 7171 -8051 9093 -10344 11885 -13832 16382 -19876
56 -19876 24985 -33166 48348 -85784 358456 329403 -551969 88155 335387 -53857 -255956
67 -255956 -3549 131971 -104097 -148576 98231 9417 51135 -15355 -114697 197989 119775
78 119775 -208021 31738 140542 -7914 -157062 -95372 196351 -50326 -309137 157360
88 157360 205433 -121594 -52402 102101 142666 -32489 -125679 77585 -3224 -76337 -4345
99 -4345 -107098 68321 95236 -198193 35066 194058 -56024 -36349 53040 49737 -380
110c80n7456R1903p2460m3625J15908j12603R4153J03763k65743J62114K11621
121B27195k78583l9781J50047J0535r9909j14452J86381L8921k22665J23522Q6447
132F7658q0104N1425o4654K5915R6612r1151j3267k8103K8098Q6403k07750M9575
144g9343K32762k36130m4526K62488n2362j48168K6258J53632m7217k09125J65017
155B3286P4459k25062J01531O8142r9071Q7466l8365l5908J06958l0461k5047
166G928j7539J5512O4931j25882M660J17946j30475L220R8331n2050J7782j1804
178g440J9389N8223j03464M5918N9672j36881N1792M4656p6980M5081k4076q381
190c2491N9238l7828L2973l309m1764P8497m4914k3396N3631r4148L8196N7479
$$ plain form
110 -380 -57836 34067 -38393 -82018 33890 -78713 15440 119203 -146540 15574 227195
121 227195 -51388 -91169 58878 69413 -30496 -144948 41433 80354 -142311 -18789 67658
132 67658 -12446 38979 -25675 240 96852 5701 -7566 -35669 -7571 78832 -128918 -79343
144 -79343 153419 -82711 -127237 135251 82889 -65279 -39021 114611 67394 -141731 23286
155 23286 97745 -127317 -25786 42356 -56715 30751 -7614 -43522 63436 32975 7928
166 7928 -9611 5901 70832 -55050 -50390 67556 -62919 -59699 38632 -13418 4364 -7440
178 -7440 11949 70172 -33292 12626 72298 -64583 -12791 31865 -45115 -34 -24110 -32491
190 -32491 26747 -11081 21892 18583 -23181 55316 10402 -12994 40637 -53511 -15315 42164
202D2164j07236M8107M0108m9442L5169p794K7438M582p0121P6659j0961p8176
214d9503Q2089m1467m3510P1905m3622J3188K5574m4171N8367j1878j7636M6932
226D6268p1528K6676M5986r7701L8862K9725n9319L3182k455K0428J1413o2851
238d1314P7457Q391q2603P3977j8621n1745N2872l8921Q466J8883n4179N5862
250H525K204k7471M9950m4987K3335M1707q8497M0015L0276o8901K4869p066P421
263h620K1892o0055N9104K0729o9379P1551q710m7490N4574m0750J072K5751o0345
276d0676L4937J863k1967M9562n0512J8971N9567p2397L4359K2715n8788M3093
288B0727k6048j7522M4203n8645K2707K8439m8527N6359j5015k7437O7311m6143
$$ plain form
202 42164 -65072 -16965 23143 -26299 8870 1076 28514 33096 -37025 39634 28673 -49503
214 -49503 32586 -8881 -52391 19514 -24108 -10920 14654 -29517 28850 16972 -664 46268
226 46268 -25260 1416 47402 -50299 -11437 18288 -41031 -7849 -10304 10124 21537 -41314
238 -41314 36143 44534 -38069 35908 17287 -34458 18414 -20507 -12041 6842 -47337 8525
250 8525 10729 -16742 33208 -11779 11556 53263 -35234 4781 35057 -33844 -8975 -16041 -8620
263 -8620 13272 -46783 12321 33050 -36329 35222 26512 -20978 33596 -7154 -6082 19669 -40676
276 -40676 -5739 -3876 -25843 23719 -26793 -7822 51745 -20652 13707 36422 -22366 20727
288 20727 -5321 -22843 21360 -37285 -14578 13861 -34666 21693 6678 -20759 46552 409
300D09k884L5030n0891L1260k0156l4570P0700n3988j0537O7611n3561K8264K2985
313B9672m6777N3017k6352k6915M9169n0496P474J2618m1213O0426l0883l1768
325d2028Q2327m4297k291M6826n3827L4126k901m7158N3600l7360j5956L9631
337A0692m6326L9479R197m6831O8493k1125k7627N4863m5751R989J2142n5945
349c8750N4291k0230m1293O7005l7987K19M7132m5253L3875K877l4108M7285m2649
362g586l960L4840o6525M0408J6790o2927O1718o756k4651N3636l8520J3699J9272
375B9438m9132M3738k2530l5585N4519m7898M211M3411n0214L8749O775l2433
387a6951N5834l7239o348M5010o5580K1471J9858n3273M0497j5028j3495M7394
$$ plain form
300 409 -2475 32555 -18336 12924 -7232 -41802 28898 -25090 -35627 31984 -21577 6687 29672
313 29672 -17105 35912 9560 -17355 31814 -18682 -11208 1410 -39803 20623 -10260 -42028
325 -42028 40299 -3998 -6289 40537 -13290 20836 17935 -29223 24377 -12983 -28939 10692
337 10692 -35634 3845 13042 -33789 34704 13579 -14048 40815 -4936 5053 17195 -38750
349 -38750 15541 -4689 -45982 21023 -16964 -16745 30387 -14866 19009 21886 -12222 35063 -7586
362 -7586 -11546 23294 -43231 -2823 13967 -48960 12758 6002 -18649 34987 -3533 10166 29438
375 29438 -19694 24044 1514 -34071 20448 -27450 -23239 20172 -30042 8707 15482 -16951
387 -16951 38883 1644 -4704 40306 -25274 -3803 16055 -37218 3279 -11749 -25244 22150
399B2150l9652K3523K2899m6510M9149j6263l5495M9564m7418k142L8383n3226
411c5038L0084R012l0745N2119k4606o103M0877m4106K1031O507m3416M0709k8363
424a2038j9097M9274m4290J5187L1107m2585M1906j339k7519M1810l5985k432
436f001K6553m6839K6222j253l3120M7319k1588l557L7330l8290K9225J0220m4130
449a7909M3856k1184k9887M2477l4281J108K0809l1778L4912l474j6621M0187
461B8215l1826P881K6889m9857K7154K575m1520L6994j6866r250L2559l3589K3990
474C349J7857l4997L5598r162k1378K8999k9865O452J1720l8667L1448l341k0512
487b2499M1775k7575J613L7568l7703J4512J1706l1060K0963j6072o557K2774
$$ plain form
399 22150 -17502 6021 28920 -17590 31559 15296 -20199 29365 -18053 -20195 18188 -35038
411 -35038 -4954 4058 -26687 25432 826 -5277 35600 -8506 12525 19032 -24384 16325 -12038
424 -12038 -31135 18139 -26151 -10964 20143 -22442 19464 18125 -9394 32416 -3569 -6001
436 -6001 20552 -26287 -65 -1318 -34438 12881 -8707 -12264 25066 -13224 16001 26221 -17909
449 -17909 25947 4763 -25124 17353 -16928 -15820 4989 -26789 8123 4649 -11972 28215
461 28215 -3611 4270 31159 -18698 8456 11031 -30489 6505 -10361 -19611 12948 -20641 3349
474 3349 21206 -13791 21807 12645 -8733 20266 -9599 -3147 8573 -30094 1354 -1987 -22499
487 -22499 19276 -8299 -6686 30882 -6821 7691 19397 -11663 9300 -6772 -13329 9445
499I445l4677J8087J7362k8713L2333p542j4532L5515k8699P76K0963l7536J7972
512G54K59k4128L1864j8068p524L0278j9288J4250M425k1009K9960j9525j3246
525a0998L0907l4645J968J9621k8205K5004j941j9515L4863j4212j866J7951k6509
538g577J7906j065k8509K8780j4184j2630K2011k1623K0024Q102l0833L6166k743
551A3825k3673K9374j9006m836J3085k5817J9891k104k2612K7439j3503M486K4562
564B1111l3049J7188J4231k8283K1248r980j2989J9528k7857J3919J8041l6794
576b3686K2247J0789j5205K1331j6759L517J6090k9302J8784j595k7503K9490
588H198j6389r465L0942k3647O567J4242j6285K5340j5878j4347L3590k9467m529
$$ plain form
499 9445 -25232 -7145 10217 -18496 13837 6295 -8237 27278 -1421 -645 20318 -17218 754
512 754 1013 -23115 8749 -9319 -16843 13435 -5853 8397 12822 -8187 21773 2248 -10998
525 -10998 19909 -14736 -12768 6853 -21352 3652 1711 -17804 17059 2847 981 18932 -7577
538 -7577 10329 9264 -19245 9535 -4649 -17279 4732 -16891 3133 11235 -19598 16568 13825
551 13825 -9848 19526 520 -4316 8769 -17048 2843 739 -21873 5566 -7937 -3451 21111
564 21111 -11938 5250 19481 -8802 12446 2466 -10523 9005 -18852 -4933 13108 -23686
576 -23686 -1439 9350 -5855 15476 -1283 2234 18324 -10978 7806 6211 -21292 8198
588 8198 -8191 -17656 13286 -10361 -3794 10448 -5837 19503 3625 -10722 22868 -6599 -11128
601a1128K3317k6215J0159j746q821L0636k1880k76K4657k8103K2105O015l6157
614a7437K7135p852j8356K3405j8124O574L689k0380M2460j0262l0231L5830r116
627G335m040Q128k5841K2675r921k2971L9136k1635j0905L0728k4363J8916J4277
640B1519l4106K0765O28q292J0155k9252J8921Q390l9404L5229M336k5203K4418
653H104j2508J3101J5450m0905K5757P189l4499K4464r569r058J7028k4467J9940
666B7J1725k2738K3849j4151J61L2052m1986L878K5414l4924J3967J538j3147
679a4335K2984k6003J0809L3712l3649P765R352j1617J9532k6411L60K0954l7648
692b4195K0524J2593l1972L2713r436j5986M1964j8839j1985J2664r305J6119
$$ plain form
601 -11128 12189 -14026 -3867 -5613 -14434 16202 -5678 -5954 18703 -9400 12705 18720 -17437
614 -17437 9698 1846 -16510 6895 -11229 -4655 -966 -21346 21114 10852 -19379 16451 7335
627 7335 3295 11423 -14418 8257 -1664 -24635 14501 -7134 -18039 12689 -11674 7242 21519
640 21519 -12587 8178 8806 514 10669 -18583 338 8728 -30676 4553 8889 -16314 8104
653 8104 -4404 8697 24147 -16758 8999 16188 -18311 6153 -3416 -12474 4554 -19913 27
666 27 11752 -10986 12863 -1288 -1127 30925 -11061 -7183 18231 -16693 -2726 -1188 -14335
679 -14335 8649 -17354 -6545 27167 -6482 1283 10635 -982 18550 -7861 -7501 13453 -24195
692 -24195 -3671 8922 -23050 9663 227 -15759 26205 7366 -4619 8045 -1260 14859
704A4859k2628j0052L4979l5388J8L3508k4809J2464j44j2342L6899k3724j2991
717i351K7891k9326Q102J0575k8194K1090n259j0698K5094j1744J0799k620k1440
730a5081M2611j5851l3095L6427j9293j0944K2104k0961J2722R99j5559L0935
742A5014q727o711J3182k0458J9095O41k9979K4523j3383j1133K8454k4366Q909
755d939J9167k9121K2821R790k0328J2413j3406M225R489k6683J6687j770j8028
768a9683K7751j2287l16K1118k8142J7525J5755k8992J5032q402j2551K4173j9592
781h611k931J2966j2645J5095k585j713J8685k7969J0251K5455l5697O424P560
794D285k0006J9967q926q546J9759j4424R993Q554j3744J7320j2499q516K3620
$$ plain form
704 14859 -7769 -17821 17158 -18230 -18212 15296 -9513 2951 2807 -9535 27364 3640 -9351
717 -9351 18540 -10786 -2684 7891 -20303 787 -4472 -15170 9924 -1820 8979 6359 -15081
730 -15081 27530 11679 -21416 15011 -4282 -15226 6878 -14083 -1361 -362 -15921 15014
742 15014 6287 -424 12758 -7700 11395 12036 -17943 6580 -6803 -17936 10518 -13848 -4939
755 -4939 14228 -14893 7928 17718 -2610 9803 -3603 622 10111 -16572 115 -1655 -19683
768 -19683 8068 -4219 -4535 16583 -11559 5966 21721 -7271 7761 -641 -13192 10981 -8611
781 -8611 -11542 1424 -11221 3874 1289 -424 18261 -9708 543 25998 -9699 -3275 4285
794 4285 -15721 4246 -4680 -13226 6533 -7891 2102 10656 -3088 14232 1733 -6783 16837
807A6837k2157k617J0785j7540J7541n644j1658K9440j6232o597K5166j5155J259
820C428K463j3059J3172j0489m152J2520j8338J2084P569j5420K3803q645j6057
833a1121K7343j0150q776R116j6623R641Q05j2440J6419j1408j064J8674j2715
846b299Q816J462j5742J9928p583j2182J5017j7744L884J1799j7937J3672Q90
859A981j0752J9435p320j796Q737j5922J1232n32j6411J6754j1400n939J8548
872F615j4738P463R691j7861J7066M69j2185J4119j3011j182Q328j5629J2129
885A274k241j2911K0272q577n05J4777j7807R817P822j8462J3693o950r526J4400
899E076j4604O053Q489j9321J7302M442j2195J4878j0419N30J0579j7865R956
$$ plain form
807 16837 -5320 -7937 2848 -14692 2849 -2795 -14453 14987 -1245 -7842 17324 2169 3428
820 3428 5891 -7168 6004 -4485 -8637 3883 -14455 -2371 5198 -10222 13581 4936 -11121
833 -11121 16222 6072 -2704 6412 -10211 -570 235 -12205 4214 -7194 -8258 10416 -2299
846 -2299 6517 7979 -7763 12165 4582 -7600 7417 -10327 -6443 5356 -12581 1091 1981
859 1981 -8771 10664 3344 1548 10285 -5637 5595 5063 -11348 5406 -5994 -11933 6615
872 6615 -8123 -660 9031 -8830 8236 8705 -3480 10639 -2372 -3554 4774 -10855 1274
885 1274 -967 -13878 6394 -2183 -2688 12089 -5718 4099 11921 -6541 7152 202 -9324 5076
899 5076 -9528 -3475 5014 -14307 2995 7437 -4758 10120 -299 231 10810 -7055 2901
912B901L8j7149J8183q006m376J7072j7218P771J2247j5685J2149m623p275J5075
926A1104j8961M214J2327k3496J2259N647j1905J5832j0230K147J5128k0070J0866
939D862N097j9361J5671q461p810J7522j7931M870J1390j3813J5237m736p290
952d753J9998j8325J692J3559k2446J0037J105j2967J8385j3090r96J9333j8805
965g273J0406Q064j7693J6557p405r100J6002j8478M656Q094j7717J8854m603
978C64j1389K4037j3633k15J3997j8659J1101r09j6173J9260j3006o080J7584
991F279j6458J0672O094j5263J9883p884p134J8600k0038M065R015k1984J6353
1004B200j954j3541J9247j0562K658J2468j7119J5688q51j6683K0255j3012p061
$$ plain form
912 2901 2939 -14210 3973 -4033 -8409 8663 -8555 -784 11463 -4222 7927 3304 -3971 11104
926 11104 -7857 -3643 8684 -14812 -2553 3094 -8811 7021 -3209 -1062 14066 -6004 4862
939 4862 9959 -9402 6269 -2192 -10002 7520 -10411 -5541 5849 -7964 7273 2537 -4753
952 -4753 15245 -3080 -1388 12171 -10275 -238 867 -12100 6285 -6805 -7801 11532 -7273
965 -7273 3133 11197 -6496 10061 2656 -6444 9558 -8920 -4264 3830 -13887 4967 364
978 364 -11025 13012 -621 -836 13161 -5498 5603 4694 -11479 7781 -5225 -11305 6279
991 6279 -10179 493 6587 -8676 11207 3323 -3811 14789 -5249 -1184 7831 -14153 2200
1004 2200 246 -13295 5952 -4610 -1952 10516 -6603 9085 8234 -8449 11806 -1206 -8267
1017h267J4705j8897J0741N447j7915K1290n961p361K1029j6726L771R741k0169
1030h572J3345l934j2298J6355j5228M505J4165k0596J7592L694j6717K0465j0140
1043B636n573J3433j9815R193L321j8494J8592o408o569J9908j4813O346R974
1056A1731j7346J5311n162j2460J7388j7656K08J5045j9720J1467M201j1060J7779
1069I726r020o05J3712j9346R155L600j8715J5418q125p259J7453j4426O150J0147
1083G865j4928J6072j804j1780J6917j4465k202J0806j6711Q885o20j0061J9359
1096G333j1040n67J6952j6563P932O571j6164J2952p544q873J4069j4135M177
1109d900Q369j4843J6015k12r292J6844j1002o09R486j6633R551j242j4725J6983
$$ plain form
1017 -8267 6438 -12459 -1718 3729 -14186 7104 1143 -6218 14811 -1915 1856 11597 -8572
1030 -8572 4773 839 -11459 4896 -10332 -5827 8338 -12258 5334 9028 -7689 12776 2636
1043 2636 -2937 10496 -9319 -126 3195 -15299 3293 -3115 -9684 10224 -4589 1757 11731
1056 11731 -5615 9696 4534 -7926 9462 -8194 -7986 7059 -12661 -1194 3007 -8053 9726
1069 9726 706 101 13813 -5533 3622 7222 -11493 3925 -4200 -11459 5994 -8432 -2282 7865
1083 7865 -7063 9009 7205 -4575 12342 -2123 -4325 6481 -10230 -1345 -1965 -12026 7333
1096 7333 -3707 -4274 12678 -3885 4047 10618 -5546 7406 -138 -9011 5058 -9077 -4900
1109 -4900 3469 -11374 4641 4429 -4863 11981 979 370 9856 -6777 2774 1532 -13193 3790
1123C790q278m142J5587j2421O930P465j1607J1819o171o742J2398j5241L095
1136c518P231j6423J2363J548r173J5063q153R52J1809j4817P849K251j4779J1150
1150C353o213m724J0475j2059O980O566j0799J3950l784p065J4782j2263j342
1163b143R232j4782N728J529q245J1548p516M51J2909j2273P695M200j2583J1125
1177F875n867o343J0796j3711L280P925j2709J2014O22r014J4114n464j855P502
1191H165j1935P008j845j0338J3826r498m529J4464j0689M851P691j1970J1353
1204F554j660p430J0419j0659O3O339j2881R281K65r093J2895n978J364J0058
1218I537j4341R159L792j5012J2180m243r095J0676q811L479N796j0782J1331
$$ plain form
1123 3790 -4488 -8630 6957 -5464 1466 8931 -2676 9143 2972 -3770 8628 -6613 -3518
1136 -3518 3713 -12710 -347 1201 -7972 7091 -1062 -110 11699 -3118 4731 6982 -7797 3353
1150 3353 -2860 -7584 2891 -9168 -2188 4378 -6421 7529 3745 -3320 11462 -801 -2143
1163 -2143 7089 -7693 -1965 -436 -8681 2867 -4649 -4198 8711 -3562 4133 8333 -4250 6875
1177 6875 1008 -5335 5461 -8250 -4970 2955 -9754 2260 2882 -6132 7982 2518 663 8165
1191 8165 -3770 3238 1393 -8945 4881 -4617 -9146 5318 -5371 -520 7171 -4799 6554
1204 6554 4894 -2536 7883 -2776 -2713 3626 -9255 26 291 -8802 4093 -1885 -521 9537
1218 9537 -4804 4355 8147 -6865 5315 1072 -8023 2653 -6158 -2679 3117 -7665 3666
1231C666j155n417J3278j1093j87R705j5151P133K003j2313J1919o253k169J3769
1245G735j2690M093Q780j0556R139m095n854R877j2876M224O876j5526J1814M99
1259A440j0155J6981p483m057J1618j0131N558P40j1148J1975r111l810J4256
1272F673j3397L525P022j0441J4286l993q706J5317j2041M48R895j6653P451J027
1286D13r665J3766p068j735R435j0630J2132J073j5388J5428n965p881J3228j2996
1300e853J793O277j2034J3988k179r159J5088r170K369Q833j5823R609q70j1108
1314h239J3516r650k414J1975j4543J0043P093j4061J2153k929m350J0355j2846
1327c897L806L945j4966J3720k081r268J3647r851L339J2282j4596Q079L59r648
$$ plain form
1231 3666 2511 -2906 10372 -721 -908 8797 -6354 779 2782 -9531 2388 -3865 -6034 7735
1245 7735 -4955 -862 7918 -2638 6501 2406 -3448 6429 -6447 -2223 4653 -10873 941 1440
1259 1440 -8715 8266 783 -3274 8344 -1787 3771 4511 -6637 5338 -3773 -7583 6673
1272 6673 -6724 -3199 3823 -6618 7668 3675 -5031 10286 -1755 -1307 8588 -8065 -614 413
1286 413 -9252 4514 -2554 -4289 5146 -5484 6648 7721 -7667 7761 1796 -6085 7143 -5853
1300 -5853 -4060 2217 -9817 4171 1992 -7167 7921 -1249 1120 9953 -5870 3739 2869 -8239
1314 -8239 5277 -4373 -6787 5188 -9355 688 7781 -6280 5873 2944 -1406 8949 -3897
1327 -3897 -91 3854 -11112 2608 527 -8741 4906 -4945 -1606 10676 -3920 4159 4518 -5130
1341e130J3877j0145m805J0424j3430P811N188j1749J2102n680o94J5362j5957
1354b826L282P419j4397J0670l075j0340J2044r412L364R032j2885J1234q4q645
1368d619J6196j0560m941J1373j3400M954L007j1446J2214n661l648J4761j0446
1381b216L851O220j2163J1181l965q016J1061j2902J737J0176j3672R612J001
1394A905r657J5194m392k969O912j0892P520Q71j2010J0610q087l529J4772j0962
1408d714L051O551j0794J2860m68r399R313r021M32P897j2919N486r0n980J2817
1423E022p121O90R615j2311Q597M406j4160R301l819o769R514p984J383N076q722
1438g282J1119j395m181J0095r671J461P907j2521N563q02r977J2448n425l124
$$ plain form
1341 -5130 8747 -1398 -6203 4221 -9209 -1398 3790 -7959 4143 -1537 -2231 13131 -2826
1354 -2826 456 7875 -6522 4148 1073 -9267 2777 -6635 -3271 5761 -7124 4110 4026 -4619
1368 -4619 11577 1017 -3924 7449 -5951 -997 2010 -9436 2778 -2883 -6531 8230 -2216
1381 -2216 1635 7855 -4308 6873 2908 -5108 5953 -6949 -5212 4964 -8708 904 1905
1394 1905 -7752 7442 3050 81 6993 -3899 3621 4492 -7518 3092 -4995 -8524 6248 -4714
1408 -4714 -1663 4888 -5906 6954 6486 -2913 6400 -2621 -2189 5708 -7211 -1725 -1815 -7795 5022
1423 5022 -2099 -1409 8206 -4105 4492 8898 -5262 4039 220 -6549 2965 -5019 -3636 1440 -7282
1438 -7282 3837 2442 -1739 8356 -1315 146 8053 -4468 1095 293 -9684 2764 -2661 -5785
1452e785J0591r041M194P564p694N385m649k267P506j0522L222K951j2150J1952
1466A257J011q494J1437n183j042R498q364K256o8p678Q433n135l648P306p953
1481f367N611M094o901R323m059l938J1355r899j020O777j1392M024L561o898
1495e729O048k622O53O704p155O985l6r098J0114m686o200Q821r504R85P296p806
1511e230O005Q84n254R509l707j664M708q063M572o72o644Q103p369j121J0865
1526D922r298M267O252r647P402O36o302O184o294n47M116p371N727p96n326R990
1542C915m478QP243r245N306K507r595Q037m146o458R208n146n9M672o503P443
1558B709k80l466Q026q600O03P043j1209N339J685r759R326k554k743Q247p391
$$ plain form
1452 -5785 4806 -4235 -41 7523 -171 5214 565 -1702 5804 -4718 -1496 1455 -10695 1257
1466 1257 2268 -6226 5211 28 -1014 8484 120 2376 2308 -5370 3063 -2072 -5720 1586 -6367
1481 -6367 -756 3338 -3563 5760 1701 -2237 9118 -781 -1801 4976 -6416 -2392 1169 -5729
1495 -5729 319 -2303 -1650 5054 -2101 4884 4848 -4250 5864 1178 -5022 3799 -5705 -4720 2576 -5230
1511 -5230 775 1659 -3595 5914 2207 543 5251 -2812 1760 1088 -5556 2547 -4822 -5943 4922
1526 4922 -4376 -109 6143 -3504 3898 4534 -1768 4416 -1878 -2425 1691 -5680 47 -749 -6075 3915
1542 3915 -563 -555 6688 -2557 2749 5256 -4339 3698 -448 -6906 2302 -2844 -2903 1769 -4734 2709
1558 2709 2429 -1037 6989 -1611 -1008 6035 -5174 165 1850 -7909 1417 -1137 -3880 4367 -3024
1573c024L686N154q471O962k774n218P645p371J302L977r082Q682o13o244J1424
1588F035o022k152R256q830L171K043q133O579m258k078P924r263M584N791q942
1603d295Q937k118n599R760q293Q57N645j1427O523J045p777J0060m904j502Q308
1618E220p765N575J212q199R569n677m285R313j0649K569N604q446Q324j624m322
1633c581R620o775J171O406j1061N782M80q074R050o352r34P726q949O784L038
1648D331q861J0301l328n079Q863q895J801L497r063Q124k476m916J0381p027
1662b347R19P888r158N397N78o747Q243o864j615P610j0292N608L449q684R363
1677C348k180l274R056q420K799L065r875Q265k739o561Q994o333Q35P153p988
$$ plain form
1573 -3024 662 5816 -2655 4307 1533 -3685 3960 -3411 -2109 1868 -7214 1468 855 -5389 6035
1588 6035 13 -2139 7117 -1713 1458 3501 -4632 1947 -2311 -4389 3535 -5728 -1144 4647 -4295
1603 -4295 4642 2524 -3075 6685 -1608 -751 4894 -6533 -10 1035 -6742 3318 -1586 -3088 5220
1618 5220 -2545 3030 4242 -3957 5612 -65 -4350 4963 -5686 -3117 2487 -5959 2365 741 -3581
1633 -3581 6039 -736 435 6841 -4220 1562 2042 -6032 3018 -3334 -4268 3458 -5491 1293 4331
1648 4331 -4530 5771 2443 -2636 6227 -2668 -867 2630 -6433 1691 -785 -5701 4680 -2347
1662 -2347 -1428 6460 -2698 2699 3277 -3470 4773 -2091 -3706 3904 -6388 -780 2669 -6015 3348
1677 3348 1168 -2106 6950 -1470 1329 4394 -5481 2784 45 -6516 2478 -3855 -3020 4133 -3855
1692c855O868J89o221R834o876k399P603j0151L925K561p769P863l171j660Q699
1707E440p748M101M104r362P610k003o517P479o989P20N366q283P001O00n493
1722c974R809m791j853O690q253L834M53p177P032m084k972Q767p032K928N085
1737D462o883O129m64m563O241o828J30M586q524N122M13n425Q320l140o33O318
1753E261o511M110J438p630O963m239m027O838o347J714L552m924O216m81l428
1768a495P689o410K98M927q449L394O94o039O037l059o58O445n969M142L149o599
1784a903O006k330m006M961n726J130K603o492O266m9m230Q056l634q79N453n796
1800e70K137N83n495M549l482j528N465n891L163L998n110N070l35l267N387n002
$$ plain form
1692 -3855 3013 3202 -3019 6815 -61 -2460 5143 -5008 -1083 1478 -6291 1572 -1599 -3259 5440
1707 5440 -2308 1793 5897 -3465 4145 2142 -4375 3104 -3885 -3165 2201 -6082 919 1519 -3974
1722 -3974 5835 1044 -809 5881 -2372 1462 1915 -5262 1770 -2314 -5286 3481 -3551 -623 4462
1737 4462 -2421 3708 3244 -1319 4922 -1906 -1776 2810 -5714 -592 -179 -5604 2716 -424 -1057 5261
1753 5261 -1250 2860 4298 -3332 3631 -608 -4635 2203 -4144 -2430 1122 -3802 2414 1933 -1495
1768 -1495 6194 -216 82 5009 -3440 -46 648 -5391 646 -2413 -3071 3374 -2595 1547 4696 -1903
1784 -1903 4103 1773 -2233 2728 -2998 -1868 735 -5757 509 460 -3770 4286 652 -227 5226 -570
1800 -570 1567 2150 -3345 1204 -2278 -3806 1659 -4232 -1069 2929 -2181 2889 2554 -713 4674 -328
1816c28mK597o975L589O93m571N982k029o12N510m553L034J132n478N034k805
1832B16l626N128m892q5M225m479M468K92k864O410l856o81M181o146J920J251
1848A462n665M697k494j682N684m587L043L311n459N126m94m443M660m579p00
1863b120L122n414M394q2m040P118k620j078N794n869J950J899n291L724k286
1878g99l077N123m575J319M111m913M282N91k972N454m422p18L889p310L709J289
1894I81o478O287j762j748N858m217K063K237m595N105l027l536N789n862N23
1909b382M367o374L991J072l533O982l998j030N357n868K325J385n952M283k116
1924a491j706N365n758K974L589o192P220j276n031O509m577j096L799o063L635
$$ plain form
1816 -328 -332 2265 -4710 -1121 -428 -4999 983 -1046 -1658 3852 -701 2333 3465 -2013 3021 216
1832 216 -3410 1718 -3174 -3259 966 -3513 955 1247 -1617 4793 937 256 4437 -1709 211 1462
1848 1462 -4203 494 -2000 -3682 2002 -2585 458 3769 -1690 3436 2942 -1501 3159 -1420 -2120
1863 -2120 1002 -4412 -18 -100 -4140 2978 358 -720 5074 -795 1155 3054 -2237 1487 -799
1878 -799 -3876 1247 -3328 -2009 2102 -2811 1471 2062 -910 4544 122 -596 3293 -4017 -308 981
1894 981 -5497 790 -972 -2720 3138 -1079 984 3221 -1374 3731 704 -2832 2957 -2905 -2382
1909 -2382 1985 -4389 -398 674 -2859 4123 125 -905 4452 -1416 909 2294 -3658 625 -1491
1924 -1491 -3197 2168 -3590 -616 2973 -3219 4001 2725 -2306 4203 -374 -1470 2329 -3734 -99
1939i9k78m010P343m140n41N630n947L628K156o286N457l037k912O239o488J293
1955a992L735n989N645K76l612N291l682J007L861p666M710r00n612P476m075
1970a527k080N976n005L825J900n557N991k941j862N672o262N04L061o175N532
1985A052j435l298O394m623K204M895p208L998O47n442N592l441j997M322n981
2000d321M317J294m853O786k772j816O621n802M50K608n716M907j832l915N624
2015A580m704J069N696n794L791M15l549O114m313j403M036o976L422K187o139
2030d568N441j465j721O125m594K216J785n400N623k030m805N453m736o6M355
2045A613m837M007K2k990O092l054r92M367o121K300J763n506L841k240j653N981
$$ plain form
1939 -99 -377 -4387 2956 -1184 -1725 3905 -2042 1586 3742 -2544 2913 -124 -3036 3203 -3285 -1992
1955 -1992 1743 -4246 1399 1675 -1937 3354 -328 679 4540 -3126 1584 684 -4928 2548 -1527
1970 -1527 -3607 2369 -2636 1189 3089 -2468 3523 582 -1280 4392 -1870 -1366 1695 -4480 1052
1985 1052 -383 -3681 2713 -1910 294 5189 -2019 1979 2626 -2816 2776 -665 -2662 1660 -4321
2000 -4321 -4 1290 -3563 3223 451 -1365 5256 -546 -96 2512 -3204 1703 -129 -4044 1580
2015 1580 -3124 -2055 3641 -2153 1638 2053 -1496 4618 305 -1098 2938 -4038 -616 1571 -4568
2030 -4568 873 -592 -2313 3812 -782 1434 3219 -2181 3442 1412 -3393 2060 -2676 -2742 1613
2045 1613 -3224 783 805 -2185 3907 853 -139 4228 -1893 407 2170 -3336 505 -1735 -3388 2593
2061B593m775J997L573n803N253K87m180L553l968M33K638n221L949j336l127
2076d134P051k991j022M879m442J992K044m881L054k597k028M534m118Q97K603
2091H41l642M503p0k149M623m597P47L141o023K596L49m798M318j87j702L713
2107A663k841K228J620k905L395k585k755M642m112j14K245m565M064J154l107
2122a973M959k664q91M816l607M93k93k943L142k356j172K776m136L456L693n126
2138a826M132J59l407M095k370j725J936l617K107J24k691L889j943M63L526k891
2154c9J895P97m079L915k260l151M227l855m86M116k991K037J023j727L204k261
2170C65Q17J419m754K623K2l996L987j617j921M820k427Q50K558l850L244J70
$$ plain form
2061 2593 -2182 -185 3388 -2415 2838 3125 -1055 2498 -1470 -1037 1601 -3620 329 -1007 -4134
2076 -4134 2917 -74 -1096 3783 -659 1333 3377 -1504 1550 -1047 -3075 1459 -2659 -1762 841
2091 841 -2801 1702 1632 -517 4106 -491 256 3397 -2626 -30 319 -4479 -161 -348 -2050 1663
2107 1663 -1178 1050 2670 -235 3160 575 -2180 2462 -1650 -1764 481 -4084 -20 1134 -1973
2122 -1973 2986 322 -569 4247 640 1133 840 -2103 1039 -1317 -2489 287 -3849 -393 3300 -1826
2138 -1826 2306 2465 -942 3153 783 -942 994 -2623 -516 -392 -3083 806 -1137 -674 2852 -39
2154 -39 1856 2653 -1426 2489 229 -2922 1305 -2550 -3036 1080 -1911 126 1149 -578 2626 365
2170 365 1182 2601 -2153 470 492 -3504 483 -1134 -3055 1765 -662 188 2746 -1104 2140 2310
2186B310k887K852l811k81K650l356K553q06k075N290k296m85M246m622J309K444
2202C035m837J990q75j799K980k199Q26J745k947L747K04k829M232l063r06L174
2218B478n037K328P00m136L970p44j656M193k517Q95J910k840L199k737j960M037
2234B083m090J15L519n288L481J335k782M062k093p39L681m063J421P15m322L674
2250G09j760j037L508m074K191K575l819M490j053l744M927k766j392K966m469
2265b748K123O56k689M554l136K08M249m481K432J541m621L532j806k312L893
2280A395m204J366K883m426M170K64l205M475k478J17K098m563K906m01l523M842
2296A716l299j071M583l447K085J846l452L446j669j562L447m489R19K284m608
$$ plain form
2186 2310 -577 2275 -1536 -1817 833 -2523 30 -776 -2851 2439 143 -342 3904 -718 591 3035
2202 3035 -1802 188 -687 -2486 494 -1705 -879 866 -2081 1666 1870 -959 3273 210 -696 2478
2218 2478 -2559 -231 469 -3667 303 -441 -2097 2096 -421 474 2384 -456 2743 6 -1954 2083
2234 2083 -2007 -1892 1627 -3661 -180 1155 -1627 2435 342 -397 3284 -779 642 1357 -2965 709
2250 709 -1051 -2088 1420 -2654 -463 2112 -1707 2783 1730 -2014 2913 147 -1245 1721 -2748
2265 -2748 -625 31 -2658 1896 -1240 -1032 3217 -1264 1168 2709 -1912 1620 -186 -2498 1395
2280 1395 -2809 -1443 1440 -2986 1184 1448 -1757 2718 240 357 2455 -2108 798 397 -3126 1716
2296 1716 -1583 -2654 1929 -1518 567 2413 -1039 2407 738 -824 2623 -1866 -947 1337 -3271
2311c271L426l06k452M398k495P13L044m081K389J80l932M243k948j103L348m058
2327b905K605J413l491M470j307k069M869m313M29K825m841K851o71k724M352
2342A493l335O38L582m283L317Q12l245L708k439j332K808m119J848J037l616
2357c126M053j169j795M598k945J267J772m073L268j341k751M187l774J7L014
2372A202l719K541P67k102L849k139m16K740m162K094Q54m316L039j012j647L664
2388A237k862J371K375l334L327m25l169L571k541p99K288l323K229m3k671M550
2404A781j971o61L843l232J214R91k950K223j660k131L324k876P97K624l320L007
2420A003M68k045L490k493n26J887l702J772J56l359L827r48j084K946j910J002
$$ plain form
2311 -3271 155 -151 -2603 1795 -700 13 3057 -1024 1365 1545 -2387 1856 -1092 -2195 1153 -2905
2327 -2905 -300 1113 -2378 2092 785 -1284 3585 -728 -299 2526 -2315 536 -135 -2859 1493
2342 1493 -1842 -1204 2378 -1905 1412 2224 -1021 2687 248 -1084 1724 -2395 -547 490 -3126
2357 -3126 927 -242 -2037 2561 -384 883 2655 -1418 1850 509 -2242 1945 -1829 -1812 1202
2372 1202 -2517 24 791 -1311 2538 399 -17 2723 -1439 655 1509 -2807 232 -780 -2427 1237
2388 1237 -1625 -254 2121 -1213 2114 1689 -1480 2091 -450 -1249 1039 -2284 -55 -98 -2769 1781
2404 1781 -190 -851 2992 -240 974 1965 -985 1238 -422 -2553 771 -2105 -1308 1316 -2004 1003
2420 1003 1471 -574 2916 423 -103 1784 -1918 -146 10 -3349 478 -470 -1554 1392 -518 484
2436D84J882k783K351j239j796K547l049Q1J436k561K218J104k377L619j631J00
2452C86K416l292R00N46l230K745j106j978L360k601J501J880k614K870k30k240
2468f87K984k078q05J448k986J339K96j962L171j062r45L724k719J254J272l295
2484a051K153r31j607J783k401P63K307k907K439O43j841K981j311o64K044l631
2500a231J266J0k580K977j241j451L412j911Q96J729k464K343p32k008K981k823
2516h27p26J943k654J619J153k384L167p60o86K656k700J064J247l844K084n45
2532a93k319K618j930R63K180k864K955L22k464L448k458j013K397l420J323N35
2548H0k668L235j216o24L182k113O46J562k863K014n70k611L036k682M17J908
$$ plain form
2436 484 2366 -417 1934 695 -1101 1446 -1603 -1522 -86 -2647 -429 675 -1702 1917 286 386
2452 386 2802 -490 410 956 -2274 471 -635 -2613 747 -1854 -353 1527 -1087 1783 1553 -687
2468 -687 2297 219 -586 862 -2124 -785 -489 -2451 720 -342 -1287 2437 -282 972 2244 -1051
2484 -1051 1102 171 -1436 347 -2054 -1291 1016 -1891 548 1191 -650 2331 1020 356 2400 -1231
2500 -1231 35 45 -2535 442 -799 -2250 1162 -749 147 1876 -588 1755 1023 -985 1996 -827
2516 -827 -1553 390 -2264 -645 508 -1876 1291 531 -155 2501 -199 865 2112 -1732 352 -193
2532 -193 -2512 106 -1824 -861 1319 -1545 1410 1732 -732 2716 258 -755 1642 -1778 -455 80
2548 80 -2588 647 -569 -1193 1989 -124 522 2084 -779 1235 665 -1946 1090 -1592 -1175 733
2564G33l260K809P51k287L720j922q31K374k802J124P35l632K912r80j422L299
2580A321k325M56K371k754K694l31k716L938l604O2K167l607K008O40k396L382
2596A306j479k50K846l160K070O61l825L169j291j848K984k734M62J878k907L079
2612I61J41k154L437k533K6K283l667J669j21k396L522k136o32L234l238J940
2628C36K108l445K535j252j127K886l792R44J450l190L528p54k033L399j798r7
2644c02K954l550J807N9l015L578k117j604L116k745J424J378k403L226j698q37
2660g29L388l799J209J779m206K970m09k329L134j849J11K394k546K224j86k463
2676a307L382j986p75K057l663K026R36l058L509j575j247M020k200P1J680l143
$$ plain form
2564 733 -2527 282 1033 -1254 2466 544 -287 2087 -715 409 1144 -2488 424 -556 -1978 1321
2580 1321 -1004 -548 1823 -931 1763 1432 -1284 2654 -950 -888 1279 -2328 -320 320 -2076 1306
2596 1306 -173 -423 2423 -737 1333 1994 -1831 1338 47 -1801 1183 -1551 -1089 789 -2118 961
2612 961 1102 -1052 2385 -148 -122 2161 -1506 163 42 -2354 1168 -968 -1600 1634 -1604 336
2628 336 2444 -1001 1534 282 -845 2041 -1751 -807 643 -2547 981 227 -1806 1593 -205 -302
2644 -302 2652 -898 909 968 -2047 1531 -586 -2190 926 -1819 -395 983 -1420 1806 108 -729
2660 -729 2659 -1140 69 1848 -2358 612 203 -2126 1008 -841 -730 1664 -882 1342 1156 -1307
2676 -1307 2075 89 -686 1371 -2292 -266 670 -2388 1121 -454 -1701 2319 119 190 1870 -1273
2692a273K148n25j763K378l030Q75K316k775K039N24j996L432j808j186K597k974
2708a021J257R54l594K544o36j397K978k003R67J485k385K926j250j966L143l080
2724a078j41K423l007J275M03j998L344r92l69J701k064J309Q21k809J841j202
2740e43j327K433j801P75J174k304K752J97j954K236j465k82J613k400R54n81
2756e23j433K323q42q25K774k321J706J084k164J526q44j243J820k177O5J145
2772G1j965J895Q6q89K094p96k50J713k384J151k60k507K527q66j497K019j329
2789a187L69J925j310J283n5j436K008j506m32R82k575J340P68j660K070j242
2805f58j16K904j654R9J027k650J946q50j237J302j681O99J144j656K092j44j162
$$ plain form
2692 -1273 875 350 -1413 965 -2065 -1190 1126 -1649 390 914 -1082 2350 542 -644 1953 -1021
2708 -1021 236 1190 -2404 140 -496 -1893 1085 -918 49 1534 -851 2075 825 -1141 2002 -1078
2724 -1078 -1219 1204 -1803 -528 -125 -2123 1221 229 -140 1561 -503 806 1627 -1182 659 -543
2740 -543 -1870 563 -1238 -463 711 -1593 1159 1356 -598 1638 173 -109 1504 -896 58 -523
2756 -523 -1956 367 -475 -1300 1474 -847 859 1943 -221 1305 461 -782 1038 -1139 -1074 71
2772 71 -1894 1 87 -802 1292 496 246 1959 -425 726 466 -2041 486 -380 -1877 142 -1187
2789 -1187 -818 1107 -203 1080 1025 -411 1597 91 -341 641 -1934 -594 174 -1486 584 -658
2805 -658 -774 2130 476 575 1602 -1048 898 48 -1189 113 -1568 -869 275 -1381 711 567 -595
2822e95K759j193j229J812k646M57P41j906J683n26o79K157j320O98J239j872
2838d20J469P1j703J418j980j22J962k577J556Q36k106K326L79j260J726k052
2854d77P88Q08k693K055r55j606K539j515L19J704j890J875M46j910K520k243
2870b35k82J930k742Q16N50k007K424j001k81K414k163J101J573l145K223r69
2886B06j653J926j559R7J544k235J551J217j950K763j137r97J846k085M69J76
2902A79k323K492j081n03K519k706R87K110k224J676oj870K401k014l63J613k732
2919a845J628O93k341L054j231n67K548k576J774O4k721K590j007j829K509k082
2935a339M49J726k135K295l61j135K627k345J6K149l417J286N97k244K594j433
$$ plain form
2822 -595 2164 971 -258 1554 -1092 -635 106 -1800 -117 -643 -1322 835 -485 213 1452 -420
2838 -420 1049 1120 -583 835 -1145 -1267 695 -1882 -326 510 -1596 730 1109 -151 1575 -477
2854 -477 311 1119 -1574 481 -474 -2080 459 -1056 -737 967 -923 952 1398 -512 2008 -235
2870 -235 -517 1413 -1329 -513 37 -1970 454 -547 -828 1586 -577 524 2097 -1048 1175 206
2886 206 -1447 479 -1080 -983 561 -1674 -123 1094 -856 1907 770 -227 1619 -466 3 179
2902 179 -2144 348 -733 -1236 1283 -1423 -436 1674 -550 1126 1120 -750 1651 -363 -726 887 -1845
2919 -1845 -217 476 -1865 1189 -42 -609 1939 -637 1137 1201 -1520 1070 63 -1766 743 -1339
2935 -1339 -890 836 -1299 996 635 -500 2127 -218 -202 1947 -1470 -184 413 -1831 763 -670
2951f70k93K204k145J571J031k634K279o51j854K491k407P75M97k132K639m32
2967B69j476K735j345k06J687k411J315j1j947K419k017n34K500k490J592R42
2983A022k202K587q41o82J805k307N45Q19k399J843j59j938K636j425L56J847
2999A507k217K018j57k125K418j552j292K308k198J036N35j890K181p06l68K233
3015A731k309J017J201k817K033p06j409J913j729K61J544j778J270P71j545J953
3031A401r91o58J514j930P55K25k081K315r39p98K490j726K61J421j777J399j13
3048G68j191J660j917j69J586k003J022N13j288J966j194L6J600j796P86L64j630
3065h87J365o70j519K115j365K08J212j091J342n1p51J462j051o53J545k027L78
$$ plain form
2951 -670 -963 1241 -904 667 1698 -936 1343 692 -1162 1329 -1078 -303 194 -1938 701 269
2967 269 -1207 1528 183 -23 1664 -747 568 557 -1390 1029 -988 -1522 978 -1512 80 1022
2983 1022 -1180 1407 566 -116 1689 -618 -73 746 -1653 190 31 -1907 729 -696 -340 1507
2999 1507 -710 1308 1151 -974 1444 -108 -1400 908 -1290 -254 281 -1609 572 -134 -502 1731
3015 1731 -578 439 1640 -1177 856 150 -1259 654 -1075 -814 730 -1048 222 993 -552 1401
3031 1401 410 -248 1266 -664 91 316 -1765 550 -389 -1187 1303 -423 -162 1259 -518 881 768
3048 768 -423 1237 -680 -849 737 -1266 -244 269 -1019 947 -247 -211 1389 -407 379 743 -887
3065 -887 478 -192 -1711 404 -961 -753 459 -632 710 659 -92 1370 319 -334 1211 -816 -438
3082d38M46j464J806n14m17J771j461M22J250j613J190j79k064J596r90k66Q94
3099c1j254J321L93j120K016n89o63J396j334K69R1j745J109j74q83J511j035
3116g22J42J387q90Q88R9r27R18n73p64O50j339M23N30q04J302k55m05J627j337
3135e0Q31L23j482P85l09j304J563q51n18J357j274J261N51j223J699j021n47
3152b09R40j146K08M41j579R47k48k11J563r19K58J237j535R42P7j169J014q54
3170b43m15N50j564J399M35j183J892o21m47J618j215p1O43j354O00p0j266J746
3188D34j144j97J710j063J062L57j299J167j185j33J169k167R30P73j639J390
3204A65j96n87J744j148J28J147j484R15n15j091J252j442n7J353j201J145M42
$$ plain form
3082 -438 8 -1456 350 -164 -581 1190 -271 151 1401 -212 978 799 -1265 331 -659 -925 -31
3099 -31 -1285 36 429 -691 1325 736 73 1469 135 404 495 -1250 -141 -315 -1198 313 -722
3116 -722 -580 807 -83 805 904 -23 895 322 -442 208 -1131 -708 -178 -982 320 65 -340 1287 -50
3135 -50 781 1104 -378 407 98 -1206 357 -494 -1012 345 -929 332 883 -340 1359 338 -209
3152 -209 731 -415 -207 234 -1345 -398 -646 -857 706 -213 45 1282 -253 689 766 -403 611 -243
3170 -243 -658 -108 -1672 -273 162 -1021 871 250 -197 1421 206 135 778 -576 24 -46 -1312 434
3188 434 -710 -907 803 -260 802 1159 -140 1027 -158 -291 878 -1289 -359 414 -1225 165
3204 165 -31 -618 1126 -22 106 1253 -231 684 169 -922 330 -1112 -1169 184 -1017 128 570
3221E70j106J678o60o12J751j891L10M86j689J112m82n23J642j123K66J523j775
3238e23J444N3j576J530j101l56J162j816Q50N85j404K063p57o45J853j643O62
3255C81P10j756J007p12p38J618j366p9J490j318J176L53j188J510r65J6P98k259
3273a322J214R3j446J754n12m77J596r36K39P11j482J821j074q13J300j555M28
3290d61M18j012R20J79j114K055q45j10J041j593Q36M1j538J435o88k47J174j505
3308a014Q70Q10j363J663l45j164J939j798K84N99j597J290j37j211J542q42M67
3325gJ030j307O21M23j259J951j712m82J423j950J112Q45j764J260k50l72J582
3342A144j116M55O14j750J200k34j624J843j478J18J308j088R54K22j151J827
$$ plain form
3221 570 -536 1142 482 -130 1621 -270 40 526 -1163 -51 -533 -1056 586 -537 -271 1252 -523
3238 -523 921 974 -602 928 -173 -529 633 -1183 -333 252 -1152 911 154 -491 1362 -281 381
3255 381 1091 -665 342 -370 -1108 510 -856 -935 555 -763 413 766 -422 1088 123 139 937 -1322
3273 -1322 -108 -15 -1461 293 -219 -696 900 -36 203 914 -568 1253 179 -634 666 -889 -461
3290 -461 -43 -1055 -135 44 -1070 985 140 30 1071 -522 314 355 -1183 252 -436 -683 491 -1014
3308 -1014 -144 666 -697 966 621 -543 1396 -402 -118 481 -1116 174 37 -1174 368 -474 -7
3325 -7 1023 -284 337 760 -499 1452 -260 -742 681 -1269 -157 688 -1076 184 -66 -438 1144
3342 1144 28 483 1097 -653 547 313 -1311 532 -946 -828 480 -608 346 568 -583 1244
3358A244p67q87J137j349P24J65j315R17l66k46J236r74M29J153j701J429j45
3375F84r41O74q60k90J082j116N79L99r51J168m0k42O98o88ON36j567J301o38
3394b06q68J546q80L6Q37j255J162L28p72P65o78j00N78j284P33J41j080J005
3412HQ2o08J047n66M20N86j044O61l32p49Q32l72n09L96o37J130J98j491J773
3431H25m62n34J345j173j73N21j009M09J41r49J074l76%J197q05L88Q1n55P54
3450F99j079o6N02j176P13O02r74R95J0m75Q07k46J26K61j100P23k34q74Q72q09
3470g23l35J381j066Q40M60q46J193l13l44Q79j592J32Q03j266M81j24l25J539
3488G74r00M70Q88j479Q08L68j425O87o69o33J577j101L36M70q17J385m94k69
$$ plain form
3358 1244 477 -410 727 -622 102 267 -1048 -131 -497 -743 493 -481 -52 1101 -600 829 684
3375 684 -257 417 -443 -733 349 -767 -188 211 -740 428 388 146 844 156 162 698 -869 432 -206
3394 -206 -1074 472 -408 -372 465 -790 372 700 -72 693 15 -85 493 -791 -58 83 -997 8
3412 8 90 -518 529 -37 383 969 -75 586 254 -495 337 -35 -544 -148 -785 345 543 -948 825
3431 825 363 -171 1174 1 -172 349 -660 -251 -110 -1059 15 -361 -361 836 31 419 500 -55 699
3450 699 -380 -446 56 -1120 -407 195 -779 216 226 -249 558 312 438 699 -401 322 88 -786 86 -723
3470 -723 -1058 323 -743 97 557 -289 904 591 247 1126 -466 -334 469 -797 -316 -440 -765 774
3488 774 -126 344 1232 -247 561 929 -496 191 -478 -1111 466 -635 -299 171 -646 739 245 -24
3506b4J193j311K11L87j127R88p16o36J046m66p3J071q74P88O44q86O47r71j10
3525b19R44j569N83J98j315J372k0k85J060m33l07R45j095O59r3j525J586j132
3543f46j00J002p92M35Q60j154J381o90m12R43j190O1L71j028Q05m9o67J590r99
3562b79L51R75j376J023l40m97R73j250k46R72j083M90M75j329J780p95o9J326
3580A101q94LO65j418R28k80j253J652j286L96J114j150J173K77j621J701j048
3597F0l32R77j744P48M66j400J370k55q06J928j241M41Q60j028N65o40n79J202
3615E92r57k34O21j063J200L95r06J322q05j91J365j662L15L91j369J253p25k2
3633d80R46j260R64P39j518J364m53o60J395j232k72O58j152J092k69p84J347
$$ plain form
3506 -24 1169 -142 69 456 -671 317 -399 -1035 11 -455 -528 543 -331 457 1101 215 862 -109 -219
3525 -219 725 -844 -261 -63 -1378 -6 -26 -311 749 316 9 954 -141 518 425 -1100 486 -646
3543 -646 -746 256 -536 -101 759 -395 986 296 -116 827 -363 -302 69 -959 -154 -203 -870 720 -279
3562 -279 72 1047 -329 694 354 -143 830 -420 -666 306 -777 -287 188 -1141 639 -156 -225 1101
3580 1101 207 210 875 -543 385 105 -1148 504 -782 -386 728 -422 751 1028 -593 1108 60
3597 60 -272 705 -1039 -291 175 -1225 145 -110 -916 1012 -229 212 1072 44 609 -31 -610 592
3615 592 -365 -599 22 -1041 159 554 -352 970 165 -26 1339 -323 -8 383 -986 267 -458 -480
3633 -480 466 -794 170 909 -609 755 302 -358 1037 -195 -467 191 -961 131 -138 -922 425
3650D25q50J80J203j143P54K4r51R86r28j27O61j103O39K68r12J162J25n30J039
3669I22j013J17O80j163J025k76r55Q97p36J67Q30r81O37J20n16J336q82m03Q89
3688F95j283M05M09r85R85k12k64R06o71L11L26j007J056k9j163P82p93j75Q86
3707A79p61N97K70r31J230m99m64J003p69L29J69j051P56j79p41R94n86OJ088
3726F40p20L49M34j004J013o70m69O31q64M13J18p76Q57J12l32R06n86N06K05
3745G63r84O21r1p82N41k48m25N85n07L22K63l64Q45J1m73R53j094j55O15j171
3765g75P91j8m70P20k75m1P64q88P13J49q33P51n94k07O70p96M9L64n81N28j04
3786h3L7R69p92J76L02n42k7q6q71R97n87o0J021p98L17P13o88N57j3m46L91p83
$$ plain form
3650 425 -425 -245 958 -185 569 593 -358 628 -300 -427 234 -869 -230 38 -874 288 413 -117 922
3669 922 -91 26 706 -457 568 292 -663 234 -502 -335 495 -486 151 271 -245 1091 209 -194 695
3688 695 -588 -183 226 -759 226 14 -250 656 -15 296 622 -385 671 642 -521 261 -532 -707 179
3707 179 -582 15 285 -646 584 85 -379 624 -145 184 353 -698 58 -121 -862 132 -454 -448 640
3726 640 -80 269 703 -301 712 42 -427 204 -660 -247 -129 -905 -48 64 -268 638 52 558 763
3745 763 -221 400 309 -473 68 -180 -605 -20 -527 -205 58 -306 539 550 77 1030 -64 -219 396 -775
3765 -775 16 -2 -472 248 -27 -68 696 -192 521 670 -163 588 -6 -213 457 -339 -290 74 -507 21 -83
3786 -83 -46 923 131 307 609 67 40 -46 -917 80 -507 -567 454 -344 -27 686 -2 555 542 96 487 -296
3808b96K22K38r15N77K05m81P20l81M19N07r44O59K3r46O74m20l82N53p07K34
3828d41P77q54P63q6o9O04n03k58P08j227N72l23q14J225l01k99R10n53N13M33
3848G77q98O70l58j76J64q47L58P16j228J168k43m59R26j7o11Q17r68M0N68j055
3868f56P94r28K45J024j144R78J2p84J156j87p20J059r76J37M28j703J458n05
3886c12m53R41l36J08P68r58Q20N5r42R24p09o36O27p50O77K32p22J219n67o9
3906h3J275j380N49J68j012O93k52j063J180n39J40O94j119R96N21q12R98p14
3924B40j82N82r71J5L54o76R20m13m74J132p17K32R65j139N89n14o06J274j094
3943d83m0N67o76Q51j45p21J175m18j17P79r56L03L48j193P96l47m33J257r42
$$ plain form
3808 -296 -74 164 -751 -174 31 -450 270 -111 308 815 -129 530 553 -393 281 -139 -521 32 -675 -441
3828 -441 336 -518 245 159 90 694 191 -67 641 -586 -14 -337 -1151 74 -227 -526 384 -169 344 777
3848 777 -121 549 191 15 179 -668 -310 406 -822 346 103 -356 570 553 -58 759 -209 -169 399 -656
3868 -656 138 -790 -545 479 -665 313 325 -459 697 510 -210 849 -127 10 438 -1265 193 -312
3886 -312 -765 176 -160 -52 716 -242 578 633 -309 615 -94 -730 -103 -853 -176 56 -666 553 -14 -83
3906 -83 1192 -188 361 529 -483 210 -42 -1105 75 -464 -324 370 -749 247 768 -44 954 240
3924 240 58 640 -331 -316 38 -638 282 -131 -605 527 -190 42 1007 -132 457 -57 -663 611 -483
3943 -483 -523 44 -632 219 74 -647 528 110 -7 772 -184 119 467 -726 70 -277 -710 547 -395
3962c95N04L95q60N70O9p17J187r36r5P03j019L28L04q31J189o59M36O72r74N37
3982D08J29j143J266n77o71R92j075N99M26r73J210o92j83J288j030p7K69l52
4000a86N61p25n16J288p63j76Q64o05M34L95r69Q36l39j88N33q54J94L59r97J068
4020B14l2o90P23l87J54R13j189P80q7p50O52l54l43M59m40J22P9l30J004k53
4040B45l15N99o38j63O49q56M42j74m59P70k71k11R47p85M90L77o24L20o47J12
4060a92N39r00J41N26p15O95L34p21O31k32oM60o32K74l90j60O54q78J7N21q78
4081i12Q04L68k69L73l34k21O52o04J33J96r10N43k30L07M1m00M39L79l01L61
4101D15Q0n94N85j76q01N19m88k6O55m89J39M38k11M78l79j30O58r76M38k32o00
$$ plain form
3962 -395 109 504 -356 214 283 -434 753 -183 -278 425 -594 -266 38 -793 396 -263 173 845 -129 408
3982 408 537 -606 660 83 -588 404 -671 -72 354 -619 591 -101 -284 1004 -26 -103 166 -186
4000 -186 375 -350 -866 422 -341 -517 347 -258 176 571 -398 438 99 -89 444 -410 -216 143 -854 214
4020 214 182 -508 215 -172 -18 895 -294 486 399 -351 301 -53 -396 63 -377 -255 -176 -506 498 245
4040 245 -70 529 -109 -272 377 -479 -37 -211 -670 100 -171 -382 565 -220 270 647 23 343 -304 -192
4060 -192 347 -553 -412 114 -601 94 428 -293 338 106 100 560 -72 202 -188 -348 306 -572 -555 -34 -912
4081 -912 -108 260 -9 364 30 -191 461 -143 -10 186 -724 -181 -411 -104 -63 -463 -24 355 54 415
4101 415 495 -99 486 310 -491 28 -460 -486 169 -320 -181 257 46 524 145 15 673 -303 135 -97 -697
4122f97Q17n03k94Q03j72L01K33o78P94k71k26L8j90k74L12l81P7O9m4P26n68
4143a28M19N85o67K97K10o62L2k62j64J98k57K38L38p00P59J46k65K91n61K59
4163A06M98j053M29n10l41Q94j23k70R07p89N14M12p21N24m07m75O49m52k38L23
4183a23o07R70m91J88K99k55RO79p84L87J08r46P22m00k05O53p49M81M49n48P96
4204F33j76n22R52j202J64L26j196R30J33m96P64m44K28M54m98M44j9p08N16l38
4224e5l83Q05r91L51M69q97J321l48l23R22r30K72L75j214P62l60l64Q02p36L97
4244a25L59m88O74np11Q93j84p64Q49q27P1J60n02R63m40l21R80o87K15N82r42
4265b50N79j21o76Q15o45q4M56n02J25J65k34P06q9m06O54n58J89Q8r14P78j95
$$ plain form
4122 -697 120 -383 -677 126 -46 255 488 -190 604 333 107 145 -45 -319 -7 -388 -311 -242 -286 440 -128
4143 -128 291 876 209 506 716 54 86 -176 -340 -142 -399 -161 177 -523 236 382 117 408 -153 106
4163 106 604 -449 -20 -530 -871 23 -100 -370 537 -252 262 674 -47 477 70 -405 244 -208 -446 -123
4183 -123 -730 240 -251 -63 236 -19 -10 669 -115 272 380 -566 156 -244 -449 204 -545 -64 385 -163 633
4204 633 457 -65 887 -315 -151 175 -1021 -91 42 -454 310 -134 94 548 50 494 475 -233 283 -55
4224 -55 -438 367 -624 -273 196 -701 620 272 -51 871 -59 213 588 -626 136 -224 -588 214 -522 -125
4244 -125 234 -254 420 415 -296 597 413 -351 498 -329 -258 -98 -600 363 -77 -398 582 -105 110 692 -250
4265 -250 329 208 -468 347 -298 -382 74 -428 -303 -138 -372 334 245 -161 493 -65 124 212 -702 76 -119
4286a19n15L46j21K92N49o59P37k75n73Q30o12j07L23o42N5M67o89P21k27K57
4306C8M24n73N47O3p40M12l52m06Q41j010N63L72m26L75n4j92P38n48P2M27p58
4327a87M51l99k83P01m70r9P91n99K22N17o58N36l81l62O14p68K66K01n76M83
4347@k0n32O72P8k18N12o57N62l70l22K64j62k99M37k18J99L63j93k2j54J56M52
4369E28o38K00K18m62J95k80o5M72k42j60O19q40R66m31n49Q24j89j27J63m54
4389b52q5L35p15P21k32Q9O49n41Q7M31o42J21K46o42O78l23m66O27l46J70N86
4410D96p13M4O90n04L36m73K05qp70Q29l68l60M39J81K66q7RM5k26k51L25J0o47
4433e32P53n76J92L06m91L15R8n29P93l45J01M53p32R6R6n86O98m38l37O99q3
$$ plain form
4286 -119 -634 -288 -409 -117 432 -227 510 235 -338 492 -120 -227 96 -546 -491 -24 -713 8 -219 38
4306 38 462 -111 436 499 -241 171 -181 -587 254 -756 -193 179 -247 128 74 -118 620 72 144 571 -187
4327 -187 264 -135 -418 283 -187 -286 505 -94 128 645 -13 523 142 -220 394 -374 -108 93 -483 0
4347 0 -20 -552 120 198 -20 492 -165 397 27 -295 -31 -193 -492 -55 -273 -74 289 96 74 -80 76 528
4369 528 -110 90 308 -154 41 -239 -304 168 -74 -234 385 -455 511 80 -469 355 166 39 202 -252
4389 -252 -337 -2 -717 4 -228 -139 510 -31 56 487 -155 -34 212 -430 248 -75 -541 86 -260 -90 496
4410 496 -217 -173 517 13 349 -124 81 73 -697 132 -236 -596 -157 24 290 203 212 257 31 -220 105 115 -532
4433 -532 221 -355 -163 143 -348 -33 65 -464 329 -16 85 538 -194 -98 -2 -588 110 -328 -665 34 -49
4454d9K27K58l88M96l96m42N81k92m59L69n04P35k0k01N18m21L9M34o47K52j49
4475e9k71O31p76P8O44o67K69L89l78K83K95l65L46j81k30N26q32R5K86p58J001
4496C26m96q5P07p94M42L21m64N44l33q25J006p31OM07l73M2L26j53O08n63K08
4517A26M83r38L25J06p02O54m75L29K18m58N2P42r29R30l50k12L88m07j69K12
4537g5n07M68M5j5L92j73M8K62n53L82q7p43J057q17j30M25n98M3N90l97P37j8
4559C36m90Q44o57J07j46l77N72l26m89P78l46k9O37p55O48K11o93N77j04n67
4579b69O28q77L18M02o95N06M0l94N71N8l3P08p93N0J55o75M74l58j08K59n03
4600e36N16K78n99R61k89l08M18l83l37N03n95M98m00k39Q03q25P61L32r23P88
$$ plain form
4454 -49 178 436 48 544 148 -294 287 -5 -464 -95 -599 136 116 -85 433 12 51 485 -162 90 -59
4475 -59 -330 301 -475 -397 247 -420 -151 238 -140 143 438 73 419 238 8 534 -298 -203 83 -675 326
4496 326 -170 -255 452 -342 100 421 -43 501 168 -657 349 -382 -376 31 -342 -300 26 -127 481 -82 126
4517 126 609 -329 -4 102 -600 54 -421 -92 126 -332 -280 462 -467 463 113 -99 289 -118 -287 -75
4537 -75 -582 -114 -69 -84 308 135 183 445 -108 274 187 -556 501 -316 -446 -21 -619 -576 14 -383 354 336
4559 336 -154 690 33 140 -6 -383 189 -137 -626 152 -194 -223 414 -341 307 518 -175 402 298 -269
4579 -269 359 -518 -200 202 -493 13 53 -341 230 288 255 963 170 220 375 -300 174 -184 -292 -33 -536
4600 -536 -20 258 -341 620 331 23 441 58 -279 224 -371 127 -273 -512 291 -534 227 559 -364 424
4620D24J26q25N55n06p5L01q51P35l8j94O83n10K89M22q40N09K36r12P67k67n32
4641e03M92o02J99K16m78P95K04l49O30m15j73M28o15m6K18m70O64n55K42N06
$$ plain form
4620 424 550 -275 280 -226 -301 0 -851 -116 -154 -348 335 -175 114 536 -304 205 441 -471 296 29 -503
4641 -503 -11 -613 -414 -198 -676 119 323 -26 604 189 16 444 -171 -217 1 -469 195 -360 -118 388
$$ [...]
8191i2
##END NTUPLES=NMR FID
##END=
