##TITLE=1H_Ser Am-S-107N
 200.13MHz, CDCl3,
 8 sc
 
 2.10.2025
##JCAMPDX= 6.0         $$ Bruker NMR JCAMP-DX V2.0
##DATA TYPE= NMR FID
##DATA CLASS= NTUPLES
##ORIGIN= UXNMR, Bruker Analytische Messtechnik GmbH
##OWNER= pz
$$ XWIN-NMR		Version 3.5
$$ Thu Oct  2 13:41:47 2025 Russian Standard Time (UT+4h)  she@DPX200
##.OBSERVE FREQUENCY= 200.1313
##.OBSERVE NUCLEUS= ^1H
##.DELAY= (6, 6)
##.ACQUISITION MODE= SIMULTANEOUS
##.ACQUISITION SCHEME= undefined
##.AVERAGES= 8
##.DIGITISER RES= 18
##SPECTROMETER/DATA SYSTEM= spect
##.PULSE SEQUENCE= zg30
##.SOLVENT NAME= CDCl3
##.SHIFT REFERENCE= (INTERNAL, CDCl3, 0, 14.3821)
##AUDIT TRAIL= $$ (NUMBER, WHEN, WHO, WHERE, WHAT)
$$ ##TITLE= Audit trail, XWIN-NMR		Version 3.5
$$ ##JCAMPDX= 5.01
$$ ##ORIGIN= Bruker BioSpin GmbH
$$ ##OWNER= she
$$ F:/spectra/data/she/nmr/H-C/1/audita.txt
$$ ##AUDIT TRAIL=  $$ (NUMBER, WHEN, WHO, WHERE, WHAT)
(   1,<2025-10-02 13:40:18.35 +0400>,<she>,<DPX200>,
      <created by zg, POWCHK disabled, PULCHK disabled
       configuration hash MD5:
       00 E9 B6 7A A2 85 ED C7 34 08 36 98 17 FE 4E 26
       data hash MD5: 16K
       89 73 D9 E6 58 1D 1A 40 B8 8E 23 03 6C 90 B7 CA>)
$$ ##END=
$$ 
$$ hash MD5
$$ 7A 51 8B DC D5 E9 58 19 A6 47 17 6B 5D AA 81 F8
##$RELAX= 
##$RELAX= 
##$RELAX= 
##$RELAX= 
##$RELAX= 
##$RELAX= 
$$ Bruker specific parameters
$$ --------------------------
##$DU= <F:/spectra>
##$EXPNO= 1
##$NAME= <H-C>
##$PROCNO= 1
##$TYPE= <nmr>
##$USER= <she>
##$AMP= (0..31)
100 100 100 100 100 100 100 100 100 100 100 100 100 100 100 100 100 100 
100 100 100 100 100 100 100 100 100 100 100 100 100 100 
##$AQSEQ= 0
##$AQ_mod= 1
##$AUNM= <au_zg>
##$AUTOPOS= <>
##$BF1= 200.13
##$BF2= 200.13
##$BF3= 200.13
##$BF4= 200.13
##$BF5= 200.13
##$BF6= 200.13
##$BF7= 200.13
##$BF8= 200.13
##$BYTORDA= 1
##$CFDGTYP= 0
##$CFRGTYP= 5
##$CHEMSTR= <none>
##$CNST= (0..31)
1 1 145 1 1 1 1 1 1 1 1 1 1 1 1 1 1 1 1 1 1 1 1 1 1 1 1 1 1 1 1 1 
##$CPDPRG= <>
##$CPDPRG1= <>
##$CPDPRG2= <>
##$CPDPRG3= <>
##$CPDPRG4= <mlev>
##$CPDPRG5= <mlev>
##$CPDPRG6= <mlev>
##$CPDPRG7= <mlev>
##$CPDPRG8= <mlev>
##$CPDPRGB= <>
##$CPDPRGT= <>
##$D= (0..31)
0 0.7 0 0 0 0 0 0 0 0 0 0.03 0 0 0 0 0 0 0 0 0 0 0 0 0 0 0 0 0 0 0 0 
##$DATE= 1759398017
##$DBL= (0..7)
120 120 120 120 120 120 120 120 
##$DBP= (0..7)
150 150 150 150 150 150 150 150 
##$DBP07= 0
##$DBPNAM0= <>
##$DBPNAM1= <>
##$DBPNAM2= <>
##$DBPNAM3= <>
##$DBPNAM4= <>
##$DBPNAM5= <>
##$DBPNAM6= <>
##$DBPNAM7= <>
##$DBPOAL= (0..7)
0.5 0.5 0.5 0.5 0.5 0.5 0.5 0.5 
##$DBPOFFS= (0..7)
0 0 0 0 0 0 0 0 
##$DE= 6
##$DECBNUC= <off>
##$DECIM= 32
##$DECNUC= <off>
##$DECSTAT= 4
##$DIGMOD= 1
##$DIGTYP= 9
##$DL= (0..7)
0 120 120 120 120 120 120 120 
##$DP= (0..7)
150 150 150 150 150 150 150 150 
##$DP07= 0
##$DPNAME0= <>
##$DPNAME1= <>
##$DPNAME2= <>
##$DPNAME3= <>
##$DPNAME4= <>
##$DPNAME5= <>
##$DPNAME6= <>
##$DPNAME7= <>
##$DPOAL= (0..7)
0.5 0.5 0.5 0.5 0.5 0.5 0.5 0.5 
##$DPOFFS= (0..7)
0 0 0 0 0 0 0 0 
##$DQDMODE= 0
##$DR= 18
##$DS= 0
##$DSLIST= <SSSSSSSSSSSSSSS>
$$ [...]
##$SUBNAM0= <"">
##$SUBNAM1= <"">
##$SUBNAM2= <"">
##$SUBNAM3= <"">
##$SUBNAM4= <"">
##$SUBNAM5= <"">
##$SUBNAM6= <"">
##$SUBNAM7= <"">
##$SUBNAM8= <"">
##$SUBNAM9= <"">
##$SW= 18.0517328524113
##$SWIBOX= (0..15)
0 0 2 0 0 0 0 0 0 0 0 0 0 0 0 0 
##$SW_h= 3612.71676300578
##$TD= 16384
##$TD0= 1
##$TE= 0
##$TE2= 300
##$TE3= 300
##$TEG= 300
##$TL= (0..7)
0 120 120 120 120 120 120 120 
##$TP= (0..7)
150 150 150 150 150 150 150 150 
##$TP07= 0
##$TPNAME0= <>
##$TPNAME1= <>
##$TPNAME2= <>
##$TPNAME3= <>
##$TPNAME4= <>
##$TPNAME5= <>
##$TPNAME6= <>
##$TPNAME7= <>
##$TPOAL= (0..7)
0.5 0.5 0.5 0.5 0.5 0.5 0.5 0.5 
##$TPOFFS= (0..7)
0 0 0 0 0 0 0 0 
##$TUNHIN= 0
##$TUNHOUT= 0
##$TUNXOUT= 0
##$USERA1= <user>
##$USERA2= <user>
##$USERA3= <user>
##$USERA4= <user>
##$USERA5= <user>
##$V9= 5
##$VALIST= <valist>
##$VCLIST= <CCCCCCCCCCCCCCC>
##$VD= 0
##$VDLIST= <DDDDDDDDDDDDDDD>
##$VPLIST= <PPPPPPPPPPPPPPP>
##$VTLIST= <TTTTTTTTTTTTTTT>
##$WBST= 1024
##$WBSW= 4
##$XGAIN= (0..3)
0 0 0 0 
##$XL= 0
##$YL= 0
##$YMAX_a= 610566
##$YMIN_a= -680168
##$ZGOPTNS= <>
##$ZL1= 120
##$ZL2= 120
##$ZL3= 120
##$ZL4= 120
##$ABSF1= 10
##$ABSF2= 0
##$ABSG= 5
##$ABSL= 3
##$ALPHA= 0
##$AQORDER= 0
##$ASSFAC= 0
##$ASSFACI= 0
##$ASSFACX= 0
##$ASSWID= 0
##$AUNMP= <proc_1d>
##$AZFE= 0.1
##$AZFW= 0.1
##$BCFW= 1
##$BC_mod= 2
##$BYTORDP= 1
##$COROFFS= 0
##$CY= -3
##$DATMOD= 1
##$DC= 2
##$DFILT= <>
##$DTYPP= 0
##$F1P= 0
##$F2P= 0
##$FCOR= 0.5
##$FTSIZE= 0
##$FT_mod= 4
##$GAMMA= 1
##$GB= 0.15
##$INTBC= 1
##$INTSCL= 1
##$ISEN= 128
##$LB= 0.25
##$LEV0= 0
##$LPBIN= 0
##$MAXI= 10000
##$MC2= 0
##$MEAN= 0
##$ME_mod= 0
##$MI= 1.114404
##$NCOEF= 0
##$NC_proc= 0
##$NLEV= 6
##$NOISF1= 3.799351
##$NOISF2= 2.8
##$NSP= 1
##$NTH_PI= 0
##$NZP= 0
##$OFFSET= 14.38212
##$PC= 1
##$PHC0= -1914.801
##$PHC1= 11.99226
##$PH_mod= 1
##$PKNL= yes
##$PPARMOD= 0
##$PSCAL= 0
##$PSIGN= 0
##$REVERSE= no
##$SF= 200.129724274929
##$SI= 16384
##$SIGF1= 3
##$SIGF2= 2
##$SINO= 400
##$SIOLD= 16384
##$SREGLST= <1H.CDCl3>
##$SSB= 0
##$STSI= 0
##$STSR= 0
##$SW_p= 3205.1282051282
##$SYMM= 0
##$S_DEV= 0
##$TDeff= 0
##$TDoff= 0
##$TI= <>
##$TILT= no
##$TM1= 0
##$TM2= 0
##$TOPLEV= 0
##$USERP1= <user>
##$USERP2= <user>
##$USERP3= <user>
##$USERP4= <user>
##$USERP5= <user>
##$WDW= 1
##$XDIM= 8192
##$YMAX_p= 0
##$YMIN_p= 0
$$ End of Bruker specific parameters
$$ ---------------------------------
##NTUPLES= NMR FID
##VAR_NAME=  TIME,          FID/REAL,        FID/IMAG
##SYMBOL=    X,             R,               I
##VAR_TYPE=  INDEPENDENT,   DEPENDENT,       DEPENDENT
##VAR_FORM=  AFFN,          ASDF,            ASDF
##VAR_DIM=   8192,          8192,            8192
##UNITS=     SECONDS,       ARBITRARY UNITS, ARBITRARY UNITS
##FACTOR=    0.0002768,     1,               1
##FIRST=     0,             0,               0
##LAST=      2.2672688,     0,               0
##MIN=       0,             -680168,         0
##MAX=       2.2672688,     610566,          0
$$ Real data points
##PAGE= N=1
##DATA TABLE= (X++(R..R)), XYDATA
0@%%%%%%%%%%%%Qj6J6j6K0k8L2l9M7n2O0p2Q4r6J12j28J49j73J99k24K50k84L23
35A72l64M07m55N06n64O29o96P70q53R44j043J149j265J393j532J687j861K053
53A077k267K507k781L095l458L880m385N003n771O758q072R912j2677J7262k6153
68a6070M9289k18091m95296O30665N36221l02522l50078Q0205O5844L8065J42886
79A61118p6527l05867N6444L39651K4998k45058j08104L1907J26475J57687o4950
90I7774k45015K835K09259j9245j24982J42901R8272k10481o2530J92319l5254
101D5853j63099J14953J21380j41804j2533J75590j40900k72660K09189L08902
111B44871k02615k35742J88430J24934j76265j9107J84046k9630j70891L6086
$$ y = [0, 0, 0, 0, 0, 0, 0, 0, 0, 0, 0, 0, 0, 8, -8, 8, -8, 12, -16, 16, -23, 24, -28, 32, -40, 44, -52, 60, -68, 81, -92, 107, -117, 133, -151, 172, -192, 215, -240, 266, -298, 331, -365, 405, -448, 496, -547, 602, -663, 730, -802, 885, -976, 1077, -1190, 1317, -1464, 1631, -1827, 2053, -2332, 2671, -3100, 3658, -4414, 5498, -7179, 10083, -16070, 33219, -184872, -680168, -49503, 486718, 184196, -165882, -85677, -19833, 18232, 161118, 84591, -221276, -164832, 174819, 199817, -45241, -153345, -121438, 5037, 162724, 97774, -147241, -144406, 64853, 45608, -79374, 63527, 161799, -48682, -111212, 81107, 45853, -117246, -2293, 119087, -22717, -35250, 140340, -560, -273220, -64031, 244871, 42256, -193486, -5056, 119878, -56387, -75494, 108552, 78922, -91969, -55883]
121e5883J12700k8171k9781K3484j0014J1682P695r2651l7863J08532K8142q5320
133d7448O5862J17660j63028j86527J85749J96417j52711j11156J43683K2190
143G0691j33851N5255J23721j19347j17337J42745Q6776j39673n4339Q6641Q207
154I489o731O6034m4281j58292R681J86962O2054j06438o4360K1307M6608L9369
166F1402n1742r6053M8961J33477j6241j15324q345L8649l1703K3043Q7920o5458
178H586j28626Q2228J31002p7802q7220R6705N5086j14383l8430J08126J6730
189E2002p6286K1879O0075l0400m6303q871j3498J1630O4063J7135p3952l4961
201e7487N4399K4539k5934r082j604J1561M2914n313o9278P73R1233J2461r3715
$$ y = [-55883, 56817, 28646, -1135, 22349, 12335, 24017, 31712, -60939, -98802, 9730, 37872, -47448, 18414, 136074, -26954, -213481, -27732, 168685, 15974, -95182, 48501, 70691, -63160, -7905, 115816, -3531, -120868, 21877, 108653, -31020, -85359, 1282, 9489, 2758, 68792, 24511, -133781, -124100, 62862, 124916, 18478, -45882, -24575, 22033, 61402, 9660, -86393, -37432, 96045, 79804, -35520, -43865, -5216, -36919, -13876, 74044, 8586, -120040, -37812, 93190, 15388, -71832, 24873, 79959, -34424, -72854, 35272, 52002, -24284, -2405, 57670, 27270, -19033, -27904, -41402, -29772, 34291, 51426, -22526, -57487, -3088, 21451, -4483, -13565, -15169, -3608, 39306, 33993, -35285, -34512, 56721, 69182, -24533]
214b4533k3071N7825m438k5328L7917m78n2091K3610N1693n8846p5240P1586J02720
227H1326m2422q0091K1717M1901o605j0294n146o723J4958J8369j7190k9674P111
240a2763J8901n229P67k564l5134p05N1599J0520l3162J222K1208j5991j9027
253b0358K8329J5185k8316Q915L7020k6311m2934J5647K3398j2390p909J4416
265D692n562k2807J1937K4411j5229j4621J5510J0766m388q642j537J8857J5037
278B8424j4499k2615J453J7777o413j9447J5086J6095k0309j0618J0013n008p415
291a7476J2382J4744p859j1849J2386R581j1874J446J0287m390l173J21l502O62
305A486Q08O43j997q467l643J525L000M342l722K01J4079n074j5951J0581J6282
$$ y = [-24533, -47604, 10221, 5783, -19545, 18372, 17894, -34197, -10587, 41106, -17740, -92980, -21394, 81326, 38904, -41187, -19470, 22431, 15826, 5532, 386, -6337, 8621, 26990, 9800, -19874, -12763, 6138, 909, 1676, -888, -36022, -36727, 14872, 25392, -7770, -6548, 14660, -1331, -20358, 7971, 23156, -5160, 3755, 40775, 14464, -28470, -12823, 10575, -1815, -9724, 4692, -870, -23677, -11740, 12671, -2558, -17179, -1669, 9097, 4709, -3933, -5470, 13387, 28424, 13925, -8690, -7237, 10540, 4127, -15320, -234, 15861, -4448, -15066, -5053, -10061, -17476, -5094, 9650, 1791, -10058, 2328, 11909, 35, 1481, 11768, 7378, 4205, 4326, 824, 1486, 2294, 2937, 940, -7527, -11170, -9645, -6645, -2303, -6025, -5824, 8255, 3181, -12770, -2189, 14093]
320A4093o780r293R094J1194j3931j3935J4328O623j5823m330O106J916m450o647
334a1835M166Q514j970n038M07N929O208m517m30R923l218p567M536J633m815
349A926l821J571L621n297o936K614R44P93K288m299m79Q010K591k018k910L066
365A664R453k106r735L274O414l298o606m97M130n888o422R466K258j4871L96
380a2368J3260K257o324l016M325O047M617j79j1421q59J7666l44j7381J520O691
395D491q428k75J1159p345j9151P807K1489r472j4879J2522L590p355J3892O572
409A4617k1962l550K7113M237k4768N73J5216j5473o222K4796p025l1209J0484
422a3173K5321j1797j4873J2742J074j1074J7898J2912l0302n299L8076k826l1839
$$ y = [14093, 7313, -1980, 7114, 18308, 4377, -9558, 4770, 11393, -4430, -8760, -2654, -738, -5188, -11835, -7669, 845, -1125, -6163, -5756, 173, 6381, 1864, 1434, 11357, 8139, 572, 5108, 6741, 1926, -1895, -324, 3297, -2000, -8936, -6322, -5378, -4585, -2297, -6596, -7075, 935, 3526, 1508, -1402, 1664, 11117, 9011, -724, 2550, 8964, 5666, -940, -1437, 2693, -3195, -9617, -151, 2107, -12764, -12368, 892, 3149, -3175, -6191, -1866, 4181, 8798, 8619, -2802, -3661, 14005, 13661, -3720, -2200, 4491, -3937, -4212, 6947, -398, -19549, -11742, 9747, 275, -14604, -2082, 1508, -5847, 8045, 14617, -7345, -10895, 16218, 20455, -4313, -3740, 11476, -3997, -10219, 14577, 7552, -23657, -13173, 12148, 351, -14522, -1780, -706, -11780, 6118, 19030, -11272, -16571, 21505, 18679, -13160]
435a3160J4216K1631k6680j4053L1039K248l2603P559K2380k3854q841L2299m970
448G211l1438J6563K5956j9573p848K5721j2053k8004L5838L0271m9937k7311
460c4604M6421J3548l3058K495J2430k6014k101M3493o267m6976J1952L3049j5050
473f82j453K3538k7673l0205N0871M0768n4602m1524M2793K2090k6441R121R265
486A5866m4374m287N9228M264n5002p010L1566K262N108J7331l5690l5960N6208
499I510M8868n4002m0364L7503J4799k1094J8004J2668n0616j6532O2447J4443
511C5634n5942p085K8794o392M718K6360k6734m0450L6226M6284l3766l0199L3763
524A1211L167l3704K5629L0117m5172k8515M3525J7971l4105p34J9468k2226q815
$$ y = [-13160, 1056, 22687, -3993, -18046, 12993, 15241, -17362, -9803, 12577, -11277, -20118, 12181, 7211, -24227, -7664, 18292, -1281, -9129, 16592, 4539, -23465, 12373, 42644, -7293, -34604, 11817, 25365, -7693, -5198, 7232, -18782, -20883, 22610, 16343, -30633, -18681, 14368, -682, -2135, 21403, -6270, -36475, 14396, 55164, 562, -40962, 1831, 23921, -2520, 6601, 15866, -28508, -32795, 26433, 30697, -24305, -31315, 251, 2513, 7621, 24952, -10738, -46698, 9510, 58378, 4376, -35988, 1515, 16314, -4780, 13224, 25892, -24724, -41256, 21191, 35634, -20308, -27393, 1401, -4991, -273, 26087, -647, -41097, -4871, 41413, 7647, -22552, 11211, 14378, -19326, 6303, 36420, -8752, -37267, 6258, 24229, -9876, -10610, 8858, -13368, -22183]
537b2183M0044j484m1174J4178K9793k2345m351L6084j4798m9031K4783N2918
549D2434k8613m2476K6102J4819k5242J4184K2849l8131k6314M2473K5319l0703
561c299q951J5786j4745L012M3387j3684n9609J5722N6882j0218l4021R363Q33
574D58k2709K4215L4366m0886m1951L9380L3034k2142p515M568k3491M648N1402
587C3377j114o0837n47N5265j124l1218J0636k479k7705K1952L9577k8733m3365
600c6315K4259L1402j7797q678J1164j8791o152M0501N538m2027K858L4301j1716
613H547k1734K3202O506l5468N200L9577j4401l0690J7420Q400k4596Q804K8418
626A9185j9181k5895K7008J9961k5761l306K1086j6487j3350L3378R160l8318
$$ y = [-22183, 17861, 16377, -24797, -10619, 19174, -3171, -7522, 28562, 13764, -35267, -10484, 42434, 13821, -28655, -2553, 12266, -12976, 1208, 24057, -14074, -40388, 2085, 27404, -3299, -12250, 3536, -11209, -8197, 35190, 21506, -38103, -22381, 34501, 24283, -9738, -375, 458, -22251, 1964, 36330, -4556, -46507, -7127, 25907, 3765, -3750, 818, -22673, -18025, 33377, 32263, -28574, -29121, 26144, 25020, -6198, 4438, 1959, -25746, -3794, 35783, 7050, -36315, -12056, 19346, 1549, -7129, 4035, -14756, -20908, 19593, 25131, -16896, -14038, 20263, 8547, -13187, 10015, 16521, -18947, -13747, 25830, 11429, -19261, -1841, 6559, -18037, -9233, 19185, 4, -25891, 1117, 21078, -4683, -7989, 13097, -3390, -16740, 16638, 25798, -12520]
638a2520m587L2711l604k3065J0105O037k1887O905K6742j3885k0085J7850P192
651G909j9346P312K0942j7921j7722K7884J6061k7421p508J7697q609r918K0991
664A0351K571k8689r05K8797j398k1404L763N836r567J0507J7353j7664j5663
677a6112K0713J3801j7245p474R139m160m071J7551P36k4203k01J9109m971j2491
691i879O697L154q590O780J3749j0927j3378J4177R579j3355k041R897k871m746
705a754Q057J712j1658k051P836m632o669J0032M354r708k37P012k325m814M131
720g14K628l073L350P019n042q259N555M456n746j782J022k397J084N114j415
735A800p681q1P881k964o402M903O596p24j713R69K61j962j250J391Q2J08K065
$$ y = [-12520, -17107, 15604, 12000, -11065, -960, 5077, -16810, -9905, 16837, 2952, -17133, 717, 7909, -11437, -4125, 16817, -1104, -18826, 9058, 25119, -2302, -9810, 7887, -722, -10640, 10351, 12922, -15767, -16672, 12125, 10727, -10677, -6914, -1078, -10645, -138, 17215, -449, -16112, 4601, 18402, 1157, -6317, 2822, -1338, -5409, 12142, 12878, -11325, -11526, 7583, 2612, -9879, -3182, -28, -8618, -1838, 11911, 984, -12394, 1783, 11362, -1993, -4034, 5863, 2992, -1754, 6303, 8015, -3643, -5694, 2142, -2490, -9159, 873, 5227, -4481, -4718, 2294, -31, -4845, -714, 1914, -1159, 2191, 9210, 4168, -4091, 1464, 5920, 174, -1608, -586, -2983, -1899, 3215, 1800, -5881, -5962, 1919, -1045, -7447, -2544, 4052, 3328, 1615, 2584, 2845, 883, -367, 1024, 1106, 1214, 3279]
752C279j651l310N73J4j479r6p37L00J252K398J469k701j206M479N80m219o81
769a736L904L487j061l802k90lj891m59p65l50L009P74k888k69Q38N05r48N66
787a379L500q23q62L259R68l151m89J094j599j618k91J247N77q08L92k115j409
804c507J404p15l61L977J664j891M36J756l50k910M65L762j499k708J767l75j058
821a43J04j707j396K47J457n43j109K876K660k294j272J910r81J19L145l72j703
838I98J748J188k885l495J119J569j778K52Q69k808Q41M107j855m135K183M085
854B003n27k511K165K338j507P82J52m712L27M611k104l953K076K756l086k717
870c907K378k75k069L902L002n034J43N610k85m044J135J736j982J65L578k969
$$ y = [3279, 1628, -1682, -1109, -1095, -2574, -2670, -3407, -3107, -1855, 543, 2012, -689, -1895, 2584, 3164, -1055, -1736, 2168, 5655, 4594, 792, 502, 499, -1392, -1851, -2616, -2966, 43, 817, -2071, -2340, -1502, -997, -1945, -1379, 2121, 1298, 436, 3695, 4663, 1512, 1023, 2117, 518, -1100, -1391, -144, 433, -375, 17, -2098, -3507, -2103, -2818, -3179, 798, 2462, 571, 1007, 2763, 2413, -497, -32, 3730, 2231, -477, 1290, 915, -143, -39, -1746, -3142, -2895, -1438, -1981, -3090, -214, 2446, 152, -1120, 790, -191, -72, 3073, 2701, 998, 2746, 3934, 1049, -2446, -1327, 242, -1536, -1284, -415, -3223, -2382, 1725, -130, -4265, -2082, 2003, 1476, -1035, 1130, 3468, 1961, 2743, 2895, -1817, -1490, 3121, 1017, -2936, -860, 1896, -1190, -3907, -1529, -1804, -3873, 29, 3031, -2003, -1860, 3750, 3465, -579, 556, 2292, 310, 475, 4053, 1084]
886A084n397M867L847o744l326N047J24l036K967L828m770l112O090K864n189
901h56N78K783k103J928L311m606n848M395M924m890l960M424j245m290N891M872
917E308q976m165Q815M278n539j276L800j730n80O518k301r469K795P580l250
932A808m336K725p59n400M312P222p089p358Q108N754n566k81L486l219j436P102
948E073N30q514P40O950m292m044P500j637j1232M003J1655n684r366O922N166
963C770p379R89R826n679q912Q455O620o294j992L941m958k559J0187P79j4422
978g628r08J3098j731p764N410N30r009M913J3080o442j2678O461J0093n690p91
993I44M743q802m869J4996M506j6983l968J2223q7p384O739K101j4541J670J8763
$$ y = [1084, -4313, 554, 4401, -2343, -5669, -622, -498, -3534, -567, 3261, -1509, -4621, 1469, 4333, -856, -278, 2505, 402, 2330, 5641, 1035, -4813, -418, 4506, -384, -4344, 80, -1165, -5455, 436, 5308, -3668, -7833, 982, 5260, -279, -1555, 2245, 515, -65, 6453, 4152, -5317, -2522, 5058, 1808, -2528, 197, -562, -5962, -1650, 5572, -1517, -8875, -767, 4987, -579, -860, 2626, -593, -2029, 5073, 5603, -2911, -2171, 4779, 487, -3557, 3943, 2306, -8926, -4923, 6732, 1048, -8318, -1396, 3770, -3609, -2620, 7206, 1527, -7385, 1070, 7690, 1396, -596, 3345, -1613, -4172, 6015, 6794, -7628, -8536, 4562, 2831, -4933, 477, 1007, -8002, -3089, 9991, 3549, -9129, -2668, 7425, 1735, 944, 5687, -3115, -7984, 7012, 11518, -5465, -9433, 2790, 2703, -4681, 2058, 4159, -10382, -8712, 10051]
1008A0051k688j5532L389Q270k426J511M738q857p840J3145P673j3232m440Q901
1022B663m203m462J1961N88j7877O72J8768p99j4353L910P396p800K088J2250
1036A0802p886j2172R018R200q861k796P325n652q436J2631P081j6369m989J4128
1050C024Q68q394N765K910j0222Q55J3744k113j1719M084N875o824K726Q477j0313
1065a257j0217J2938Q652j2732n396R961j727q278J0727O632j5226m387J5572
1078E262L096r744j52L434m504K652R565o459j2733P163R234o608k952M737n370
1093c379m462J1236N302j2434n600J1624K933o608L057K246q700J708J1953l099
1107E777j1810K827P279m239k132O001m351q546P715Q902p701o542N830L084k970
$$ y = [10051, 7363, -8169, -4780, 3490, 1064, 2575, 7313, -1544, -9384, 3761, 11434, -1798, -6238, 2663, -1540, -6002, 5959, 6547, -11330, -10658, 8110, 7311, -7042, -3132, 4264, -3536, -1448, 10802, 2916, -9256, -238, 8962, 101, -2695, 4630, -1022, -9458, 3173, 10254, -6115, -11104, 3024, 3892, -4502, 1263, 4173, -6049, -5194, 8550, 6437, -5282, -1198, 4677, -2147, 579, 9056, -1257, -11474, 1464, 10116, -2616, -8012, 1949, 222, -8056, 2671, 9303, -5923, -10310, 5262, 8358, -1386, -1538, 1896, -2608, 44, 9609, 3150, -9583, -2420, 6814, 206, -2746, 1991, -3379, -7841, 3395, 8697, -3737, -9337, 2287, 5220, -1388, 1669, 3915, -4785, -3077, 8876, 5777, -6033, -3206, 4073, -166, -2298, 3703, -648, -9194, -1479, 7423, -278, -6820, -990, 2094, -876]
1122h76K866K484p108j462Q698Q66p602J014L383l803M29N673l852p860M317P551
1138D718m827m039N247o16n190N495N708o892m484O835K931n174R3L381m497k231
1154c542P042O59p795n50N196o27k248J893k10l317K789M322k876l094L516O52
1170A810k515K806J894m846k810O360J150o038p19M112j714k761M459M76n174
1185c510L23N581o06l488J494J889k033O79L800l212l378L277J975l467n89K098
1201H33j324j769K323J338l824k28L473m93j308J871J00k319J801K832k771k460
1217a925K939J720l627l2L091k336l220K638K006k700r44K128R15j875O09J734
1233A121j186J28R23l41k22J167o28j497J223Q35j755k017K042R10j998K44J327
$$ y = [-876, 1990, 4474, -2634, -4096, 4602, 5468, -2134, -1120, 2263, -1540, -1111, 4562, 710, -7150, -2833, 4718, -109, -4148, 1099, 483, -4707, 788, 6496, -396, -4880, 1955, 4886, -288, -195, 3186, -1311, -3542, 3500, 4159, -3636, -4186, 1010, 383, -1865, 28, -182, -3499, -710, 3612, 736, -2358, 1158, 1810, -705, 2101, 3995, -851, -3661, 2699, 3849, -2189, -2908, 1204, -510, -3271, 1188, 1664, -3510, -3187, 2394, 1788, -1700, -206, 1683, -350, 329, 4129, 917, -2461, 816, 2791, -676, -1265, 833, -491, -2260, 63, 1401, -2423, -2651, 822, 329, -979, 892, 992, -1327, 474, 3306, 535, -1925, 1014, 2734, -893, -925, 2166, -170, -3390, -752, 1254, -1446, -2390, -262, 653, -1222, -613, 1121, -65, 63, 986, 645, 423, 1590, 962, -535, 688, 1523, -232, -2249, -207, 703, -1295, -1051, 276]
1250B76j305n99J987k5r57L13J730j14j485J133N93j682J54J248j123q22J167
1267D89m48l35q02K9Q40p32J17J26K94J166l2j540J329R88j027l65L88Q46q62
1286D69n63O65m24j203M63O06q68l39M29P57L5o30M05K94R1K91k82O3P73K88m99
1307H21k36o20j35M71r37l40M96J79J69p34O1O84j28o23J208K93l47K83N35N80
1327A680j081j115Q63P20j161p39O30N44o10q84J74N58k62l26N76O60P3P2m93
1346a21O95K27l28k23M6Q15m06o55P00m71j491L79Q53m21r90K92Q87R0J76n3k84
1367b83k73J847m77j081P27J206j268o32P43l7j615k95K210p95j639J457M80j130
1385h55J29R17n38j48J458K5j129J282J274k355j721K802N85l169K14J782m39
$$ y = [276, -1029, -1628, 359, 334, -623, -310, 1420, 1306, -179, 954, 1547, -135, 19, 1267, 144, -678, 489, 41, -294, -1096, -1067, -227, -959, -842, -716, -422, 744, 712, -828, 501, 1489, 462, 97, 485, 1331, 469, -94, 571, 147, -1056, -593, 13, -855, -1194, -765, -8, 27, -603, -198, 96, 187, 478, 196, 259, 1032, 1320, 821, 585, -35, -170, 301, -636, -976, -480, -301, -132, -866, -805, -121, -249, -872, 336, 629, 282, 565, 1100, 1680, 599, -516, 347, 1067, -94, -833, -203, 341, -269, -1153, -979, -421, -683, -1009, -433, 227, 300, 372, -121, 574, 801, 473, 250, 296, 1111, 705, 50, 750, 279, -1212, -833, 20, -401, -1391, -1099, -212, -122, 54, 1, -283, -556, 1291, 814, -267, 460, 1666, 398, -234, 509, 472, -1143, -1438, 772, -23, -1662, -205, 275, -855, -726, 191, -347, -495, 963, 988, -141, 1141, 2415, 60, -1661, 1141, 1726, -1443, -1229, 553, 114]
1402A14j249J465l14k766J404K766j467j598K175M42j401J607R34k709j279L493
1418A617J073l407l41K279j232j372K255o47k945J584K360r08j688K028j59k551
1434b054K536K984l516k484L885J365k990J16J415k162j262L452O43m354K77L125
1450I76j126r52K356j435k951K769M551l213l603L676J550l453N88L004l571j931
1466b765L636J564l346r15K286j238r04L116n18m097K063M235k445k146K645Q1
1482A252l386K335L628k774m635L509K733l064n85J287k393n26M521L07m646l12
1498b749M336m82k254L070o62m271K214N656k630n222K063K446j463n01J777k386
1514a058k329L791K362l892j163K546j038l61L504K3n132N83O131j095m825J328
$$ y = [114, -1135, 330, 16, -2750, -1346, 1420, -47, -1645, 530, 972, -429, 1178, 2112, -597, -1876, 1617, 2690, -717, -1058, 1221, -11, -1383, 872, 225, -2720, -1136, 1224, 316, -1372, 656, 497, -2054, 482, 3466, -50, -2534, 1351, 2716, -274, -158, 1257, -905, -2167, 1285, 1928, -2426, -2149, 976, -150, -1102, 1254, -181, -3132, -363, 4188, 975, -2628, 1048, 2598, -855, -267, 2737, -834, -2765, 871, 2435, -911, -1826, 460, -778, -1682, 1434, 916, -3181, -1118, 3117, 672, -1474, 1171, 1252, -2134, 201, 3829, 1055, -3580, -71, 2662, -402, -987, 300, -2093, -2619, 1902, 2209, -2437, -2749, 1587, 1105, -1149, 1921, 1259, -3012, -798, 4858, 2228, -2994, -931, 1515, 52, -449, 1328, -1058, -3387, 404, 2766, -1126, -2289, 257, -781, -1142, 2362, 2385, -2747, -2164, 3967, 2872, -1953, -625]
1530f25K011k811J018L572k820m342K647L313j875j640J775j372j157M484J405
1545C583n715j206N009R04l018N87J240l154K43M603j206n107J419L077j645o37
1561a023K469k106k726L871K915l907j995L634L37k679K606J522m510j258N036
1576B186P40m486Q9J935j736mL560j675m719K889L867k255j685K139m53k172K984
1593A204K499m262k448M172J135l205N75R16k331J39L747p52m489J058L595j590
1609c7j218K704r00l247K968L551l149l047K793J255j983M80J253k886r25L640
1625A252j23l070N89K186j793J59K558o81l781J839L693j950k217K194Q3j967
1641a029J821J274k726j568K723R02k513J48J376j495o63L426k47l393R25K496
$$ y = [-625, 1386, -1425, -407, 3165, 345, -3997, -1350, 1963, 88, -1552, 223, -1149, -2306, 2178, 3583, -2132, -3338, 1671, 2575, -443, 144, 1384, -1770, -1527, 3076, 1870, -3237, -1818, 1259, -386, -1023, 1446, -660, -3386, 485, 3400, -507, -2502, 1132, 1469, -1210, 1396, 2918, -1592, -2850, 2186, 2926, -1560, -1471, 464, -1272, -1276, 2284, 609, -4110, -1221, 2646, 391, -1294, 845, 392, -1780, 1204, 3703, -559, -3007, 1165, 2300, -905, -330, 586, -1745, -1606, 2141, 1389, -3100, -2042, 1553, -37, -1255, 1449, 549, -2698, 270, 3821, 672, -2375, 418, 1673, -310, 170, 1423, -1463, -2388, 1252, 1129, -1941, -1352, 834, -959, -800, 1758, 1077, -2704, -865, 2828, 878, -1339, 855, 938, -1029, 792, 2066, -660, -2228, 495, 1397, -1116, -968, 408, -1087, -1750, 1676, 1429, -1964, -1039, 1457]
1657A457n79j409J281K37j746P30K167j941j229J001L14j139O70Q19j906m46K210
1674D91O04k333M57J704j104l52J746K7j458MJ515j60j682P03K86j282N71Q30
1692E67j376n99J452M26j206k9P55r2n06J201N77j147m1P11k22j44l6q0p53M33
1712a09Q28j179p82Q65Q07j249L53M44k9o33O90P85m15p74P65N51p23R9J1r8P
1733B14q2n88j2m7O7k93K40Q49j97q75N81O61k59l90O12J05L79m86l31K90n27
1754h9J14K36m45k02L26l64j31L94r3n73L80Q95o1p93O57Q50o44o38P49Q5m12
1775B41k12lL70n11j21k07p7O86m56o90Q05M13m74j72P62M86o72k22P02j47n72
1796g1K22M46q46K78O0o56N8M15k32l01L58J98l32k14P72J36l82L33K10J16k91
$$ y = [1457, 878, -531, 750, 987, -759, -29, 2138, 197, -1032, -31, 283, -856, -186, 633, -1273, -1719, 491, 1095, -1238, -781, 923, -181, -533, 1213, 1240, -218, -214, 1301, 1141, -541, 162, 448, -834, -263, 567, -809, -1408, 44, 470, -736, -765, -10, -102, -608, 593, 1170, 23, -18, 693, 471, 327, 291, 211, -542, -109, 719, -460, -1242, -377, 430, -819, -466, -22, -51, -684, 6, 791, 376, -398, 367, 918, 195, 294, 305, 207, 214, 132, -456, -468, -515, -448, -741, -501, 348, 151, -724, -143, 518, 259, -131, 481, 586, 965, 479, 148, 438, -89, 25, 261, -184, -386, -60, -424, -555, -161, -254, -827, -447, 448, 387, -406, 251, 1101, 457, -181, 568, 653, 241, 29, 26, 396, -115, -236, -443, -520, 166, -290, -980, -175, 238, -236, -408, 354, 840, 168, -54, 648, 501, -71, 151, 597, -249, 29, 89, -567, -509, -94, -326, -627, -269, -71, -403, -617, 155, 291, -91, 242, 452, 568, 277]
1817B77K27r0J9k15j8m72O5L57m65m50L02M57n91J6M25M59o06n5Q15k47l66O46
1839D90K30l93J84j38q15M98L80n49o77K30M79o11p1J026m53l63M71N64l46l03
1859a67L87K94m92O74J69j315K74J120r60o86N45L19r08n9Q30M7j103N16J181
1878F66m44l98M35K7l1M55%p18j46Q14m21r29P97J61j389K50J246n2j293K29J247
1899E06p88K93M93n38l33N67J036r04m47Q85m14o66N94M50j521p00K221l7j445
1918g48j31R49k43m67J210%j296K72J919r44n92L15J09j436J659P55k077j183
1936a929K128P15j493n10J185q91n53K258K10k108m9K011O1r54M41j02j371J207
1954B56J503j516k076J572J100j776N50J163j634q20K209Q93k001n58J860j92
$$ y = [277, 504, 414, 433, 218, 200, -272, -207, 150, -315, -765, -463, -6, -597, -581, -156, 303, -303, -358, 457, 210, -156, 490, 720, 327, 511, 373, -442, 56, 436, -113, -790, -560, -81, -692, -763, 263, -190, -553, -82, 482, 136, -167, 220, 514, 22, 696, 865, -450, -176, 944, -16, -702, -157, 162, -746, -805, 25, 72, -1031, -515, 666, 222, -176, 259, 286, 255, 710, 710, -8, -154, 660, 239, -690, 107, 268, -1121, -871, 375, 323, -970, -741, 506, -282, 11, 504, -34, -367, 200, 1236, 332, -115, 770, 356, -310, 284, 734, -787, -1487, 734, 697, -748, -879, 70, -173, -640, 570, 570, -726, -454, 1465, 521, -71, 244, 353, -1083, 576, 1331, -746, -1929, 199, 914, -579, -1089, 96, -795, -1348, 910, 1120, -988, -1037, 974, 1035, 81, 522, 420, -951, 256, 1759, 243, -1833, -261, 839, -937, -387, 776, -858, -1678, 531, 1424, -577, -1135, 725, 533]
1970E33p16J529j19k181K10K869j529k062J295M35j443O41K229k040k167K403
1986a13J644j986m94J587p00n35K113K37k715m17K918p20j788J635j02k513J143
2003h06K578j812k340J513J757j250l20J809j508j281K781J343l264k25J683L2
2019F90j099J496K71l333L91L487j129k848J558Q90j407Q42J764j926j753K200
2035I4K241k542p09J997q02j342L005L2l404k21K751r9k373J210M70j583N87K298
2053A610j314k372J478J814j018M3Q05j395q35K435Q24k707o27J987j19j345J357
2070F21o2k195J61K505R6k622P48J605j172O15J192j492j704J952J741j653j040
2087g04J028j52j039J386L05k130k17K307m01j143L53L22p28L79J978q44k108
$$ y = [533, -183, 1346, 1227, -954, -744, 2125, 596, -1466, -171, 264, -1179, -538, 1691, -349, -2516, -113, 1531, -455, -949, 638, -62, -597, 1516, 1753, -962, -1379, 1539, 819, -969, 666, 564, -1949, -806, 1772, -40, -2380, -867, 890, -360, -680, 1129, -379, -1660, 1121, 2464, -800, -1025, 658, 690, -409, 1087, 1358, -1975, -1584, 1903, 774, -2074, -516, 374, -1033, -191, 1573, -353, -2106, 94, 2335, -207, -916, 1081, 279, -1063, 1942, 1974, -1430, -1651, 1100, 1001, -1372, -162, 308, -1275, -688, 1610, 296, -2076, -598, 1216, 198, 241, 1046, -349, -1184, 1251, 2075, -632, -1259, 728, 609, -736, 621, 559, -1636, -1475, 1030, 1126, -1496, -748, 857, -315, 300, 1492, 0, -1704, 248, 1989, 336, -704, 324, 172, -867, 519, 824, -1306, -1523, 784, 383, -760, -407, -85, -813, -434, 1544, 700, -1408]
2104a408J276J644j292m49J239r88r51J271J032j706j074J311N77j120K27O66
2120B55j247q2K174m60j030K95R29o99n5J079o61j442P87J604j252j159J076l11
2138a99m14M22L13q47m04J556K95j038K10Q70p98k68J627l15j802L62J451n17
2156E04j050N00J08p85L71O77o49n64P79L81l47N2O93q76j6J205k14j356N06J043
2176I62r25n86P52K80j265R5J132l34q60M25M63m00M39N13r38j66Q19M22q08l17
2196b97Q98j42o80P24r5p59j3M67n4n20o0R6l3L46L50m97M0N75K24n77K62M97
2218G52k03o61L38N11r28l41O00n2n06P4K09k94K16J16J18J49J7n6J6K47k3j75
2240A24k45O04R1n69k15K11J7l42o2J97k99K56M32m17O2K05O4m52L96L38N9j89
$$ y = [-1408, -132, 1512, 220, -229, 1010, 22, -929, 342, 1374, -332, -1406, -95, 482, -638, -411, 255, -992, -1074, 1100, 640, -390, -95, 834, 135, 80, 1159, 498, -944, -157, 1447, 195, -964, 112, -199, -613, -191, 122, -725, -1129, 427, 722, -316, -106, 764, -34, -302, 1325, 1010, -792, -430, 1021, 504, -546, -46, 62, -723, -352, 325, -324, -888, -109, 272, -75, -23, 670, -206, -222, 983, 769, -587, -81, 962, 37, -549, 203, 483, -782, -687, 445, 111, -749, -324, 139, -261, 178, 691, -247, -413, 406, 828, 20, -297, 601, 459, -221, 503, 408, -351, -364, 103, 49, -471, -531, -435, -468, -122, 228, -269, -229, 346, 570, -7, 255, 752, 549, -112, 226, 737, -191, -532, 68, 16, -490, -416, -207, -501, -285, -169, -51, 98, 115, 59, 75, 322, 299, 124, -121, 483, 574, 5, -210, 1, 18, -324, -386, -189, -488, -232, 200, -217, -155, 50, 114, -338, 58, 396, 455, 266]
2262B66k46P66n76m00k7K00j65oo2j87K15k49J69L18j34J80k58J87M50k23l6K71
2284D53K47n42k48K08j97M74m78n6l0j33O2j8J20N7K11l66L41j31K31j47K13n2
2306B19n8n6P7J11r1m70J97Q3j74k26J68j0J69j19k26N19n7p7M0M70L0r5n19J37
2330D2M04J5n12L45j50m59j63M18j21j62j86K99qK97l5k90L59M48q7m22M55K26
2352G13q59K17K82l87m54J65M06l10N3K31m33j10M55m4l22J82P23n62l4P30K4
2373F66q76J81Q75m40p35K84J19n20K88L05o43l90P21N15p84K53Q8j76L6Q30k59
2394C38p65L49R77l16j013P23J52q38J68N80p01q10J133R9q76Q15L14q47l33J469
2414F18L09j344K06Q52l58l12O04j77j121J00J476j025n56P36o1q39N80R54j297
$$ y = [266, 20, 786, 210, -190, -217, -17, -182, -188, -250, -437, -222, -471, -302, 16, -118, 62, -196, -9, 441, 218, 182, 453, 700, 158, -90, 118, -79, 395, -83, -139, -169, -302, -240, -258, -138, -81, 130, -236, 105, -26, 205, 58, 271, 219, 161, 105, 182, 293, 202, -268, -71, 12, -162, -388, -220, -230, -61, -180, -406, 113, 56, -21, 19, 489, 519, 424, -95, 42, 446, 461, -51, 294, 144, -315, -478, -60, -181, -343, -529, -230, -238, 59, 24, -266, 93, 541, 454, 32, 487, 713, -146, 71, 353, -34, -488, -323, 83, -227, -174, 57, -376, -486, -31, -75, -397, -215, 508, -54, -88, 642, 666, -210, -29, 846, 406, -329, -45, 74, -446, -158, 147, -496, -886, -165, 350, -434, -181, -93, -269, -233, 597, 338, -427, -78, 899, 583, -430, 293, 445, -393, -225, 355, -346, -1156, -23, 76, -800, 15, 329, -518, -851, 618, 927, -417, -211, 641, 283, -29, 575, 398, -723, -623, 853, -172, -728, 8, -53, -892, -312, 642, -655]
2433f55m96J686L96j415L02Q12l71n07J169k13j421L28J067l99o41M60q2r52O11
2452c21R77r67j157J656O48p63J29M65p46o33J417N68j577n15J402m62l10K25
2470C6j20r97L77J529o40j294J111P36j299M43J373j306j213J824O57j097n14
2487c94P78n68o4P66r5j739J83J853m15j022R06j41r18N99J451o71j723J001J617
2506A404j226k79Q42r87o01J472L93j540p86J516k1o83O84J79j744L07K473o19
2524G84j692O83R74n30j70P39l35j626J268J373j601j064R88k20l30J249p9j617
2542a206r1J806N66j667N51O32r90L64J451o91j992J132J555j169o74N78n13q64
2560a222J454R03k335l93K118N8r62L76M51j196j64K497o57j630O18O11n14n9
$$ y = [-655, -1151, 535, 931, -484, -182, 630, 259, -248, 921, 708, -713, -385, 682, 283, -358, 102, 20, -932, -321, 656, -311, -1468, 188, 836, 73, 202, 667, -79, -712, 705, 1273, -304, -819, 583, 121, -189, 36, -84, -1081, -704, 825, 185, -1109, 2, 738, -561, -118, 1255, -51, -1264, 560, 1217, 120, -394, 384, -184, -248, 518, 423, -1316, -1133, 720, 305, -717, 189, 48, -870, -271, 1180, 509, -1214, -213, 1404, 178, -101, 741, -246, -847, 625, 1018, -522, -1308, 208, 187, -496, 188, 367, -1377, -1070, 1403, 784, -908, -225, 749, 219, 49, 788, 453, -1173, 95, 1468, -133, -1197, -209, -429, -759, 490, 411, -1206, -1297, 509, 1075, -592, -41, 591, -399, -35, 1416, 725, -1267, -135, 1420, 251, -423, 155, -358, -1222, 232, 1135, -1200, -1593, 525, 583, -379, -3, 448, -748, -912, 1585, 928, -702, -84, 527, 13, -46]
2578d6N96n73j306J254J064j375q84J599l05j023J274O52j417l17J667L34j428
2595b34O5N51o9l99R81n75j757J129J165r96p83J257m97r66J212R80j531q92J988
2614F29P00j643M52O52j026N4J437m64j350j16J283o50k58P60o62j110J062J301
2632A051j262p40J182L46j021P40O36r65l25J069N2j014O1O89p27k28R04n21r60
2651a033N40J026o88m77O92M21r10O86O82r80J59P6M71n37J31m32k25K21N65m75
2671h7n58L68L34l11q8J78L49p25M05Q08n45m10O41M1k53P3L65o94l90Q15j2l96
2693i2n56Q16l90j99L08J05l36K4N40J92l09J35R4K6k14L44o44j06O43k37j15
2714B9k73J39j38m96L85N01p79J19N64K39k53j07L32J71j78j39L91l56M8l2j65
$$ y = [-46, 550, -23, -1329, -75, 989, -386, -1270, 329, 24, -999, 275, 927, -490, -807, 860, 1194, -234, -169, 382, 313, -86, 895, 320, -1437, -308, 857, -139, -922, 335, -162, -1128, 84, 1064, -467, -1359, 629, 1329, -314, 138, 790, -236, -182, 1255, 791, -559, -675, 608, -42, -300, 460, -202, -1312, -250, 1051, -211, -951, 231, 577, -444, 296, 932, -33, -358, 711, 763, -251, -190, 499, -228, -456, 448, -73, -1033, -493, 533, -155, -632, 60, 481, -429, 257, 939, -41, 118, 194, 665, 128, 259, -173, -398, -177, 388, -87, -645, -277, 57, -254, -342, -164, 185, -540, -135, 673, 128, -282, 359, 400, 147, 220, 585, -109, -499, 316, 304, -92, -648, 168, -222, -421, -113, -8, -344, -320, 220, 412, 103, 238, 332, 358, 144, 488, -156, -262, 381, 144, 29, -244, -105, -243, -739, -354, 147, -632, -513, 51, 290, 37, -70, 262, 433, 255, 116, 507, 151, 199, 167, 2]
2735Bl54M12k66l73K84M56n37m27O04L55m48J80M51j4k21J01L29j04Lk13l40R7
2757b3L17j91r32P23K35n66j95O45j65k11j31M30K22k73J13M38k68l7J72j04N2
2778B51n8m68q5L44n0l24J24P80o31n76N35K85k45k6M77j29j33K88n6j8j87K51
2800C49j32j19k7j17j65m59N35J95n25JM03n1j63N08l7N3m9J60m98M50J95k84
2822B23j29J0j28k7l80K59J98o74L78L21m40J33M27L5j0j94M96k79Q1L46m48m02
2844b04L87L96m16n13L41J19o56J00L01l72jN05k08m0L90j32N9K87J74j58m85
2865a26M85K46m41l66P81o99o51N00N63m67k52J32N82m31N6L97o13K63P64j84
2885E39l78k2L36l48k78P13n00r47N41Q36r61l41Q04j61k12M55L42q38j69J036
$$ y = [2, -352, 60, -206, -579, -295, 161, -376, -803, -199, 156, -292, -112, 339, 325, 104, 205, 534, 430, 433, 220, -120, -23, 294, 103, -829, -106, 129, -437, -632, 13, -152, -363, -494, -64, 158, -115, -2, 436, 168, 131, 303, 199, 251, 193, -275, -360, -16, -66, -390, -266, 514, -117, -693, -158, 127, -118, -144, 333, 204, 71, 359, 303, 285, 98, 349, 217, 98, 71, -46, -211, -670, -135, 60, -465, -464, -61, -112, -275, 233, 196, 249, 200, 360, -138, 312, 507, 223, 94, 104, -24, -51, -431, -172, 26, -648, -270, 51, -389, -256, 171, 206, 196, 2, 498, 219, 300, 646, 198, -204, 183, 579, 163, -350, -9, 110, -546, -446, -145, -517, -518, -13, -221, -261, 129, -3, 56, 343, 517, 359, -126, 359, 605, 164, -202, 579, -120, -771, -271, 292, -175, -427, -295, 287, -144, -88, 309, -304, -41, 723, 539, 161, 139, 475, 127, -151, 562, 62, -885, -344, 492, -469, -810, -6, -167, -379, 76, 418, -420, -589, 447]
2905D47N2n41L35J16n26OJ012k62j074O2P15k65o89L99L20r73N55P27n92l36P12
2926B00R0m09R44k20r03J49J045j01j225K57R10j165k4J166n46j603O15J453n24
2945A09r36R83J4o87R16Q31j462n51J707m1j103J48N13o05m96J622n01j883M65
2964i57J458r09j17P15m75n70J200J003j000j156J483L15j248P11M76j453n96
2981a120J752K01j818p8J216k02l91Q63k32j432J082J251p21r34J039J67j038
2998c95P31J171j809j193K058L76j579K58K88p92O2J415k26j335J72J699n49n25
3016a73Q38l98j125J156J329j236j490J351O45j339j08Q66j041m51J778j05j464
3033i67K25Q51j92r2P74j29j396R12J466j122j120J139J54q39P19L63j172p46
$$ y = [447, 499, -42, 293, 409, -117, -111, 901, 639, -435, -373, 342, 77, -612, -213, 107, -866, -311, 416, -176, -512, 200, 290, -119, 825, 605, -298, -149, 896, 795, -430, -173, 737, -428, -452, 714, 168, -1435, -820, 633, 109, -827, 156, 170, -517, 399, 1230, -232, -783, 924, 883, -220, -72, 441, -164, -660, 962, 461, -1422, -957, 501, -408, -525, 190, -285, -855, 345, 1348, 348, -808, 675, 990, -258, 453, 929, -524, -1120, 632, 833, -985, -1063, 153, -49, -440, 423, 191, -1241, -159, 1092, 371, -563, 476, 643, -395, 336, 1507, -302, -1495, 563, 939, -640, -382, -94, -886, -824, 591, 365, -970, -798, 901, 352, -173, 665, 267, -858, 298, 1627, 391, -1099, 252, 897, -442, -550, 316, -725, -1176, 602, 497, -967, -742, 109, -83, -175, 599, 470, -926, -14, 1452, 330, -790, 349, 503, -336, 383, 746, -426, -1172]
3051a172J000J087j574j68R66o32j09J362k98j136L75J179l32p00O18J27j110
3068e17P21Q29j139j015R71L58l01n15P34m77k66J146J5j137Q3J088m24l7O70
3087G87l19j397R25J177n46j512N42O03p98R7P98r12n43J286J26o40j3Q18j93
3106B86l48Q78N6j276R9J266o23n88K78M01r44M2Q40m61j034R65O04p22J80L67
3126B66l34o05J533J8j032r1P92J10q66N53N5r31N4J166o06j057N34M40l68j88
3146e57P50l97m63P45P89r75o1N73j74k96J87K52n60j28Q94k56r09K97K46l03
3166c46L45L45o52k17N73P42n74n71Q65J9r10P77N53j092l93O62J72n36P7j6k66
3187d43p7N50j51n69N44L92n84J15K46K24j75N14j11k96n59N06l6l56O05m85m44
$$ y = [-1172, -172, 915, -659, -827, 139, -493, -602, 760, 462, -674, -299, 880, 548, -152, 466, 593, -517, 204, 1033, -106, -1121, -150, 208, -93, -608, 126, -351, -617, 529, 544, -593, -510, 578, 154, 117, 787, 468, -929, -4, 1173, 627, -885, -343, 260, -538, -441, 357, -555, -1098, 188, 314, -326, -339, 479, 286, -62, 816, 872, -404, -305, 961, 338, -250, 28, 429, -515, -473, 367, -94, -1128, -163, 441, -281, -101, 266, -68, -673, 860, 878, -154, -245, 547, 657, -209, 344, 399, -532, -478, 688, 82, -975, -441, -1, -369, -557, 193, -204, -667, 78, 867, -108, -169, 404, 230, -66, 121, 373, -187, -315, 579, 323, -586, -289, -43, -346, -1, 344, -308, -525, 48, 790, 216, -355, 510, 529, -381, 396, 949, -143, -536, 126, 298, -238, -161, -177, -443, -520, 30, -121, -690, -146, 246, -338, -223, 23, 247, 72, 586, 475, 179, -380, 126, 90, -266, 339, -146, -590]
3208e90J62K55l70P5J88J3j26K3O46L2p34R90n7m76l9Q4K75l24J44J96n17n2k
3231b04M7m89M03J88l15L62j93M26m79L57O06n81j19L30jm29K13l87KL09k90j43
3253c87J15l2P8m17J32O49L0l50J27J96K17l56j8M47k77J14j57m1k2m6l75J48
3275b25J54l52J49M9j58N50o10K33P52m99j15K66J53o8J29l72J41k98mJ33k35
3296b27k0J27k77P4J25j30l0K44K70R2n77L42M79j88j53L04k81K8j84J80j45j43
3318i0k08L8J84j55j55j51L34M88m39k72P20j48p8jP79l96m17l8M51o03K46j50
3340f1r1j50N20j85m89J63L66l43l6M55L20n21J76M10j08l13J19K59l62j8K91
3361D02l53l67N06q1p45O44J52o65j43P90O1n52K03O25K4n61M54j01n48L20N59
$$ y = [-590, -428, -173, -543, -468, -280, -267, -393, -370, 276, 308, -426, 564, 507, 31, -8, 76, 351, 27, 171, 367, -150, -202, -204, -157, -646, -243, -55, -370, -8, -201, 225, -254, 103, 709, 128, 9, 339, 338, -91, 122, -265, -263, 46, -244, -387, -272, -304, -226, -643, -511, 138, 168, -182, -55, 141, 358, 2, -16, 431, 154, 268, 111, 70, 48, 2, -373, -225, -71, -423, -274, -225, -383, 167, -443, -210, 542, 43, -72, 194, 347, 279, 408, 36, 177, -121, -125, 8, -227, -247, -120, -397, -323, -198, -328, -358, -114, 156, 248, -329, 13, 492, 304, 151, 455, 174, 202, 18, 198, 53, -90, -298, -260, -76, -231, -386, -537, -203, 285, -154, -426, 294, 146, 68, 67, 846, 450, 33, -5, 446, -157, 89, -61, -152, -302, 218, 33, -456, -293, 73, -270, -306, 149, 469, -52, 124, 534, 426, 113, 232, 491, 129, 111, 402, 49, -318, 188, 107, -638, 6, 158, -507, -650, 140, 201, -351, -148, 477, 501, -60, 394, 293, -255, 65, 624]
3382F24o79j58L6qr0K08Q6l08m70J054J24r59L13O16n07J55N10r1n85N8O98m68
3404A59k80L47l04m09O28K07j039n5Q56Q4n09K21L74p1m66R01j68o82J90M87o9
3425D02l71L14l32n85O50M22j016m20J194k26p84P15M09n32m24J060K22p78j41
3444b21R01n89p8N51l37q83N73O88n61p69N29M5o98O09N56p90l30J002M09o73
3464f6k54L86K53n99J179j94j229J92P17m03l21N49o00j96K61N61n19p74R02P40
3484E85p14P7O96o78o5O17K06r24kL91o7k87O24m46j058P01J094n52j309P61N04
3505A54l86M92L89o27n45P76N24p15j83N06m88r5O48j89j046Q3J028o8j206O42
3525c06L84q75P16R49o66q85N22J210j068K03L5j22p46J142J52j167n7P64j75
$$ y = [624, -55, -213, -177, -185, -275, -67, 19, -289, -759, 295, 419, -540, -227, 389, -118, 37, 547, 456, -129, -71, 627, 159, -121, 226, -78, -487, 141, 348, -691, -746, 110, 194, -315, -94, 280, 209, -257, 644, 476, -206, -16, 471, 402, 31, 345, 13, -572, 78, 500, -516, -936, 258, 32, -752, -37, 372, -160, -584, 476, 698, -80, -221, 680, 91, 13, 564, 227, -656, -83, 605, 44, -725, -196, -151, -849, -240, 316, -474, -804, 198, 607, -66, -320, 66, 319, -280, 899, 705, -524, -332, 385, -18, -339, 210, -390, -586, -325, 236, -283, -1057, -155, 585, -129, -52, 644, -34, -99, 518, 724, -200, -202, 189, 122, -165, 459, 13, -1045, -344, 750, 198, -1111, -350, 154, -232, 260, 649, 22, -523, 253, 777, 62, -121, 385, -103, -198, 450, 261, -785, -702, 326, 258, -948, -306, 78, -797, -81, 868, 202, -683, -161, 1049, -19, 184, 219, 97, -649, 493, 645, -522, -579, 185, 10]
3544A0p72P38L59j093J75J481o91p13K50P29m32K30K33m53o19J086M64j348R2
3563b74M78j79n73O51Nj022M26P71j69l86j07O62o99L54Q86o84o00P02K43n90
3583a05K06L27m10p42O74O00j029m45J133R8p81L87J28m50K96M65j94l77M20K30
3603D31l69J07L90o55n32R15O5o09l37L28J70k51K77K35n81N6O35J40k72M3J99
3624C85k66k19O70k85r54R34K81q03j57N59l43j26K74P3j30j42K77o0m7M03j19
3645B05l31L88N10l99m39P0L71m02r5M00l49n65K11O67l70k77J99M23k10L03q1
3666B29j93o7N51j90n01K65L29l69k24J41J29m05P4J99k20k51L96J42l36K29J55
3687H3j79J51J84kj05L1l2J87o20O86j56p93NO05m71L10j57m1O0K95n4J03j37
$$ y = [10, -762, -24, 335, -758, -583, 898, 207, -506, -256, 473, 41, 271, 504, 51, -568, 518, 982, -366, -274, 204, 25, -548, 103, 108, -914, -488, 283, 114, -272, -379, 283, -416, -62, 824, 140, -460, 242, 485, -105, 101, 428, 18, -724, -50, 550, -479, -924, 209, 307, -474, -87, 41, -409, -113, 352, 158, -219, 201, 431, 62, 169, 559, -96, -628, 287, 352, -257, -594, -266, -96, -347, -70, 165, -416, -360, 275, 415, 143, 186, 385, 119, -100, 570, 285, -669, 265, 546, -257, -414, 145, -198, -324, -50, 23, -107, -249, 28, -32, -79, 324, 205, -126, 262, 772, 373, -66, 4, 375, -27, -122, 278, -71, -636, -425, 242, -128, -405, -206, 217, 7, 310, 229, 36, -31, 520, 330, -171, 94, 423, 54, -170, -29, 100, -305, -231, -32, -252, -503, -107, 35, -301, -72, 83, -96, 55, 239, 237, 132, 163, 131, 318, -302, 384, 228, -565, -560, 45, -426, -116, -273, -314, -254, 41, -13, 90, -47]
3710d7K08O00q22L15k16m8k85N30P2l17j62k6K58m01J81K15k72K2J79j10O8L40
3732B82n2k45m7L9L20n76O40l8k68k14N31k93k86l11M65k06rO9L06m06O88l20
3754F9n0J95Kj54J48R0m1k40m5L15j79n58M51n5l27K71J07k01j81L04J0J54J93
3777B78p1o9l46P97j14p98M89k0j14q8p8K67j1k06j01k10J24K90K0k21M23j58
3799H3r2K05q9K52k48m02P41m8l59J48o0k97j04J28o7O9m1j0r0L36p3k66J46M95
3823C57j25l78L19m6L4k77L06Qj30k35K91R8p00L04k00p7M41J53k25o2R1P7k13
3846a89L13J98j23p0R8K75m90l80K96N2m10M09l02Q9j48K01J03O9J94k27k7N24
3868D55o0j53l15J87L53m28k78L55k00L0O7j56k65J16L32j54j06J74K64j65J67
$$ y = [-47, 161, 761, -61, 254, 38, -10, -295, 235, 307, -10, -172, -198, 60, -341, -160, 55, -217, -195, -16, -126, -58, 282, 230, -15, -62, -23, 297, -279, 361, 323, 55, -159, 372, 79, -207, -518, -53, -259, -268, -199, 107, -299, 389, 69, 19, 214, 216, 62, 210, 300, 259, 19, -26, 289, 110, -448, 3, -52, -379, -108, -1, -202, -383, -79, -69, 85, 278, 207, 138, -208, 589, 475, -323, 166, 146, 32, -56, -134, 133, 122, -84, -185, -395, -271, 19, 39, -182, 241, 83, -9, 196, 107, 359, 111, -291, 450, 402, 43, 191, 131, -166, -270, -142, -209, -140, -181, -191, -281, 55, -18, -284, -138, 357, 232, -146, 173, 127, 161, -116, 190, 198, 68, -167, 124, 222, -478, -174, -374, -451, -10, 143, -82, -144, -53, 24, -189, 124, 322, 199, 129, 227, 502, 12, -368, -72, -20, -430, -21, -323, -234, -382, -181, -78, -9, 185, -42, -69, 455, 395, 242, -73, 114, 467, 39, -239, 116, -84, -54, 13, -143, -408, -292, 40, -114, -220, -46, 218, 53, 220]
3889B20K25l11l01J98M52k83j84M00k10m20J32K18l28K77j02p4j04J09l6j59K38
3910d3M28k80j32LL16k39R4N01n27k65J95K11k08n51M99k82l7O12n62j50L07P54
3932F44n69r3K27Q0n86L31N43m86n48M02J79J0k90J32J1n04P19j03n24P2N61j29
3954G9k58M65k8n56M71O03m93j40P7L79o42lK34l74j42J11M44n44j9L22J00l67
3976b81M42J80n72k8P78q7l18j1K70j55q0N6m04k25L34J70j29j54k7J6k69O41
3998A47L76o33k9K98o3k40K21J46p92N62L31k26m86L44Q8l39J77K88n16k43O33
4019D4K23o19K11M31j64mM4J47r3m55L72J92j76k34J59j69K47R6p81J76K38K35
4041A20o2j95J40k47j0N52K11o03P3L11n6j14j1Mk80j47O20l14k71j6L6L19j49
$$ y = [220, 445, 134, -167, 31, 483, 200, 16, 416, 206, -214, -82, 136, -192, 85, -17, -91, -195, -86, -122, -281, -43, 385, 105, -27, -24, 292, 53, 147, 648, 121, -144, 51, 262, 54, -497, 2, -280, -317, 295, -267, -417, -110, 644, 75, -18, 209, 289, -297, 34, 577, 91, -457, -55, 124, 134, -156, -24, -13, -517, 202, 99, -425, -353, 208, 79, -179, 286, 258, -298, 173, 776, 283, 143, 220, 599, -43, -46, 188, -186, -328, -217, 227, -317, -336, -14, 86, -281, 161, 341, -231, -259, 519, 432, 114, 103, 373, 218, 138, 194, -210, -435, -101, 69, -60, -214, -241, -225, -494, 147, 523, -110, -139, 159, 96, -144, 77, 223, -569, -7, 324, 98, -388, -44, 44, -295, -118, 170, -346, -589, 44, 267, -352, -141, 290, 126, 122, 166, 313, 220, -235, 137, 329, 153, -81, 78, -91, 156, 252, -529, -353, -115, 120, 58, -137, 3, -244, -254, 298, 509, -94, -21, 290, 234, 120, 109, 113, -167, -314, 306, -8, -279, -295, -259, 60, -89]
4064h9K35l37m5L57K67l71j23L30n8R5k57N3k08j11L24mk35N6L0J2J34K28l60
4087g7l05M66J28p5j52K49n7j27J0K13j89l5k20K35o7j15J33j75n2L12k04k00
4109c04J7P96n78K04J78j67l7n1K15n5k98J91j22J8mj59J22Q0k23m0j52J16J89
4132f4K45m09L10j5j07K53j64J34m53J86j01J22N8j2l09J02L27r7l99K76K44l2
4154I5k79M00j1k94P5r8L46q7M0l24J39J31O5m51K16K00m35M47l74J53j37k14
4176c97M44Q1r9m47L87K27l36L50j07j53K61j09R5j90Q2k68J69j83N09l86l22
4197c92K22K23O9l34J05K96j92K77J13m71J96m2j99K14K68m69J09O9k5r9l46M55
4219D7j37j25%M9M19l13r6M25r9p3K7k72L4K08j3Kl55M15l69M2J76l78K38J57
$$ y = [-89, 146, -191, -236, 121, 388, 17, -106, 224, 166, 261, 4, 57, -151, -262, 62, 58, -177, -121, -91, -79, 55, 283, -77, -382, 84, 212, 137, -15, 234, 177, 50, 60, 273, 84, 49, -171, 64, -3, -118, 15, -160, -212, 100, -104, -304, -287, 509, -69, 135, 313, 146, 109, 58, 273, 218, -80, 111, -11, 7, 3, -156, -34, 46, -177, -217, -369, -253, -64, 181, -228, 82, 67, -40, 213, 49, 183, -270, -84, -185, -63, -5, -17, -326, -224, 103, 6, -393, -117, 127, 95, -184, 216, 205, -89, -14, -112, 234, 147, 187, -137, 2, 133, 198, -253, -37, 163, -272, 175, -199, -46, -183, -397, 47, 128, 29, -418, -31, 196, -140, 210, 103, -50, 211, 102, 197, 7, 89, -179, -10, -193, 316, -70, -392, -170, 53, 122, -212, -107, 189, -3, 274, 387, -84, 112, 70, -129, 85, 353, -116, -7, 62, 37, -62, -408, 47, -90, -215, -215, -166, 253, -60, -156, 269, 170, 97, 124, -148, -114, 94, 81, 83, -272, 143, -226, -184, -8, -386, -148, 9]
4243Ij08K47L1j79r5p0L33J5J05k78K16j31k6K4m2J10l69L93j29l0l48J69R2J30
4267F9q6J67j06K3J88j20R1j38Q6l88K83j81P4m8p4Q6o6j1R9j03q2K83r6Q9l19
4292b80K24K25k6K1k94J13J49p9r2p8j02K25k24K51k3r2O4J00P0k46k18J68K42
4315I8l0q2l2M0Om8N4k07L24j90q7lJ8M33m97K54j61K83j38j28P3K41l21M50l88
4340c8M5K94m15Q9L58k42k11J68N1j1j94k6K56l24J31m8k87M24Jj2J07LJ19k32
4364Fj54L40p6p2o3j20j2J00R5N3J74m51N8Q7j54J61J68j92K66o5l30O5K90j89
4388a5m7L3m9J06l78P8N83n48O7L63m42j29M01K26l02K3K27ql51M84m17R3l64
4411c66M80N0j93L0J81o15J76L1M35j42Q2j82j23n9L94K06k37nM8p7m34L70K1
$$ y = [9, -99, 148, 179, 0, -95, -165, 168, 183, 288, 10, 226, 95, 69, 93, 51, 161, -208, 185, 56, 26, -322, -153, -61, 69, -17, 150, 44, 67, 255, 135, 226, 88, 174, -214, 69, -112, -38, -86, -160, -74, -140, -151, -52, -155, -237, 46, -50, 39, -280, -56, 169, 143, 164, -130, -17, 132, 53, -39, -117, -219, 6, -218, 33, 10, -82, -18, 82, 152, -94, -312, -144, 98, 68, -14, -46, -6, 0, -48, 6, -201, 123, -67, -154, -157, -139, 294, -203, 51, -110, 173, 35, -93, -20, 221, -100, 350, -38, 7, 301, -114, -25, 333, 91, -120, 48, 99, 88, -106, -132, 124, -200, -69, -117, -404, 20, 21, 9, 116, 119, 238, 6, -148, 192, 116, 44, -19, -139, -151, -51, 44, 97, 271, -180, -122, -35, -189, -28, 140, -52, 214, 149, -181, -116, 174, -15, -62, -29, -78, 28, -350, -272, 311, -237, -170, 193, -249, -378, 23, 249, -53, -30, 197, 189, -162, 322, -95, -2, -366, 114, 164, -29, 1, 182, -433, -257, -226, 209, 67, 149, -33, -156, -215, 179, 385, 148, 143, 191, 114, -320, 50, 71]
4434G1n3k5Qm32J87P8J89m1j91K73m46J01M85j7m24L18L4k56J72n4L36n96j02
4457c85M12o1m2M13k39l2J06j93k29k9J86N6J33J31k69O20m77K16j58m70J77P1
4479f3%j3P8L6k06J06j6j40Q1K30l6P1K6j5j39J15o3m6j12J35J91j62m6J07j12
4504GL5N3J77p5m56Q8M71n8m38M58l25m7R3j7L0j08L75n15L40m2j15N4j03K06
4528H8Rj27P1K01n12K67j6L2M0Q7R9j24j54L93k93j53K48J58j65j67k3J60j37
4551a8J2K43m32L74j57j79K74J24K07m18k37M64l38k0J20j42L85l47k00L59j69
4572i5K0J6j93J09J77m2K7K14j32l36M73j45J5k56K1J53l9m0j14Q2J88j16J38
4595A25k01N6R6k11J15J10O7j52J10j61k0N0l7j5M6p0J6P1l53k6N76j7l77J80
$$ y = [71, 18, -7, 1, -431, -244, -166, 23, -18, -209, 64, -382, -281, 204, 187, -237, 81, 115, -141, 31, -23, 313, -283, -385, 27, -34, -76, 337, 98, 66, 172, -21, -250, -279, -93, -37, 96, 227, -42, 578, 101, 317, 159, -311, -134, -63, -63, -76, 2, 38, -168, -62, -78, -218, -137, 93, 57, 128, 154, 139, 0, 115, 52, 6, -106, 29, 220, 58, 12, 119, 7, 42, 95, 272, 197, -259, -171, 300, 242, -196, 262, -63, -110, -17, -34, -4, -112, 263, -252, 88, 46, -69, -15, -118, 88, 97, -30, 41, 242, -270, -3, -19, 13, 53, 140, 239, 115, -39, 354, 61, -92, 156, 314, 149, -18, -41, 119, -18, -6, 237, -195, 179, 22, -157, 117, 241, 448, 30, -207, 257, -81, -101, 19, -123, 262, -85, -285, 74, -95, -75, -59, -252, -143, 34, -8, 19, 233, 101, -235, 238, 93, 108, -148, -127, 26, -13, -53, -167, -85, 103, -13, 125, -76, -20, 76, -135, -20, 90, 157, 5, 115, -46, -66, -16, -53, -68, -22, -92, -76, -5, -358, -384, 192, 175, -202, -22]
4619b2P9j69K33j83J01J32l3n7M9j55J71j65J99k7o7P5k68K60p2j31k6J23l27
4642b80J10R4j69L45n05O16k65J09M8K7m48K92o3K10k11J78n0J2j60J00N1p4J49
4665A16j87j6L35l85J65L6K27l04L8j12L4J15l08j79M90j11O2J29J85n20m4K45
4687A1J03j70J68j01j06J88k72K26J83j93j38n3N0L8n8J76p1J32j41K00k69J55
4709E8l84J88r6K83k79M54l13PK08j27J62j45L0M0j76K6L29k52k04J24J77P8j61
4732B7L7J32j08M6k38R9q2k0JJ17J22l78K63J94Ql53o8J86K25k11k80K51L5j33
4756a28O5J95J06r8j74J39j68J08m6K0j15J8j6K26k75q2J58P8Kl14L79Pl42M79
4780B22j07j75KJ08j06J38l58O75p78K94o0O4J86n7M5k26J29J5K49m70L67l55
$$ y = [-22, 57, -112, 121, -62, 39, 171, 138, 81, 130, -25, 146, -19, 180, 153, 86, 161, -107, 153, 81, -50, -76, 47, -280, -170, -76, -245, 100, -405, 211, -54, 55, 103, 130, -318, -26, -89, 121, -90, 88, 38, 50, -110, -10, 41, -33, 116, -71, -87, 248, -137, 28, 64, 291, -13, 25, -87, -53, 62, -246, -425, 65, -46, 16, 145, 330, -190, -234, 11, 114, -56, 112, 11, -95, 93, -179, 47, 230, 37, -101, -154, -104, -66, -124, 52, -19, 113, -28, 172, -97, 58, -326, -138, -234, 49, -230, 224, -89, -82, 126, -1, 161, 16, 46, 86, -90, -64, 265, 13, -191, -67, 110, 188, 27, 64, 196, 88, 134, -104, -5, -87, -107, -106, 11, 133, -245, 18, 212, 220, -133, -201, -15, 210, -1, -281, -30, 5, -128, -63, 132, 238, 140, -34, 105, -63, 45, -1, 19, -96, -78, -94, 132, -143, -225, -67, 11, 13, -301, 78, 85, -257, 222, 115, -60, -58, 50, -56, 82, -276, 399, -379, -85, -145, -81, 105, 48, 93, -133, -4, 11, 260, -210, 157, -198]
4802a98L30k31K52k9j65J64J23k70J89Lj91Q3O7j87j17L00Rk7m9j43K21j27J13
4825A20K7j49K89j72l3j63K6q6K48k81L30n6o5j55J46k79K71O7q2L5P6l71M60
4848B03l30J86J60j62q3p2K92j57k04j18L23k66K1J80n8R9J8j40oQ3M07m91L75
4871B60n18K63J65l25N18n64j06L00J34k32N7O8J5r2P9k1L2j75K55Om07J99K8
4894f1Q4J01k59J91K79n39R8L68l61j43K31r5K26k09R9j56N02l59k5K8j46qq3
4917b37K75p5J0p1J17l78L60J61k19m5K15k02r3K06j93J24J93Lj5k62L6L09ol59
4941a46K06P9J4m21N6J49N2j0K24k92n4J91N1k10j4L28k74N7N0k4m6N8l2k57L86
4966A21m5k29nP3j02j57K25L62n34L59K82j01k99L98m9l25K45m9J10m76J00L70
$$ y = [-198, 132, -99, 153, 124, -41, 123, 246, -24, 165, 168, -23, 60, 127, -60, -177, 123, 132, 105, 56, -87, 134, 7, 120, 147, -2, 287, 115, 82, -81, -55, -141, 107, -174, 156, 100, 35, -120, 26, -253, 18, 85, 3, 38, 114, -257, 203, -127, 59, 219, 57, -26, -98, 194, 37, -167, -285, 38, -228, -207, -27, -85, 14, 32, -108, -114, -31, 376, -115, 260, -258, 5, 170, -155, 363, -201, -307, -7, 127, -105, -48, 20, 35, -57, 22, 1, 33, -142, 113, 119, -288, -89, -61, 23, 124, -135, 56, 335, -204, -106, 262, -99, -242, -11, -106, 120, -89, 10, -146, 356, -3, -28, 0, -146, -154, -237, 38, -37, -27, -98, 19, -359, 1, 162, -57, -102, 113, -89, -182, 24, -169, -45, 148, 151, 136, -126, -90, 219, 213, -146, 60, 139, 153, -268, -212, -63, -11, -21, 203, -89, -143, 48, 99, -111, -125, 203, -71, -14, 36, 12, -34, 24, -8, -265, 121, 76, -153, -158, -85, -187, -344, -119, 243, -291, 68, 350, 249, -50, 348, 299, -26, 219, 170, 280, -196, -96, 274]
4988B74k50j19j10K85o2j56K19j03n5K10N6k74M25r5l33L44j20p4k37L86m2np4
5011I0l16K88m4j79P9k25J21k0K47K9l87L68j49oK53j83L24j35k87P0j72J94j02
5034a42k77L02K85J5k48J14N1J2l47N53k91k3Q8J00l63j56O17mn41L88m5l0Q6
5057A44l0k28J7J48q6J96j14J35k85k03M82K94n78K0J56r7j8J75k99J26l7R1k31
5080b22K27J3J75m92J94q3J08j38K43M2k08L72k00p4j03J00K33k21K39j8r5j15
5102b3j77M97l43j90J69M20n60R3L01j48j11K19j1l51J98K8q0r9q6J13Q6L72l61
5125d4J43k74K95p3m19M51l0p5k22O21L9l57J45l18J45R2j59j46K16J6o8j04m1
5148a67p1J07j39M30j51J28m69R8K10j5o5J51j43K68Nl49K43j01k8m3K67k55K12
$$ y = [274, 24, -95, -205, 80, 18, -138, 81, -22, -77, 133, 189, -85, 340, 245, -88, 256, 136, 62, -175, 211, 169, 164, 90, -226, 62, 18, -161, -82, -307, -186, -206, 41, 70, -317, 51, -98, -104, 149, -34, 290, 155, -132, -62, -234, -40, -142, -419, -117, 168, 183, -65, 49, 100, 112, -235, 318, 27, 4, 92, 192, -171, -327, 290, 286, -255, 133, 88, 58, 144, 114, -114, -97, 51, -35, 161, 47, 182, -103, -306, 176, 470, -108, -88, 68, -29, -47, 128, -171, -45, -82, 9, -222, 5, 18, 193, -299, -105, -188, -80, -218, 25, 67, -141, 231, 31, -43, -146, -46, 187, -34, 205, 187, 92, -23, -200, 297, -46, -236, -67, 353, -207, -114, 187, 39, -72, 147, 136, -215, -17, 11, -69, -168, -254, -141, -55, 317, -44, 99, -175, 120, 47, -372, 79, 49, -26, -248, 373, 412, 55, 200, -118, 27, 119, -40, -186, 30, 46, -22, -126, -167, -238, -131, -270, 160, 9, 137, -332, -234, -24, -39, -104, 47, -96, 172, 177, -172, 71, -30, -58, -101, 166, -89, 123]
5171A23j02Mj84K16j68P7L51l81M9K47n5k3l32J20M7K67k95j85K24r1Q3l23J37
5194a94J23j09j72K38J35j10M3o4k9K18O6Q3n3j32j96K02k26J65k3j1J55r5l44
5217c30J24q3J43J62j94M68k13j37M3J85j07k02L13j49NJ24k15k35K04J14m59
5238d39oQ01q35N41jj62P1k07J91j26M04p9K09l33J89k16K95j26j96J30l63O9
5260a89m1J93l15l1L71j23J26P2L2M2j36nL63j67K30l36k43K30J14k91m3K27j23
5283d3J37k48L0R5R1k56M59l54K58j10Np5J76j21j31M13m33J37O3l3r1k21R5K03
5307D6j19j3n7J75K26j48Ll16Q7n7N28l19J94k79m0j3J57j79O3J20r2Kn5J14O8
5332I6m1j34J74j05j54M53K0J12l18R7j7k26J04P8ll64L64lm59K66J39j69q0N1
$$ y = [123, 21, 25, -159, 57, -111, -34, 317, -64, -15, 232, 177, 154, -178, -58, -11, 256, -39, -224, 0, -91, -8, -331, -194, -71, -180, -352, -114, 21, -89, -46, -110, -139, 79, 145, 228, 175, 43, -153, 49, -177, -12, -35, -46, 109, 14, -330, -206, -289, -146, 16, -178, 290, 77, -60, -17, 168, 61, -141, 172, 23, 28, 152, -63, -298, -94, 20, -439, -445, 356, -479, 62, 61, -101, -30, -237, -46, -172, 232, 153, 362, 29, 218, 2, 297, 171, -25, 105, -258, -189, -230, -37, -352, -383, -12, -135, -9, 63, 95, 137, 1, -4, 359, 192, 422, 86, -157, 73, 187, -104, -147, 80, -43, 94, -154, -124, -29, 62, -194, 265, -89, 169, 59, 64, -11, 165, 44, -87, 326, -107, 30, 93, 60, -31, -252, -157, 46, -73, -86, -143, 32, 258, 110, 113, -203, -116, -173, 355, 36, 230, -49, -89, -102, 55, -124, -61, 59, -33, -31, -86, 28, 96, 55, -79, 95, -10, -164, 289, 309, 421, 103, 200, 183, -43, 61, 139, 136, -228, 136, 133, -326, -60, 79, -90, -170, -119]
5356a19J62j06M22m45Q5L2p5l8K70M1l08m8R7j36K20j83N6J30j93k17L37J5n2
5379e3J98o02O30k24K71k35Q5J16j13k49J63K54k75Nj5j0J24j23j65J19J90J30
5401B21k26K29k30J07k47O3J81k03O5J3J36k62J60MK40p37O68j68o3J34k9Qk78
5424b14K67J84l50m6K91j43j27K22J18l87M10j83M0j06r5M9K3n1J51k30N3ON4
5447f4O8K2l1P1j48J40M0k17M4O9J05J72q9j86k5L1o8K68k73J41Q4R3k10K43k39
5472D1J20j03K34j97j62M5M7J18j56J19l33J88j48K83j70J38j42O9p7J03p6l0
5494h9k3L72m33L33k82J99J5N9M8l58J57r8J3Q6J04k50M5m30P49J38l81o6L56
5517B64k12j69J53J2K29m87L03j91j97L98p9O4n54M95l17J51L20j69k18O6J48
$$ y = [-119, 43, -63, 359, -86, -1, 31, -44, -82, 188, 229, -79, -127, -30, -166, 54, -129, -73, 57, -136, -353, -16, -1, -53, 145, -457, 173, -51, 220, -15, 70, 186, 73, -176, -13, 241, -34, -29, -44, -54, 70, -53, -218, -99, 91, 221, -5, 224, -6, 101, -146, -83, 98, -105, -40, -27, 109, -153, 7, 11, 251, -486, 182, 14, -49, 85, 56, 64, -214, 53, 237, -113, -159, 132, -11, -138, 84, 202, -185, 225, 42, 82, -24, -119, -70, -47, -98, 53, -177, -124, -118, -64, 4, 26, -5, 66, -82, 58, 98, -119, -75, -6, 99, 271, 182, -4, -29, 2, -66, 202, -71, 70, 154, 247, 37, 280, 41, 161, 58, 292, 95, -67, -22, 25, 143, -13, 106, -227, -39, -187, 96, -74, 64, -78, -9, -86, 17, -59, -89, -112, 260, -173, 160, -122, 77, 92, 151, 199, -159, -2, -100, -87, -1, 103, -147, -102, -532, 217, 355, -26, -92, 264, 52, -117, 36, 48, 277, -210, 93, -98, -295, 103, 24, 88, -466, 29, -288, -137, 183, 14, -204, -138, 10]
5538A0j6P3R7K02m37k4R8J1k22K64l50k9K64j22P2j85m7K05l4L14J0l74P6J53
5562IM43m79L4O2n8J73l07J57mj11R3K4l90J72j7J66j6q6J27K15J49k54L9k94
5586a53M72j73l35M85q9j59k07L79l53n8O6K72k49q3J0L4M7K52J04k17q9N7J59
5609A72k33K74K19k45k19j42K84l10j25j34K25K08j93N8M09n40K29j8J56K17j39
5630A53k04j8K48l5j62J80l27L05l77O2J80n6J00m19K13o6M14m73L28j67L79o53
5652c95P17p6j21rK99m6n12Q1K19j35J24l98J84l3j61K53Lo6J81q4q7J27J94k01
5676E8j97K46J19l26J8N2J77k26k37J61JM7O3l9O3J46J13k15K5J49j1m21O80j75
5700B71q7M4m26K78m7n7R9k35Q7m9K41O1n5L9l09J8K82J24m15J14K53m2k52m0
$$ y = [10, -6, 67, 164, 366, -71, -95, 3, 14, -208, 56, -294, -323, -59, -181, -109, -294, -341, -136, -170, 144, 154, -220, -144, 9, 452, -27, 7, 69, 11, 184, -123, 34, 30, -81, 12, 36, -354, -182, -199, -33, -49, -135, -8, 207, 356, 102, 141, -153, 319, 146, -189, 296, 207, 48, -159, 220, -133, -191, -125, 147, -102, -185, -175, -141, -94, 158, 262, 45, -44, 13, 172, -61, 213, 432, 187, -32, -174, 110, -200, -325, -459, -234, -26, -219, -161, 248, -292, -63, -81, 75, 292, 153, -51, -69, 179, 144, -18, 162, -165, 140, -237, -175, 5, -51, 49, -370, -157, -223, 191, -282, 46, -121, 258, -395, 322, 246, 125, 116, 415, 369, -143, -62, 157, 22, 146, -252, -68, -101, -262, -9, -6, -72, 109, 25, -62, 65, 259, 58, -139, 107, 226, -100, -82, -30, 147, -79, -316, -155, -154, -107, -44, -83, -20, 126, 239, 24, 49, 198, 187, -234, 446, 271, 184, 228, -198, 80, 33, -24, 75, -160, -73, -122, 119, 180, 125, 164, -145, -127, 155, 279, -136, -22, 231, 189, -63, -103]
5724a03R3N9k23L25j42M7l71J93O7k4P4l76J05L67j01j77L86nm15K76J19j57J30
5747A47j08P4kj74l5J3L00j59K3QK7j61J85j62j41K23K08m38K49K02k39P7k53
5770a36K3J74j20o6L90q8j87k92L90k7j07j59L34j53L5J18q4K42l20m1m4M5J43
5793G0j82j85K24o1J71j92J54R3m25K55R7L14n69K43K29r8Q9j32k68J90K69j74
5815A12l21O8L58l40K0n8o5J09N8j28M60n16K37L04k02L8K72k21j49k73K12L10
5837B85k63K56k07m35L05J69k98k92j4O61m64K46J90J19l89M17k3j74q9n2n8M38
5859C28k30k84K42J35l21j41j55L67J19k24R4J93Qk30K0K73R8p4j25J52m29K45
5881F1l6m52K86K46l94J80J2L0j70O8K22j6k39J34M40j25j48j08J00O4j11M9j34
$$ y = [-103, -10, 49, -174, 151, 9, 56, -315, -122, -55, -79, -5, -381, -276, 91, -10, -187, 199, 194, -221, 55, 174, 17, 147, 39, 113, 111, -63, -98, -85, 215, 56, 79, 87, 114, -47, 138, -24, -165, 58, 266, -172, 77, 279, 40, 117, -136, -113, 61, -59, -125, 265, 177, -10, -302, 88, 61, -46, -205, 129, -24, 11, 129, 45, 287, -33, -74, -118, -73, 70, -112, -297, -73, -134, 37, -155, -1, 92, -333, -78, 19, 333, -236, 7, 236, 138, 227, 95, -173, 17, 286, 112, -209, -141, 217, -123, -103, -161, -226, -117, -59, -187, 273, -243, -6, 298, 96, 134, 406, 185, 36, -237, -25, 285, 22, 278, 71, -364, -59, 110, -188, -480, -494, 167, -297, -51, 139, 258, -131, 286, 263, 89, 0, -52, -110, 328, 98, -186, 56, 191, -130, -271, -426, -59, 60, -164, -70, 123, 131, -99, -79, 194, 292, 218, 93, 245, -184, 61, 25, -427, -141, 105, -289, -109, -97, -67, -237, -169, 53, 37, -202, -68, 372, 247, 99, -9, 91, 155, 44, 93, -41]
5904d1k11M03j90l31O20k62j81oL01j86j92J88M44j24j36Pj97J09n3J49r5j53
5926a37K71k67L42l18M6N0j41Q8Kr5j0J40J63k00K72j44j80K02J15j46o6K01k34
5949d6j04N00j19l26P5n1j27o6Q3K14j23K15k28J70l49L47L80m61K84n1l51K65
5971A31J54m70K1P8q1J26j64kJ21P1r8K57j42j3k46K54RR9J78j81k00J0J81k61
5995a68p2O8J78j31L4K18l38j90N01p2l5R8j28K18J37m92J13J56o3K43l72K6K98
6018B27k80m31M79o1o9o9j5J66M1J66j51n2L4J09o7J98J86o21L41j70J27k62n0
6041b24J67J00l68l3J05L00J20k05K89m33L88p1J89m26L43j71L5q7L39m93n5J58
6063c3Q4k82N7j2P9M0k46K33m4J10Q9j70K47q9K63l66R6K04J29n07L37k18j38
$$ y = [-41, -252, 151, -39, -370, 250, -12, -193, -199, 102, -84, -276, -88, 356, 232, 96, 103, -94, 15, -38, 111, 16, -137, 134, -133, 209, -109, -63, -13, -154, -66, -64, -159, -169, -29, 134, -66, 206, 62, -118, 84, 199, 53, -13, 188, -46, -150, 350, 231, -95, -20, -71, -198, -264, -181, 33, -90, 125, -103, 67, -282, 65, 445, -16, 268, 217, -134, 131, 285, -185, -164, -86, -167, -41, -205, -207, -86, -15, -113, 144, 2, -11, -257, -3, 6, 105, 283, 102, -98, -88, 93, -168, -240, -172, 6, -125, -91, 127, -211, -401, 100, 28, -7, 91, -37, 181, 318, -174, -61, 95, 32, 275, -97, -71, 227, -53, -484, -5, -66, -135, -204, -219, -53, -12, 154, 3, -49, -15, 94, 27, 225, 411, -210, 131, -39, 88, -174, -224, -57, 43, -325, -358, -253, 47, 167, -38, 251, -182, 206, 135, 324, -102, 241, 70, 105, 18, 357, -136, -191, -33, 51, -231, -174, -186, -107, -67, -313, -80, -124, -14, 75, -95, 152, 63, 326, -40, 56, 260, 389, -118, 219, 1, -137]
6086a37M32k64k09J44m5L6j09L87m89J14K98k08L21l38K02J33j50l55K31Q4l9
6107C9j27j8j22J6O8j8j83J2k9L61K73m15J42N1R5J13k41J50J22j59l23j66M38
6130G9K85o73J03J13k4j12n1J37J74j07k45L10K60n6l8l39L72n3n8q0J82j41j38
6153a00n0J35l20J02J85r2L96n3l85J80L38k69k2M5j42K8J35l12K06mk9j42K33
6176F3m2l98M55l73J65p6K22N3j7J0O4j23K60K9k39J48N7k95j27J87l73K93j18
6199a75J25kN2m25mM71r3Q7m1k76K73l7K57m18O41l35k39K72L4m15K74j34j69
6222b77K64k96K82n2K5j16J63L23k92J72j87P5j76K13n2k8j15J70j18j78NJ8O
6245a71J39l37M66l88K07J05Lj35J14j6L00j51j73R5L4Q7r8k30K8k4j68K97k18
$$ y = [-137, 295, 31, -178, -34, -79, -43, -152, 235, -254, -140, 158, -50, 271, -67, 135, 268, 118, -237, -6, 78, 39, -88, -106, -228, -212, -144, -162, -345, -333, -362, -1, 272, -143, -1, 50, 145, 258, 17, 167, 289, 130, -193, -359, 79, 364, -309, -206, -93, -117, -229, -280, -143, 31, -76, -321, -11, 249, 193, 155, -184, 188, 135, 77, -3, 179, 38, -100, -150, -15, -335, -233, -48, -140, 256, 203, -182, -2, 336, 67, 45, 90, -52, -24, 111, -201, 5, 1, -28, -170, 63, 21, -377, 78, -295, -130, -206, 16, 69, 52, 62, 126, 3, 263, 292, 53, 201, 258, -37, -164, 23, -350, -57, -175, -50, -52, 0, -425, -429, 42, -51, 36, -5, -281, -8, -45, 212, -206, 435, 100, -139, 133, 167, -248, 26, -108, -277, -13, -309, -27, -79, -54, -170, -7, 316, 24, 196, 9, 84, -92, 121, 69, 41, -74, 96, -22, -200, -195, -177, -171, -32, -369, 97, -291, -84, 21, 24, -111, 3, -13, 287, 136, -37, 58, 92, 179, 81, -149, -121, -145, -313, -16, -234]
6268b34K57j02l1j57K66k4j45J33M42m40J59r8N1R6j97o1M84o85k7J92j20L50
6290A09j21j80k8K36Q8l00K08J27J08k72j04M53l11J10k56L94k18p2k14K53k11
6311b01K91l20pR5J38q3KJ04J15L1j83J39L03k63K19l43j65K99k53o0R0m2J89
6334I5r7K0J92m04L63m6ql59K59j49M04m81J93L52k80Q1j52M56q36M39m6j43J99
6357E2p8M7o8n7j51J09J70J72k45J48J54l71K52k28K30J5k75j42J37p2J22J7j79
6380b41L60m29J27J38j7P7L43m49J11J83n7k00q2J69Ok71M26j06k71pjp5K06J67
6404A07l4m99N71j36j58J66p6m8k68M68o9k41K02n4j95K20o4o4J09J30j45k87
6426c65L73K09p8o1R0R1m39O0J31J74k51K57j61%J48R2l20l88K91J62k58K40j08
$$ y = [-234, 23, -79, -110, -267, -1, -25, -170, -37, 405, -35, 124, 26, 77, 173, -24, -85, 399, -286, -313, -121, -241, 109, -12, -192, -220, 16, 104, -196, 12, 139, 247, -25, -129, 324, 13, 123, -133, 261, 43, -29, -243, 10, -201, 90, -230, -237, -142, -4, -87, -85, 19, 134, 165, -18, 121, 424, 161, 380, 37, -128, 171, -82, -142, -52, -94, 95, -2, 18, 210, -194, 169, 123, 115, -244, 15, -134, 270, -211, -18, 334, 54, 135, -17, 439, -397, 42, -4, -147, 52, -26, 21, -47, -104, -255, -146, 24, 196, -49, 99, 253, -118, 134, -94, 136, 151, -124, -266, -129, -201, -79, -62, -241, 119, -310, -183, -45, -62, 15, 358, -91, 20, 203, 146, -54, -136, 33, 39, -232, 194, 88, -183, -190, -191, -266, -60, 107, 73, -426, 145, 9, -149, 17, -59, -107, -375, 93, 24, -217, -15, -69, -264, -44, -108, -172, -63, 67, -78, -365, 8, 217, 139, 78, 168, 259, -180, -120, 11, 185, -66, 191, 30, 30, 178, 270, -50, -438, -147, 15, -243, -3, -111]
6449a11j32P3K19n2L9k64N96j70k21R2j92rJ95l6J09k11n9p0J40k22J62lj1K45
6473A07r4J42n5j48m9M1K46J09l64K00r5M2m7j74k9R8O5K55k51r6J12K01l95j1
6497a90L63k39O7K02n0k17K62k51J12L12m19K9j64J35M3j73j18K41J28l15K21
6518b1J66l82N76l06K26j58Rj22J76rJ72l74J43o0m9q0J16n2K3j55J47q8K8lJ64
6543H7k65J25Om4Nn5J19L18m03J67l8L3j71n7P1j07R4J57P0j48n8M32j44Q8J41
6568D23q5k84O9o3j1j41J6M7K5l7K46n67L27R8PK0k17j15p9K70L0K22n6m68L02
6593b1K31m72L53k71P0J76j50j66l3J72J42l18N6J59J99m02J30L52k44rN8K65
6615B77k45K43j90j25J76m7l23J94K45j40j13q0K38o0q0j47J07K1N5J37Q6ol29
$$ y = [-111, -243, -170, 49, -3, 36, -228, 368, 198, -23, 69, -123, -132, 63, 27, 136, -75, -134, -204, -64, -286, -124, -127, -138, 107, 13, 155, 100, -48, -97, -56, 190, 299, -65, 135, 40, 82, 35, -139, -168, -70, -5, 250, -1, -97, 15, 216, -179, -190, 173, -66, 1, 203, 153, -64, 198, -53, 59, 371, -48, -19, -183, -48, -5, -178, -296, -55, 73, -242, -21, 145, -237, 339, 33, 259, 101, 110, -12, 164, 155, 327, -47, 96, 36, -13, -93, 23, -29, -6, -161, -14, -102, -74, -77, 87, -178, -53, -47, -91, -86, -141, -22, 296, -107, 60, 22, 55, -116, -173, -102, -209, -115, 42, 112, -36, -94, 338, 194, 282, 423, 338, 54, 123, 60, 49, -92, -76, -29, -4, -41, 205, -362, -35, 63, 70, 90, -127, -242, -321, -51, -21, 201, 145, -323, -21, 210, -262, 91, -180, -110, 66, -84, -250, -283, -111, 31, -287, -231, -72, 127, -275, -145, 207, -37, -46, 12, 277, 32, 275, 85, -40, 136, 89, -234, -40, 205, 65, -48, -128, 110, 50, -30, -177, -70, -49, 6, 143, 229, 223, -106]
6638a06K35jQ5k87M16m02k17m3M01k51M95l96KR9J51Q0l96K34k57K57j27O6O2
6661A00L3o6j19oj68p0M4m7K68k12j72K53N9P0P8k14K63j03k24M37l08J15j02
6684i1K0j0pK28m76K13O2J41j71k5J21J10q6kj9O6m0J92K8P7l69J50J44n32K14
6709f2mj17l8L80k08r7j31K28j4J27j92j93N2N36j8j01j90Q6q3J9J32J66j25l14
6733a61mL0N3K5l9P1K6P2Kk9Jj06Q6K64l79o7N1K83j19j6m2J09l64J57K8j11J57
6760b2j67J04m1J7P0o1J33J36k50K47j71J15j23K60m51J08O9j61J86j79K64J21
6782B04l58J27JK78j67M0k58L47mj03J04l07J39mK7jK78m86l1J21QJ13m52J13
6806b71K40n9J65j35k00L27k7j31J94Lk4m6J36l13M6Q3j57N5J06q2K9O6l1l48
$$ y = [-106, 129, 128, 213, -74, 342, -60, -277, -320, 81, -170, 325, -71, -69, 30, 181, 261, -135, 99, -158, 99, -28, 38, 100, 133, 67, -52, -58, -226, -296, -252, -299, -31, -243, -415, -162, -103, -33, 45, -169, 94, -9, -233, 204, -104, 11, -91, -71, -81, -88, 140, -336, -123, -61, 80, -91, -116, 5, 115, 29, 27, 8, 74, 34, 226, 254, 331, -38, 112, 256, -276, -62, -66, -183, -221, 159, -49, -146, -277, -49, -63, 64, -128, -321, -269, 267, 249, 148, -42, 44, -39, -20, 112, 278, 153, -161, -165, -135, -82, -57, -96, -25, 1, 73, 75, 46, 47, -59, 27, 291, -88, -155, -104, 179, 60, 44, 2, 111, -253, -96, -68, -179, -22, -189, -85, -126, -109, -39, -100, 33, 169, -81, 166, -5, 110, -13, 247, -204, -96, -27, -188, -2, -181, 83, 204, -154, -27, -26, 252, 85, 125, -133, 214, 210, 107, 211, -96, 43, 39, 66, 65, 343, -143, -174, -53, -45, 68, -384, -271, -31, -90, 75, -60, -260, 67, 40, -91, 103, 106, 82, 36, 172, -141, -95, -12, -169, -114, -8, -90, -61, 5, -26, -374]
6830c74K42K31m49L47j56K35r7J22j62K59l82M81l63k4L4M9M8j28q3j37J56J67
6852A6J5rR7Q7K9K4k13Ql6k6L87l58K36jj06k38J95k6N0k15J50l03J51N7P1J74
6878B16J06l33L5n2J6J99m89L52N7m0k22L03k72J06j76J29j43L20j05J8l1J48
6900A42j53J58J62n03L97l8k21K55k25l6q0K81r7j17j09K28k12J79J15m9J78j48
6922A07j03J92l75J94l2N9K18K2l31k6J88k38M0Q5q4L3j3m9J16m7k17R9J53kK51
6947B40l41n2J26P9j71P1K65m87K81O2l31J89J39j99j78K15j4J63j94J23J0J34
6969A30oK07r9j54j98n7J75Nj05L64k76KO1J98n79J03J49K14n00O46k29k1k0j44
6993a34K04n9K24k51j30J60J77p9l32J58J68l10J5L83l80K05k14L43J85l53l7
$$ y = [-374, -132, 99, -350, -3, -159, 76, -21, 101, -61, 198, -184, 297, -66, -90, -56, -7, 41, -87, -170, -307, -151, 16, 31, 22, 119, 206, 235, 259, 46, 54, 18, -8, 379, 21, 257, 256, 150, -88, 107, 81, 131, -84, 66, -237, -86, -29, 42, 216, 322, -11, 24, -28, -12, 187, -302, 50, 107, 67, -155, 148, -124, -18, -194, -65, -208, 112, 7, 25, -6, 142, -11, 147, 309, -194, 203, 165, -56, 199, -26, -62, -142, 139, 42, -75, -184, 44, -168, 11, 126, 77, 255, 107, 4, 196, -179, 15, -17, 42, 260, 282, -49, -75, 113, -125, -85, 0, -84, -51, -64, -113, 3, -44, -261, -162, -9, -11, 240, -101, -153, -27, 52, -119, -48, 217, -270, 11, 73, -258, -69, 70, -129, -307, -92, -106, 57, -137, -14, -4, 130, 124, 331, 232, 78, -120, -177, -2, 3, -102, 262, -14, -12, 49, 247, -332, -229, -80, 134, -366, 280, 51, 30, 10, -134, 70, 11, 235, -16, -146, 14, 191, 112, -220, -62, 106, -204, -189, 194, -186, 19, -195, 148, 333, -20, -57]
7014e7K5l1J05K10l13K31J54m28K16j91j28j2K0J89O3OLk57L00J22k30K69m24
7037a58L70j59Q7O8l08K90k3j69p0N8Q1l53K61J09j58p0L27J2l10l7J14o1J23
7060B4l4pL72l97P6j16l5J71j38P6o2r8J05J71j81j1po9K71n5j16M7K25j63n3
7085dk47K79n7M9l9j31K73K8l61J39Pn4R9q8L11q7J93l50K94Q0l36K13k74L85
7109C22k29k74J10r2K55j40J79j54K8J56l87K64O9j11j41J72j15Q3n6Q2m1j64
7131a84K26n8n8P1m3J56q2j06K26o07M91j14j13O7K72q1k22L14o6J1l22ML16J06
7155B04m13J69N4j95j6K84K8j21j89K70k96J46J54q1J93j93j0K7m6J88j33k61
7177b37J05P8J43k59J01L2R2l85O8J71K43j22q5L02n0L9j97J71j69O8J33J01m19
$$ y = [-57, -32, -63, 42, 252, -61, 170, 324, -104, 112, -79, -207, -219, -199, -10, 53, 59, 62, -195, 105, 227, -3, 266, -158, 212, 53, 140, 208, -100, 190, 167, -2, -72, -14, 67, -286, -25, 84, -74, -144, 183, 195, -115, -152, -38, -99, 24, -10, -17, 355, -42, 34, -82, -117, 54, -84, -8, -70, -168, -63, 108, -73, -84, -91, -160, 111, 56, -60, -13, 212, 49, -4, -251, 28, -29, 20, -19, -150, 123, 151, -210, -71, -64, -118, -19, -107, 204, 117, 310, -40, 254, 334, -2, 211, -63, 322, 93, -181, -71, -163, 92, -48, 131, -23, 5, 161, -226, 38, 107, -4, -145, 27, -88, -5, -61, 21, -20, -184, 42, -16, -74, -3, -46, 110, 28, -78, 148, -459, 32, -82, -195, -128, 144, 63, -159, 155, 89, 100, -222, -218, 98, 204, -209, -40, 14, -181, -197, 87, 115, -6, -195, 75, -221, -75, 79, -2, 191, -2, -12, 15, -31, 157, 24, -237, -132, -54, 89, -170, -69, -37, 55, -330, -262, -91, 152, 30, -55, 247, 197, 236, 39, 210, 41, 109, 242, 343, -76]
7200g6K09j60J43o1K6j78J26j45J1K29k52K63J7N0p4J90l94J15k59J29J97k04
7222i8J18m1k9j00R9O1j6J26m66L11j32M53j51k75O7N6k15K36q8L5M5P5k66Oj96
7247c85K14K08N6k07p9K04k81M40j13k13K47%k15Q7J23J71l72P1O5P5k42q7K78
7270D5qp6km1J21l07J55J44p8K6R9J13k61L44l72j14P1J73j40M7J4R7k5j34J51
7295D2k15J87M3J12l94J22N4j5L3P3n3N9L93m51O1k67M36l76j4K55q7r9o3q6O2
7320a88L39K1j03K10k26K33k78J56k97M16j73%j42J5M1j25K11n13K68j65K21q
7342h7J32N2j75K40l5j77J92o7K6o4n2L18m31Q8R1J1k15J08J5k7L4mJ9p4l2J04
7368a0M01n68L62J4j93o1L16j71n3j6J91k29j61L68k88K57j74j53L46oj18k86
$$ y = [-76, 133, -27, 116, 55, 81, -97, 29, -116, -105, 124, -128, 135, 152, 202, 128, 318, -76, 39, -220, -91, 106, -98, 20, -21, -50, -150, -51, 10, -6, 120, -346, -35, -167, 286, 135, -140, -73, -17, -232, 4, -84, -49, -4, 71, -195, -189, -385, -171, 37, 93, -114, -193, 11, -270, 170, 57, -156, 91, 91, -124, -37, 86, 257, -115, -44, 21, 96, -146, -233, 45, 37, -39, -41, -82, 39, -268, -113, 31, -47, -21, 78, 191, -70, 274, -98, -212, -141, 32, -108, -61, -47, 50, 25, -109, 42, -173, 14, 57, 169, -225, -103, -49, -64, -31, 42, -11, 48, 441, -10, 51, -216, 220, -156, -170, 85, -2, -101, -164, -250, -188, 151, 172, 69, 279, 53, 286, 8, 164, -133, 283, 110, 110, -32, -17, 24, -101, 110, -403, -135, -300, -79, -87, 45, 97, -78, 162, 127, -50, 142, 75, 101, 37, -15, 303, -128, -40, 51, 62, -153, -45, -30, -57, -23, -27, -8, -82, -114, -10, 391, -177, 185, 199, 6, -55, 261, 90, 37, 21, 212, -17, -178, 190, -98, 159, -15, -168, 178, 172, 54, -232]
7390b32J01m8J7N0r8K13j29J61J9j94J72j77J01J59J89m67K59k24K21o4P0j85
7412h6J79j21k97L18j93L38j00L17k32l9m6j22o5K41j26k16LJ46L60m82K09P5
7434F1o8l5J43OM5j09j87J39MJ42j71J22l07O20m68l09N69k64J16k11M7J51j30
7457i4R2n5j09L3M33j85o3%n2J07j51m9kK23k28L31k07k60J52J49J05n8j20J9
7481A1m4k55Q0K86K22j56PK3r1L0n1Q2j3j14p2P4j28n9N3j6J92r9mK3N5k19M10
7508B27N5k05k01Q3K03j28n6J98k87J22n7j83L41k77M23n77L22j8j21K18L4k3
7530I3oj08j49K26k65J59n3K82k44J19r7J76J16l00r1L8o2K22j28J13Q8K6k07
7553e2L64n52j6N24k06k37QK53k56K93k54K38%j91L0N7j06L0K95j68j95j28L81
$$ y = [-232, -131, -179, -162, -112, -210, 3, -126, 35, 54, -140, 32, -145, -44, 115, 304, -163, 96, -128, 93, 29, 99, -86, 93, -28, -325, -7, -200, 138, 38, 355, 123, 84, 38, -84, -149, 92, -34, -250, -247, -101, 259, -223, -14, 61, -7, -42, 101, 107, 152, 43, -144, -5, -1, 141, -30, 92, -215, 405, -63, -372, 197, -67, 49, -162, -115, 36, -94, -2, -57, -166, -133, 300, 115, 52, 52, 0, 107, -44, -93, -95, 128, -100, 231, 24, -236, -84, 65, 170, 112, -8, 11, -33, -288, -208, 78, 300, 144, 151, 174, 83, 113, 62, 144, 131, 17, -55, 19, -109, -168, -115, -131, 61, -38, -42, -19, 36, -183, 227, 282, 77, -124, -41, 162, 34, -22, 176, -111, 11, -46, -229, 112, -165, 258, -319, 3, -15, -136, 82, 116, 93, 87, -21, -170, 56, -209, -50, -103, 179, -65, 54, -43, 133, 249, -51, -142, -104, -166, 56, -72, 41, 129, 155, -52, 312, -240, -256, 268, 62, -175, -167, 86, -170, 123, -131, 107, 107, -84, -54, 3, -103, -73, 222, 54, -141, -269, 112]
7576A12P8r4k57K49K33m06k37M87k72J13M3k66J20R0l88L36k33K69J01m8p3K10
7598A67L9j56m9j85J51M7R3k02L1Q5j48J94q1J69k58P2J67k46K41j33J23k4O4
7621A61M9j66R7l11J29K48q4j92k6J44J0k50K65k10J34j7J58l57Q8J78k68L43
7643A23j42P6l38J62J62j22r0K29j74J60m6l9K62j74j96L29l92L73L1K0j37j58
7665h1K17p0M8k22K07r1j39M30m82K94j82J11k0%j08J48J4kr6J18Q1l50M2N0L7
7690d6K48k00k44K68J39j44N7j04j27R6K69j20l35M33nl3p3Kj41J16n4j90o5L09
7714E6o8Q1j15J14m9Q8k8j33p1L19j52o3PQ2j86L65j97O1L1j86j75p1K24j62J48
7739h0J86j4qj94m0Q1J86J55j20M6l72Q8L24j03k28N9j31J74k25K77J2J72j87
$$ y = [112, 190, 96, -161, 88, 321, -85, -322, 165, -107, 6, 49, -217, -97, -7, -395, -59, -292, -23, 78, 30, -43, 167, 206, 50, 1, -184, -33, 14, 107, -95, -64, 21, -127, 67, -14, 155, -103, -31, 136, -110, 131, -2, 121, 97, 161, 210, 44, 141, -170, -41, 207, 123, -69, -95, 49, 59, -191, 74, -136, -2, -19, 139, -218, -130, 48, -220, 123, -19, 57, -281, -119, 43, -79, -169, 60, -114, 46, 0, -39, 223, 49, -147, 182, -210, 163, 194, 214, 77, -81, 136, 66, 114, -108, 99, 8, -131, 299, -183, 111, -71, 40, 20, 20, -88, 60, 74, 72, -24, 94, 175, -175, -133, -83, -46, 202, 2, -242, 26, 165, 21, 78, -26, -153, -57, 212, 92, -243, 190, 185, 152, 79, 81, -60, 56, 2, -188, -253, 56, -12, 69, -46, 68, 19, 107, 79, -54, -125, 194, 42, -21, -14, 68, -118, 247, 50, 111, 142, -44, -219, -290, -66, -228, -80, 106, 92, 84, -110, -150, -69, 117, 272, 152, 198, -174, -86, 238, 135, -93, -34, -165, 9, -216, 61, 73, 245, 58]
7762E8j16J74n01K53K19l3O8j91J39J2k48K07o2J78j50n6Q3o5N4j62l0J18J25
7785G4j85j41K92j54L56j72Q3j97R1k32J24K3OJ67r0N3j59J67k33L34l15L6k25
7808b97l3J62L0J07M6q0K84o17N70m70R1M02l53O3J0J69l04J18J96J61k64Q2j19
7831d6M5j44LK02l2Q9k3l88K01J68j48O1j18j81K29J09J2J89l20Q9J51p8N7m7
7855H0m14M84m90M43r2r2M9j08J88j48J52J35k50K36j12M0k82K40l8K36k00L0
7877H7l51p6O64j05q6m03L34k04J64M3r3L3m7K33l27o2K84jL8l36K09J02P9j25
7901E4L7rj24O1K17K5k39J18k29K62o6l8j94K2K20J00n81L93J27j27L50j18l23
7924f2o6M91l38q0J01J92j80j91j9P5j54L29l87K84M5r9K3j00L8O8J2J32k34K2
$$ y = [58, -58, 116, -385, -132, 87, 54, 122, -69, 70, 82, -166, 41, -21, 157, 7, -49, 34, -31, 23, -139, -169, -51, 74, -111, -252, 40, -114, 242, 70, 153, -44, 47, -185, -61, -38, -32, 135, 45, 98, -61, 106, -127, 207, -108, -72, -297, -330, -168, -138, -31, 15, -65, 219, -398, 172, -298, -207, 195, -158, -95, -85, 84, -220, -102, 94, 255, -9, 73, -46, -1, -145, -142, 60, 28, 117, 94, -294, -93, 75, -73, -12, -130, -311, -82, 27, 39, 228, -92, -3, 148, 70, 127, 80, -334, 150, -340, 103, 11, -81, -32, -140, 48, -100, 52, 187, -63, 173, 61, 101, -181, 59, 21, 257, 57, 87, -264, -340, 324, 219, 133, -270, 64, -140, 24, 67, -26, 7, -40, 193, -134, -196, 88, 87, 125, -211, -2, 100, 179, 54, 91, 82, -42, 19, 236, 261, 22, 140, -89, 173, 107, 69, -125, -103, 117, 217, -364, 29, 156, 29, 379, 261, -62, -128, 363, 25, -55, 46, 238, 58, -133, -152, -77, -231, 98, -289, -5, 40, -59, -36, -136, -98, -30, -18, 114, -120, -98]
7948i8O5M25k92j39J07j7k06J66J11J97m27j00L01k07k87K02M18j93L54m88R5
7969a3m6kM6N9J72m65O6J64L11m52J40J81k12J96k27J27k02J08k3J65n5k95L62
7992A05k28P8J84k59J60j10J44p2r6K49r5N6n2p0j49K42k9o7k2j0L4k5J58l92
8016b66K84j96L5J94j79K73m00J61M22l58K9j45l4K04l57J81J60J24Pj48k38J18
8038a29J78J50j48j8Q5k08J10p4p1J14J82k16J29o3m1l4k30L31L6M1K1k28j2J65
8062G0r1L70n02K15m09M83j51M5J98l20l3J39k29M36k41O0r9j2J06J22n0j40J01
8085F8l4N5J7l12J18J51P7m1k8K8l79L61k92L92j98j17L85l59kO2R6l13L24r7
8109c8O4k41K01j84J81%k8J38j32M2oj52L7K42o5o9o7R6M8k94K09J23O9j95K21
$$ y = [-98, -33, 392, 100, -39, 68, 51, -155, 11, 122, 319, -108, -208, 93, -114, -401, -199, 219, 26, 380, -108, -13, -59, -61, -15, 44, 216, -249, -183, -19, 292, -160, -20, 161, -51, 145, -82, 45, -157, -49, -72, 93, 38, -257, 105, -123, -45, 139, -120, 40, -70, 74, 2, -94, 155, 60, 116, 64, -6, -155, 87, 58, -9, -31, -41, -7, -32, 126, -266, 18, -178, -143, 51, -128, 145, -255, -94, 328, -30, -1, -146, -180, 24, -333, -152, 8, 132, 139, -9, -247, -129, 49, 199, 51, 33, 118, -90, 20, -54, -125, -11, 171, -45, 84, 21, -20, -54, -284, 47, 83, 124, 145, -83, -95, 70, -21, 349, -153, 62, -347, 136, -15, 30, 228, -92, -125, 14, -215, 221, -20, 40, -59, -71, 35, 157, 107, -33, 68, 34, 89, 106, -206, -88, 63, 140, 99, 71, 99, -280, 81, -211, 181, -17, -134, 251, -108, -110, -48, 48, -265, 59, -38, 26, -215, -14, -198, -17, -17, -45, 93, -39, 3, -3, -155, -118, 124, 59, -10, -77, 19, 67, -227, -18, 105, 174, -21, 200]
8134B00k49j44J14K7K38k62J02qO2k31L2O4J46j15k35N39m17K26j48J20l56n6
8156c51K05Q0J51k88K5M20n7n56L16j7n8J01k75J1m1L05Q9k79K32j67N18k88Q2
8179A58l2j82n5K9N4O7j17J01j21O1N3j44
$$ y = [200, -49, -193, -79, -52, 186, -76, 26, 18, 80, -151, -119, -55, 91, -24, -259, 280, -137, 89, -59, 61, -295, -351, -146, -66, 85, -203, -178, 242, 185, -371, -55, -72, -130, -29, -304, -293, -334, -29, 60, -219, 13, -154, 364, 76, 158, 126, -56, -111, -82, -28, 39, -78, 23, -98, -37, 16, -128]
8191a28
$$ Imaginary data points
##PAGE= N=2
##DATA TABLE= (X++(I..I)), XYDATA
0@%%%%%%%qQqJ6j6K4l2M0n6P2q8J04j25J49j76K11k51K96l45M02m71N43o23P17
31C83q18R30j054J190j343J512j697J898k120K365k631K921l235L579l960M372
47B292m820N315n857O452p106P831q639R540j0553J1698j3006J4519j6290J8395
61I771k0949K4125k8199L3644m1330N3085p3508J18866m00859K04924P30996m95298
73A15268l76421J38144K22702o2603N1992q8179k03952P8676L72076k5091l01712
84g9100r3196J39658J07448P2836j10884k10452K4647K44649j858j62705P1040
95B083J09722j89997p9043K12743K7829j73101Q8279J47114j30613p9866J50146
106H5296p0312k24138J83812L00703k15731k87475J90109J78822j82815o7612
$$ y = [0, 0, 0, 0, 0, 0, 0, 0, -8, 0, -8, 8, -8, 16, -16, 24, -32, 40, -48, 56, -69, 80, -96, 115, -136, 160, -185, 217, -254, 289, -334, 383, -435, 495, -559, 631, -712, 800, -897, 1001, -1119, 1246, -1385, 1536, -1699, 1880, -2080, 2292, -2528, 2787, -3070, 3382, -3724, 4107, -4532, 5008, -5545, 6153, -6853, 7666, -8624, 9771, -11178, 12947, -15252, 18392, -22938, 30147, -43361, 75505, -325354, -120430, 610566, 115268, -261153, -123009, 99693, 37090, 89082, 903, -203049, -124373, 247703, 222612, -79100, -172296, -32638, 74810, 147646, 36762, -173690, -149043, 95606, 93748, -68957, 2083, 111805, -78192, -157235, 55508, 83337, -89764, -1485, 145629, 15016, -64850, 85296, 14984, -209154, -25342, 275361, 59630, -227845, -37736, 141086, -41729, -109341]
116a09341J79987r894j78977M1224J52582k6225o5687L1033M493j1700Q617n3628
128c7516k2658J08273L9913r9738O464Q6853j25385j56544J83060K03608j69244
139A7086j58792J48342O8086j35398K2386J31987q6768j18415J37593J05891j45934
150a3936p1979J16526K9700n1765K0000l2115j18204L4752J84729K8895j55461
161b8858p0832O2117N6343J4331m1995o3352N8377J23453l2763j32261k046P8497
173B1011p032p646N6941n0953j16268P4373J32702q1858j13620Q4016O8176j05539
185d5697m3294J19456L4662q8787O173O8776l0723n5502J2146K0457J5680M0986
197E4333j521p8182l3753O2024K8743m2851j7346J3190R571K4199p413n4557O514
$$ y = [-109341, 70646, 60752, -118225, -77001, 75581, 49356, -16331, 14702, 19195, 7495, 16112, -37516, -60174, 48099, 88012, -11726, -5262, 81591, -43794, -200338, -17278, 186330, 17086, -141706, 6636, 74722, -60676, -38290, 93697, 6929, -111486, 26107, 131998, -13936, -85915, 30611, 60311, 8546, 28546, -3569, -121773, -87021, 97708, 126603, -28858, -99690, -37573, 18770, 33101, -8894, -72246, -13869, 109584, 76821, -55440, -57486, 21011, 13979, 6333, 63274, 12321, -103947, -29574, 103128, 21270, -92350, -8334, 59842, -45697, -88991, 30465, 65127, -23660, -17487, 51289, 20566, -34936, -22790, -2333, 13347, 54333, 52812, -25370, -59123, 2901, 31644, -11207, -28553, -15363, -5792, 18407, 10994, -43563, -37049]
210c7049Q4729P839r3251j7892Q0429J4385l9708K1499R716n1056O629M7389m4788
223a1129o3453O8318R1159o0566r7155L0624O2451j1519k0815L577M442J4479
235A0413J4740j5231k4354J2517K6073p845j3086j116k1246o55M4792L791m6917
248a8124q486K4808q126j8124K6007K2029k5738j082L4849j8337m0111K3702L5687
261B8954j2634j5836J0599j620k1406N877K1754j6442k2395J4762J1522j0299
273g164p731M006J5771J0254j5485j7578R634K3231k99j7275J1268J7619k1163
286E088j6740J3195J7r881P805R181j1912j5055R089J1810j1729j941J3784j085
300A626m299M854J518K657L805n96k224o163k684M118J730L18n879n069O754m263
$$ y = [-37049, 47680, 55519, -37732, -55624, 24805, 39190, -518, 20981, 30697, -20359, -13730, 33659, -11129, -74582, -6264, 84895, 24329, -72826, -42202, 20249, 8730, -12085, -8508, -4066, 10413, 25153, 9922, -14432, -1915, 24158, 16313, 3227, 2111, -19135, -19790, 25002, 28793, -18124, -26610, -1802, -9928, -28052, -2045, 19984, -5754, -6836, 28013, 9676, -30435, -6733, 28954, 16320, 484, 11083, 9463, -11943, -6066, 15688, -754, -23149, -8387, 3135, -7164, -14895, -10889, 4882, 15136, -349, -17927, -8293, 14938, 14639, -2636, 8632, 26251, 5088, -11652, 1543, 1560, -8321, -516, 8665, -3247, -18302, -9213, 2597, -9132, -11073, 2711, 1626, -2673, 2181, 3699, 6356, 10161, 9565, 7341, 1178, -1506, 2612, 4342, 4660, -1219, -6288, 466, -3797]
316c797j6522Q781J8257p808j0046R339J2018q966j1228J5811J2155j5338m825
329b169J0608J101o362n904J419N623n252q669j09M498L750m123k920R156k03
344D44p183O690O384k523r68L600L889l526p172K590K948l399j192m694l281N733
360a660Ln500k102L156P322n00q228N037R928j503m722J718N701k348o596P069
376F775K708j4738k274J2306j159j1228l625M801M973O08k210o564J141J7281
390H795K915j7331K242J3915m578l149Q773n065j6464O234J9282j0482k0764R710
404e967Q721j0974N321O928j7550l712K7283O252k5359o58K1645o340j0256K1065
418A6399q00l0167P959K7767j3268k2298J0432P163j3200P327J2320k4686r172
$$ y = [-3797, -20319, -11538, 6719, -1089, -11135, -1796, 10222, 1256, -9972, 5839, 17994, 2656, -2169, 8439, 9540, 3178, -2726, -1307, 4316, -936, -9605, -9714, -5216, -1466, -5589, -8509, 647, 444, -6739, -49, 6335, 3812, 2844, 6444, 10333, 6807, -365, 2225, 5173, 1774, 582, -4112, -7393, -1660, -1657, -7157, -9259, -6103, 1219, 719, -7509, -2472, 7456, 5953, 1231, 2949, 8650, 6302, -294, 6775, 9483, -5255, -7529, 4777, 3618, -7610, -11235, -6434, -1461, -853, -3063, -9627, -8486, 8795, 11710, -5621, -3379, 10536, 5958, 2809, 11582, 6517, -9947, -3713, 15569, 5087, -15677, -5967, 2754, -8220, -2899, 4029, -13521, -17233, 10050, 16302, -9057, -9715, 11930, 5590, -4666, 16399, 15599, -14568, -6609, 21158, 7890, -14408, -3976, 3187, -10013, -2686, 9634, -15052, -24224]
431b4224L6771L166l4328J0310K7729j8846j6329L0137R168l3096J995K7213j7416
444B250j7617K7545Ll4709J0299K8782j8990j7461K2858k79k6087K6132L1187
457C3913m3110k8023N1543K1682l9930o075K2231j5360p235L4440m266m8862P389
470b1663M1475j4350j9210J8693j2988k6074M2280L6948n3033m1826N1745L5657
482C7654l4024o915J7398k8013o451N3368K227o1012p527M3429N019j4330N177
495F000k1730k7007M8656M5346n6008m5386M7800L0815k7225K391J5686l4844
507a5506j4640N9016J5200o2796j3257M3127k69j3601J5089j8213l4727L2949
519g628M5970l4557l9487L5387J8791l2598J2942L3351l6586k9411M6754K4063
$$ y = [-24224, 12547, 15713, -18615, -8305, 19424, 578, -15751, 14386, 23554, -9542, -7547, 19666, 2250, -15367, 12178, 12181, -22528, -12229, 16553, -2437, -19898, 2960, 2681, -23406, 2726, 33913, -9197, -37220, 14323, 36005, -3925, -10000, 12231, -3129, -10364, 24076, 19810, -29052, -21663, 19812, 5462, -13748, 4945, -8043, -34117, 8163, 45111, -7922, -49748, 1997, 37654, 3630, -3285, 14113, -13900, -20351, 33017, 35244, -25768, -33295, 10134, 15153, 823, 6000, -15730, -42737, 5919, 51265, -4743, -50129, -2329, 28486, 1261, 3652, 19338, -15506, -30146, 28870, 44070, -18726, -31983, 11144, 10875, -2726, 12363, -5850, -40577, -7628, 38342, 3785, -35702, -315, 18476, -14122, -1180, 32171, -4415, -33826, 12928, 36991]
531C6991m0143j1719K5455j2186j5200L1303K093m3335Q079L6749j7892j6738
543a6543K9077n312m1132K2300N3893k5985m9295K8652L0279k6279p64K2865k9369
556g613k5169M1458K5243l8541j9944K2947k378o031K9753q252n2542J7644O2164
569C8739j1947m6035R084J8060j4867J2596K8393l4277m0587M1198L8179l3037
581E499k3590J1966q854J383L9024l096n7663R38O1397J718m3767N875J4473j7528
595a2225J4306L5136k7215m3858K6264L7227k1758k2541J3502o032q954L1100
607A4952N683m3158j394L9660n943k7282J8320J5447k8563N76L9756j0441l7176
620a9563J5259J9301k1588k1K5930j5614k9193K3225K3125k7717j2563K4276n734
$$ y = [36991, -3152, -14871, 10584, -1602, -16802, 14501, 16594, -26741, -18662, 18087, 195, -16543, 12534, 7222, -33910, -11610, 42283, 16298, -32997, -4345, 25934, -345, -1109, 21756, -7613, -32782, 8676, 33919, -4622, -24566, -1619, -3997, -10028, 19725, 11473, -41069, -23425, 38739, 26792, -19243, -10159, 7901, -6966, 5630, 34023, -254, -40841, 357, 38536, 5499, -18091, -6125, -14979, -13596, 25428, 22332, -35331, -34393, 27004, 28722, -15045, -9170, 5303, -12225, 2081, 37217, 10002, -33856, -7592, 29635, 7877, -14664, -1162, -7194, -16148, 14952, 20635, -22523, -23917, 15743, 9800, -17482, 838, 16285, -12278, -11702, 28054, 17613, -19563, -4304, 14997, -6591, -6612, 19318, 3704, -25489, -2264, 20861, -6856, -19419, 4857, -877]
633h77j5937K6983J2322l6349n953L7014J131k8689O552J4852j6108k91K4710
646A9360j1749k6048J4442J3515j9066k50K0178j1857j9248K4600J8330k8420
658f213j1964K4169N72j2721J5763O492k5970k186K9091j551k7337J142J3171
671B458o383K004J3900j5221j6890J9687J5710j8954j0420J4750L600n479J1938
684A0700K321k2354n81K2097l002j6728N252P377q554J504J0145r883j4663J3072
698c297J2298j3407m983J2857N87o389O483L328j0371j824J0055q61p597P021
712C900N288j1329l853P451j909o577L365L998k884M14O168m052p343O037P488
727F162n234k072L821L4M41L124k459p424p12O848j751p414L580O792l424m109
$$ y = [-877, -16814, 10169, 22491, -13858, -19811, 17203, 18334, -10355, -3803, 11049, -5059, -5350, 19360, 7611, -18437, -3995, 9520, -9546, -9796, 10382, -1475, -20723, 3877, 22207, -6213, -18177, 5992, 6564, -6157, 9606, 16098, -9872, -12058, 17033, 15482, -11855, -10713, 2458, -3925, -1921, 11979, -3242, -20132, -445, 15265, -3689, -14109, 641, 4241, -1238, 10700, 13021, -9333, -9914, 12183, 9181, -7547, -2295, 5082, -3472, -1968, 8177, -1706, -16369, -3297, 9001, -4406, -9389, 3468, 4055, -2334, 4149, 7477, -2894, -4718, 5337, 4476, -3121, 3900, 9188, -2141, -5994, 1457, -452, -7029, -3664, 334, -2550, -2136, 4032, -20, -7363, -1326, 6162, 928, -1144, 2677, 2711, 3152, 6276, 3817, -3607, -4319, 2529, 778, -6636, -3056, 3736, 312, -3797]
743c797J206N75q95N23K658K133L3J477n42l107Q93J499j797p68j45l93P16M34
761G03q16l324j810L704J200m351P64N383K781j643l236N41J912j008J99J176
777B175r6J380m56l841j333O16k50o95l57K096j09j936K936J196l268K65K761
794A084J51m52Q28K046M69j624r45j775j864J160K97j433K246O69l070p78J480
811a511j60j486J482L958j01k309J851J616j531j58j83j777J073P20j343j226
827a085O10J584l414k294K200O88o04L011K11j667J739J565j807j875K068K617
843C547j456r99J160k381j319L664k377m706J624M210j230l009J558K771j409
858c52m88J454j884K79N230l93m178K184K349l028l285K016J000k710J257K741
$$ y = [-3797, -2591, -2016, -2911, -2388, 270, 2403, 2436, 3913, 3371, 264, 1157, 2656, 859, 91, -54, -447, 269, 703, -113, -3437, -5247, -1543, -343, -4694, -3930, 1453, 4234, 2591, -645, -104, 1808, 800, 999, 2175, 2079, 3459, 3003, -838, -2171, -1555, -1805, -2500, -2857, -761, -870, -2806, 130, 1326, -1942, -1677, 1084, 1235, 783, 1611, 3657, 4126, 2502, 1557, -218, -2082, -922, -625, -2058, 188, 857, -2213, -2991, -1511, -1671, -3157, -1675, 2283, 2182, -127, 1724, 3340, 1809, 1651, 1468, -309, 764, 1484, 141, -1085, -475, 1109, -2305, -4599, -2399, -1711, -2315, 696, 907, -760, 979, 2544, 737, -1138, 930, 3547, 2091, 1092, 2252, -129, -1448, 2216, -161, -4867, -3243, 967, -263, -3272, -1714, 1057, -352, -840, 614, -1270, -991, 4239, 3846, -332, 1852, 4201, 1173, -2112, -96, 904, -1806, -549, 2192]
874B192n098j746N341Jm600J325L490n79k46L080r47m110L639M737o180m463O002
891A838J264m372P69K717m457l882N557K563n323n24M701q01J68L362l174m338
907c932M624O280m738n120M677J079m783L026L719q311m824R059M138p372l076
922e554N329Kj515M575m42q058L686R143k744o367K909J495m216K224N529o395
938c99p987P509O568p244l224M402j570j576N742J520p581M43Q406j872n488O296
954C945Q36j0195K808J1336n416j0875N586P094p483k666Q624l342r450P645Q541
969F988p652l586N570q09k346P476J507j2184j226J3966q74j1209K869L606p529
984e433K454J0874o359j3555P161J1964n482n578N466l544m401J3386M843j6803
$$ y = [2192, -2906, -4652, 689, 690, -3910, -2585, 905, 326, 80, 3160, 2213, -1897, 1742, 6479, 299, -4164, 1838, 3102, -1270, -501, 2216, -2241, -6123, -566, 1997, -3326, -3850, 851, 50, 218, 3580, 406, -3932, 692, 6972, 2234, -2886, 1791, 2870, -1913, 1113, 4832, -3479, -8303, 756, 4894, -2478, -5554, -225, -223, -1738, 2837, 2395, -5663, -1977, 7166, 4422, -1945, 964, 2459, -1757, 467, 5996, -399, -8386, -877, 5691, -1553, -4777, -375, -1945, -3521, 2221, 3741, -3840, -3397, 5009, 3137, -2351, 3945, 4781, -5414, -2606, 8730, 3314, -7561, -1975, 5119, -2364, -5030, 3594, 252, -9198, -1553, 6988, -664, -4250, 1320, 511, -1835, 5641, 7148, -5036, -6262, 7704, 6830, -4379, -1510, 2096, -5433, -2979, 7895, 1536, -12019, -4858, 7106, 1624, -3954, 1512, -2032, -6433, 6953, 11796, -5007]
998e007m169J4888K144j0459K841M206j1227k01J6701k768j8248L181J2451k555
1012A778l256L887n130n737J1765R308j3957o529J1658K54o728P900J882j5554
1026h459l08J8513j230j7639J970J1157n530k737J0815n074j2300R241J1491q558
1040A352o048Q133j229p814R577P270j5120o914J5531K606j1763K178N143q233
1054e331o52J2065j172j2937L309R762m979j246Q147o612r600J2062J0015j3604
1068g73q139J1696J435r287N919O670j3570n895J6464L563j2535j010O433k027
1082a056M19P913m658j1732P439J1567o964o401N383k214m681Q582M327j2666
1096d742n616J2372M314r479L18M316n943M24J1325k228j2025L414R882k998m934
$$ y = [-5007, -9176, 5712, 7856, -2603, 238, 4444, -6783, -6984, 9717, 6949, -11299, -8118, 4333, 1778, -1478, 2409, -2721, -8458, 3307, 12615, -1342, -7871, 3787, 4041, -2687, 5213, 7095, -8459, -8767, 9746, 8516, -9123, -7153, 4004, -1526, -4263, 6552, 1478, -10822, -1581, 9910, 1352, -4696, 3437, 2208, -5606, 3971, 11241, -3879, -10793, 4738, 7344, -4419, -2241, 2902, -5331, -5983, 6082, 4910, -8027, -4718, 5044, 65, -1181, 6966, 354, -9246, 2816, 12831, -773, -8912, 2784, 4219, -5068, 851, 7521, -6049, -11944, 4520, 8083, -4452, -5462, 971, -1056, -637, 7276, 2618, -9114, -1675, 9892, 2928, -3473, 1910, -304, -4985, 3597, 7924, -4742, -10358, 2014, 6328, -3151, -2833, 1483, -4460, -4036, 7289, 5061, -6964, -3550, 6332, 3334, -1600]
1111a600M613j276p622N885Q805q593q820P207M605m550K29K665m576j926Q495
1126C541J795q253K23N844k245j112N062k675p089L841P250m636o359M565J092
1141H44m920L082N533o493m969P127M434n763r99M374k007k898O338J638p821
1156b500q44O464j52m351J127M09k768J042M235k832m116L464K386l377J702K633
1172B522l854j575N850K055o278j109N195l33m170K974J204n475q4N113m45m800
1188c210R28L072j658l30L289j612l521L672L203l527j286K754n54j982J672J253
1204B163l528j040L414m78k296J206O34k394J357K777k352j992K952K716l393
1219b54n16L317j054l469K785K257l127j861K325Q23k491m79J689q39q64J713
$$ y = [-1600, 3013, 1737, -5885, 0, 8805, 212, -8608, -1401, 3204, -1346, -1117, 1548, -3028, -4954, 3541, 5336, -2917, -2694, 3150, 905, -207, 4855, 2180, -4909, -1068, 6182, 1546, -4813, -248, 844, -4076, -994, 4539, -1954, -6923, 204, 4638, -1125, -2124, 2250, 243, -2655, 3683, 5321, -2500, -3344, 3120, 2968, -1383, -256, 153, -2615, -1573, 2662, -170, -4286, -822, 1564, -1813, -111, 2522, -1332, -2907, 2943, 4998, -1280, -2389, 2806, 2473, -1697, 1277, 2481, -2994, -3078, 2035, 1590, -3210, -2282, 790, -868, -1198, 2091, 479, -3042, 630, 3833, 306, -980, 1774, 1220, -762, 910, 2163, -1365, -2405, 1009, 531, -1765, -559, 75, -2319, -962, 1815, -537, -2529, 423, 3139, -254, -770, 2547, 1493, -1976, 809, 3066, -61, -1922, 403, 1226, -1265, -1744, -55, -894, -1758, -45]
1235d5R9q04J133J36j142J268J144r04j718J857J479k368o09J449j184j430J473
1252a66K88j784K87J568j79j702J340R29j207J75J713m79r65J257M95q97n62K05
1270C16K25o11j038P75k76J04J75j412Q38J101m62p61J452M52m54j49L94O68j361
1289b4L33R40j149k81K53j63J11p83l30J68K66K41o6j69P07N24l02m52M39K10
1309D73K98q8l94N87J94n36p28o86P47l82n75N04N79q05j32J005j87l29l24J067
1329B88J000q59l02Q79R6l24r85Q7N65p21o06R17K4k04n30l71O62j8k55j07P08
1350e6Q12o5n42P37J21j065q6J109j46j292k9R58l60p18l56l89K89R34L79j255
1370a020O52J540j012n38Q72P80j295j43J962k37k183R68P30j810j93Q80p06o98
$$ y = [-45, 54, -750, 383, 519, -623, 645, 1789, 885, -833, 1024, 2503, 135, -474, 975, -209, -1639, -166, 122, -1662, -1375, 193, 14, -1688, -348, 581, -626, -451, 1262, 783, -182, 1075, 1570, 673, 111, 316, 541, -70, -1108, -333, -609, -505, -330, -1742, -904, 197, -265, -1026, 426, 878, 424, 275, 669, 1337, -24, 309, 1249, 100, -181, 72, -91, 20, -763, -1093, -925, -659, -418, -484, -653, 54, 578, 276, -176, 263, 473, 771, 683, 289, 876, 1070, 534, -194, -880, -133, -515, -1090, -586, -7, -812, -944, 61, -126, -455, -779, 288, 1288, 429, 127, 1006, 1102, 778, -207, -120, 445, -276, -882, 35, 59, -145, -675, -1046, -384, -402, -657, -764, -56, 756, 691, 149, 886, 1007, -58, -144, 965, 819, -473, -502, 456, 96, -622, -978, -1367, -1078, -144, 235, -1020, -368, 1172, 160, -378, 494, 1274, -21, -164, 1798, 1561, -622, 346, 1076, -734, -927, -47, -753, -1451]
1388a451J394L39j209K79J552j312j531L180J222k952k04K269k75j525R26j67
1404E35j971N69K806k090k190J809J042k009P09J755k285j211L834J261l205o88
1420a329L116p39j853J851O43l018L36L249j469k704J582M77k616J602L132k999
1436g39k734L983K493l326p19K278p09j630L111Q06m257l42L605o71k519J220
1452a50R2l016K374L640l160l660L385K934l318k98L370j923k506M077J710l982
1468d31j375K805j24j937K169J56m176J001M646k554l412K617J672k904J409L962
1484C524k675m218L364L716l032k012J936p55r68L143M10n089k85M344l33l095
1500b025J823Q63l583J685N684k689n455K282M392j618j766J705q44k680L540
$$ y = [-1451, -57, 282, -927, -648, 904, -408, -1939, 1241, 2463, -489, -693, 1576, 1301, -224, 702, 535, -1436, -867, 1939, -151, -2341, -532, 510, -1499, -790, 965, -1320, -2531, 1303, 2564, -641, -1329, 1787, 1048, -805, 1046, 1689, -1329, -993, 2256, 787, -1917, -335, 142, -2474, -872, 2260, -739, -3473, 510, 3003, -323, -1042, 1236, 527, -1103, 2008, 2814, -1443, -1785, 1820, 1149, -1370, -150, -58, -3074, -700, 2940, -220, -3880, -495, 2439, -879, -1177, 2193, 270, -2236, 1841, 3551, -431, -1806, 999, 875, -1062, 1107, 1263, -2913, -1912, 2734, 180, -3232, -615, 1057, -1847, -438, 3524, 849, -3369, -5, 3711, 679, -1333, 603, -152, -1120, 2023, 2433, -2656, -2941, 1403, 1070, -2025, -202, 661, -2922, -1237, 4447, 1758, -3697, -1415, 2977, 1359, -407, 1298, 454, -2226, 1314]
1515A314K116m375k198L323j55j207K117j71l970M44N826m76n440J256L573j911
1531F6j95L472k201m421K923L742k360l106J799K55j715L188J066n376j180N491
1547A448R46l763K93K206j645m37M271p66n392J405M279j709k123J895j224k368
1563b684L088K586m111k926M468J176k878R89K316l416j281N269R82m747o95L254
1579A390n75j266K564j341m177K517M024k747l334K447Q84k051J665K515l636
1594a121j912M189J684l074l60K036j661o57L457o99m495P62M041j797k276K350
1610D67m44k573K316K940k437l666L256K205j776o44J690j657p47K937Q62m126
1626a397K00K363j215q31J704l28l376J615L946k080l252K555J232j766Q79K101
$$ y = [1314, 3430, -945, -3143, 180, 25, -1182, 935, 764, -3206, -2762, 3064, 2588, -2852, -1596, 1977, 66, -129, 3343, 1142, -3279, -356, 3386, 1026, -2080, -281, -26, -1741, 1447, 2513, -2863, -4043, 1448, 2394, -1369, -1076, 1130, -515, -952, 3319, 2553, -2839, -1434, 2845, 1136, -987, 908, -316, -2684, 404, 2990, -1121, -4047, 421, 1597, -1281, -292, 2024, -1392, -2673, 2596, 3578, -1169, -1864, 1390, 815, -451, 2113, 772, -3405, -888, 3136, 389, -2945, -498, 386, -1665, 0, 2515, -1121, -3033, 1156, 2840, -234, -594, 1442, -219, -876, 2581, 1882, -2613, -1851, 2190, 393, -1883, 467, 23, -2550, -234, 2706, 269, -3397, -141, 2064, 288, -356, 1334, -323, -1070, 1867, 2729, -1397, -1197, 1166, -49, -880, 824, 496, -2880, -1265, 2681, 601, -2651, -96, 1136, -630, 249, 2350]
1642B350k345j504K347J644k764o38J989j293q90K272pl344O74K781r99j794J101
1659d20J025j257M68J881j099j442J533P12j327J46P37j586m67J741N16k533k11
1676a583K539p48j669J631L61j836O78J635m57j121O42Q75r58K65R53j299p62
1693h54J118L98j266m98J174m65o37O40O12q09J30J081j08o51K96Q1L5M83K61
1712A021r06p41R39M30j364k83J000n07m05K44P68o54n23O52P44k01n19O26J3
1731C34J06L98m14K0j63J25m00j39K68l4j008P5J159m48o78L23R91n89k70K42
1751a02N41k22r7L61n8O5L52n73m59L91j46n35N9M97n4j151M55J075o19l33M78
1772g5N80l92l01N89L13j79j32l8l34M32j03o31J84N58r89m37P59K90o62l47Q19
$$ y = [2350, 5, -1499, 848, 2492, -272, -910, 1079, -214, -1104, 1168, 1161, -2183, -1509, 1272, 273, -1521, -420, 605, -652, -184, 1697, 598, -844, 689, 1401, 74, 220, 957, -629, -1096, 645, 1161, -1372, -1583, 956, 208, -1461, 170, 531, -1305, -627, 1008, 551, -570, 72, 947, -11, 254, 1207, -92, -854, 264, 662, -604, -1102, 72, -393, -1030, -390, 222, -587, -457, 624, 516, -135, 161, 242, 277, 760, 1021, 115, -626, 313, 743, -621, -904, 96, -411, -816, -572, 196, -458, -981, -329, 415, 214, -305, 321, 334, 440, 838, 424, 444, 281, 406, 6, -133, 135, 101, -907, -832, 327, -121, -799, -476, 515, -74, -344, -102, 439, 217, 120, 481, 423, 488, 840, 267, -192, 199, 53, -482, -423, 74, 20, -1131, -676, 399, -220, -553, -75, 505, 113, -188, 401, 714, 535, 403, 365, 31, 463, 360, -271, -87, 471, -518, -955, -196, 94, -568, -915, -96]
1793i6N88p33J26P42m99K94q4n2j98L43m09k23J79J14K7q38M87J11q31M55M44
1814e3l6p6k2M20r9m1M30k16m04P71j01r54N67M86j162k56Q23R1p39q6J103p65
1836c19m95P85L91n02P7Q45p42K19L92jp98L53L47p21j14M58l64p72P53M63q99
1857f44k8N26L82l81M72K88r55L84J100l51j196N95M82m96o10R25n12p29mR61
1877B09k08q88M60M45m70P27j63j27j44Q40J14r02K45P87r76n0Q82m82j152J35
1897g18R92k13r79L58N32r09O12R80r25o48J411j9k71J07P02j156n52J585L09
1916A198k193j19J382j99q54R62j00j048O03J000j86j361R46M41l89M78P44j338
1934c3j039J996O25j943n95J463l60j057R36R83k164k39K095k76j099M19M97q35
$$ y = [-96, 492, -241, -115, 627, 128, 422, 338, 286, 88, 431, 22, -201, -22, 92, 119, -719, -232, -121, -952, -497, -53, -89, -165, -187, 233, 134, 93, 523, 307, -97, 674, 573, -381, 186, 672, -490, -746, 77, 168, -571, -657, 446, -319, -814, -29, 362, -140, -63, 782, 40, 259, 651, 650, -148, 205, 552, -169, -283, 175, -189, -961, -208, 255, -644, -672, -146, 236, -145, 327, 615, -340, 44, 1144, 793, -403, 192, 674, 178, -432, 493, -19, -748, -752, 209, 1, -887, -427, 18, -452, 275, 112, -15, -159, 681, 795, -107, 138, 925, -51, -101, 781, 299, -853, -718, 274, 61, -918, -560, -28, -937, -325, 655, -270, -918, 493, 474, 203, 310, 1012, -144, -696, 889, 1198, -995, -1114, 268, 69, -785, 177, 77, -971, -368, 632, 446, -915, 31, 472, 83, 561, 1305, -33, -1072, 924, 1549, -394, -989, 474, 114, -943, -7, 976, -1188, -1427, 668, 392, -707, -288, 209, -626]
1952f26Q94J347j215j920J870J200j274o97J070q24j322J943Q17k265j042K238
1968A94L47j563J415K4j679O12L057j429k034J016J398j382L2J693j606k161K231
1985A65J523j816j539J814L0j134J369P35k550M9K672j60k300J060J315j683J62
2002b88K605j266l150J613K051j108j708J645q87j224K156J413k855p07K437K09
2018I36j480J194J94k031J07L496o91l485Q04K052j136l80J140j006j706J874
2034a18J925k172j217J842k40q01J752N75k803j25L249k8k760N73J203r04k65
2051c14J825j187k793J787J874j148j092J228o00o99J560J705k951r63K729M99
2067A460j732P09L13j591J22K224j48k939K98K043p46q38J369r24j846K384J756
$$ y = [-626, 268, 1615, 400, -1520, 350, 1550, 276, -421, 649, -175, -1497, 446, 1263, -1002, -2044, 194, 541, -1022, 393, 417, -1262, -650, 2407, 978, -1056, -40, 1358, -24, 8, 1701, 95, -2066, 165, 1688, -128, -1667, 147, 177, -957, 412, 1147, -1403, -1354, 1318, 1158, -1142, -82, 1233, -450, -288, 2317, 1051, -2099, -486, 1565, 457, -1251, 394, -493, -1717, 439, 1852, -1003, -1710, 727, 936, -544, 650, 844, -1187, -1080, 2416, 1725, -1760, -956, 1096, -40, -420, 720, -286, -1992, -118, 1807, -365, -1582, 260, 20, -781, 971, 1546, -1257, -1382, 1867, 1839, -921, -348, 855, -49, -314, 1511, 324, -2469, -682, 1192, 44, -1048, 180, -420, -1119, 441, 2146, -805, -1768, 961, 1460, -272, 437, 750, -841, -719, 1505, 1357, -1582, -1284, 759, 13, -825, 544, -380, -2226, 158, 1914]
2084A914j978j168J567L53o95P13Q43k284m30K289J35k034p7J072q21K49J118
2101G66o87k001J113K155j232q04R06J17q40J120J051j728r75J421Q15j253k91
2118c47Q36j137m08J893k83j843K42J441l32l87O98l8j188P47J621j319r28Q43
2136A11N66m38j29N35j218l14R85N55j708L60O61j18m53J027j28j147O09J556
2154A312l56j378K81O69m07k14P40o10q61O45L95o96L0L27k73p5P16M51j411K00
2174e15J244l27o26M26M84q53P6J082m89j171K45P64o19n9M71m85l04N49L73p12
2194d46J24P97l7o31N18L34r04J83O04j80n90m4l7L11k12J85m55o6M59M04p97
2215d80L4Q97n10j34P92R7p45RN03K78n53j25L38m74r9r1k0k15M2J96J60m04M46
$$ y = [1914, -64, -1232, 335, 688, -7, 706, 1549, -735, -1165, 1124, 1259, -775, -852, 220, -601, -352, 766, 79, -1922, -809, 1346, 114, -690, 216, 333, -507, 613, 1664, -64, -1039, 382, 1197, -56, -347, 489, -648, -1056, 837, 554, -1289, -1047, 394, 62, -325, 373, 335, -853, -106, 1515, 196, -732, 111, 677, 239, 110, 645, -573, -887, 98, 653, -1055, -695, -34, -152, -605, 422, 294, -853, -244, 1312, 956, -422, -141, 528, 121, -93, 647, 37, -824, -179, 216, -480, -450, -123, -396, -471, 245, 696, -715, -515, 729, 402, -224, 202, 686, -167, -91, 991, 502, -669, -424, 340, -279, -338, 133, -352, -656, -107, 266, -446, -322, 475, 438, -193, 325, 659, -245, -62, 542, 362, -228, -272, -309, 2, -210, -25, -480, -546, -87, 317, -480, -446, 451, -59, -193, 599, 696, -49, -40, 463, 741, 188, 63, 401, -73, -172, -263, -283, -498, -456, -260, -100, -504, -58]
2238e8j55K8M98M86q93J81M42k74R5l2k38l18L78J70m55m10L20r2k99L74K15m05
2260d42J91oQ61q4m99N60rl39m3j65J62j01j68O4K7Q8m45o3Q7K23j71m28Q51J55
2284C06n19J55J1L57L53n56O2o7J16J21m20m5K79k27k03P9n8J24J1l70N44J37
2306A90k43R9L18L39o02M02k0n8m68L78%j07l49o9Rj41J94k14j52M77Mk90L82
2329G9K16k79J5M68j79j96k29M46j8n10R4K15q1j45o1k88KN85k04l99O84o7k93
2352a45J19O74o0o61Q0P59m33l22J44m86J97l8L37p30k23Q27j49m13M69M43r77
2373e88L31J123l22p23K46O97q26J61L68j72p49M67L37r54K18N43n58m94J009
2392A14Lp99J23J204n18p83P61O75r12K35P53q40n76O97L19r48R8P19p57o41J218
$$ y = [-58, -213, -185, 313, 799, -94, 87, 529, 255, 350, 318, 80, -238, 140, 310, -145, -555, -235, -327, -626, -252, -37, -442, -251, -257, 604, 520, 21, 581, 572, 233, 190, 25, 187, 86, -82, -18, 9, 97, -348, -411, -324, -101, -272, -700, 151, 306, -213, -58, -47, 310, 663, 107, 169, 102, 218, 339, -81, -126, 153, -74, -277, -198, -256, -132, -121, -491, 53, 190, -53, 46, 364, 703, 101, 503, 483, 425, -43, 335, 335, 228, -121, -190, -181, -322, -128, -342, -494, -17, -13, -303, 79, 295, 16, 31, 499, 320, 124, -105, 341, 323, -187, -93, 122, 41, -104, -165, -453, -451, 134, -70, -469, 215, 148, -145, -26, 648, 588, -73, 7, 766, 333, 11, 155, -331, -134, -172, 165, -565, -788, 39, -110, -523, -54, 389, -588, -257, 866, 544, -179, 67, 764, -62, 99, 467, 295, -454, 13, 350, -604, -386, 157, -401, -895, 114, 117, -682, -559, 645, 127, -656, 105, 780, -132, 103, 856, 16, -560, 137, 456, -492, -394, 325, -432, -1073, 145]
2413A45M48j387K1J161l9n26L35J28n26K31J021m78q07O86K79q23K11O99j494
2432g15o35J643L71j261j44J250n55o08J320k2j248O8J632n08p71L44K88r01N73
2451A21Q08j204j146J483O63j226k80J076p01m40J335Q15j810l59J593K00o96
2468B32L42l17p86L34J311q33j330N43Q54r76m8J304j082q59J350J376j805m11
2486h01R76N42m23N79N3j221l76K111o94j758Q43J68p35L17J052q03j489J091
2504e68J737j204q27J121k15n90J214P17j282r01J317M68j316M14L10j292m7J993
2522A049l72k203N01J782q52l11R73o19r71J092J538j468j071J550p9q91Q91K98
2540H37j840k40K084j14j858P6J397p33l45J617o74j383Q02J970r34j195Q32o
$$ y = [145, 593, -794, -773, 388, 349, -177, 158, 286, -240, -9, 1012, 534, -273, 413, 692, -131, 80, 779, -715, -1350, 293, 664, -597, -741, 509, -46, -654, 666, 644, -604, -536, 1096, 588, -183, 161, 449, -452, 121, 929, -275, -1421, 62, 725, -501, -781, 295, -406, -846, 489, 1304, -506, -865, 728, 928, 232, 574, 257, -529, -195, 1116, 283, -1047, -504, 350, -626, -674, 630, -452, -1311, 39, 1415, -390, -801, 175, 717, 294, 873, 926, -295, -671, 1440, 746, -1012, -169, -1, -736, -419, 633, -170, -1659, -568, 1169, -35, -862, 259, 44, -546, 668, 1385, 103, -798, 519, 987, -329, 85, 395, -897, -944, 1049, 677, -1526, -1025, 757, -95, -406, 567, -52, -1023, 69, 1607, 139, -932, 618, 539, -352, 539, 837, -1003, -1243, 841, 727, -1131, -1055, 342, -391, -736, 881, 207, -1176, -374, 1596, 662, -533, 299, 293]
2558B93r80R14J159j899q65J639L93j460J55R29o11o69J793n9j646L10J644n07
2576E33q25J064l91j092J237J211j704j120J321N25j258N81N71j462m30J705M19
2593H85j592P6J099n48J7J080l82j344Q26J242q86j047O16n9r04J068Q00j192
$$ y = [293, -687, 227, 1386, -513, -1378, 261, 654, -806, -651, 278, -333, -1002, 791, 732, -914, -604, 1040, 533, -292, 772, 381, -711, 526, 1737, 33, -1087, 234, 759, -499, 82, 653, -809, -1239, 466, 885, -707, -631, 468, -80, -63, 1017, 635, -709, 117, 1359, 473, -574, 42, -17, -921, 147, 947, -245]
$$ [...]
8191g2
##END NTUPLES=NMR FID
##END=
