##TITLE=1H_Ser Am-O-NEA
 200.13MHz,CDCl3,
 8 sc
 
 26.6.2025
##JCAMPDX= 6.0         $$ Bruker NMR JCAMP-DX V2.0
##DATA TYPE= NMR FID
##DATA CLASS= NTUPLES
##ORIGIN= UXNMR, Bruker Analytische Messtechnik GmbH
##OWNER= pz
$$ XWIN-NMR		Version 3.5
$$ Thu Jun 26 16:09:36 2025 Russian Standard Time (UT+4h)  she@DPX200
##.OBSERVE FREQUENCY= 200.1313
##.OBSERVE NUCLEUS= ^1H
##.DELAY= (6, 6)
##.ACQUISITION MODE= SIMULTANEOUS
##.ACQUISITION SCHEME= undefined
##.AVERAGES= 8
##.DIGITISER RES= 18
##SPECTROMETER/DATA SYSTEM= spect
##.PULSE SEQUENCE= zg30
##.SOLVENT NAME= DMSO
##.SHIFT REFERENCE= (INTERNAL, DMSO, 0, 14.3821)
##AUDIT TRAIL= $$ (NUMBER, WHEN, WHO, WHERE, WHAT)
$$ ##TITLE= Audit trail, XWIN-NMR		Version 3.5
$$ ##JCAMPDX= 5.01
$$ ##ORIGIN= Bruker BioSpin GmbH
$$ ##OWNER= she
$$ F:/spectra/data/she/nmr/H-C/1/audita.txt
$$ ##AUDIT TRAIL=  $$ (NUMBER, WHEN, WHO, WHERE, WHAT)
(   1,<2025-06-26 16:08:05.98 +0400>,<she>,<DPX200>,
      <created by zg, POWCHK disabled, PULCHK disabled
       configuration hash MD5:
       00 E9 B6 7A A2 85 ED C7 34 08 36 98 17 FE 4E 26
       data hash MD5: 16K
       C7 90 76 C5 27 31 55 37 9D 41 50 F6 57 F5 F4 DE>)
$$ ##END=
$$ 
$$ hash MD5
$$ EE D7 5A 1C 39 95 4F D0 75 1C 2E B5 CA 81 13 CA
##$RELAX= 
##$RELAX= 
##$RELAX= 
##$RELAX= 
##$RELAX= 
##$RELAX= 
$$ Bruker specific parameters
$$ --------------------------
##$DU= <F:/spectra>
##$EXPNO= 1
##$NAME= <H-C>
##$PROCNO= 1
##$TYPE= <nmr>
##$USER= <she>
##$AMP= (0..31)
100 100 100 100 100 100 100 100 100 100 100 100 100 100 100 100 100 100 
100 100 100 100 100 100 100 100 100 100 100 100 100 100 
##$AQSEQ= 0
##$AQ_mod= 1
##$AUNM= <au_zg>
##$AUTOPOS= <>
##$BF1= 200.13
##$BF2= 200.13
##$BF3= 200.13
##$BF4= 200.13
##$BF5= 200.13
##$BF6= 200.13
##$BF7= 200.13
##$BF8= 200.13
##$BYTORDA= 1
##$CFDGTYP= 0
##$CFRGTYP= 5
##$CHEMSTR= <none>
##$CNST= (0..31)
1 1 145 1 1 1 1 1 1 1 1 1 1 1 1 1 1 1 1 1 1 1 1 1 1 1 1 1 1 1 1 1 
##$CPDPRG= <>
##$CPDPRG1= <>
##$CPDPRG2= <>
##$CPDPRG3= <>
##$CPDPRG4= <mlev>
##$CPDPRG5= <mlev>
##$CPDPRG6= <mlev>
##$CPDPRG7= <mlev>
##$CPDPRG8= <mlev>
##$CPDPRGB= <>
##$CPDPRGT= <>
##$D= (0..31)
0 0.7 0 0 0 0 0 0 0 0 0 0.03 0 0 0 0 0 0 0 0 0 0 0 0 0 0 0 0 0 0 0 0 
##$DATE= 1750939685
##$DBL= (0..7)
120 120 120 120 120 120 120 120 
##$DBP= (0..7)
150 150 150 150 150 150 150 150 
##$DBP07= 0
##$DBPNAM0= <>
##$DBPNAM1= <>
##$DBPNAM2= <>
##$DBPNAM3= <>
##$DBPNAM4= <>
##$DBPNAM5= <>
##$DBPNAM6= <>
##$DBPNAM7= <>
##$DBPOAL= (0..7)
0.5 0.5 0.5 0.5 0.5 0.5 0.5 0.5 
##$DBPOFFS= (0..7)
0 0 0 0 0 0 0 0 
##$DE= 6
##$DECBNUC= <off>
##$DECIM= 32
##$DECNUC= <off>
##$DECSTAT= 4
##$DIGMOD= 1
##$DIGTYP= 9
##$DL= (0..7)
0 120 120 120 120 120 120 120 
##$DP= (0..7)
150 150 150 150 150 150 150 150 
##$DP07= 0
##$DPNAME0= <>
##$DPNAME1= <>
##$DPNAME2= <>
##$DPNAME3= <>
##$DPNAME4= <>
##$DPNAME5= <>
##$DPNAME6= <>
##$DPNAME7= <>
##$DPOAL= (0..7)
0.5 0.5 0.5 0.5 0.5 0.5 0.5 0.5 
##$DPOFFS= (0..7)
0 0 0 0 0 0 0 0 
##$DQDMODE= 0
##$DR= 18
##$DS= 0
##$DSLIST= <SSSSSSSSSSSSSSS>
$$ [...]
##$SUBNAM0= <"">
##$SUBNAM1= <"">
##$SUBNAM2= <"">
##$SUBNAM3= <"">
##$SUBNAM4= <"">
##$SUBNAM5= <"">
##$SUBNAM6= <"">
##$SUBNAM7= <"">
##$SUBNAM8= <"">
##$SUBNAM9= <"">
##$SW= 18.0517328524113
##$SWIBOX= (0..15)
0 0 2 0 0 0 0 0 0 0 0 0 0 0 0 0 
##$SW_h= 3612.71676300578
##$TD= 16384
##$TD0= 1
##$TE= 0
##$TE2= 300
##$TE3= 300
##$TEG= 300
##$TL= (0..7)
0 120 120 120 120 120 120 120 
##$TP= (0..7)
150 150 150 150 150 150 150 150 
##$TP07= 0
##$TPNAME0= <>
##$TPNAME1= <>
##$TPNAME2= <>
##$TPNAME3= <>
##$TPNAME4= <>
##$TPNAME5= <>
##$TPNAME6= <>
##$TPNAME7= <>
##$TPOAL= (0..7)
0.5 0.5 0.5 0.5 0.5 0.5 0.5 0.5 
##$TPOFFS= (0..7)
0 0 0 0 0 0 0 0 
##$TUNHIN= 0
##$TUNHOUT= 0
##$TUNXOUT= 0
##$USERA1= <user>
##$USERA2= <user>
##$USERA3= <user>
##$USERA4= <user>
##$USERA5= <user>
##$V9= 5
##$VALIST= <valist>
##$VCLIST= <CCCCCCCCCCCCCCC>
##$VD= 0
##$VDLIST= <DDDDDDDDDDDDDDD>
##$VPLIST= <PPPPPPPPPPPPPPP>
##$VTLIST= <TTTTTTTTTTTTTTT>
##$WBST= 1024
##$WBSW= 4
##$XGAIN= (0..3)
0 0 0 0 
##$XL= 0
##$YL= 0
##$YMAX_a= 320514
##$YMIN_a= -370207
##$ZGOPTNS= <>
##$ZL1= 120
##$ZL2= 120
##$ZL3= 120
##$ZL4= 120
##$ABSF1= 10
##$ABSF2= 0
##$ABSG= 5
##$ABSL= 3
##$ALPHA= 0
##$AQORDER= 0
##$ASSFAC= 0
##$ASSFACI= 0
##$ASSFACX= 0
##$ASSWID= 0
##$AUNMP= <proc_1d>
##$AZFE= 0.1
##$AZFW= 0.1
##$BCFW= 1
##$BC_mod= 2
##$BYTORDP= 1
##$COROFFS= 0
##$CY= -3
##$DATMOD= 1
##$DC= 2
##$DFILT= <>
##$DTYPP= 0
##$F1P= 0
##$F2P= 0
##$FCOR= 0.5
##$FTSIZE= 0
##$FT_mod= 4
##$GAMMA= 1
##$GB= 0.15
##$INTBC= 1
##$INTSCL= 1
##$ISEN= 128
##$LB= 0.25
##$LEV0= 0
##$LPBIN= 0
##$MAXI= 10000
##$MC2= 0
##$MEAN= 0
##$ME_mod= 0
##$MI= 1.114404
##$NCOEF= 0
##$NC_proc= 0
##$NLEV= 6
##$NOISF1= 3.799351
##$NOISF2= 2.8
##$NSP= 1
##$NTH_PI= 0
##$NZP= 0
##$OFFSET= 14.38212
##$PC= 1
##$PHC0= -1201.718
##$PHC1= 10.3922
##$PH_mod= 1
##$PKNL= yes
##$PPARMOD= 0
##$PSCAL= 0
##$PSIGN= 0
##$REVERSE= no
##$SF= 200.129724274929
##$SI= 16384
##$SIGF1= 3
##$SIGF2= 2
##$SINO= 400
##$SIOLD= 16384
##$SREGLST= <1H.CDCl3>
##$SSB= 0
##$STSI= 0
##$STSR= 0
##$SW_p= 3205.1282051282
##$SYMM= 0
##$S_DEV= 0
##$TDeff= 0
##$TDoff= 0
##$TI= <>
##$TILT= no
##$TM1= 0
##$TM2= 0
##$TOPLEV= 0
##$USERP1= <user>
##$USERP2= <user>
##$USERP3= <user>
##$USERP4= <user>
##$USERP5= <user>
##$WDW= 1
##$XDIM= 8192
##$YMAX_p= 0
##$YMIN_p= 0
$$ End of Bruker specific parameters
$$ ---------------------------------
##NTUPLES= NMR FID
##VAR_NAME=  TIME,          FID/REAL,        FID/IMAG
##SYMBOL=    X,             R,               I
##VAR_TYPE=  INDEPENDENT,   DEPENDENT,       DEPENDENT
##VAR_FORM=  AFFN,          ASDF,            ASDF
##VAR_DIM=   8192,          8192,            8192
##UNITS=     SECONDS,       ARBITRARY UNITS, ARBITRARY UNITS
##FACTOR=    0.0002768,     1,               1
##FIRST=     0,             0,               0
##LAST=      2.2672688,     0,               0
##MIN=       0,             -370207,         0
##MAX=       2.2672688,     320514,          0
$$ Real data points
##PAGE= N=1
##DATA TABLE= (X++(R..R)), XYDATA
0@%%%%%%%%%%%%%%Qj6J6j6J8k6L2l4M2m8N6o8P6q8J04j19J35j54J74j97K24k51
$$ 0 0 0 0 0 0 0 0 0 0 0 0 0 0 0 8 -8 8 -8 10 -16 16 -18 24 -24 32 -36 40 -48 56 -63 72 -82 92 -105 119 -132
36a32K80l15L54l94M38m86N38n96O59p28Q04q86R74j074J184j305J440j588J755
$$ -132 148 -167 187 -207 231 -255 283 -313 346 -382 422 -464 510 -564 620 -685 755 -833 922
55I22j945K161k410K699l041L453l960M607n457O629q354J1146j6424K9794j28965
$$ 922 -1023 1138 -1272 1427 -1614 1839 -2121 2486 -2971 3658 -4696 6450 -9974 19820 -109145
70a09145k61062K43336L33342P0720k23451k33620m0663J84270K21999L0633k26371
$$ -109145 -370207 -126871 206471 277191 53740 -179880 -220543 -36273 185726 216359 -10012
81a0012k08806L8330K22977J61216n4508j98394j33146L3891J91061J79091o1705
$$ -10012 -218818 -180488 42489 203705 149197 -49197 -182343 -148452 42609 221700 159995
92A59995k63680j41344J54059K59736N4200j85764k10097l9000J84791K34915
$$ 159995 -103685 -245029 -90970 168766 222966 37202 -172895 -211895 -27104 207811
102B07811k334k39133j84378P2833K32355J27083j04335k09688j04597J17979
$$ 207811 205477 -33656 -218034 -145201 87154 214237 109902 -99786 -204383 -86404
112h6404K21326P0596j55987k04555k8786J80068J70811k0287j55741j38229O435
$$ -86404 134922 205518 49531 -155024 -183810 -3742 167069 146782 -8959 -147188 -140753
123a40753J65288J55208l8841k02778j29473R9421J90714P3300r3249j78230q6535
$$ -140753 24535 179743 140902 -61876 -191349 -91928 98786 172086 78837 -99393 -185928
134a85928J21951K03990N0578j69079j92219J7293J91744J35753n3518j74808
$$ -185928 -63977 140013 190591 21512 -170707 -153414 38330 174083 120565 -54243
144e4243j09946O4222J67182J05125q0292j91749p0690J24122J57788K9714j13085
$$ -54243 -164189 -99967 67215 172340 92048 -99701 -170391 -46269 111519 141233 28148
155B8148j39521k7793J20518J61337J3013j71678j49414M2149J72284J09901p0542
$$ 28148 -111373 -139166 -18648 142689 155702 -15976 -165390 -123241 49043 158944 88402
166H8402j62958p5285P9111J54403P0420j00712j61142m1372J25616J52182M092
$$ 88402 -74556 -149841 -70730 83673 154093 53381 -107761 -149133 -23517 128665 132757
177A32757j35408j23572L657J34867J27018l3850j56747r9967O7884J56486O7574
$$ 132757 -2651 -126223 -122566 12301 139319 105469 -51278 -151245 -83361 73125 140699
188A40699q3265j37217n3418R1800J39641K9752j07919j32554j4575J24948J19826
$$ 140699 57434 -79783 -133201 -41401 98240 127992 20073 -112481 -127056 -2108 117718
199A17718j5256j25029j03604L2749J36840Q9942n4675j44445p1118Q6264J33257
$$ 117718 102462 -22567 -126171 -93422 43418 133360 78685 -65760 -136878 -50614 82643
210H2643L5419q7178j21093k6381R8345J15467Q872j12915j09050K2094J22909
$$ 82643 118062 30884 -90209 -116590 -18245 97222 106094 -6821 -115871 -93777 29132
221B9132Q9772l6220j26734p4079N5311J18894N8714p1471j25127l1800R2041
$$ 29132 118904 82684 -44050 -118129 -62818 56076 114790 43319 -81808 -113608 -21567
232b1567J10952J2220r7765r6843L027R6201R4604j5266j11746p9187L6522J11140
$$ -21567 89385 101605 3840 -93003 -89976 6225 100829 85563 -26183 -105370 -68848 42292
244D2292O6560n6133j12965m6858O6465J12982L2323q5296j02474j0417R4094
$$ 42292 108852 52719 -60246 -107104 -40639 72343 104666 19370 -83104 -93521 573
255E73R4240j3262r6767p4910J9158R6904O9282l6056r9325n8260M9764J05514
$$ 573 94813 81551 -15216 -90126 -70968 25936 95218 59162 -40163 -98423 -48659 56855
267E6855M0367o3784r8222l0013P8458R7288O426q5800q6981J0700R5346O7385
$$ 56855 97222 33438 -64784 -94797 -16339 80949 87375 1575 -85406 -74706 20640 88025
279H8025k9239r0784n7915L9857R0845M5780m3515r1072l7496O1360Q6961K0817
$$ 88025 58786 -31998 -89913 -50056 40789 86569 43054 -48018 -85514 -24154 62807 83624
291H3624o9069q7390n166P9642P6232p691q7956o7982K9658Q6492N1978l5986
$$ 83624 14555 -72835 -78001 1641 77873 70182 -17774 -85756 -56098 30394 82372 46386
303D6386q6938l7444M8114P9774L0220n7499q2243j5456O3185P5764N043p5170
$$ 46386 -40552 -77996 -29882 49892 80112 22613 -59630 -75086 -11901 63863 68906 -6264
315f264o6719J3312P7082O1377k6170q2644m4772L6476P9035L4253n1097p3925
$$ -6264 -72983 -59671 17411 78788 52618 -30026 -74798 -38322 40713 74966 23869 -50056
327e0056k0529N2483P3550J0787o2292o5179o41O7769O3380j5252p1424n1443
$$ -50056 -70585 -18102 55448 66235 3943 -61236 -61877 5892 69272 54020 -17404 -68847
339f8847K3831P6357L9535l9774p2614l0017M7192P2429J4475n1658o2808p031
$$ -68847 -45016 31341 70876 31102 -41512 -71529 -24337 48092 62567 10909 -51899 -58930
351e8930N9879N7392n143o0300n5184J3628O7453M4036k3749o7645l8838L7431
$$ -58930 949 58341 53198 -7102 -62286 -48658 18795 62831 39082 -28563 -67401 -29970
363b9970O7565K4474m2335o6318j3820N4066N7960L435n5240n5092Q182N7004
$$ -29970 37595 62069 19734 -46584 -60404 -6338 51622 55057 -183 -55275 -47093 9911
375I911M5192j3976o2077l9399K6047O0548L3206l2094o3724k1159M2100N8457
$$ 9911 55103 41127 -20950 -60349 -34302 26246 59452 27358 -36366 -57525 -15425 43032
387D3032J2722m9791n4494P8N1391M9059q964n7423l9314J7004N4633L6753k4929
$$ 43032 55754 5963 -48531 -48453 2938 51997 43033 -14390 -53704 -36700 17933 54686 29757
400B9757n7046k5012L1606N6683J8262m1153n3340r917M4387N1508k429n0092
$$ 29757 -27289 -52301 -20695 35988 54250 13097 -40243 -50160 -5773 45735 43306 -6786
412f786m1214Q494N3129L8062j9920n1741k8900K4999N2395K0485l0596n0065
$$ -6786 -48000 -39506 13623 51685 31765 -19976 -48876 -23877 28518 49003 18407 -31658
424c1658j7634L8723M9290L814m0995m4469R62M8424L9922j0830m7486l3514J9534
$$ -31658 -49292 -10569 38721 42535 1540 -42929 -41967 6457 46379 35549 -11937 -45451 -25917
437b5917M7161K4225k2800n0321k0771L3987M5964J0724l4363m4550l965M1637
$$ -25917 21244 45469 22669 -27652 -48423 -14436 31528 42252 7889 -36661 -40626 1011
449A011M0571l913m5735l4335J3915M3147K9294j8411m9004k0507K7006M1421
$$ 1011 41582 37669 -8066 -42401 -28486 14661 43955 25544 -23460 -43967 -16961 24460
461B4460J5014k8353m1419p988L3372M0324K243l8176l4802L023L7705L5026j2342
$$ 24460 39474 11121 -30298 -38286 -4914 35410 37653 -523 -35325 -32302 5403 40429 28087
474B8087m4981k4734J8992M2455K1045k4635m1963j3530L0251M1360L523l3835
$$ 28087 -16894 -41628 -22636 19819 40864 16229 -25734 -39264 -9013 32347 35870 2035
486B035l3658j502L6232L4329j0181l9114k5493J2841L9267K1898j8266l8509
$$ 2035 -31623 -33125 3107 37436 27255 -11859 -37352 -24511 14756 36654 18388 -20121
498b0121j6820K6268L7402O518k5882l4326o896L2879L2351m347l2009k7660O950
$$ -20121 -36941 -10673 26729 33247 7365 -26961 -33857 -978 31373 27026 -4983 -32643 -25693
511b5693L4124K4868r952l7847k1328K0625L5754J4215k1160l8636j0048L1326
$$ -25693 8431 33299 23347 -14500 -35828 -15203 20551 34766 13606 -25030 -35078 -3752
523c752L2481l19l1319k8515N053L2201K5941q490l5656j8657J6816K9648J6250
$$ -3752 28729 28410 -2909 -31424 -26371 5830 31771 23281 -12375 -31032 -14216 15432 31682
536C1682j7785l5260r906K4074K9550N096k5200k7403j753K6515K9667n033l2237
$$ 31682 13897 -21363 -31269 -7195 22355 27451 2251 -25152 -26905 -390 29277 24244 -7993
549g993j9605R894K9108K0200j5480l3344j2855J8588L0286Q210k1202k7710o240
$$ -7993 -27598 -17704 11404 31604 16124 -17220 -30075 -11487 18799 27009 5807 -21903 -28143
562b8143K6544L0596m964k8439k0838M871K8482K1050j2724l0168j4713J5458
$$ -28143 -1599 28997 24033 -4406 -25244 -20373 8109 29159 16435 -13733 -28446 -12988
574a2988K8614R495j6621k7514q420K4514K7040j445k2438k2738R74K6145K1284
$$ -12988 15626 25121 8500 -19014 -27434 -2920 24120 22675 237 -22501 -21527 4618 25902
587B5902p260k7753j8435J1739K6793J4185j3094k8602r861K2067K4349K984j8802
$$ 25902 18642 -9111 -27546 -15807 10986 25171 12077 -16525 -26386 -4319 20030 23014 4212
600D212k4612k435K3436K2449k937k6121j8962Q593K3949J6538j0586k7766j0020
$$ 4212 -20400 -22835 601 23050 20113 -6008 -24970 -16377 7572 24110 13524 -14242 -24262
613b4262J6978K3127Q248j7516k4792l276J9599K1453r69k2327j7151L541K1445
$$ -24262 -7284 15843 24091 6575 -18217 -21493 -1894 19559 18590 -3737 -20888 -17347 4098
626D098J8861q333k4950j1355J1164K2843J1369j4793k3766o787J7060K2434R37
$$ 4098 22959 14626 -10324 -21679 -10515 12328 23697 8904 -14862 -21649 -4589 17845 18782
639A8782j9573j8010j35K1799J8829p427k1191j2534P507K2346J1321j2168k1419
$$ 18782 -791 -18801 -18936 2863 21692 14265 -6926 -19460 -11953 10393 21714 9546 -11873
652a1873q468J4386J9705L415j4253j9476k554K0151J7932l227j8550j5787M933
$$ -11873 -20341 -5955 13750 17165 2912 -16564 -19118 1033 18965 15738 -2812 -18599 -13666
665a3666K0377J3841q223k2111j0828J3491J9878N352j3701k1267k290J9301J6632
$$ -13666 6711 20552 12329 -9782 -20610 -7119 12759 18111 4410 -16857 -19147 154 16786
678A6786n12j7228j5898L973J7999J3309o459k0334r939R846J7120R112j0510
$$ 16786 16274 -954 -16852 -12879 5120 18429 11970 -8364 -18303 -8457 8663 17775 7265
691G265k0312m918J4062J8227L773j6240j6969K39J6537J6774m988j9879j1726
$$ 7265 -13047 -17965 -3903 14324 18097 1857 -15112 -14873 1664 18438 13450 -6429 -18155
704a8155O780J8673J1001j0718j8333n823J1240J7714M684j3859j5513k231J4478
$$ -18155 -11375 7298 18299 7581 -10752 -16575 -5335 12379 17063 3204 -12309 -14540 -62
717f2J5798l199j6099j2266K655J7927J1855p102j6556r251Q607J7970N755j0920
$$ -62 15736 12537 -3562 -15828 -13173 4754 16609 9507 -7049 -16300 -7693 10277 16032 5112
731E112j5631m420J3345J5255p66j3539j4583J565J6713J1436m299j5108j0102
$$ 5112 -10519 -14939 -1594 13661 12895 -644 -15227 -13662 3051 14487 10188 -4920 -15022
744a5022P521J5677O746q692j6365m652J2357J3294K049j2007j4120O97J3472
$$ -15022 -7501 8176 14922 6230 -10135 -14787 -2430 10864 12913 906 -13214 -12517 955
757I55J1245j281j4232j0295N781J3783Q707p037j6243n273R444J3476M506j1662
$$ 955 12200 10919 -3313 -13608 -7827 5956 14663 7626 -8617 -13890 -4446 9030 13536 1874
771A874j3855o78J1902J2806r73j3782r402L619J3359R479o498j4726o349O513
$$ 1874 -11981 -12659 -757 12049 11076 -2706 -12108 -8489 4870 14349 7851 -6875 -13224 -6711
785f711J4224N233j0015j2282l064J0467J3158J03j1865j0387J244J3266J0580
$$ -6711 7513 12746 2731 -9551 -12615 -2148 11010 11113 -752 -11139 -9895 3371 13951
798A3951n236j3276q314M449J4389N704p512j1988n080R884J3419R47r668j1653
$$ 13951 8715 -4561 -12875 -8426 5963 11667 4155 -7833 -12913 -3029 10390 11337 1669 -9984
812i984q91J2708R840k344j1739r965L690J2939O433n050j2118o329R070J2227
$$ -9984 -10875 1833 11673 9329 -2410 -12375 -8685 4254 10687 5637 -6481 -12810 -3740 8487
826H487K930p755j2741j622J0535R809M85j1114j0451K669J1090P610l142j2187
$$ 8487 11417 3662 -9079 -10701 -166 9643 10128 -986 -11437 -8768 2322 9932 6790 -5397
840e397o333P163J1155N441p300j2451k158P780J0332J779j0246r320J070R376
$$ -5397 -11730 -4567 6588 12029 4729 -7722 -9880 -2100 8232 10011 -235 -9555 -8485 891
854H91R170k945j1193n779L620J1318O886p035j0763l620N994J0322K664r136
$$ 891 10061 7116 -4077 -9856 -6236 5082 11968 4933 -5830 -9450 -3456 6866 9530 394
868C94q954p84R558R433k105r760p250K392J1212O630n376r281n463N317J0462
$$ 394 -8560 -9344 214 9647 7542 -2218 -9468 -7076 4136 10766 5390 -3891 -9354 -4037 6425
883F425K159o948r076k321Q917R137q12p507q295R33J0514O287l256r082o546
$$ 6425 8584 1636 -7440 -9761 -844 8293 7481 -26 -8321 -7388 3126 9413 6157 -2925 -9471
898i471N084R543L474n827r842k466Q373P965J339o764r434J441Q454O352j597
$$ -9471 -4387 5156 8630 2803 -7039 -9505 -1132 6833 8172 1408 -8026 -6585 1869 8221 6624
913F624q842o447L729Q005N304m564j0078k644N864Q369L746p220q879L91P094
$$ 6624 -2218 -8665 -4936 3069 8373 3809 -6269 -8913 -3049 5320 9066 1846 -7033 -6642 452
928D52P429j079q880n816J882Q196O387m368q886l140M143Q420L952o410p974
$$ 452 7881 6802 -2078 -7894 -6012 2184 8571 4203 -4683 -7823 -3680 4740 8692 2282 -5692
943e692j100O340P703k75p380p103l3Q967O887m296p450m109L444Q672L344n002
$$ -5692 -6792 -452 7251 6976 -404 -7507 -7540 1427 8314 4018 -3432 -7541 -4097 4575 7919 2917
959B917p448k563N952P372K8n933p005m87Q066N167j544n930n471K258P895M315
$$ 2917 -4531 -7094 -1142 6230 6258 325 -6680 -7167 899 6066 4522 -1408 -6879 -4621 3274 7589
975G589l144q187l462N360O833K003n393q657m03P580N714l28o609o184K966P610
$$ 7589 4445 -3742 -7204 -1844 4989 6992 1599 -7058 -7461 119 5833 5505 -1104 -7288 -4322 3288
991C288M399l698p968k000L885N470L215m979p486J0M960N156J476n585n752R05
$$ 3288 7687 3989 -3979 -5979 -2094 3376 6591 1612 -5874 -5864 -904 4252 5728 143 -5609 -4704
1007d704O003N739k001p001l646J217P300M630n144p647j337M763O700R82n744
$$ -4704 1299 7038 5037 -1964 -5610 -4393 2907 7537 2393 -5254 -6591 -1828 4872 5854 110
1022A10n490M29O404N143k751m852m125K65P257L687m203n091k476K766O543K026
$$ 110 -5380 -4951 1453 6596 3845 -1007 -5132 -4867 2390 6077 1874 -3217 -5693 -2927 3616 5642
1038E642l636o157j796O536N086p45m606o455J191P114L049l208m487l290L145
$$ 5642 2006 -4151 -5947 589 5675 4930 324 -6131 -4940 2174 5223 2015 -2472 -5762 -2617
1053b617N402L086l385o868k48M786L821J015l960o193L67N530L762q02n558l662
$$ -2617 2785 5871 2486 -4382 -4630 156 3977 4992 1032 -5161 -4794 736 4498 3696 -1862 -5524
1069e524K203N737L676l407o225p65L528M529J974n060n655L80M676M362r93m881
$$ -5524 -3321 2416 6092 2685 -3540 -4305 -777 3752 5726 666 -4989 -4609 67 4429 3436 -1445
1085a445l171J112N412M020l136n045j799J798N263K440m578m759p61L682M936
$$ -1445 -4616 -3504 1908 5928 2792 -2253 -4052 -2254 3009 5449 871 -3888 -4649 -967 3969
1100C969J03m316m320O30N796L680k836l861k889J187N910J399l252m564j357
$$ 3969 4072 -244 -4564 -3934 1862 5542 2706 -1155 -4044 -2857 3053 4452 1200 -3364 -4721
1115d721L564M145M08k717m519k06N367L338j288l349m489J323N358K060k682
$$ -4721 -1157 2988 3396 679 -3840 -4046 1321 4659 3371 22 -4467 -3144 2214 4274 1592
1130A592m811k053L832M010J555l158n045Q16M303K508q1l520m162J271L965K963
$$ 1592 -3219 -5272 -1440 2570 4125 967 -4078 -3262 1041 3549 3468 -52 -4214 -2943 1022 3985
1146C985j617n002j671K332L845K561k973m726R5K853L713Q95m053m079Q93L764
$$ 3985 2368 -2634 -4305 -1973 1872 4433 1460 -3266 -3171 -318 3395 4290 237 -3842 -2949 815
1162H15L038j737m238j593R79M371L185l814l477n29K326L971L64l371l148p93
$$ 815 3853 2116 -2122 -3715 -2736 1635 4820 1006 -2471 -3000 -674 3297 3661 290 -2858 -3651
1178c651L581L572j489k974k630L38M883K435k290l102j964J808M564P20k798
$$ -3651 -70 3502 2013 -961 -3591 -3253 1630 4065 1775 -1327 -3291 -1483 3081 3801 1003
1193A003l907r81L875K726m68k668l377P99M334K129j208l163k206J622L682J229
$$ 1003 -2904 -3885 -10 2716 2248 -420 -3797 -2998 1336 3465 2257 -906 -3112 -1490 2192 3421
1209C421k249m044p77K917K969N19k705l763J195L619K264m79l574k486J743K904
$$ 3421 1172 -2872 -3649 -732 2237 2756 51 -3712 -2517 1102 3366 2887 -687 -3173 -1430 1474
1225A474J960j982m115p80K115L242J400l287k957N00K474L277l14l535k006O35
$$ 1474 3434 1452 -2663 -3443 -1328 1914 3314 27 -2930 -2430 44 3321 3007 -528 -2534 -1899
1241a899K989K438k347l121j128R95L689J453k933k451n38K660L387m51k679k491
$$ -1899 1090 3528 1181 -1940 -3068 -2073 1616 3069 136 -2315 -2853 -193 3194 2743 64 -2427
1257b427K50K726K432j712k552j833J008M067R64k021k450p93K432K588k4k263
$$ -2427 -2177 549 2981 1269 -1283 -3116 -2108 1959 2923 902 -1548 -2341 91 2679 2655 392
1273C92k760k28K998J596m48k320k540J656K895J231r64k831j179K436K254N23
$$ 392 -2368 -2596 402 1998 1550 -770 -3310 -1654 1241 2472 1508 -1323 -2502 -66 2188 2711
1289B711k099k830N4K115J906J44k892k215J260K450J806p27k935r17J596K063
$$ 2711 612 -2218 -2164 -49 1857 2001 -891 -3106 -1846 604 2410 1683 -1252 -2169 -573 1490
1305A490J450k341k645l45K100K044L29k665k120R90J881K763j260k403q95P27
$$ 1490 2940 599 -2046 -2391 -291 1753 2082 -583 -2703 -1713 168 2931 1671 -732 -1627 -900
1321i00K124J375j873k354p11J239K733J29j953j785j03K128K207l24j911j963
$$ -900 1224 2599 726 -1628 -2339 -1100 1633 1762 -191 -1976 -2079 49 2256 1932 21 -1942
1337a942N20K866J015j612j872j503J381K725L58j677j931n70K562J835l01j547
$$ -1942 -1422 1444 2459 847 -1025 -2528 -1147 1578 1936 259 -1672 -2242 320 2155 1854 307
1353C07k124O23K421P44q29j969k157J861K214N36o83k483m80J774J879M92j810
$$ 307 -1817 -1194 1227 1971 1142 -827 -2984 -1123 1091 1627 944 -1539 -2019 -245 1634 2126 316
1370C16k223N89J667J496n1k716j552J288J427J672r67k366k20J358J794Q39k151
$$ 316 -1907 -1318 349 1845 1794 -922 -2474 -1186 241 1913 946 -1420 -1640 -282 1512 2351 200
1387B00j882N91J284J448j59k365j040K85K123J558j355j658m22J064J761O56
$$ 200 -1682 -1091 193 1641 1482 -883 -1923 -1638 485 2043 688 -970 -1392 -328 1433 2089
1403B089j997j202l69J264J956n76j634j285J63K052J123r00q89j229O19K724
$$ 2089 92 -1110 -1479 -215 1741 1165 -469 -1754 -1591 461 1584 684 -205 -1434 -815 1909
1419A909J8j467j488p90J481J509j10j158j745L25K052P06k7r60k066J244J920
$$ 1909 1927 460 -1028 -1818 -337 1172 1062 -96 -1841 -1516 536 1242 1215 255 -1811 -567 1353
1436A353M61p38k281m91J175J641K77j435j869O56J692J045R5j863j354J112J418
$$ 1353 1814 1076 -1205 -1696 -521 1120 1397 -38 -1907 -1251 441 1486 1581 -282 -1636 -524 894
1453H94R46m38k172r16P63J477R08j715j311L75Q24J504P37j906j469O81J078
$$ 894 1840 1402 -770 -1686 -923 554 1462 -253 -1564 -1189 -365 1139 1876 -30 -1499 -818 260
1470B60J402n60j819n83M28J560Q59j877m96k82O00K115J9j679j188K97J034R70
$$ 260 1662 1102 -717 -1300 -872 688 1547 -330 -826 -1108 -508 1607 1626 -53 -1241 -944 90 1060
1488A060K45j590j461M74J838K57q35o81j065J337J950P1j179j378j99J481P25
$$ 1060 1305 -285 -1746 -1272 566 823 -12 -693 -1758 -421 1529 1600 421 -957 -1156 325 1050
1505A050k52j053j682J002J678l22J16j114r48J383J344K22p25j255k02Q15O18
$$ 1050 798 -255 -1937 -935 743 421 537 -577 -1525 -142 1202 1424 699 -556 -758 57 675
1522F75N29j491j533R71R91Q48q1j635l12O97J455M23r30j491L39N5R04N01j529
$$ 675 1204 -287 -1820 -849 142 990 909 -726 -1038 -341 1114 1537 607 -884 -545 -490 414 915 -614
1541f14p01M48N70J250J67j258j024P22J227L81n49j055n25j47J806K75j255r75
$$ -614 -1315 -867 -297 953 1120 -138 -1162 -440 787 1168 619 -436 -961 -1108 698 973 -282 -1257
1559a257k9Q70J904n17q63q19K15J206L56p17o34r40L26J579j90n79p86k97N66
$$ -1257 -1286 -416 1488 971 108 -711 -496 710 1066 349 -285 -1225 -899 680 490 -89 -875 -1172 -606
1578f06J417J04m40j463N98J109J15J11j112j428R54J216P8l98j230MO36J354
$$ -606 811 915 475 -988 -390 719 834 945 -167 -1595 -641 575 653 255 -975 -971 -335 1019
1596A019J63j124o59L08N83L16M44j449q86Q50M02L62r6p88j04J91J038O70j219
$$ 1019 1182 58 -601 -293 290 606 1050 -399 -1285 -435 -33 329 233 -555 -659 -468 570 1240 21
1615B1n44L51m1Q85L70j567n03Q3R06P98l97o73o35J96J844J10r03o14O0j00J153
$$ 21 -523 -172 -213 672 1042 -525 -1028 -945 -39 759 362 -311 -946 -750 1094 1204 301 -313 -253 -353 800
1636H00p2j213k67j97O82Q32j55p94m30J27J608J62l18q94o37N39Q21o4q81n51
$$ 800 728 -485 -752 -949 -267 565 410 -384 -814 -687 921 1083 765 -129 -766 -227 594 530 -351 -902
1656i02j12Q83Q41k49m75q46L38J189j48M79j000j005L92R42K18m52q72m95J220
$$ -902 -1014 -131 710 461 -14 -860 -522 667 519 998 -2 -1007 -615 327 545 93 -779 -1274 -54
1675e4K87Q76j187q34P50N71J54L16j255n06N92L55M13m36r61J97J08J247M26
$$ -54 233 1109 -78 -912 -162 409 563 879 -376 -882 -290 65 478 42 -919 -722 -614 633 1059
1694A059j026m20R6M28P68k71r17k57M02L67J75l02n99j69r5J402K10p05j28o13
$$ 1059 33 -387 -291 137 905 634 -283 -540 -138 229 404 102 -497 -666 -761 641 851 146 18 -595
1714e95O84Q51l46r80l24J8J005j60K7o05l02O56P43N7k84l29p70P38O10Ro11
$$ -595 89 940 594 -386 -710 -692 313 153 180 -425 -727 -71 672 729 445 116 -654 84 694 703 92
1735I2r98k57J292J59j1l87p32P62P46j67K3q52j52P10L08n1n86q34M02l6O23
$$ 92 -906 -1163 129 288 277 -110 -842 -80 666 499 522 -330 -482 228 536 485 -101 -935 -533 -569 54
1756E4N51p00q07N07L94Q58l71p16q1L62K44M27j072m86N04P1N44J13m91r4j54
$$ 54 605 -95 -902 -395 -1 857 486 -230 -311 51 295 722 -350 -836 -332 -261 283 396 -95 -189 -343
1777c43K13J065k89o19l84k33J093M09j316r2j88J09J104n5q73M07q4L32K56k56
$$ -343 -130 935 646 27 -357 -590 503 912 -404 -496 -684 -575 529 474 -399 8 -76 256 512 256
1797B56k24m79k18P44M03k00o76o35O76P98J52n58l60OQ40L27o29j54m69K15N20
$$ 256 32 -447 -665 79 482 282 -394 -1029 -353 445 597 39 -321 -315 525 852 223 69 -400 -185 335
1818C35l76J19m53l49O70j3O60K78j054j44K77N02J99o50o74O25j96M22J36p99
$$ 335 -41 78 -375 -724 -54 -67 593 871 -183 -327 -50 452 651 1 -673 -48 -244 178 314 -485
1838d85j17N24J16M52n0m92%l0K52N69j055l35R7K79P37k48o05k1N07K03N75o93
$$ -485 -602 -78 38 490 440 -52 -52 -82 170 739 -316 -651 -554 -275 462 214 -391 -412 95 298 873 180
1860A80k97O4P0M41k83j25l38m7k25R38J12m53k54l65J180K20n99l49l01K32P63
$$ 180 -117 -53 17 458 175 50 -288 -335 -560 378 490 37 -217 -582 598 818 219 -130 -431 -199 564
1881E64m87m80kk07L83N01j79P1m34k04N82L37J96n03p50M21O46j01l54o70J08
$$ 564 77 -403 -405 -612 -229 272 93 164 -270 -474 108 445 641 138 -612 -191 455 354 0 -670 -562
1902e62M56J99K15l81k57L2L00J00L28n18k27R9r2P84l07p33p7M45L47K77m58
$$ -562 -106 93 308 -73 -330 -298 2 102 430 -88 -315 -216 -308 476 169 -564 -641 -196 151 428 -30
1923c0j25O3M4N16J02j015K71R4l14P02k99k19j04n4N36K02k25j8m29K34O75j99
$$ -30 -155 -92 -48 468 570 -445 -174 -80 -394 308 9 -210 -314 -368 168 370 145 127 -302 -68 607 408
1945D08n70j68j35M41m2p7J8m3J4L95p4K56l02l80K91P67l92n89l29k84Q14k6
$$ 408 -162 -330 -465 -24 -66 -143 -125 -168 -154 241 167 423 121 -259 32 799 407 -182 -511 -795 19 -7
1967gJ43j66n32O48L39k80K74m05k50L71K64k92k72k16o3L57p0M64k67m76M64
$$ -7 136 -30 -562 86 425 145 419 14 -236 135 399 107 -165 -381 -444 -87 -157 307 40 -436 28
1988B8J93L04O4r85J02N58k01qr4k18M6q5M46N1k40k01j48J24Q44Q2p61Pk75M14
$$ 28 221 525 589 -396 -294 264 63 55 -39 -257 -211 -296 150 201 -39 -240 -388 -264 580 662 -99 -92 -367 47
2012D7N16m95k71p7NM15P5l94J65K10j19L90k14K5l19k59P01k07M0m95m32M84
$$ 47 563 68 -203 -280 -275 140 215 -179 -14 196 77 467 253 278 -41 -300 401 194 234 -261 -693 -209
2034b09O65k91k02L37o79N91M58n97n0j81k72L31j48M99k29p78P01J60mK16o46
$$ -209 456 165 -37 300 -379 212 670 73 23 -158 -430 -99 -247 252 23 -755 -54 106 102 318 -328
2055c28k5O64J54j6m36k19K21q5M4J07o4k90J70m2L16O03q41k78L41N03r1o68
$$ -328 -353 311 465 449 13 -206 15 -70 -26 81 17 -273 -103 -145 171 774 -67 -345 -4 499 408 -260
2077b60q9K24Q1M69m08p39N81J62o9N41l52j91K51q3Q3l16L43k6o49j69P61Q2
$$ -260 -349 -125 -44 425 17 -722 -141 21 -48 493 141 -50 201 118 201 -115 228 202 -447 -616 145 227
2099B27o71K90l62O41M95l57l56q1K85L20k32l82K40o06N73p2j52J21J74l87M28
$$ 227 -444 -154 -516 125 620 263 -93 -174 111 431 199 -183 57 -549 24 -48 -200 -79 95 -292 136
2120A36%K58j90m64L80j90J39K65n35n37N90K04k70L55l62J10l2L84M9k49j46
$$ 136 136 394 204 -260 120 -70 69 334 -201 -738 -148 56 -214 141 -221 -111 -143 241 290 41 -105
2141a05n0l1J59K49q48J19L53j35K77J06l14L14k01J47K20k94L75k83j81L41j49
$$ -105 -155 -186 -27 222 -626 -507 -154 -289 -12 94 -220 94 -107 40 260 -34 341 58 -123 218 69
2162F9k03m41P1N06K09k80k92J43J27N22j47o35P96m28J62o2n01M67m76L2L08
$$ 69 -134 -575 -504 2 211 -69 -361 -218 -91 431 284 -351 445 17 179 117 -384 83 -393 -361 -53
2183e3M34o29M58m34K35N71m07j2k94n97P35L50n59J09k63L4N02k9N8j16j58J16
$$ -53 381 -248 210 -224 11 582 175 163 -131 -728 7 357 -202 -93 -356 -322 180 151 209 93 -65 51
2205E1J13k21L24o20l1L71k6O2No21M55K2N0M43l25j45J32L52M9k82k04K5k66
$$ 51 164 -57 267 -353 -384 -13 -39 23 28 -593 -138 -116 -66 377 52 -93 39 391 440 158 -46 -21 -287
2228b87K00K53l26J50o1R0K50n7k18J89J2m20O04k47k67Q2l57L09L34o36K75Q9
$$ -287 -87 166 -160 -10 -71 19 269 212 -6 183 195 -225 379 132 -135 -53 -410 -101 233 -403 -128 -39
2250c9J47L03k3k23r6j88K44J59n18K8M4j7J52l6L66l21m19N98L0NJ75k57m1J51
$$ -39 108 411 388 165 69 -119 125 284 -234 -206 -162 -179 -27 -63 303 -18 -437 161 191 196 371 114 73 224
2274B24m8k38K4l86J52J68J40O7j26p8M90q9p7qk51Q5j31J66j48P3j61J01j50
$$ 224 176 -62 -38 -424 -272 -104 36 103 -23 -101 389 300 223 215 -36 49 -82 84 -64 9 -152 -51 -201
2297b01J71J50j07O7J50j27K03l53l31J81R2k45L95l63J46J57m9K86k36m6K76
$$ -201 -30 120 13 80 230 103 306 -47 -378 -197 -105 -350 45 -318 -172 -15 -64 222 -14 -60 216
2318B16j62J20J06m77K85m31K40j35J19J0Rj06K5N77m41J3K54k89N45l71l05J75
$$ 216 54 174 280 -197 88 -343 -103 -238 -119 -109 -100 -206 -181 396 -45 -32 222 -67 478 107 -198 -23
2340b3l68K81l6n3L97r6l56K79K14k03L87l10k20K79p6Lj24k67M61j89M1k04Q3
$$ -23 -391 -110 -146 -199 198 102 -254 25 239 36 423 113 -107 172 96 99 -25 -292 169 -20 21 -183 -100
2363a00j36K92J75J71l05k92M42n4k5Mm92K55O7M2M1j5k84O06m87O6L23q0k74
$$ -100 -236 56 231 402 97 -195 247 193 168 172 -320 -65 2 44 85 70 -214 392 -95 -29 294 214 -60
2386f0M9j8K77l91j29J96j24N4K01k14P2j42L18k1R9j78L65m52M4k2r9K71k44
$$ -60 -11 -29 248 -143 -272 -76 -200 -146 55 -159 -87 -229 89 68 167 -11 354 -98 -54 -76 -175 96 -148
2409a48PJ03J14k65M05l01P7L47j06l0l58o7L46k34l9L16l08k29K67L8K11O0k58
$$ -148 -141 -38 76 -189 216 -85 -8 339 233 203 -155 -222 124 -110 -149 167 -141 -370 -103 -65 146 206 -52
2432e2J38j28R7J90k09j48J32K5j95J60m17K68N3J85K37l51K44J21j96K0r0l6
$$ -52 86 -42 55 245 36 -112 20 45 -150 10 -407 -139 -86 99 336 -15 229 350 154 174 84 48
2454D8q6j43j21P29l66l12k6J86K33J43l09K62l6nK12l30l26M1J78o6L9j12L4
$$ 48 -38 -181 -302 427 61 -251 -277 -91 142 285 -24 238 202 197 409 79 -247 -206 -28 -94 -55 -167 -133
2477a33k79L11K93m17J03K64l15L31N5o79N89j46k90J66J94M9k51J85o7j7L26
$$ -133 -412 -101 192 -225 -122 142 -173 158 213 -466 123 -23 -313 -147 47 96 -155 30 -37 -54 272
2498B72n2j04l62M71j09k95K47l51K93n8M5j11K44k0L2j47J70j4k12J21K14m07
$$ 272 220 116 -246 225 116 -179 68 -283 10 -48 -3 -114 130 110 142 -5 165 151 -61 60 274 -133
2520a33R4j04k24J41K13J8j22j02K91J87k56K45j24k79J37J12k48q7P6J17r0k4
$$ -133 -39 -143 -367 -226 -13 5 -117 -219 72 259 3 248 124 -155 -18 94 -154 -241 -165 -48 -138 -162
2542a62P1Q3l51O52j48k19M16k37j10J97k64K1R9r6k04J23K59l1j85K61l7q3L86
$$ -162 -91 -8 -359 293 145 -74 342 105 -5 192 -72 -51 48 -48 -252 -129 130 99 -86 175 138 55 441
2565D41j42m38K20k33J13J7k28J19J1l20O44l65mM51m23j5N08k73k17J91rj05
$$ 441 299 -139 81 -152 -39 -22 -250 -131 -120 -440 204 -161 -165 286 -137 -152 356 83 -134 57 48 -57
2587e7M0j96M02n58L26q5J34J99m2k39L41J4l22N3j03J07k73J33K13l29q8K65
$$ -57 -17 -213 189 -369 -43 -128 6 205 163 -76 265 279 -43 10 -93 14 -259 -126 87 -242 -330 -65
2609f5J05l11N23k64K05m3P2o3J1k82K4j30J05K85m96M27Ml57L40J48k30O6l62
$$ -65 40 -271 252 -12 193 150 222 159 170 -112 -88 -218 -113 172 -324 103 107 -250 90 238 8 74 -288
2632b88M13J47n68J35L75n41L72J26k69N9j40N5K86K20l82K83k68k42N40k83J02
$$ -288 125 272 -296 -161 214 -327 45 171 -98 -39 -179 -124 162 382 0 283 15 -227 313 30 132
2653A32l59q1K54j76QL76r2r3J60J4k52M55l96L20l31j30K59l99N14l51k06L26
$$ 132 -227 -308 -54 -230 -222 154 62 -31 129 143 -109 346 -50 270 -61 -191 68 -331 183 -168 -374 -48
2675d8jrK35l16N57l56k6L0J49m72L05Q9l64J50k90P5O11k48qJ39k15J6L49p3
$$ -48 -49 -58 177 -139 418 62 36 66 215 -257 48 137 -227 -77 -367 -292 319 71 63 202 -13 3 352 279
2699B79l76j04j12L71n94K97J65k4J03j19Q1O6q4K53k7r8l9Lj77K62k31j94L61
$$ 279 -97 -201 -313 58 -536 -239 -74 -98 5 -114 -33 33 -51 202 175 77 38 41 -136 126 -105 -299 62
2722F2k01J30K05r0R2m5l12J13L18m65J37O2K0j43j77J83k45L06K56k34k66L52
$$ 62 -139 -9 196 106 198 153 -159 -46 272 -193 -56 6 26 -117 -294 -111 -356 -50 206 -28 -294 58
2744E8l8K56j74k47K56K7k07j52L39l17K4JM2J15O7K3j23p9L81L2m32K39j41k94
$$ 58 20 276 102 -145 111 138 -69 -221 118 -199 -175 -174 -132 -17 50 73 -50 -129 252 284 -148 91 -50 -344
2768c44J60j21R6M41k68R7j13J99J4j00J33k95J15J24k3k23J95j08k94L18lJ08
$$ -344 -184 -305 -209 232 -36 61 -52 147 161 61 194 -101 14 138 115 -108 87 -21 -315 3 0 108
2790A08j08K08j29K06k54K1J07k93J37j71j37K58l45M03j99K19J08l08K98J09
$$ 108 0 208 79 285 31 52 159 -134 3 -168 -305 -47 -392 11 -188 31 139 -169 129 238
2810B38k83J01K01m25L55k90o7j43K50L3J55j17K17k82j30L84k09k86N42o72O11
$$ 238 -45 56 257 -168 187 -103 -170 -313 -63 -30 125 8 225 -57 -187 197 -12 -298 244 -428 183
2831A83Oq8J99l87j26P1L58l27K48p8j14K80j19K6L1l59J76L7j32K14m21J37K08
$$ 183 189 101 300 -87 -213 -142 216 -111 137 59 -55 225 106 132 163 -196 -20 17 -115 99 -322 -185 23
2854B3j52J28J95j34j83K56k36M26k77j36J49l23K20K00k36J74j13q5M14r5l68
$$ 23 -129 -1 194 60 -123 133 -103 323 46 -90 59 -264 -44 156 -80 94 -19 -104 310 215 -153
2875a53K63J22O0k75o7J0P3k92j1R9R4l1q5K22P8J37j9l32q3K67k0q5J89k41n0
$$ -153 110 232 292 17 -50 -40 33 -259 -270 -171 -77 -108 -193 29 107 244 225 -107 -190 77 57 -28 161 -80 -130
2900a30j27O0J21K58l38R7j18N7L38j66k2K29l76J70L6l21J55k11K10K69k22M8
$$ -130 -257 -197 -76 182 -156 -59 -177 -120 218 52 30 259 -117 53 89 -232 -77 -288 -78 191 -31 17
2922A7K74l50K98k27R2P2j44l6n1j41K60j70l1J97j41j19L21Q5q4j4p0P3N6J46
$$ 17 291 -59 239 12 104 176 32 -4 -55 -196 64 -106 -137 60 -81 -200 121 206 122 108 38 111 167 313
2946C13m36J67k35L01j47n0O1j9J19l07J46J65J10o0j8K83m35J72k89J13J47k34
$$ 313 -123 44 -191 110 -37 -87 -26 -45 74 -233 -87 78 188 128 110 393 -42 130 -159 -46 101 -133
2968a33R7N1j16L13k58J93J92o86N31q2k51K89k77j78L47k75K06k3J20k24K46
$$ -133 -36 15 -101 212 -46 147 339 -347 184 102 -149 140 -137 -315 32 -243 -37 -60 60 -164 82
2989H2qO2o4k8j10L87k97J23r3l57K66j5N5j10k5K36L3r5K71j99l0J98k66k02
$$ 82 74 136 72 44 -66 321 24 147 54 -303 -37 -52 3 -107 -132 104 137 42 313 114 84 282 16 -186
3013a86J18j54L04R3j62j05l1L44O9k51K14l32K03L26m95k8J43k37J97K1k4r5
$$ -186 -68 -222 82 175 13 -92 -123 221 290 39 253 -79 124 450 -45 -73 70 -167 30 51 27 -68
3035f8l3K9L89k95J36J03n31L57j19k06J75Q4j73J25P4O8J25k60J04M37p48K20
$$ -68 -101 -72 317 22 158 261 -270 87 -32 -238 -63 21 -152 -27 47 115 240 -20 84 521 -227 -7
3057gJ52k53L85k50j66K01k26o0K53k47J94k87J65N50m48J11J22k57K03l28J22
$$ -7 145 -108 277 27 -139 62 -164 -224 29 -218 -24 -311 -146 404 -44 67 189 -68 135 -193 -71
3078g1M4n7N6n3J56J32j13j27%N17n04J27L1k12L6k9j44K04K4k04J89l97K81o
$$ -71 -27 -84 -28 -81 75 207 94 -33 -33 484 -20 107 138 -74 -38 -67 -211 -7 17 -187 2 -395 -114 -120
3102a20J48J15k27rJ49O9k24n8k3L86K12m47M1j09M4J05J39l30K28j18J03p9p4
$$ -120 28 143 -84 -93 56 125 -99 -157 -180 206 418 -29 12 -97 -53 52 191 -139 89 -29 74 -5 -79
3125g9J37r2Q0J52k65O5p5q1L92k91k98N18j9k57P7j7K41J08l61o2P9j02O9o0
$$ -79 58 -34 46 198 -67 -2 -77 -158 234 -57 -355 163 144 -113 -36 -53 188 296 -65 -127 -48 -150 -81 -141
3149a41J02R5r8J96J01l40R1P6l54J78J84k42Q1j36M9K43j48J21nj07L46j27m54
$$ -141 -39 56 -42 154 255 -85 6 82 -272 -94 90 -152 -71 -207 -158 85 -63 58 53 -54 292 165 -289
3172b89K92j05J81P2k70k8K77k43K31j37j33K08K90m66K96O6l29r2N8K88J35m77
$$ -289 3 -102 79 151 -119 -147 130 -113 118 -19 -152 56 346 -120 176 242 -87 -179 -121 167 302 -175
3194a75k86L52k45O32j71r6Q9pK71n37L85K96p92K38J63l23P6J68j52J31n7j22
$$ -175 -461 -109 -354 278 107 11 100 93 364 -173 212 508 -284 -46 117 -206 -130 38 -114 17 -40 -162
3216a62M39k97O9L57k86m3O2k10L80k31j99K60l57L23L06n47J19R0q6Q0R2j53
$$ -162 277 -20 49 406 120 77 139 -71 309 78 -121 139 -218 105 411 -136 -17 73 -13 67 159 6
3238FK9J6k5j40j47L87k88j05K39l70K71P5J90pj25K21k25r5N4J98r0M8j78J1
$$ 6 35 51 26 -114 -261 126 -162 -267 -28 -398 -127 -52 138 131 6 227 2 -93 -39 159 69 117 -61 -50
3262e0m3qK44l27L59k26L41n7n7k4k25J57q2J5j07N2k67K25L05l97J98k6l0J59
$$ -50 -93 -101 143 -184 175 -51 290 233 176 152 -73 84 2 17 -90 -38 -305 -80 225 -172 26 0 -30 129
3286A29k68L39K6m00K23Pj06m1J22M9K6J66m00K64l9NL9k91K65l18K4K09q7j11
$$ 129 -139 200 226 -174 49 56 -50 -91 31 80 106 272 -128 136 97 102 141 -150 115 -203 -179 30 -57 -168
3310a68L53m39K15J48j68J34k2l5J62j88nj41O7L34k20q5J13k63NK86j50o3L51
$$ -168 185 -254 -39 109 -59 75 53 18 180 -8 -13 -154 -87 247 27 -58 55 -208 -203 83 -67 -130 221
3333B21j92K02j74n8J93o1k15K00k42K2L2m6L4j3J06J91j42L04k28j92M7p4mJ68
$$ 221 29 231 57 -1 192 131 -84 116 -126 -104 -72 -118 -84 -97 9 200 58 362 134 -58 -11 -85 -89 79
3357G9k76O4K19k04K21k54k76L80L06m0L2k26j00J70J1q9r4j49J35l8m0J88k39
$$ 79 -197 -133 86 -118 103 -151 -427 -47 259 219 251 25 -75 95 106 17 -77 -226 -91 -129 -169 19 -220
3380b20L42j4j56p9L43j20J29l80QK82m82M06L1j74J41j06j27R7L03j78J1k08
$$ -220 122 108 -48 -127 216 96 225 -155 -147 135 -347 59 90 -84 57 -49 -176 -79 224 46 57 -151
3402a51r1K99R9k18L04j28j54R6l05K25j69L43J37j58r9J49k79K88jk65Km7L26
$$ -151 -242 57 156 -62 242 114 -40 56 -249 -24 -193 150 287 129 30 179 -100 188 187 -78 -76 -123 203
3425B03k09k18K5N7K4J21K83l04J64j25k25N15k52m02K28j25J53J29m0J42k70
$$ 203 -6 -224 -199 -142 -118 3 286 -18 146 21 -204 311 59 -343 -115 -240 -87 42 2 144 -126
3446a26K20J7O5q0K61n26L31l01J56J04k60J30O0j32K1O5j03L17k67K22k12J22
$$ -126 94 111 176 96 357 -169 162 -139 17 121 -139 -9 51 -81 -60 5 -98 219 -48 174 -38 84
3468H4m3N1k50K97l73J67L7j4j12K27p4j07R3l1J69rm5Q9m5l30L01N8j44L10m41
$$ 84 41 92 -158 139 -234 -67 -30 -44 -156 71 -3 -110 -17 -48 121 112 67 156 111 -219 82 140 -4 306 -135
3493a35p1J92M5m8O3k23J64K84p4j75Q5O3j24j37J61l5K1K22j40l06M60l89K10
$$ -135 -206 -14 31 -17 46 -177 -13 271 197 22 107 170 46 -91 70 35 56 278 138 -168 292 -97 113
3516A13j00j18L16n3M1L7l27J19j4n2Q1l6J03m66M15J8jJ4j69J03l14M16l10J9
$$ 113 13 -105 211 158 199 236 -91 28 14 -38 43 7 110 -356 59 77 76 90 -79 24 -290 126 -184 -165
3540a65J0j48O26p6Jk25K0J90Lk93L8Q8Q4m70J86k44M84nk08k0Q0p0j25N78o29
$$ -165 -155 -303 323 247 248 23 43 233 236 -57 -19 69 153 -317 -131 -375 109 104 -104 -124 -44 -114 -239 339 -290
3565b90M49l42p5K26k40J26M03k43o8j11K25m7k25J22J56j19J87K6k32K60l03
$$ -290 159 -183 -258 -32 -272 -146 257 14 -54 -165 60 13 -212 -90 66 -53 134 160 -72 188 -115
3586a15%r7J15J92M7k74R6J30p9J11r2O1m4j47J95J68l08r7K18q3m2k65K41j2
$$ -115 -115 -212 -97 95 142 -132 -36 94 15 126 34 95 51 -96 99 267 -41 -138 80 -3 -45 -310 -69 -81
3610h1P5J19j16J52k0P5l23l47O31l69J69Pl8k35J3K06J18pj42K22k25K31j53
$$ -81 -6 113 -3 149 129 204 -119 -466 165 -204 -35 -28 -66 -301 -288 -82 36 29 -113 109 -116 115 -38
3633c8j37K2j9J15k09q8M46l46L42p8J39r8k04J28q6J58j02k17K92j79n4K47o
$$ -38 -175 -153 -172 -57 -266 -354 92 -254 88 10 149 51 -153 -25 -111 47 -55 -272 20 -159 -213 34 28
3656B8j50Q0Rj04K00k2J0j4P4J3O0k87J35J08k38J03P5K35l14RJ09k3j0j02J17
$$ 28 -122 -42 -33 -137 63 41 51 37 111 124 184 -103 32 140 -98 5 80 315 1 10 119 96 86 -16 101
3681A01j46m1r8L5p9oj5j11N15l40J23K40j85L02j84l01L77j43o3J11j4l30M09
$$ 101 -45 -86 -184 -149 -228 -234 -249 -360 155 -185 -62 178 -7 295 111 -190 187 44 -19 92 78 -252 157
3704A57q0J54j34k58M14j20k80K39r5J55l90Q0k3K74k65K73n8k98K48J10k09P7
$$ 157 77 231 97 -161 253 133 -147 92 -3 152 -238 -158 -181 93 -172 101 43 -255 -7 103 -106 -29
3726b9j89K32K3r3L54k46J69n49M63p4O6l14R6j33K24%J0n6j5L8l6N0k7J6j3k16
$$ -29 -218 14 37 -56 298 52 221 -328 135 61 127 -187 -91 -224 0 0 10 -46 -61 -23 -59 -9 -36 -20 -33 -249
3752b49K81j37K10J0l72K84P6J81j33n4l96N25k94K14k16J10q8k74K99k6Q8l01
$$ -249 32 -105 105 115 -257 27 103 284 151 97 -299 226 -68 146 -70 40 -48 -322 -23 -49 39 -262
3774b62M32l19J67O6k65K85j30j48L14k86J72K2l63M17J0j8J82k31j19N8J43k72
$$ -262 170 -149 18 84 -181 104 -26 -174 140 -146 26 48 -315 102 112 94 276 45 -74 -16 127 -145
3796a45J13k0N4J25k08L8q8J16J65m53M17k3j79j55K68r4j41%K08Q8k34j58Q7
$$ -145 -32 -52 2 127 -81 -43 -131 -15 150 -303 114 91 -88 -243 25 -69 -210 -210 -2 86 -148 -306 -219
3819b19J38j56K63n8PK03k21o8J89R8j17j55J09j82L11m48K41J37k23J75l17L46
$$ -219 -81 -237 26 -32 -25 178 -43 -111 78 176 59 -96 13 -169 142 -306 -65 72 -151 24 -293 53
3841E3Lj2j86pK97k53RJ21k00J18K28m15L25J55l02P3J58N5k51J88l29K41j27
$$ 53 56 44 -142 -149 148 -105 -96 25 -175 -57 171 -244 81 236 -66 7 165 220 -31 157 -172 69 -58
3864e8J47K5l23K54j14m9J02j6J83N0j32j8K66k07j46j08J8J78p0j07Q3m2O0K11
$$ -58 89 114 -209 45 -69 -118 -16 -32 151 201 69 51 317 110 -36 -144 -126 52 -18 -125 -42 -84 -24 187
3888A87k60j87M20k63mN0k52J47M5MK08j26j3P5K36n43N1M28J47n65J45L94k67
$$ 187 -73 -260 160 -103 -107 -57 -309 -162 -117 -113 95 -31 -44 31 267 -276 -225 203 350 -215 -70 324 57
3911E7r3l7m2K63k63L7l8K31l49K66k1j22L68m26L17J79l73J89j39j66J25%o7
$$ 57 -36 -73 -115 148 -115 -78 -116 115 -234 32 11 -111 257 -169 148 327 -46 143 4 -162 -37 -37 -104
3934a04o0k8J67P1j09n4K61j77K99l82jrj2P8N1J30l22J52J28k26N0K78j08o3
$$ -104 -164 -192 -25 46 -63 -117 144 -33 266 -116 -117 -126 -138 -60 -9 121 -201 -49 79 -147 -97 181 73 10
3958A0Q2n9q0r1N6K48p4r5qk60K35j8K86j45K2Nj93K62%k54R5m9J32l64K92o0
$$ 10 92 33 -47 -138 -82 166 92 -3 -11 -271 -36 -54 232 87 109 114 -79 183 183 -71 24 -25 107 -257 35 -25
3984b5j7N4K08k34k34jK35o8K12k06K77k91K87l19J51M6j33j09M2J0l9K07k28
$$ -25 -42 12 220 -14 -248 -249 -14 -82 130 -76 201 -90 197 -122 29 75 -58 -167 -125 -115 -154 53 -175
4007a75K63j79K66j32j7L1l15R0L0L98l57N2J30k99M33L2l74M10j20j36mj37J52
$$ -175 88 -91 175 43 26 57 -258 -168 -138 260 -97 -45 85 -214 219 251 -123 287 167 31 27 -110 42
4030D2l3k95M16k82k4L71j25l0N0n8J01k84l14N52q6j11J94qRj19o5P6k08M58
$$ 42 9 -286 130 -152 -176 195 70 40 90 32 133 -151 -465 87 1 -110 84 76 85 -34 -99 -23 -231 227
4054B27k23K7k29N02k65j25n8m2OL11J01l34K0r9M8K39l1J20l15M7j22J72K81
$$ 227 4 31 -198 304 39 -86 -144 -186 -180 131 232 -102 -82 -181 -133 106 75 195 -120 -73 -195 -23 258
4077B58k08k40L55k69M48k84k32J45J08K19k1j47k77L46k21J10K27m43K66Q0k77
$$ 258 50 -190 165 -104 344 60 -172 -27 81 300 279 132 -145 201 -20 90 317 -126 140 220 -57
4098e7rJ21j12J75j1qJ46k69K41M6m40L46j05O5l58K21k28L58Q4k49K91m14K03
$$ -57 -66 55 -57 118 107 99 245 -24 217 263 -177 169 64 129 -229 -8 -236 122 206 -43 248 -166 37
4121C7K06l55K99r0j01k8n1m3J53o2lj33L60r0j82J10Q8k05RK64k30K14Nm37K96
$$ 37 243 -112 187 97 -4 -32 -83 -126 27 -35 -38 -171 189 99 -83 27 115 -90 -81 183 -47 167 172 -265 31
4146C1k00j3J99L5q0J65J14l5k03l22J99K30r9L9o6J95k23j83J23p7J93N9l51
$$ 31 -169 -182 17 52 -28 137 251 216 13 -309 -110 120 21 60 -6 189 -34 -217 -94 -171 22 81 -270
4169b70K97K64m73L75Q3l10k07J22J76M2l74M59k52K86k49R3q9j4R1j68K29j97
$$ -270 27 291 -182 193 276 -34 -241 -119 57 99 -275 184 -68 218 -31 62 -27 -41 50 -118 111 -86
4191h6J12j17N4p1k1J59j14j66J84K38k29j46L10j94R7L01l90j08O5J29j28K8
$$ -86 26 -91 -37 -108 -129 30 -84 -250 -66 172 -57 -203 107 -87 10 311 -79 -187 -122 7 -121 -93
4213i3K58Q1j06m09M79j07O5j62p6L4j47L7j52N14q6K0m68J03J75K16j51qr2K01
$$ -93 165 246 140 -269 210 103 168 6 -70 -36 -183 -146 -298 216 130 150 -318 -215 -40 176 25 17 -75 126
4237A26n4p2N7k92Q5P1M8k2J64l60J88J25j89J16K82l26L5o6J23j13L7k4RJ08
$$ 126 72 0 57 -235 -150 -79 -31 -53 111 -249 -61 64 -125 -9 273 -53 -18 -84 39 -74 -37 -61 -52 56
4261E6k67L53P4l79K18o3L30j88l93M79p6J62m02o6L07k50K44k23q8J9J87o8Q8
$$ 56 -211 142 216 -163 55 -8 322 134 -259 220 144 306 -96 -162 145 -105 139 -84 -172 -153 34 -34 54
4284E4j40j19K78O1j44J24j2M7j13J8k52R0%K11j37M6R8j3K16k48n0k10M1K48
$$ 54 -86 -205 73 134 -10 114 102 149 36 54 -198 -108 -108 103 -34 12 110 97 313 65 15 -195 -154 94
4308I4k41J12K58l87L83j07j77L9L13l06J7J36n42N25j69j89K21L0K4k60K4L05
$$ 94 -147 -35 223 -164 219 112 -65 -26 287 -19 -2 134 -408 117 -52 -241 -20 10 34 -226 -202 103
4330A03k01rK21j00P5k1l74J55J76p4j42K12l9o2oj6K42j20M7l48L73j91K82j82
$$ 103 -98 -107 114 14 89 68 -306 -151 25 -49 -191 21 -18 -80 -86 -102 140 20 67 -281 92 -99 183 1
4354AN1Oj63R8j45Jk34K08J42L40l55L02l68J6j27M9K82j30J01j93K71o9j83j7
$$ 1 52 58 -105 -7 -152 -151 -385 -177 -35 305 -50 252 -116 -100 -227 -178 104 -26 75 -118 153 84 -99 -116
4378a16Q9r3P8nmR1k32M11m36K57k81K23j08q4L38J31l67jj39p5N47J53l04k31
$$ -116 -27 -120 -42 -47 -51 40 -192 219 -217 40 -241 -18 -126 -210 128 259 -108 -109 -248 -323 224 377 73 -158
4402a58N5P8L5m42M74j72n8L50j56n4K14k50Q9n7Kp2R0p8K17l70K21Rl26L67J31
$$ -158 -103 -25 10 -432 42 -130 -188 162 6 -48 166 -84 5 -52 -50 -122 -32 -110 107 -263 -42 -33 -359 8 139
4427A39j24J12k33K15j82M8K50l05k43J35L37l54K23J12p2K05n46L77j83J45l9
$$ 139 15 127 -106 109 -73 -25 225 -80 -323 -188 149 -205 18 130 58 263 -283 94 -89 56 17
4448A7k24J44J88j17m4J63l58K40J44p1m2J48n91L27pL7J24pj37M7Q6Jr1J82r4
$$ 17 -207 -63 125 8 -36 127 -231 9 153 82 40 188 -403 -76 -83 -46 78 71 -66 -19 67 68 -23 159 65
4473F5L4j29o6Q0m3N9l9O5o4J51q2k12J63Q3k80L02r3p0K0R6k11K10j1j24K01
$$ 65 99 -30 -96 -16 -59 0 -39 26 -38 113 31 -181 -18 65 -215 87 -6 -76 -56 40 -171 39 28 -96 105
4498A05M4j89l6j33J59J66J89l82J37R8j9j78J48Ok86j09L33k2j52K25l06N9O0
$$ 105 149 -40 -76 -209 -50 116 305 -77 60 158 139 -39 109 115 -171 -280 53 31 -121 104 -202 -143 -83
4521h3j1r1M0J79J16k86M79k29k65pK78j02j31K22r0J33m47N57m60J98K3P2m1
$$ -83 -94 -185 -145 34 150 -136 343 114 -151 -158 120 18 -113 109 19 152 -295 262 -198 0 23 95 54
4544E4n0J03j45J55l26J26NJ70j31k45K27N3J09k55L79k82j9J24K04m5k75qJ39
$$ 54 4 107 -38 117 -209 -83 -78 92 -39 -284 -57 -4 105 -150 229 -53 -72 52 256 211 -64 -72 67
4567F7J79j79j58K63n5j94J28J87j41L02o46M98k09k17N23k75r0J5m4R1q0K18
$$ 67 246 67 -91 172 117 -77 51 238 97 399 -247 251 42 -175 348 73 -17 -2 -46 45 -35 183
4589A83j48J20k76R7J67j36L7j83K08Pm9j26J12q3k90L35O4m60L46m5J92k70J55
$$ 183 35 155 -121 -24 143 7 44 -139 69 76 27 -99 13 -70 -360 -25 39 -421 -75 -120 72 -198 -43
4612d3K7j22O3J41Qj27K9j79R6J37q1l3N31l28n40N29j33K98n22K67J9j84n8K37
$$ -43 -16 -138 -75 66 74 -53 -24 -203 -107 30 -51 -84 447 119 -421 108 -25 273 -249 18 37 -147 -205 32
4636C2j27r7K31k62M34k82K97j69O8J1J0k40j42P3M4J43n1J2j16J27R2r6R9k57
$$ 32 -95 -192 39 -223 211 -71 226 57 125 136 146 -94 -236 -163 -119 24 -27 -15 -131 -4 88 -8 91 -166
4660a66kj4K52K5j58Q5n3J22l03R6P3k2j42R4M5J04m4K25k59J96j3j58K6O1Lp6
$$ -166 -168 -182 70 95 -63 22 -31 91 -212 -116 -43 -65 -207 -113 -68 36 -8 217 -42 154 141 -17 9 70 73 -3
4686cJ03j59J3p1o6K76O2k85j74L34O4j78L5j86L44p0l6j20j43q5J61L36k96J35
$$ -3 100 -59 -46 -117 -183 93 155 -130 -304 30 94 -84 -49 -235 109 39 3 -117 -260 -345 -184 152 -144 -9
4710ip4J18k4ppJ94j82l5j0j00j01k9M7M01nj07J35j71kj88L90l11J32k93k26
$$ -9 -83 35 11 4 -3 191 9 -26 -36 -136 -237 -266 -219 182 177 70 205 34 32 -156 234 -77 55 -238 -464
4735d64J61J51R5N9R2j26r4J50P6j76J15p0Q9P4j02j43J34j35k04M05k35j1J99
$$ -464 -303 -152 -57 2 94 -32 -126 24 100 -76 39 -31 58 132 30 -113 21 -114 -318 87 -148 -159 40
4758D0qL0k64M11k11Lj00P0j25O6J81j08k6K97n1k28J48j38n5O7r7j41M59l12
$$ 40 32 62 -202 209 -2 1 -99 -29 -154 -88 93 -15 -41 256 205 -23 125 -13 -68 -1 -98 -239 220 -92
4782i2J47N6k82J66K19m47R9M30l13J69lk79J97J52j93q7P1k1K02m15K12j14J44
$$ -92 55 111 -171 -5 214 -233 -134 296 -17 152 149 -130 67 219 26 -61 10 -11 191 -224 -12 -126 18
4805A8K19k42Q3q2o6J0M4j76J72R6j49J53j87J85Q7j9m20J52J60JL1j09n2nP3
$$ 18 237 -5 78 -4 -70 -60 -16 -192 -20 76 -73 80 -107 78 165 146 -274 -122 38 39 70 -39 -91 -96 -23
4830b3%r9OK00l71J68K16J95j49j66J31l6l05K28J4k47K07r7J63j06J4J1N3L8
$$ -23 -23 -122 -116 84 -287 -119 97 292 143 -23 108 72 -233 -5 9 -238 -31 -128 35 -71 -57 -46 7 45
4854D5k9Q5k9nm2r0K09m2J9l9L9j21J04j91m2J67j66N6K09k49P7P5j42J22N2R1
$$ 45 16 101 72 67 25 -65 144 102 121 82 121 0 104 -87 -129 38 -128 -72 137 -112 -35 40 -102 20 72 163
4880A63l15J46r5L0j76p2K77J54j87j96N11k49K55k55K0r2K70k51P5l9l6J5l00
$$ 163 -152 -6 -101 -71 -247 -319 -42 112 -75 -271 240 -9 246 -9 11 -81 189 -62 13 -26 -62 -47 -347
4903c47K13N7M21l27J72l05L02J02l03J43j94J10j1J6k01J94j50R3PO6K48j48
$$ -347 -134 -77 344 17 189 -116 186 288 -15 128 -66 44 33 49 -152 42 -108 -15 -8 58 306 158
4925A58l4j21n0MJ78j73k17K54L52m60J55p5k04J28k6R0K29j82k07L59J11m64
$$ 158 124 3 -47 -43 135 -38 -255 -1 351 -109 46 -29 -233 -105 -131 -41 188 6 -201 158 269 -195
4947a95J29K1N6P8N8l66M52m02J55RN8QM7k57J64q6L0K06K1l66n8K25j15L23k73
$$ -195 -66 -45 11 89 147 -219 233 -169 -14 -5 53 61 108 -149 15 -71 -41 165 186 -180 -238 -13 -128 195 -78
4972g8j03k03N88j59j2m9j33R5J31j96j40L42N3j06r0R7m8N3J42k76R2J88k65
$$ -78 -181 -384 204 45 33 -16 -149 -54 77 -119 -259 83 136 30 -60 37 -11 42 184 -92 0 188 -77
4995g7k9J45Rj45K01l10P8L10k27K73m7m0K25n95J43K8K5P5j35j27Q6L9J19op1
$$ -77 -106 39 48 -97 104 -206 -128 182 -45 228 181 141 366 -229 -86 -58 -33 42 -93 -220 -134 -95 24 18 -53
5020e3N2q6j3L9J15p7P7Rj26l05J85J15J69L6j17k71L11j08O6Q8k84K62j64N4
$$ -53 -1 -87 -100 -61 54 -23 54 63 -63 -368 -183 -68 101 137 20 -251 60 -48 18 106 -178 84 -80 -26
5044b6m0M35m33J38k60J25L9nJ75k66j16K37k8J40Nj72j9l7nK6n9J58q8j85L79
$$ -26 -66 369 -64 74 -186 -61 -22 -27 148 -118 -234 3 -25 115 120 -52 -71 -108 -113 -87 -146 12 -76 -261 118
5069A18l9r8j61J46J95k84J24k69M43j66r1J26j29P4N4J34J57k93j67J7J41l98
$$ 118 79 -19 -180 -34 161 -123 1 -268 175 9 -82 44 -85 -11 43 177 334 41 -126 -109 32 -366
5091c66M59k37j41K95j60l7PJ02j82P6J34M6qQ7m80M42k41L42p4l34MN15q2l74
$$ -366 93 -144 -285 10 -150 -187 -180 -78 -260 -184 -50 -4 -12 75 -405 37 -204 138 64 -270 -266 249 167 -207
5115b07K23q6J51j58K80l12m1J78k1l8J12j06j20K57r8o4j13K38j46K07m7Q2l18
$$ -207 16 -70 81 -77 203 -109 -150 28 7 -31 81 -25 -145 112 14 -50 -163 75 -71 136 89 171 -147
5138a47J45j09K82l8j25j9L7m15K86J34J0J74l52J99L27n24L61j21J06l67M18
$$ -147 -2 -111 171 133 8 -11 26 -389 -103 31 41 215 -137 62 389 -135 226 105 211 -156 262
5159B62j81P1Q5k69K84m29jj8J21K24k90J71q8J71n7Oq5j08L98m43J92K15l27
$$ 262 81 152 237 -32 252 -177 -178 -196 -75 149 -141 30 -58 113 56 62 -23 -131 267 -176 16 231 -96
5182i6J55j64p9K95j53J13Kp1L5r5L9K9j77K11q7J8Q1j73O2K07K16m64J24l0j20
$$ -96 59 -105 -184 111 -42 71 73 2 37 -58 -19 10 -167 44 -43 -25 56 -117 -55 152 368 -96 28 -2 -122
5207a22J67k85M03jl51J91j96J39J29N5q9k6Nj47K38J26j89m4R2l55LL29k95L33
$$ -122 45 -240 163 162 -189 2 -194 -55 74 129 40 14 19 -128 110 236 47 3 95 -260 -257 72 -223 110
5231A10K3k04j00K28j25p6Q4J8r8j45J06K65n8K31n12M23k44K9R4k65N24k20k05
$$ 110 133 -71 -171 57 -68 -144 -60 -42 -140 -285 -179 86 28 259 -253 170 -74 -45 49 -216 308 88 -117
5254a17L30k83J72l70J3K87p0K3P6l22K48J26k22K15j13K1J78j14j15Q0l06K93
$$ -117 213 -70 102 -268 -255 32 -38 -15 61 -261 -13 113 -109 106 -7 14 192 78 -37 43 -263 30
5276C0n8m4L54m76n4K33L66j28l56J48J94l36J95n8j05J08J6j96K84j39o5K19
$$ 30 -28 -72 282 -194 -248 -15 351 223 -133 15 209 -127 68 10 -95 13 29 -167 117 -22 -87 132
5298A32J5k34O8MJ7j67OJ23K8j54N1j4mp7R0%P1l5J25p6j14J11R7p4n0pJ59n8
$$ 132 147 -87 -19 -15 2 -165 -159 -36 -8 -162 -111 -125 -129 -206 -116 -116 -45 -80 45 -31 -145 -34 63 -11 -61 -68 91 33
5326C3k45K98l1J64l61J04j02J78O4M5j11k23K05J03k17p0K0o7J81J85j82j58
$$ 33 -212 86 55 219 -142 -38 -140 38 102 147 36 -187 18 121 -96 -166 -146 -213 -32 153 -29 -187
5348a87R0P4J90j92Pn2J13j01K36l99L02p8l3o4j16L08J18j03k37K69J05m05Q8
$$ -187 -97 -23 167 -25 -18 -70 43 -58 178 -221 81 3 -30 -94 -210 98 216 113 -124 145 250 -155 -67
5371f7NL5K29k94J28P0mK09p3j68j00L13j76j53q1M14m20J45M3r7r9k19N09k67
$$ -67 -62 -27 202 -92 36 106 102 311 238 70 -30 283 107 -46 -127 287 -133 12 55 -42 -141 -360 149 -118
5395a18K2m3Q3K6J70j56J25j01k50L41j08M4j2Ol5P2q6M3J08k91J47Q3j54m3J53
$$ -118 -96 -139 -56 -30 140 -16 109 8 -242 99 -9 35 23 29 -6 66 -20 23 131 -160 -13 70 -84 -127 26
5420B6J28j96K0q5K18j37K2K11j59L3j7Q1J33o1j89n8N4K3M7j23qj66K67j12M8
$$ 26 154 -42 -22 -107 111 -26 -4 207 48 81 64 145 278 217 28 -30 24 47 94 -29 -37 -203 64 -48 0
5445@l72O10j73r9J8J40j09NP2k86M8L78l59l3J82K59j34j07J19j2Q2k80J15k00
$$ 0 -372 238 65 -34 -16 124 15 20 92 -194 -146 232 -127 -160 22 281 147 40 159 147 229 -51 64 -136
5469a36J54J19j91k13K02J05k28J40Q5K56m59O4L10j41N7j80l2J47k02K19j20
$$ -136 18 137 -54 -267 -65 40 -188 -48 37 293 -166 -102 208 67 124 -56 -88 59 -143 76 -44
5490d4NJ22k98J83J22K0p8j18k05K42L54j65k3J70l13j98q9N35k47M8k85K65q7
$$ -44 -39 83 -215 -32 90 110 32 -86 -291 -49 305 140 117 287 -26 -224 -313 222 -25 23 -262 3 -84
5513h4K84O1l26L9R9n1j33N8l6K11q8j39J41j52J31Q2J56j05j60J67j49m9K0J08
$$ -84 200 261 -65 -26 73 22 -111 -53 -89 122 34 -105 36 -116 15 97 253 148 -12 155 6 -43 -23 85
5537H5R0m38K89j5m9Q2J90j23k3l58J85L2j73K17o5O1j00r0J39L1j36O1L59k32
$$ 85 175 -263 26 11 -38 44 234 111 88 -270 -85 -53 -226 -9 -74 -13 -113 -203 -64 -33 -169 -108 251 19
5561A9p3J74n2k02J79O9n3j19J24k50J9J74k70L07R0k44L99j48p8N4J2k6l00L05
$$ 19 -54 120 68 -134 45 114 61 -58 66 -184 -165 9 -261 46 136 -108 291 143 65 119 131 105 -195 110
5585A10k56N2K1J68j02J48j5k62M22o2r9m2j43J23k03K94j86J87l18J40N1o5P0
$$ 110 -146 -94 -73 95 -7 141 126 -136 286 224 125 83 -60 63 -140 154 -32 155 -163 -23 28 -37 33
5608C3j9J23k11k0K38j76J86Ol32K13J03j08j61K83l41L85l36K66k70J55J50l3
$$ 33 14 137 -74 -94 144 -32 154 160 -172 41 144 36 -125 158 -183 202 -134 132 -138 17 167 134
5630A34n1k10n6K39P2k39QJ23j27J21Jj8j90J41J87p4j6j29K43m83L64j1k08R7
$$ 134 83 -127 -183 56 128 -111 -103 20 -107 14 15 -3 -193 -52 135 61 45 -84 159 -324 40 29 -179 -82
5654h2K58j95L7O9M8m35K89j00JK64k07R4J34p9m8r4q5J43O3j74K30J0j88Q3R3
$$ -82 176 -19 18 87 135 -300 -11 -111 -110 154 -53 41 175 96 48 -46 -131 12 75 -99 131 141 -47 36 129
5679A29j39K28m14K64P1l01K93k85p5J82J37k85K18j52K50j7l24J78l0L7O9k20
$$ 129 -10 218 -196 68 139 -162 131 -154 -229 -47 90 -195 23 -129 121 104 -220 -42 -72 -35 34 -186
5701a86J50J67j67p4K6L5J0O7o2O9j86K14J39j99M5k9j29K24k62k4K32p5lk17
$$ -186 -36 131 -36 -110 -84 -49 -39 28 -34 35 -151 63 202 3 48 19 -110 114 -148 -172 60 -15 -18 -235
5725b35K8K05L13l88K43j26K70l93J60L6k18K4k2j9q1K78J95l09O4J53p5k80J62
$$ -235 -207 -2 311 -77 166 40 310 -83 77 113 -105 -81 -103 -122 -203 75 270 -39 25 178 103 -177 -15
5748a5O6j88K32j32J65Q6n16O12k11J17k46j83K10k10m2L79j32K6j8j6J1J3J34
$$ -15 51 -137 95 -37 128 214 -302 310 99 216 -30 -213 -3 -213 -255 124 -8 18 0 -16 -5 8 142
5771A42k28J49Q0j83K42l04J20J91k21J82k38M9l28J61p8JJ50K33Pn43K30M40
$$ 142 -86 63 143 -40 202 -102 18 209 -12 170 -68 -19 -347 -186 -264 -263 -113 120 127 -416 -186 254
5793B54j53j87M9K5J6j55oJ50O3p4L4M9R6m08M6r3L22JL4m4m0k08K80l6K07j79
$$ 254 101 -86 -37 -12 4 -151 -157 -7 56 -18 16 65 161 -247 -201 -294 28 29 63 19 -21 -229 51 15 222 43
5819D3J87j52J8j57qQ9P3m25K49J65J1l09K9L86k10Q3j88J89j18L2j83L54R5l92
$$ 43 230 78 96 -61 -69 20 93 -332 -83 82 93 -216 -187 199 -11 72 -116 73 -45 -13 -196 158 253 -139
5843a39m3K29k84J89k22J36K08J9L1n6K67n31L41j06j7pJ9l8K33l90L7RJ94r0
$$ -139 -182 47 -237 -48 -270 -134 74 93 124 68 335 -196 145 39 22 15 34 -4 229 -161 -124 -115 79 -11
5867a1k54K54j06L91k26o1O4J1k21J13J8k2r2O9p3J50k6K06l36K72l83K18O8l0
$$ -11 -265 -11 -117 274 48 -13 51 62 -159 -46 -28 -50 -142 -73 -146 4 -22 184 -152 120 -263 -45 23 -7
5891gJ24k82K25k12L43k31o4J06j36J68N0M1j76j06J19j6J13j22J7k85J43K86
$$ -7 117 -165 60 -152 191 -40 -104 2 -134 34 84 125 -51 -157 -38 -54 59 -63 -46 -331 -188 98
5913I8l94K41L1J29k67J34K13j87K08k08Qjq2L30l71r2K99k91L00M6j03j74K64
$$ 98 -296 -55 -24 105 -162 -28 185 -2 206 -2 6 5 -77 253 -118 -210 89 -202 98 144 41 -133 131
5936A31p6j55J40l3k10M50l43K14R0l3k1k92L26k24nJ2M5J59j69j31K03j16k01
$$ 131 55 -100 40 7 -203 247 -96 118 208 175 154 -138 188 -36 -41 -29 16 175 6 -125 78 -38 -239
5959b39O61j32m14J45N3l77L42k17J06R2k05M70j99p1J01k53J71k32K18M1K15
$$ -239 422 290 -124 21 74 -303 39 -178 -72 20 -185 285 86 15 116 -137 34 -198 20 61 276
5980B76j62K0q3J61K9l52J83k3O0K34n2k42J21J17k27l76K72K16k19K30k16L5
$$ 276 114 134 51 212 241 -111 72 49 109 343 291 49 170 287 60 -316 -44 172 -47 183 -33 2
6002BPJ29m5p2j06J73j9k03k0J01J62lj90K01k1j40L95o27N99n4j95j01J60j26
$$ 2 9 138 93 21 -85 88 69 -134 -154 -53 109 106 -84 117 96 -44 351 -276 323 269 74 -27 133 7
6026Gk03R4M5J55k34QK14p4Q0j00K53j72J68k37j39K40k9j5O6m86K28m4K79n8
$$ 7 -196 -102 -57 98 -136 -128 86 12 92 -8 245 73 241 4 -135 105 76 61 127 -359 -131 -175 104 46
6050D6r2J47j16K36k82q8Q5j24L9L19j49j72K15m7j62P1J68k94M31r2k18J82k23
$$ 46 -46 101 -15 221 -61 -149 -64 -188 -149 170 21 -151 64 17 -145 -74 94 -200 231 139 -79 103 -120
6073a20K79m4p3N4j48k06K84J22L5k6M6j89j29k20L46k28K71K4k54K6K90j72K27
$$ -120 159 115 42 96 -52 -258 26 148 183 157 203 14 -115 -335 11 -217 54 78 -176 -150 140 -32 195
6096A95m23J77J82L8j77J14m2J32j73n3L1K2K05l43O0L4q1J71L3j9k1r4J88m27
$$ 195 -228 -51 131 169 -8 106 64 196 23 -30 1 23 228 -115 -55 -21 -102 69 102 83 62 -32 156 -271
6120b71K50n5k0K08n4j93J71J18j72o8q8K11J26l37K07j86J22Kq1J42l10M78j73
$$ -271 -21 -76 -96 112 58 -135 36 154 -18 -86 -174 37 163 -174 33 -153 -31 -29 -110 32 -278 200 27
6143B7m1L7P5k06j6P2p8q4K75K27l08R5k60J81L2o7l37L48J24r4N0J97n7k65K09
$$ 27 -14 23 98 -108 -124 -52 -130 -214 61 288 -20 75 -185 -4 28 -39 -376 -28 96 2 52 249 192 -73 136
6168A36K6Q7l17N8Q5k13K69m3j52J12j53M52k15m6r2n1J87J82j40l62OKR1j04
$$ 136 162 249 -68 -10 75 -138 131 88 -64 48 -105 347 132 86 -6 -57 130 312 172 -190 -184 -182 -91 -195
6192a95J72j07K53Ol39J07K20j04J34k91J29pJ85k84K4J8Q4M7j73lK46j80K7o3
$$ -195 -23 -130 123 129 -210 -103 117 13 147 -144 -15 -22 163 -121 -97 -79 5 52 -121 -124 122 -58 -31 -94
6216i4J07K07j94K00m98K75l16K47k0J81j4j18j58K77j87M4K07l11J55n4K44l32
$$ -94 13 220 26 226 -272 3 -313 -66 -86 95 81 -37 -195 82 -105 -61 146 -165 -10 -64 180 -152
6238a52J80r6N3j68O7N4J6M2K89l53J68k80J58K10j95L07m07M8j36L95m58M4K87
$$ -152 28 -68 -15 -183 -116 -62 -46 -4 285 -68 100 -180 -22 188 -7 300 -107 -59 -195 200 -258 -214 73
6261G3j90R5Kn9J77M7Q6l36M09l05j28l60N30l69M69p9j41J27k3J76n16Q3L94
$$ 73 -117 -22 -20 -79 98 145 231 -105 304 -1 -129 -489 41 -328 141 62 -79 48 25 201 -315 -232 162
6284A62j07L5l04J14j0R1M9j3q0J52k6j50o9M5p9J19r8p3K95k90J46J9mK0M4J47
$$ 162 55 90 -214 -100 -110 -19 30 17 -63 89 63 -87 -156 -111 -190 -71 -169 -242 53 -237 -91 -72 -76 -56 -12 135
6310A35k42J39j02J53L8n09L57Q4O2j43l7J85k1j26m2J80o7j04J30j08O7r8M2
$$ 135 -107 32 -70 83 121 -388 -31 53 115 -28 -65 120 99 -27 -69 111 44 -60 70 -38 29 -69 -27
6333b7j59J47n4J44j98N8L50m07K22j61L0O8J71k04J43p9O8j3l3O3j14J00k19
$$ -27 -186 -39 -93 51 -147 -89 261 -146 76 -85 -55 13 184 -20 123 44 112 99 66 129 15 115 -104
6356a04R4j03L64kl63j69M61l61K07J26j50pJ03k28K20o9k32L5%L38k07j21M07
$$ -104 -10 -113 251 249 -114 -283 178 -183 24 150 0 -7 96 -132 88 19 -213 -178 -178 160 -47 -168 239
6379B39m45J23O6lL5J12j22j26J30j21L2L2O9j73j20M09k29j18J99j88J79O1j62
$$ 239 -206 -83 -17 -20 15 127 5 -121 9 -112 -80 -48 21 -152 -272 137 -92 -210 -11 -199 -20 41 -121
6402a21N5n2M0m6R2J97j82n8J10Mm05M80K6J73l93n0P3j73K02M8J8Q7k20K3L6
$$ -121 -66 -118 -78 -124 -32 165 -17 -75 35 39 -366 114 140 313 -80 -130 -57 -230 -28 20 38 125 -95 -72 -36
6427c6O4J37qNk87M01m21K23m46L05p8J37L01m84K46K70l09K12l93J64J41n3k05
$$ -36 28 165 157 162 -125 276 -145 78 -368 -63 -141 -4 297 -187 59 329 20 232 -161 3 144 91 -114
6450a14J02k78L75J52k27k0J26K56k66r1R9j28J80k06Q7k4J29j23J93O5l50J34
$$ -114 -12 -290 85 237 10 -10 116 372 106 15 114 -14 166 -40 47 23 152 29 222 287 -63 71
6472G1n9l1j05J86q5K7j62M9K29M3J45m27K47Pk35J74l6k71L47l38K13P6j07l9
$$ 71 12 -19 -124 62 -23 4 -158 -109 120 163 308 -119 128 135 -100 74 38 -233 114 -224 -11 65 -42 -81
6496h1j8p6J71J39k92J67J50j57L8J72O9l58N6m7N1J01l8j08m9L81q8l52K30O2
$$ -81 -99 -175 -4 135 -157 10 160 3 41 213 282 -76 -20 -67 -16 85 47 -61 -110 271 183 -169 61 123
6520A23Mm6m77L83P9N1k61K46j08k51J27R9J37l61K81K0k19L44k69m3J86k26J60
$$ 123 127 81 -396 -13 66 117 -144 102 -6 -257 -130 -31 106 -255 26 46 -173 171 -98 -141 45 -181 -21
6543b1m1k61L55q1L27k67M1k22J57LJ09k68J66j49J49j8k00L09n6J0p4J6o2j3
$$ -21 -62 -323 32 -49 278 11 52 -170 -13 -10 99 -169 -3 -152 -3 -21 -221 88 32 42 -32 -16 -78 -91
6567i1r9L56L0k57L7k28J60J39k1L9j36J13j51rj33J64Q2J1k07j9L10l6K5n8J91
$$ -91 -190 166 196 -61 -24 -252 -92 47 26 65 -71 42 -109 -118 -251 -87 -5 6 -201 -220 90 54 79 21 212
6592B12J4q2j34J43M8j69k10K40k46J90k16R2PP0j65J66j10j17K61R8Nk44J77
$$ 212 226 144 10 153 201 32 -178 62 -184 6 -210 -118 -111 -41 -206 -40 -150 -267 -6 92 97 -147 30
6615C0j77lj09L70m7J40j10j69J33J5l39M91l80m9K04k57K37k80J43K59j36J61
$$ 30 -147 -150 -259 111 64 204 94 -75 58 73 -266 225 -155 -204 0 -257 -20 -300 -157 102 -34 127
6637A27q3p5k18J94Q8r4J92Jm18K44j2j04M29l07j15L69j31l07K49Q8k9J56l3
$$ 127 44 -31 -249 -55 33 -61 131 132 -286 -42 -54 -158 271 -36 -151 218 87 -220 29 117 88 244 211
6660B11j69k63J50K78l33J45qr1j7J16j40r3L38k30L28r5m4j01P1J9n5j41L00
$$ 211 42 -221 -71 207 -126 19 11 -80 -97 19 -121 -214 124 -106 222 127 83 -18 53 72 17 -124 176
6683A76k70K6N4J60q2k91J48N2j08o1j40M37p7r5O8L8O3L9k35n1K34k19L41j41
$$ 176 -94 -68 -14 146 64 -227 -79 -27 -135 -196 -336 101 24 -71 -3 35 98 137 -98 -149 85 -134 207 66
6707F6k09K92J8qj58o6J62k50J37K20k9l19N8K28k80L09j08j18J04j76m6J83o8
$$ 66 -143 149 167 159 1 -65 97 -153 -16 204 175 -144 -86 142 -138 171 63 -55 49 -127 -173 10 -58
6730e8p2j3J25j82K90k65K17r7j34K27q9J19k9L1j39M7n0l2o2J11L77k5k08k06
$$ -58 -130 -143 -18 -200 90 -175 42 -55 -189 38 -51 68 39 70 -69 -22 -72 -104 -166 -55 322 297 89 -117
6754a17mq7M93j71J98j42r0l6L2J12m07nj4J75J4m7j80L16j83J3LJ63o7J70k14
$$ -117 -121 -208 285 114 312 170 80 44 76 188 -219 -224 -238 -63 -49 -96 -276 40 -143 -130 -127 36 -31 139 -75
6779g5j09jM9J95J20l17L4M98p09K0K32J48j48p4j6L12k9j82j64N7J72N0p6J38
$$ -75 -184 -185 -136 59 179 -138 -104 394 -315 -295 -63 85 -63 -137 -153 159 130 -52 -216 -159 13 63 -13 125
6803A25M6l11O9J48l75N29Jl36L30n30K49KJ53j65j83J61J08k8L5k31M17k68J14
$$ 125 171 -140 -71 77 -298 231 232 -104 226 -304 -55 -53 100 -65 -248 -87 21 -7 28 -203 214 -54 60
6826F0N2l09K70q7l47N63j28j58J00OL8R0l4l74L06J21l4l81J39K52j9p6j1n8
$$ 60 112 -197 73 -14 -361 202 74 -84 16 22 60 150 116 -258 48 169 135 -246 -107 145 126 50 39 -19
6850a9L5n5k9n2O9L78m80JMJ75j84K00J05r3q9j10J60O7q5MQ1k41j66J29L28k53
$$ -19 16 -39 -68 -120 -51 327 -153 -152 -148 27 -157 43 148 55 -34 -144 16 83 -2 2 83 -158 -324 -195 133 -120
6876a20L74l38r9Q9QJ18j10m4m6L83j45O6j68n3j21K44j52P2K57k06j66J37nK0
$$ -120 254 -84 -183 -94 -86 32 -78 -122 -168 215 70 136 -32 -85 -206 38 -114 -42 215 9 -157 -20 -25 -5
6900ej4m7j2K14j64qJ66k78L39k26J77j92K50l29L55j40k3q1o7R0k26L48l5j8
$$ -5 -19 -66 -78 136 -28 -36 130 -148 191 -35 142 -50 200 -129 226 86 63 -18 -85 5 -221 127 92 74
6924G4j11O6j22K43j93K5J55k1n8j01Pj4K42j02J22k31j39J67J45k4jK8j67Q5
$$ 74 -37 29 -93 150 -43 -18 137 116 58 -43 -36 -50 192 90 212 -19 -158 9 154 130 129 157 -10 75
6948G5k0Q0k25Q1J04J9p1j35J71k87J05K01L7l39J78L4J92m07M00k19j44M05l24
$$ 75 55 135 -90 -9 95 114 43 -92 79 -208 -103 98 135 -204 -26 8 200 -207 193 -26 -170 235 -89
6971h9P9J38j16Q8m5jj43J7J92l22J33N8L42k55L3l48L40j2j97J3L0RK17j43K65
$$ -89 -10 128 12 100 55 54 -89 -72 120 -202 -69 -11 331 76 109 -239 101 89 -108 -95 -65 -56 161 18 283
6996B83n49L43l32J96J6J40j7J59k87j33K73L8m8j2L6o7k13J48J6K20k27j48K49
$$ 283 -266 77 -255 -59 -43 97 80 239 -48 -181 92 130 82 70 106 39 -174 -26 -10 210 -17 -165 84
7019H4p0M8j20J62J3l39j54N09n1j72Q5l43M30k36J10M1J9O2o9K61J09j96l17
$$ 84 14 62 -58 104 117 -222 -376 133 82 -90 -5 -348 82 -154 -44 -3 16 78 9 270 379 183 -134
7042a34o7J74j96J7K94p6j50J70J7j26P2L14m82L87M0p9k95N3R6p1L57l62J70
$$ -134 -201 -27 -223 -206 88 12 -138 32 49 -77 -5 309 -173 214 254 175 -120 -67 29 -42 315 -47 123
7065A23j3j37L47m11J12M7m4Q4k89K10R4k3l49K15n1J32j24K47j60m4j42K52k32
$$ 123 110 -27 320 -91 21 68 24 108 -181 29 123 100 -249 -34 -85 47 -77 170 10 -34 -176 76 -156
7088a56K19m8R2K7k98j34M78j74mJ40j46J28J0J99l86Mk41K14n5L1J89O6m22K92
$$ -156 63 15 107 134 -164 -298 180 6 2 142 -4 124 134 333 -53 -49 -290 -76 -131 -100 89 155 -267 25
7112B5P5j06j87K9J96oJpj78K27J2j57J34q3jj10L37j72k60K70l1P4J64l19j97
$$ 25 100 -6 -193 -164 32 26 27 20 -158 69 81 -76 58 -25 -26 -136 201 29 -231 39 8 82 246 -73 -270
7137b70L01J2j61j60K91J73k47q5j8K47j27K24l95L31j8j6J72n58K70O4j00PM04
$$ -270 31 43 -118 -278 13 186 -61 -146 -164 83 -44 180 -215 116 98 82 254 -304 -34 30 -70 -63 341
7160C41l44k6o7J44j95M4N0L86m68K77m10k0M26m58J99Q9q9L92k49Q1J9j35K9
$$ 341 -3 -29 -96 48 -147 -103 -53 333 -135 142 -268 -288 138 -320 -121 -32 -121 271 22 103 122 -13 16
7183A6l02L39K0Q3o3p9J15k1r7L3j48m6L54M5m6n2l59L70k95K28O1m03L22j11
$$ 16 -286 53 73 156 93 14 129 108 11 44 -104 -150 204 249 203 151 -208 162 -133 95 156 -247 75 -36
7207c6Q9k32J97k6j2O9k69K66K3j84M17k45j43o7K24J00J61n01J83J88r7r3L03
$$ -36 53 -179 18 -8 -20 49 -220 46 69 -115 302 57 -86 -153 71 171 332 -169 14 202 105 12 315
7230C15k55p9M0k3j1m9L0K76m22m7J49K7N5J7J95l65J33K1j80M9m0K79j77J17
$$ 315 60 -19 21 -2 -13 -62 -32 244 -178 -225 -76 -49 6 23 218 -147 -14 7 -173 -124 -164 115 -62 55
7254E5K44k57m1R2o7m07M77k22N9J28K7M22l67P1l86J5N3Q3j15J33l0N2j4M1o5
$$ 55 299 42 1 93 26 -381 96 -126 -67 61 88 510 143 214 -172 -157 -104 -21 -136 -3 -33 19 5 46 -19
7279a9L9k71R6K07K66l52k47L72j0k69m8n5J00j19K09mL84o6l00J88o3r4P9l1
$$ -19 20 -251 -155 52 318 -34 -281 91 81 -188 -236 -291 -191 -310 -101 -105 279 213 -87 101 38 -56 23 -8
7303hL9L22m47R6l14K13J59j05l2N6j54K27j23L51l56J15k55K37p9J21j16o2L
$$ -8 31 353 -94 2 -312 -99 60 -45 -77 -21 -175 52 -71 280 -76 39 -216 21 -58 63 -53 -115 -112
7326a12P7m4j38L66j92m2o0J57o5Q4L73m60J85k47J81l33K94r2l1O4j55J60O7
$$ -112 -35 -79 -217 149 -43 -85 -145 12 -53 31 404 -56 129 -118 63 -270 24 -68 -99 -35 -190 -30 37
7349C7n2K10k03n8Q2J38m05K92j28l8k0k71M11J06j94O2l9K84K5n43M16L20m37
$$ 37 -15 195 -8 -66 16 154 -251 41 -87 -125 -145 -416 -5 101 -93 -31 -70 214 239 -304 112 432 -5
7372eJ7Q8j67K24j38m1o9K61k13M4Q4Q4j69K02j35J99j95L1j61R2O3L5k31L01
$$ -5 12 100 -67 157 19 -22 -91 170 -43 1 85 169 0 202 67 266 71 102 -59 33 96 131 -100 201
7396B01k20L3P5JO6n5j56rJ98k12j5l3Q2J77j90Q2K3n3r1J24J12j65K3J65k00
$$ 201 -19 14 89 90 156 101 -55 -64 134 -78 -93 -126 -44 133 -57 25 48 -5 -96 28 140 -25 -2 163 -37
7421c7K92l91J63P5m2j09r2J79j19J60J35k96N1K17j26l2Q7j33P6k77K64rO0R7
$$ -37 255 -136 27 102 60 -49 -141 38 -81 79 214 -82 -31 186 60 28 115 -18 58 -219 45 36 96 193
7445A93l2J1k00p3Q6m2J89K5m3k41J85j93J02l1K16l45M98j76k10M3n8K19q6K8
$$ 193 161 172 -28 -101 -15 -57 132 157 114 -127 58 -135 -33 -64 152 -193 305 129 -81 -38 -96 123 37 65
7469F5n2J25j09J82r9n3M3j38J38j01N9L8k86M37k82J40m0j17L8O5j8K4k6rm7
$$ 65 13 138 29 211 112 59 102 -36 102 1 60 98 -188 249 -33 107 67 -50 -12 53 35 59 33 24 -23
7494b3j86J48n2J54J04O9l89m2K50n4L07m09P8o0j00K78k75J27N6k35K29J63l0
$$ -23 -209 -61 -113 41 145 214 -175 -217 33 -21 286 -123 -45 -105 -205 73 -202 -75 -19 -254 -25 138 108
7517A08kj01J89j74Lk21L15P8j69k8l75J35L02n0M8r3J24j02Q0j58P9J56k83L27
$$ 108 106 5 194 20 23 -198 117 195 26 -2 -377 -242 60 10 58 -35 89 -13 67 -91 -12 144 -139 188
7541A88k86K32l47K28K23j84J23l03mK70j27l1J52k06K28pk33J22j47j03J5K39
$$ 188 -98 134 -213 15 238 54 177 -126 -130 140 13 -18 134 -72 156 149 -84 38 -109 -212 -197 42
7563D2J14k27K00l1k7j97n9p7J89O2M8Jj78L9J49J5j25j4J74j98K31j31q9M12
$$ 42 156 -71 129 98 71 -126 -185 -262 -73 -11 37 38 -140 -101 48 63 -62 -76 98 -100 131 0 -89 323
7587C23q2m32M15J14l18q7n5J42k51o9L42k2M3J6k12K9k1j51Q25o06R7R1o3K17
$$ 323 241 -191 224 338 20 -67 -122 20 -231 -300 42 20 63 79 -133 -104 -125 -276 549 -57 40 131 68 285
7611B85l64p5M12l67L41k27k09K44o0J79j15j58K59jrj53J30m34K55r5j51M20
$$ 285 -79 -154 258 -109 232 5 -204 40 -20 159 44 -114 145 144 135 -18 112 -322 -67 -162 -313 107
7633A07k22K26J13l96P0K93O1l20l2n7m0Q3J08j28Q2J54j23O5Jj0O1o6J74k50
$$ 107 -115 111 224 -172 -102 191 252 -68 -100 -157 -197 -114 -6 -134 -52 102 -21 44 45 35 96 30 204 -46
7657d6K21l18K94m1m36J72J6R0q5Q9L2K25p2M9k37j85L23k75K91j95j86L08j58
$$ -46 175 -143 151 110 -326 -154 -138 -48 -133 -44 -12 213 141 190 -47 -232 91 -184 107 -88 -274 34 -124
7680a24m0M9J82o9k16K55m04J89L5o5L92p2j10j16J71L6j09K58j28j35l7K5j13
$$ -124 -164 -115 67 -2 -218 37 -367 -178 -143 -208 184 112 2 -114 57 93 -16 242 114 -21 -58 -33 -146
7703a46M27l34m9rl3J64l3K71k10o3j87R4J17j65Q2n1K39j47j39J48J77j0l2J08
$$ -146 281 -53 -102 -111 -144 20 -13 258 48 -15 -202 -108 9 -156 -74 -125 114 -33 -172 -24 153 143 111 219
7727B19l74J07R5J68l26K74j60j7J1m9J5J23j05k3J44o0j86K18j67L3Q6j36M12
$$ 219 -155 -48 47 215 -111 163 3 -14 -3 -52 -37 86 -19 -42 102 42 -144 74 -93 -60 26 -110 302
7750C02n4m70J80j96Q8L46l55L50n6Or8j53Q0J61L6j39j2Q5l5j05j11L22l80J01
$$ 302 248 -222 -42 -238 -150 196 -159 191 135 141 43 -110 -30 131 167 28 16 101 66 -39 -150 172 -208 -107
7774a07K41m0k15J59J3L3k65J50n9J53QK33l81J29k2j53L6K4L0J51k9j32j43J55
$$ -107 134 94 -121 38 51 84 -181 -31 -90 63 71 304 -77 52 30 -123 -87 -63 -33 118 89 -43 -186 -31
7798c1K89k56j31J26M20k76m14K24k6J25J87k56K06j91O0j11L29j23r2k11L40
$$ -31 258 2 -129 -3 417 141 -273 -49 -75 50 237 -19 187 -4 56 -55 274 151 59 -152 188
7819A88j39j14K35j01r7J29J51K3k30k42K47L23n59j50L57j9m8J62l44J83K31
$$ 188 49 -65 170 69 -28 101 252 275 45 -197 50 373 -186 -336 21 2 -46 116 -228 -45 186
7840A86n63L14J60k68P1K30k89P8R3R0K9l09J68L14j89n9j66J47j9j24o8J0J63
$$ 186 -377 -63 97 -171 -100 130 -159 -81 12 102 131 -178 -10 304 115 56 -110 37 18 -106 -174 -164 -1
7863ajj87K17j5L0J08L3m03J28K05l61L57k55M35k38K4k78J05K0J19Q6k95mL89
$$ -1 -2 -189 28 13 43 151 184 -219 -91 114 -247 110 -145 290 52 76 -202 -97 -77 42 128 -167 -171 218
7887B18k59J71l36J29K66j85K08j28l5m1m3J65l14K38q9j30K17L9J7l22K83l20
$$ 218 -41 130 -206 -77 189 4 212 84 49 8 -35 130 -184 54 -35 -165 52 91 108 -214 69 -251
7909b51K27J43j0K3j78J12j00k06L16j2k22J31j86R5r6j33M77k29jm4R8M9j29
$$ -251 -24 119 109 132 -46 66 -34 -240 76 64 -158 -27 -213 -118 -214 -347 130 -99 -100 -144 -46 3 -126
7932a26lK2J01j03J53J5l27Q1K49n0j79J92K50k10L14p4j87qo1k88J69k22N62
$$ -126 -129 -107 -6 -109 44 59 -268 -187 62 12 -167 25 275 65 379 305 118 110 49 -239 -70 -292 270
7955B70k62j44L3J51N3k14J33k6ql46J17L14M4j29J98k54J97j43K3M3p1r7L61
$$ 270 8 -136 -103 48 101 -113 20 -6 -14 -360 -243 71 115 -14 184 -70 127 -16 7 50 -21 -118 243
7978B43o3j36o2m3K15l88K85j41K34j72j09Pj66J65j30J15K51p7k84J63k52L57
$$ 243 180 44 -18 -61 154 -234 51 -90 144 -28 -137 -130 -296 -131 -261 -146 105 28 -256 -93 -345 12
8000A2L39j55k44j3j1j0j09K08O7j95k51L14m0J63M8q2p0L0J49O6k51J13r2Jj41
$$ 12 351 196 -48 -61 -72 -82 -191 17 84 -111 -362 -48 -88 75 123 41 -29 1 150 216 -35 78 -14 -13 -154
8025a54L40j32j33K6K29L8l21J41j53l0M0LP5L1K25j49j90J95R0k42r4L72k69
$$ -154 186 54 -79 -53 176 214 -107 34 -119 -149 -109 -106 -31 0 225 76 -114 81 171 -71 -165 207 -62
8048f2l1R3J48j56O6l6O4j58l76L94K20k54q9L54k70L26l15J91k41K73j36n3J52
$$ -62 -93 0 148 -8 58 22 86 -72 -448 -54 166 -88 -177 177 -93 233 -82 109 -132 141 5 -48 104
8071A04M8j98j96M08k64M88m47q8j52L95J29k89m2J61R6m05K47J46r7L4m42M58
$$ 104 152 -46 -242 166 -98 390 -57 -145 -297 98 227 -62 -104 57 153 -252 -5 141 44 78 -364 94
8093I4l35J55J35J1Q1j02Q6q7o73Q48M6k64n1K4J55j22l5o1M5k3Q8r3k74N85J97
$$ 94 -241 -86 49 60 141 39 125 38 -635 213 259 -5 -56 -32 123 1 -34 -95 -50 -73 15 -78 -352 233 430
8118D30o74K28p4Pn6NJ50K30n5l11l6J57p6k42L19j26ML2J45j33J22j59j0j9J26
$$ 430 -244 -16 -90 -83 -139 -134 16 246 191 -120 -156 1 -75 -317 2 -124 -120 -88 57 -76 46 -113 -123 -142 -16
8143a6J39j22K14k81J97j48k23L21J28l09r7J89j56M5J29j03O5j8K56l18J40j29
$$ -16 123 1 215 -66 131 -17 -240 81 209 -100 -197 -8 -164 -119 10 -93 -28 -46 210 -108 32 -97
8165i7N0j18K09L4k08N9J31J2n7oJ2J55l10M4J85R0k54p8J12P8q4J14J07k72L0
$$ -97 -47 -165 44 78 -130 -71 60 72 15 9 21 176 -134 -90 95 185 -69 -147 -35 43 -41 73 180 -92 -62
8190f2l7
$$ -62 -99
8191i9
$$ Imaginary data points
##PAGE= N=2
##DATA TABLE= (X++(I..I)), XYDATA
0@%%%%%%%%%%Qj6J6j6J6k4L2l4M2n6O6p4R1j11J32j54J78k08K40k75L15l61M11
$$ 0 0 0 0 0 0 0 0 0 0 0 8 -8 8 -8 8 -16 16 -18 24 -32 34 -40 51 -60 72 -82 96 -112 128 -147 168 -193 218
33B18m64N26n95O68p50Q41r38J045j162J289j430J583j750J934k135K353k590
$$ 218 -246 280 -315 353 -397 444 -494 551 -611 678 -752 831 -919 1015 -1120 1233 -1357
50a357K853l143L463l820M218m664N170n749O417p200Q130r255J0658j2459J4863
$$ -1357 1496 -1647 1816 -2004 2214 -2450 2720 -3029 3388 -3812 4318 -4937 5721 -6738 8125
65H125j8259K3459l2513N2740j82325R2529L76758j14309k77060j91852J13420
$$ 8125 -10134 13325 -19188 33552 -148773 -56244 320514 206205 -70855 -262707 -149287
76a49287K25741J59662r6707k46235j44329J52323K35652P7869j57872k02710
$$ -149287 76454 236116 139409 -106826 -251155 -98832 136820 214689 56817 -145893
86a45893n1391J37846J82066Q1775j47920k41821m0725K34623K21097n0334k49624
$$ -145893 -197284 -59438 122628 204403 56483 -185338 -226063 8560 229657 179323 -70301
97g0301j49344P8265K20117J49696j06536k64818r8851J72920K34965L6650j85379
$$ -70301 -219645 -141380 78737 228433 121897 -142921 -241772 -68852 166113 202763 17384
108A7384j89401j210J81393J81673k8399k12288j53082P0044K15507J15835j09931
$$ 17384 -172017 -173227 8166 189839 161440 -50848 -203930 -133886 81621 197456 87525
119H7525j84948p0108R0603J72068Q1917j15690j96339m7948J69288J81207j3568
$$ 87525 -97423 -167531 -76928 95140 177057 61367 -134972 -182920 -13632 167575 154007
130A54007j61742j44988K997J68814J60670m1888k04553j32325J02977K13848
$$ 154007 -7735 -152723 -149726 19088 179758 137870 -66683 -199008 -96031 117817
140A17817O7346j34853j75380l5126J34693J57609K3291j37876j65764M983J75163
$$ 117817 185163 50310 -125070 -160196 -25503 132106 155397 17521 -148243 -143260 31903
151C1903J26981n1955j53838r9027M9152J49172J06343n9645j83732q8244J19826
$$ 31903 158884 106929 -46909 -145936 -96784 52388 158731 99086 -84646 -172890 -53064
162e3064J77758L7596j36177j56120n619J35177J29847l961j43004j28397L4812
$$ -53064 124694 162290 26113 -130007 -135626 -449 129398 125437 -17567 -145964 -111152
173a11152J60170J08975o7326j61786p1831P8540J45866O9382r5534j60046l7548
$$ -111152 49018 157993 90667 -71119 -142950 -64410 81456 150838 55304 -104742 -142290
184a42290J22051J42137K88j34050j14247J8166J31224J11892l3845j39392r1698
$$ -142290 -20239 121898 122186 -11864 -126111 -107945 23279 135171 101326 -38066 -129764
195a29764M9367J42185P3890p9861j37744m9319Q9112J36174L2604j06264j30709
$$ -129764 -80397 61788 135678 55817 -81927 -131246 -42134 94040 126644 20380 -110329
206a10329r658J28755J14934k7560j22620q8730L3276J23539P8218n2170j28419
$$ -110329 -119987 8768 123702 96142 -26478 -115208 -81932 41607 119825 67655 -60764
217f0764o7199P4873J30385L8919q6662j19601k0788J02924J08569J071j07644
$$ -60764 -127963 -53090 77295 116214 29552 -90049 -110837 -7913 100656 101727 -5917
228e917j04568K0407J20393P9717m3041j16678o1407N7455J09049N1192o2339
$$ -5917 -110485 -90078 30315 110032 66991 -49687 -111094 -53639 55410 106602 44263
239D4263j16531l5636Q3323J06816J7927r3201j00721N017R9518Q8314k0286j11989
$$ 44263 -72268 -107904 -24581 82235 100162 6961 -93760 -88743 10775 99089 78803 -33186
251c3186p5119M2198J10373O0906n8459j06550l4615O4393R6099K7541p6247r4283
$$ -33186 -108305 -66107 44266 105172 46713 -59837 -94452 -30059 66040 93581 17334 -76949
263g6949j2218Q3065R2376n178r4954p7549J8258R8791P1265m0419j01152n0811
$$ -76949 -89167 -6102 86274 81096 -13858 -91407 -73149 25642 96907 56488 -44664 -95475
275i5475N4389J02525L2541p0219q9353j8515P1935Q3617K583p5577p6097M436
$$ -95475 -41086 61439 93980 23761 -65592 -84107 -12172 71445 74028 -1549 -77646 -73210
287g3210Q7043P0839k2228q7422o0479L5111R3952M4281m9729r1411l4189O5371
$$ -73210 13833 84672 62444 -24978 -85457 -50346 43606 87887 38158 -53253 -87442 -22071
299b2071Q6062J2695o8478p8573p67P6740O6500q643p5964o2802K3941Q1163M9846
$$ -22071 63991 76686 8208 -70365 -71132 5608 72108 63465 -12499 -75301 -51360 29803 79649
312G9649l3687q6620m0893M9038Q0023K8168n6283p9745r224O6960O9382n56p3668
$$ 79649 45962 -40658 -81551 -32513 47510 75678 19395 -60350 -69574 -2614 66768 66212 -7456
325g456o1350J6410P0320N2854k3516p6645m2573L3943P4185L5855m6034p4792
$$ -7456 -68806 -52396 17924 70778 47262 -29383 -71956 -38013 36172 72027 25993 -48799
337d8799j9593N4162P2260R654o5164o2891L849O5611N7142j9492o9706m3502
$$ -48799 -68392 -14230 58030 67684 2520 -60371 -56522 9089 66231 46739 -22967 -66469
349f6469K5329O9697L7331l5903o5420k7861M0880O8795J6573n1208o2801q720
$$ -66469 -41140 28557 65888 29985 -35435 -63296 -22416 46379 62952 11744 -51057 -59777
361e9777N8797N9403p248o2101n0872J5286O7250M0271k6918o2844l2720L6459
$$ -59777 -980 58423 51175 -10926 -61798 -46512 20738 61009 34091 -28753 -61473 -25014
373b5014O3385K0460l9986o0877j5571M8869N5883L491n1373n4280P133N9567
$$ -25014 38371 58831 18845 -42032 -57603 -8734 47149 50640 -733 -55013 -47880 11687
385A1687M4240j5522o0672l8202K8170N9352K7742l3458n9840j7359M1225N2201
$$ 11687 55927 40405 -20267 -58469 -30299 29053 56795 23337 -36503 -53862 -12637 39564
397C9564J1095m5755n3052L56M9769M6781n772n4770l9321J7802N3850L4594k7416
$$ 39564 50659 4904 -48148 -47792 1977 48758 42986 -11784 -51105 -33303 20547 55141 27725
410B7725n7926k2093L2393N2611J7113m0720m9860n010M2951M6362j828m6685
$$ 27725 -30201 -52294 -19901 32710 49823 9103 -40757 -45767 -2816 43546 41718 -4967
422d967l9010P073N0004L7528j9964n1397k7555K2789N1443K1335l2968m8102
$$ -4967 -43977 -36904 13100 50628 30664 -20733 -48288 -25499 25944 47279 14311 -33791
434c3791j2231L8264M6555L788l9617m2100O60M6479L6958j4152m4900l1476J6965
$$ -33791 -46022 -7758 38797 42585 2968 -39132 -38472 8007 44965 30813 -14087 -45563 -28598
447b8598M9146K4761k5292m7569j7187L3686M3776Q742l3870m3598j646M1981
$$ -28598 20548 45309 20017 -27552 -44739 -11053 32723 41465 7595 -36003 -37649 4332
459D332L4133o937l9836l2315J1219M2036K7011j6186m3448k0025K4109M0318
$$ 4332 38465 31528 -8308 -40623 -29404 12632 39643 23457 -19991 -40016 -15907 24411
471B4411J7833k8180m5482p413L4912L7255J510l7647l5020O109M0585L0960j4566
$$ 24411 42244 14064 -31418 -38831 -3919 33336 34846 -2801 -37821 -31712 8873 39833 25267
484B5267m2154k0626J8339L9237K0330k5619m0973r071K8309L5758M908l3022
$$ 25267 -16887 -37513 -19174 20063 40393 14774 -26199 -35270 -6961 28797 33705 683
496F83l3718Q78L6258L1107j0226l5039k2617J0786L7629K1576k1079l6342j3412
$$ 683 -33035 -32157 4101 35208 24982 -10057 -32674 -21888 15741 37317 16238 -20104 -33516
509c3516K1514L4714R930k4962l4970o717L2912L2294m174l0468k9102O535L9100
$$ -33516 -12002 22712 32642 7680 -27290 -34007 -1095 31199 27025 -3443 -32545 -26010 13090
522A3090K3720j7387l6144j6720J9750L3607J1270k2589l4656n032K9890K7399
$$ 13090 36810 19423 -16721 -33441 -13691 19916 31186 8597 -26059 -31091 -1201 26198
534B6198M56k6311k8987M368L3294K1424j0589l1282j8315J3059L0095J6969j7805
$$ 26198 26654 343 -28644 -24276 9018 30442 19853 -11429 -29744 -16685 13410 30379 12574
547A2574l4714p624K3752K8001O404k4593k9803J336K9231K3673n864l0041k1083
$$ 12574 -22140 -29764 -6012 21989 28393 3800 -26003 -24667 4564 28237 22373 -7668 -28751
560b8751Q262L0286K0734j6875l2605q439J8875K8265R454k3533k8379k038K5486
$$ -28751 -20489 9797 30531 13656 -18949 -27388 -8513 19752 29206 5673 -22706 -24744 742
573G42K4247l643k5468k1151M246K8769K0241j4327k7546j1780J3391K8635J1344
$$ 742 24989 21346 -4122 -25273 -21027 7742 27983 13656 -13890 -25670 -12279 16356 27700
586B7700j8873k7076o816K1569K5246M04k2571k4041J636K8935J9216j0340k3395
$$ 27700 8827 -18249 -25065 -3496 21750 22154 -417 -24458 -22822 6113 25329 14989 -8406
599h406j5763R455K7346J3615j4847k6667r416J9129K3437M133j9075k5367L39
$$ -8406 -24169 -14714 12632 26247 11400 -15267 -24683 -5554 17883 22016 2941 -22426 -22087
612b2087K4748J9042m220k2529j8616Q273K5620J3998j1711k4884r537J4176K1048
$$ -22087 2661 21703 17483 -5046 -23662 -15389 10231 24229 12518 -12366 -21903 -7727 13321
625A3321Q103j6384k4818j304K0359J9497J028k1663j9631N119K2450J6488q791
$$ 13321 21424 5040 -19778 -21082 -723 18774 19802 -1861 -21492 -16373 6077 22565 13774
638A3774k3564j0755J0399K1715J0222j6720k2630k458J6365J9949K743j8800
$$ 13774 -9790 -20545 -10146 11569 21791 5071 -17559 -20017 -3652 16297 19040 240
650B40j7834J473K0043J6270o510k0125j2518N967K1915J1618j3218k0308p007
$$ 240 -17594 -16121 3922 20192 13682 -6443 -18961 -12994 8921 20539 7321 -12987 -19994
663a9994J3336K1065M711j5945j9341j362J9827J6982m493j9265j5000N656K2310
$$ -19994 -6658 14407 19118 3173 -16168 -17530 2297 19279 14786 -4479 -19479 -13823 8487
676H487J0446j0769j9240q565J2514J9896N431j3358j8681k147J7001J4325l56
$$ 8487 18933 8164 -11076 -19641 -7127 12769 18200 4842 -13839 -15986 1015 15340 14984
689A4984j6320j6965L465J9557J2671n755j8790j1611R502J8981R216j1440k0666
$$ 14984 -1336 -18301 -14836 4721 17392 11637 -7153 -18764 -9262 9719 18935 7495 -13171
702a3171l544J4698J6247K473j6676j7417K839J6572J3523l440j7718j0265O679
$$ -13171 -16715 -2017 14230 16703 27 -17390 -14551 2021 15544 12104 -5614 -15879 -9200
715i200J6744J0472r982j8031n345J0089J6474N427j4363j6262j158J4263J5180
$$ -9200 7544 18016 8034 -9997 -15342 -5253 11221 16648 2285 -13977 -15135 -872 14308
728A4308j499j5880j1193L332J6723J0992p946j5938p723P534J7467M956j2036
$$ 14308 12809 -3071 -14264 -10932 5791 16783 8837 -7101 -14824 -7290 10177 15133 3097
741C097j4466l761J2911J4668j85j2972j2436K165J6069J0054n825j4142r583
$$ 3097 -11369 -15130 -2219 12449 12264 -708 -13144 -10979 5090 15144 9319 -4823 -14406
754a4406O642J5581N732q404j4539n472J1979J3612J776j1569j3601J533J4291
$$ -14406 -7764 7817 13549 5145 -9394 -14866 -2887 10725 12501 932 -12669 -11136 3155
767C155J0696k805j4301j0925N688J3979P366p141j4702m892J0250J2903L689
$$ 3155 13851 11046 -3255 -14180 -8492 5487 12853 5712 -8990 -13882 -3632 9271 12960
780A2960j0790j3275M3J1897J1307o00j4039j0170M020J2120Q658n485j4191n528
$$ 12960 2170 -11105 -11062 835 12142 11542 -2497 -12667 -8647 3473 12131 6646 -7545 -13073
794a3073P578J3301N957j0332j3122j503R885J2609J86j2431j0057P84J1962J0098
$$ -13073 -5495 7806 13763 3431 -9691 -11194 -1309 11300 11486 -945 -11002 -10218 1744 11842
808A1842m788j2760o671N564J3706O266q153j1806m683Q496J2973P84j0262j0585
$$ 11842 7054 -5706 -12377 -6813 6893 13159 5006 -6800 -11483 -2987 9986 10770 508 -10077
822a0077o49J1651R872l133j0766q857L926J3492O350n498j1344o518P672J1795
$$ -10077 -10726 925 10797 7664 -3102 -11959 -8033 5459 11809 6311 -5033 -11551 -3879 7916
836G916K428p979j1801j757J0904R588m95r932j0082L121J1811O815l005j1627
$$ 7916 10344 2365 -9436 -11193 -289 9299 8804 -1128 -11210 -8089 3722 10537 7532 -4095
850d095o527O398J0257M098o791j1824k232Q875R399K098r648r712K071R608P879
$$ -4095 -10622 -4224 6033 10131 3340 -8484 -10716 -1841 7558 9656 8 -9704 -7633 1975 9854
865I854j864j0984o458L918R969N715o698j0615k877O673J0032L196r136q707
$$ 9854 7990 -2994 -9452 -5534 4435 10150 3452 -7163 -10040 -3367 6665 9861 725 -7982
879g982J48Q384Q876j537j0200o384K354J0151O127o145r320m236M958J0911L302
$$ -7982 -7834 550 9426 7889 -2311 -8695 -6341 3810 9937 3792 -5528 -9764 -4806 6105 9407
894I407p453q201j736P765Q764o82q603p885J226J0483N780m050q676n822M894
$$ 9407 1954 -6247 -7983 -218 8546 7864 -739 -8624 -7398 3085 8865 4815 -3861 -9683 -4789
909d789J0226K962n385q611k372P521P732P37p514q604M84R090N879j404q796
$$ -4789 5437 8399 3014 -5597 -7969 -448 7284 8021 507 -8097 -7613 1477 7356 5952 -2844
924b844o676M349R424M420m443r124k823O300P444K700p586r050R58P240O191
$$ -2844 -9520 -5171 4253 8673 4230 -4894 -7717 -1417 6027 8727 1141 -7909 -6951 289 6480
939F480J43q553o422L283P907N196l423q277l570M154Q394L609p357q466l23O006
$$ 6480 6623 -1930 -8352 -5069 2838 8034 4611 -3666 -7236 -3082 5312 8921 1564 -6902 -7225 -1219
955a219P206M60p918n542J561P882N437l345p187m132K937Q569K763n665o394
$$ -1219 5987 6447 -1471 -7013 -5452 2430 7867 4522 -2665 -6797 -3860 4709 7472 1807 -4587
970d587k402M257P976Q59n707o702j23P995N577j573o782o274K601Q919L194m388
$$ -4587 -6989 -2732 5244 6103 396 -6306 -6429 1566 7143 5570 -1212 -7486 -4885 4034 7228 2840
986B840p159l522N384P354J285n576o615M22O982M424o43n677o046K556O442K918
$$ 2840 -4319 -7841 -2457 4897 6182 606 -6009 -5587 1395 5819 5176 -501 -6547 -3991 2451 5369
1002E369j550o898m096M002O487L174m447p060n39M847O110J950p056p574K562
$$ 5369 3819 -3079 -7175 -3173 3314 6488 2041 -5019 -5558 -711 5399 7349 293 -7281 -4719
1017d719O333M089j718p136l640L509O896K559m787n133o43L004O313J573o392
$$ -4719 1614 5703 3985 -3151 -6791 -3282 3614 6173 1386 -3747 -4390 -1386 4927 6500 108
1032A08n026O41M279M875n82n908m386J200P359L991l988n293k859L552P330N10
$$ 108 -4918 -4277 2 4877 4295 -1613 -5999 -4799 2560 6551 2563 -2730 -5589 -2037 5293 5803
1048E803n729m506l98L922N531n41n220m862J659O853K526k079l936m286K703
$$ 5803 74 -4432 -4830 -908 4623 4082 -1138 -6000 -4341 2512 5038 2959 -977 -5263 -2560
1063b560O305J378l179n601j756M179N174O65m815n923J910N878K970m38n118
$$ -2560 3745 5123 1944 -3657 -5413 -1234 3940 4605 -210 -6133 -4223 1655 4625 4187 -931
1078i31m359K783N477J976l131n443j391L217M835J700m541m935J141L916L871
$$ -931 -5290 -2507 2970 4946 1815 -3628 -5019 -1802 3033 4733 192 -4743 -3602 314 4185
1093D185P72n768l989K022M647L296k705n581k101K448N630J999m666m118L18
$$ 4185 4957 -811 -4800 -2778 1869 5165 2460 -3121 -5222 -2774 2856 4855 189 -3929 -3611
1108c611L038N105N00n534l511R74M362L249k319m289k371J158N778K035l564
$$ -3611 -573 4532 5032 -502 -4013 -3039 1323 4572 2253 -2036 -4407 -3249 2529 4564 1000
1123A000l419k110L338N675N4m288m052L64M192L507j370m214l801K170N869N22
$$ 1000 -2419 -4529 -1191 4484 4538 250 -3802 -3438 754 4261 2891 -1323 -5124 -2954 2915 3437
1139C437k011l112k074K659M707K47k866m335m58M081K585K22l793m280J826M639
$$ 3437 1426 -1686 -3760 -1101 3606 3853 987 -3348 -3806 275 2860 3082 -711 -4991 -3165 1474
1155A474J957m12m636k895L432M371J004l305m347j9K862L319P08m214l705J690
$$ 1474 3431 3019 -1617 -4512 -1080 3291 4295 990 -3357 -3376 -514 2805 3513 -701 -4406 -2716
1171b716L320K825l91m405k231K105L576K379l103l839q40J718M071J179m105
$$ -2716 604 3429 3038 -1367 -3598 -1493 2083 4462 1359 -2480 -3320 -1602 2469 3648 -457
1186d57k991L20K941L860n13l905k563J166M439J645k840k916j867J811M397L23
$$ -457 -3448 -3128 -187 3673 3160 -745 -3308 -2142 2297 3942 1102 -1814 -3681 -1870 2527 2850
1202B850k850k463p64L162L517n20l144k676N61L736J648j259l404k453K022L881
$$ 2850 0 -2463 -3227 -65 3452 2932 -212 -2888 -2327 1409 3057 1798 -1606 -4059 -2037 1844
1218A844R84k159k853j663L523L432j21k243l797R96L174J647o17l470k364J896
$$ 1844 2828 669 -2184 -3847 -324 3108 2987 744 -3053 -2057 1117 2764 2147 -1323 -3687 -1791
1234a791L244J332j626l291q87K762K869P65k749l285M29K296K595o8l775k442
$$ -1791 1453 2785 1159 -2132 -3019 -257 2612 3377 628 -2657 -2228 68 2663 2595 -1180 -3622
1250c622J553K741K404j620l208p64J602L037J573k624l030m51J922L054k58l309
$$ -3622 -2069 672 3076 1456 -1752 -2516 -914 2123 3696 1072 -1958 -2409 -487 2567 2309 -1000
1266a000j445L3K643K443j141k436j562J215L315J305k494k665o44J905K783j88
$$ -1000 -2445 -2412 231 2674 1533 -903 -2465 -1250 2065 3370 876 -1789 -2433 -528 2255 2067
1282B067k465k177j70L132K071n76k256k179J360K973R13j310k534j664K319K191
$$ 2067 -398 -2575 -2745 387 2458 1882 -374 -2553 -1193 1780 2693 1383 -1151 -2815 -496 1695
1298A695J95j753k695j01K870K162j21k466k230J230K742P75o99l185j096J763
$$ 1695 1890 137 -2558 -2659 211 2373 2252 -214 -2444 -1214 1528 2303 1604 -1581 -2677 -914
1314i14K012J052j539l054K95J987K046Q76k822j988J019J656J765o83l177j125
$$ -914 1098 2150 611 -2443 -2148 -161 1885 2761 -61 -2049 -1030 626 2391 1708 -1469 -2594
1330b594J331J944J491j634k538j1J216K725P75k823j283j97K174K016r86k770
$$ -2594 -1263 681 2172 538 -2000 -2011 -795 1930 2705 -118 -1401 -1598 576 2592 1606 -1164
1346a164j043M43K327J447j263k146q14J520K579N24j936j657m32J854J782n41
$$ -1164 -2207 -1764 563 2010 747 -1399 -2213 -693 1886 2410 474 -1183 -1615 239 2021 1480
1362A480j844j936P5K903R65p87j496j785J725K392M16j220j943j022K216J377
$$ 1480 -364 -2300 -2225 678 1643 856 -640 -2425 -700 1692 2108 888 -1055 -2077 139 1516
1378A516J05j520k532P41K060Q01%j981j313J633J529Q58o57k407m57J127J463
$$ 1516 1621 101 -2431 -1690 370 1171 1171 -810 -2123 -490 1039 1897 1240 -1167 -1624 -497 966
1395I66P64k043j826P53J366J556L2k462p34R26J627J216r52k042n63N89J657
$$ 966 1730 -313 -2139 -1386 -20 1536 1568 -894 -1628 -702 925 2141 1189 -853 -1416 -827 830
1412H30N97k028p94k64J072K183j49j966p23K81J686J367j103j461j084P15J993
$$ 830 1427 -601 -1395 -1659 -587 1596 1447 -519 -1242 -961 725 2092 989 -472 -1556 -841 1152
1429A152J63j350j162r28J727K197k37j454j241k75J959J187n05j446j652P01
$$ 1152 1315 -35 -1197 -2125 -398 1799 1562 108 -1133 -1408 551 1738 1233 -213 -1865 -1164
1445a164J991J45k70j928o53J764J676rj337j200p0J483J052n5j700j717J027
$$ -1164 827 972 702 -1226 -1879 -115 1561 1552 215 -985 -1055 428 1480 1425 -275 -1992 -965
1462i65J212P52j19j701j349J812J685M73j225j546K0J147J292Q7k017j272R98
$$ -965 247 999 880 -821 -2170 -358 1327 1800 575 -971 -951 196 1488 1575 -442 -1714 -716
1479g16P00R81K05k098l38P23J288Q51p94j208m49M40J830l9j904n05m3Q00J370
$$ -716 -16 965 1170 -928 -1266 -543 745 1596 802 -406 -855 -415 1415 1376 -528 -1033 -1076 -276 1094
1498A094l40j345p19N14J665N15p91r23o09Q35J588p51j107o11m74J110J672o10
$$ 1094 754 -591 -1310 -796 869 1384 593 -330 -939 -104 1484 733 -374 -985 -1459 -349 1323 713
1516G13r64n41R1J551M48p0j356j541J246J625n57k87j471n38J364J445oj492
$$ 713 -251 -792 -701 850 1298 1228 -128 -1669 -423 1202 645 358 -1113 -1651 -287 1158 1152 -340
1534c40r67Q32R45O22K2j425j310J662N41N5m41j245k79J035R00M51r91j065N45
$$ -340 -1307 -475 470 1092 1114 -311 -1621 41 582 637 196 -1049 -1328 -293 607 1058 67 -998 -453
1553d53K07J689j58k102n26P42P22P55k48j805L5Q01J288%j057l17M5M51J298
$$ -453 -246 1443 1285 -817 -1343 -601 121 876 628 -1177 -1142 -341 947 947 -110 -427 -382 69 1367
1572A367l74j421n13K15O07R69l46j262o37P16J772j38p97p26n01Q36J815r22
$$ 1367 993 -428 -941 -726 -119 850 504 -758 -1395 -679 1093 955 158 -568 -1069 -233 1582 660
1590F60q40o95k27J154O64o72n29o18R46Q73K3Q3j014q95J216P30k10m42j041
$$ 660 -180 -875 -1102 52 716 44 -485 -1103 -157 716 739 822 -192 -1087 129 859 649 207 -834
1609h34k45Q86P71L2q96p75P22Q73L41K01j624m43R02P69J45n51j457J78N00J240
$$ -834 -1079 -193 578 610 -286 -1061 -339 534 875 1076 -548 -991 -89 680 825 274 -1183 -1005 -505 735
1629G35R3j205m98P31l2J137M2j460l28O20K55M73l70r74j47K58J507J55j297
$$ 735 828 -377 -875 -144 -176 961 1003 -457 -785 -165 90 563 193 -781 -928 -670 837 992 -305
1648c05j58k04Q38J242o62j133J08pK48L45k63l68q13O74R25J01m42l87n79Q64
$$ -305 -463 -667 171 1413 751 -382 -274 -281 -33 312 49 -319 -1132 -458 467 568 126 -261 -840 24
1668B4J245n07q34m42m81J365M05n86q21o27R44R90j05k72n53m04J312L0Q5o06
$$ 24 1269 762 -72 -514 -995 370 775 189 -632 -1259 -315 675 570 298 -255 -659 653 683 768 162
1688A62j015J18O41N29J30q94p90J105K78L36j4r42k81Q39J48K96q24l47P5M2
$$ 162 -853 -735 -94 435 565 -329 -1119 -14 264 600 586 -356 -637 202 350 646 -178 -525 -450 -408
1708d08J059k80o45o45P45K41Q98l66j011k31P77O60J04p81o09j39l3J045j39
$$ -408 651 371 -274 -919 -174 67 965 599 -412 -643 134 794 898 117 -492 -631 -664 381 242
1727B42o19r7j69P17Q60k92n19n45P7R87M4o34l70q22Q07R92m15l70n07P6R48
$$ 242 -377 -474 -643 74 934 642 123 -422 -345 642 686 52 -318 -1140 -333 659 244 -126 -633 -557 391
1748C91L30l44l01l19m1N92J08l9o75n06N74N18K66l44r57J73R41J86Q3n06q45
$$ 391 721 377 76 -243 -284 308 416 377 -298 -804 -230 288 554 210 -747 -574 367 553 636 130 -715
1769g15P35J62J65K6j019K62K52J86M16k49m72q2L94N05J85p55n37K81J67O69
$$ -715 20 182 347 373 -646 -384 -132 54 470 221 -251 -333 61 566 751 -4 -541 -260 -93 576
1789E76l91j040M38R3M24M14o62J32j20K45N25L5o56k5q67P08P88p74m99l9j1
$$ 576 185 -855 -417 -324 100 514 -148 -16 -136 109 634 669 13 -12 -879 -171 617 -157 -656 -695 -706
1810g06R26L12n03j9p1Q6Q23k64m98k93l73M53J77J09j48o55J10Q74J96o9l60
$$ -706 220 532 29 10 -61 25 848 584 86 -207 -580 -127 50 159 11 -644 -534 340 536 467 107
1831A07p35M09R47m53p3o21k57P60j23J07k42k43J22L17L84L42p03l39L73K42
$$ 107 -628 -219 728 275 202 -419 -676 84 -39 68 -174 -417 -295 22 406 748 45 -294 79 321
1851C21L13l77r76J94M95k6N01n23j96L06Q9L39P2o97k8Q8J33O27l41o02l30J89
$$ 321 634 257 -719 -525 -30 -56 445 -78 -274 32 121 460 532 -165 -193 -105 28 655 314 -288 -618 -429
1873d29M85M36q10j03q2N17Q08j64r38L26m50O44K49m32l01p3q9K78N17o9l63
$$ -429 56 492 -318 -421 -503 14 822 658 -280 46 -404 240 489 57 -244 -317 -406 -128 389 320 -43
1894d3p45O36O77K1l11m94m1L94L03n26k40j60J09O04M1J47l73k66N11J77K9k0
$$ -43 -788 -152 525 546 235 -259 -300 94 397 -129 -369 -529 -420 184 225 372 -1 -267 244 421 450 430
1916D30p13o4J45J85J59m52n02Q63J23K08j79p09N41J75p5J40J47o26j1k6M21
$$ 430 -283 -347 -202 -17 142 -310 -812 51 174 382 203 -506 35 210 135 275 422 -204 -215 -241 180
1937A80K15m13n04R8J32Q28n6r88M14K91J66M65r92M53l46j82K17J55m02J23k26
$$ 180 395 -18 -522 -424 -292 536 480 -508 -94 197 363 828 -164 289 -57 -239 -22 133 -269 -146 -372
1958c72J35P35j74o59J27J06N66k3k47n31j81M80O1p9l18K47l52M96K53l35M85
$$ -372 -237 498 324 -335 -208 -102 464 441 194 -337 -518 -38 23 -56 -374 -127 -479 17 270 -65 420
1979D20p33K90J66K41l45j11n44K00O76p8o0m33J31J062o78j66j54m5N6K00o0
$$ 420 -313 -23 143 384 39 -72 -616 -416 260 182 122 -311 -180 882 204 38 -116 -161 -105 95 35
2000C5J62o23J30L84m72N91J4l61k21N49MO25p42k02j21J08M60l02k84Q8l21K36
$$ 35 197 -426 -296 88 -384 207 221 -140 -361 188 192 817 75 -127 -248 -140 320 18 -266 -178 -499 -263
2022b63L38j5k26K51K13q8M09o19Kl73K07N47m92j04J83m01L77L86k93j97J6J53
$$ -263 75 60 -166 85 298 210 619 0 2 -371 -164 383 -109 -213 -30 -431 -54 332 39 -158 -142 11
2044A1K26j05N9J57o86N05J8k90O0j92n52J051K15j30l08k85N36LP5p0n69q6K42
$$ 11 237 132 191 348 -338 167 185 -105 -45 -237 -789 262 477 347 39 -246 290 293 368 298 -271 -357 -115
2067a15L53m62K05k82N8J79L64L0m01j02J52n5L77J45r70J66N39m78J79M3l53
$$ -115 238 -224 -19 -301 -243 -64 300 330 -71 -173 -21 -76 301 446 -524 -358 181 -297 -118 -75 -428
2088d28J80K79o0K79j69j85J75m33O98j29k70k00j35K24N31m55j56J30J54O34
$$ -428 -248 31 -29 250 81 -104 71 -362 336 207 -63 -263 -398 -174 357 -98 -254 -124 30 664
2108F64k95n29M77k97p5N63o54j96J35j05n1N47k77J03l49K49K60J50r5j70l40
$$ 664 369 -160 317 20 -55 508 -146 -342 -207 -312 -363 184 -93 10 -339 -90 170 320 225 55 -285
2129b85M23K23n18P0j72j07K58J77n3K7m15M21J19J0L09p47R1O47k92L6l27k43
$$ -285 138 361 -157 -87 -259 -366 -108 69 16 43 -372 49 168 178 487 -260 -169 478 186 222 -105 -348
2151c48M17j53K08j02k93L71K61l98L04J27p06PK2J83K15j78j88k80K36R17n53
$$ -348 69 -84 124 22 -271 100 361 -37 267 394 -312 -305 -283 -100 115 -63 -251 -531 -295 622 69
2172F9k98N79j47j43K98l5n31M36l80k12L64j76L15n80J53P27l90k75M8R2K69
$$ 69 -229 350 203 60 358 323 -208 228 -152 -364 0 -176 139 -441 -288 439 49 -226 -178 -86 183
2193A83L22l76l98J68J02qM0j09r5K4L17J55l25k3M44l43J37k1n4j33m54K04L39
$$ 183 505 129 -269 -101 1 -7 33 -76 -171 -147 170 325 0 -23 421 78 215 194 140 7 -447 -243 96
2216I6m40M78m68J0O04k50J15K6k11J60J15j42Q5k73k31J95k5K68K12o77K24K76
$$ 96 -344 134 -334 -324 280 30 145 171 -40 120 235 93 178 -95 -326 -131 -156 112 324 -353 -129 147
2238A47j87M47j83m78K99J22k8J86q26M21l2k76N08k32j4K22l95N21L67o42p6
$$ 147 -40 407 224 -254 45 167 139 325 -501 -80 -112 -388 120 -112 -126 96 -299 222 589 -53 -129
2259a29J01L31o7r5m94N71n16K18J25j14J16jJ15Q7q2K04j4o49L24J66j56O0j95
$$ -129 -28 303 236 141 -353 218 -298 -80 45 -69 47 46 161 248 166 370 356 -293 31 197 41 101 -94
2282i4k05O49k80j43L86n47M85j8k25R3n1rO1l4j67l5j1j08L15k70J53O5n75P82
$$ -94 -299 350 70 -73 313 -234 251 233 8 101 50 41 102 68 -99 -134 -145 -253 62 -208 -55 10 -565 217
2306B17Jl2On62M48L93p55K31k6k74N35o17M29R9J09k51J89j06K31k2m11K08l70
$$ 217 218 186 192 -370 78 471 -284 -53 -79 -353 182 -435 -6 93 202 -49 140 34 265 243 -168 40 -330
2329c30K24J58j42r9q5lN41l11o7M77l28l6K71j58k16n7k44N39k12n8K64j80Q0
$$ -330 -106 52 -90 -189 -274 -277 264 -47 -114 363 35 -1 270 112 -104 -161 -405 134 -78 -136 128 -52 28
2352B8j4K69j49j7k78M87P3o25M36k65p1M3k46O2K14j04J60K71j44R2k89M1J26
$$ 28 14 283 134 117 -161 326 399 -226 210 -55 -126 -83 -329 -267 -53 -157 3 274 130 222 -67 -26 100
2375A00J11l27L02o33L09M51m34K59l97K41K90k08O1L72n27L0J07K2J10m81Q3
$$ 100 211 -116 186 -447 -138 313 -121 138 -259 -18 272 64 125 497 -30 0 107 129 239 -242 -159
2396a59J8o5N9N15n20J62P6j61N54l80m0J79n48L58J25k21QJ4j17M0kJ06M0l70
$$ -159 -141 -206 -147 368 -152 10 86 -75 479 99 59 238 -310 48 173 -48 -40 -26 -143 -103 -105 1 41 -329
2420c29L60J42j1j85J79m84L90m1oN4n04K05O1r2M26k36k9O00l94j21J09k60j28
$$ -329 31 173 162 -23 156 -328 62 21 15 69 -435 -230 -169 -261 165 -71 -100 500 106 -15 94 -166 -294
2443b94L02k3j11p8k09K65l8L64o0k10j3N8P5R8J71l78m7L78l52Q6l98M08J09
$$ -294 8 -15 -126 -204 -413 -148 -186 178 118 -92 -105 -47 28 126 297 -81 -128 250 -102 -16 -414 -6 103
2466A03q1K8L34l45q3K02p1K73l30k22P4m6K35O5n26M72l79K72M99m07m4K90j83
$$ 103 22 50 384 39 -44 158 87 360 30 -192 -118 -164 71 136 -390 82 -297 -25 474 67 23 313 130
2489A30oj8l81K18m3J10K09l78J89o1l30M77P7l65K92J8J05oQ7m65r8M8N8n5K23
$$ 130 124 106 -275 -57 -100 10 219 -159 30 -31 -361 116 193 -172 120 138 243 237 324 -141 -239 -191 -133 -188 35
2514C5J47j11kJ78r3k99J62K5J22k99o2L5j06J28q9J29J22M44r99M98J71K9p0
$$ 35 182 71 69 247 154 -145 17 42 164 -135 -197 -162 -268 -140 -229 -100 22 466 -533 -35 136 165 95
2537I5j57K94k01K5N8j55r3K04j69j57L83Jk64R8J54J82m6l5j43k9R4n1l90R0
$$ 95 -62 232 31 56 114 -41 -134 70 -99 -256 127 128 -136 -38 116 298 252 217 74 45 139 88 -302 -212
2561b12P1l23N65NJ05k01K14j51k19L36Lj58J01k42L09l94K08R7l10L80j00j97
$$ -212 -141 -464 101 106 211 10 224 73 -146 190 193 35 136 -106 203 -191 17 114 -196 184 84 -113
2583a13L81l05J63K56k82Q7j13j88J83j06k02K94j69J54L02l62J67L7j79K23K3
$$ -113 268 -37 126 382 100 187 74 -114 69 -37 -239 55 -114 40 342 -20 147 184 5 228 251
2604B51k97N11o95L56O3n51N46k44l19N22j60J23O5p8j05M7k99N30m58l3J18r3
$$ 251 -46 465 -230 126 189 -362 184 -60 -379 143 -17 106 171 93 -12 35 -264 266 -192 -225 -107 -200
2626b00J12J60j24J0l2n0J86R8j15J59o3o3K07l29k41L73l58K00l10L46k16J80
$$ -200 -88 72 -52 -42 -74 -124 62 160 45 204 141 78 285 -44 -285 88 -270 -70 -380 -34 -250 -70
2648g0L71j35l29J51K44l56L97j50k55L6o6o3K98j00p5j27M76j11j67J87L37n61
$$ -70 301 166 -163 -12 232 -124 273 123 -132 -96 -162 -225 73 -27 -102 -229 247 136 -31 156 493 -68
2670f8k44N09k37j17L55n43M27j38Q0J14J31j40p1p6J26M6m15M46q1l9r3n2k49
$$ -68 -312 197 -40 -157 198 -345 82 -56 24 138 269 129 58 -18 108 154 -261 185 104 65 -28 -80 -329
2693c29M98k08P4j64O1K23j79j4K52N3l55K24k34L10m87R7K08k51JJ64L4Q0J07
$$ -329 169 -39 35 -129 -68 155 -24 -38 214 267 -88 136 -98 212 -275 -178 30 -221 -220 -56 -22 58 165
2716A65j61K5J55k25K35l1m90K57J0J59p5j99O0K40k61L35l54K14J1J53l15L00
$$ 165 4 29 184 -41 194 163 -327 -70 -60 99 24 -175 -115 125 -136 199 -155 59 70 223 -92 208
2738B08l23p0J46q4K23l38r8N60l07K05L1m39N83j96N7m74M6Q9J71n3k83K21L13
$$ 208 -115 -185 -39 -123 100 -238 -336 224 -83 122 153 -286 297 101 158 -316 -270 -181 -10 -63 -346 -125 188
2761A88k31J60R3Q3l04k10J46n8J09O0n63M92O5k13K87k72J0M63j88j01K21l53
$$ 188 -43 117 210 293 -11 -221 -75 -133 -24 36 -527 -35 30 -183 104 -168 -158 305 117 16 237 -116
2783a16M1M2K65jk00k11Q5P5nj28j18J86K92k92J35Q0q6J53k51K51k84r7Kl7o4
$$ -116 -75 -33 232 231 31 -180 -95 -20 -25 -153 -271 -85 207 -85 50 130 44 197 -54 197 -87 -184 -182 -219 -283
$$ [...]
8191A74
##END NTUPLES=NMR FID
##END=
