##TITLE=1H_Ser Am-O-NEA-2
 200.13MHz,CDCl3,
 8 sc
 
 23.6.2025
##JCAMPDX= 6.0         $$ Bruker NMR JCAMP-DX V2.0
##DATA TYPE= NMR FID
##DATA CLASS= NTUPLES
##ORIGIN= UXNMR, Bruker Analytische Messtechnik GmbH
##OWNER= pz
$$ XWIN-NMR		Version 3.5
$$ Mon Jun 23 16:36:57 2025 Russian Standard Time (UT+4h)  she@DPX200
##.OBSERVE FREQUENCY= 200.1313
##.OBSERVE NUCLEUS= ^1H
##.DELAY= (6, 6)
##.ACQUISITION MODE= SIMULTANEOUS
##.ACQUISITION SCHEME= undefined
##.AVERAGES= 8
##.DIGITISER RES= 18
##SPECTROMETER/DATA SYSTEM= spect
##.PULSE SEQUENCE= zg30
##.SOLVENT NAME= CDCl3
##.SHIFT REFERENCE= (INTERNAL, CDCl3, 0, 14.3821)
##AUDIT TRAIL= $$ (NUMBER, WHEN, WHO, WHERE, WHAT)
$$ ##TITLE= Audit trail, XWIN-NMR		Version 3.5
$$ ##JCAMPDX= 5.01
$$ ##ORIGIN= Bruker BioSpin GmbH
$$ ##OWNER= she
$$ F:/spectra/data/she/nmr/H-C/1/audita.txt
$$ ##AUDIT TRAIL=  $$ (NUMBER, WHEN, WHO, WHERE, WHAT)
(   1,<2025-06-23 16:35:23.67 +0400>,<she>,<DPX200>,
      <created by zg, POWCHK disabled, PULCHK disabled
       configuration hash MD5:
       00 E9 B6 7A A2 85 ED C7 34 08 36 98 17 FE 4E 26
       data hash MD5: 16K
       69 F0 59 5B 2F 2B 63 36 4C 5B 2B 90 57 61 0E A9>)
$$ ##END=
$$ 
$$ hash MD5
$$ 1D 9B 74 93 C3 61 9D 18 D5 6D 22 F0 C5 FB 86 B0
##$RELAX= 
##$RELAX= 
##$RELAX= 
##$RELAX= 
##$RELAX= 
##$RELAX= 
$$ Bruker specific parameters
$$ --------------------------
##$DU= <F:/spectra>
##$EXPNO= 1
##$NAME= <H-C>
##$PROCNO= 1
##$TYPE= <nmr>
##$USER= <she>
##$AMP= (0..31)
100 100 100 100 100 100 100 100 100 100 100 100 100 100 100 100 100 100 
100 100 100 100 100 100 100 100 100 100 100 100 100 100 
##$AQSEQ= 0
##$AQ_mod= 1
##$AUNM= <au_zg>
##$AUTOPOS= <>
##$BF1= 200.13
##$BF2= 200.13
##$BF3= 200.13
##$BF4= 200.13
##$BF5= 200.13
##$BF6= 200.13
##$BF7= 200.13
##$BF8= 200.13
##$BYTORDA= 1
##$CFDGTYP= 0
##$CFRGTYP= 5
##$CHEMSTR= <none>
##$CNST= (0..31)
1 1 145 1 1 1 1 1 1 1 1 1 1 1 1 1 1 1 1 1 1 1 1 1 1 1 1 1 1 1 1 1 
##$CPDPRG= <>
##$CPDPRG1= <>
##$CPDPRG2= <>
##$CPDPRG3= <>
##$CPDPRG4= <mlev>
##$CPDPRG5= <mlev>
##$CPDPRG6= <mlev>
##$CPDPRG7= <mlev>
##$CPDPRG8= <mlev>
##$CPDPRGB= <>
##$CPDPRGT= <>
##$D= (0..31)
0 0.7 0 0 0 0 0 0 0 0 0 0.03 0 0 0 0 0 0 0 0 0 0 0 0 0 0 0 0 0 0 0 0 
##$DATE= 1750682123
##$DBL= (0..7)
120 120 120 120 120 120 120 120 
##$DBP= (0..7)
150 150 150 150 150 150 150 150 
##$DBP07= 0
##$DBPNAM0= <>
##$DBPNAM1= <>
##$DBPNAM2= <>
##$DBPNAM3= <>
##$DBPNAM4= <>
##$DBPNAM5= <>
##$DBPNAM6= <>
##$DBPNAM7= <>
##$DBPOAL= (0..7)
0.5 0.5 0.5 0.5 0.5 0.5 0.5 0.5 
##$DBPOFFS= (0..7)
0 0 0 0 0 0 0 0 
##$DE= 6
##$DECBNUC= <off>
##$DECIM= 32
##$DECNUC= <off>
##$DECSTAT= 4
##$DIGMOD= 1
##$DIGTYP= 9
##$DL= (0..7)
0 120 120 120 120 120 120 120 
##$DP= (0..7)
150 150 150 150 150 150 150 150 
##$DP07= 0
##$DPNAME0= <>
##$DPNAME1= <>
##$DPNAME2= <>
##$DPNAME3= <>
##$DPNAME4= <>
##$DPNAME5= <>
##$DPNAME6= <>
##$DPNAME7= <>
##$DPOAL= (0..7)
0.5 0.5 0.5 0.5 0.5 0.5 0.5 0.5 
##$DPOFFS= (0..7)
0 0 0 0 0 0 0 0 
##$DQDMODE= 0
##$DR= 18
##$DS= 0
##$DSLIST= <SSSSSSSSSSSSSSS>
$$ [...]
##$SUBNAM0= <"">
##$SUBNAM1= <"">
##$SUBNAM2= <"">
##$SUBNAM3= <"">
##$SUBNAM4= <"">
##$SUBNAM5= <"">
##$SUBNAM6= <"">
##$SUBNAM7= <"">
##$SUBNAM8= <"">
##$SUBNAM9= <"">
##$SW= 18.0517328524113
##$SWIBOX= (0..15)
0 0 2 0 0 0 0 0 0 0 0 0 0 0 0 0 
##$SW_h= 3612.71676300578
##$TD= 16384
##$TD0= 1
##$TE= 0
##$TE2= 300
##$TE3= 300
##$TEG= 300
##$TL= (0..7)
0 120 120 120 120 120 120 120 
##$TP= (0..7)
150 150 150 150 150 150 150 150 
##$TP07= 0
##$TPNAME0= <>
##$TPNAME1= <>
##$TPNAME2= <>
##$TPNAME3= <>
##$TPNAME4= <>
##$TPNAME5= <>
##$TPNAME6= <>
##$TPNAME7= <>
##$TPOAL= (0..7)
0.5 0.5 0.5 0.5 0.5 0.5 0.5 0.5 
##$TPOFFS= (0..7)
0 0 0 0 0 0 0 0 
##$TUNHIN= 0
##$TUNHOUT= 0
##$TUNXOUT= 0
##$USERA1= <user>
##$USERA2= <user>
##$USERA3= <user>
##$USERA4= <user>
##$USERA5= <user>
##$V9= 5
##$VALIST= <valist>
##$VCLIST= <CCCCCCCCCCCCCCC>
##$VD= 0
##$VDLIST= <DDDDDDDDDDDDDDD>
##$VPLIST= <PPPPPPPPPPPPPPP>
##$VTLIST= <TTTTTTTTTTTTTTT>
##$WBST= 1024
##$WBSW= 4
##$XGAIN= (0..3)
0 0 0 0 
##$XL= 0
##$YL= 0
##$YMAX_a= 255689
##$YMIN_a= -306352
##$ZGOPTNS= <>
##$ZL1= 120
##$ZL2= 120
##$ZL3= 120
##$ZL4= 120
##$ABSF1= 10
##$ABSF2= 0
##$ABSG= 5
##$ABSL= 3
##$ALPHA= 0
##$AQORDER= 0
##$ASSFAC= 0
##$ASSFACI= 0
##$ASSFACX= 0
##$ASSWID= 0
##$AUNMP= <proc_1d>
##$AZFE= 0.1
##$AZFW= 0.1
##$BCFW= 1
##$BC_mod= 2
##$BYTORDP= 1
##$COROFFS= 0
##$CY= -3
##$DATMOD= 1
##$DC= 2
##$DFILT= <>
##$DTYPP= 0
##$F1P= 0
##$F2P= 0
##$FCOR= 0.5
##$FTSIZE= 0
##$FT_mod= 4
##$GAMMA= 1
##$GB= 0.15
##$INTBC= 1
##$INTSCL= 1
##$ISEN= 128
##$LB= 0.25
##$LEV0= 0
##$LPBIN= 0
##$MAXI= 10000
##$MC2= 0
##$MEAN= 0
##$ME_mod= 0
##$MI= 1.114404
##$NCOEF= 0
##$NC_proc= 0
##$NLEV= 6
##$NOISF1= 3.799351
##$NOISF2= 2.8
##$NSP= 1
##$NTH_PI= 0
##$NZP= 0
##$OFFSET= 14.38212
##$PC= 1
##$PHC0= -1201.661
##$PHC1= 16.7922
##$PH_mod= 1
##$PKNL= yes
##$PPARMOD= 0
##$PSCAL= 0
##$PSIGN= 0
##$REVERSE= no
##$SF= 200.129724274929
##$SI= 16384
##$SIGF1= 3
##$SIGF2= 2
##$SINO= 400
##$SIOLD= 16384
##$SREGLST= <1H.CDCl3>
##$SSB= 0
##$STSI= 0
##$STSR= 0
##$SW_p= 3205.1282051282
##$SYMM= 0
##$S_DEV= 0
##$TDeff= 0
##$TDoff= 0
##$TI= <>
##$TILT= no
##$TM1= 0
##$TM2= 0
##$TOPLEV= 0
##$USERP1= <user>
##$USERP2= <user>
##$USERP3= <user>
##$USERP4= <user>
##$USERP5= <user>
##$WDW= 1
##$XDIM= 8192
##$YMAX_p= 0
##$YMIN_p= 0
$$ End of Bruker specific parameters
$$ ---------------------------------
##NTUPLES= NMR FID
##VAR_NAME=  TIME,          FID/REAL,        FID/IMAG
##SYMBOL=    X,             R,               I
##VAR_TYPE=  INDEPENDENT,   DEPENDENT,       DEPENDENT
##VAR_FORM=  AFFN,          ASDF,            ASDF
##VAR_DIM=   8192,          8192,            8192
##UNITS=     SECONDS,       ARBITRARY UNITS, ARBITRARY UNITS
##FACTOR=    0.0002768,     1,               1
##FIRST=     0,             0,               0
##LAST=      2.2672688,     0,               0
##MIN=       0,             -306352,         0
##MAX=       2.2672688,     255689,          0
$$ Real data points
##PAGE= N=1
##DATA TABLE= (X++(R..R)), XYDATA
0 0 0 0 0 0 0 0 0 0 0 0 0 0 0 0 0 -8 8 -8 8 -8 13 -16 16 -21 24 -27 32 -37 41 -48 55 -61 69 -78 91 -101 112
37 112 -126 141 -157 175 -192 213 -236 261 -287 317 -349 384 -423 465 -512 566 -624 693 -768
56 -768 855 -956 1078 -1219 1394 -1615 1901 -2285 2832 -3674 5113 -8042 16315 -88856 -306352
71 -306352 -26085 198837 70156 -90642 -28491 70730 53680 -6199 -26969 -54739 -38194
82 -38194 38631 61092 -13619 -71504 -16388 86929 33829 -114460 -86458 66018 85475 557
94 557 -31523 -11016 -8730 -1429 35731 16990 -50556 -16749 69678 49220 -25810 -38526 42
107 42 20034 -4299 -21168 -13177 -13139 6156 29592 -10286 -52771 -7106 63966 43594 -45273
120 -45273 -46914 50874 69602 -9044 -36831 1131 21167 687 -19837 -7099 3668 -8969
132 -8969 -1810 16888 6460 -14781 -12812 9015 7528 -18331 -1530 37873 21279 -9610 -3119
145 -3119 3735 -1003 4291 10822 4721 -3483 4362 14020 1726 -15725 -26213 -22815 4230 17735
159 17735 1028 4209 20554 2440 -18894 -3050 17848 12275 3059 13226 18996 5176 -6399
172 -6399 -10495 -13557 -11213 -6326 2815 15471 9372 -7183 -7388 -6350 -15481 -7251 21043 24435 -1037
187 -1037 -5679 14173 13161 -7757 -10617 3585 8034 2489 5180 10597 -1473 -20548 -17488 1889
201 1889 3135 -11024 -5500 14020 8674 -8441 -3514 8792 8277 4903 5920 4894 1495 5696
215 5696 11145 -1289 -16682 -9404 5917 6654 -8158 -17335 -4538 7261 -558 -2664 4482 1356
229 1356 -1880 4353 7635 -522 -3288 12321 18982 -2445 -11899 1892 5838 -2852 -10795 -9717
243 -9717 3832 8003 -1204 -7656 -12531 -10351 2246 7038 3577 233 5138 17725 8282 -13951
257 -13951 -4936 12263 5970 -3102 -1706 5177 5079 -7703 -12408 -8916 -10052 -1438 7246 2257 579
272 579 329 -437 2902 -1584 -1841 9068 8859 4270 5603 2415 -582 -5148 -8608 721 1248 -6920
288 -6920 -129 3092 -4995 -8590 -7894 148 5459 -940 2013 7508 2756 3835 4146 -866 3460 5024
304 5024 2254 2882 -3370 -4154 544 -5705 -7392 -3369 -2969 1105 -1475 -7580 836 3661 -991 3432
320 3432 5097 4769 5191 702 2237 3013 -3474 768 3899 -2541 -1551 -2578 -6299 -3621 -5197 -4646
336 -4646 1175 -368 411 2728 -1297 571 2133 644 6446 5673 1559 6153 3699 -3010 -2565 -2337
352 -2337 -1587 -1511 -5129 -847 279 -6519 -4633 -2565 -2954 2219 2313 1377 5553 4005 2639 2729 -783
369 -783 1677 4962 1987 1144 -1750 -3722 -26 -3968 -7965 -2923 -963 -522 -446 -3021 -866 1344
385 1344 -564 2628 3512 2183 5402 5404 2023 246 -981 568 987 -2024 -1286 -947 -4226 -3377 -3331 -5459
403 -5459 -2421 -34 195 2296 2512 1039 567 2417 4992 3021 818 3943 3519 -63 -304 -2616
419 -2616 -5308 -1508 265 -3460 -4481 -1530 -791 -3253 -2399 384 -58 1821 6143 3911 261 1487
435 1487 3344 2440 1893 35 -851 1450 1904 -4246 -7711 -2398 -205 -3642 -3968 -807 213 215 103
452 103 177 1376 2725 3803 3658 4003 2593 -607 620 1604 -2894 -2754 1573 -608 -4530 -3659 -2729
469 -2729 -2413 -2117 -1454 -286 1214 2990 1416 -403 3993 4421 -1000 2462 5520 759 205 710 -3063
486 -3063 -3034 -611 -2281 -4593 -2375 1033 -2768 -5579 1610 1617 -2855 2921 5368 676 2262 3364
502 3364 1553 2895 2124 -1174 -814 2059 1226 -6303 -6150 2181 -603 -6248 -1430 -1401 -1976 3685 615
519 615 -3505 1649 5246 4027 2244 1553 1560 398 3520 3957 -6041 -5692 4325 758 -5039 -4488 -4639
536 -4639 296 3117 -4902 -6542 2501 8064 3089 -4294 701 6627 1638 1806 3155 -2381 1304
551 1304 5337 -1553 -4684 -3772 -3669 87 -378 -4354 -3507 1508 4817 -2283 -9214 2345 10335 2036
567 2036 -1300 1764 4611 5973 -1500 -6617 1764 4811 -1287 -4575 -1991 1609 -2290 -6436 -2585
582 -2585 -1073 -1176 3660 1291 -1772 2236 2196 2293 3985 -307 -434 5766 3810 -3072 -4029 2009 3246
599 3246 -5323 -5767 487 -2018 -2445 489 -3456 -1743 4277 957 -1215 2624 2385 -292 1834 6346
615 6346 4074 -2823 -89 2518 -3235 -3067 -947 -3772 127 2585 -4449 -5516 110 1145 -2031
630 -2031 -2050 3093 4239 2832 4589 1641 -3726 803 4402 84 -419 68 -991 -132 -1010 -4061 -4161
647 -4161 -2238 -717 -2144 -1194 2898 1902 -336 855 61 76 3776 3022 902 2203 2304 115 -342
664 -342 -1386 -3365 -3807 -1807 -961 -1535 278 682 -3162 -3120 160 266 1170 3379 2467 1207 3153 3210
682 3210 -320 -1345 509 -728 -1656 913 754 -2237 -2670 -2443 -4195 -2267 994 -145 -1674 1399
698 1399 3392 908 782 2171 783 759 1941 973 1051 2329 675 -2593 -3500 -1848 -1207 -2306 -2157
715 -2157 -1418 -1308 850 1441 -748 -400 666 501 2061 3040 3258 3069 774 -239 -460 -1327 -1044 -1235
733 -1235 -1920 -474 -513 -1554 -1003 -2570 -2822 -377 -85 1549 3416 2234 1831 1826 470 924 935 708 1660
752 1660 -239 -680 790 -1651 -2389 -2293 -4552 -2766 333 77 666 163 -842 1217 599 989 2570
769 2570 1169 1788 2990 869 1207 998 -2807 -2105 -1212 -1761 -584 -1096 -1337 -661 -2560 -2063 -73 -437
787 -437 1613 2639 179 2364 3185 1464 1971 -8 -1571 1118 603 -8 36 -2504 -1649 -1439 -3471
804 -3471 -1469 -606 -1924 243 895 713 2653 948 154 1746 458 1660 2780 627 1656 918
820 918 -1963 -938 -1707 -2901 -835 -1786 -1711 253 -884 -399 370 -1516 29 1404 1211 3300 2863
837 2863 1081 1691 360 -83 572 -1604 -1368 -199 -1158 -197 -753 -2947 -1554 -1289 -1878 337 788 1067
855 1067 2657 1019 1417 1980 256 1228 1617 174 1324 620 -1049 -182 -1576 -2963 -2001 -2335 -924
872 -924 284 -946 -140 391 -46 1543 966 -133 1877 2092 1755 2003 815 -22 301 -1025 -1267 -1516
890 -1516 -1832 -318 -1311 -2361 -770 -898 -981 294 -164 191 2095 2001 1662 1743 1123 1104 650 282 209 -812
910 -812 -390 25 -1743 -1727 -1206 -2005 -1693 -854 -583 -421 551 1334 1539 951 898 1099 1862 1841 723 362 960
931 960 658 -891 -1048 -1512 -2630 -1615 -466 -832 -1675 -767 162 96 75 4 504 2430 3235 565 121
950 121 2045 1286 -557 -531 345 -934 -1418 109 -1245 -3062 -1302 -722 -1571 -391 -75 -375 1382 2471
968 2471 785 -155 1482 3080 683 192 1572 -82 -1096 999 -922 -2795 -1351 -971 -1456 -696
984 -696 -1118 -727 -144 1017 1543 -663 310 2875 1556 848 1341 431 1424 1645 -1390 -1642 -142 -799
1002 -799 -1327 -1829 -1346 -629 -1610 -717 -73 -954 702 1866 439 1920 1597 141 2283 1846 -996 339
1020 339 1496 -423 -1543 -960 44 -1391 -3060 -525 -532 -1698 686 -603 -1439 2614 1682 -962 1127
1037 1127 2439 1678 1023 250 521 212 374 898 -2837 -2585 1368 -1171 -3353 -358 -788 -1003 813
1054 813 -24 -760 582 1931 2483 103 359 2343 743 679 611 -2020 200 2190 -2566 -2721 201
1071 201 -1100 -1743 -1091 -753 202 -125 714 1323 -247 1422 2258 239 2181 2162 -751 732 1369 -1703
1089 -1703 -879 -38 -1066 -1781 -1219 -201 -1466 -2416 654 508 -1100 1553 1489 -109 2216 2000 -267
1106 -267 1517 2056 619 -315 -695 -100 -983 -1310 -590 -2204 -1762 1082 -879 -2467 414 722 -130 918
1124 918 1129 1329 1302 925 1166 597 698 1047 -424 -511 -342 -1708 -1127 -268 -2159 -1417 447 -720 -1369
1143 -1369 -82 619 731 560 1153 1813 1316 1445 516 -81 1077 465 -1125 -151 -67 -1817 -1358 -748 -1444
1162 -1444 -1268 47 214 -991 -346 1549 826 39 1560 1408 868 1406 792 -191 63 432 -867 -1249
1180 -1249 -651 -801 -1682 -915 -846 -1595 -503 811 -117 -190 1220 1395 643 817 1748 1429 991 719 12
1199 12 -160 -137 -825 -1293 -576 -1266 -1565 -591 -801 -963 -529 543 531 -107 698 1669 833 862 1373 878 642
1220 642 827 -431 -163 -108 -1127 -1519 -656 -902 -1376 -1584 -300 -79 -1092 476 1468 -78 1095 1866
1238 1866 676 971 998 748 844 32 -216 -71 -785 -569 -1073 -1548 -875 -672 -1421 -254 102 -669 777
1257 777 675 665 1359 836 1239 1434 396 1107 747 -740 -176 -321 -1149 -544 -1485 -1248 -206 -1214 -1018
1276 -1018 169 -632 142 877 478 1464 1189 645 1702 734 -18 823 -318 -59 -88 -1361 -611 -783 -1903
1295 -1903 -854 -687 -1347 -14 -319 -86 1083 356 749 1561 379 1138 1446 273 966 339 -464 118
1313 118 -1014 -1454 -618 -1140 -1107 -192 -1356 -575 93 -518 746 675 -5 1568 1238 571 1468 242 490
1332 490 660 -446 -275 -28 -1212 -416 -851 -1612 -710 -1044 -885 220 -397 -39 1313 567 994 1135 605
1351 605 1501 825 161 1037 136 -416 -134 -951 -1004 -789 -1517 -893 -513 -956 -274 -95 -209 444 686 639 1416
1372 1416 813 873 1474 446 393 351 -570 -12 -422 -1380 -877 -1069 -1222 -665 -1132 -577 -177 -251 530 963 646
1393 646 1122 1099 537 1244 742 241 354 269 -43 -394 -959 -907 -885 -977 -691 -1070 -1056 -44 39 6 581 662 509
1416 509 1083 919 1002 756 735 524 -162 -211 -361 -853 -822 -718 -1103 -830 -411 -711 -682 -90 -40 -26 548 992
1438 992 902 1166 1011 475 603 962 117 -436 -189 -398 -730 -1050 -901 -702 -1325 -560 -482 -669 273 799 250
1459 250 662 1546 700 703 987 811 413 428 225 -314 -779 -666 -758 -1251 -1173 -946 -907 106 -282 -816 622
1480 622 838 230 473 981 1178 1172 757 783 288 195 283 -713 -999 -103 -1005 -1621 -62 -606 -1282 -283 -331 -204
1502 -204 323 731 994 160 1068 1761 235 318 1177 -200 28 812 -775 -1403 -238 -592 -1391 -1354 -620
1521 -620 65 -437 21 475 -429 958 1705 -6 724 1975 474 310 610 223 -98 -683 -540 -599 -1350
1540 -1350 -564 -513 -1451 -55 147 -812 345 628 -3 1215 1352 730 1072 592 728 516 -268 89 -104
1559 -104 -669 -324 -1029 -1113 74 -1059 -1416 318 -49 -577 759 404 531 1028 974 711 428 824 1025
1578 1025 -310 -376 422 -818 -832 -105 -1199 -1089 -157 -923 -999 -202 226 158 -221 717 861 264 1122 1377
1598 1377 13 384 1162 -281 -574 12 -768 -806 -582 -1005 -388 -481 -424 -619 -356 629 690 -87 1004 1165
1618 1165 420 1116 1016 203 433 561 -269 -299 -649 -470 -966 -1156 -892 -778 -610 36 -701 -511 978 337
1638 337 -32 953 772 617 577 702 -11 -193 372 -80 -951 -799 -199 -954 -986 -180 -881 -617 427 -251
1658 -251 -393 713 1308 343 593 1197 924 276 669 402 -291 -250 76 -522 -522 -575 -945 -1209 -904 -578 -299
1679 -299 186 335 54 269 909 585 479 793 719 628 374 284 0 -333 -353 -543 -862 -593 -444 -819 -530
1700 -530 -436 -454 174 371 124 577 841 650 499 649 892 462 -163 367 6 -679 -526 -759 -871 -421 -557
1721 -557 -601 -208 -446 120 408 400 481 619 632 1150 541 407 872 26 -111 314 -396 -538 -770 -892 -402 -866
1743 -866 -669 -322 -277 -215 397 -98 326 902 242 1004 1058 285 611 569 -19 347 -375 -378 -453 -764 -668 -339 -1094
1766 -1094 -580 -187 -395 95 256 42 946 822 570 1012 641 408 455 14 401 -69 -815 -103 -582 -1296
1786 -1296 -760 -640 -720 -184 -446 -201 372 65 253 975 392 803 712 291 940 193 -61 341 -426 -786
1806 -786 -267 -837 -1159 -616 -937 -224 -307 -522 398 187 45 763 786 655 891 444 591 737 -414 239
1826 239 -259 -633 -376 -834 -821 -473 -785 -738 47 -372 -153 229 -25 682 660 470 932 719 216 603 306
1847 306 -106 80 -746 -398 -262 -839 -641 -820 -817 -167 -260 -302 435 272 119 821 581 690 779 395 583 217
1869 217 -216 72 -514 -609 -311 -784 -866 -196 -597 -493 -95 -189 302 80 178 472 727 488 702 404 597
1890 597 456 -69 -142 -221 -472 -357 -268 -395 -448 -503 -698 -234 -312 -66 99 211 503 590 404 590 484 358
1912 358 504 219 -68 -120 -302 -502 -489 -431 -643 -759 -624 22 -204 -18 318 240 234 423 773 529 532 614 367
1935 367 384 261 -103 -788 -139 -396 -617 -390 -400 -555 -451 -353 32 -148 322 529 231 627 840 513 356
1956 356 732 506 295 57 -258 -318 -264 -519 -532 -492 -615 -340 -549 -294 20 178 540 409 46 697 715 605
1978 605 392 468 109 68 -210 -402 -396 -533 -406 -472 -977 -283 -280 -765 -34 595 6 327 538 377 707 509
2000 509 493 368 114 343 45 -607 -111 -523 -852 -114 -610 -1104 -173 -379 -277 -100 -30 508 664 373 722
2021 722 643 511 874 144 3 515 -287 -224 -128 -678 -537 -187 -768 -582 -161 -320 209 -312 245 486 313
2042 313 608 708 97 765 884 -125 133 361 -463 -470 -205 -700 -504 -707 -318 -296 -591 360 181 -319 548
2063 548 685 293 773 928 162 753 288 89 -109 -305 111 -651 -874 -95 -500 -1126 39 -124 -665 472
2083 472 241 -119 528 385 685 777 315 748 324 68 320 -278 -490 -11 -707 -775 -257 -803 -560 -156 -315
2104 -315 4 286 172 517 134 435 1033 128 529 490 -53 497 304 -623 -182 -362 -548 -632 -451 -387 -432
2125 -432 -215 -217 91 -252 369 544 112 771 635 53 530 607 -101 211 -24 -338 -503 -430 -368 -478 -812 -272
2147 -272 -397 -513 23 11 71 499 510 397 747 587 449 131 161 21 -309 -235 -355 -421 -398 -262 -523 -693
2169 -693 -428 -300 -160 122 134 392 430 406 385 498 432 452 261 161 -1 -425 4 -523 -642 -601 -258 -470
2191 -470 -802 -495 -86 -339 191 419 363 413 547 401 312 655 235 84 194 -28 -367 -620 -285 -475 -777
2212 -777 -289 -343 -456 -84 57 -16 42 334 498 551 621 453 432 352 213 48 -155 53 -120 -624 -249 -253 -617
2235 -617 -251 -334 -158 199 -110 422 529 350 527 465 154 495 357 17 342 -205 -218 -148 -444 -397 -475 -496
2257 -496 -468 -510 -563 -39 -268 39 546 224 434 429 372 445 482 -33 169 234 -213 37 -209 -442 -248 -515 -216
2280 -216 -345 -793 4 -56 -326 274 557 357 554 450 488 686 141 62 225 -318 -167 -175 -668 -512 -190 -696
2302 -696 -181 -300 -495 251 32 263 389 261 490 572 196 415 556 52 299 22 -128 10 -556 -428
2322 -428 -208 -439 -570 -292 -567 -120 -24 -250 305 359 344 483 166 390 646 96 215 144 -230 93 -126
2343 -126 -539 -270 -393 -618 -121 -233 -193 -11 -204 352 360 74 633 448 454 496 347 87 369 -179 -216 -13
2365 -13 -287 -162 -426 -477 -418 -400 -298 72 52 41 375 273 275 321 314 604 444 283 207 82 -298 -239 -273 -337 -216
2390 -216 -607 -256 -343 -225 -254 90 -14 -24 174 388 379 404 482 346 154 132 196 6 -96 -340 -216 -396 -357
2413 -357 -352 -331 17 13 -210 -48 155 258 136 597 501 280 458 206 -12 120 129 -320 -313 -401 -540 -454 -267 -255
2437 -255 -507 -207 69 80 241 210 212 559 355 331 477 394 180 221 -116 8 -162 -436 -52 -472 -510 -546 -681
2460 -681 -324 51 109 119 184 196 342 413 411 593 283 196 250 -60 -181 193 -242 -367 -173 -582 -494 -373 -219
2483 -219 -168 -408 166 271 -137 337 564 274 343 762 127 175 134 -34 -194 -176 -169 -397 -336 -154 -332 -537 -133
2506 -133 124 -360 291 452 113 468 522 265 489 351 394 332 -238 34 -226 -627 -192 -334 -584 -204 -251
2527 -251 -519 133 124 -160 287 162 459 399 409 632 248 341 210 -42 -80 273 -272 -861 -237 -629 -598 -365
2549 -365 -410 -178 -117 -113 144 -4 299 662 267 257 591 84 189 365 -211 -342 -110 -282 -443 -518 -412 -261
2571 -261 -299 -156 -41 -160 173 390 -47 388 392 399 435 540 367 227 60 23 -90 16 -167 -551 -761 -343
2593 -343 -139 -417 -19 -364 -371 297 252 115 536 259 441 418 361 143 268 159 7 -519 -547 76 -390 -505
2615 -505 -90 -484 -286 -7 -13 55 259 415 439 195 282 254 258 266 410 -242 54 -92 -572 -269 -365 -337 -419 -372 -198
2640 -198 -44 -234 173 166 402 539 277 -251 431 526 103 64 69 64 185 -212 -499 -336 -462 -438 -317 -275 240
2663 240 -33 35 154 294 293 547 418 84 269 461 186 139 118 -31 -221 -67 -391 -539 -498 -307 -364 -239
2685 -239 84 -162 13 290 452 291 196 61 412 146 429 186 -105 -198 -286 -82 -228 -240 -327 -429 -231 -70
2707 -70 -133 -118 378 8 -19 571 521 301 331 305 457 192 -119 162 -110 -144 -310 -240 -470 -355 -486 -344 -56
2730 -56 -252 11 315 125 368 82 355 473 426 312 370 106 -56 195 -361 -202 -186 -403 -288 -341 -431 -24
2752 -24 -403 -225 285 106 160 470 130 447 297 319 269 134 -117 133 -278 -156 -137 -403 -386 -243 -459 -111
2774 -111 -61 -161 330 78 240 533 130 157 592 -15 607 455 26 -28 -1 -380 -268 -255 -198 -167 -705 -363
2796 -363 -173 -115 133 252 289 264 407 267 667 250 226 412 82 -176 160 -456 -175 -136 -484 -282 -153 -479
2818 -479 -80 -84 -29 148 67 236 312 380 423 449 265 743 168 -142 116 -99 -278 -143 -357 -235 -179 -541 -160
2841 -160 -224 -152 18 154 61 529 275 373 494 140 411 171 5 -325 -161 -273 -12 -336 -551 -225 -312 -322
2863 -322 -156 -68 30 408 93 253 348 109 323 315 303 302 -124 -103 -12 -156 -12 -217 -256 -298 -156 -563 -228 -142
2887 -142 -234 17 -63 152 312 511 231 334 172 164 313 -118 -37 -58 -291 -183 -349 -304 -92 -372 -217 -63
2909 -63 -191 138 39 315 176 355 453 370 327 -137 127 55 63 70 -302 -128 -206 -396 -470 -249 -208 -299 -301 -109 -101 212
2935 212 317 94 517 241 428 310 -6 115 102 -32 -176 57 -454 -186 -358 -355 -147 12 -365 112 -131
2956 -131 -91 192 326 367 465 225 158 306 306 175 55 -241 -78 -225 -350 -227 -339 -486 -261 -21 -274 187
2978 187 118 322 430 105 267 449 263 306 307 140 105 67 -191 -241 -293 -313 -410 -322 -166 -133 43 91 94 209 152
3003 152 147 323 483 -79 353 546 -101 144 -172 -421 -42 -382 -304 -267 -360 -148 23 -237 61 97 -185 172
3025 172 384 164 520 230 79 266 108 -225 -70 -254 -66 -2 -477 -150 -330 -517 40 -284 -106 -1
3045 -1 47 128 205 208 314 390 221 497 86 95 209 -232 -300 -114 -458 -243 -185 -345 -161 3 -187 -13 83 43 222
3070 222 190 147 205 219 180 377 30 120 183 -425 -201 -76 -574 -315 -285 -295 -81 -337 -124 -97 187 297 191
3093 191 -42 350 415 154 285 315 -25 -28 -199 -102 -403 -403 -273 -112 -381 -180 -115 -75 -38 27 -46 144 171 128 316
3118 316 175 243 126 170 187 -21 -317 -277 -250 -255 -342 -224 -411 -186 -46 -132 -101 36 332 147 232 448 177 415
3142 415 486 -14 128 -38 -140 -54 -214 -251 -174 -52 -226 -322 -182 11 -41 -88 80 -6 409 323 384 217 439
3165 439 74 147 11 -74 -82 -259 -162 -89 -337 -432 -85 -262 -36 -169 171 50 116 19 351 233 191 308 32
3188 32 162 137 -156 -62 -177 -353 -134 -171 -346 -321 -44 -82 -65 94 57 141 0 166 485 253 464 106 131
3211 131 139 -74 -117 -81 -241 -178 -189 -336 -341 -104 -265 -56 -191 -110 9 19 122 197 102 149 446 -29 119 -3
3235 -3 -299 -162 -221 -274 -313 -385 -391 27 -332 -112 -50 -27 127 308 255 379 259 468 351 155 78 36 -77 -185
3259 -185 -126 -425 8 -189 -458 -59 -199 -15 71 17 -120 159 209 250 701 167 201 151 -5 97 -40 -193
3281 -193 -213 -190 -285 -164 -486 -280 -173 -136 7 -81 44 429 380 40 326 79 193 176 133 160 -50 -190 87
3304 87 -98 -364 -177 -381 -330 -227 -356 -192 -203 -88 -6 -18 13 121 374 127 229 195 137 -20 -88 42 81
3327 81 -377 -261 -218 -266 -198 -163 -267 177 -199 109 348 213 237 205 259 240 214 7 96 79 -330 -131 -176 -179 -399
3352 -399 -330 -198 -87 95 12 292 131 93 176 168 424 227 203 243 82 58 -25 0 -277 77 -171 -247 -117 -225
3376 -225 -68 -19 -89 -33 -77 125 394 210 218 326 123 277 123 148 152 -74 -60 -72 -154 -297 -457 -405 -118 -196 -257
3401 -257 -134 112 46 94 186 180 320 340 311 316 235 381 -73 -112 -77 -116 -227 -414 -432 -297 -321 -178 -181 -158 104 193
3427 193 475 65 137 214 40 22 146 28 -46 -89 -48 -70 -313 22 -330 -190 -111 -128 47 -69 288 -10 263
3450 263 178 285 269 421 252 192 29 66 119 -167 -73 -190 -231 -297 -333 -169 -243 -166 89 -68 177 122 229 359
3474 359 259 47 299 -114 36 200 -194 -54 117 -238 -292 -163 -394 -80 -150 -187 -19 -87 13 288 1
3495 1 308 515 132 315 196 -3 402 -2 -223 132 -70 -256 -187 -303 -373 -205 -343 -25 -85 -35 27 76 108
3518 108 349 377 156 115 -103 220 95 156 -24 1 -170 -157 -270 -247 -118 -160 -9 -140 -351 67 26 -148 217
3541 217 188 173 425 165 99 129 100 -110 106 -314 -166 -203 -389 -184 -148 -461 43 57 -114 -45 143 98 435
3564 435 226 127 503 132 194 252 -70 -114 -98 -407 91 -243 -315 -267 -200 -108 4 -210 59 156 103 319 386 194
3588 194 516 130 -58 39 158 -15 -112 -397 -238 -160 -104 -25 -345 -312 108 201 -103 26 188 219 253 446 236
3611 236 119 202 219 -119 -70 22 -98 -353 -84 -173 -211 -284 -394 155 7 67 48 212 333 361 172 324 315 91
3635 91 151 155 -222 -124 48 -144 -336 -260 -208 -183 -340 97 -54 -132 15 69 264 346 209 267 366 105 98 -115 17
3660 17 139 -59 -267 -144 -151 -207 -227 -188 -7 -261 -8 68 244 110 288 312 191 210 227 78 112 -34 -16 -221
3684 -221 -39 -195 -248 -186 -235 -211 -73 -247 -179 -23 -86 298 -56 299 221 507 73 162 247 10 -77 -161 -355 98
3708 98 -399 -254 -71 -133 -374 -13 305 120 55 -27 420 308 165 61 324 -10 308 36 47 114 -69 -108
3730 -108 -131 -364 -57 -268 -254 -67 -71 -93 164 108 195 167 129 323 166 198 208 407 -155 89 -97 -102 90 -325
3754 -325 -138 -38 -147 -147 27 -358 300 125 97 114 65 311 138 441 -38 224 29 -54 25 -213 -19 -56 -431
3777 -431 -236 -110 -246 -117 -100 -77 353 -117 163 369 108 169 86 41 209 100 -93 -98 -13 -83 -25 -207 -309
3800 -309 40 -165 -121 -120 -82 231 245 113 112 151 207 312 201 103 60 -100 -172 99 -249 -132 -198 -228 -103 -248 -184
3825 -184 -4 -157 -72 194 243 102 207 7 273 416 131 252 195 -70 38 -90 -58 -176 -351 -376 102 -184
3847 -184 -288 -114 -5 47 74 -5 272 296 121 150 236 294 118 -143 -35 4 -48 -166 -236 -279 -117 -149 -63 -58 -45
3872 -45 -6 219 169 230 254 44 308 324 414 223 11 77 71 -430 -550 -275 -229 -131 -322 -145 -155 -145 -21 -159 41
3897 41 181 269 76 352 166 224 43 -18 -35 41 -119 -90 -243 -341 -280 -88 -119 -70 -89 127 84 69 -25 329 270
3922 270 135 152 144 60 108 -3 41 136 6 -44 -233 -137 -9 -135 -206 -169 -8 75 86 341 75 67 228 323 48
3947 48 185 274 149 -105 185 -32 5 -178 -456 15 -258 26 66 -105 -136 4 136 298 85 135 260 -95
3969 -95 252 34 -15 84 192 -310 3 -292 -298 263 -254 -347 -113 -237 -92 139 97 154 238 88 95 349 115 155
3993 155 -139 -66 -8 -142 -61 -26 -281 -193 -204 -235 132 -108 -115 139 86 168 178 28 -34 140 68 127 207 181 135 19
4019 19 -217 -224 -307 -103 -23 -209 -194 -235 -135 146 25 -127 349 104 355 301 -4 77 135 111 26 -27 -144 44
4043 44 -68 -172 -186 -123 -370 -10 -243 -42 197 16 208 185 85 271 511 69 62 51 20 12 -91 -63 -88 -108
4067 -108 -163 -65 -218 -218 -43 -273 32 11 97 220 28 207 39 334 48 23 -55 -76 -195 -207 -274 -121 -353 -172
4091 -172 -388 -133 -103 -86 -3 110 127 -9 187 195 293 189 92 36 4 -25 13 -107 -297 -148 -151 -262 -162 -305 29
4116 29 -126 -226 71 143 214 79 93 246 385 117 333 111 84 19 -136 -170 -322 -167 -318 -242 -333 -162 -269
4139 -269 21 72 174 122 167 47 100 49 203 105 -113 24 24 96 -256 29 -251 -277 -221 -380 -33 -265 -252 38
4163 38 -28 139 101 134 211 -22 34 46 71 157 -56 -84 13 -73 -177 -158 -247 -311 -125 -157 -182 -191 -62 271 23 110 -1
4190 -1 246 374 113 79 44 -101 -141 -127 -127 -111 -66 -161 -124 -241 -119 -319 -140 -224 -62 47 313 48 236 363
4214 363 304 109 77 -72 102 -68 -219 -272 -328 11 -280 -236 -150 26 -26 39 342 93 115 291 31 170 203
4237 203 94 -135 -121 90 174 -94 56 -140 -126 41 -306 -149 -238 -284 -249 137 -62 75 40 99 142 207 292 218
4261 218 85 -313 -5 72 -26 14 -109 -146 7 -124 -96 3 -163 -90 -12 -87 409 151 189 57 17 113 311 220
4285 220 74 -33 -104 21 -216 -147 88 -439 -138 -242 -113 234 -12 96 228 84 120 185 -69 146 158 218
4307 218 172 -80 -11 25 -54 -226 -230 -217 -237 -48 -218 -62 70 50 238 89 163 425 180 12 80 71 -115 111
4331 111 -173 -226 4 -126 -65 -153 -350 -135 92 -249 72 65 68 353 -188 476 243 85 83 -117 -4 128 212
4354 212 -80 -10 -85 -120 -239 -368 -308 -187 10 62 45 41 97 110 17 68 -110 97 69 -111 8 94 -90 -31 135
4379 135 -174 33 -263 22 -213 101 112 -111 -32 226 -5 -39 212 63 103 203 -14 215 -32 -239 -324 -73
4401 -73 -315 -199 -71 -149 -230 -154 24 113 -1 100 148 99 70 222 184 340 -48 126 -75 -237 -125 -287 -68
4424 -68 36 -267 -142 77 -97 -137 -119 -224 -17 205 -47 230 172 226 65 46 80 -37 -90 26 1 -28 -103 43
4448 43 -12 -170 -172 -262 68 -147 -62 229 211 49 132 121 116 14 148 141 295 -125 55 -119 -320 -146 -33 -192
4472 -192 -79 -142 -174 175 -190 177 191 67 49 193 190 322 130 38 86 29 -137 -182 -293 -41 -62 -280 -114 -149
4496 -149 9 96 14 192 133 133 155 122 323 193 2 -36 -55 169 -189 -64 -146 -150 -59 -164 -35 -166 -93 -178 -157
4521 -157 -8 248 33 -96 37 -67 67 412 -177 81 -136 -151 77 -63 -113 5 22 -258 111 -352 -148
4542 -148 -218 -158 164 135 -68 262 292 150 197 181 -76 118 -69 -125 -269 -128 10 -111 -190 -60 -188 48 -91
4565 -91 102 120 132 34 33 213 47 187 151 -91 217 -65 41 45 9 -265 -117 -115 -362 -164 -293 -49 -115 -34 122
4590 122 148 203 163 129 104 75 143 77 -13 -111 -53 -202 25 -219 17 11 -37 -39 -214 165 -183 -25 -30 86 -43 61
4616 61 288 100 -186 33 30 -40 -129 -210 -140 -52 -137 -249 54 63 -37 -69 139 28 151 183 269 286 214 99 -67
4641 -67 137 -56 -88 -34 -160 -78 -56 -140 -247 -244 -145 -100 -34 -203 41 -18 162 161 99 35 341 -61 -25 184 100 -10
4667 -10 20 -119 -93 25 -48 -4 -173 -178 18 55 -116 29 211 -34 -17 250 -16 317 248 -80 -25 70 -151 -138
4691 -138 -220 7 -96 -124 -63 -142 -52 -60 -47 -122 112 264 30 -53 431 52 126 4 242 2 211 17 -216 -108
4715 -108 11 -97 52 29 -64 -38 -109 179 -23 94 17 190 224 109 -12 -134 357 63 -49 -10 -26 -248 -229
4738 -229 1 56 -54 -174 -70 0 146 82 -88 33 225 160 46 -27 3 116 92 -124 75 -146 95 -72
4760 -72 -37 117 106 -44 -22 -107 -73 72 -8 76 165 65 14 238 96 -3 -187 91 253 24 -120 -74 -101 -79 -100
4785 -100 162 -294 -77 -233 -198 47 225 95 229 158 84 110 -173 -98 17 70 -148 -260 -269 30 -219 -16 -25
4808 -25 -22 -29 6 -47 81 90 -12 110 145 148 198 30 57 289 -52 -107 -241 59 -159 -177 -423 40 -71 -190 -100 178
4834 178 40 1 -41 254 201 -11 222 22 210 -50 259 37 13 -96 68 -105 -311 -168 -137 -81 161 183
4856 183 -27 -197 12 74 0 137 92 182 -77 208 -79 -110 -77 -165 -191 -43 -93 -157 10 -4 7 -79 -82 182 -29
4881 -29 107 118 244 257 -8 164 87 130 -244 -74 -289 85 -182 -30 -55 -473 -74 67 -104 -182 -116 242 -88
4904 -88 107 109 84 79 143 194 207 96 -7 -93 -42 9 -67 -147 37 -39 -158 -180 151 142 55 200 23 230 123 85 221
4931 221 79 -11 12 -24 -85 47 -159 -95 -410 23 2 -152 -359 -180 -1 0 -14 113 273 166 83 2 110 66
4955 66 -86 -183 -173 -273 -233 -14 69 -96 -66 30 93 -78 80 27 -117 -25 181 72 -67 240 82 267 47
4978 47 -55 -237 208 -126 14 -263 -21 -23 -128 -159 8 -92 192 210 237 -42 129 177 -102 118 149 27 163
5001 163 -195 -34 -34 -117 70 -355 81 -241 -9 -50 79 -17 121 91 -18 -57 89 266 52 117 50 93 -153
5024 -153 -42 -103 -27 -123 -72 -53 -138 -281 -12 -20 -25 -113 47 139 16 -27 191 221 194 134 134 152 164 141 -72 -88 92
5051 92 -83 12 -151 -147 130 -103 -38 -58 101 96 -119 44 -12 -72 195 37 149 -29 76 -58 26 -100 -268 -40
5075 -40 -140 -266 -194 66 72 -39 -96 26 39 35 -15 -121 -10 185 -54 -8 -91 -30 -166 -38 22 -155 -352 65
5099 65 90 -136 -102 -96 -50 -3 192 -24 -239 226 238 108 -164 53 75 -9 -1 -105 -130 -11 -158 -138 -61 -64 -74 6
5125 6 161 167 209 249 181 221 195 308 -139 100 -5 123 -318 -97 -125 -232 -190 -145 -12 163 105 -109 -67 11 11 40
5151 40 8 -171 118 23 -23 209 -174 -98 53 34 -87 -110 -212 -259 -19 24 -7 -92 110 184 74 142 -196 24
5175 24 64 245 30 -112 -108 -144 -279 82 -143 -11 -190 -41 -5 -213 -50 -14 -20 -61 312 9 84 179 129 57 -30
5200 -30 101 106 18 -81 26 156 -187 -64 -184 31 1 -45 -103 102 -191 -83 104 312 4 88 140 151 13 41
5224 41 50 -49 49 150 -198 -180 -9 -37 -148 -113 86 -26 -76 -81 -34 -43 -232 235 97 73 317 7 32 -10 -214 -57
5250 -57 -49 -77 24 13 -39 25 -71 -42 139 99 15 163 148 76 -165 65 47 81 19 48 -56 -6 -212 -137 -78 128 10
5277 10 -147 193 -75 59 -41 110 -54 -70 -30 244 87 193 -104 138 -3 -71 -4 -54 76 -37 -175 -97
5299 -97 17 -51 -23 259 31 61 147 66 72 0 444 174 117 61 101 -116 -66 -5 149 56 -45 -153 -64 -98 -8 -142
5325 -142 -108 -8 -25 51 98 65 -106 179 -37 150 42 105 72 -139 -21 -117 -44 -203 -135 176 -17 -55 -224 31
5349 31 -97 111 135 126 136 135 173 32 165 -66 95 -91 31 -59 -223 -7 55 -126 -82 -183 -94 118 -8 153
5373 153 -95 58 236 334 129 -60 42 181 -13 -43 16 22 -41 -97 -160 -75 266 -61 -53 -86 142 -66 16 76 -39
5398 -39 81 119 42 55 -131 -99 -16 -13 36 56 -89 29 10 -144 -104 10 177 -90 74 57 -114 61 119 155 192
5423 192 89 17 36 -42 -165 -158 -32 -339 -170 -81 -197 113 -59 -114 -1 -39 -23 41 191 94 68 27 241 124
5447 124 133 -35 -309 -186 187 -195 -215 -84 -108 9 -111 -131 -126 33 208 -83 60 -30 262 56 136 19 152
5470 152 132 -30 -30 -12 -135 105 -372 -29 -140 -81 50 -126 147 -98 168 22 -71 -123 -59 -11 -12 160 108 23
5494 23 -19 -87 -44 -166 -134 -114 107 -208 -104 -30 -83 34 39 92 257 -82 22 141 246 56 37 -21 50 -172 -191
5519 -191 -94 -93 -178 -127 67 -68 108 222 -170 -66 41 191 96 201 69 155 0 62 131 -15 26 28 114 -192
5543 -192 251 167 -35 -5 35 62 137 38 51 -36 189 44 150 -46 102 -58 -100 10 -70 -67 -114 -70 47 -113 -102
5568 -102 73 -74 -140 189 -121 -80 165 -17 185 79 223 -3 -108 -78 169 36 -171 -184 -123 -34 -89 -70 -286
5591 -286 -137 3 42 166 271 314 -7 223 -9 25 223 126 -21 -31 74 -185 -122 -173 -6 -114 6 -60 323
5614 323 -394 -222 39 88 109 -272 -112 110 -69 248 75 26 -115 118 6 -66 -168 -220 5 -53 -138 -25
5636 -25 81 45 -55 99 280 -91 102 12 251 3 106 137 19 54 -110 187 -102 -206 -5 -72 48 -172
5658 -172 -56 76 131 125 -6 177 -16 120 -61 276 -42 59 -112 -100 -122 96 -14 59 -385 29 -60 56
5680 56 -44 -94 4 -122 231 -67 37 -57 9 76 -20 53 246 -48 -74 -69 17 -205 -83 -19 -37 -144 -188 -48 246
5705 246 -151 -58 36 -2 79 168 -135 76 -35 44 235 54 -100 -18 -136 -3 40 -289 79 -159 47 -166 -5
5728 -5 -135 -63 -94 -133 2 107 96 30 -111 -153 155 -168 -22 -23 -154 -26 133 27 9 -172 128 91 -175 99
5752 99 195 -54 -61 90 128 -43 30 106 167 -56 40 87 58 -33 -151 -222 -116 -114 -107 -107 -192 78 112 -102 -99 155 72 329
5780 329 147 -9 -142 90 86 -92 -346 -82 -233 -11 -62 48 -196 49 -92 77 -153 11 63 6 139 77
5802 77 21 8 153 -59 52 14 -95 24 -79 -159 55 -149 185 -65 -204 19 -99 237 27 151 68 -61
5824 -61 132 44 40 107 -239 -71 75 -112 79 58 -73 92 -57 -39 -130 -35 -65 4 -16 91 42 -65 -95 118 106
5849 106 71 78 -104 -28 187 -64 -10 -18 -134 -64 -140 -202 88 43 -78 -142 -209 342 39 103 -6 99 32 78 -65
5874 -65 129 -84 111 113 18 -37 27 22 -72 10 79 176 -22 269 96 -136 69 27 125 -77 102 54 63 267 -97 -196
5900 -196 -108 -157 -5 -193 -226 -107 185 -40 75 -24 50 -47 40 103 -94 80 -233 151 59 -189 -48 46 -225
5923 -225 -67 -83 24 -71 50 -61 14 76 117 98 9 117 103 119 -56 -5 -34 -173 93 3 -84 -24 -99 -23 43 -144
5949 -144 122 -79 8 -132 -7 44 211 19 171 109 -20 238 189 -249 -84 184 -199 67 -33 -46 84 -5
5971 -5 -103 62 -168 -14 6 23 100 52 34 -42 -75 3 65 -137 -13 -189 -65 -84 -26 -44 -130 -162 -69 86 3 -27 341
5998 341 -32 47 170 -169 56 157 17 44 64 56 -70 88 1 40 31 -113 -167 -67 -88 -76 128 -245 177 77
6022 77 7 -15 -7 235 130 25 -3 21 -112 24 -20 -25 -48 32 65 -70 -45 -25 64 -3 -68 -17 -307 93 120 -69 250
6049 250 -46 -51 84 282 -53 86 28 30 95 -39 -214 -120 -108 -39 213 101 232 122 99 -19 -106 -65 111 -239
6073 -239 113 -39 59 -129 -63 159 -204 -140 -100 -59 -92 116 -124 -43 67 -10 98 -31 -79 15 64 70 -157 -107 67
6098 67 63 172 -26 -101 49 34 -5 -81 -57 -78 73 -124 -31 41 196 -61 203 3 -175 89 98 -230 -213 106 -68
6123 -68 -273 143 -108 -146 19 -211 42 83 5 189 206 -9 -108 200 93 -118 -9 -9 -79 -18 32 19 -101 -252
6147 -252 -102 33 -98 -202 15 -50 -25 64 114 164 53 -15 -49 -60 256 145 18 83 138 159 -41 108 -126 -2
6171 -2 -21 -8 20 -140 3 141 -197 74 -15 214 -51 102 -110 166 60 111 31 145 31 -163 106 52 80
6194 80 -43 -27 -231 -40 42 -106 55 -155 -16 276 237 103 -86 127 -110 -117 -121 -8 20 28 68 -115 1 49
6218 49 -38 -249 -142 12 5 105 -48 158 124 41 -104 -22 -90 20 138 -47 -63 -124 -62 198 -286 -146 -165 146
6242 146 -12 108 -122 75 55 -73 -45 20 101 -270 -14 13 73 63 2 -210 148 -98 72 67 -104 -34 -130 -55
6266 -55 -18 120 -239 51 -288 170 148 77 309 34 68 -80 52 47 50 -40 -109 -34 -154 -106 32 104 -49 -82 139
6291 139 -56 237 -2 -68 46 200 4 182 -67 -131 108 28 4 194 -12 -197 -26 -8 -29 -182 -52 46
6313 46 58 120 173 137 38 -206 136 358 181 -110 17 -212 -85 -41 -93 -59 -143 123 -85 -226 86 -153 -79 -41
6337 -41 -27 205 -133 -86 -21 30 56 -116 -60 93 -166 21 126 -26 -44 -61 121 25 10 -41 -91 25 -30 -152 55
6362 55 28 -26 18 169 -5 -77 -166 -25 -20 -192 -128 1 88 -130 -198 118 125 191 210 -161 -4 7 156 33 -57 -89
6388 -89 27 -23 -27 46 -130 -60 -167 -65 -247 193 60 -68 88 29 41 -109 231 -225 -93 -124 144 74 -31
6411 -31 140 -120 57 21 32 -161 -8 -56 3 154 69 42 -27 -106 59 -76 18 39 188 -104 -15 189 171 -95
6435 -95 30 97 -188 -276 16 -157 -8 -138 -127 -67 -136 102 -40 -138 109 20 -32 -111 -79 -90 -115 -137 -70 29 9 -31
6461 -31 -105 -29 -15 -128 136 99 -91 212 -34 -11 -4 -30 150 143 156 -68 38 -109 34 -100 11 -5 -272 -45
6485 -45 -19 74 57 177 -59 -206 86 209 -50 -1 159 -164 18 -118 -2 47 -54 30 -34 -198 91 8 91
6508 91 22 77 95 23 7 -115 -25 -13 -160 52 66 -68 -46 -172 -82 100 90 -62 113 72 -154 9 -16 -221 -14
6533 -14 99 -13 51 -139 -104 -73 94 -58 -29 -68 -32 23 3 -67 131 -151 -53 -74 -180 -138 -61 17 -6 -22 54 254
6559 254 93 208 213 -44 115 200 40 51 67 -3 -104 -121 -123 -27 84 37 -293 -128 207 -228 -167 5 -63 33 152
6584 152 -42 33 136 10 98 -137 2 -3 118 -41 -104 30 151 -178 169 -66 81 -150 -78 69 85 27 -73
6607 -73 35 -4 112 189 104 -412 126 -147 4 -18 -19 -132 -98 -39 -164 165 -121 82 -54 42 -92 -6 9 94
6631 94 -139 -82 -20 56 -15 -104 -180 -128 29 -4 -58 -203 51 274 -100 129 133 155 -8 -157 -93 11 -24 -72 124
6656 124 147 -5 15 -203 -263 76 80 136 -49 -91 -43 -127 31 81 -201 74 -210 -140 -65 -48 -16 -112 -205 -228 -97 73
6682 73 21 -2 -138 69 180 -81 31 108 -7 -18 150 -79 151 -141 -255 9 210 145 -59 -198 260 -110
6704 -110 -116 -91 -3 21 9 34 124 137 -125 167 86 -33 69 -116 139 69 29 99 225 11 -142 38 -117 -38 -98
6729 -98 -41 -220 -384 1 46 46 139 34 -177 -153 167 -68 97 -128 -53 109 -19 217 66 -51 163 91 -214
6752 -214 -31 -107 -5 -169 -129 57 -195 39 -122 -248 -138 -103 143 11 32 -204 -196 -117 160 107 -143 -74 86
6775 86 -43 119 4 -172 74 -41 19 -58 -37 -31 -63 -138 116 234 270 132 -92 3 -107 17 62 -111 -25 97
6799 97 -123 -111 -189 33 56 161 84 171 71 -72 168 123 60 42 -30 111 79 129 6 73 94 86 -224 -89 -114 64
6825 64 54 -94 -234 20 276 -182 -186 -196 4 11 57 25 -46 1 98 -172 -104 -45 -152 -220 37 59 -6 122 94 137
6851 137 36 60 -100 81 -4 -116 -150 -22 62 -2 -22 -77 -27 92 170 -157 148 26 -127 -186 132 80 -84 30
6875 30 -201 198 -67 5 162 56 72 8 -207 180 3 -108 -71 -56 -47 106 -21 -141 -90 153 -129 -46 -157
6898 -157 -94 192 16 -111 -120 0 -58 -30 -139 -28 -62 -15 24 3 -155 -167 40 167 -156 62 80 -247 5 55
6922 55 -176 -71 -16 -42 284 35 -12 -133 118 -97 38 53 140 47 -54 51 13 116 -143 -94 130 -5 242
6945 242 151 87 -25 126 -83 -89 -166 93 -67 167 -61 66 -114 7 -93 37 -14 182 -29 189 58 97
6967 97 -29 -264 -37 -26 -72 -110 92 -62 -17 -102 -91 -358 85 -17 -36 67 116 38 13 7 -85 -125 29 -58 110
6992 110 56 163 -96 -222 58 81 -104 101 -12 -3 117 -186 -281 -125 35 132 213 32 56 63 -94 215 126 -61
7016 -61 -28 8 -114 101 123 176 -57 139 -81 -71 -136 -8 98 -116 19 138 110 42 17 175 37 -50 191 64
7040 64 44 -67 -56 -4 -117 -42 25 -9 59 -157 -17 215 210 184 74 -1 136 33 -127 45 -14 -88 182 64 55
7065 55 41 28 -60 -57 -146 103 -59 -108 63 -122 86 10 149 -49 288 -84 60 9 -143 63 -164 -31 -77 -74
7089 -74 50 52 33 -102 43 24 74 127 40 -48 -72 148 52 19 24 -152 152 221 157 -263 -31 -75 -188 -87 22 -4
7115 -4 -138 41 -38 51 -297 -18 -100 -235 -21 100 21 -209 130 -76 69 141 229 -75 71 -57 -49 50 -42 69
7139 69 -219 47 33 60 1 37 76 2 87 114 -28 25 -106 15 -133 -32 -187 -159 62 -127 -43 -152 93 123
7163 123 -102 93 144 37 44 174 -1 210 143 -274 122 -108 10 125 -174 -85 137 -116 -81 -125 -25 8 -13
7186 -13 -164 94 205 132 147 123 22 -6 -12 -3 111 -59 80 -124 -193 -99 -179 -277 -24 41 -66 110 108 -40 -76 -67
7212 -67 -147 182 -21 159 -128 7 64 57 109 -57 72 -31 -95 -9 151 -37 200 -38 140 103 -76 15 -15 -20
7236 -20 255 -230 68 -237 117 -41 9 -64 -46 99 -34 101 -30 156 -144 -225 192 -122 102 39 80 195
7258 195 -19 -35 89 156 -145 47 25 -129 -1 70 -145 -103 -13 -4 43 -141 103 202 -229 163 -18 336 -31
7281 -31 -121 58 -118 -36 118 126 -34 -55 -29 75 -211 -76 -162 -86 -63 -118 -196 -280 -70 -7 114 -51 -60 5 -92 1
7307 1 111 56 -93 -141 176 -172 33 -16 54 94 -124 -44 143 150 -191 236 152 -32 -28 -76 38 66 32 -61 24 -37
7333 -37 -44 -20 -70 -119 -43 27 2 172 -114 -212 -123 -175 3 -48 35 115 -241 -26 12 152 -12 -59 181 151 -81 59
7359 59 -17 -20 156 -50 44 -154 -59 108 -136 -27 -12 53 100 59 -13 -22 60 187 124 -1 -73 -114 -215 -68 -196 -155
7385 -155 -72 56 89 151 -25 -218 103 105 -58 83 -55 73 -41 -206 208 -86 -82 -69 168 156 73 -38 -195
7408 -195 -21 -124 300 -22 -127 -194 -6 -38 28 -118 37 -6 -68 152 3 86 50 128 -9 -112 -184 143 -98
7431 -98 -85 107 135 17 87 37 -123 83 68 -75 -77 110 5 -47 -44 80 53 -154 -7 -146 -32 145 -93 7
7455 7 10 16 -122 -5 -70 -91 57 46 43 65 -110 211 173 -234 28 -62 -167 -180 -171 -78 2 -111 -161 66 -29 122 68
7482 68 39 106 97 -153 -53 13 10 7 141 83 162 -52 -126 -101 -102 -203 4 269 -2 -47 -36 -197 9 -232 -31 -35 244
7509 244 155 37 -81 78 -238 18 -4 10 -175 98 11 37 90 -74 -19 -226 188 12 72 -129 100 -24 106
7532 106 -22 -85 64 -123 29 90 -193 -129 -356 -58 -77 -120 -136 -140 -246 -39 -35 -18 66 15 -152 -45 -118 -112 124
7557 124 116 -169 -176 185 75 37 42 -152 33 97 -197 -36 89 28 149 219 212 41 -20 113 54 -20 -66 177 -26
7582 -26 -95 -32 138 99 21 -46 15 -13 365 201 278 -72 -315 -6 -78 -19 -51 -142 24 -64 -36 -300 18 -35 -61 40
7608 40 3 116 70 -194 265 -62 -33 24 97 29 -44 60 -80 131 46 -10 -86 9 68 -5 88 -86 71 84 162 15
7634 15 217 -144 1 -51 -8 -137 162 -42 120 29 181 24 3 -102 -8 150 4 209 212 101 -138 23 167
7657 167 -1 165 248 -57 -170 -99 -63 116 -57 -235 73 -71 71 166 99 8 -53 -72 -7 47 -51 -20 116 -58
7681 -58 72 -61 -92 57 -10 67 35 -46 107 11 7 130 86 -250 58 77 -181 27 -63 110 -54 -152 -241 -77 -125
7706 -125 -42 -25 -49 -94 208 22 15 54 -93 52 33 65 -26 -116 37 -68 0 -89 112 85 -53 30 93 -2 -16 146
7732 146 -89 -78 195 65 26 -4 -156 -24 31 -165 88 168 -40 -72 -88 -13 112 61 62 10 -33 -213 12 -251
7756 -251 246 151 -248 60 -123 -151 18 30 -107 164 49 35 16 -25 -212 25 41 141 122 55 88 182 -318 84
7780 84 -119 90 -24 -5 70 -62 158 8 21 -130 -68 222 -36 -52 9 6 -174 193 -85 184 183 -76 9 65
7804 65 -239 14 162 9 44 92 105 -57 11 -170 4 -54 -49 -23 -49 108 102 278 32 31 -49 4 71 82 -62 -69 -28
7831 -28 -179 -110 -276 46 -3 -14 -94 70 -14 4 -164 29 112 13 45 -301 -67 41 -52 -228 27 -41 -156 -89
7855 -89 63 -116 17 316 95 26 60 145 30 -50 -148 229 44 -46 25 96 -41 -225 -247 69 171 13 -231
7878 -231 -88 80 -32 -81 0 55 159 125 237 -98 103 -24 -27 38 44 164 2 4 -14 98 -174 -152 -83 89 21
7903 21 -2 60 -94 -3 159 161 -29 63 190 -10 33 71 -132 17 -99 9 188 -45 30 -107 -172 102 -52 -159
7927 -159 105 106 172 -30 59 40 130 -30 -320 -45 24 -47 39 -84 56 -318 20 58 -105 -103 26 87 -22 -200
7951 -200 73 -252 54 -82 23 -180 -186 -78 -54 55 21 -121 -101 -244 -94 13 26 55 -42 7 -153 10 -124
7974 -124 -79 182 172 5 -19 -373 100 152 75 125 71 84 18 -81 -51 192 71 77 132 17 -121 96 -31 114 -48
7999 -48 -187 -97 -69 -66 -40 0 -58 -106 132 -207 37 17 -27 18 203 -30 -205 -59 49 -31 -16 -55 1 118 -122
8024 -122 -132 22 -78 117 -51 -253 -133 123 49 72 -75 13 127 75 -64 32 43 -44 -143 63 -94 6 -262
8047 -262 -237 49 -51 -191 257 -37 20 177 -86 -76 -1 40 23 35 18 -11 43 291 -21 -52 -57 -79 104 -102 -89
8072 -89 -92 130 -57 -172 -2 -171 87 49 186 -152 -83 -116 93 -100 -104 256 -84 81 -178 85 33 -89 129
8095 129 -26 -19 135 -96 -11 -191 36 -85 3 -39 -56 60 -215 148 11 197 -116 99 39 59 60 140 47 -124
8119 -124 -134 -100 -8 -74 94 -80 -60 -90 0 -253 -5 70 136 52 -77 -149 107 -92 -254 20 38 16 -47 -116 70
8144 70 -19 -198 -61 2 -186 -57 29 -11 76 -106 -9 67 -154 172 -35 170 111 -60 -115 20 60 248 6 -155
8168 -155 88 -178 -36 -276 132 -138 173 67 -76 -131 9 -331 -27 48 44 85 57 135 -138 -77 -241 229 -9
8191i
$$ Imaginary data points
##PAGE= N=2
##DATA TABLE= (X++(I..I)), XYDATA
0 0 0 0 0 0 0 0 0 0 0 0 0 -8 8 -8 8 -16 16 -19 24 -32 32 -40 48 -56 72 -80 94 -110 126 -144 166 -186 214
33 214 -240 270 -306 342 -384 430 -480 535 -595 660 -731 810 -894 986 -1087 1199 -1322
50 -1322 1455 -1602 1766 -1949 2153 -2383 2646 -2947 3296 -3707 4198 -4802 5559 -6545 7889
65 7889 -9829 12903 -18519 32143 -139895 -39167 255689 28158 -137791 -62218 82669
76 82669 34891 -35713 -47849 -20582 -2189 63554 57766 -21945 -70449 -6961 64734 12146
88 12146 -119110 -70617 88047 88364 -36075 -65996 -19995 475 -5826 11844 -1822 -52642
100 -52642 -21695 63289 35792 -45231 -40882 16260 34153 3748 -17754 -2066 4638 5764 12894
113 12894 -22711 -59643 -14800 41754 10010 -66296 -52560 48911 64641 -24536 -47860 10132
125 10132 33309 5253 -17031 -3161 12695 -385 -3333 10404 -2770 -25204 -19948 1291
137 1291 3072 -17591 -6867 27378 8385 -30430 -19224 298 -2163 2203 11347 8416 2293
150 2293 8871 15839 1457 -15964 -15523 -5245 13710 19327 -6360 -15812 -2313 -14908 -32192
163 -32192 -10639 15215 9592 -1735 7927 16052 3015 -7282 -3503 -66 3419 8811 11410 12818
177 12818 2282 -16845 -16953 -8183 -11104 -4700 16090 13974 -13223 -17857 5041 7715 -11320 -10098
191 -10098 9924 15853 7854 6460 10175 698 -12957 -6022 12652 10616 -8089 -8678 5941 -1035
205 -1035 -20014 -13734 3190 2305 -3657 -1273 1800 2194 6194 11664 3888 -6974 2687 16933 11031
220 11031 -6248 -13434 -766 9852 -1309 -9559 -2591 -3988 -8793 -2719 1176 -3917 -4493 8290
234 8290 14712 -3942 -12106 7022 13612 2229 -2801 1278 11552 11963 -2909 -10972 -10423 -7043
248 -7043 2296 3871 -4141 -7547 -3339 5108 -680 -17326 -5613 17759 11601 -458 3736 10371
262 10371 8587 -3350 -7843 178 1087 2877 7113 -2142 -9066 -7003 -7544 -4413 -4011 -4830 5355
277 5355 6941 -470 1488 2069 146 854 821 7919 10076 -202 1290 5408 -4952 -8352 -4763 162
293 162 3284 -4886 -6636 469 -3625 -5206 64 -2088 2076 7444 4218 4570 2579 652 6436 2728
309 2728 -1874 3081 1856 -134 -2531 -9640 -4423 304 -6274 -3795 534 -1507 -114 -1535 -323
324 -323 4374 875 3565 9112 2745 1400 3231 -1155 370 392 -1958 1640 -748 -4685 -2641 -5895
340 -5895 -6148 -1966 -2988 1124 3279 -1713 2600 4157 -1288 1564 5303 5177 5413 1606 1939 2863
356 2863 -4726 -4920 -1228 -3437 -1580 -1149 -4789 -1867 -1925 -3877 -926 -660 1678 6902 4400 2598
372 2598 2598 800 3756 2388 -2454 1510 3778 -254 -2104 -5285 -5081 -2387 -4028 -2872 -110 -2024
388 -2024 163 1967 -1181 -511 1878 3899 5645 3201 2727 3972 331 -243 507 -2583 -1946 137
404 137 -2502 -2997 -3100 -5200 -4391 -1747 1011 774 -851 2993 4654 1302 1869 2519 973 3902 5290
421 5290 120 -2141 -4 -500 -4076 -4494 -1946 -2563 -2426 266 -1469 -4872 -1787 2218 1768 1900 2123
438 2123 2796 4682 5177 256 -2515 2550 4715 -735 -3035 -1240 -1419 -3505 -4406 -4149 -2808 -1236
454 -1236 -242 185 421 416 -243 1883 4836 2337 1645 5826 3618 -1637 -970 432 -753 -1640 -1940 -1993
472 -1993 -2101 -2016 -3484 -4944 -839 1519 -2441 95 5654 1658 299 3628 1589 1506 4205 2589
488 2589 -224 150 1917 -1922 -6253 -945 369 -5987 -2544 1557 -3662 -3009 1212 -134 1291 2757
504 2757 849 2005 5073 4386 -1023 -1804 5856 3422 -5106 -1707 341 -3471 -510 -2253 -7515 -2268
520 -2268 2409 -291 -2228 -1490 756 1523 3412 5232 -1260 -1829 8705 5863 -3402 -1632 -123 1122
536 1122 2280 -5224 -7887 937 4260 -2712 -9033 -3536 4372 363 -1589 2794 323 2026 7696
551 7696 1641 -2500 1116 2182 3278 2547 -2824 -2707 482 717 -5189 -10647 -639 7849 -2063 -6799
567 -6799 -108 2941 3231 -1084 -4186 4931 9303 1471 -1712 1679 4234 282 -5022 -1421 1366
582 1366 -1762 -80 -1553 -6409 -2284 -38 -1750 553 -787 -1369 5157 4629 -1869 -703 5287 6360
598 6360 -1559 -3548 3735 2135 -2234 330 -2516 -3873 1370 -1852 -5881 -1362 291 -2048 112
613 112 4069 2812 -2614 10 5597 1443 -10 4083 1746 1836 3867 -3173 -5996 172 759 -4033
629 -4033 -4158 235 1084 -1654 -1210 -1399 -4420 519 6422 2218 657 3227 2294 2076 1760 -1396 -1391 756
647 756 1106 -1232 -1876 234 -1388 -4870 -3380 -1804 -1762 1399 2170 -192 1524 2849 1275 1220 1675
664 1675 781 935 2572 2461 671 -42 -706 -4197 -4958 -1159 -846 -1722 146 -541 -1666 174 1346
681 1346 -1063 -948 2733 3279 2122 3690 3711 -485 -1359 -148 -1674 -1111 1167 -628 -3744 -1836 111
698 111 -2720 -3288 -729 -381 -384 1856 1983 1826 3447 2642 -168 -408 1748 2322 202 -378 -81 -1240
716 -1240 -1134 -1326 -4110 -3882 -1645 -1427 -143 1105 711 696 -191 -359 1597 1773 2000 2660 1653 1827
734 1827 1605 -701 -1081 -2133 -3048 -1046 -708 -1241 122 -1503 -2626 -1256 -1101 -127 1615 1641 2905
751 2905 2327 1364 2831 1350 -705 229 -1123 -461 1900 -192 -1957 -2216 -3708 -2317 -1499 -1572 329
768 329 -139 -163 2061 865 692 2423 -103 559 3030 1873 1730 1260 -860 -676 -1915 -3252 -942
785 -942 -1528 -1495 -46 -2478 -1380 1192 -653 -80 524 -190 3122 3551 1789 2277 633 15 980 -1228
803 -1228 -722 530 -2145 -1330 -759 -2187 -1232 -1868 -2959 -341 42 529 2716 1120 1468 2300 112
820 112 1018 1745 147 1584 1453 -669 308 -1196 -2647 -1652 -3025 -2274 103 -852 437 844 -1172
837 -1172 -71 811 437 2276 1440 1203 3426 1756 1029 654 -1830 -1276 -365 -2285 -662 -497 -1700
854 -1700 -913 -1701 -2190 -256 -885 227 2443 1235 1859 2690 1132 1283 1076 -668 597 479 201 526
872 526 -1541 -2397 -1439 -2418 -1243 -1133 -2246 -1 1275 201 1024 1177 500 1704 1298 1271 1582 1118
890 1118 1677 643 -1532 -690 -882 -1911 -1154 -1752 -2194 -529 -345 -1078 -477 -441 386 1225 1102 1435 1710
909 1710 1769 2112 792 138 771 -324 -1100 -663 -1150 -1522 -1139 -1021 -1420 -2006 -1822 -518 579 1032 699
928 699 600 1974 2068 694 801 1313 708 580 1262 -187 -1878 -1281 -644 -1710 -2332 -1841 -1369 299 715
947 715 -1226 -939 1337 1710 231 678 2377 1643 925 2056 1098 -1352 -531 457 -1350 -1345 -1191 -1934 -1051
966 -1051 -323 -1728 -2007 -78 1580 225 -406 2124 1656 269 2430 1724 -769 923 1456 11 -268
983 -268 -720 -1333 -1257 -1036 -975 -2597 -2268 913 243 -1205 629 884 1296 2523 385 117 2581 1771 698
1002 698 342 18 365 -988 -1386 -827 -2063 -1415 57 -1819 -1202 -18 -1324 611 1592 -442 1202
1019 1202 2940 1265 435 1011 1944 639 -1499 181 1062 -1693 -1004 -1122 -3046 56 -105 -3236 -1150
1036 -1150 1203 191 8 366 1291 1915 1650 2072 121 -630 3323 1402 -2455 271 200 -1814 -561
1053 -561 -1369 -2649 -1223 -193 162 -1303 -1140 1408 1112 -87 1479 410 1381 3890 -114 -1459
1069 -1459 2064 931 -1237 -975 -709 -350 -1497 -1620 -1181 -1997 -1150 579 -691 408 2090 -941 859
1086 859 3002 308 569 2560 920 -216 372 508 -768 -2311 -293 284 -2838 -1348 -129 -2262
1102 -2262 -414 386 -1440 245 2302 892 410 855 1801 1421 746 1334 357 -649 1396 -582 -3486
1119 -3486 -441 209 -1897 -1402 -411 -971 -463 -521 205 765 893 1771 954 783 1783 818 335 1400 -316
1138 -316 -866 731 -956 -2254 -1240 -693 -1033 -1303 -894 48 -161 -7 483 445 1375 1901 204 1135 2104
1157 2104 197 -21 883 -77 -849 76 -176 -1919 -1784 -325 -676 -1806 -480 380 -278 151 817 518
1175 518 1060 1828 1085 476 1115 1078 -99 45 -6 -858 -966 -72 -1441 -1914 -721 -536 -1000 -1052 295 859
1195 859 296 673 903 968 1464 850 665 1064 741 -63 -19 -288 -1205 -1165 -753 -1065 -1436 -1200 -80 -783 -672
1216 -672 502 511 539 1180 553 937 1601 839 611 925 290 -273 -854 -502 -439 -1733 -1640 -72 -1609 -1317
1236 -1317 139 -721 -581 513 814 1183 1060 730 1521 963 655 810 37 175 356 -961 -733 -639 -1770
1255 -1770 -1263 -644 -1182 -604 -658 -129 696 180 612 1592 352 1131 1637 499 987 428 -200 500 -494
1274 -494 -1417 -237 -1355 -1147 -437 -1401 -740 -263 -620 610 637 -100 1108 1212 1022 1789 625 587 1155
1293 1155 -515 50 197 -998 -485 -630 -1529 -715 -1135 -1232 181 -610 -433 953 210 825 1648 501
1311 501 1342 1113 213 1212 284 -333 351 -1018 -974 -331 -1781 -1059 -632 -1658 -255 136 -585 328 245
1330 245 211 1272 688 838 1457 371 742 1070 -541 -240 -229 -1217 -386 -964 -1570 -545 -908 -1119 -136
1349 -136 -528 75 692 446 970 1247 423 1241 1161 125 860 -11 -43 340 -911 -830 -695 -1410 -1123 -832
1369 -832 -1024 -396 -380 -361 936 203 359 979 729 1032 1569 534 806 435 -197 131 -343 -1088 -739 -1005
1389 -1005 -1310 -469 -989 -798 2 -677 225 548 164 1156 1336 940 921 376 541 742 48 46 -342 -981 -382
1410 -382 -742 -1349 -917 -1143 -1021 -396 5 -122 215 744 552 779 784 1087 644 712 713 416 -86 -89 -592 -1135
1432 -1135 -992 -855 -944 -911 -517 -546 -317 49 -1 197 914 876 692 1208 1370 772 492 500 233 -351 -595 -499
1454 -499 -969 -770 -592 -1226 -846 -278 -567 -667 446 470 540 945 869 849 742 990 912 206 -212 199 -633
1475 -633 -252 -724 -1704 -608 -639 -1417 -951 -193 -122 257 56 513 804 646 1369 871 448 1339 593 -621
1495 -621 727 92 -1204 -570 -627 -1253 -804 -483 -695 -881 -515 445 -21 -432 1308 698 448 1770 661
1514 661 -50 1171 865 -318 -419 -300 -71 -741 -1125 -522 -1506 -912 -26 -1258 -706 1115 444 -136 966
1533 966 958 755 1060 493 780 230 441 397 -872 -521 -9 -1566 -1125 -494 -1317 -544 180 -790 -210 609
1553 609 563 774 562 734 1304 701 688 452 -122 565 -39 -1547 287 -449 -1416 -619 -651 -1030 -430 -67
1573 -67 -311 11 512 1270 300 125 1552 783 66 1280 233 -448 726 -450 -1039 -418 -432 -870 -1104
1592 -1104 -922 -160 -776 -333 495 -381 86 1522 382 43 967 854 554 483 67 -46 -102 -701 -994 -974
1612 -974 -316 -148 -1367 -646 -82 -610 -70 304 -98 692 1144 499 570 937 630 632 131 221 -216 -538 -20
1633 -20 -786 -1537 -359 -570 -1484 -292 405 -361 225 489 311 297 878 1153 524 476 1243 351 -362 610
1653 610 -393 -644 -168 -770 -1229 -457 -48 -796 -761 239 135 -332 237 1030 362 633 1171 673 269 492
1673 492 246 -373 -425 -240 -494 -586 -803 -764 -762 -294 -234 -645 170 129 86 405 840 564 619 668 674 309 256 98
1697 98 -263 -397 -239 -806 -661 -428 -889 -626 -219 -426 -502 108 613 484 364 749 828 473 553 733 173
1718 173 240 248 -245 -376 -875 -835 -639 -852 -610 -500 -575 -166 -8 -136 947 612 491 1149 911 424 681
1739 681 204 203 272 -435 -219 -379 -996 -459 -724 -832 -143 -613 -284 82 -344 220 776 474 668 804 496
1760 496 628 374 -62 315 -218 -396 -112 -851 -746 -628 -1085 -296 -474 -683 76 133 53 484 652 651 863
1781 863 326 699 945 -167 57 195 -652 -123 -471 -986 -427 -1055 -714 -341 -443 -271 196 20 458 404
1801 404 301 929 801 218 772 217 -222 439 -265 -127 -392 -1037 -491 -544 -1130 -389 -353 -656 194 -42 287
1822 287 830 38 432 1164 412 539 518 -15 68 -40 -487 23 -434 -1039 -636 -916 -737 -376 -634 28 198
1843 198 -220 584 493 323 896 586 547 589 133 150 75 -399 -323 -216 -785 -501 -292 -673 -297 -704 -88 126
1865 126 -189 227 731 399 673 886 464 641 483 -200 309 133 -567 -235 -596 -463 -571 -743 -414 -292
1885 -292 -631 85 209 237 584 504 545 683 445 749 457 187 146 41 -552 -317 -403 -604 -703 -631 -666 -318 -510
1908 -510 -110 214 125 478 707 593 659 690 382 368 612 65 -1 -95 -161 -496 -736 -426 -635 -720 -526 -419 -228
1931 -228 -110 277 113 302 646 357 375 781 500 120 230 131 -145 -282 -424 -562 -471 -797 -518 -628 -497
1952 -497 -149 -29 42 52 102 214 748 702 445 607 513 223 239 -59 28 -322 -574 -233 -781 -404 -360 -688 -504
1975 -504 -27 -66 143 229 242 597 428 518 721 406 254 294 -439 12 -32 -757 -686 -198 -775 -598 -383 -510
1997 -510 -112 -54 34 398 267 650 833 252 603 662 83 539 207 -513 162 -249 -822 -300 -595 -649 -76
2018 -76 -352 -171 -166 -96 277 340 110 572 600 90 677 429 230 676 -129 -313 -228 -414 -585 -608 -744 -208 -288
2041 -288 -492 -25 -233 181 708 93 286 1084 384 357 662 127 45 -148 135 -155 -842 -564 -367 -1282 -670
2062 -670 267 -768 -231 284 -347 233 800 325 614 497 676 477 -108 323 322 -546 -32 -156 -1003 -225
2082 -225 -166 -857 -329 -290 -372 35 -125 191 375 406 867 606 128 821 447 -83 316 75 -346 -101 -547
2103 -547 -632 -186 -545 -538 -405 -390 -83 -125 -74 535 210 480 818 -150 225 987 231 62 123 -231 -191 -371 -422
2126 -422 -654 -895 -313 -345 -712 -418 44 -200 157 725 67 438 909 507 392 389 383 125 -231 129 -171 -808
2148 -808 -465 -455 -747 -390 168 -498 -358 247 255 248 49 563 453 382 582 533 355 330 -164 -277 -265 -558 -453
2171 -453 -538 -369 -349 -362 -322 -270 156 374 329 158 376 472 421 753 300 207 325 277 -284 -340 -362 -103 -609 -497
2195 -497 -440 -585 -293 -118 -271 -86 64 147 242 491 652 334 344 482 283 71 78 38 -608 -606 -497 -715 -549
2218 -549 -344 -348 -18 69 -123 148 160 453 558 193 344 549 239 400 217 -381 68 -115 -512 -287 -495
2239 -495 -584 -336 -457 -199 -60 -103 206 240 145 676 405 244 714 556 -173 423 86 -263 -53 -613 -265
2260 -265 -408 -715 -397 -320 -482 -44 -299 39 363 -75 478 788 149 550 904 243 353 40 -97 69
2280 69 -412 -315 -124 -643 -550 -269 -564 -192 -213 -245 277 384 74 483 358 392 609 412 408 261 -91 -11 126
2303 126 -478 -264 -94 -682 -402 -364 -413 -77 -222 197 203 116 564 429 260 697 401 168 569 80 -246 142
2325 142 -525 -251 -411 -578 -529 -472 -548 -46 -72 -277 401 303 204 471 408 426 544 195 349 288 -73 -239 -170
2348 -170 -551 -281 -600 -558 -291 -682 -49 -67 -373 324 215 97 663 413 343 472 281 286 146 -119 -70 -263
2370 -263 -571 -350 -643 -742 -392 -404 -379 -182 151 71 293 146 123 399 449 518 502 90 206 155 -231 -178 -421
2393 -421 -450 -317 -295 -455 -321 -507 -309 -103 -66 49 45 405 707 507 571 372 66 255 302 -26 -95 85 -410
2416 -410 -434 -463 -383 -341 -559 -187 71 -66 246 280 238 379 333 516 441 352 146 2 -114 150 -107 -67 -368
2439 -368 -346 -399 -406 -371 -344 -191 -250 244 23 43 361 396 412 358 267 336 358 -93 -64 -149 -448 -171 -349 -350 -240 -392
2465 -392 -302 -139 -136 150 40 131 508 231 183 496 364 166 174 194 74 6 -182 -190 -421 -444 -353 -416 -308 -38 -188
2490 -188 -227 409 247 238 514 382 410 408 181 445 82 -91 146 -338 -320 -220 -560 -483 14 -503 -446 -214 -303
2513 -303 108 268 289 223 449 464 492 157 186 410 -320 88 148 -371 -247 -257 -663 -367 -413 -242 143 80 -22
2536 -22 199 -50 315 261 41 530 521 0 543 0 -122 112 -251 -382 -534 -349 -438 -531 -310 -68 -139 -250
2558 -250 283 71 133 524 289 100 566 251 324 234 -94 27 -346 -302 95 -349 -459 -193 -533 -94 -97 -470
2580 -470 25 311 -15 336 323 23 547 169 232 302 128 45 -124 -318 -305 -185 -714 -197 -469 -671 -229 -139
2602 -139 -91 311 111 60 429 469 355 328 111 706 -51 -149 309 -69 -444 -125 -192 -421 -169 -315 -154 -295
2624 -295 -19 143 140 386 388 220 -34 387 194 131 141 -8 27 -118 -159 -233 -571 -425 -369 -383 -97 -219 -267 -96
2648 -96 115 216 478 411 458 251 395 -37 24 37 281 -27 -419 -16 -396 -410 -213 -431 -481 -296 -77 -388
2670 -388 157 331 260 192 552 158 74 395 246 158 141 161 -219 -226 -262 -481 -416 -222 -286 -269 -309 -41 65 -126
2694 -126 88 274 256 413 482 292 197 240 48 12 -230 -468 -188 -560 -320 -485 -575 -142 4 -173 -121 146
2716 146 136 188 169 324 272 191 264 248 58 160 16 -119 -208 -417 -274 -170 -446 -382 -188 -184 -48 17 84 370
2740 370 500 307 587 195 212 222 -62 173 257 -466 -341 -265 -434 67 -357 -579 -406 -142 -49 -50 2 139 313
2763 313 237 590 394 246 369 42 113 248 -291 -196 -279 -301 -297 -227 -495 -258 -203 -140 269 61 140 419 376 279
2787 279 355 15 400 291 15 214 -62 -337 -218 -289 -378 -173 -511 -335 -195 -169 47 66 29 317 302 151
2809 151 424 255 231 418 99 132 158 -303 146 -250 -498 -99 -265 -276 -223 -220 -251 53 45 152 629 172 259 426
2833 426 101 261 264 96 90 -135 -266 -33 -447 -191 -141 -451 -155 -58 -365 -71 249 40 311 374 206 571
2855 571 247 370 359 -21 63 -10 -309 -165 -401 -487 -352 -451 -431 -446 96 -45 126 -76 243 95 349 443 438
2878 438 52 84 378 24 106 -133 -133 -256 -222 -207 -487 -468 -181 -172 -142 30 -151 303 295 422 333 414 262 442 219
2903 219 74 -58 74 -414 -56 -238 3 -252 -282 -39 -261 -61 -153 -34 172 130 188 374 371 202 330 246
2925 246 166 25 -70 -129 -148 -215 -408 -181 -520 -242 -406 -287 -84 -302 -175 197 92 368 348 285 325 172 98
2948 98 -104 -227 7 -129 -523 -334 -272 -518 -334 -384 -310 -74 -118 256 178 139 248 486 232 373 211 369
2970 369 278 67 -190 -183 -144 -279 -377 -346 -172 -402 -361 -229 97 -20 193 290 30 399 228 193 316 244 -56
2993 -56 117 -16 108 -339 -485 -316 -180 -186 30 -415 -339 268 -21 -30 376 95 236 351 94 264 367 0
3015 0 366 -73 -129 67 -290 -286 -275 -384 -321 -111 -262 -255 37 26 285 138 147 295 306 328 288 -10 209 47 -62
3040 -62 66 95 -600 -199 -24 -434 -100 -313 -264 -4 -23 121 524 -16 401 318 325 185 358 109 39 -11 -103
3063 -103 15 -222 -525 -159 -458 -375 -437 -326 -28 152 14 376 23 126 388 150 264 558 92 136 264
3084 264 153 -181 -245 -315 -340 -298 -155 -85 -555 -342 119 1 115 287 185 178 529 100 57 163 309 152 -248
3107 -248 48 -33 -390 -52 -253 -150 -230 -147 -302 -230 -25 126 73 201 564 575 0 212 200 -7 358 174
3129 174 -145 22 -353 -459 -248 -117 -200 -191 -161 7 41 -59 258 279 284 388 369 157 291 173 73 157 56
3152 56 -374 -379 -260 -170 -333 -176 -349 -334 -263 15 -259 130 89 -14 349 312 259 102 167 -182 -94 67 -138 -106
3176 -106 -207 -267 -371 -421 -304 -257 -251 128 -338 178 186 142 547 95 49 273 388 369 90 -78 16 -90 -171 -150
3200 -150 -362 -134 -51 -260 -141 -93 -113 140 86 232 293 480 86 274 135 103 243 -120 -21 -325 -352 -88 -257
3223 -257 -452 -254 -242 -345 -93 -61 52 359 97 111 266 199 365 169 102 82 -135 -123 65 -223 -186 -276 -307
3246 -307 -391 -291 -485 -90 39 -181 290 132 171 247 147 73 446 -128 165 74 -210 81 -80 -47 -174 -391
3268 -391 -362 -231 -360 -236 -21 -158 125 75 88 30 271 92 299 156 60 133 -99 -130 156 -558 -369 -11
3290 -11 -567 -240 -185 -310 -76 -8 -34 17 9 122 398 225 226 223 25 111 272 -202 100 -278 -363 -158 -82 -200 -282
3315 -282 -129 -208 126 -70 202 41 -1 99 223 114 429 302 153 184 -79 71 -205 -189 -462 -61 -197
3336 -197 -156 -189 -346 -121 -326 95 279 39 305 241 299 519 474 -28 285 334 -72 186 -142 -236 -34 -309
3358 -309 -351 -66 -36 -43 -323 -159 87 55 74 186 250 215 377 191 203 92 -56 80 -32 -92 -20 -243 -202 -185
3382 -185 -149 -242 116 -124 -112 265 68 51 240 222 192 -54 274 201 -117 103 -72 -251 -116 -81 -424 -264 -368
3405 -368 -324 105 5 -49 128 -85 117 68 87 146 319 335 158 47 267 -53 -30 -316 53 -255 -238 -495 -147
3428 -147 -81 -32 -46 20 13 79 80 354 319 293 -80 200 132 -256 -24 -23 -405 -92 -543 -206 37 -254 -169 25 17 63
3454 63 89 187 266 275 351 211 268 118 181 -154 71 -123 -301 -14 81 -295 -99 -453 -139 12 66 -125 118 135
3478 135 205 151 27 376 -133 215 323 56 113 72 -160 -15 -82 -209 -315 -347 -162 -123 -169 -21 152 130 54
3501 54 306 155 359 265 20 114 -128 -16 91 -94 -236 -127 -249 -345 -389 -258 -184 -9 -188 -57 117 -101
3523 -101 230 49 107 532 131 41 194 -137 150 -149 -292 -18 -504 -280 -10 -242 -356 -93 52 -29 268
3544 268 -129 -82 108 197 372 370 145 169 -154 -154 -139 -204 -143 -39 -522 -239 -445 -397 -49 37 -29 53 193 234 244
3569 244 224 315 304 -41 162 233 -45 17 -154 -308 -45 -55 -194 -175 -228 -284 -162 -34 76 177 20 343 153
3592 153 355 324 -155 324 351 -44 104 -28 -266 -225 -311 -504 -99 -67 -191 -53 -126 -23 305 322 110 71 200
3615 200 528 375 55 219 -6 202 -177 -465 -196 -243 -315 -222 -361 -239 32 71 -39 123 105 231 230 217 321
3638 321 231 168 94 -88 25 12 -12 -153 -162 -262 -418 20 -307 -118 -351 -55 -119 115 47 340 212 222 333
3661 333 301 333 222 48 109 59 -95 -189 -105 -283 -267 -498 -217 -161 -152 -4 153 267 59 495 22 264 270 161
3685 161 -45 30 61 -145 -328 -108 -236 -146 -88 -279 -266 -71 -307 -83 202 -24 144 -18 -69 221 72 -31
3707 -31 237 213 26 -104 -151 -242 11 -267 -103 -119 -269 -15 -195 -40 66 118 108 178 183 141 131 340 204 115
3731 115 21 323 -29 -215 -239 -282 -186 -84 -348 -13 -28 -204 169 -107 120 145 133 213 283 175 108 281 71
3754 71 147 14 -167 -91 -126 -96 -275 -239 -81 81 -107 -56 70 -57 62 137 333 325 278 142 -3 -131 260 217
3778 217 -219 -46 -199 -243 61 73 -165 63 -159 -125 38 -5 221 225 49 363 153 38 289 68 -64 102
3800 102 -127 -281 -76 -207 -224 -184 -259 -41 -231 -169 10 -17 278 171 74 127 377 202 163 274 -64 149 -28
3823 -28 -139 -72 -252 -314 0 -335 -199 178 -256 -55 -133 58 254 349 69 463 195 65 140 44 -66 -44 -207
3846 -207 -254 -55 -219 -181 -160 -358 14 -280 -99 40 23 76 163 58 266 222 -33 -2 446 172 65 -196 -162
3869 -162 -157 -122 -230 -60 -378 -222 9 -251 138 33 153 84 327 194 138 173 144 82 97 -71 -16 -214 -228 -17
3893 -17 -309 -36 -149 -177 -240 -175 -67 65 18 378 196 126 34 263 56 188 -69 -31 -144 -217 -37 -151 -265
3916 -265 -84 -289 -312 -117 -236 156 -9 -18 64 283 116 127 21 262 220 -24 -35 199 -265 -83 -188 -109 -150
3939 -150 -204 -229 -123 -188 -98 -11 -185 52 139 91 177 427 39 231 107 69 137 -196 -234 -110 -6 -307 -396 -319
3963 -319 -177 -186 96 -30 -142 -125 223 165 99 182 146 410 177 140 99 -108 -265 38 -173 -232 -220 -344 -163 -288
3987 -288 -318 -114 109 -154 234 171 -22 546 139 198 300 -77 -105 -188 -55 -275 43 -250 -125 22 -256 174
4009 174 -185 47 54 -41 -44 186 123 94 270 251 402 346 -94 154 -39 -49 -59 -92 -97 -31 -434 -107 24 -210 29
4034 29 -102 20 92 146 75 106 -35 116 178 -42 -71 -3 -136 109 3 -27 -52 -185 -320 -160 -339 -111 -83 136
4058 136 310 242 199 137 405 250 133 125 -94 -122 -192 -70 -334 -101 -285 -275 -411 -139 -48 -286 137 88 -64
4081 -64 -103 70 -12 300 36 181 264 -15 273 -8 -266 4 -26 -165 9 71 -175 35 -221 -117 -35 -1 285
4104 285 230 108 313 214 180 103 51 142 60 -7 -87 -313 -89 -136 -274 -283 -75 -127 -236 -125 48 208 27 80 241
4129 241 200 175 38 126 -23 1 -168 -126 143 -139 -260 -444 -41 -253 -31 -24 -196 148 53 136 118 170 210 268
4153 268 120 218 102 -22 -40 68 -144 -288 -56 -508 -249 -116 -175 -58 79 -8 -16 23 177 226 330 207 224
4176 224 233 106 170 -191 25 -21 -222 -133 -421 -179 -95 -344 -86 89 44 -62 19 202 110 145 379 74 196
4199 196 97 195 27 185 -56 -162 -102 -222 -65 -437 -104 -232 -238 -178 13 30 290 54 357 223 136 99 132
4222 132 -2 111 123 -186 -239 -72 -172 -327 -231 63 -144 -6 -63 67 -23 181 197 119 210 238 308 203 258 229
4246 229 108 -103 -158 -187 -120 29 -141 -149 -100 -20 -144 149 -304 88 10 175 139 92 209 189 133 37 99 -45 -63
4271 -63 -4 120 -299 -221 -265 -301 -263 -68 -13 -130 -121 170 -25 133 154 17 83 79 140 194 -125 -255 -54 -145 -102 -108
4297 -108 -228 -3 -186 -247 82 106 -59 242 142 49 297 101 118 256 43 232 -108 -175 -64 11 -137 -38
4319 -38 -48 -274 -196 -187 -142 -41 -221 50 -64 53 201 148 -169 182 -72 166 51 -108 26 -105 -228 -118
4341 -118 -194 -224 -88 -185 -122 -37 -20 32 203 119 193 338 134 -85 87 75 -229 -197 -1 17 -194 -119 -114 -360 -127
4366 -127 -207 -254 153 -36 168 8 151 32 196 122 18 -4 63 18 -84 -220 -166 -93 -210 -236 -50 10 -196
4389 -196 114 160 -76 -205 279 149 81 144 241 54 345 -136 -34 -155 -66 39 -10 11 -393 -234 -43 -130 -323
4412 -323 -119 -110 -107 -63 105 217 141 300 26 14 116 148 118 -115 -48 64 -59 -301 -62 -79 -122 -78 -59 -88 -182
4437 -182 -112 -68 172 170 -8 168 306 155 -39 17 13 -4 99 -209 -45 -250 -117 -247 -42 -97 -63 -59 -59 105 55
4462 55 37 199 173 184 213 105 55 -23 -20 -84 -105 -18 -111 -126 -356 -129 -135 37 -54 -199 -92 105 141 252 24 157
4488 157 294 -24 155 -37 -52 61 -81 -370 -80 -256 -245 72 58 -257 -123 -152 198 152 -4 236 296 22
4510 22 192 41 -170 -20 50 49 -58 -383 -173 -77 -309 -15 110 -222 -127 -194 59 182 -32 39 233 224 0
4533 0 130 -28 123 79 -103 135 21 -125 -132 -283 -125 -118 -107 -25 132 -268 111 28 -51 159 119 84 -81 -245
4557 -245 -34 182 -27 -35 -184 -224 -237 -245 -152 -89 -86 -207 -74 40 -2 98 27 226 270 -87 46 16 -49 228 -61
4582 -61 192 77 -229 -181 -175 -281 -142 3 -26 156 4 -2 281 112 160 213 199 10 195 81 18 57 58 52 -40 -362
4608 -362 -23 -260 -179 -175 -126 -19 -22 -122 116 311 260 241 149 133 101 14 201 128 -23 37 -177 -234 -46 20 -313
4633 -313 -21 -253 -24 -134 -40 -146 6 -61 -79 309 246 222 -211 78 84 -123 -228 177 26 -96 -189 -97 -133
4656 -133 48 -268 -40 -17 70 -47 30 211 118 48 125 105 -142 66 -8 141 152 7 128 29 -167 -161 -219 -168 -116
4681 -116 -26 55 -18 118 47 19 111 69 87 196 91 44 80 17 -47 -39 46 -330 -303 22 -227 34 3 -18 -23 139 63
4708 63 139 36 -68 139 187 155 154 281 45 -64 -341 -241 -108 -289 -146 -135 -37 110 -14 -44 -16 -60 53 -34
4732 -34 -55 33 293 88 169 29 62 233 -53 -137 -222 -90 24 92 -118 20 -13 -311 -24 34 200 247 43 116
4756 116 124 -13 28 -44 -105 -53 201 -17 -44 -170 -281 -82 -330 -193 -79 10 -58 126 238 116 249 165 164 147
4780 147 51 -5 41 96 -72 -31 -98 -43 -62 -216 60 -195 -88 39 -25 58 -39 114 207 178 418 140 311 227 159
4805 159 -26 45 -71 -102 -68 -159 29 -25 -165 -56 -311 -120 61 -55 81 15 97 148 223 72 83 -68 -60 123
4829 123 -28 -122 -40 -50 -270 -164 -115 -190 -75 47 109 166 174 135 154 8 225 13 333 183 65 -47 -125 135
4853 135 -12 -79 -187 -188 -161 -174 -90 -26 -5 68 -90 141 152 243 236 46 139 150 13 -134 -18 -52 -306 -53 -8 -40
4879 -40 -93 -12 192 -205 -205 126 -40 -19 104 89 -210 59 80 -10 82 148 -96 22 113 -108 -174 -68 -151 -290 -184
4904 -184 -75 -109 -52 122 -86 68 164 173 48 -11 191 102 106 -63 95 -115 -71 -125 -84 -77 -190 -98 -244 -76 149
4929 149 4 -144 0 54 147 49 64 98 196 179 182 -78 -89 43 -264 -68 -165 -111 -205 -148 134 131 -93 -134 198 169
4955 169 39 123 65 15 50 115 -144 -24 119 56 -150 -56 -124 -381 -45 -172 95 162 -120 -119 88 142 -59 -70
4979 -70 -19 115 -88 141 -12 106 -105 -90 -190 -362 -107 -206 -415 -163 -88 -66 63 89 185 -5 252 69 74
5002 74 61 -31 66 -166 12 103 -49 -147 -170 -216 20 -145 -222 -122 -101 -14 -73 182 101 43 113 -10 1 3 -4 13 93
5029 93 -17 -68 -66 55 -34 -165 -180 5 -49 205 67 98 -18 -124 -27 375 217 -24 -145 286 195 -29 -112 117
5053 117 207 200 -209 8 -114 -178 -36 -30 -95 39 95 -186 -72 -35 17 178 204 -94 323 54 -77 -57 -113 -150 -153
5078 -153 -165 -200 -306 -51 133 -41 105 260 29 124 147 59 22 87 -47 -2 170 -31 74 -147 -167 -83 -196
5101 -196 -230 224 118 -184 -108 -125 1 223 -68 111 159 125 288 126 13 144 58 -118 59 -164 10 -47
5123 -47 -210 -53 -105 -203 -56 1 -79 65 203 158 121 -12 64 242 -114 82 -19 -54 16 -234 -270 -141 82 -106
5147 -106 -86 -256 46 -16 -23 -290 276 191 -17 8 161 95 212 197 299 -79 -70 -71 38 54 179 -210 -104 -31 -147
5172 -147 -21 -241 -53 -170 -16 155 139 52 53 -44 181 -24 -214 47 28 -163 -2 -360 -55 -100 -106 -152 -173 -11
5196 -11 -51 77 81 69 37 150 184 172 -123 -94 185 -119 -92 67 46 -226 -69 -39 -334 -203 12 -77 -49 -204 -132
5221 -132 41 -128 -21 -53 151 153 -47 45 80 140 227 -111 -69 -8 -126 78 -179 -40 -210 84 39 143 42
5244 42 166 87 99 -7 30 125 141 -10 12 -179 15 -27 -4 -72 -141 -9 -69 3 -216 -3 13 167 -36 -135 -103
5269 -103 -46 230 212 39 -51 -81 -114 43 -140 -30 -161 -42 -258 -234 32 -102 -88 -74 110 4 -18 102 120
5292 120 178 49 118 146 -156 6 -339 -7 -39 87 35 -111 -78 -144 -99 -87 100 -2 -127 179 -131 82 85 231
5316 231 -66 -140 -218 79 -180 -84 -92 -142 -135 -38 -99 -102 -82 -84 -63 -60 145 -15 -141 51 245 104 139 152 116 108 22 133
5344 133 -98 -131 -117 34 -150 -72 -147 -93 -80 -113 -40 31 276 148 -45 -18 41 238 201 48 -35 25 31 -128 -187 -6
5370 -6 -17 26 91 -5 3 -12 -36 158 202 81 314 151 4 133 16 178 -10 -23 -53 47 34 -98 -47 -114 -40 -154
5396 -154 -62 -211 60 -9 66 174 153 110 -78 50 -157 -87 13 -125 -241 -18 13 48 -204 96 29 -257 -122
5419 -122 134 -151 7 207 125 191 190 128 199 -201 -1 -11 102 -198 -111 -165 -84 -128 -141 -182 210 -108 -139 32 24
5444 24 18 -16 166 165 154 65 -19 -68 54 166 33 56 -4 100 107 -6 -202 -225 95 51 86 -10 20 -187 30 85 204
5471 204 200 -3 2 73 12 73 -18 -76 -94 -80 -102 -181 0 -205 -91 -101 -54 38 153 -111 80 127 258 167 -78 27
5497 27 125 21 -129 218 -118 -61 198 -92 14 -85 19 -104 -118 -86 30 -16 111 10 217 -44 49 -157 -115
5520 -115 109 140 30 93 -128 39 -206 -111 207 66 -89 -23 -2 345 140 -175 4 58 87 -154 -49 105
5542 105 111 -113 184 0 -6 -328 31 -99 -3 231 -30 127 -117 26 48 69 322 206 92 144 318 161 55
5565 55 45 97 111 -55 -100 -54 -26 -245 -93 -43 41 -89 277 -35 62 256 -78 52 97 65 -136 -104 -62 -47 115
5590 115 80 -14 -242 -36 -31 -75 10 201 -86 -100 -93 14 64 44 36 86 103 -32 120 36 148 -24 207 -33 -74 -58
5616 -58 -74 -84 -18 -79 -169 -84 -43 131 -97 -3 -60 -54 43 111 -60 -158 63 -68 -170 -60 -125 16 -226 -175 -47 -133
5642 -133 -140 84 18 20 -21 92 146 -41 -91 -122 3 102 103 170 -55 78 -184 183 -103 -49 71 -80 -42 -146 -43
5667 -43 341 -48 89 -37 93 159 52 -49 17 5 -92 -25 -238 21 -105 56 -52 -51 -56 -54 60 73 144 202 -238
5692 -238 -77 12 51 -115 155 26 83 -39 1 53 -5 -256 45 14 -11 -147 -246 -116 111 166 55 5 -80 363
5716 363 30 231 13 38 44 29 5 118 -32 -44 -152 -148 -52 -80 -65 -4 -144 -21 -209 -19 51 50 -28 -216 70
5741 70 -122 90 26 41 16 38 -56 108 -40 -18 -52 -167 -114 -100 -19 161 -41 -107 20 9 161 147 82 -138 50
5766 50 -225 183 33 107 0 -59 -102 207 32 65 -140 -61 70 234 75 90 -23 -135 254 189 -177 -29 58
5789 58 -72 220 42 -81 -140 5 -190 -125 -247 2 -99 -187 135 -4 -22 -140 74 111 -41 -190 230 121
5811 121 14 -35 143 -69 27 -217 -250 71 -51 -47 175 -4 -76 17 30 -100 116 -114 7 113 -30 92 55
5834 55 72 -54 62 124 -16 -468 -184 40 85 54 -139 119 214 -22 18 174 144 -36 114 -204 178 -49 -71
5857 -71 191 -90 -110 5 -145 -138 -172 1 -51 -146 -52 118 -84 -153 -94 252 -5 71 24 110 21 -69 -68 -35 89 -249
5883 -249 -8 -222 -220 -201 -82 161 -26 -63 -18 -39 -2 122 63 45 -46 -87 148 53 1 114 70 -51 -98 -273 -22
5908 -22 193 116 41 -144 -78 -66 -5 172 -58 -25 109 -3 -49 128 194 171 -3 91 -201 -71 -34 102 -167 -128
5932 -128 74 58 177 -43 130 101 -154 5 -25 -65 -51 -56 34 63 -92 -298 49 51 -19 -87 -229 -81 136 10
5956 10 -94 160 -187 119 -29 -85 63 -9 89 50 6 -253 68 -117 -49 184 -42 56 54 -86 -97 5 -156 88
5980 88 -71 48 -12 149 -58 -14 -17 -107 78 161 261 92 8 -96 -73 -44 26 -4 -44 154 -141 -235 -117 -157 -12
6005 -12 -55 -68 37 168 -91 -105 -22 -22 143 -228 -142 -100 -178 55 -53 -9 -120 -111 -152 38 -14 22 -69 110 30 122
6031 122 81 12 19 -46 -101 161 -66 -69 -85 -99 126 -64 140 3 107 -167 108 221 213 163 20 -157 32 -1 32
6056 32 -254 -102 -172 -61 -147 61 -73 -137 18 -129 143 -28 296 211 26 -111 17 105 83 159 -15 169 -296
6079 -296 55 140 -260 101 -45 -77 13 -42 -58 -234 -15 -79 -97 -62 83 204 -327 194 -20 -97 17 67 44 -45
6103 -45 -2 69 -85 -20 -31 92 65 -129 -45 -86 -36 120 -129 -87 60 72 133 -218 6 40 -150 9 70 -91 -204
6128 -204 45 -53 -19 153 -53 94 -61 -81 -151 167 108 17 -28 44 -49 -161 -39 237 -229 -185 -93 56 14 -122
6152 -122 -8 37 -95 -135 -8 -130 0 -231 -36 107 -41 177 91 111 280 70 -101 115 76 -95 76 27
6174 27 -253 15 -105 -151 -114 78 -43 106 20 257 9 68 87 47 -32 -44 36 36 70 -129 -30 21 -154 -156 -143 -46
6200 -46 -101 -86 -20 69 99 -41 -62 9 219 32 26 383 9 -27 58 36 -80 -32 -32 179 -190 72 5 -14 80 -40
6226 -40 114 127 -25 137 16 -71 -86 146 157 42 -71 -141 -57 -169 48 -61 -224 9 -86 -46 -122 -122 68 8
6250 8 98 307 -73 -214 59 48 197 174 -128 -75 -140 122 156 7 -73 -29 -68 -34 -131 -9 85 107 -109 -71 40
6275 40 83 108 240 -50 98 158 45 76 28 115 111 -1 111 79 -11 -90 41 -186 -135 177 4 133 -107 -36 -174
6300 -174 -249 -81 125 -211 58 35 -112 102 -216 -214 125 -22 -15 52 -50 -15 112 181 70 34 -25 61 170 -121
6324 -121 148 68 207 -45 159 37 50 182 -76 5 170 123 -102 -110 -48 52 44 -50 159 -74 74 47 -28 192
6348 192 117 32 -22 -102 40 -61 87 -256 -88 81 -166 41 2 103 -58 -149 -35 7 21 10 10 80 -132 128
6372 128 1 83 -1 -28 -124 -45 -26 -9 -11 97 -1 -45 1 -188 55 55 -31 -130 -71 78 -23 23 -30 61 119 -69 21
6399 21 -159 -121 -229 -104 170 -132 -51 0 31 140 36 107 53 137 -26 -111 14 -30 33 75 -75 -196 -80 38
6423 38 15 -80 -83 -25 -25 -100 177 130 -21 46 -79 7 109 55 -10 -15 108 49 -89 -104 -191 -153 48 125 -69 88 9
6450 9 101 36 115 249 -150 -144 -180 119 75 157 70 -3 86 -53 102 3 -271 28 111 61 57 40 -215 13 -73 39 -20
6477 -20 115 -146 6 223 56 -50 -13 -69 -90 -33 -136 -11 -2 51 1 106 -34 -114 87 106 120 122 31 -97 -202
6502 -202 9 -102 4 216 60 -232 -54 10 -168 64 44 -85 -149 -25 -61 -60 142 -196 -16 62 -238 29
6524 29 -36 -73 50 118 -69 26 -120 -170 180 20 6 -82 22 -55 213 -125 -38 96 21 -6 -78 -108 -75 45 68
6549 68 140 76 -193 -183 -24 88 133 -105 60 204 -80 -7 -180 103 276 -166 -31 85 299 104 -26 -48
6571 -48 8 72 53 -10 7 -227 -37 -51 54 -242 75 11 -63 8 113 71 -314 255 -129 49 133 -25 167 93
6595 93 -187 -155 -70 -202 -27 -206 -140 110 -6 70 34 102 101 185 -63 155 -159 164 142 29 136 17 -57 105
6619 105 34 86 15 294 -144 -48 -64 -168 -32 67 23 -141 2 -289 -6 -75 4 -27 92 -135 -140 -94 -147 -56 -98
6644 -98 -223 -14 161 60 54 -1 -355 -54 8 -155 137 -119 32 130 -5 127 254 60 -163 -51 9 152
6666 152 79 -86 33 -121 -66 -232 -138 131 56 -212 -8 49 -28 47 29 -204 -188 219 -68 180 -62 138 3
6689 3 -108 136 4 -192 -148 -96 52 98 -163 19 48 -134 50 -86 -11 47 280 -147 -38 24 -83 -58 -70 -177
6713 -177 -155 18 5 26 -171 36 -67 -57 122 2 181 -59 59 -150 -127 -18 123 -87 -29 86 -98 36
6735 36 55 47 -16 -126 -153 -75 36 -27 -284 90 13 -277 73 -65 55 -57 -29 31 -151 37 80 -37 129 54
6759 54 -6 88 -139 -160 231 -141 -163 224 -6 109 -56 -138 181 -51 9 123 133 -68 78 89 -42 -99 3
6782 3 -32 25 -50 63 -160 -100 -55 -12 42 103 19 -76 96 87 -7 -50 -126 0 11 158 -184 -58 -61 -63 -3 -128 -47 60
6810 60 -7 116 -64 8 -8 -30 106 20 25 87 151 28 -15 -91 72 138 -49 -61 0 8 57 82 106 -81 101 34 31 47
6838 47 190 -159 -86 -135 -137 97 51 71 147 -50 -54 -193 19 114 117 -130 -95 87 144 -210 -169 33 -216 -86 -95 1
6864 1 24 27 17 19 -27 -28 84 -123 -157 39 -124 34 -28 -59 -13 -25 223 62 142 -58 -37 47 27 -91 -87 -83 -191 7
6892 7 -8 65 68 -212 46 -107 -53 -142 -65 149 60 -44 103 74 -67 -74 2 103 -73 -128 90 -160 -16 124 84
6917 84 38 45 35 4 -221 -181 165 27 212 112 -35 41 -86 -27 110 39 -16 -114 -101 -252 122 -5 14 3 -27
6942 -27 -44 60 -107 132 45 76 -110 5 -102 107 -81 32 -70 -94 0 -120 -200 -48 -44 76 -318 -125 -15
6965 -15 99 -185 -75 180 83 102 -140 53 252 -65 110 43 -47 -121 -14 -123 -43 -190 43 -75 -76 -155 91
6988 91 -85 -81 -48 31 -30 -131 291 -86 165 209 -226 -54 254 -333 -144 40 -126 14 -15 6 51 -1 -45 -13
7012 -13 57 -9 105 -4 86 144 101 89 -29 79 2 -159 62 75 76 -44 -19 110 114 -233 65 -45 90 231 -105
7037 -105 70 12 210 -379 171 249 -26 4 -63 -90 -60 -44 14 106 -41 -45 17 68 36 182 42 -25 67 34 36 -108
7063 -108 93 81 46 -89 -62 -117 -293 1 -181 75 -20 -99 -9 81 60 114 -96 -231 -89 104 64 80 125 -117
7087 -117 25 -51 -148 -99 71 -149 -98 65 -90 53 -107 -64 -136 85 -122 -42 13 -35 83 -33 153 6 125
7110 125 -188 -12 -57 89 -24 36 -35 91 -24 107 168 -101 191 142 -2 -39 -42 177 425 65 -87 -10 139
7133 139 -50 -36 -91 -232 38 -115 15 33 -28 -137 -18 -124 -179 -53 39 28 -113 46 -81 62 13 -90 -50
7156 -50 92 68 -310 -77 68 -163 -60 41 -162 53 12 14 -293 -268 -142 101 -233 125 172 -189 -183 -62 145
7179 145 105 79 46 202 226 13 -144 -42 -100 -167 -77 127 -6 -55 -205 128 -57 26 152 -225 31 -52 66
7202 66 83 96 108 -47 42 -74 49 96 42 -56 -48 -130 -64 16 -94 66 109 73 38 -61 274 -104 75 -71 92 13
7228 13 -144 8 -177 98 -122 -114 -46 111 -31 30 159 243 18 41 -24 5 -87 -133 34 -236 -74 126 351 -70
7252 -70 48 18 73 123 -352 92 -92 5 32 12 82 47 -156 -34 -92 112 1 -34 22 -45 -88 29 -91 -263 134
7277 134 -82 -33 196 61 44 16 134 -58 211 149 31 117 -37 67 -6 -7 32 21 -70 -158 5 -52 -55 115 188
7302 188 26 -85 -94 149 34 85 174 73 -81 -67 54 155 -138 112 -224 -20 -44 29 -20 29 41 21 14 -135
7326 -135 -90 -207 -76 93 33 53 -3 97 -101 -78 57 9 -107 -3 -164 17 127 -5 70 -134 -25 114
7348 114 52 92 -27 -40 81 -1 143 23 14 43 11 -80 -108 -73 100 116 -50 -47 -45 -191 -110 37 -98 119 8 -164
7374 -164 -11 28 -128 -6 53 118 98 83 -12 -5 -117 -21 22 -1 -182 -101 -131 -250 110 -79 -56 63 150 -82 191
7399 191 70 -100 -270 65 129 67 133 -29 -162 157 153 -117 76 -141 6 -86 27 53 36 175 12 -159 -141
7422 -141 -55 216 14 81 161 195 -41 24 17 29 34 -73 117 -97 -49 -112 -254 -228 82 -90 -86 120 70 -68 97
7447 97 -60 -43 -61 102 93 -134 -176 -13 -103 8 -147 -86 69 -59 26 48 -126 8 231 -22 135 64 -192 58
7471 58 266 -146 7 -79 25 -134 125 -113 38 -74 -32 -35 -82 -61 6 -12 1 108 111 -97 130 58 112 -110 -14
7496 -14 -90 -49 -156 1 -113 -42 179 83 -12 51 -115 -138 101 -31 -28 -104 24 113 -195 55 -68 -101 -91 4 93
7521 93 -36 -10 39 -114 -237 -231 -49 -6 -127 220 -41 -13 214 9 51 -40 12 -36 223 -90 20 -112 -216 -15
7545 -15 106 64 -102 82 44 33 -63 -80 158 -34 97 33 64 38 10 -52 33 52 151 32 89 -130 65 130 -56
7570 -56 55 160 59 -205 26 -162 -66 -55 3 -121 -103 147 -87 -31 274 62 -93 -111 -112 119 -9 -14 22 -127
7594 -127 -73 -116 53 54 -177 -12 25 59 -49 -9 123 126 84 -77 101 -62 78 -160 -169 -151 207 96 -40 -76 -10
7619 -10 -9 -117 52 -200 -40 -21 -149 112 -98 131 -157 144 -88 -139 15 57 -138 -26 70 -161 92 -185
7641 -185 60 -172 69 112 -54 9 5 189 134 -17 213 206 -4 36 -57 61 -159 78 160 21 -13 106 -42 -50
7665 -50 -1 -130 -154 -39 124 -95 -24 108 142 109 58 140 -164 99 -90 47 -104 -85 101 -38 191 -176 -114
7688 -114 -70 55 144 -77 -94 31 -110 -104 10 -194 -29 70 -265 220 -39 -99 70 107 -98 -36 -33 -131 -71 -25 103
7713 103 57 16 46 23 -6 -63 -104 31 -41 4 -95 59 180 104 -185 -12 -373 162 -22 -131 0 -35 -15 304
7737 304 -64 45 -135 27 28 -355 105 -73 51 -72 6 -116 44 -199 -158 166 22 -15 -43 93 72 114 237
7760 237 55 30 81 123 31 -127 128 -17 192 -13 56 125 -111 82 4 -144 -229 114 -132 -15 144 96 53
7783 53 -158 73 -241 -3 -93 -167 11 109 -62 -165 -98 0 -1 190 90 71 82 64 297 -74 -79 2 31 96 3 -129
7809 -129 -64 155 183 -134 -237 93 113 124 0 82 -96 -132 -3 -155 -36 -149 -122 65 -110 -73 25 188 93
7832 93 22 62 -103 3 -3 -128 27 39 -143 -54 -136 -97 79 -223 183 -6 -4 -81 222 28 9 60 -159 16 -61
7857 -61 -144 84 25 132 121 -80 227 -24 -120 111 36 14 39 -37 52 -38 -29 -110 -36 92 -176 23 122 -73 100
7882 100 24 15 -27 118 -63 8 38 -37 150 238 94 -101 20 216 188 292 -73 2 -1 231 -43 18 -11 -20 -243
7907 -243 -106 -152 -106 65 -109 -112 20 -111 -134 -46 -10 12 -19 -84 -115 -97 5 -205 87 25 33 36 16 -3 265 13
7933 13 81 -105 255 -17 -143 229 8 -230 -239 -4 -129 -126 -179 179 47 -27 -87 113 59 -18 -33 -137 -109 192
7957 192 -87 217 140 198 26 94 -26 27 -151 31 107 -79 59 -101 -86 -73 -86 104 81 155 -90 -46 158 -1
7981 -1 44 24 12 30 -30 231 39 -70 57 -65 83 32 -57 -146 -150 -35 120 -16 35 72 65 137 60 46 10 78 53
8008 53 -31 -100 -36 -134 -29 -145 -10 -177 -110 75 -124 -94 -72 94 23 25 33 4 112 -24 -175 -40 -22 -234 -49
8033 -49 -98 -246 71 -19 -45 -81 -5 -37 40 35 -58 -44 81 -60 144 49 -33 112 -48 219 66 -89 -72 -31 33 -161
8059 -161 -12 -113 -114 -55 -11 35 -149 33 -164 9 63 37 82 177 123 23 178 26 -134 -69 -7 248 -28 0
8083 0 134 -78 -25 -57 81 -136 43 -155 138 62 64 215 -26 62 33 -28 -457 82 -147 -89 44 28 38 -5 42
8108 42 -85 -36 17 190 92 174 -293 120 -131 -53 82 -190 -106 -187 -153 -124 43 163 168 -54 -131 -69 67 28 -32
8133 -32 98 173 3 145 205 -178 -30 -54 210 -116 78 -47 -82 157 -15 13 -187 21 -31 -62 73 -13 92
8156 92 -49 -76 -30 35 -31 65 -47 26 -8 -9 62 -112 -107 19 26 -77 -207 3 -70 -111 -29 -193 249 -65 -43 133
8182 133 225 -156 152 42 -107 -132 -86 7 -104
8191a04
##END NTUPLES=NMR FID
##END=
