##TITLE=1H_Ser Am-NEA
 200.13MHz, CDCl3,
 8 sc
 
 25.4.2025
##JCAMPDX= 6.0         $$ Bruker NMR JCAMP-DX V2.0
##DATA TYPE= NMR FID
##DATA CLASS= NTUPLES
##ORIGIN= UXNMR, Bruker Analytische Messtechnik GmbH
##OWNER= pz
$$ XWIN-NMR		Version 3.5
$$ Fri Apr 25 14:06:02 2025 Russian Standard Time (UT+4h)  she@DPX200
##.OBSERVE FREQUENCY= 200.1313
##.OBSERVE NUCLEUS= ^1H
##.DELAY= (6, 6)
##.ACQUISITION MODE= SIMULTANEOUS
##.ACQUISITION SCHEME= undefined
##.AVERAGES= 8
##.DIGITISER RES= 18
##SPECTROMETER/DATA SYSTEM= spect
##.PULSE SEQUENCE= zg30
##.SOLVENT NAME= CDCl3
##.SHIFT REFERENCE= (INTERNAL, CDCl3, 0, 14.3821)
##AUDIT TRAIL= $$ (NUMBER, WHEN, WHO, WHERE, WHAT)
$$ ##TITLE= Audit trail, XWIN-NMR		Version 3.5
$$ ##JCAMPDX= 5.01
$$ ##ORIGIN= Bruker BioSpin GmbH
$$ ##OWNER= she
$$ F:/spectra/data/she/nmr/H-C/1/audita.txt
$$ ##AUDIT TRAIL=  $$ (NUMBER, WHEN, WHO, WHERE, WHAT)
(   1,<2025-04-25 14:04:38.09 +0400>,<she>,<DPX200>,
      <created by zg, POWCHK disabled, PULCHK disabled
       configuration hash MD5:
       00 E9 B6 7A A2 85 ED C7 34 08 36 98 17 FE 4E 26
       data hash MD5: 16K
       9A FA AE B8 29 24 36 A5 23 50 C4 BB 1D A5 A2 4D>)
$$ ##END=
$$ 
$$ hash MD5
$$ 03 5A A1 7D D6 FF A6 A2 94 CB B3 5B 83 1D 0B 6A
##$RELAX= 
##$RELAX= 
##$RELAX= 
##$RELAX= 
##$RELAX= 
##$RELAX= 
$$ Bruker specific parameters
$$ --------------------------
##$DU= <F:/spectra>
##$EXPNO= 1
##$NAME= <H-C>
##$PROCNO= 1
##$TYPE= <nmr>
##$USER= <she>
##$AMP= (0..31)
100 100 100 100 100 100 100 100 100 100 100 100 100 100 100 100 100 100 
100 100 100 100 100 100 100 100 100 100 100 100 100 100 
##$AQSEQ= 0
##$AQ_mod= 1
##$AUNM= <au_zg>
##$AUTOPOS= <>
##$BF1= 200.13
##$BF2= 200.13
##$BF3= 200.13
##$BF4= 200.13
##$BF5= 200.13
##$BF6= 200.13
##$BF7= 200.13
##$BF8= 200.13
##$BYTORDA= 1
##$CFDGTYP= 0
##$CFRGTYP= 5
##$CHEMSTR= <none>
##$CNST= (0..31)
1 1 145 1 1 1 1 1 1 1 1 1 1 1 1 1 1 1 1 1 1 1 1 1 1 1 1 1 1 1 1 1 
##$CPDPRG= <>
##$CPDPRG1= <>
##$CPDPRG2= <>
##$CPDPRG3= <>
##$CPDPRG4= <mlev>
##$CPDPRG5= <mlev>
##$CPDPRG6= <mlev>
##$CPDPRG7= <mlev>
##$CPDPRG8= <mlev>
##$CPDPRGB= <>
##$CPDPRGT= <>
##$D= (0..31)
0 0.7 0 0 0 0 0 0 0 0 0 0.03 0 0 0 0 0 0 0 0 0 0 0 0 0 0 0 0 0 0 0 0 
##$DATE= 1745575477
##$DBL= (0..7)
120 120 120 120 120 120 120 120 
##$DBP= (0..7)
150 150 150 150 150 150 150 150 
##$DBP07= 0
##$DBPNAM0= <>
##$DBPNAM1= <>
##$DBPNAM2= <>
##$DBPNAM3= <>
##$DBPNAM4= <>
##$DBPNAM5= <>
##$DBPNAM6= <>
##$DBPNAM7= <>
##$DBPOAL= (0..7)
0.5 0.5 0.5 0.5 0.5 0.5 0.5 0.5 
##$DBPOFFS= (0..7)
0 0 0 0 0 0 0 0 
##$DE= 6
##$DECBNUC= <off>
##$DECIM= 32
##$DECNUC= <off>
##$DECSTAT= 4
##$DIGMOD= 1
##$DIGTYP= 9
##$DL= (0..7)
0 120 120 120 120 120 120 120 
##$DP= (0..7)
150 150 150 150 150 150 150 150 
##$DP07= 0
##$DPNAME0= <>
##$DPNAME1= <>
##$DPNAME2= <>
##$DPNAME3= <>
##$DPNAME4= <>
##$DPNAME5= <>
##$DPNAME6= <>
##$DPNAME7= <>
##$DPOAL= (0..7)
0.5 0.5 0.5 0.5 0.5 0.5 0.5 0.5 
##$DPOFFS= (0..7)
0 0 0 0 0 0 0 0 
##$DQDMODE= 0
##$DR= 18
##$DS= 0
##$DSLIST= <SSSSSSSSSSSSSSS>
$$ [...]
##$SUBNAM0= <"">
##$SUBNAM1= <"">
##$SUBNAM2= <"">
##$SUBNAM3= <"">
##$SUBNAM4= <"">
##$SUBNAM5= <"">
##$SUBNAM6= <"">
##$SUBNAM7= <"">
##$SUBNAM8= <"">
##$SUBNAM9= <"">
##$SW= 18.0517328524113
##$SWIBOX= (0..15)
0 0 2 0 0 0 0 0 0 0 0 0 0 0 0 0 
##$SW_h= 3612.71676300578
##$TD= 16384
##$TD0= 1
##$TE= 0
##$TE2= 300
##$TE3= 300
##$TEG= 300
##$TL= (0..7)
0 120 120 120 120 120 120 120 
##$TP= (0..7)
150 150 150 150 150 150 150 150 
##$TP07= 0
##$TPNAME0= <>
##$TPNAME1= <>
##$TPNAME2= <>
##$TPNAME3= <>
##$TPNAME4= <>
##$TPNAME5= <>
##$TPNAME6= <>
##$TPNAME7= <>
##$TPOAL= (0..7)
0.5 0.5 0.5 0.5 0.5 0.5 0.5 0.5 
##$TPOFFS= (0..7)
0 0 0 0 0 0 0 0 
##$TUNHIN= 0
##$TUNHOUT= 0
##$TUNXOUT= 0
##$USERA1= <user>
##$USERA2= <user>
##$USERA3= <user>
##$USERA4= <user>
##$USERA5= <user>
##$V9= 5
##$VALIST= <valist>
##$VCLIST= <CCCCCCCCCCCCCCC>
##$VD= 0
##$VDLIST= <DDDDDDDDDDDDDDD>
##$VPLIST= <PPPPPPPPPPPPPPP>
##$VTLIST= <TTTTTTTTTTTTTTT>
##$WBST= 1024
##$WBSW= 4
##$XGAIN= (0..3)
0 0 0 0 
##$XL= 0
##$YL= 0
##$YMAX_a= 285765
##$YMIN_a= -363019
##$ZGOPTNS= <>
##$ZL1= 120
##$ZL2= 120
##$ZL3= 120
##$ZL4= 120
##$ABSF1= 10
##$ABSF2= 0
##$ABSG= 5
##$ABSL= 3
##$ALPHA= 0
##$AQORDER= 0
##$ASSFAC= 0
##$ASSFACI= 0
##$ASSFACX= 0
##$ASSWID= 0
##$AUNMP= <proc_1d>
##$AZFE= 0.1
##$AZFW= 0.1
##$BCFW= 1
##$BC_mod= 2
##$BYTORDP= 1
##$COROFFS= 0
##$CY= -3
##$DATMOD= 1
##$DC= 2
##$DFILT= <>
##$DTYPP= 0
##$F1P= 0
##$F2P= 0
##$FCOR= 0.5
##$FTSIZE= 0
##$FT_mod= 4
##$GAMMA= 1
##$GB= 0.15
##$INTBC= 1
##$INTSCL= 1
##$ISEN= 128
##$LB= 0.25
##$LEV0= 0
##$LPBIN= 0
##$MAXI= 10000
##$MC2= 0
##$MEAN= 0
##$ME_mod= 0
##$MI= 1.114404
##$NCOEF= 0
##$NC_proc= 0
##$NLEV= 6
##$NOISF1= 3.799351
##$NOISF2= 2.8
##$NSP= 1
##$NTH_PI= 0
##$NZP= 0
##$OFFSET= 14.38212
##$PC= 1
##$PHC0= -830.1433
##$PHC1= 8.9922
##$PH_mod= 1
##$PKNL= yes
##$PPARMOD= 0
##$PSCAL= 0
##$PSIGN= 0
##$REVERSE= no
##$SF= 200.129724274929
##$SI= 16384
##$SIGF1= 3
##$SIGF2= 2
##$SINO= 400
##$SIOLD= 16384
##$SREGLST= <1H.CDCl3>
##$SSB= 0
##$STSI= 0
##$STSR= 0
##$SW_p= 3205.1282051282
##$SYMM= 0
##$S_DEV= 0
##$TDeff= 0
##$TDoff= 0
##$TI= <>
##$TILT= no
##$TM1= 0
##$TM2= 0
##$TOPLEV= 0
##$USERP1= <user>
##$USERP2= <user>
##$USERP3= <user>
##$USERP4= <user>
##$USERP5= <user>
##$WDW= 1
##$XDIM= 8192
##$YMAX_p= 0
##$YMIN_p= 0
$$ End of Bruker specific parameters
$$ ---------------------------------
##NTUPLES= NMR FID
##VAR_NAME=  TIME,          FID/REAL,        FID/IMAG
##SYMBOL=    X,             R,               I
##VAR_TYPE=  INDEPENDENT,   DEPENDENT,       DEPENDENT
##VAR_FORM=  AFFN,          ASDF,            ASDF
##VAR_DIM=   8192,          8192,            8192
##UNITS=     SECONDS,       ARBITRARY UNITS, ARBITRARY UNITS
##FACTOR=    0.0002768,     1,               1
##FIRST=     0,             0,               0
##LAST=      2.2672688,     0,               0
##MIN=       0,             -363019,         0
##MAX=       2.2672688,     285765,          0
$$ Real data points
##PAGE= N=1
##DATA TABLE= (X++(R..R)), XYDATA
0@%%%%%%%%%%%%%%%qJ6j6J6j6J6k4L2l2M0m8N4o2P1q3R3j05J19j34J53j73J92
37A01k13K39k66K93l26L63m01M43m89N37n91O52p19P93q73R62j063J176j304J452
57G66j624J826k064K356k722L192l824M714o059Q303j2691K4253j09735k69710
71c63019L01305K36645j69489r2334J09203l3121n6512J10239M7861r6071L448
82a845N4046n0049l1001L6559l6265j1859Q4323l3038j24939P5335J47560p2400
94C6427j07154Q0295M4942q0994K8389Q4000q4002p7790Q6122K3937q1749K8376
106a9201O3209o6063k5787R3401k1434j14362O4658J36061n8893j16180K6787
117c7804N2036r494O932Q574k9373p216J3784r022J9804L8118m3725n2128O0717
$$ y = [0, 0, 0, 0, 0, 0, 0, 0, 0, 0, 0, 0, 0, 0, 0, 0, -8, 8, -8, 8, -8, 8, -16, 16, -16, 24, -24, 30, -32, 39, -44, 49, -56, 63, -71, 82, -91, 101, -112, 127, -139, 154, -172, 191, -210, 233, -256, 281, -310, 342, -377, 416, -457, 505, -558, 618, -686, 766, -858, 968, -1096, 1260, -1462, 1730, -2094, 2620, -3439, 4864, -7827, 16426, -93309, -363019, -61714, 174931, 5442, -86892, 22311, -10810, -67322, 42917, 90778, -5293, -1845, 52201, 2152, -28849, 7710, -28555, -40414, 43909, 10871, -114068, -38733, 108827, 36427, -70727, 9568, 54510, -26484, 1905, 85905, 1903, -75887, 10235, 34172, -47577, -19201, 44008, -22055, -47842, 45559, 24125, -90237, -25579, 110482, 51589, -64591, -37804, 14232, 4738, 11670, 20244, -9129, -16345, -2561, -11583, 8221, 46339, 2614, -49514, 11203]
130A1203M0898p9467k1330Q1445j2670p8888M1538O9166n7490m4479P8232L3960
142F2118q0967l1752O5709L8093l1661m2436j8829K3183L5476j2892k4304K5765
154G503J1368m7458r921N8201J9247l6089j964Q500l6557l050O0738J3394n1401
167g489k0983J8647J3935J3490L56l2104r479L7634L009m1133J2447M0968l0259
180i61m3451L2832M1033k1405k3246J4017J0922m223k08N46K168P927j4373k4733
194b3155J8993K6361l3214k9476M3781L1586m3032k7028L5767K0291j8082J283
206D075J0807j9694j3264K3051J2616j6161j1177K572O698Q624m634j3754P892
219b349J8680j2438k4820J4114K7123j4878k5240Q313J3898j214J853L510o732
$$ y = [11203, 52101, -27366, -48696, 32749, 20079, -58809, -17271, 51895, -5595, -50074, 28158, 62118, -18849, -50601, 15108, 53201, 21540, -20896, -39725, -16542, 18934, 6042, -18262, 7503, 18871, -28587, -38508, 19693, 38940, 2851, 887, 9387, -27170, -30220, 30518, 43912, -7489, -28472, -9825, 4110, 17600, 17956, -14148, -23627, 14007, 17016, -24117, -11670, 29298, -961, -44412, -11580, 29453, 8048, -15198, -1181, 9741, 5518, 5310, 5856, 8024, 15951, 1578, -23155, -4162, 22199, -11015, -40491, 3290, 34876, -8156, -35184, 583, 20874, 2792, 4075, 14882, -4812, -18076, 4975, 17591, 1430, -9747, -7175, -477, 8147, 3513, -10241, -2349, 16331, 3893, -20927, -6813, 20310, 5432, -19808, -11495, 2403, 1189, 3042, 6552, -180]
232a80m163Q266O846l140m047k407l301K979M9j0391k290J1273R16r683K732R967
248C426k394m191J0348R159j3417j3899J0024J5900n124j8194n247J4006Q248
261H645j1085o985J0996N620j0724m147J2399M881j5034o840J4695N073j4247
274f753l627J5687P105j3815p988J5640J0549j4086j1203J0116P966j1115j2036
287a3560Q835J0423r183j1414R595J3934m754j1877N163J5997k264j4729P73J2538
301I477n55j3304m730J0135M003j0494m608R676N859p172n216P834P006p453p282
316f824O997N789p973n026P904N618n902n039O352O643m464n903K555L829l859
331F97o992J625O590n040p990N932R791l744p087O435R729m406p575N274N651
$$ y = [-180, -4343, 3923, 10769, 7629, 3582, 1175, -2126, 853, 902, -9489, -11779, -506, 410, -9273, -6541, 3426, 1032, -3159, 7189, 16348, 2931, -10968, -944, 14956, 9832, -8362, -13609, 397, 8645, -2440, -9425, 1571, 7191, -3533, -7680, 4719, 9600, -5434, -12274, 2421, 7494, -6753, -10380, 5307, 12412, -1403, -9391, 6249, 16798, 2712, -8491, 1625, 9591, -1524, -13560, -4725, 5698, -3485, -14899, -5304, 8630, 3876, -8001, -2838, 13159, 10895, -3834, -3061, 9477, 8922, -4382, -9112, 1023, 5026, -5468, -10076, -400, 5459, -1713, -6929, 905, 7911, 458, -6824, 173, 5962, -2011, -7037, 867, 6485, 583, -4456, 1896, 8539, 4075, -1828, 727, 4556, 697, -6295, -4670, 1920, -3120, -11110, -5178, 4613, 869, -6218, 217, 9946, 5540, -2035, 3239, 8890]
346H890o724n775L731K693n696n476M910N750l192n016L056O759J42o426M59Q135
362F220j944r841J881J0592k773j1855K775J3163p68j2532Q89J1046n7r495k978
377e677N376K723n909m440M897N100m552n165Q420J1122p169j2051Q825J3035
391A4535r159j2672O581Q154q734r421O088Q104m495o047K273P010K700n597k855
406c535Q691L238j2317l446J3682L174j5224m173J3939L452j0912J64Q623j904
420C452o320J29K781K055j624n483l26P127r92r409L219J4835o37j1059K266O081
436F095o830K05J1600k999j6660l150J0119M356l246l292l409K774R333j503p391
451c998O679O395j1092m345J2894J634j1208J225N045j0523k906J8255O161j6413
$$ y = [8890, 2166, -3609, 122, 2815, -2881, -8357, -3447, 2303, -889, -5905, -2849, 3910, 4052, -2374, -1915, 6220, 4276, -5565, -3684, 6908, 4135, -7720, -4945, 8218, 7450, -5082, -4193, 6853, 6796, -2699, -5677, -301, 2422, -3487, -7927, -3030, 2070, -2482, -7647, 773, 11895, 4726, -7325, 1500, 14535, 5376, -7296, -715, 7439, -1295, -10716, -4628, 3476, -1019, -7066, -4793, 2217, 4917, -680, -3535, 5156, 8394, -3923, -7369, 6313, 9487, -5737, -9910, 4029, 7481, -3431, -3267, 5356, 3452, -2868, -2739, 42, 2097, 473, -5010, -5336, 1791, 799, -8610, -5391, 9444, 8807, -2252, 14, 6095, -735, -530, 11070, 8071, -8589, -11739, -1620, 2736, -510, -3802, -7211, -4437, 4896, 3393, -3998, 2681, 9076, -2016, -6361, 6533, 8167, -3041, -1816, 3229, -7294, -10200, 8055, 14216, -2197]
465b197q621O593N015M355R95r806m253R642K94j1102N221J3790o565r143J0821
480E039L628j4851J890J7048l014j5764j310N120M70K040q53p302K073R587k787
495A014n374J2612J803j8836o8K2051n81j8449J659R253q197p228J0733O187n438
510A141j256n07n529K509N887j217K602M662j2601j2777J2956J7171p795j0543
524e297Q750K916j1572l06J1283L530l896n921r590j067J3349O982r150q908o64
539i561L820J0494J1668q157j9125j31J5646O859k326m795q813o544L631P295
553c9M912J694n488j0587k0J2057L189m709K315J2r252j09J0566o07q752K816
569b002P241j516m274Q61n34M0L868j458n035J992N2m399K977M990p071m889J1205
$$ y = [-2197, -10818, -4225, 790, 5145, 6140, -3666, -7919, 1723, 2017, -9085, -3864, 9926, 3361, -5782, 5039, 8667, -6184, -4294, 12754, 9740, -6024, -7334, -2214, -1744, 296, -557, -7859, -5786, 3801, 1014, -4360, 8252, 10055, -8781, -8849, 13202, 12621, -5828, -4169, 5084, -3113, -10341, 392, 6579, 1141, -115, -622, -6151, -3642, 2245, 1028, 3630, 8292, -4309, -17086, -4130, 13041, 5246, -5297, 3453, 6369, -5203, -5509, 5774, 9304, 5408, -513, -10103, -11170, 2179, 9161, 11, -8897, -9561, -5741, 4753, 16421, 8264, -10861, -10992, 4654, 11513, 9187, 4392, -4421, -10965, -7334, -39, 4873, 6567, 1079, -9508, -9528, 2529, 5718, 1009, 3324, 3336, -5916, -6025, 4541, 3934, -4818, -2002, 5239, 3723, -551, 310, -224, -184, 3684, 2226, -2809, -817, -765, -5164, -2187, 2803, -4268, -9157, 2048]
586B048O706q538k216P294l823p622Q083J0253m436j0308p393j033J0006J0447
600I468n840r992K111M544m031J805Q621j614o917L728J84q945J901J0987P91
615F801o980l551k80L551Q189r57j1336j371Q562k632m357Q067N67j4733j737
630a2197J4865O078m353k941k339l950M184O484M81n14l333j0847k981J3992M468
645G097j0399p09N300o096k324J2713L063j3385j160J1256l64n278J153k391l790
660e314P438M312p585j839N194m088j634J0631k86j5383J063J5375l540j2783
674h439L900N811m830L356P498n262n063N268R13m132N512L296j0757m304P271
689C8j946n027J0074M316j4120m197J4835M836r702j498N439k095j279L546k062
$$ y = [2048, 8754, 216, -2000, 5294, 1471, -6151, 1932, 12185, 7749, -2559, -9952, -10985, -979, 9468, 3628, -6364, -4253, 291, -3740, -1935, 6686, 5072, -1845, 1883, 2067, -6878, -4977, 6010, 6801, -179, -3730, -4010, -459, 7730, 6773, -4563, -5934, 2628, -4, -4361, 3706, 4273, -10460, -12197, 2668, 8746, 4393, 1452, -887, -4837, -653, 5831, 6312, 5798, 2465, -8382, -11363, 2629, 7097, -3302, -4011, 1289, -4807, -7131, 5582, 8645, -4740, -5900, 5356, 4992, -286, 867, -1524, -5314, 2124, 6436, -1149, -2988, 2206, -1882, -3516, 7115, 6829, -8554, -7491, 7884, 4344, -8439, -4539, 1272, -3558, -202, 7296, 2034, -3029, 2239, 3152, -980, 4532, 7828, -2929, -7233, 38, -1908, -6935, 3139, 7455, -6665, -10862, 3973, 8809, -893, -2391, 3048, 953, -326, 3220, 1158]
704A158l230K874j251l544N501L657p807k251Q880m43r378K630R735m618p953
719f040M099L652l719Q94L926j264k430L48R86K031K728k558n246J860L279n013
735b467l429O388J505p657p94Q351K944m650j944L468J753j024j240m01l2j191
751d20k573J309M045j921m702K669M323j464l753K102K554k094k246J627J860
766A316j760j378R50L201P55m231n30M944J043n724r18M767m85n527P0M897o18
783G72m043k37K452J710L45j216o7K393j62j791J308K533k960n042K745L930l570
800i00l839L973K700l250j303L874J110k237j324J064J158m16j743r14K521J387
816A861k899p23M365O37m431L8L953j310m314M15L190j696k545J543J736n02K10
$$ y = [1158, -2072, 802, -449, -3993, 1508, 5165, -2642, -4893, 3987, 3544, -5834, -3204, 6531, 1913, -6040, -1941, 1711, -2008, -1114, 2812, 1548, -882, -534, 452, 2483, 5211, 2653, -2593, -733, 2546, -2467, -5896, 492, 1997, -5660, -6454, 1897, 4841, 191, -1753, 1715, 3468, 2444, 1204, 803, 771, -420, -2993, -1684, 2361, 440, -4262, -1593, 2730, 1266, -2487, -385, 2169, 75, -2171, -544, 1316, -444, -1822, -872, 2329, 3084, -1147, -1677, 3267, 4310, -1414, -2332, 2435, 1950, -3577, -3507, 1390, 772, -3271, -3508, -1056, 654, 999, -217, -284, 2109, 1947, 156, 1464, 3997, 1037, -4005, -1260, 2670, -900, -4739, -766, 1934, -1316, -2619, 1255, 2365, 128, -1196, -132, 1026, 610, -1133, -2047, 474, 1861, -1038, -1761, 2604, 3241, -1190, -1152, 2801, 1491, -2823, -2408, 782, -914, -3459, -1916, -180, -682, -472]
833d72R78J095M15r90k12J257J068k870k618K249K089l583k479L601J754l165
849a883r03L724J435l374k99L291K09k640n88J361P84q88j864P35L021j5l058
866i52J97L127j88m280m7M107j459m395J421L809j684l055K307L490K25k691L54
883B86K755J33k527j886J602J045k915k487L154J788k991j353L784J899k513j710
899a936L252J877k007k507R26J939r3k707JJ973k91j912K221J457k101k414J894
916d28K359j633j846J42P19n4J16k52J077J911r72j958K038K056j857j846J792
933A364n78l705Q80L446k020l535J889K776p08K83J252m79q11R81K32j88M87n47
951A019k666P77J977k418j871M423J986m346j436L389L95l262J606L062k438l155
$$ y = [-472, 506, 1601, 2016, 1026, 814, 2071, 3139, 269, -2349, -100, 1989, -1594, -4073, -472, 1282, -1883, -2786, 938, 2373, -1001, -1300, 1991, 2200, -440, -1028, 333, 1117, 229, -1635, -900, 2121, 2106, -952, -755, 2372, 2184, -2096, -2143, 1964, 505, -3890, -2469, 1340, -344, -3399, -1092, 2398, 2623, -68, 286, 3041, 3174, 647, -1239, 363, 1408, -1507, -3994, -840, 948, -2043, -3396, 388, 2287, -226, -1936, 1316, 3193, 1186, -1321, -395, 1544, 1451, -1256, -1255, 718, 427, -1485, 736, 2193, 92, -2322, -428, 1931, 298, -1548, -1406, -687, -741, -625, -877, 200, 2111, 1139, -819, 1219, 3275, 1418, -428, 1364, 786, -2919, -2039, 1407, -613, -4148, -2259, 517, -191, 92, 1344, 865, 54, 1035, 1267, 1079, 1566, 1019, -1647, -870, 1107, -1311, -3182, 1241, 3227, -1119, -2555, 834, 1229, -2033, -427, 2635, 197, -2958]
967b958R65J970Q51L77j535Q3K671K3l289J52L410r29m348R24L419k554l429K715
985a482K476k574o98K924K487p66k560r40J898K235j126k510R30R72m069j800
1001d603M797L373k640k484K24L50J53J552K136o03m010k149K654M073l91l750
1017a318r17L186Q75r37P93m69k204j517K324K174o15l052j946P25J994J275K42
1034F13J126q23k147J117K491j01k031R4J328j645k359O39O35%O35J758p43j287
1052g00j015l85K766L118j515l561L78P37j199P72L555j236m726J101M803o3k714
1069A16j237k94J350J163j253o48K73j342k505K200O275o58m815J311K640l557
1085i81o90M815J948m207l470m42R84K075Q82j388l33J497k258j468N102L684
$$ y = [-2958, -1993, -23, 828, 1205, -330, -247, 2424, 2447, -842, -690, 2720, 1791, -2557, -1633, 1786, -768, -4197, -1482, 994, -1580, -2278, 646, 3133, 2367, -193, -1133, 765, 3000, 1874, -636, 294, 1266, -2803, -4603, 194, 3567, 927, -1557, -1333, -983, -830, 722, 2858, 2255, -1755, -3904, -1250, 2823, 2432, -1318, -2235, 951, 1826, 889, 1682, 1213, -991, -2508, -184, 1990, 1375, -1677, -3623, -2898, -904, 371, 613, 1739, 916, -1231, -114, 2377, 2276, 245, 339, 1667, 22, -2337, -1698, -1063, -1063, -428, 1330, 587, -700, -1715, -2100, 666, 3784, 2269, -1292, -914, -177, -1376, -604, 2951, 1715, -3011, -1910, 2893, 2830, 116, -1121, -1415, -65, 1098, -155, -803, -530, -1872, -4377, -2177, 4098, 3440, -1375, -64, 2576, -981, -1671, 3144, 5092, 885, -2585, -3027, -2043, 32, 914, -474, -807, 690, -1568, -3036, 2066, 5750]
1101E750o425l379N300K001l648q81K364j634j572K501K440j357j372k028j208
1116c148M278L293m368l426K630R39l559K133N163k594m389K963L576k208j458
1131a75J566j030m5J407j495l152Q80J065j348K299K941k894m412L873L589k040
1147A029p19J739j945k265K574K095k334j629P40m07P66K798j393l346Q29J587
1163A19o51J162K263m019l583L016L947j817j091K336p75k247J343K648j265j209
1179A77k78m81J63P50k441r56K777J576k884k80L864n07l514J921L475j701k383
1196g22R23J144j327j370L1J211J743r17k987M68K888k77j868J737J344l412j657
1213c048L615J406k237j240J045J457N6o7j071O19J017j813r16K305N07m124j174
$$ y = [5750, -675, -4054, 1246, 3247, -401, -1282, 1082, -552, -2124, 377, 2817, 1460, 88, -1940, -3148, 1130, 4423, 55, -3371, -741, 198, -3361, -1228, 3935, 1341, -3048, -85, 3491, 1283, -175, 1391, 361, 316, 1723, 228, -2924, -2044, -979, -2327, -28, 2913, 19, -4393, -520, 3069, 1029, 310, 2049, 104, -2161, 413, 2508, 174, -1455, -715, -1122, -356, 2442, 1049, -2297, -1468, 119, -532, 630, 2893, -1126, -4709, -1693, 2254, 437, -654, 1682, 907, -1340, 3, 2651, 1386, 177, -101, -582, -419, 331, -2110, -3066, -289, 1287, -1597, -1877, 1987, 1480, -2034, -113, 3362, 1661, -722, 201, 1345, 18, -1352, -1321, -110, 1633, 716, -2271, -1803, 1085, 808, -1060, 677, 2021, -1391, -3048, 567, 1973, -264, -1504, -459, 998, 1054, 987, -84, 535, 1552, -261, -1177, 1128, 1635, -2489, -3663]
1230c663L590J212k688k04K214M29j090N98J216m30n04O3m73P15n22j768l68K152
1248D79j66j388J74J229m21j284J915J219j762q86O78M46k25L14J00p69j7P65
1266D01L19O84k35j158m65Q06L27j120m11K15q32m66J570J404j021j101J322J651
1284A890m92j089Q30N3n33j311rJ071q06j258J46K058K90j956k46K552O44k047
1302b13p67J454R04j531q18J581O61j964o45K265Q88j188j783O23J812p02j726
1319a149M84J169o51j537K84K117o4j662J53K438K1j449k96J633N72k098r50J149
1337A64K15j370j123J265Q87p59o45J277J573r77r82N34J100j42j481m01J506
1354F41m45j266O16J237n07o86K71N36m70n37L39L45p74J06l96M34P36l9j69J97
$$ y = [-3663, -73, 1139, -1549, -1753, 461, 890, -200, 398, 1614, 1184, 680, 743, 270, 985, 463, -1305, -1673, 479, 313, -1075, -901, 328, -93, -1377, 538, 1757, -5, -891, -213, 233, 8, 322, 422, -347, -364, 401, 720, 1404, 1169, 11, -454, 352, 679, -441, -852, -637, -1469, -1935, -365, 1039, 18, -1083, 239, 1890, 1398, 309, 1139, 1192, 659, -652, -661, 410, -396, -1654, -1508, 550, 840, -1116, -1362, 1190, 1834, -213, -980, 474, 1378, -153, -971, 610, 1271, -693, -1338, 927, 1815, 627, -1156, -533, 1279, 577, -1149, -665, 504, -147, -1684, -1400, 717, 653, -1009, -856, 1582, 1603, 154, -142, 1491, 2063, -35, -985, 164, 379, -991, -2114, -849, 38, -721, -1366, -89, 1484, 507, -475, 59, 1159, 1017, -464, -865, 641, 196, -1070, -454, 783, 276, -410, -139, 397, -73, -610, -271, 74, -700, -594, -990, -556, 180, 141, -28, 169]
1374A69M59K80M0J89k26p31l92M55o65o79M53K46p67P2P90L43J72n04M56J066
1394A226l20j132M86P83j30j444o07J093K38j045J87J366k22j227R3J305M33j622
1412e39r40J162J151o66j930J107K147j098j064J392J599j396j720Q63J409j521
1428d4j834R83O48k80o60l79J318J605p06j149J465J431k311j258K077J313k584
1445c65q91J950Q9k199J98J455R7l37o4o68M11J194n02j279J189P11k433n73L542
1464A525l29k658J367K176j247j304J454R9k055N23Q97r14n04R62j333j083K708
1481B84J017j342O79J377k261r52K887N38k866p7J847k243j647L177P03k438M18
1498h99J877j366l25J603p01j508K024N01k160L72K151k317j719M037J504m565
$$ y = [169, 628, 908, 948, 1137, 911, 180, -212, 243, -422, -1101, -648, -402, -1169, -1097, -307, 36, 208, -296, 160, 1226, 906, -226, 260, 1043, 913, -531, -1138, -45, 193, -852, -665, 701, 479, -748, -655, 650, 1083, -539, -1479, -317, 834, 168, -1762, -655, 1492, 394, -670, 722, 2321, 925, -795, 68, 1477, -44, -1878, -895, -247, -527, -1187, -1566, -248, 1357, 651, -498, 967, 2398, 87, -1171, 906, 2219, -365, -1256, 694, 783, -1416, -1218, 237, 334, -3, -67, -735, -324, 870, 368, -911, 278, 989, -1444, -2017, 1525, 1196, -1462, -95, 2081, 834, -470, 984, 1083, -972, -449, 448, -466, -970, -8, -1341, -2424, 284, 1301, -41, 638, 2015, -246, -1198, 1689, 2227, -639, -716, 1131, -1112, -2759, 418, 1121, -1317, -899, 978, -388, -713, 890, 189, -1319, 705, 1206, -954, -582, 1569, -748, -2467, 1570, 3074, -1491]
1514a491l3L554j195k487K005O09k366L17J507j396k99J464j465r91M623J490
1530C846m923q74M105j053k752K756K018m443k034K906O19j173J651l47j822J543
1546B3J650k986K55L927j470m469L069L306m103k335M114N77l380J625K895l022
1562c24j139J507p54n47K716Q6m235M75L540k566j180M935K46m827J043L774j903
1579H47k086K851J74l335J070K113l189j232L259o91j763K933J516m222kL749
1595A992r98k006L025M77m831n9M173p70k857K434O89k978J273K500j962j805
1611a703J507N61j523K336N88m042q28M246M36k224K288R10m238q31M585M99l213
1628f46j7J211k149j56K069p72j011J988l9j703K306J186l143p31L941M76l607
$$ y = [-1491, -1524, 2030, 835, -1652, 353, 962, -1404, -1087, 420, -976, -1275, 189, -1276, -2267, 2356, 3846, -1077, -1951, 2154, 1101, -1651, 1105, 3123, -1320, -3354, -448, 171, -1002, 649, 302, -1520, 23, 1673, -1313, -1058, 2869, 1399, -3070, -1, 3305, -798, -3133, 981, 1558, -1822, -197, 2698, -324, -1463, 44, -710, -1257, 1459, 1545, -2690, -2215, 1325, -1241, -2421, 2514, 2760, -2067, -1024, 2750, 847, -1239, 1612, 1786, -1549, -479, 1634, -1555, -2787, 472, -219, -1982, 951, 2467, -1755, -1757, 1992, 994, -1012, 2013, 2490, -2341, -2400, 1773, 1003, -1854, 580, 1269, -1709, -436, 2064, 102, -1703, -196, 365, -1158, 1178, 1766, -2276, -3104, 1142, 1578, -646, 1642, 2552, -1686, -2517, 2068, 2567, -646, -663, 548, -1601, -1757, 312, -460, -1471, 517, 478, -1225, 1081, 2267, -876, -1607, 2334, 2810, -797]
1645g97LJ608j322j187K053Q76j332l58l3j85J046N59j370o61J660K01k480P72
1663i47K327j517j872K733J552j727j168J209j35n02M53p5o16R2j232p59J729
1680d55J638j226q18J219L08j138N16J932n85j783j02R57m40k11l8k42k21L33
1698c56K99K75N34q31q26N86J659r33p18J29K17r25M15J510j45q23l14O67J30
1717E50L38q88k73K15j20q82M57N75n82p21J050J394m63j184L80J203m77l55K40
1736D57O8o68n81n4R90N29j678p31J333J246q86l73J253k16j107Q8J395l13j279
1755e27n21J052P27o02j72mN14l20p68N76J023r54j214N40J036o27p87O35R27
1774E34k16n21L10Q97j15n73l91N93j39j084j24O77N80j387m18J071R17q20k01
$$ y = [-797, -794, 814, -508, -1695, 358, 1234, -98, -456, -489, -674, 372, 931, -439, -1100, 560, 761, -1719, -947, 1380, -137, -2009, 724, 2276, 549, -619, 590, 455, -47, 406, 331, -285, -193, -1425, -2184, -455, 1183, -43, -861, 358, 666, -472, 44, 1976, 1391, -392, -494, 463, 23, -188, -226, -468, -689, -356, -57, 218, 752, -79, -905, -319, 1340, 407, -311, -182, 35, -890, -475, 1035, 890, 67, -247, 420, 550, 888, 0, -273, -58, -178, -1060, -603, -28, -610, -1331, -281, 1113, 650, -534, -154, 1049, 572, 217, 457, 525, -143, -724, -778, 212, 741, -937, -1668, -335, 911, 25, -348, 905, 689, -418, -330, 1065, 752, -527, -1048, 4, 731, 129, -43, -47, 467, 147, -621, -45, 978, 24, -1190, -650, 386, -241, -1028, -393, 534, 318, -203, 107, 1004, 889, 316, -75, 518, 379, -705, -829, -152, 428, -959, -1377, -306, 611, -209, -410]
1793d10J259q2r98O1P56J29p74l79M51M55o58p9N72M2j91o85N99P52q67o44J29
1814e62N68l40r48Q55Q19n94k94O03N40j17m33L66L89m39q38j36N49l07n27N2
1834g94N88L66o89J09J166K03r53k17Q60M65j148k79O88L8q56j5P19r7o64k6Q56
1855C20L97p98o36N30N27o46m92L50O85k38n48O64O79k72p42O52O19k31j317L89
1875a08P11q10r30L13Q63m94n17P56Q25k74k35j91P02K56n05n83N98K54j025m48
1895h42R99O11j466j88J234N80j361n5R17J21r66k45R32j67n31K3L29Q13o01j31
1915FJ03N08K35j297J65O43l27j128M95N68m42o16L95Q45L44q11P52M52j64o78
1935D8j46P28jo67n38L53K63o24n17J100M33o79l39J141J4q47l15J026K95n91
$$ y = [-410, 849, 767, -231, -170, 586, 715, -59, -438, 13, 468, -190, -269, 303, 345, 154, -531, 68, 820, -47, -691, -562, 6, -334, -1282, -427, 392, -202, -496, 107, 647, 530, 97, 463, 852, 413, -425, -561, -12, -319, -846, -794, -206, 160, -529, -420, 746, 949, -4, -221, 639, 1104, -44, -323, 365, 403, -453, -468, 251, 154, -510, -536, 320, 717, -81, -717, -187, 340, -306, -798, -448, 237, -1, -549, 115, 794, 522, -220, 432, 1051, 820, -497, -108, 603, -207, -1137, -824, 39, -455, -972, -216, 609, 335, 100, -91, 611, 867, 362, -221, 377, 631, -394, -842, 157, 768, -698, -886, 348, 928, -433, -488, 429, 550, -416, -661, 271, 104, -427, -404, -75, 738, 137, 6, 109, 617, 852, -445, -280, 363, 36, -1092, -597, -29, -471, -1087, -692, 153, 497, -314, 438, 890, 726, 48, -98, 630, 629, -38, -576, -223, 40, -584, -1101, -1, 432, -247, -586, 555, 569, -278, -593, 433, 728, 137]
1955A37o46M62O80j104J01R80J80n02n12L07J73l52o90Q9M20j60n50R8J042R2
1975B45q12O08J174k00p71k27O67n29n34N88M73p41j087K96K29Q88l4q32L54L58
1995A13n11l76J344N56j359l49N66Q58j258k89J072o5n96L52P01l85q64o4K34
2014c20O54k19r21oR00m44m97J142J312r15j185O11R17n51j117Q71L4m55m87J32
2034e44r4N46p00j12J406N63j145q41J389L42j093J50R82o83j041N17L68j1K94
2053B93m24k20N28K26o72j57Q45o55j067J161J380j599j216J474P92n14O08Q24
2071A607j360r29Q02L69k81P15o66k007M08J395n82l33J633pk004P57K310q65
2089I62j707J156L83j295L53J266j271j138Q63N67k68J004N05k438mK040p08j492
$$ y = [137, -509, -47, 633, -471, -370, 610, 790, 288, -224, 83, 256, -96, -786, -697, -277, -437, -987, -889, 153, 245, -567, 41, 1215, 1015, 244, 17, 684, 155, -379, 209, 682, -59, -1146, -850, -621, 267, 233, -599, -245, 113, -398, -774, 570, 1126, -233, -582, -16, 842, -416, -705, 367, 302, -294, 58, 759, 374, -490, -554, -320, 334, 115, -806, -812, 88, -356, -853, 289, 1601, 686, -499, 112, 1029, 478, -639, 232, 266, -189, -676, -544, -638, -92, -792, -904, 502, 1065, -80, -921, 468, 810, -283, -133, 849, 166, -875, -358, 10, -1, 293, -131, -351, 177, 403, -269, -426, 419, -236, -1303, -142, 1238, -361, -1577, -103, 689, 175, 783, 1607, 247, -682, 120, 489, 208, 923, 257, -1750, -1342, 53, -529, -862, 771, 764, -1240, -483, 1827, 962, -745, 411, 794, -501, -148, 1118, -153, -1291, -428, 139, -129, 875, 1380, -1058, -1062, 978, 270, -1222]
2107a222J771R38k606l40K989j078j664J390J117j237L5R73j435n17J690q9j395
2124f80R58r4k172M1L317l23k639J355J765j693r77K789k14k306M16J124r60K99
2142FN32j292r96K170J05j683J312J343k294j211L070Q61k708k8J474j297q26
2159a462K630R4j225L4L70j381P57J851j409j566J323N22k256R34K287j394k079
2176a970K259J001j676M59J078q56r55J366J20j289K73M29j343j6K085j000j178
2193a213J451J070k209L07K072j286j509J825J051k290l8J540m56p58J411l7j415
2210d84P7R68j078K60J602j184k145R69J941j811j3J856j44k081J238J985j257
2227F99p49L09l06m67R19n7j045L42L64j169R3K073m16j967R49K184j366j234
$$ y = [-1222, 549, 1487, -1119, -1459, 1530, 452, -1212, 178, 1295, 58, 93, 1066, -369, -886, 804, 715, -680, 278, 184, -1988, -1947, 1370, 1047, -1592, -237, 1528, -165, -1142, 1647, 1433, -873, -457, 667, -293, 6, 538, -754, -1750, 420, 525, -1158, 154, 1497, -797, -2008, 1062, 1923, -785, -813, 661, -636, -1462, 1168, 1262, 37, 71, 441, -940, -183, 1668, 259, -1307, 16, 538, -1718, -784, 1503, 109, -1970, 289, 1290, -386, 73, 1151, 295, -660, 706, 826, -463, -190, 239, -1104, -1120, 965, -35, -1213, 238, 1308, -901, -594, 1478, 192, -1317, 508, 1559, -731, -769, 771, 315, -443, 968, 931, -484, -407, 561, -517, -257, 1345, 161, -1984, -1015, 926, -885, -898, 958, 814, -1267, -29, 1956, 699, -50, 259, -47, -514, 405, 348, -697, -355, 9, -1160, -1067, 1006, 590, -1377, -428, 1756, 390, -844]
2245h44J254N29j349j66J128j63m88N70p38q4Q93k50j145Q07J131j474r29J483
2263A65N49j244l85J420k3r44N10P56m77J09k33l21L39O8p20k46P46J93j185J91
2283g32J208m93n50Q53N29l89r27J073j45m93P0m8l4Q2K28m97K90K59o30J76N46
2304C76r2n64j57N38k97m78K65M90k69K65l18N82n2k3j23J6J11k62o13Q52J33
2325C80j226j41O95M55r10J03Q28K60m59j98P56J41j80r87L85P81o13r06M52R16
2345E32m68n07R1Q60k34p08M88N52j88r57l2P86J62r92K09P57M05n69l84N57N13
2366H73p55o19O50M76q76m99J35P87j56n15L32N83P4o63K33O80j01r81M88K60
2386D06Q5o54l44N77Km72j60P05J09n14o5N01L5o02J30R7R6l23N6L72L9p1PK29
$$ y = [-844, 410, 939, -410, -576, 552, 389, -99, 471, -267, -351, 542, 292, -853, -46, 1085, -389, -1318, 165, 714, -530, -915, 505, 482, -462, 48, 804, 327, 436, 203, -118, 221, 289, -431, -677, 69, 262, -923, -732, 476, -17, -567, 286, 815, 426, -501, 572, 427, -66, 4, -44, -78, 4, 232, -265, 25, 284, -346, -170, 376, 284, -280, -437, 101, -196, -674, -409, 81, -188, 77, -241, 341, 289, 266, 143, 159, 270, 8, -605, 247, 380, -846, -987, -292, 163, -747, -644, 184, 444, -15, -213, 543, 684, 504, -483, -98, 683, 70, -836, -384, 532, 64, -443, -352, 508, 274, -434, 54, 606, 418, -539, -571, 215, 377, -615, -406, 351, 756, 187, -197, 360, 873, 118, -501, 149, 625, -251, -750, -615, 172, 16, -499, -167, 416, 490, -173, 60, 740, 639, -342, 146, 406, 491, -163, -507, 70, 72, -400, -560, 145, 254, -260, -325, 176, 211, -391, -261, -164, -68, -391, -335, 37, 76, 5, 12, 241]
2410B41K43o74J51J61K7o14L35j83K70j74k90N50K10l24o9Q43o9l53q9K84rr01
2432d34K60n9M09n49M9j2P03m20k83K79N61l12n14M04M08l83o49M68M89n15j68
2453b68J79P86l55r37L65P94j39q98n0N35L5o35k03Q78J67m00m89Q78R18q03n20
2474a62N73L26p13m79O05k45k22l56L08M33K38n65l64J205Q7r18m18J264k00o82
2494b85J31N23k87p50N12N09k38l67N53j10j30o9j10m18N44L38q95pR03m81n98
2515g32O05P70n24l8J001r64o48L50Q06m77l97M17p11k4K76N70l10J23m9l41M52
2536A55Q17n77r65O36Q24j253j45R98j48j295N63J171l04n76J60k32l59L31L68
2555A69k78N28j42j221K46J251K31j037M22P43q32n30N35O98q70j98k7o5N27r3
$$ y = [241, 484, -190, -39, 122, 149, -465, -130, -313, -43, -217, -507, 43, 253, -71, -140, 703, 634, 281, 192, 476, 467, -434, -174, -233, 176, -373, -324, -336, 367, -53, -336, -57, 504, 192, -322, 82, 490, 107, -542, -74, 415, -100, -268, -89, 697, 342, -595, -230, 564, 425, -473, -523, 12, 47, -588, -791, 87, 254, -146, -635, 243, 1161, 358, -162, 411, 737, 24, -455, 150, -95, -317, -673, -365, 68, 306, -259, -623, 582, 669, -249, -667, 597, 397, -285, -154, 369, 82, -668, -156, 353, 115, -252, 301, 191, 61, -8, -118, -536, 8, 346, -549, -556, 347, -134, -732, -127, 643, 119, 81, 1082, 118, -530, -180, 626, 149, -248, 169, -542, -566, -290, 280, -30, 93, 44, -297, 155, 972, 395, -570, 66, 890, -363, -508, 490, 342, -953, -390, 781, 477, -99, 61, -171, -530, -199, 169, -109, 419, 277, -944, -698, 553, 784, -253, 169, 912, 80, -450, 85, 783, -87, -285, -312, -377, 150, 57]
2575E7o69o3J299n4r43O45N60p98o76J452n5j083j13O35k26k15L28j88j07J31
2595h3K56l35p9R12j326k70J431L38j555K18Q21o30k73J253M76j533r0M39J0r
2615b9O28m23j240M13O12p85M80J329j271q16J265M83n85J05O48r17p28J049Q07
2634A025r91q06P68p39L42Q37m8p13K89j6l24J90J028m79j183R33N27j021n21
2653i02J663l0q47K74K65k14n82P7L59j18J71l69j025J186N06r76J89J024j59
2672D92j054L11J004j80o64j32L31j21k79J78o6J8n5m25Q74N77o17p72j4Q29L5
2693B70m95M59J53r16j21P78L38j6o80q4L20M29l47l19L73k83o01K08P67J6q70
2714f21K34N19r3J14L69l22P1k7l25K37J7j74n47n4O09m10k22O67L83q44L08L51
$$ y = [57, -612, -675, 624, 570, -373, 272, 832, 34, -642, 810, 755, -328, -441, 194, -32, -247, 81, -107, -214, -83, 173, -162, -241, 671, -655, -925, 506, 844, -711, -493, 328, -302, -575, 678, 1154, -379, -469, -30, -20, -29, 599, 176, -1064, -651, -39, -824, -344, 985, -286, -1102, 163, 646, 61, 166, 814, -103, -831, 218, 1025, 34, -772, -4, -743, -401, 436, 388, -325, -36, -52, -376, -186, 842, 363, -820, 113, 640, -381, -902, 761, 731, -116, 158, 423, 209, -373, -296, 63, -55, 116, -253, -1278, -92, 414, -562, -373, 651, 492, -562, -251, 753, 573, -91, -223, 108, -13, -292, -114, -180, -162, -217, -642, 232, 809, 192, -580, -594, 235, 270, -225, 234, 387, -529, -650, 128, 466, 450, -230, -314, 6, 435, 88, -231, 142, -141, -742, -534, 233, 249, -621, -387, 132, 39, 153, 522, 200, 271, 244, -81, 156, 173, -1, -548, -602, 7, -403, -625, 42, 425, -419, -111, 240]
2736B40q3o73N59L58j97m99N90j72l50L38j0l02L63j17l58p6J055n06o03L25L38
2757B20p94p0Q69Q5j034M02P56k36q4j3O7j63J41l79P2L35J9j024L55P14J87r16
2779d91J89R51k88o26K45O14n24k92K19O7J27k50j0P1M54l06l97M31K44m82o59
2800g13O51M75n68j84J71J87j95J24J51L54n7n65P5O85K2q00n11R65p6n16j51
2821d76M31j66J8P4N38l17j38R9MK41K43o53j3N39n10l77L10K88j14k11N07K1
2843C38n92J64J57K68n02m4L61k4l92mN39L0J34m10J44L52l21l07K21L53q10l68
2865g13Q02q8l84j35N52K45m22J27J16L15j36j2l97M74l96k91J03J47M04o23K2
2886b90O02R4p79R2N12j7m76J84J70q8k25n6K07M42l71k19M52K30l08n64P91l11
$$ y = [240, 157, -516, 43, 401, 204, -295, 295, 123, -227, 111, 101, -201, 162, 45, -313, -389, 666, 160, -443, -118, 220, -574, -644, 225, 310, -724, -322, 434, 198, 114, 101, 168, 5, 146, -233, -161, 174, 193, -831, -476, 238, 425, -491, -302, 649, 361, -265, -20, 594, 70, -222, -3, 64, 191, -59, -69, 2, 456, 150, -247, 184, 428, -54, -713, -62, 413, -155, -339, -168, 19, -176, -52, 99, 453, 396, -169, -94, 591, 613, -187, -698, 267, 191, -325, -476, -45, -211, -193, -119, 419, 102, -36, 63, 67, 308, 551, -102, -115, 424, -86, -463, -153, 135, 21, -190, 317, 338, -254, -90, 67, 335, -167, -211, 150, 126, -266, -270, 269, 299, 433, 23, 167, 519, 198, -109, 112, 465, -345, -713, 89, 1, -383, -518, 34, 279, -143, -16, 100, 415, 279, 267, -130, 344, -52, -343, -240, -93, 311, -312, -290, 312, 406, -373, -281, 231, 214, -262, -78, 92, 4, -221, -277, -70, 372, 1, -218, 234, 464, 156, -408, 383, 72]
2908G2J10p16J71P44j88n94j20R96k76l17L60O0m3l42K4L75j47k06j01L26j81
2929Gl96n3O06m18L30l43L81J70m20N3K69j29o0j60J09K57j90n1K12K97n04j26
2951a59L28J06n11j45N87m73K11j52M4K5j2K45j73K73L16n34n1N01k40m96j3N89
2973B66j34q07N15L21k49l61P77l0j63p7P4j83J50N2l29K15K18l88l38L88M50
2994C67p62p3J037k47r74M48L24m34k75M50K46l39P7o7J40L19J51n29j00J051
3014H10l89r43N86M28o73m12M05K69n59N1O46l5j61L15k70m9L40J1m95N5P72p98
3036i6m05Q51L8p85K60O86l31o96N74K04m93L23j20n1j67N4j12L1M74q0m56O29
3058C32K05n39m79N04K71m81n7L36l46l01J49M82j03j53M07j87J6L00M8l52m4
$$ y = [72, 182, -534, -363, 381, 193, -401, -521, 475, 199, -118, 242, 302, 259, -83, -59, 316, 169, -37, -138, 188, 7, -389, -442, 164, -254, 76, -267, 114, 284, -136, -83, 186, 57, -3, -163, -54, 203, 13, -38, 174, 471, -33, -159, 169, 275, -236, -381, 206, -267, -56, -208, -164, -139, -151, 94, -79, 194, 510, -24, -75, 426, 186, -310, -323, 266, 132, -675, -160, 161, -88, -449, 328, 298, 135, 58, 132, -51, 99, 151, -178, 37, 255, -133, -471, -83, 367, -395, -468, 569, 322, -652, -204, 120, -314, -589, -139, 107, -232, -155, -222, -82, 237, 388, -141, -241, 810, 421, -522, 64, 492, -181, -593, -188, 81, -478, -427, 219, 184, 23, 338, 68, 19, 359, 370, -125, -70, 702, -96, -501, 350, 388, -397, -137, 549, 218, -478, 96, 300, -193, 130, 10, -41, -208, -154, -266, -235, 239, 159, -297, 332, 537, -2, -481, 23, 294, -187, -244, 92, -254, -555, -406, 76, -27, -180, 227, 40, 56, 356, 404, 52, 8]
3079HL2l90L12M33k41r02K20P78p0J07K6l85l06J77J36J42J8J51r05J79P54r7
3101A77m38M47M8q8j82N07j60n79r6O26j60m38L7k5Q1J41L5k13O42j65k68K70
3123A99kj34k58L58J70p16K59N5j15M8K83j14M6N1j68j71J87J91J48n26M61l51
3145i9k14L33M74k25j09M3k08J05k18N44k21k7l98l58N49J97j19k61O3O89l15
3166B25k20M02j86l35k01P41J4k86k14m03K23J4K61r2K11Q0n26K2N71o9l70j35
3188b73N52m41l49O80J23n00K54j7P3K35o13k84N44J31j51m61P07k4k69j1L84
3209B90M5l81j5M04j16o9k74K27Q0k47j53N3J3l72J37K43M12o5k03O7J93l39n2
3232a22L17K63n39k90M57o2rJ61k7l53N87l80j38J64J77m86J01j80R12n83m71
$$ y = [8, 40, -350, -38, 395, 154, -748, -528, 250, 180, 287, 313, -72, -378, -201, -65, 77, 95, 246, -659, -480, 274, 177, -261, 186, 234, 146, -36, 471, 311, -268, -364, 262, 102, -336, -299, -324, -243, -102, -67, -280, 362, 197, -71, 199, 197, 63, -195, 163, 333, -383, -124, -69, -184, -136, 147, 33, 79, 130, -38, -209, -22, 169, 317, -209, 252, -99, -313, 20, 494, 269, 160, 203, -5, 100, -118, 426, 205, 178, -220, -578, -29, 168, 49, -212, -149, 540, 225, 5, 407, 221, -114, -315, 426, 440, 154, -60, -463, -240, -226, 35, -57, 154, 234, -292, -270, 301, 232, -138, -273, 279, -162, -511, 169, 292, -208, 46, 29, 102, 337, -276, -560, -16, 115, -36, -497, 210, 186, -83, -94, 290, 335, -46, -61, 343, 227, 158, -116, 111, 191, -56, -209, -156, -143, -515, -378, -135, 277, 212, 9, 76, 269, -70, -122, 195, 458, -81, -371, 86, 24, 15, 176, 149, -204, 383, 3, -135, 29, 206, -280, -179, -359, 553, -30, -501]
3253e01O74k91K0J68K73k83j55J46p7R8j60j27J59o8J17o23O69L36m81j89K28
3274f7M45l79k42O07k20j4k42M53j27m99J97p4K12J72j13p5J30k1k76k43P75n82
3296a83l9K32K86k16l91O9L86k13L80J56k32J05l96J35J29l14J02l62K31Q2j55
3317b08n8J08L30o9k03K48j32N9K3j13k04J92J8j14K53k44K56r9R4l54o4K71M76
3340D66k53k61L02m62Q7J58l22L55J26m18R2L05J26n31L12L72l55m18L81j6j12
3361f6k29N4J76K56k69O7N22l22k9k50M30j77j95L7l60M19K8n25K88M64k60m34
3383c75L56L27l40k28K50J63p0l94J66K12J39m52J47L63k7l48n5K35K45j20m38
3404b44L86j23k47L61j41R2k80J71j80N19j07k66K81l78K19J29l02J88k33j83
$$ y = [-501, 173, -118, -98, 70, 343, 60, -95, 51, -26, 72, -88, -215, -56, -124, -7, -630, 39, 375, -106, -295, -67, 378, -1, -243, 364, 144, 130, -112, 341, 214, -285, -88, -162, 50, 222, 109, 34, 164, 143, -133, -376, 399, -183, -222, 10, 296, 80, -311, -242, 144, -69, 311, 467, 235, 340, -56, 79, 208, -106, -4, -366, -135, -53, -208, -266, -158, 172, 103, -100, 148, 16, 75, 98, -15, -219, -27, -9, -123, 130, -114, 142, 43, 137, -217, -281, -10, 466, 213, -48, 254, -208, -121, 37, -285, 70, 196, -222, -130, 175, 301, -230, 82, 454, 99, -319, 62, 46, -66, -295, -241, -65, 191, -78, -11, 511, 189, 160, -90, 340, 163, -32, 5, -355, 64, 92, -433, -145, 319, 59, -375, -19, 308, -32, -260, -10, 153, 83, -311, -145, 67, 206, -246, -99, 264, 237, -111, -166, 69, 314, 194, -244, 142, 19, -228, 133, -8, 84, -196, -25, -205, 314, 207, -59, 222, -156, 63, 192, -110, 78, -155, -338]
3424c38J55M10k96j76K86K81k22j19j36L77j63K4o9J07j95M8OL6J09J67n74K52
3446c0N6k01J01K79k39p5k9K71j78j27n4N53k24j99K96J9m8j44p4K5J40k66j92
3469c40L88Oj25j88J84L15r8k77M42k0l71n5K66K30n04K0L9J10r3j06J75L71l66
3492Cn2k5J96k83l2J1L92j34j62k64N65L6k45m4Q7K57o65J51J17J83j35j4k41
3515b98J59K58n37M35n9L25l45J95K58l97l1j07L10pl66J18J54ql76J02K75J13
3537A71j12l3nN4J33m86M10o8k94j41N92J64k84j48L79m23j09L40R3m06PK02l85
3560c49Q9K95Nj76l2L99k38R9K68j72o45N98J38o86K1M37j6n92N30M83o71M7J40
3583b8R1j45J74Ml68K07K25m31M6O35r2o85M44L98m20m21O37k08k20Q3L06l27
$$ y = [-338, -183, 227, -69, -245, 41, 322, 100, -19, -155, 222, 59, 83, 14, 121, -74, -26, -20, 16, 125, 292, -282, -30, 26, -175, -74, 205, -34, -109, -138, 133, -45, -172, -226, 327, 103, -96, 200, 219, 171, 27, -47, -22, 118, -148, -340, 48, 54, -71, -259, -75, 240, 142, -135, 307, 287, -84, -139, 127, 357, -147, -127, -88, 22, -71, -177, -2, 369, 3, -49, -74, 122, -161, -193, -182, 210, 76, -86, -350, 215, 251, 6, -38, 49, 306, -359, -208, -91, 92, -43, -57, -298, -139, 119, -418, 17, -42, 283, -62, 133, 391, -6, -37, -144, 166, 159, -207, -89, 65, 57, -319, -217, 58, 171, 59, 26, 21, 75, 208, -278, 132, 64, -230, -371, 221, 385, 101, -47, 332, -91, -200, 140, 233, -173, -166, 36, -349, -260, 35, 40, -136, -168, 231, -7, 92, 360, 188, -457, 141, 279, -407, -386, 51, 35, -557, -27, 456, -215, -168, -28, 63, -82, 92, 96, -272, -65, 160, -271, -225, 410, 318, -367, 77, 475, 55, -366, 271, 63, -157, -74, 232, -95]
3605i5Q7J62l51k53O52n8o48K49R40n27l85N10P4q98J25P84l27p9j84L29p35N53
3627g5L11m97L6P31p48k57O43L17m37l96O42n5o73N98M11o40k41L11NJ0j18M86
3649C64o60J69M43n19n6N20r8l76K02O58o70r9M47p8n04N54K07p73J7K18L7m63
3671d60L83J16m52L29O55l77l21M27O5o52L76M85q42j86O03j64l27L27M23l95
3691A3n51N70L07l79k30K62n12M01N80o07J13K71Qp83P72L50m16o87M67N70o63
3712a44J82K08k41l53M86k45k18M82K62o18o8O00j14n19M44L27n73j13L17J23
3732B25m77J51M73m46%L41k12l18O14k92j50P1N9l29O3M52q6l60M33j21j41j40
3754a90O87r8m74n5L54k30Pj19N1k57J20Q1K2J04J17k96nL87k16pq3J67l09P8
$$ y = [-95, -8, 154, -197, -450, 202, 144, -504, -255, 685, 158, -227, 283, 357, -541, -416, 368, 41, -38, -222, 107, -628, -75, 236, -261, -225, 506, -242, -499, 144, 461, 24, -372, 270, 215, -458, 140, 551, -89, -330, -19, -14, -4, -122, 364, -296, -127, 316, -203, -259, 261, 163, -213, -11, 647, -23, -122, 325, 247, -257, 297, 504, -269, -252, -34, 3, -460, -77, 39, -413, -84, 571, 194, -127, 300, 365, -287, 89, 574, -268, -454, 149, -15, -342, -15, 408, 13, -538, 32, 339, -40, -270, -8, -520, -119, 461, -146, -33, 238, 246, -537, 235, 585, 169, -518, -51, 519, -144, 38, 246, 5, -348, 138, -107, -325, 157, 419, -199, -267, 333, 219, -300, 144, 471, -102, -215, 102, 225, -252, -101, 372, -74, -74, 267, 55, -263, 351, 59, -91, -20, 39, -290, -227, 225, 139, -221, 212, 91, -50, -190, 497, 399, -75, -130, 224, -6, 1, -118, -67, -324, -204, -123, -101, 3, 120, -176, -181, 206, -10, -17, -100, 67, -242, -164]
3778a64K21j8k22J89J27k14J08J28j37k07J35M4k2qJ82p1k36L18J29k78o1K30
3800A73j8j15m1M26k46m84M47l09L77k55m33M28j8R8m8L10l5Ol41j03L90l10j17
3823b18J3L17k31jj35R5L65k11l0N2J99m05k50L65M41k16j18j9P2M7l91K97M52
3846D90l11j09l7K22q4l87Q1j02L03k91n2R4L20Jk35K49L8k08J08L2k15k01n8
3869c52M61j01j31L4r6L55l25k58M98j01K03j37j19R1o4j24Q9L82k39mQo3K11
3892B18l91J17q2J39k18L51J25l82RK6M07k53r2k11M90o6j57K61m8m9r8l20J75
3915d9K59n17K82k7Q8m86L41M53j86Nj91L60j32m9m37K99K43m35j0K81J52k53
3937il94L93L22j20k83m2L4J60j91J1K54j09J50j97J69j27j43K56Rn8J12k09j43
$$ y = [-164, 57, 39, -183, 6, 133, -81, 27, 155, 18, -189, -54, -10, -32, -40, 142, 71, -165, 153, 282, 4, -57, 173, 155, 40, -1, 425, 179, -305, 142, -167, 210, -45, -478, -50, -68, 30, -18, 292, 257, 263, -78, -181, 209, -101, -218, -205, 112, -119, -120, -255, -160, 205, -6, -36, 16, 215, -190, -440, -75, 366, 150, 32, 13, 85, 132, -259, 38, 490, 179, 70, 33, 255, 171, -216, -135, -237, 66, -225, -277, -183, 137, 138, -97, 152, 190, -18, 90, 122, -93, -294, -352, 109, 8, -123, -89, -185, 170, -155, -413, 85, -16, 187, 50, -69, 22, -42, -166, -77, 305, 66, 62, 70, 7, 218, -173, -56, -138, 1, -217, 134, 259, -123, -114, -88, 319, 66, -26, -237, 253, 187, 30, 291, 243, 194, 96, -224, -49, 210, -307, -25, -52, 36, -450, -109, 344, 158, 163, -28, 332, 200, 151, -286, 13, 256, -179, -189, 92, 244, -9, -403, -10, 312, 192, -91, -133, -99, 61, -130, -119, 135, 26, 176, -21, 148, 21, -122, 134, 143, 85, 197, -12, -155]
3960a55J63m36J48R8j4J31R2J14j68O8P8j21n1K8K73l56K16k27J71j87K28k16
3982a23J33P6J0k20J12O4n0L11l37l01J87J77N8K7l5J81k73j32N35l60j79R4K26
4005A81k76k16J58L73k12Q5k03J51k51L28J58j26J2k28o8J84P6l8k09J78P5m03
4027b71K63K47j05p4j60K88k49Lj4J74K11r6m39L48J3J31j60r9L74j52r3j51J11
4050A00k37k2J98J5k9l33K29J38j8k22oP2L51j34p1Q4p6k61k43N86l94J76m3K77
4074A37O3m03J84J38m2J04k41n5L97J12l97J58N8P8m99J73J68k75j09K70J59k42
4096f4K25k80q3L14p6N3k12K27M69q94M91l3j56L05j81q8j06M5L18j74m18J05
4118b13M55j82k05J89k77L78Q4k84j84o4P5n2K38O5J64k46J03O8P0j25qPo9l4
$$ y = [-155, 8, -428, -280, -182, -196, -65, 27, 141, -27, 41, 119, -2, -53, -25, 248, -108, 108, -119, 52, -135, 93, -123, 10, 86, 96, -124, -12, 52, 2, 313, -24, -325, -138, 39, 97, 124, 89, 270, -3, -135, 400, 40, -139, -45, 181, -95, -311, -153, 220, 8, 93, -110, 41, -210, 118, 276, 150, 162, -66, -134, 50, 126, 88, -121, 57, 132, -271, -8, 239, 134, 60, -100, 188, -61, -58, -72, 102, 313, 217, -222, 126, 139, 270, 110, 11, 385, 233, 140, -11, 100, -137, -159, 39, 54, 25, -308, -79, 59, 41, -181, -187, -115, 236, 102, 31, 115, 39, -222, -465, 121, -273, -97, -140, 137, 200, -203, -19, 119, 77, 181, -60, -115, 282, 394, -3, 155, 213, 291, -208, -35, 133, -142, -251, 19, 178, -64, 161, -119, -202, 112, 36, 89, -123, 104, 573, -321, 170, 137, -19, 286, 105, 17, -89, -44, 274, 100, -318, -213, 242, 60, -145, 44, -233, 145, 229, -55, -239, -303, -228, -280, -42, 23, 187, -59, 44, 112, 182, 57, 49, 56, -13, -47]
4142d7Q0N3k05L8r4K89l65J69j37J13M2J26k3K05o4l22J3K68k45J67p8k01m6j63
4166d27K42K80J89l32O1J55o1M3j32Q6k16K79l61P0K47j63k32K92j22J68j08k4
4188f6J16l04K74oL22p5k99j84L75j44J34j04K00l38K41kM3j16p4q5k03J36J76
4211A7p2l9J60j79J17K68k36j54l3N06p03L57L95l11J02j2k07M3L24n14K83j04
4233HJ58L7n62J33L50j08j48Q0j18R3q2J48R8o8J45k1j0j2J03l60J80j72N1k15
4257b92L60Qm83M37J05L5p6M6J33l09j6K74m64K23N4k96j20M59j09K7M8L42k88
4280I8m69N29j47j89j77M17k4m20M76L7k66J66N4j02R5L60j71l23l39M59k58K52
4302E8j20o8j92L95j50J08j42J06J23k73k9J48mj10J57j83J43l8m6K02O6J58j88
$$ y = [-47, 33, 86, -119, -81, -175, 114, -251, -82, -219, -106, -64, 62, 39, 244, 180, -142, -129, 139, -106, 61, -17, -218, -264, -427, -185, 95, 284, -48, 13, 168, 107, 150, 18, 104, -112, 167, -194, -124, 123, -40, -272, 20, -102, 66, -42, -66, 50, -254, 20, 14, 336, 261, -38, -222, 153, 9, 143, 39, 239, -99, 142, 140, 183, 67, -7, -92, -295, -159, 17, -55, -94, 66, -113, 4, 272, 36, -118, -151, 355, -348, 9, 404, 93, 195, 183, -24, 19, 343, -171, 112, 8, 166, 203, -359, -226, 124, 16, -132, -52, -170, -77, -159, -11, 87, 19, 164, 143, 133, 121, 224, -136, 44, -128, -77, -292, 68, 76, -407, 30, 135, 170, 94, 140, 273, -36, -52, 222, -242, -19, 35, -261, -381, 78, -31, -4, 44, 386, 98, -371, 158, 11, -178, -355, 62, 38, -382, 94, 131, -135, 31, 85, -17, 78, 438, 267, -56, -395, 64, -194, 58, -62, -130, -322, 73, -77, 31, -111, -5, 118, -155, -184, -36, -40, -150, 7, -176, -33, -71, -117, 85, 151, 309, 121]
4325A21k44K01r6p5J1P4J70j41k18J63JM8J64k32J73J84l31R8O7L2k04j60J73
4348b1j5Q7J38o9J18k90L61l72L02j9M5k4j71O5j32J09k37K27k29O2K24L5k73
4371g9L85j08q2l21K87k44M13l74J31j39M02k64J21m7j5L8k46LK9K4K71q5O2l4
4395A28q0O3j98J35J59k97M5M8l04M62j07n9J2k03J17Jm23L26K73Q5j36J17k44
4418h0J04j72J68j90K35j28j37J76J18j41O5m4k16K33j94K12J1p6L02m00m3K22
4440B5k80K37J02k64P4J61j50K01j75J6L48m54J16M3k34M7q4K98j4M5j03K76j40
4463I1q2J50Nk35J80J50m03J92j54P2J87k54K00p9%Ok05L05k0q4k70kM91L4m31
4488a56J71j24j66K34m0NJ91k14o0L1L16k85m9O6N0q9j02K52m4k5J36J82l06r4
$$ y = [121, -123, 78, -18, -93, -82, -8, 162, 21, -197, -34, -33, 15, 179, -53, 120, 304, -27, 71, 138, 170, -34, -194, -21, -36, 51, 189, 120, 238, -52, 309, -63, 239, 220, 265, 241, 70, 135, 3, 112, -125, 102, -127, -65, 159, 194, -79, 306, 198, 116, -205, 82, -162, 251, -123, 8, -131, 271, 7, 128, 81, 66, 104, -142, -139, -110, -86, 185, 100, 162, 128, 48, 111, -87, 48, 207, -90, -45, 3, -301, 161, 54, -5, 7, -196, -79, -78, -501, -175, 98, 183, 47, 164, -80, 24, -148, 20, -170, 65, -63, -200, -24, 94, -47, 18, -26, -242, -9, -203, 9, 20, -56, 246, -154, -197, 25, -255, -18, 84, -180, -106, 55, -95, 106, -69, -53, 295, -159, -43, 0, -234, -187, -271, 27, 13, 58, -45, 231, 91, 9, 159, 164, -71, 109, 259, -144, 48, -106, -34, 153, -101, 99, 20, 20, 26, -179, 126, 106, 22, -248, -250, 241, 275, -156, 15, -109, -275, -41, -81, -76, 115, -99, -159, -128, 188, -97, -146, -80, -30, -119, -221, 31, -13, -38, 98, 280, -26, -120]
4512a20K84L4k23k27K04k18l9L39p9J63k86K44M8J66k44q9n9L04k74P8R9J7m9
4535G3k54N8K65o9j58p8q8J20JJ73j72J19j84K22Q8j54K30o41L98K13Kk34K33
4558A63M0k13N9k02N3K13j96J30k22L36j28l17L60j33l3L46k33l7O1k75J01R2
4580c5K33j7j22o4Q6M8J07l9l28L28m22K96j00j9J98r9Nj93o9L69k05k8k24M35
4604A41j32n6L17m08J55lm9K40k31r8J85J2j75M3j52p9L35j1K47m01J79L36m38
4627d3J47n1j02J17k12nJ87k8j87K24j00mK2q4L58j85k62K10P8J36m75K67l9n4
4651h5j2J81Pk97n1L42l3JN0J4o2Q2l90L24J31q4j31R9ok48J27j44Q7J7J62O1
4677A42j80R5q2j87K97j23j88K73k00r7L74r2j81o4n3J82K16j30r8J61l5j39k3
$$ y = [-120, 164, 198, -25, -252, -48, -266, -305, 34, -45, 118, -168, 76, 124, 290, 46, -43, -102, 202, -72, 6, 105, 122, 73, -181, -123, 142, 73, -85, -163, -251, -131, -130, 43, -129, -10, -194, 28, 116, -38, 192, -449, -51, 162, 164, -70, 163, 203, -10, 49, -153, -100, 113, -83, 47, -175, 161, 33, -284, 76, -57, -90, 256, 23, -14, 47, -228, -127, -35, 198, 181, 59, -5, 81, 129, 236, 197, -131, 197, -225, 71, -29, -48, 150, 51, 56, -137, -206, 163, -42, -70, -294, 141, 9, -47, 270, -138, 17, 14, -35, 205, -26, -124, 61, 73, -102, -59, -211, -290, 45, 34, 281, -120, 59, 395, -43, 104, 53, -49, 68, -144, -149, 38, 10, -177, 47, -53, -57, -35, -119, 239, 54, -208, 2, 80, 216, -259, 8, -31, -85, -97, 84, 91, -206, -257, 85, 52, 53, 103, 117, 55, 137, -253, 71, 202, 118, -13, 86, 80, -168, -41, -185, -98, -81, 81, 142, -38, 57, -25, -212, 85, -38, -226, 47, -153, -250, 124, 32, -149, -213, -266, -84, 132, 2, -96, 65, 30, -109, -132]
4700a32L79k30k37J37l82K96L45L7j66l53L21N0Q1M4j90j73N4M1J92j49J45j64
4722e4J5Q4K53m99J21J06N0j0j91K42m02M39j51j5n8L4J16j66j12J12J81R5j80
4745A0k4j57K38J23o28L87K3O3j34L57l02p9K52J23l87J55O5R3j88J21k39J27
4767aJ79m47Q6P4K44N9m00j29K85K62q2j90L5l5k21M36j4j09K06j88l97K06K97
4790A56l89N28l23j97K16k19J3J70M80k46j0l99L49J37m1k13Q1Lo3J48k57J50
4812G4j01j01O5j36R1J33j56J3KK41J05j97j58k1rJ55q6m7O6K26k53J16q9K70
4836B03k92J23j68L4L78k18k78n2J92J1j8J79o8r4P4J52k90RK34k41J13J44m7
4859H0k73J38J70k26L27j32J78m28j10P4kJ9j18L0J14K92k81K12p0L0p6N5O9J86
$$ y = [-132, 247, 17, -220, -83, -465, -169, 176, 213, 47, -306, 15, 65, 146, 190, 0, -173, -119, -78, 114, -35, 110, -54, -39, 45, 298, -201, -80, 26, 76, 66, -125, 117, -285, 154, 3, -12, -70, -36, 80, -86, -198, -86, 95, 190, 10, -14, -171, 67, 190, -438, -51, -28, 35, -99, 258, -44, -123, 129, 252, -135, 20, 85, 178, -10, 111, -128, -1, 178, -269, -183, -109, 135, 194, -206, -335, -50, 212, 130, -60, -25, -60, -281, 155, 141, 32, 238, 50, -347, -141, 156, -233, 295, -28, -225, -9, -228, -215, -45, 435, 189, 179, -220, 129, 266, 225, 12, 93, 96, 33, 181, -76, 74, -27, -128, -63, -199, -108, 25, -131, -118, -116, 125, 230, 33, -125, -146, -155, 0, -86, -133, -67, 159, -94, 22, -67, 203, -89, 34, -134, -100, 278, 60, -218, -270, -78, -67, -85, 94, 26, -68, 6, 158, -132, -123, 111, -130, -17, 127, 80, -193, -55, 115, -111, 216, 84, 262, -166, -276, -202, -204, -185, -303, -273, -159, 133, -148, 64, -6, 24, -52, 3, 72, 258]
4883B58k42pM7j33RK49j62q4L49k53j64J98N2Q4j47j35J95k1o5kk8K1J9j47K55
4908A46m7J2k77L78k82M5K1J8m0o0j46L2M19l34K04m9Kj38K42k36L30j46m6p9
4932c1K13l82L17j8j71K44j62j00N2q7L78k18J73j01k24o1K87j53O7K16j96J24
4954A67k53j34J58r9K19k66L19l33K8K17J72L4k89J45J5k08j16L73j75O9m0j20
4976a17J06j89Q3J70o3O3O5l59P0K26m0q0K64j65j07o6K88k72M4R6k72L29j69
4999i5J63K26p3k14K2Q2j49j99L42O3k47K4K80r8Lk72K92o4M06m78j16J30p6J40
5023I2ml70L83K8j68k46K68O8k44J42M5K31l6p5k04K27p9k99L60l7j87L29l97
5046a73M15j89o4N8q0K32n07K49N7j1K91n14K78J71k33m1K6k32J76J66K3k30J9
$$ y = [258, 16, 9, 56, -77, -68, 181, 19, -65, 284, 31, -133, 65, 117, 201, 54, -81, 114, 93, 28, 26, -2, 19, 38, -109, 146, 99, 111, -166, 212, -70, -25, -4, 14, -26, -86, -232, -200, 219, -115, 89, 40, 42, -96, 146, -90, 240, 94, 48, -31, 182, -200, 117, 99, -72, 172, 10, -90, -38, -125, 253, 35, 208, 107, -117, -178, 109, -44, 23, 239, 43, 167, -86, -220, -62, -161, 58, -208, 111, -222, -194, 23, 195, 229, -60, 85, 100, -108, -224, 149, -26, 43, 3, -117, -11, -200, -117, 53, -10, 53, 118, -241, -171, 55, 15, -65, 199, 34, -73, -139, 149, -123, -79, 17, -255, 74, -95, 68, 294, 221, 7, 29, 111, -38, -237, 105, 168, -79, -55, 225, 127, 130, -142, 150, 86, 492, 14, -102, 28, -48, 92, 88, -282, 101, 129, -39, -285, -17, 51, -193, -51, -6, 225, 189, 114, -90, 137, 58, -241, 119, 82, -105, 224, -173, 242, 53, -11, 47, -33, 199, -308, -59, -2, -13, 278, -236, 42, 213, -20, -61, -35, -267, -91, 75, 98, -132, -113]
5069a13k5j15M44j51p3n0M0K58p9j78M6J19k20J03l25J86J44k34Q1r8L9L62k71
5092a10M4r9L57j13j27K77r4l04L07j91j22L59l53P5j42L3K15N2m2l03L02q2j1
5115g2J60l37O9q7J68o3L20m17J5L69q5J48o7K87o45L67j93J60j91J56j70%r7
5138b05K53R2k77J1J73l45K75J10P2j8k06K28m54M04n9j62K19r6j32K74l21N24
5160C60l32K33Ol69k38L58k18P1K26p6Jj15r5J48j50K22o9l5p4J48K19k85K8K14
5184A78k61m6j8K05r5J83j23p8r0j34L42J06N0m06K64qm9Ml8J61J68l13P6k18
5208a40j66L10p5J39k8k2J15m23K52J52m2R3n2L9p8jj33K8K45k34m1K25k26K41
5232A78l60J52J11l63K14r2K72N5j96Q3j74q6K34J42m58L56k61J98n3J60k10J00
$$ y = [-113, -138, -253, 191, 40, -33, -83, -43, 215, 136, -42, 4, 123, -97, 6, -319, -133, 11, -223, -142, -240, -201, 161, -110, -66, -165, 192, 79, -48, 229, 135, -169, 138, -53, -175, 184, -169, -94, -236, -203, 12, 64, 22, -281, 21, -61, -72, 88, -249, -180, -267, -99, -162, 158, -259, -244, 125, 40, 188, 121, 408, -237, 130, -63, 97, -94, 62, -108, -108, -205, 48, 140, -137, -126, 47, -298, -23, 87, 159, 141, -65, 163, -291, 113, 54, -108, 111, 15, -117, 157, -164, 360, 28, 261, 267, -102, -340, 18, -200, -129, 97, 21, 22, -93, -188, -40, -190, 32, -37, -72, -146, 2, 221, -64, -36, 178, -83, -129, -147, 58, -37, 146, 23, -55, -145, -279, 63, 169, 219, -187, 77, 69, 20, 24, -14, 147, 315, 2, 78, -140, -306, 4, -71, 68, 40, 18, 133, -290, -38, 114, 72, 165, 113, 152, 74, 73, -60, -32, 213, -21, -62, 163, -63, 178, -182, -30, 81, -282, -68, -160, 112, 167, -29, 54, -120, -206, 28, 170, -288, 68, -193, 5, -48, 112, -98, 2]
5254Bp9L0k03J91J70J19k05L1k4l5k16L27K41l41J44k92K00l21K53J01l57Q8K63
5277H7r1N2j40M5p3J13Q8J85l43j88M04J44m01K41k08J23k58L42l06J63j23K17
5299G3k79L03k50M7K09j21k6K57oj60m2J23j92J17j5k8J69J4m42K0K7o0L38k25
5323a49K63k38J68j99K2p2O8O0M5k17K11J03J67m4q8j36j25K09k63K65j07q8K78
5346A33j02o3j59K32j95P3jJ55q2j0o2nJ17n45J47J11K74K1R0j20pR3o1R3J14
5371B41k80J0L30m50K15j88j87M48k28L28j49l4l13L55j84J81n9j91J21K18k35
5392e1K29l39K23j31J42j27L5n0j03j9L35k45m7j49K03M12o03K19K07o0k69J38
5414e0j34K56O9j80J25k21K04K07m37J02K2J6J90Mj75K6j5l35M07p4J3j02K05
$$ y = [2, -77, -47, -250, -59, 111, 230, 25, 56, 32, -3, -219, 108, 349, 8, 152, -140, 60, -261, -8, 93, -264, -176, 87, -4, 48, -92, -47, -120, -7, 81, 266, -77, -265, 139, 283, -118, 123, -85, 38, -220, 122, -184, -21, -144, 73, -206, 97, -153, -106, 103, -18, -44, 213, 207, 47, 5, 128, -64, 53, 38, 10, 179, 193, -249, -229, -202, -262, 76, -149, 114, -124, 44, -155, -133, -205, -137, -77, -32, -249, -38, 65, 232, 188, 100, -36, -161, 48, -215, 50, -57, -145, 133, 31, -32, -191, 41, -154, -81, -82, 73, -9, -19, -81, -86, 31, -514, -367, -256, 18, 39, 129, 9, 2, 95, 34, 127, 241, -39, -29, 301, -149, 66, -122, -309, 139, -89, 239, 90, 56, -257, 98, -86, 95, 36, -155, -34, 184, -51, 178, -161, 62, -69, 73, -54, -19, -69, -172, -191, 144, -101, -148, -297, -94, 318, -285, -66, 141, 81, -188, -50, -184, 72, 141, -39, 86, -135, 69, 276, -161, -59, -37, -21, 169, 173, -2, 24, 9, -326, 81, 7, 20, -82, 123]
5437A23k1R7K8k29N9k33K41J15m98K59M78n38P0q4J91l23M99m30K9K76j5k65K46
5460G5m8K4j45K23k03K0k41K91J16N5r3j78L24j35J28k74P5j74j7L53j68K02K1
5483B31k20K7L6k72N04l87j15K93k46k6K12n1j07K00k60J32j16K24J2j28J56o0
5505C9k4j58J64j51J95j28L2J97l96L88m83P74n50m5K15N7j37J43l28M82j83n9
5527D4j43N4M5J6Q0Q9k01K56j95J0l9k80J74k7J99J00q1m0j63j11M14k16k30J92
5551e3j35J7j24J86L09j50jk90L88q6l04J30k99M89R1k26J23j5j76J20Q9L1k99
5574a85J03N3n3J78J2j26K10j63m7J60j28o7n2j8O6j14K80j61J47m6m14P37k64
5597A08N2j60O2q5O5j29L05N3m13K24j5N7j17J54k59j62J27K09m41O00%j67P4
$$ y = [123, 102, 199, 227, -2, 57, -176, 65, 180, -318, -59, 419, -119, -49, -133, 58, -265, 234, -196, -167, 109, 94, -171, 75, 27, 51, -94, 129, -74, -54, -295, -4, 112, 167, 74, -104, 220, 85, 213, -61, 14, -160, -177, 176, 8, 210, 231, 11, 38, 74, -198, 306, -81, -196, 97, -149, -175, 37, -14, -121, 79, -181, -49, -165, 59, 71, -57, 99, 39, 15, -143, 21, -130, 65, -63, -31, 166, -230, 158, -325, 449, -101, -146, 69, 126, -11, 132, -196, 286, 103, 44, -99, -45, 0, 16, 96, 185, -16, 240, 45, 55, 16, -264, -90, -117, 82, 182, 101, 61, -102, -213, 201, -15, -245, -53, -188, -171, -295, -109, 200, 50, 49, -241, 147, 61, -243, -113, -412, 77, 168, -58, 65, 50, -126, -6, 83, 114, -185, -82, -29, -82, 96, 108, -18, 192, 29, -18, 142, 14, -53, -105, -123, -57, -171, 109, -52, 95, 49, -365, 372, 108, 160, 0, 62, -23, 42, -87, 218, 271, -142, 82, 67, 124, 7, 161, -98, -260, -133, 76, -365, 235, 235, 68, 142]
5620A42o9j23J32k31j58K31K15J8N3k46k22J70MR9Rlo1L6J9J04j90J7l0L9K66
5645B21k11j88P4J04o9J2K82k91qk22K54L5j67M17K5m86LL14q4J00L7K74m65J48
5669A09l1q7Q1l92Q1K0J20J86k69J54K75j71l42L77l0o0o8l51N97k14J36k49L57
5692B29j45j17J49N8k23R0j00LK07k52J87m3N1l15L39J59m32O6K84p7Ko8l0l83
5716c61K97K44j08L9Q2J3k81M8K72j78k32J78O4k41L58k9k03j03P0L33k53O6k57
5739a82K77j59J31J93j75j71J30j5k23L90j75P6q6J22k16J95k8Kk39K19j76j14
5761b24L03j60r3oM96m50n7J14J41n3j03L51j37k32J52K91k56j46q2j93J83J68
5783Gj90M8L9K68l28L7K49k92K53k63K93J72m03N8k6L27j46m19K92P4r8j12j08
$$ y = [142, 73, -50, 82, -149, -307, -76, 139, 157, 210, -36, -258, -88, -84, 15, 24, 21, -40, -4, 15, 119, -71, -54, -84, -45, 221, 10, -178, -104, 0, -69, -57, 225, -66, -74, -296, -42, -7, -174, 243, 268, -218, -215, 99, 15, 115, 152, 426, -39, 109, 78, -9, 72, -320, -239, -219, -99, 87, -182, -28, 247, 76, -266, 111, 81, 21, -47, -398, 199, -15, 121, -128, 229, 84, -33, 116, 174, -49, 41, -59, -56, 151, -101, 86, 43, 94, -221, 118, 277, -155, -89, 195, 118, 120, 52, 22, -361, -64, 180, 72, 111, 193, 206, -75, -27, 245, 67, -165, 13, 77, -164, 194, 165, -38, -141, -71, 262, 9, 75, -182, 95, -64, 67, 260, 85, -86, 44, 29, -194, 196, 21, 97, 11, 133, -83, 112, 84, 86, -153, 66, -110, -224, 79, -81, -174, -180, 316, -134, -191, -77, 64, 11, -92, 259, 122, -110, 42, 333, 77, -69, -151, -344, -161, 7, -183, -135, -96, 172, -156, -119, 130, -162, 91, -172, 121, 293, -110, -52, -78, 249, 103, -316, -24, 50, -48, -160, -268]
5806b68K10J54m69K08K02j31j19K63J68l66L06k08J34J51l20J67K32n26R2J39
5826A9p7K58j48K7j61J47k22N4j0J39Q5o0rj13q9J05K1J99q8P2j31N0Rm6j76J80
5852C5j27k4j49J99o7m3K78k37j4K36r0j94L53L7k45K79j24j66k4l4J14J12M0
5875A45k27Nj71L49k38L57k66R2o9O1j35L04k39k24L55k08J01O5k06J53O3Q0j82
5898c5L4k92K69N0k42L51m6q6P4M0N7O7j12k79M58q9n07L29PL7j69J77l11J56
5922f2n5K60k01R9J4l02R1J17J52l4j93K43q2J71n50M20j38J04j1Lq3p4J33J35
5946A57l20K39m2j84N6K22k42o8K37l03K34J96p6M4J24l65Q2J34k33Q6Nn9N5J06
5970H5j88k8P5Q2j86K12J50l63K28j3j63L96j00j97O6M4k62K59P5m13L81j48r6
$$ y = [-268, -58, 96, -373, -165, 37, -94, -213, 50, 218, -148, 158, -50, 84, 235, -85, 82, 314, -212, -120, 19, -58, 200, 52, 79, -82, 65, -157, -103, -113, 26, 111, 51, 42, -71, -160, -55, -34, 165, 77, 149, 18, 68, 77, 31, -145, 35, -92, -116, -265, -66, -133, -176, 102, -135, -149, 87, -3, -197, 156, 193, -52, 227, 103, -63, -87, -121, -7, 105, 145, -82, -77, -248, 101, -137, 220, -46, 46, -23, 38, -97, 207, -32, -256, 99, -109, -8, 57, -149, 4, 67, 147, -35, -1, -293, -24, 26, -216, 135, 89, 3, 77, 117, 174, 241, 129, -150, 308, 219, -288, 41, 48, 85, -84, 93, -218, -62, -117, 143, -58, 41, 55, -247, -156, -39, 113, 79, -114, 129, 47, 218, -332, 88, -50, 54, 43, 46, -37, -111, 22, 157, -163, 76, 34, -150, -94, 128, -114, -182, 55, -248, -14, 182, 106, 150, 274, -91, -9, 125, -108, -22, -17, -76, -21, 85, -103, -131, -56, 26, -160, 52, 202, -161, 67, 54, -109, 287, 187, -10, 56, 100, -162, 97, 172, -241, 140, -8, -104]
5993a04j04QO0P8J16pj46L09k86kj24J62L6J48j72j80K4J58K06J08k35J51P8l08
6017b6K45l08K11k70J86Q3L2j80KK2J66o4k66J0%o7MJ94j05J82m5J2n1o9n7J2
6043a47J18K81k08mJ08j5l4j92K69j14j42J62l0j01j33O42n80J48M4P2k79M47
6065C12j54K05n02M21m6k21j02j82J99o2K78j57J90j98k36J85K04j25J19j67K19
6086A80j73l43J66J25j82J65o4j85K59Q5k37m5J94J12p4o6O7kJ99j48P9j35j07
6109a30K25j48J45n0n1j01K37j50J24k86M28n77J35N8q7K72J40k28k14K17K7O6
6131E2j33J24j14J30j20PrJ29j43R2J6K98j77n3l9j61k7K30k91J36r3L80j4l51
6155a31K49k02r2j8J63l6P0J25qj61k35J26K93j92J30L3J6m7q5l13K83M3j77K27
$$ y = [-104, -208, -200, -140, -62, 54, 47, -99, 210, -76, -78, -202, -40, -4, 144, -28, -208, -184, -26, 180, 288, 53, 204, 282, -26, 219, -89, 122, -148, 38, 121, 153, -27, -25, -3, 163, 99, -167, -157, -157, -224, -220, -26, -131, 51, 6, 18, -33, -102, -159, -147, -29, 252, 44, 40, 148, 133, 99, -93, 176, 62, -80, 82, 52, -49, -182, 460, -120, 28, 72, 144, -135, 312, 158, 363, -139, 282, 236, 15, -87, -269, -70, -132, 146, -11, 179, -19, -255, -70, 134, 9, 128, -39, 180, 7, -336, -170, -45, -227, -62, -126, -311, -52, 33, -204, -249, -55, 57, -17, -83, -16, -18, 181, 33, 112, -23, -130, 95, -53, 92, 42, -9, -110, 127, -23, 101, -185, 243, -334, -199, -141, -228, 44, 184, -44, -258, -41, -14, 52, -81, 43, -71, 59, -61, -54, -63, 66, -77, 15, 31, 329, 152, 99, 60, -101, -128, 102, -189, -53, -146, 234, 220, -131, 118, -84, -176, -194, -31, -67, 3, 128, 120, -41, -276, -150, 143, -49, 81, 114, 130, 83, -2, -315, -32, 11, -166, 61]
6179F1l61K93q6K25j53n0M11l47m05K28O2R9j94M08j71j6k84N05j05J12m09K20
6201D3r2K70l01K46l10j03J28p7L80l31J46k26K05R6k19J6R2J24k98L07j5Q0l03
6224a42kJ36k55K51j59J28Q7L6q0k47J60J55j37nK64j61j55j3l2K51j77K53o2
6247I4p2j0N2r0N5j03k34L50Q1M6j49j21J00N3j39K90j56R1j98N8J31R2l24J11
6271HR6k01q9J88O2k36K21J58l64M6o3J35Q9J00l44L59k00j6J56j05O9K16q1k78
6295g4M0p9L71k63j55K02j48R5J8k5Q3j86J68J59j08K64m03j06k1L88l50K59k6
6318A03k53L64rk66p4K55k54k11L11Q0j85J30N2j8m01M73l70L17L17k42j35J4
6340bJ25R7J2l29K10l85L08J4N0L6k78L9J67K51k89j05mJ85k9p6N3q9Q6K22k06
$$ y = [61, -300, -7, -93, 132, -21, -71, 340, -7, -412, -184, -122, -23, -217, 191, 20, 4, -280, 225, 120, 232, -177, 43, -49, 221, -80, 166, -144, -247, -119, -196, 184, -147, -1, -227, -22, 74, -145, -129, -37, 87, -211, 96, 81, 161, -142, -144, -8, -263, -12, -171, -43, 44, 80, 0, -247, -87, 68, -69, -74, 190, 29, -126, -139, -171, 80, -97, 156, 94, 22, 12, 64, -26, 29, -74, -308, 42, 123, 169, 20, -101, -1, 52, -87, 203, 47, 138, -60, -2, 129, 221, -103, 8, 104, -97, -186, 2, 64, -172, 49, 207, -157, -111, -174, -39, 50, 150, -194, 165, -35, -51, 105, 0, 69, 285, 204, -74, -34, -113, 258, -5, -160, 42, -106, -11, 7, -18, 65, -121, 47, 206, 98, 362, -41, -147, -168, 220, -130, 129, 103, -150, 214, 205, -61, -135, 120, -134, -345, -34, 46, -139, -9, 43, 25, -376, 97, -273, 44, 361, 119, -16, -2, 123, 220, 232, -97, 113, -272, 36, 50, 100, 136, -142, -103, 64, 315, 26, -79, -83, 102, 73, -3, 50, -39, 47, 269, 63]
6365F3n9j77K64r0O9j45J39K28m63j0K58j06Qj24J36M7j79J09o9K05J5j95N3o4
6389h7J54r8j67J88M3l47K95Q7k23L15m14J62J76k59L95j62j77M81l74J7K39n38
6411b94r9M72j56M8j47J92k32M22l28Q0J25j52J71j90J76J25j23l1kJ92j06j07
6433C6J59k59j40k4K93j63J25k12o5j62M36K7k62L3K27L9o5k2qq4N0J74k30L7
6457f0j54J49K38J04k74K3k02K04j12Q7K34lm87L75l0R7j90l3j43K87j34J24R3
6480A93q3j84J60L7n1K9J3m7k58J06J83j51J31j99J36j39J54J34k64J1Q1Q7j74
6503i5q5J89r7kk54K62K75l68K36k07L6n7K59l13m5K76J37J02m74J29J78J48k82
6526e2L5J84j43q2M79j68l53J86k38n6K18j48J03J26j3j45J12j95l2l2J99J02
$$ y = [63, 4, -173, 91, 1, 70, -75, 64, 292, -171, -181, 77, -29, -21, -145, -9, 38, -141, -32, -101, 104, 119, -76, -23, -87, 67, -31, -198, -10, 33, -314, -19, 68, -155, 160, -254, -92, 84, -175, 220, 58, -119, 362, -12, 5, 244, -294, -393, 79, -77, -29, -176, 16, -216, 206, -122, -42, 83, -69, 102, -88, 88, 213, 90, 59, 57, 249, 143, 36, 195, -64, -204, -228, 65, -98, 27, -185, -250, -412, 24, 51, -211, -178, 49, 88, 23, 1, -7, -91, -41, 133, -97, -60, -214, -65, 173, 277, 3, 26, -176, 28, -84, 3, 237, 234, -253, 122, 92, 189, -1, -34, -177, 110, -24, 100, 193, 110, -74, 86, 123, 72, 101, 114, 67, -191, -85, 98, -53, 78, -121, 15, -124, 30, 164, -100, -89, -8, 79, -95, -180, 9, -88, -90, -344, -82, 193, -175, 61, -146, -110, -167, 92, -221, -266, 10, 147, 249, -225, -96, 82, 230, -52, -17, 167, 24, -58, 421, 253, -100, 86, -152, -208, 10, -138, -35, 91, 78, -67, 45, -150, -182, -214, -15, 87]
6548H7p2qj06J09P9p3r5J7q1J02J64r5J60R8l12K0L7J34k29k26J57L30k2j12m3
6573B0J12j16J80k59k3j20N02k16r2J44m15L52n1J31l20L36k07qR2K5o2M2L20
6596C67k45k66o8L29l4o1pP9j51j93M72j58K2P7j04j76J66j69%K25o9j07L9j22
6620a54J38p2J22J73k73j9J04j39J8J89k7r9k13J34mj88J43J51r2N2QJ4j75J23
6644h6J33k6q6R4P7l5l9m3k15J06J48K04j4k85J0k54L77r8L3J32k31l3o0K06O2
6669G7k43K07J90k38j19J04p9Q5q6P7Q7O7J9k27QJ04O9j65k3L08J5o78N66K31
6693C56k19l5rk73N2N5j49L91m00M30j81J21k32P0K21l29R7J49j39o5J60J51m27
6716b05J72j57L54l16L54k99o1J36Q1N9m4mk54J09k2K56k46M7j78m9L24NJ3O5
$$ y = [87, 15, 7, -99, 10, 89, 16, -79, -62, -143, -41, 123, 28, 188, 286, -26, -6, 31, 165, -64, -290, -133, 197, 175, 63, 20, 132, 16, 196, -63, -86, -206, 296, 80, -12, 132, -283, 69, 18, 149, -171, 165, -42, -50, 42, 67, 5, 47, 367, 122, -144, -212, 117, 83, 22, 15, 94, -57, -250, 222, 64, 86, 163, 59, -117, 49, -120, -120, 105, 36, -71, -32, -154, -16, -88, 34, 207, -66, -85, 19, -120, -102, 87, 60, -39, -252, -118, -122, -310, -167, -16, -108, -56, -48, -34, -209, -86, 47, 21, -65, 29, 106, 71, 32, -11, -226, -120, 28, 232, 218, -67, -57, -311, 66, -32, 1, 133, -98, -131, -191, 15, 77, -166, 41, 231, -7, -126, -22, -101, -16, -102, -25, 62, 129, 148, -79, -71, 33, 102, -63, -86, 222, 237, -441, 125, 356, 137, 102, 93, -180, -128, -73, -222, 169, -231, 199, 18, 139, -93, -23, 198, -131, -34, 115, -24, -89, 71, 222, -205, -33, -190, 164, -152, 202, -97, -158, -22, 59, 118, 74, 70, -184, -75, -97, 159, -87, -40, -218, -267, 57, 62, 75, 140]
6740A40r5L6K07j85j39m2K17j00P1J69m71K6K49j86J65j25J21p0n6J23J3J00l06
6763a38k8J20PO9k17J25K58l8N8k00K4K8rJ96k1l64K13j05j73J68q4J01k24M75
6787B41n60K97K16Q2m72J04L28m20K60j61K43j13m09K19J40K51j86J79j95o1K88
6808B71k72M04l52p9l13L11n7mR8l3j09j08L24l28K30K16k81J5L03l02K41l55
6830a80J97L7m0J02J9L5j7p6l3j88J33m3J26k40K27J47j80j09J32j64K55r8n6
6853a4K77p7k41J36l07L16k18J54k7J06J52j97P7j72J75l54K91k14N8L06k12p0
6875e5J1K8K23j78j71J6J00N6J3j31J4J76k73K10R6K2lk87oJ35M3m8p2L23j60
6900H2j62k24K52P0q2K48l69K71m0J60j95J48Pk65K11k36N51m57k85M97k68M93
$$ y = [140, 45, 81, 288, 103, -36, -78, 139, 39, 110, 279, -192, -166, 83, -103, 62, -63, 58, -12, -68, 55, 68, 168, -138, -166, -46, -39, 30, -187, -62, 196, 158, 216, 16, 40, 68, 59, 255, 234, -130, 83, -22, -195, -27, -111, -10, -234, 241, -319, -22, 194, 276, -196, -92, 236, -184, 76, -85, 158, 45, -364, -145, -5, 246, 60, 239, 44, -17, 271, -1, 403, 51, -28, -341, -30, -87, -91, 7, -26, -135, -243, 81, -247, -17, 199, -82, -67, 236, -66, 175, -180, 17, 54, 14, 116, 135, 170, 153, 77, 44, -144, -11, -54, 72, -168, 59, 206, 26, -83, 49, -115, 140, 42, -14, 263, 186, -55, 81, -226, 90, -128, 26, -1, 105, 257, 60, 137, -35, 140, -214, 77, -137, -79, 227, 15, -55, -44, -16, 207, 29, -142, -126, -26, 30, 43, -88, -74, 102, -171, 39, 135, 157, 154, -133, -139, -4, 39, -9, -81, 242, 82, -80, -304, -52, 18, -64, 184, -185, 86, 46, 206, 11, 159, 166, -99, 112, -124, 427, -30, -315, 182, -86, 407]
6922D07l88k40K39K5k48M76P4m84J0J84m19M27n3k22K04M9O7j35j47J83j66L17
6944A60k64L0K52lk52j25J80j23J39L0p4J8L3pJ1J64r6k99L19l95L65j13j4L57
6968B93l71K35N1j95R4j71K45l36M51k75J3j03N7J25j20J44k31q5M3J47r1N6N0
6991B6J63l10n1M71m78J68P8j88K12j7k33J44J3j65L94l14K8j34K68k71L22j22
7013DK00N7p32K58M63L3O6l01Q7l4r0qq8j6q7J74j28J80M9j52J76J9R9j45o2j23
7039a01j00M2J15Q2k17m6K99K0j62K52M1k69m1j42OO8P2K57j72k12K90l21J28
7062a11J13k7k86L49j1j21j9n6L34j39r4L47k34K8O1q0J25j15j78L71m76J67p2
7085a24J37p8l3m2n4K38j94P3r6J95o7K67l99P1J67k54L28l44K70j49j70K68J46
$$ y = [407, 19, -221, 18, 43, -205, 271, 345, -139, -129, 55, -364, 63, 10, -212, -8, 41, 108, -27, -174, 9, -157, 160, -104, -74, 178, 175, -77, -202, -22, -145, -6, 24, -50, -32, 1, -6, 5, 169, 73, -226, 93, -302, 63, -50, -64, 293, -78, 157, 208, 13, 107, -64, 181, -155, 296, 21, 34, -69, -12, 113, -7, 137, -94, -179, -136, 11, -80, -24, 26, 189, -121, -172, 299, -179, -11, 67, -121, 91, 74, -159, -15, -2, -167, 227, -87, -59, -193, 75, -196, 126, 4, 204, 261, -471, -213, 250, 283, 349, 48, 135, 101, 11, 3, -85, -101, -188, -14, -142, 38, 87, -65, 111, 130, 229, 84, 22, -101, -201, -159, -44, 38, -179, -225, 74, 94, -68, 184, 225, -44, -85, -227, -221, -153, -81, 176, 4, -208, 82, -239, -111, 2, -25, -311, 38, 27, -94, -113, -169, 165, 26, -68, 279, 45, 73, 134, 54, 179, 64, -114, 257, -219, -52, -124, 13, -65, -98, -140, -194, 44, -150, -77, -173, 22, -45, 222, -177, -106, 61, -193, 135, -209, 61, -88, -258, 10, 156]
7108A56l48J30Q9%J86l0j65J23p3k75j38M54M1j34P6m2N8j96J5J54j4J4pl5N5
7133I4j75J7Q7j94qJ91jK00K1l04L89l26p6k0J67J15j85j29qR5J89J33l25J45
7157I2k75L23L9p1l92L40P2j41J74q3k36K04k56K86K2l01r4K88j9kJ07Q4k30K1
7181d8rK86k43J13j1mj22N5J02k40O3J12k66K90j6q8kr4O6J06J5RJ2k29J64k96
7207b75K27K6j13q6K17P1j60J47k97J28pJ62J12Q0k01l7J15K7r0J08k1j88PoK50
7232A96M1l9l58M55j59l45L10k70L53k47Kj3j49NM31m13K8J46L5O4k15J76J33
7255A67k36J51k31L35l00J31l5k90M32n2j18o1K47j00l61M22j01q6J11m0P2l5
7277B2J31ko3p7l1k0k7N82m26k28J34r2m7N5p9L11p9J41m08J94J66K13l38j24
$$ y = [156, -192, -62, 27, 27, 213, 183, 18, 141, 68, -207, -345, 109, 150, 16, 92, 50, 108, -88, -73, 81, 67, 81, 74, 39, 94, -81, -64, 23, -171, -179, 12, 11, 211, 232, -72, 317, -9, -85, -105, 62, 177, -8, -137, -145, -50, 139, 272, -53, 92, -183, 140, 179, 108, -284, 56, 128, -13, 161, 78, -158, 46, -210, 76, 98, -203, -297, -9, -28, -30, 77, 161, -69, -48, -57, 229, -14, 99, 88, 84, -38, 17, 119, -121, -58, 54, -212, 78, 62, -26, -28, -122, -56, 50, 65, 74, 86, -143, 21, -275, -48, -22, -135, -221, -4, 67, -93, 54, -243, -115, -122, 40, 152, 232, 31, -6, 109, 136, 46, 154, 133, -55, -48, -54, 196, 237, 198, -160, 295, 136, -209, 101, -169, 184, -63, -61, -74, -223, -218, 213, -200, -172, -26, 9, 73, -142, 34, 167, -69, 82, -149, 186, -114, 17, -18, -308, 124, 72, -46, -107, 140, 40, -321, 101, 0, -86, 25, -15, 57, 22, 153, 151, 88, 11, -20, -40, -67, 515, 89, -139, -5, -97, -144, -89, -168, 143, 64, 205, -203, -9, 157, 370, 32, -92]
7301i2K28l66K98k89K38M12n23O6j19K6P9J20k12K18m6k57m4K04q8J22K10jl64
7324a80J80J6k9k48J20J97J65o0j62j47j41K89J15j98M2k12L26k39R3K50J35n66
7346b54M82m12L67k11mOk09L01L4ol17L10l73N17j89k05K82M22m32k66P8j7N6
7369d0M5o9J15O4j11O7Lk40J56o8J52k37p1K07Mo5j60L63l00J7K45n6L5j78J07
7394a5o4J65R4j14J51k84L3l10J31N09k94K7j36R9p0Q7J78J4o76K95L65j39m8
7417bq7J83q7J66l27L06j80k41M03Q8k97J49j46l5J90l74K92mJ84k35J90L1j82
7440a5K62j95r5n3K81j82J92j71j88M35j38o7k61J51J48l63J48q8N08l44k89O59
7462C35k48J12k72k20M7J43OJ07m9J21k18K17N0J00k38j51L51j73k91J12J51l3
$$ y = [-92, 136, -230, 68, -221, 17, 429, -94, -28, -147, -121, -42, 78, -134, 84, 38, -219, -263, -59, -147, -25, 185, 184, -180, 0, 16, -13, -261, -141, 56, 221, 161, -1, -148, -289, 0, 115, -83, -41, -253, 73, -166, -73, 177, 312, -254, 228, -184, 183, -28, -32, -26, -235, 66, 100, 94, -223, 87, -286, 231, 42, -163, 119, 541, 109, -157, -79, -96, -40, 5, -64, 51, 115, 4, 71, 74, -166, -10, -78, 74, -163, -234, -27, -23, -88, -248, 115, -185, -168, 77, 21, 56, -122, -15, -79, 86, 180, 66, 217, -67, -34, -344, -213, 296, 2, 29, -107, -8, -78, 9, 187, 201, -475, -180, 185, 46, -2, -89, 94, 7, 173, -154, 152, -28, -269, 134, 222, -75, 74, -72, -107, 83, -291, 1, -3, 181, -54, 136, 167, -15, 247, 52, -43, -96, 185, 3, 195, 24, -164, 271, 133, 66, -195, -44, 104, -259, -111, -199, 309, -35, -324, 335, 87, 199, -73, -293, -246, -103, -97, 10, -39, 82, -136, 81, 131, 231, -7, -158, 193, 20, -271, -159, -8, -41]
7484d1K07l20J46j17N0K71j77o9J21k89j77M58O2k77N7M38j35n6n0o9J32j34r4
7507f3N3j27K57j52J27n2p4K67k00k7O9k02J75k68L29l6k37L83j47k69K88o1K15
7530B48j24r4J68%j6j94o0q3J86N0j80k9L5j5l1P7j20N4J27j2M4j9l89L82j86
7555a81L26r1j80J97k14J4O0L67l16M1q6J90j41q8r9K98k03K27k52N7K63k63Q9
7578A5j11K46m26K38J3j07L58l32J26n8J17L7N8k91J85k36j66L34q7r2L18k20
7600h1L2j22L31j7j74J84l37P4Q2k00J46R1K1J16o4J37o24M51j06q1J59j85K57
7623I0j74J05M7k83K57o7l3L55m18K0J04j97L59k08P9J03k05J25pj09J70j44M6
7646A5k37K57m7j10L58j5j68n0N0J71j68q3R2q8K97j74j6K6n7j32K12j74J12J33
$$ y = [-41, 166, -154, -8, -125, -75, 196, 19, -50, 71, -218, -395, 63, 125, -152, -95, 343, 208, 152, 102, 33, 165, 31, -63, -10, -137, 120, -32, 95, 43, -31, 236, 36, 9, 78, -124, 51, -217, 112, 76, -161, 222, 75, -194, 94, 33, 248, 124, 30, 198, 198, 182, -12, -72, -155, 31, 81, -99, -128, -93, -108, -139, -62, -182, -128, -1, -13, 31, 12, -377, 5, -181, 145, 54, -126, 71, -143, -129, -69, 298, -18, 23, -63, 127, -14, -102, -201, 97, -106, 121, -131, -74, 189, -74, 15, -96, 150, -276, -38, -25, -132, 226, -106, 20, -38, 79, 116, 174, -117, 68, -168, -334, 0, -87, -179, 139, -81, -49, -171, 160, 143, -31, 153, -184, -110, -28, -228, -82, 9, 30, 146, 82, 219, -405, 46, -60, -141, 18, -167, 90, -84, 21, 68, -215, 42, -25, -58, 297, -121, -101, 3, -194, 165, -43, 36, 139, -66, 59, 52, -57, 113, -31, 15, -222, 35, -12, -122, 236, 221, 53, 3, 53, 224, 56, -27, 65, -23, 274, 100, 84, 110, 53, -79, 133, -41, 71, 204]
7670B04L6k12n7J35l5j10n0k34M27J12j89L20l70o7K1j49L86o4j82J38j1q7k35
7693b73J75O6J62k08K27k89K96j92j80L37k3j98m1R3R0k49M51l4l12J11j0l6K2
7716a5L7o0j5K15l56J73L80l48J06k20l1L97k48j14P6L4L7k8J72j17Nj23P5L3
7740F5ppK0j17m9L13Jj05j30k9PN8j41K47R7m67K76j28j20K51J41j57j10J28k30
7765a93L05p6N4J37m73M30j57M3l66K51J20Np1K12m63P9J45j8K4J3o0L5k19N4
7789a89L25k21M31k52m3PP0p0qq2J06l06L55rk7J90k67J73k99J10k4L6K46l46
7813i4J66k1K24l03L3j32O4o5J03L62m00R9o6J53k46J5K11k61K20l17L85M0r8
7836G2J18j90k4J48k47J10J79O5m64NJ88KL88k93J2j51K21j53J5o7K4K5j24R3
$$ y = [204, 240, 28, -29, 106, 71, -39, -89, -323, 104, 216, 27, 347, -23, -90, -69, -218, 168, 104, -78, 60, 49, -38, -273, -98, -32, 130, -78, 149, -140, 156, -36, -216, 121, 98, -100, -141, -48, 42, -207, 244, 210, -102, 9, -1, -37, -15, 22, -38, -53, 162, -194, -21, 359, 11, 117, -103, -134, 263, 15, -99, -23, 11, 48, 20, 192, 75, 80, -43, 32, 65, 58, 51, 71, -46, -95, 218, 219, 114, -16, -45, -38, 20, -121, 126, 223, -244, 32, -96, -216, 35, 176, 19, -91, 37, -193, 112, 36, 90, 227, -246, 184, 27, 70, -296, -45, 75, 80, 9, 221, -242, -163, -18, -36, -12, 1, -59, -24, -243, -189, 136, -85, 346, 94, 51, 58, 128, 58, 50, -32, 74, -232, 123, 114, 87, 277, 10, 183, -116, -6, -30, 6, 252, -94, 72, 51, 275, -28, 5, -127, -63, -128, -25, 337, -63, 36, -30, 123, -123, -108, 103, -158, 62, -255, 130, 170, 72, 190, 0, -24, 124, -123, -13, 166, 231, -233, -228, -40, -38, 350, 57, 69, -82, 139, -14, 1, -66, -42, -17, -141, -48]
7860d8J82k68J26J01o6j71N07m47M2PJ11P1m85L13j58K16k34q9O44k00J3k22J97
7883A42q2M9o9R7j00m37M29pOOo7kR1j04L7j16J25k43K73J56R8m74K49k83Q9%
7909a37RJ75j89M9J14J07L2j87q7J31P6n7O3r6L7l5J49k92J16j68L39r2m8R9P5
7934A83j23k95K50R3l7Mo2l0j30n3K95k10K65k65N11m53J12J06L2l93J63q7K08
7957H4M7j21o0M9R4m39K82j08M6O6P9j54o3K49k62L68k48R6j81j85L37Q4J80j72
7981F8j88k9K95p2r2J46l42M6J38j56M54n8q7k25k97N60r6k22l5L12J4O9k36k36
8005b69M31r5R9j23j94L43k22J58o4j81K8J45l42J86JK64j73Mj63L16n7k82K24
8028C4p7J63j5j1k66J43k0O7J63j40K35k06m6k95N04k8k36J79k20J17k84J17K10
$$ y = [-48, 134, -134, -8, 93, 27, -144, 363, -84, -42, -35, 76, 147, -338, -25, -183, 33, -201, -290, 354, 154, 167, -55, 142, 60, 109, 40, 137, 37, -400, 29, 22, 28, 34, -33, -35, 56, -48, -11, -127, -2, -245, 28, 184, 282, -192, 57, -226, -137, -137, -128, 47, -142, -93, 21, 128, 160, -27, -114, 17, 93, 36, 99, 3, 40, 5, 154, -138, -22, -190, 149, 57, 9, 108, 183, 60, -235, 15, 108, 71, 75, 13, -17, -147, -200, 95, -115, 150, -115, 396, -57, 55, 161, 193, -200, -37, -124, 84, 131, 10, -50, -1, 93, -346, -64, -172, -126, -60, 19, -135, -198, 51, -211, 157, -91, 5, -176, -361, -24, 60, 240, 68, -120, -149, 146, 74, -18, 128, -214, -168, -30, -186, 268, 210, 123, -102, -399, 161, 65, -157, -192, 120, 134, 203, -33, -269, 162, 67, 166, 43, -151, 192, -30, 128, 64, -117, -89, 56, -286, -100, -99, 165, -8, -4, -167, 149, 92, -190, 34, -43, 120, 105, 94, -172, -29, -49, 18, 181, 41, 276, 70, 24, -271, 233, 205, -31, 148, -72, 45, -239, -122, 88]
8051H8j91L7K27j58M3O8j56O5k21N8M6K56r4k46L06j69j5j31L71j71qq2O9l6n2
8076i6K47J02k48k05J83J15n5O1j79l3l3J50M0mj54J98Q9l77R2j65K74Q5J49m04
8100a68L9J34K20l87J91O9l3k16r5K3L93j94j44J52l77N87l83L28j46J15k05J4
8122h3J10j36L9m6J85O1K5k12j83K39K99m76K41j42R2J81k5j59J07k35M2J34m8
8145A0M7q6m8J01k97J70m9J54l0J97j68J67N2j07r2K4o5R7j44j30J99Q6j06j50
8169a68J32J33k3m1j51J18K0O4K08q7k28Rr9j8J21K07q7j02Q6OJ73l07
$$ y = [88, -103, -66, 161, 3, 46, 114, -42, 23, -198, -140, -94, 162, 68, -178, 128, -41, -56, -187, 184, 13, 5, -77, -8, -44, -96, 151, 253, 5, -200, -17, 98, 43, 104, -75, -108, -141, 9, 49, 45, -109, 89, 178, -199, -107, -272, 2, 87, 236, -168, -129, 5, 225, -162, 29, 98, 65, -151, -246, -223, 170, -24, -168, -16, -393, 194, -189, 139, -7, 108, -97, -83, 27, -109, -70, -116, 69, 130, 155, -57, -240, -1, 298, -178, 63, -79, 13, 194, 169, 10, 117, -118, -76, 58, 10, 57, -29, -77, 24, -273, -103, -152, 2, -28, 169, 1, 168, 220, 113, 21, 45, -20, 77, -67, -197, 2, 88, -18, -168, -36, 97, 74, 33, -118, 0, 20, 84, 292, 205, -23, -14, -113, -131, -10, 197, 110, 8, 94, 100, 273, -34]
8191c4
$$ Imaginary data points
##PAGE= N=2
##DATA TABLE= (X++(I..I)), XYDATA
0@%%%%%%%%%%Qj6J6j6K4l2L8m6N6p0Q1r7J18j37J61j89K19k55K92l33L84m40N01
33B67n67O40p25Q17r14J020j139J270j413J570j740J926k129K350k592K856l148
50a651L470l822M209m642N127n670O286o990P802q754R887j1262J2973j5166J8098
65I895k2243K8585l9612O4180k20514J00300L65174k64046j33447J12106M6667
76D7045q6612R9463M1695j06931m0729Q1539l7797m0164L8243j498l0506P0054
88C3802j0433j02190N1870J42602p5895j28622P4224P7513q6747m439Q4959n8124
100a480q5986Q6737N3639p9329P367P6931n3080n0654Q0855N425j04031M2967
112b0639J20750o9315j31425M5722Q7343j8028k0408J2734j8010n011K4956q61
$$ y = [0, 0, 0, 0, 0, 0, 0, 0, 0, 0, 0, 8, -8, 8, -8, 16, -16, 22, -24, 32, -38, 43, -54, 64, -73, 88, -101, 118, -137, 155, -178, 206, -234, 267, -300, 340, -385, 432, -482, 538, -601, 669, -744, 826, -914, 1012, -1117, 1233, -1359, 1497, -1651, 1819, -2003, 2206, -2436, 2691, -2979, 3307, -3683, 4119, -4635, 5252, -6010, 6963, -8203, 9895, -12348, 16237, -23375, 40805, -179709, -79409, 285765, 21719, -111728, 378, 47045, -39567, 59896, 101591, -5340, -46069, 35470, -2327, -42491, -4248, -5746, -36252, 33802, 23369, -78821, -26951, 115651, 39756, -88866, -14642, 62871, -23876, -28315, 56644, -1480, -87466, -729, 52910, -26419, -19052, 57879, 4799, -45855, 35000, 40425, -63606, -20639, 100111, 30796, -100629, -54907, 32436, 14408, -6000, 6734, -11276, -16287, 8669, 7808]
124G808N413K6647l2101n0164M6719M5383p0510l1248Q1174P29q4713K9529P8829
137E3495m8186n6983O5511L7654p8558k8529P7690L1930n3115m0101Q786L6811
149F405L0618j9051l2959J8305J7794l7854j3728N2706J5982m8371j4327J7830
161f650j9225j010N6571J1414n9339k0311L7055K2144J883o681k7227r279L6035
174A5380Q568l9917R51L6770k3630m1193L6345M4075l0519l3374J8886J9998o459
187E881n393O93J42N002o507j6532J3556K5110k4174k5442M0287K7728m7445l0655
201c7749M0818K5506k8289j3419J1563r961q911K4781J1996k0798r345J3057J1552
214A0801L463o851j2270O220J6769j1260k6228J0737K6159j4035k6916J0187J8584
$$ y = [7808, 13221, 39868, 7767, -42397, 4322, 49705, -20805, -52053, 29121, 29850, -54863, -25334, 53495, 5309, -51674, 13837, 51491, -27067, -55596, 22094, 54024, 909, -39192, -30406, 6405, 37023, 17972, -14987, 3318, 21112, -16742, -30470, 22236, 38218, -10153, -24480, -6650, -25875, -26885, 29686, 41100, -18239, -38550, -1495, 20649, 22532, 15851, -11376, -20655, 15380, 23948, -15969, -15018, 21752, -1878, -43071, -6726, 37349, 6830, -26544, -7658, 12340, 5881, 488, 1181, 1323, 6325, -182, -16714, -3158, 21952, -2222, -27664, 12623, 40351, -7094, -37749, 3069, 28575, 286, -13133, -1570, -11531, -20442, 4339, 16335, -4463, -13808, -751, 10801, 14264, 7413, -4857, 1363, 18132, 6872, -19356, -8619, 17540, 3505, -23411, -13224, 5360]
227E360l525l407M379m525m563Q197P804l814n201j607j731K173L408m981k491
242d524R010L51j0007K308J0000m349q580O286P102j2328j2374J1390J5534n381
256D438j4713J036J6336P017j1701n826J1029M033j2825o213J0584M441j5728
269h092q296J3850O923j1972k827J4823N358j3773m910J6984Q906j5693j1749
282a0468J2276J0339j0970j1820Q197J0728p798j0295Q606J1143p827j2339N775
295d453J4012n053j6021J946J5660L20j2911k205J2134O168q179m241R202L817
309A0196q877n581O473L825r683q689Q419P016q393m987Q286O991m160l726O429
324C539N830n614m926L509L180m332o691K425O660l708q002M721Q862l730p866
$$ y = [5360, 1835, -1572, 2807, -1718, -6281, 1916, 9720, 5906, 705, -902, -2633, -460, 2948, -2033, -4524, 4486, 4837, -5170, -2862, 7138, 2789, -5791, 495, 7597, -4731, -17105, -5715, 9819, 4438, -10275, -9239, 7097, 14114, 2413, -3413, 7616, 11649, -1176, -7389, 3195, 7636, -8092, -16388, -2538, 4385, -7587, -10414, 4409, 9767, -4006, -8916, 8068, 16974, 1281, -10468, 1808, 12147, 1177, -10643, -2446, 8282, 484, -9811, -1205, 9938, 2111, -10228, -4453, 9559, 4506, -11515, -9569, 6091, 6411, -6500, -8705, 3429, 9597, 1418, -2823, 6379, 10196, 1319, -4262, 2211, 6036, -3647, -12336, -3917, 3099, -5294, -10281, -1995, 4996, 836, -2890, 3539, 9369, 3755, -1171, 2338, 5518, 1186, -5505, -3080, 3580, -128, -8130, -3409, 5453, 1723, -6143]
339f143M784Q053n371q183N389O649o625n504O365N542l726l933M745N385l397
354D030n334J903M470k580p785j54O644j959r761K900J1514r25j0153L312J3421
369I543r8j2216J000J1227j430j1184j886O686J961o825m968N977N448m314n169
384f248N958R024o982j1408Q284J2218r023j2219Q389R918p165r109P977R979
398I593n330p622K169N804j79o276m034N746K578r986l014J3411L892j4081k820
413a0149J6646N383j2148j859R576j038q085K77L709p92l110m051L29N588l10
428c4p657L119J3363j328j3584J148R283l556k191R162k470j5001N37J4376L881
443I048p525m031o16L312O676l059r731L107P304r235n575J2313L706j1513L76
$$ y = [-6143, -1359, 6694, 1323, -6860, -1471, 5178, -1447, -6951, -586, 4956, 1230, -2703, 2042, 7427, 4030, -1304, 599, 5069, 2489, -5296, -5450, 1194, -765, -10526, -7626, 3888, 2963, -7190, -3878, 9543, 9445, -2771, -1771, 9456, 8026, -3158, -5044, 1642, 3603, -3222, -8190, -2213, 3235, -1079, -6248, -290, 8734, 1752, -9656, -1372, 10846, 1823, -10396, -2007, 7911, 746, -8363, -386, 9593, 4263, -3359, -1190, 4614, 4435, -1841, -5875, -129, 2449, -7537, -10551, 2860, 6752, -7329, -10149, 6497, 11880, -268, -2127, 7449, 6411, -1674, -1397, 2312, 1520, -1590, -5641, -5312, 276, -34, -7691, -4572, 8791, 7463, -6121, -4973, 4310, 754, -1437, 7725, 5255, -9746, -9209, 5167, 9048, 1523, -2508, -3124, 188, 6864, 3805, -5926, -2819, 4485, -4750, -10325, 1988, 5694, -5819, -5443]
458e443R091m742k898J5232N293j9243q293J1531O350j763k326r117m064R101
472a291L052r448L375J3299n451j1926R568P336j2630o38J6816l012j7830R23
486g857J0214O91j381l51n259M74R084k737p754P372L028j6321j083K2048Rk0495
502a0318Q47J4341l877o726J0892P047q913m507J774l323J506N824k802l155J513
517A23q035q879J4595J6495r492j3555Q193O700r455o17J2695J623q629o275l765
532h278L078J2465L348j2677q959M907P601N949L795j0755j6769M411J9365M770
546A2251r285p180l739m58P998Q779J234l441o813o838K639J2015J262r695j505
561b776J346o665J98J0807P54r150K465Q935j963n530J791J976k55K345j477n151
$$ y = [-5443, 3648, -1094, -3992, 11240, 16533, -2710, -11003, 528, 6878, 5115, 2789, -6328, -10392, -1291, 1761, -7687, -4312, 8987, 3536, -8390, 1178, 8514, -4116, -4754, 12062, 9050, -8780, -7857, 2357, 3048, 1667, 1316, -3943, -3469, 5615, 2878, -4876, 2496, 5524, -10797, -11880, 10168, 10177, -10318, -9471, 4870, 993, -5733, 5159, 12206, 3293, -1214, 560, -2763, -1257, 4567, 1765, -1390, 123, -7912, -16791, -2196, 14299, 4807, -8748, -555, 6145, -3310, -3927, 8768, 10391, 1762, -4513, -8278, -5200, 7265, 10613, -2064, -11023, -6116, 1485, 7434, 11229, 474, -16295, -11884, 7481, 12251, 2966, -4214, -7953, -8411, -413, 8366, 9600, 6159, -654, -7492, -4853, 7162, 8424, -1271, -2776, -1430, -8095, -7897, 2910, 3664, -5486, -3021, 5914, 3951, -1579, 212, 2188, 1933, 4278, 2801, -2350]
577b350N83K427l954J524M565m904n026J0015N798j0149n119P982n12o463O588
592A005R146o956j1266r67N455J0244O534q520j2000L426P302l030j503O041k756
607B155q720J693L576n220J927J0988mq667j664L737M215M855l038j0561j247
622e975R999p03o881M373J335j1755L3J5561M767j0200m968O64k58M467O364j900
638D923m689k513n118J056J3659M077j2813l590P309k925l641R583J868j3863
652f677k571J2385L87p993N94K382k128O287N188p837l142O756j150l273P591
667F799n79j4407q9J5307k866j4400L975R464m070j99O326m543o306N728M030
682D170m330J930L337q679m360R808J895o218O421M211j3084m616J4957M349j2961
$$ y = [-2350, -1767, 660, -3294, -1770, 2795, -2109, -7135, 2880, 8678, -1471, -6590, 1392, 880, -5583, 1005, 10151, 3195, -8071, -9038, -3583, 6661, 13195, 4675, -7325, -3899, 3403, 373, -1130, 4911, 2155, -6565, -4872, -1296, -6516, -4589, 6399, 6395, -2272, -3936, -199, 4016, 8871, 5833, -4728, -5975, 4024, 3321, -3560, 813, 2148, -9607, -9574, 5987, 10754, 554, -4414, -3750, -4008, 459, 6823, 4923, 234, -2279, -7397, -6341, 7318, 11395, -1418, -5008, 2301, -624, -4265, 5318, 7186, -6677, -9248, 3137, 3524, -4469, -3875, -1493, -3621, 2666, 7854, 17, -3125, 3631, 2481, -792, 6799, 6220, -8187, -8276, 7031, 4165, -10235, -6260, 3204, -866, -1065, 5261, 718, -5588, 140, 4170, -160, 1770, 5107, -3572, -7932, 1876, 3771, -2447, 3974, 8185, -4899, -9515, 5442, 9791, -3170]
697c170l803P349o37l038L542n09k783K859J847k617L645L778o693l018P981L58
713E091r411J047R232m753r414M108N834l282j016M134q72k710J589K166J346
728C089R87k310n033J962M498l693l894N889K523p513q96Q223J861p078k711L364
744g32K234k217j596J92Q39J22k85J789L785j155m485K143M468k254m694J221
760f25K355k800k866J904K162j851j173J738K755M66l037p43N064P41n215q77
776b002M970m49n053K23N128j030m800P63K840N30o43j604O5J667K37j727L69
793e16K221k027l355K786N339l107l800L850L326l994k342L207N34l449j577R66
809a938J132p12j161N41K250J805k362o92M368R12m755l86M290j201m932P64L623
$$ y = [-3170, -6973, 376, -261, -3299, 243, -266, -3049, -190, 1657, -960, 2685, 6463, -230, -3248, 4733, 5091, -4320, -3273, 5959, 1206, -8208, -4100, 1734, -1548, -2564, 1570, 698, -2012, -423, 1743, 3089, 4076, 1766, -3267, -1305, 3193, -500, -4394, 1495, 4018, -3495, -4391, 3832, 5693, -1385, -4096, -732, 1502, -715, -2311, -2119, -1280, -1158, -1443, 346, 4131, 2976, -1509, 634, 5102, 2848, -1846, -625, 1730, -1070, -3936, -2032, 130, -1721, -2894, -1156, 1599, 2065, -972, -1715, 3349, 4090, -1125, -2002, 2968, 2519, -2534, -2311, 2817, 1787, -3013, -2250, 590, 1120, 477, -1127, -1062, 605, 842, -885, -516, 1705, -322, -3677, -891, 4448, 1341, -2459, 1391, 4717, 723, -1619, 1588, 2122, -1327, -2904, -1938, -806, -1518, -2679, -2138, 112, 1917, -445, -1137, 3231, 4143, -612, -998, 3292, 2091, -2841, -2077, 1546]
826A546j223l170J581K369r82r37J108N49n34j073l59J661L61j608k025K825K684
843B773k530k346L839K159l627j672L127P99l846j250K457K20k795l55K614Q53
859D20q64p49J566K780l54k875J31L220n80m362k86L486q98m454J490L841j671
876a59l077K087L788j096k804L82K455J41k617r16K136J436k373j474L232J567
892B708k715j469L097J118l430k154K586J733k619k309J340K587M7k051M78K759
908A706M93j817J580J404k206k813J596K055j959k590N93N86k10L36O13P41R96
925A104o85j479J320K297j898j942J522R53k712L14L944j776l608K155L085j650
941I44j486J028n03j351O08J02j07K70J95j504J083K705j162j846L719J769m681
$$ y = [1546, 323, -2847, -1266, 1103, 121, -816, 292, 841, 307, -766, -1125, 536, 897, -711, -2736, 89, 2773, 243, -2103, 1736, 3895, 268, -1404, 1723, 2522, -1324, -2574, -117, 103, -2692, -3047, -433, 420, -444, -1193, 373, 3153, 2799, -76, 55, 3275, 2695, -1667, -1953, 1533, 635, -3819, -2329, 1512, -159, -3236, -1149, 2639, 1543, -1261, -879, 1576, 1717, -900, -1816, 320, 1756, -617, -2091, 1141, 2708, -7, -1476, 1621, 2739, -691, -2845, -259, 1474, -1145, -3454, -2114, 473, 520, -1531, -1053, 1706, 2199, 382, 1962, 3366, 1160, -1653, -57, 1998, 39, -2551, -1958, -1372, -1582, -1246, -633, 108, 1104, 419, -1060, 260, 2557, 659, -1283, 239, 1192, -1520, -1206, 2738, 962, -2646, -491, 2594, 944, -542, 486, -17, -1368, -760, -658, -765, -495, -300, -1804, -721, 1984, 822, -1024, 2695, 4464, -217]
958b17k317M246L37l906M21K818k580l351K189K691L32p06k55O4K030N0l013O21
976e46L651q60m600Q35L748j755l439K271K975k744j052K783J055k372k416j85
992b651K720J890j385k688J154J685j950n06M922K339m044l448J051J164k89P50
1008G14Q16j790l729o71L312M139j008l906m03M156J285j498k21k09k059n53K894
1025A269J853k481l348n58K083K644L44j112q17n30j344R04K491k47k574P99J824
1042A200j080k258J603K033M29j04J26j243j842M8L50J824J070k498l590Q62K553
1059e17m27O49K820r98l736J244M669k60l788q24J123P95L79j205j276L37k47
1076a262j719K440M652j331n565J98L580j671j062M717N83n192k449K101K977
$$ y = [-217, -2534, 1712, 2049, -1857, -1436, 1382, -1198, -4549, -2360, 331, 663, -43, -298, -234, 1796, 1846, -1167, -546, 3105, 2245, -2355, -1520, 2228, 473, -2966, -695, 2280, -464, -1516, 1267, 2322, -50, -2466, -2651, 69, 1959, 574, -2114, -960, 725, -1225, -1731, 3191, 5530, 1486, -1962, -911, 253, -36, 714, 1530, -260, -3989, -4660, -1348, 2791, 1783, -2123, -2526, 1630, 2915, 1417, 1196, 987, -1072, -1625, 1269, 3122, 641, -2707, -3265, -1182, 1462, 1806, 694, -123, -653, -1997, -1093, 1398, 1151, -1423, -624, 1200, 120, -2138, -535, 1498, 1927, 1823, 1949, 706, -1136, -1088, -738, 1086, 2156, -342, -3932, -3070, -517, -944, -295, 2525, 1527, -2209, -965, 3704, 3444, -344, -1168, -45, 750, 1129, -76, -1352, -1015, -1262, -2981, -541, 4111, 2780, -2785, -2587, 993, -678, -1740, 2977, 3560, -1632, -4081, -1980, 997]
1091I97J538L3k228p19Q84q63j947L660K466n785l440N090K455l825r11L367l25
1108D47j791K605K417j848k105o36l62L200K144m093m636K859K192k584J187M310
1124C306k406n014L146M168j984k679J565L45m70J513p71l031P63K560m43P14
1140A282J668l341l912L519M441l037k885J736q05j580K795K372k573j584K034
1155A30J117O58R43j672l044R08L123j507q54R40k602k777L403L728j872k257
1171a635K326j44j807O64L039r43j709K03l51J95P41q19j114K459Q30k829m95
1188a389L325q13m042J332L810j783k884J354J093o57PJ221P33O97n70k307M52
1205d21K715r36l007J265J671k904j686L022J787k215j320J804J584k22l87n90
$$ y = [997, 2535, 2568, 340, -379, 505, -358, -2305, 1355, 3821, -1964, -5404, -314, 2141, -1684, -2595, 772, 447, -1344, 1261, 3678, 1830, -275, -911, -1273, 1927, 4071, -22, -4658, -1799, 393, -2191, -1004, 3306, 900, -4114, -968, 3200, 1216, -1463, 102, 447, -23, 1490, 719, -2312, -1549, 1011, 568, 1282, 2950, -391, -4303, -784, 3657, 620, -2265, -529, -1334, -2914, -119, 2253, -320, -1904, 130, 1247, 1905, 2848, 1176, -1868, -960, 2163, 656, -198, 742, -1860, -4637, -1234, 2494, 622, -1635, 691, 547, -1260, -596, 2443, 1500, -209, -6, -357, -162, 579, -240, -1354, 1105, 1935, -894, -1389, 1936, 1123, -2919, -1587, 2223, 440, -2444, -1090, 3, -654, -647, 574, 1307, 2004, 1434, -873, -421, 2294, 1358, -1649, -384, 1287, -1617, -3303, -281, 1506, -709, -2029, -225, 1359, 1137, 750, 160]
1221A60M95L06p15j025J556P70l336j304L724J586k743q20K118l8j460L08J013
1238E95m76j114k32R97Q60j00j572N9K504P03j962l20J182q97j043J381O61k458
1256a232j151J232J192n87J08j37O5P83P20N07l88n83n58rR26l12j249n55R99
1275b29k38o38J036Q44p41r40J188R87j440o23O75O07r93p35P35J524l25q49k1
1294a76J676m25j358k30J623k90k057p10J766M93j903k50J990P92j409n14J802
1311H20J406j140j519O98R64m91j889M54J165p18j702N63K208Mj858m22K625M75
1329A643k069m40J480O16j543p95J685N67j710n01J475J272j281q41O12J016p76
1346D10j534j79J055l62q04K59J712l99p38O32J957l99j498p8J001n01p17l36
$$ y = [160, 655, 961, 246, -779, 777, 1547, -1789, -3093, 631, 2217, -526, -1346, 772, 734, -726, -418, 595, 119, -995, -1227, -230, 630, 530, -1042, -983, 1521, 2224, 262, -58, 1124, 227, -816, 565, 1226, -1232, -2383, -1151, 41, -546, -438, -575, -510, 273, 993, 1500, 1112, 529, -29, -38, 888, 576, -673, -1228, -229, -467, -1105, -69, 775, 34, -906, 282, 1269, -171, -794, -119, 488, -505, -1240, -505, 1019, 694, -155, -176, 1500, 1075, -283, -513, 1110, 820, -1237, -1947, -181, 312, -1591, -1841, 149, 941, -468, -982, 820, 2226, 1086, -433, 265, 1229, 738, -1151, -697, 468, -250, -1952, -1389, 819, 823, -1035, -1457, 1168, 1643, -426, -866, 614, 1230, -313, -1108, 577, 1144, -566, -1067, 408, 1680, 399, -442, 170, 1186, 410, -1124, -1303, -248, -610, -1414, -1155, 557, 158, -580, 52, 2009, 1610, 112, 34, 1035, 534, -183, -519]
1364e19M8n46k4N23l1J90j10K43O62K03k85l85J19J9J55k68Q8No20Q43J45m03
1386E2o54O90P84q04m11k60P54n8j264N33L74K24r41L02J710j18j055L29J528
1405A715m0j736o01J201r5j421o29R05P18o88o24R40J317m76j306J104J921j771
1423D34j767J227J632j201j602R26J258q12p07L72P66L44o62j357J122J227j911
1440g11j607K476J275k172p81K232O83k167Q41J563n39p95r7l61PN55q24j486
1458a908J098J029j491q00K990N75k368O49K497j444j605J721M08j999o0J495
1474G87j032n60R05p31p98J954J307j923m42J282j828o76K626J315l532p5K139
1491G18o93j435K801J072k905J24J937r96j479P53k9j297J292O87k277j61L128
$$ y = [-519, -471, -1017, -1041, -518, -549, -359, -469, -226, 436, 639, 354, -31, 88, 107, 262, -6, 82, 87, -533, 310, 455, 52, -602, 88, 872, 68, -343, -603, 151, 93, -1171, -638, -264, -40, -981, -679, 1031, 913, -142, 187, 1715, 1675, -61, -662, 539, 444, -977, -1606, -701, 17, -671, -1295, -355, 962, 486, -820, 284, 2205, 434, -1333, -106, 1526, 325, -1277, -351, 907, 95, -612, -240, 526, 870, 208, -1149, -27, 1200, -711, -2318, 158, 1433, -739, -1520, 712, 1395, -772, 69, 1632, 1093, 298, 201, -160, -153, 402, -422, -1908, -810, 219, -1272, -2072, 918, 1493, -875, -226, 2271, 827, -778, 943, 1351, -648, -708, 787, -245, -805, 100, -631, -1429, 525, 1832, -91, -533, 749, -1079, -1755, 871, 2186, -1346, -1421, 718, 25, -1410, 1391, 2463, -442, -318, 1619, 623, -856, -103, -132, -1429, -137, 550, -1727, -1888, 1240]
1508A240j261j723L270J304l772o14M165p64l276J351J416j946m12J546j052r01
1524a429K102p40j446K936J827m860j548M689k07l267K098K955m121k541M188
1539F36J368j841P34J85k402R90K053k385j264L147r74l735K166M094l389k935
1555c552M497K141l900J014K638k876j648K682j33j823J843K97l947P9L952j118
1571A46k148L732J122n376K68M562j229k891K790P72l317M66L162k203j563K793
1587A086M85k621J788J540l759j206L890R4l404K348Q38l694j80N285l90l479
1603a379J749J863k712p3K854j705k818J816J354j653O56M86k921m06M835L07
1619B253l186R69J579l027n72M367N39m186j32K036p48q11J995l23j543J469p3
$$ y = [1240, -21, -1744, 1526, 2830, -942, -1556, 2609, 1845, -1431, -80, 1336, -610, -1022, 524, -528, -1429, 673, -67, -1513, 1423, 3250, -1610, -3158, 1531, 1324, -1943, 155, 3110, -1011, -3552, 636, 2004, 163, 897, 1082, -1320, -330, 1723, -662, -1926, 1221, 247, -3488, -1322, 2772, -617, -3552, 945, 3086, -814, 200, 2838, -38, -1686, 996, 863, -960, 883, 1180, -2767, -2688, 1264, 146, -2002, 1730, 2852, -2524, -2256, 2306, 1077, -1814, 976, 1748, -1569, -1103, 2059, -144, -1707, 1086, 1571, -1050, 738, 2278, -1481, -2687, 1203, 1297, -2107, 241, 1079, -2615, -2795, 2490, 2100, -1379, 370, 2233, -479, -552, 2302, 597, -2221, -405, 949, -704, -48, 438, -2483, -2889, 1946, 2253, -933, 36, 1615, -1412, -1984, 2383, 2922, -1264, -1396, 640, -108, -919, 1076, 753, -790, 679, 606]
1636F06j631Q70J550k768j007L697N76l634k57K984p99j229K093J425j965p95
1652b84R50j95J75K85j676r85J724M39k252M18K424j070j556K110K011k167j275
1669i24J483K67q16M65J50r67O8k50m83J246J309j250j608J185O81j550O02J497
1687A105m59k220K35J363M34m43J93J56k60O17J6P5j98r17j032R45J273q30j507
1706a454N24N14o87R14J454m21j042j31J319jo63k69k77K74j34l77j05R00n70
1725b32n20N78J492j197j183M94J348k71o67R9k07k97K52N91R29l84j104l25J399
1744G95J057j621q91Q23k06q95j9J063L7j415J00J158R37m49l97K49P26m22j044
1763d14P13P24r37j563Q40Q26p40l22O27R59o11o49L69R36m57m13k39N78p7l40
$$ y = [606, -1025, -155, 1395, -1373, -2380, 1317, 1893, -1741, -1998, 986, 187, -1042, 1051, 2476, 511, -284, 666, 471, 646, 931, -745, -1730, -6, 433, -1819, -1401, 1023, -47, -1603, 507, 2518, 351, -924, 559, 826, 10, 475, 625, -342, -274, -524, -1007, 239, 1548, 298, -1310, -125, 556, -994, -392, 1105, 646, -1574, -1339, 24, 458, 15, 208, 364, 104, 721, 737, 812, 614, -303, -1335, -390, 883, 53, -1454, -930, -416, -1103, -189, 1265, 844, -198, -329, 990, 989, 326, 57, -220, 54, -80, -457, -562, 338, -232, -752, -174, 1318, 121, -1062, -568, 780, 509, -158, -59, -266, -563, -311, 280, 1209, 825, -279, -604, 795, 1852, 231, -660, 163, -43, -938, -957, 106, 143, -1272, -1172, -14, 923, 474, 77, 326, 1052, 630, -414, 299, 1023, 86, -1477, -637, 189, -551, -873, -246, 713, 102, -547, -178, 758, 301, -112, -351, 227, 150, -190]
1783a90m34J378K32j416k6J057N07j009m89R09k04j082j93J286m32q04k37J221
1801G4M19l1l81M27M79n42l24J33J90l55p84M41L72o18m78M05O59n13k44M83R55
1822G67m39m37K92N67n72n23L63P67m99o13R8R66m70j90o8K78L40j330L7Q24j33
1843B5r87n6R54R35j029l57J395L0q36p5J047j70j037n80P31K19r50j20M50N50
1863A39m41k32K72J188j15j247Q26O48m57j281Q01M40m66r26L80P90l29l07L95
1882G8M19j19j013L02N23Kn05l27L22Q16n48n79J252N75r00m45J026L12j251n61
1902f21O83K96j045m9M72J44o96J58O95M58j85l36J09R30j47r31j2P62l52j159
1922h26O76M91k14j131P72Q31k28q91K25N69k48p29M31M85J71j009R9O18K42m01
$$ y = [-190, -624, 754, 986, -430, -456, 601, 1108, 99, -390, 519, 315, -767, -960, 326, -106, -910, -1147, 74, 493, 462, 81, 508, 987, 445, 121, 254, 444, 89, -695, -254, 118, -500, -978, -573, 86, -427, -671, -188, 767, 328, -109, 183, 750, 178, -345, 18, 785, 286, -327, -229, 737, 267, 77, 9, 287, 627, -703, -666, 158, 25, -962, -1018, -64, 871, -158, -515, 880, 910, 74, -1, 1046, 876, -161, -741, -10, 209, -741, -861, -411, 139, -302, -534, -262, 926, 811, -436, 390, 1038, 581, -700, 101, 541, 75, -851, -471, 319, -10, -317, 78, 497, 378, -635, -333, 190, 192, -313, -640, -318, 498, -50, -629, 623, 1198, 298, -147, 879, 1191, -60, -621, 62, 358, -687, -736, -264, -120, -816, -658, 37, 495, 310, -26, 83, 1013, 866, -65, -77, 685, 333, -826, -150, 341, 127, -1004, -232, 599, 371, -520, -295, 274, 26, -703, -272, 213, 384, -625, -526, 92, 334, -67]
1942f7m8R81L63p44o45N66P0q53o27O54L61l84n46N57J098p61n2Q27L69o98l39
1963H2L79j22m20l52M63J40k40p60K48Q67n1o62K9J183m81r07n4Q20j59o47O29
1984a5O80o68n04L56Q23R8l16l15m70L58l64l88O34M76r78o89J367M19j155K64
2004c87Q53L25o39M56N23q78o18J05K39M73l6j169n74J179K17m37Q47Q71j384
2023c4j178R66J026m79o78M87N7k63n04Q49j83L02j35k36M50M54j380r45J281
2042a43K90o17l46J056o20n55N77J366k63j38k6p06P36P7p26m59R34k63j147N25
2062d48J213j362p73Q70J415p61M8Q76j322o55J000N47Pk20j94j486K40K020j44
2081H71j006P79R3j951M61K083j055j950J173R65j090k22J649o60j158J409Q83
$$ y = [-67, -115, 866, 1229, 485, -160, 406, 476, -377, -1004, -350, 11, -373, -919, -362, 736, -25, -77, 750, 1119, 421, 82, 461, 339, -81, -433, 30, 170, -70, -830, -582, 285, 234, -428, -399, 784, 303, -604, -658, 162, 3, -644, -15, 665, -3, -507, -151, 672, 770, 454, 139, -331, 27, -337, -725, -91, 385, -593, -1282, 85, 504, -651, -387, 466, 791, 152, 608, 1131, 253, -365, -260, -21, 452, 416, -753, -1327, -148, 69, -368, 479, 1350, -34, -1212, -246, 780, 301, -377, 110, 167, -96, -600, 249, 66, 368, 233, -3, 447, 901, -479, -1424, -143, 147, -470, -816, 240, -380, -935, -358, 1008, 745, 607, 581, -125, 611, 688, -38, -497, 437, 174, -973, -448, 765, -597, -1370, -500, 915, 154, 202, 1078, -244, -899, 101, 648, 655, 435, 241, -1245, -1005, 1015, 871, -135, 644, 737, -1214, -753, 1330, 275, -1675, -502, 463, -627, -849, 800, 140, -1018, 391, 1274]
2098A274r20O82J01k046l41K333m76j447N13J256k355n16K948q7k206J081J865
2115A659j794m55J218n54q76J520M26j846L16R65j839L2K952k79k915O87K200
2132A417j757j089K595Q2k840K63K108n22m33R51q81m72J760M88k159K41J558
2149A310j857j791L200P74l040l09K241q52p03K087R22k430r5P64n48M57J522
2166A652r90k005J124J086j742L98K080j428j956J713J404j708l02J612j221q78
2182a161J456O10j538L04J021p22m53J736j14j995J119J035j981m22K182q46k015
2199a784J629J507k251o49K031K69j169J331J6j483J41J354q42o50J719j204j941
2216a976J305K001j823n93J931m35j968R52K258j452j312J211J03m37N00M15j163
$$ y = [1274, 354, 1036, 1137, -909, -1250, 1083, 607, -840, -327, 929, -1426, -1942, 1006, 919, -1287, -206, 1659, -135, -590, 628, 74, -802, 718, 1144, -702, -386, 579, -1260, -1228, 1724, 1445, -1470, -783, 1417, -340, -1429, 1166, 1248, -1592, -1329, 779, 257, -176, 775, -106, -578, 1182, 1670, -489, -248, 1310, -547, -2338, 862, 1636, -1404, -1713, 528, -324, -1027, 1060, 1982, -448, -543, 221, -327, 130, 1652, 662, -1343, -219, 867, -875, -477, 1603, 175, -1781, -68, 1336, -372, -674, 938, -283, -1161, 295, 905, -633, -329, 692, -30, -483, 1253, 1139, -856, 263, 1298, -683, -1105, 1077, 231, -1784, -155, 1352, -899, -1548, 483, 752, -417, 914, 930, -553, -412, 942, 100, -550, 1169, -35, -1976, -671, 1330, -493, -1086, 845, 410, -1558, -606, 1652, 200, -1112, 99, 202, -235, 265, 680, -483]
2233d83L76O11l70q10K086j66k569J15K075o70j495J205P23j577l91J558N12p02
2251B8K14J39n29P15K98j346K97R77r96r27J054J051j785l49J568L64j392J66
2269d53P85j1m79J96L8k50P10o57l74Q05Q1o85k89J199j00j047L93O78n03n28
2289d91K85J88l37Q6k14L66J41O5N3M24P7o92M8O82n3q73q7K99k05j51l5M41k46
2312b29m39O88M64M7k58m09M91K7m72j43N08K04r17k46J252P1m56p70N48N41r63
2333d61j93N78L33o15n92P22P18o10m66Q19Q34n73q05L95J025n39j121N1R58o60
2353b02n39j06R62Q3p25j12J023K28o92L0M98K41q56k14N10K14n05m07L06P17
2373D54p15l38N23M67k22o24K29K76k02o66M23O94o2o25K24N39O4j92j86L53J37
$$ y = [-483, -107, 504, 134, -676, 1410, 1244, -1325, -1210, 865, 195, -1300, -95, 628, -949, -1340, 218, 730, 28, 242, 381, -148, 567, 865, -481, -184, 793, -203, -1130, -76, 975, -810, -1159, 409, 773, -619, -453, 332, 321, -158, 38, 76, -174, 536, -121, -495, 310, 391, -294, -583, 616, 516, -531, -138, 540, 37, -491, -206, -18, -355, -269, -483, -117, 24, 89, 142, 566, 643, -49, -1, 681, 628, -245, -332, -33, -238, -389, -424, 17, -229, -668, 20, 484, 531, 273, -136, 355, 382, -90, -233, 275, 479, -438, -684, 568, 639, 183, -587, -39, 502, -461, -654, -76, 257, -358, -950, -228, 490, -120, -586, 233, 1067, 494, -311, 84, 1109, 570, -551, -500, 458, -202, -741, -847, 115, 198, -527, -639, 384, 612, -80, -50, 448, 689, -167, -381, 129, 343, -162, -569, -263, 454, -261, -599, -76, 391, 169, -455, -226, 50, -152, -818, -395, 299, 237, -388, -164, 375, 439, 247, 61, 414, 551]
2394E51p14j56J58M9l67j79L23L32k33j28P84j06o6m8L21j48j44k11J94j2m23
2415b23m1O5Q1J21k46K89j18r1J8L44j48m86NN12j9l13J20L20K69j83l63L80J77
2438D70k89l17J84O18r15m56K76P91l87r72P92J000o53n73M91P11n14l84rO82
2458E46m58m94J16M20L03r71j50O62N56r00l9Q52L86j065p92J201J51m38m70Q37
2478B53K54n23j77K02M24L96p37k91O79k6q37m98Q48J17r64N06P62l58n42N21
2498IN30n9o13M48J82q11N12k77m42M78J31n56j05J023n96p03Q01O87o69p4K56
2519A52M0o65N58O27n14o22L19jj97L59M23o30K04n6k94j73P53j24q51N38L82
2540B28o51j04J298k84j028K29J339k26m12o85K30l29L65L98m55J03r9o26j79
$$ y = [551, -163, -319, -161, -112, -479, -658, -335, -3, -236, -364, 420, 314, 248, 200, 521, 373, 229, 18, 212, 200, -223, -264, -199, -118, 3, -243, 46, -72, -163, -145, 199, 51, -435, -430, 82, 63, -250, -130, 190, 459, 276, -87, 293, 470, 181, -136, 48, 666, -249, -705, -429, 362, -25, -997, -205, 795, 142, -431, 60, 771, 257, -127, -136, 546, 88, -406, -290, 130, 433, -538, -688, -26, 530, -370, -409, 443, 829, -236, -1028, 173, 324, -114, -584, 253, 507, -16, -193, 9, 433, 829, 92, -199, 480, 454, -383, -881, -33, 84, -880, -374, 388, 30, -512, 9, 539, 480, -133, 315, 497, -314, 198, -79, -521, -43, 88, -468, -573, 450, -146, -849, -48, 639, -30, -104, 152, 192, -473, 85, 712, 198, -424, -105, -106, -303, 56, 479, -151, 53, -3, -297, -470, 283, 159, -692, -154, 228, -423, -527, 771, 487, -541, -312, 1027, 801, 389, -296, -66, -395, -30, 368, -87, 16, -83, -709, -888]
2559h88J651J5j509K07J186l93j317J284L21n63l92K11K27l6K20o01j48J178J49
2578H02j504O9J145p31o99R70P89j310m65J356j8o30J16L87j54K64m0m91J33L64
2598C53p04m70J187N84j688k56J140k17l46J192K00j368l74O34L82n9N26m80r90
2617g54M31P01p23M55M40m86j030R90R38j093m94P48l25n06Q56Q33j437k26Q75
2636A93l0q5P95q0j350L47L36l78j18J292j090j242R38R67n13o69J168K49j311
2655e81P75L72k01p17M62j79K98j82l76m34O43Q02o09m35R08n68q92N37J311p19
2675B15o31L5M40K9m3N2j8K3K39m34L46M85l93j321L39J139n12n36L64j60j81
2696e23J10Q95N30n81k14p55Q30M89p47j38K49j49l92n4J152p34m57p3P39Lo8
$$ y = [-888, 763, 778, -731, -524, 662, 269, -1048, 236, 557, -6, -398, -187, 40, 4, 224, -377, -525, 653, 802, -702, -633, 512, -219, -918, 52, 841, -469, -934, 422, 404, -226, -110, 277, 123, 387, 347, -144, -11, 353, -351, -821, 366, 950, -738, -994, 146, -71, -417, 775, 975, -393, -767, -133, 249, 190, 716, 236, -754, -323, 378, -345, 110, 550, 64, -966, 24, 962, -131, -625, 123, -202, -708, 148, 981, -456, -682, 193, 163, 78, 873, 793, -557, -210, 126, -252, -370, 922, -168, -1410, -472, 495, -18, -687, 481, 730, -581, 194, 566, 365, -352, 110, -69, 229, 47, -329, -763, -120, 682, 73, -362, 546, -22, -914, -377, 934, 215, -416, -381, 59, 88, 45, 97, 79, 102, 341, -93, 253, 738, 345, -976, -637, 502, -10, -546, -182, -342, -523, -413, 482, 1012, 431, 217, -538, 292, 781, 34, -104, 145, -4, -396, -450, 702, -32, -489, -562, 177, 180, 112]
2717A12J65k0n91K82J75l01K43K38o59L6Q11j55n12M34P3l69j55O76m11o91K76
2738c43M13q0m38L91o6j44M58J69k84L15l29k65M14M51m19j084O39N17m64m84
2758f33P98L89p87k24Q80N5o81M18l64K60O3j41j71J48L77o53k39R99J59j294
2778f41M46N33k93q18L78N47l71o46K13R40j97K61o04K84M40l97m19O34L37n31
2798I6o40M58L05n36j57J89N98o34P0J86L66M3n40M11k3K85n37k77M29J74m28
2819a62J44L63j41n14L8L62P0m96J17P8K70j87j38N5K14J10j85K42K13l34k65
2840a46K38K92n34l35M31r3j14J80j27r2J88J86J11l8j6j41L5jJ79n35L17K48
2862B33j36l76K81O06n44m87L84M17m47j94K29K9j81j98L20N5K88o10P1O54l8
$$ y = [112, 277, 257, -334, -52, 123, -178, 65, 303, -356, -320, 491, 336, -176, 258, 331, -38, -193, 483, 72, -619, -343, 70, -10, -448, -57, -123, -267, 191, 360, 76, 391, 62, -203, 211, 662, 243, -841, -202, 315, -149, -633, 165, 554, -233, -457, 423, 478, -203, 215, -149, 111, 174, 33, -138, 10, 387, -266, -505, 494, 653, -641, -195, 338, 45, -773, -395, 152, -219, -865, -652, 288, 91, 352, -252, 32, 472, 75, -344, 290, 627, 96, -544, -86, 219, -317, -474, -285, 313, -321, -251, -65, 301, 344, -196, 215, 192, 477, -60, -337, 92, 266, -162, -18, 345, 204, -310, -272, 90, 160, -336, -219, -141, 129, -58, -196, -141, 73, 183, -2, 240, 453, 119, -146, 92, 384, -150, -485, -54, -147, -261, -81, -208, -300, -112, 74, 185, 147, 131, -10, 25, 24, 203, -332, -15, 233, 97, -279, 2, 608, 64, -423, -39, 378, -69, -263, -34, -5, -186, -384, -64, -9, 279, -331, -260, 394, 356]
2883C56m33j42Q22L0p03j53L70pl33k02J11J52K8k97N91O0j88j06L2N25j60l78
2905b5J39J85j39n36K85j7r1n6lN96k35l12J73J58r4l76J67J49K18m89L48L72
2927D17J0n49K7M82o6k41k87K89j49n6j29m9j0L9q2J36M48L4l96J67N28l49j83
2950C1K29L28r17m2O41l03j05P9J51m33J89L99j90j64L64m36N14j71J36n73J36
2971a37L61k11j19K47M99o24o6K81L26j005L82J15l61oQK5L10L91m25n21N17P21
$$ y = [356, -77, -219, 603, 633, -70, -223, 147, 140, -193, -395, -284, -132, -104, -401, 190, 250, 62, -44, -12, 513, 353, -25, 114, 299, 160, -376, -91, -108, -199, -255, -258, 338, 103, -209, -36, 122, 28, -348, -181, -32, 186, -303, 45, 417, 427, -122, -95, 387, 321, 80, -207, 82, -67, -123, -252, -301, -311, -272, -354, -218, 230, 264, -132, 35, 563, 214, 31, 260, 588, -329, -371, 270, -33, -138, -59, 92, -341, -152, 247, 57, -107, 257, -179, 335, 164, 300, -273, -137, 224, 13, -106, 141, 640, 16, -50, 231, 557, -448, -66, 49, -312, -318, -310, -285, 25, 416, -9, -530, -13, 708]
$$ [...]
8191A13
##END NTUPLES=NMR FID
##END=
