##TITLE=1H_Ser Am-6-VH
 CDCl3
 8 sc, 
 18.11.2022
##JCAMPDX= 6.0         $$ Bruker NMR JCAMP-DX V2.0
##DATA TYPE= NMR FID
##DATA CLASS= NTUPLES
##ORIGIN= UXNMR, Bruker Analytische Messtechnik GmbH
##OWNER= root
$$ XWIN-NMR		Version 3.5
$$ Fri Nov 18 13:50:47 2022 Russian Standard Time (UT+4h)  she@DPX200
##.OBSERVE FREQUENCY= 200.1313499994
##.OBSERVE NUCLEUS= ^1H
##.DELAY= (6, 6)
##.ACQUISITION MODE= SIMULTANEOUS
##.ACQUISITION SCHEME= undefined
##.AVERAGES= 8
##.DIGITISER RES= 18
##SPECTROMETER/DATA SYSTEM= spect
##.PULSE SEQUENCE= zg30
##.SOLVENT NAME= CDCl3
##.SHIFT REFERENCE= (INTERNAL, CDCl3, 0, 15.7039)
##AUDIT TRAIL= $$ (NUMBER, WHEN, WHO, WHERE, WHAT)
$$ ##TITLE= Audit trail, XWIN-NMR		Version 3.5
$$ ##JCAMPDX= 5.01
$$ ##ORIGIN= Bruker BioSpin GmbH
$$ ##OWNER= she
$$ F:/spectra/data/she/nmr/H-F/1/audita.txt
$$ ##AUDIT TRAIL=  $$ (NUMBER, WHEN, WHO, WHERE, WHAT)
(   1,<2022-11-18 13:49:38.39 +0400>,<she>,<DPX200>,
      <created by zg, POWCHK disabled, PULCHK disabled
       configuration hash MD5:
       00 E9 B6 7A A2 85 ED C7 34 08 36 98 17 FE 4E 26
       data hash MD5: 16K
       CF A5 07 5A 14 3F 02 1F 1D 09 3E 53 B9 AA 8F 82>)
$$ ##END=
$$ 
$$ hash MD5
$$ B4 EA B6 2A 0E 73 8E ED EA F7 64 7A 6B 10 B3 87
##$RELAX= 
##$RELAX= 
##$RELAX= 
##$RELAX= 
##$RELAX= 
##$RELAX= 
$$ Bruker specific parameters
$$ --------------------------
##$DU= <F:/spectra>
##$EXPNO= 1
##$NAME= <H-F>
##$PROCNO= 1
##$TYPE= <nmr>
##$USER= <she>
##$AMP= (0..31)
100 100 100 100 100 100 100 100 100 100 100 100 100 100 100 100 100 100 
100 100 100 100 100 100 100 100 100 100 100 100 100 100 
##$AQSEQ= 0
##$AQ_mod= 1
##$AUNM= <au_zg>
##$AUTOPOS= <>
##$BF1= 200.13
##$BF2= 200.13
##$BF3= 200.13
##$BF4= 200.13
##$BF5= 200.13
##$BF6= 200.13
##$BF7= 200.13
##$BF8= 200.13
##$BYTORDA= 1
##$CFDGTYP= 0
##$CFRGTYP= 5
##$CHEMSTR= <none>
##$CNST= (0..31)
1 1 145 1 1 1 1 1 1 1 1 1 1 1 1 1 1 1 1 1 1 1 1 1 1 1 1 1 1 1 1 1 
##$CPDPRG= <>
##$CPDPRG1= <>
##$CPDPRG2= <>
##$CPDPRG3= <>
##$CPDPRG4= <mlev>
##$CPDPRG5= <mlev>
##$CPDPRG6= <mlev>
##$CPDPRG7= <mlev>
##$CPDPRG8= <mlev>
##$CPDPRGB= <>
##$CPDPRGT= <>
##$D= (0..31)
0 1.2 0 0 0 0 0 0 0 0.06 0 0.03 0 0 0 0 0.0002 0 0 0 0 0 0 0 0 0 0 0 0 
0 0 0 
##$DATE= 1668764977
##$DBL= (0..7)
120 120 120 120 120 120 120 120 
##$DBP= (0..7)
150 150 150 150 150 150 150 150 
##$DBP07= 0
##$DBPNAM0= <>
##$DBPNAM1= <>
##$DBPNAM2= <>
##$DBPNAM3= <>
##$DBPNAM4= <>
##$DBPNAM5= <>
##$DBPNAM6= <>
##$DBPNAM7= <>
##$DBPOAL= (0..7)
0.5 0.5 0.5 0.5 0.5 0.5 0.5 0.5 
##$DBPOFFS= (0..7)
0 0 0 0 0 0 0 0 
##$DE= 6
##$DECBNUC= <off>
##$DECIM= 32
##$DECNUC= <off>
##$DECSTAT= 4
##$DIGMOD= 1
##$DIGTYP= 9
##$DL= (0..7)
0 120 120 120 120 120 120 120 
##$DP= (0..7)
150 150 150 150 150 150 150 150 
##$DP07= 0
##$DPNAME0= <>
##$DPNAME1= <>
##$DPNAME2= <>
##$DPNAME3= <>
##$DPNAME4= <>
##$DPNAME5= <>
##$DPNAME6= <>
##$DPNAME7= <>
##$DPOAL= (0..7)
0.5 0.5 0.5 0.5 0.5 0.5 0.5 0.5 
##$DPOFFS= (0..7)
0 0 0 0 0 0 0 0 
##$DQDMODE= 0
##$DR= 18
##$DS= 0
##$DSLIST= <SSSSSSSSSSSSSSS>
$$ [...]
##$SUBNAM2= <"">
##$SUBNAM3= <"">
##$SUBNAM4= <"">
##$SUBNAM5= <"">
##$SUBNAM6= <"">
##$SUBNAM7= <"">
##$SUBNAM8= <"">
##$SUBNAM9= <"">
##$SW= 18.0517283424941
##$SWIBOX= (0..15)
0 0 2 0 0 0 0 0 0 0 0 0 0 0 0 0 
##$SW_h= 3612.71676300578
##$TD= 16384
##$TD0= 1
##$TE= 0
##$TE2= 300
##$TE3= 300
##$TEG= 300
##$TL= (0..7)
0 120 120 120 120 120 120 120 
##$TP= (0..7)
150 150 150 150 150 150 150 150 
##$TP07= 0
##$TPNAME0= <>
##$TPNAME1= <>
##$TPNAME2= <>
##$TPNAME3= <>
##$TPNAME4= <>
##$TPNAME5= <>
##$TPNAME6= <>
##$TPNAME7= <>
##$TPOAL= (0..7)
0.5 0.5 0.5 0.5 0.5 0.5 0.5 0.5 
##$TPOFFS= (0..7)
0 0 0 0 0 0 0 0 
##$TUNHIN= 0
##$TUNHOUT= 0
##$TUNXOUT= 0
##$USERA1= <user>
##$USERA2= <user>
##$USERA3= <user>
##$USERA4= <user>
##$USERA5= <user>
##$V9= 5
##$VALIST= <valist>
##$VCLIST= <CCCCCCCCCCCCCCC>
##$VD= 0
##$VDLIST= <DDDDDDDDDDDDDDD>
##$VPLIST= <PPPPPPPPPPPPPPP>
##$VTLIST= <TTTTTTTTTTTTTTT>
##$WBST= 1024
##$WBSW= 4
##$XGAIN= (0..3)
0 0 0 0 
##$XL= 0
##$YL= 0
##$YMAX_a= 116823
##$YMIN_a= -217585
##$ZGOPTNS= <>
##$ZL1= 120
##$ZL2= 120
##$ZL3= 120
##$ZL4= 120
##$ABSF1= 10
##$ABSF2= 0
##$ABSG= 5
##$ABSL= 3
##$ALPHA= 0
##$AQORDER= 0
##$ASSFAC= 0
##$ASSFACI= 0
##$ASSFACX= 0
##$ASSWID= 0
##$AUNMP= <proc_1d>
##$AZFE= 0.1
##$AZFW= 0.1
##$BCFW= 1
##$BC_mod= 2
##$BYTORDP= 1
##$COROFFS= 0
##$CY= 11.3945322036743
##$DATMOD= 1
##$DC= 2
##$DFILT= <>
##$DTYPP= 0
##$F1P= 2.36226072786647
##$F2P= -0.459571619588291
##$FCOR= 0.5
##$FTSIZE= 0
##$FT_mod= 4
##$GAMMA= 1
##$GB= 0.15
##$INTBC= 1
##$INTSCL= 1
##$ISEN= 128
##$LB= 0.24
##$LEV0= 0
##$LPBIN= 0
##$MAXI= 10000
##$MC2= 0
##$MEAN= 0
##$ME_mod= 0
##$MI= 1.114404
##$NCOEF= 0
##$NC_proc= 0
##$NLEV= 6
##$NOISF1= 3.799351
##$NOISF2= 2.8
##$NSP= 1
##$NTH_PI= 0
##$NZP= 0
##$OFFSET= 15.70392
##$PC= 1
##$PHC0= -18029.17
##$PHC1= 10.4007
##$PH_mod= 1
##$PKNL= yes
##$PPARMOD= 0
##$PSCAL= 0
##$PSIGN= 0
##$REVERSE= no
##$SF= 200.130013532006
##$SI= 16384
##$SIGF1= 3
##$SIGF2= 2
##$SINO= 400
##$SIOLD= 16384
##$SREGLST= <1H.CDCl3>
##$SSB= 0
##$STSI= 0
##$STSR= 0
##$SW_p= 3612.71676300578
##$SYMM= 0
##$S_DEV= 0
##$TDeff= 0
##$TDoff= 0
##$TI= <>
##$TILT= no
##$TM1= 0
##$TM2= 0
##$TOPLEV= 0
##$USERP1= <user>
##$USERP2= <user>
##$USERP3= <user>
##$USERP4= <user>
##$USERP5= <user>
##$WDW= 1
##$XDIM= 8192
##$YMAX_p= 0
##$YMIN_p= 0
$$ End of Bruker specific parameters
$$ ---------------------------------
##NTUPLES= NMR FID
##VAR_NAME=  TIME,          FID/REAL,        FID/IMAG
##SYMBOL=    X,             R,               I
##VAR_TYPE=  INDEPENDENT,   DEPENDENT,       DEPENDENT
##VAR_FORM=  AFFN,          ASDF,            ASDF
##VAR_DIM=   8192,          8192,            8192
##UNITS=     SECONDS,       ARBITRARY UNITS, ARBITRARY UNITS
##FACTOR=    0.0002768,     1,               1
##FIRST=     0,             0,               0
##LAST=      2.2672688,     0,               0
##MIN=       0,             -217585,         0
##MAX=       2.2672688,     116823,          0
$$ Real data points
##PAGE= N=1
##DATA TABLE= (X++(R..R)), XYDATA
$$ [...]
1794a20j40k72J84j70Q03J5j96j46j36k6M44K13j90l18j05kL66L54j43j23l76
1815h4K65k43J02L59m19l52j71O1R4M07O9m22j83J34K73J03l3k19k96K68k10R22
1837D25m5k07j95K1J70R7K04J26m90n61L93r1K68J88m09r5j83n1M60k47q1j85
1859d88QM2L01K17n3l87P4L12j96N89j50l31k05M94P8Q3N5k31k18J7J80p4K75
1882C92m32j91K9k5j10K93J3j88j14r4K03O6J08k13Q4m4J2M34K35k86N3m37J68
1905d4J93M84o9l40o9r1n2J96K68k79k60r7J05M6m6J44m76l73L27J55O82l31K7
1928A00m06J00K9P7K77J86j70l0k20L35J38O2m17q4k1K76K11j66k31k57j09J16
1950b04Q3J04P7k37m11J82L76J91k60J92m39J71M09J49q0k14J88k95k2N59l03
$$ y = [-120, -260, -532, -348, -518, 285, 300, 104, -42, -178, -204, 240, 453, 263, -55, -160, -162, 204, 558, 415, 292, -84, 181, -62, 40, 399, -20, -372, -543, -482, -388, 19, 88, -334, -517, -383, -110, -7, -40, -259, -555, -287, -497, 425, 380, 173, -22, -1, 169, 266, 470, 596, 106, -455, -62, -153, 115, 303, -106, -201, -384, -435, 25, -222, -303, -488, -480, -438, -137, 80, 27, -360, -286, 26, -170, 419, 269, -62, -267, 227, 305, 388, 443, 212, -6, 11, 191, 117, 392, -40, -231, -202, -227, -337, -44, -31, -219, -333, -427, -224, -158, -50, -263, -179, -223, -211, 223, 458, 172, 225, -212, -44, 149, 633, 564, 224, 155, 64, 12, 208, 476, 197, -63, -160, -55, -9, -55, 89, -387, -760, -433, -278, 404, 73, 100, -306, -206, -177, -100, 177, 363, 193, 163, -57, 278, 416, 478, 61, -23, -44, 232, 443, 277, 46, -211, -320, -204, -121, -17, 60, -177, -588, -406, -30, 161, -99, 93, -346, -175, 234, 383, 303, 89, 277, -18, -40, 519, 216]
1971B16N8l3m90K71L96k06l19p8K42n04N51J17j98l14K11l22J38L24r7k21p1M39
1993A10j71M4pJ56l3P1j24OK58L24m99j23K4Q4l7M03k46m31R0qj29L50M8p19K0
2018e39M86k48K04J09q6m93N23l5j45K31J01m9k92M23J36k8nJ51p55J35M64l53
2040f5M17Ql63l24J67K16n5M27n13m91J8P61k57j73M69o70j46O54M95m63l34K80
2062E8n61L69P06j43o57L52j17q2P66j46p72m8L90l44q1O05k82m20N04l70J25
2083a48J7M01o87J26M34q7k98L08K68m25l9L9m9J15P79n40j25J97k70Q4N38k15
2105D23q86L57P4J5Q8L62p41k55M41L6J64R8l11l84L52O41m32j85J60k38J3L76
2127A68l4l66L25L36n60J96L03n08L14L50m08o35O26r4l67N65K53j154N2O89j28
$$ y = [216, 274, 241, -249, 22, 418, 212, -107, -185, 57, -447, 104, 221, 23, -291, -80, -402, -264, 60, -37, -258, -329, 110, -61, -17, -24, 132, 99, 170, 46, 52, 310, 634, 135, 12, 36, 120, 83, 486, 240, -191, -101, -109, -238, 112, 160, -559, -539, -53, -301, -97, 12, -74, -567, -44, -79, -224, 7, 108, 59, -233, 190, 326, 298, 293, 444, -311, -176, 288, -65, 352, 360, -3, -327, -160, 56, 1, 428, -85, -576, -558, 203, -54, -227, 242, -428, -574, 80, 575, 112, -222, 58, -503, -134, 572, 429, -228, 124, 7, -75, 691, 545, -227, -275, 115, -229, -310, 295, 13, -407, 97, -273, -148, -131, 270, -417, -291, 143, 56, -242, 66, 334, -91, -130, -91, -140, -25, 754, 214, 89, 286, 16, 100, 638, 423, -463, -106, -32, -17, 71, 433, -308, -563, -122, -86, 78, 176, -135, -519, -167, 474, 42, -143, 17, -221, -208, 168, 134, -232, 93, 429, -131, 65, 368, -140, 174, 524, 116, -519, 107, 13, -354, 211, 464, -690, -638, 51, -77]
2148g7K32j97j30n97O68N90l56o9J12n06J25Q43j17q66L72J20l37L14L48n26j29
2169a83L4M07l32M35j36n83K52J83l11k6L31k92j58N80m13J45K51j56j02k55N75
2190B46k77J86L27l58m32K43n6K41K40k02j95l94M28j76o3M86l88k73M30L1k94
2211b50R4J00l37N6K65m1j18J95l2P2l1K50m69L32K40l37o9Q6J29l51L97m3l07
2234a69K8J74Pk49M11o63J06L33J56l29N1k0l80L44j55M16l33R1j05M8N56K03
2256E21l41j02k49o3M50K10j82L0m4k80m8K01L6j20j68J8J03o1Q7l05K78j82J46
2279f5j37K18j02L2o1J06N9r8J96K0j94L10k16p5J97K75n36o3L87m8pK02k32k70
2303a02J09P7k23J90j24j95R5J27J50K12n03J06L8l4J05m4J20K36j31k70J63N1
$$ y = [-77, 155, -42, -172, -769, -101, 489, 133, 64, 176, -330, -205, 638, 521, -345, 27, 147, -190, 124, 472, -54, -183, -149, 258, -74, 361, 225, -358, -106, 77, -234, -260, 71, -221, -379, 201, -212, -67, 184, 28, -74, -329, 246, -31, 155, 482, 124, -308, -65, -121, 120, 360, 158, -37, -431, -3, -179, -242, 244, -144, -417, 13, 44, -250, -156, -56, -393, -337, -72, -113, -231, -36, -68, 4, -27, 223, -246, 86, 326, -11, -80, 6, 135, -216, 181, 138, -169, -141, 33, 40, -209, 202, -461, -355, -22, 134, -195, -144, -164, -544, -200, -355, 61, -272, -181, -286, -238, 318, 521, 180, 78, -171, -234, 216, 426, 244, 274, 230, -50, -98, 103, 139, 19, -149, -131, -28, -89, -2, -307, -29, -211, -65, -202, 16, -86, -54, -115, -9, 50, -48, 148, 168, -26, 284, 68, -7, 190, 465, -71, -134, 253, 205, 198, 400, 168, -102, 7, 84, -139, 51, -73, -268, -173, -46, 104, 316, -187, -81, -43, -77, 28, -16, 104, 340, 209, -61, 102, 153]
2325A53K45k68j27K8rJ67L1l40K99k01J83m2pj06r2q1L1J76qL8r6j83q2K57r9
2350a33L67j18j02j8K5J09J17K29l30n3r5J84l9J15k11j25j82J95k9L51m40J24
2372e9l55K28K72k47J57j81J39j16K96j75J44J65l1m56N10n3j40J04M0m26K52
2393F8l1J44j15j43R6P1q7j24K51qk63q5j02L00j63K18l09J52J42k24K78r2L4
2416Hk37K36K10r4K9j42N7K6K1r3r6L91k10p5k73K38j08J42j97K10m26K82k12
2439c13K37P6p4n3O7k03K33J34m0j81K34j30J49j10J23p1k34J12R2k62J97m6j81
2462b44L04p4J25Po2l79J10p0K93O4l01PM27l43K2K65k94q8L27J38rJ63j46l10
2486f8j35L92kj16J52J5l51J29J52k70J96j69j50o5J88K9m5J60r6J08k55K39j57
$$ y = [153, 398, 130, 3, 31, 22, 189, 220, -120, 179, -22, 161, 119, 112, 6, -86, -167, -136, 40, 32, 70, -26, -209, -291, -34, -133, 234, 116, 14, -4, 21, 130, 247, 476, 146, 93, -2, 182, 143, 258, 47, -78, -260, -65, -94, 257, -183, -59, -414, -186, 86, -161, -4, -185, -46, -162, 134, -41, 103, 268, 237, -219, 291, 238, 98, 202, 242, -184, 68, 37, 181, 66, -77, 19, 90, 3, -121, 130, 122, -141, -226, -328, -28, -191, 27, -282, -130, 12, -212, 66, -26, 8, -229, 7, 217, 123, 152, 10, 67, 93, 114, 21, -75, 316, 106, 31, -242, -4, -112, 30, -167, 43, -383, -101, -313, -76, 0, -74, -127, -60, -263, -30, 104, 64, -117, 117, -13, 136, 26, 149, 78, -156, -44, 48, -214, -17, -63, -244, 60, -14, 111, 118, 56, -323, -213, -283, 10, 74, -227, -220, 207, -136, -114, 151, -143, -231, 96, 234, 225, 388, 242, -68, -203, 189, 187, 71, 223, 238, -113, 16, 168, -102, 94, -75, -225, -290, -102, -73, -118, 42, -54, 54, -201, 38, -119]
2509a19L36O8k57m1J45o8k19L13k89J89k62R1K42k96J91k61L14L5K27j23j73K9
2531G2k14N9J09Q1l4j6j92k29L0K06q8R8K07j89n0J96K69q7k42J44j48R3L06n13
2555a32L4J68%J58k36r2k07R9J94j25L05j8k52J33k8J1q6O6j77l03M67M4o5R9
2579E7l9M2j56M01k86k1J62j83J65R5l99K50j44L29m12k50K34J00j96n3M43m88
2601c49J45J55j18J11j22k36N5N04K0l54K14k15J57j5M04N3n56L35K1N3j03j98
2623c9nK46l9l47o3J74J34r1K02O2l26j37L22j61j01N1K9j74O83j07k26l93J13
2646a93J04J97L48k64l70L2K02JJ36k40r5J11L3J48j34l11Q7m02O94k8n6l3L91
2669C58n70K9L70p7l72M32j52j41R6P4QJ43j29L7O9O0j07l79O23k85l00J85L36
$$ y = [-119, 217, 285, 28, -13, 132, 64, -155, 158, -131, 58, -204, -113, 129, -167, 24, -237, 77, 112, 339, 216, 43, 72, -142, -83, 26, 107, 73, 57, -135, -364, -334, -128, -216, -118, 89, -100, -150, 46, 315, 228, -14, 130, -18, 75, 381, -132, -98, 70, 70, 228, -8, -100, -307, -208, -14, -139, 166, 148, -104, 29, 1, 12, -74, -8, -185, -488, -21, 23, -42, 57, 18, 60, -96, 305, 19, -2, 160, -23, 142, 237, -162, 88, -56, 273, -139, -389, -155, -55, -251, -304, 139, -349, -204, -49, -167, -56, -178, -414, -359, 145, 165, -189, 25, -190, -33, -48, 356, 409, -147, 188, 209, 262, 159, -39, -44, 202, 163, -184, -247, -73, 61, -30, 172, 234, -92, -229, 93, -68, -169, -118, -89, -263, 420, 313, 87, -306, -193, -89, 108, 456, 192, -178, -146, 56, 57, 193, -47, -142, -31, 2, 150, 16, -295, -208, -610, 84, 56, 0, -33, 358, -212, -183, 187, 110, -262, 170, 18, -123, -27, 47, 55, 198, 69, 106, 175, 235, 128, -251, 372, 87, -213, -28, 308]
2692C08k20j49p5k20j98O34j03K50k49k58P6K60J34k12N3k9r8J19K20r6j09m1
2714cq7j45L33J76k69j6J85k33k48M02K09m46o1K20j94J03K20j49k10L25k57K
2736a43N03j98k01o5O4Q2K56l49K33m47M17o0m5M2j35Q3k15K92L5l06K41r3k31
2759b40L14j83J15j56J47k52J65J08j9j23K72j19j64k4L88j28K20p6J1k49J87
2780A94k53l2J56Ok59K00J41l41K26J4k01n3N8o9M32k26j29r0J36J47k11j49L67
2803F4k15Q9k4J65j31L3L8l21M21n7R4l63K95r1J40j7l39J98j0k09K21j32J57
2826Fk4Rk10L5L31J5k62j28K79J33k45L5P9j68L56l22O4m7K98k53m7J0l5J74K4
2851A07K5k97m2J56j97J71k6j32L51k08K63l22L87M3k55l7O4k69L49J15j30L3
$$ y = [308, 88, -61, -136, -356, -554, 80, -23, 227, -22, -280, -204, 56, 190, -22, 31, 2, -96, 23, 243, 147, 38, -3, -90, -235, 98, 274, 5, -11, 174, -59, -307, 95, 304, -142, -203, 17, -177, -74, 146, -3, -213, 112, -145, -143, 360, 162, -39, -104, -40, 42, 298, -51, 182, -265, 152, 92, 47, 89, -46, 37, -178, 114, 149, -157, 84, -9, -240, 74, -109, 6, -150, -3, -255, -90, 18, -1, -124, 148, 29, -135, -159, 229, 101, 321, 245, 256, 7, 194, -59, -91, 65, 71, -188, 12, 153, -188, 38, 52, -149, -202, -144, -213, 219, -7, -136, -226, -90, 57, -154, -303, 64, -151, -62, -86, 79, -52, -19, 19, -302, 119, 62, 156, -207, 88, -3, 137, 120, -219, -21, -31, -240, -19, -151, 6, -18, -9, -219, -184, 147, 162, -100, -228, 51, 184, -61, -26, 53, -115, 241, -81, -17, -64, 234, -19, -66, -56, -91, 83, 107, 132, -165, -207, -51, -248, -77, -103, -235, 116, -92, 171, -151, 236, 279, 24, -13, 51, -218, 131, 246, 116, 149]
2873A49K3k13L14l20L14l98J77r0K71j58j79j66J61R1N2j81P3L8j50L08k92K25
2895D9k27K27M1m04L82j64K6K99j60k34K58k67J30K37P6j95j11J44k63J14P4J
2917C3J4Qk53K2J04j66K78l8K3K46l80J22j80K2J07J0M5J81j55J6Qk54K12O4j
2942H8O8j43J62mL7j63J01k59J88j18q6J90j33j85J08Q1n3O9K72j01n7O6j4N2
2966A66j23k11K37l86L18J36m19L01J33l1o2p9J0M28l48l12R5K16j54m7Kk26L17
2989c9J9l0Q3j68J97r1j28j1L70l34R1L1j01J47K7j39J03K03k40l24M29j17M0
3012A8r9k54K17j18L46k31N2m8J66k30K61l55rO42l49j17J55Q4n0j16N8l7L48
3035C34k00r5m7J96l88J07P0N6L4j02OM9j64P2j14J14K7nL3o3J62p5P2n9K07l49
$$ y = [149, 172, -41, 273, -47, 267, -131, 46, -44, 227, 69, -110, -276, -115, -24, 28, -153, -80, -42, -192, 116, -176, 49, -178, 49, 90, -314, 68, -96, -70, 229, 69, -165, 93, -174, -44, 193, 269, 74, -37, 107, -156, -42, 32, 33, 47, 55, -198, -176, -72, -238, 40, 2, 25, 271, -109, 13, -167, -145, -38, -28, 17, 198, 43, 59, 67, -187, 25, 89, 88, 156, 13, 175, 171, 208, 45, 146, -113, 75, -43, -129, 61, -72, -257, -149, -68, -121, -52, 220, 119, 62, 128, 114, 166, 43, -168, 69, -317, 1, 137, -282, 19, 152, 121, 59, -20, -10, 418, 70, -242, -147, 69, -85, -132, -130, -356, -39, -20, -50, 33, -135, 62, -29, -157, -168, 202, -132, -41, -10, -111, 36, 63, -76, 27, 230, -10, -334, 95, -22, 18, -81, -335, -118, -236, 110, -121, -69, -117, 49, -181, 80, -275, -284, 358, 9, -108, 47, 131, 81, -35, 23, -14, 334, 134, 39, -8, 188, -200, -93, -23, 33, 67, -35, -29, 20, -144, -72, -186, -72, -45, -50, -17, -80, 82, 7, 79, 20, 227, -122]
3061a22J78K46j86l3N2j48j54L46j37QK22M4l30K20J13l57j13J42k4J74j82p7
3083a18j13J68J68j30K30R0m11J05J48l9j52J93J9j49M7m4n8j2j85L53j85J87
3105A12r5l9Q7j3p0K38l17j47K23R2j25J52j5l18J67J46j06N6J86K23o43L83N1
3128B28l03n6K55k65P2J13j64J27j37L74n1m40J90J6Q7r0J3j67J32j78J04P8k4
3151h6kj5J59J05k62JJ54k23J48J57j58j3K20r6N1N3nm18J89n1r4J14J09l21K26
3176e8J0j13L5OK85j46k63R5J09mJ28l9j89L39l24J60P8q4K36k17R3j01K49m5
3200B40n9j90K74j59l06O0Q2R2j15J39m82L82L8j10k2qJ80J4j76K26J03j03k0
3223H0j48J76L5K20k46Nl09J53j48J56R4K2q7m2m8q6K22J5m34N12j61l5m4p2K92
$$ y = [-122, 56, 302, 116, 83, 135, -13, -167, 179, 42, 50, 272, 316, -14, 206, 319, -38, -151, -9, -33, 141, -41, -118, -231, -63, 105, -25, 205, 295, -116, -11, 137, 98, -54, 139, 158, 9, 56, 12, -46, -58, -243, 110, -75, 112, 17, -22, 65, 52, -18, 220, -97, -244, -21, 71, -54, 98, 83, -235, -68, 78, -28, 28, 214, 437, -206, 177, 228, -75, -131, 124, -141, -69, 44, -120, 7, -130, 244, 193, -247, -57, -41, 46, -44, -31, -198, -66, -244, -140, -62, -86, -88, -103, 56, 161, -101, -100, 54, -169, -21, 136, -22, -35, 185, 89, 140, 193, 188, -230, -41, -92, -186, -72, 37, -284, -58, -48, -161, -126, -120, 165, 19, -244, -149, -40, -44, 84, 45, -144, 195, -129, 31, 109, 25, 261, 44, 137, 36, 285, 240, 181, -9, 265, 106, -200, -140, -58, 34, -81, 58, -424, -42, -4, -114, -136, -144, 36, 50, -126, 100, 203, 100, 80, -68, 108, 143, 363, 117, 122, -187, -34, -182, -26, 68, 90, 3, -39, -87, -173, 49, 64, -370, 142, -19, -54, -98, -170, 122]
3248A22j68p4L12k72J24K02L9n6o2k68M84m04K4M3p3q1O5k28K83j5L0J32o7R0
3272A82k54m8J95Nk67R7j57J81J36j9j50O1J70j58JJ38J97m10J86N2j42k51N97
3295C42l16J2J94j60k10L46r8j26j40N4J14K6J17k67k3Q4L5K56k12r5k15P8J91
3318a3j06J84L2J74k79j41J56j01K38j78L99l44j20k4Q0k18J58J38l9J15j97O4
3340b2L4K19m42J66j74Q8L9or3L01k8k3k4k02m0K7K92Q1j04j77j42L98J58k69
3364E7k13K33J1Kk21R7Q6n6J56k63j70N12l01J2j35R2l4K0l6J61j40J45l5j06
3388a26J95o2j47J67K00k95K25k64K05K27m21J25k7o5J24k6l6j66K13j64Q9J11
3410H2O2m00J28J68k1l9O5j53J26j88J97k8K82k84j08lN9M4j4p5r4L77q2J53k48
$$ y = [122, -46, -120, 192, -80, 44, 246, 285, 229, 167, -101, 383, -21, 3, 46, -27, -108, -43, -271, 12, -3, 27, 159, 92, 182, -72, -120, 75, 80, -187, -90, -247, -66, 70, 51, -99, -38, 132, -26, -25, 113, 310, -100, 86, 138, -4, -255, 342, 26, 38, 232, 72, -138, 208, 110, -16, -156, -102, 12, 38, 155, -112, -135, -51, -16, 240, 28, -67, -282, -204, -13, -119, 65, 97, 271, -8, -149, 7, -94, 144, -34, 365, 21, -99, -123, -43, -261, -103, 35, -4, 111, -86, -22, 12, 231, -211, -45, -219, -131, -92, -98, -191, 110, 82, 59, 35, -167, -207, -180, 112, 193, 89, -88, -230, 168, 326, 57, -156, 77, 88, 90, -131, -34, 52, -4, 152, -111, -281, 231, -70, -58, -193, -101, -135, -115, -151, 10, -130, 15, -20, -126, 69, 7, -140, 27, 227, -68, 157, -107, 98, 325, -96, 29, 2, -63, 61, 35, -1, -167, 46, -118, -29, 82, 144, -256, -128, 40, 19, -20, 45, -108, 18, -170, 27, -1, 281, -3, -111, -114, -55, -11, -25, -100, -194, 183, 101, 254, 6]
3435FP8RJ8k15J02l27L70j08l9r6K75j92M2J93k15J40J72k64Q8p7k1K86mj31r
3460H1l0o4j9k16L37mj09L1k29K38p7r3L78l13q2K31J50R4l70j12K4K65r9j1K9
3485C0q6R0p2K9j21Q0J60%J0M0Lm46L02j84L52m81N21j6k01o4J13j88L73k67j17
3510a40J58k6L08j92m6OJ9k05k15J40Q5L79k41l4r2J68k22R4N7R6k71Q2P2N2k03
3535a71J57j58K33j62k1K04R9K2m32NJ16K83j55j01j38M02j68L23k35L1J17l11
3557f0R9Q9j29N4n3M6J86l56o1J87j69n8K44J66j45k95L89j11J84j87k54L86k54
3580a02J98p2J60j76j61K23j22J07j30k58M66l4J40l97K44j10n7J77q2l52M55
3601A17j66L3j67K26j13k25M00k07K36j04J1j39J89J67l45K45j88o5o1K93j92
$$ y = [6, 84, 93, 111, -104, -2, -329, 41, -67, -106, -202, 73, -119, -77, 116, -99, 41, 213, -51, 37, -40, -61, 225, 221, 90, 81, 51, -13, -32, -248, 89, 85, -24, 7, -222, 16, -61, -154, 224, -89, -171, 60, 210, 304, -66, -178, -154, 111, 12, 1, 30, -56, 34, -38, -9, -130, -50, 110, 110, 120, 160, 163, -283, 19, -165, 187, -294, 227, 211, 10, -54, 59, -129, 244, -23, -140, 18, -8, 300, 108, 62, 68, 87, -118, -333, -193, -108, 271, 30, -4, -96, 72, -150, -56, 1, 97, -174, -92, -20, 32, -171, -14, -172, 61, -101, -122, 82, 181, 203, -229, -224, -108, 175, 20, -81, -219, 183, 15, 338, 103, 134, 251, -60, 39, 128, -1, 53, 0, 46, 232, -124, -185, 2, -167, -225, 19, 185, 40, -255, 134, 23, 207, 20, -234, 152, -102, 96, 24, 184, 8, -153, 70, -52, 55, -75, -333, 133, 99, 239, -158, 86, -24, -81, 96, 14, -338, 117, -49, -16, -183, 43, -70, -295, 105, -102, 134, 30, 41, -98, 91, 258, -87, 158, -30, -95, -156, 137, -55]
3622e5m5P4j66K92O2j20j77J65p1k5r3j4j35L50o1n0o4J4M4q7M55k93J57k68K33
3647A22j06K8J10k12K15j03N4j36K92k45j85P2J06j45K85k94K4K87l78J88K4k95
3669b92L09n9L1J05k87Q0J57K4r4M0j82j35M33j20J3J10l32J23J32j1J0k37L66
3692A84k9j48N4J92k29J43n9j29j7m7j65O6J21K6k3J46j39R0j31k32L61J64k31
3715c2L7k41J13J92j45K07j72k11J28J90o6p6m7K18k1N7l28J05NL18k52L6O5j34
3739e4J78p3L4j00KK4P6k9Q8m9K8j10R6l12K39o1j60L26k40p9K15O4l32J30J64
3764F5j13o0P8K58l00O6J05j84n2jj27Q5L93p2k89N0LJ07M3k02J49o3j08K56r0
3789cJ86K4p1j69J50j02p8J93k81L33l09J76j04k39J34J71J99j85j09l6R2J04
$$ y = [-55, -100, -26, -192, 100, 162, 42, -135, 30, -41, -66, -159, -173, -308, 42, -19, -69, -133, -119, -75, -162, 293, 0, 157, -111, 122, 16, 44, 154, -58, 157, 54, 108, -28, 264, 19, -166, -94, 12, -133, 152, -142, -118, 169, -209, -21, 3, -292, 17, -42, -11, 94, -193, -113, 44, 68, -26, 14, -168, -303, 130, 10, 23, 133, -199, -76, 56, 45, 55, -182, 184, 155, 7, 61, 253, 24, 167, 108, -21, -38, -85, -250, -184, -63, -37, -60, 86, -53, 37, -94, -326, 35, 199, -32, 5, -236, -123, 69, -76, 131, -41, -252, -124, 66, 0, -76, -123, 95, 74, 131, -197, -92, -87, 231, -21, 15, 80, -54, 124, 51, 85, -15, -13, 11, 87, 58, 146, 97, 125, 15, 111, -201, 38, -23, -183, 143, -97, -176, 39, 103, -229, -99, 65, -48, -108, -30, 228, -72, -6, 99, -85, -137, -138, -265, -180, 213, 141, -148, -98, -95, 12, 55, -147, 2, -61, -169, 87, -3, 183, 207, 136, -33, 117, 15, -63, 130, -151, 182, -127, 49, -55, -294, -160, 11, 210, 25, -84, -120, -28, 76]
3811G6k29J09J49m8p8j14n3L53j21m6K4n9k9l8J44j05J70k19m0P0J78R7l84J33
3835f0K04k1j41n3J11j17j49J69J74k17J23L6P8p8K7k83K83j76O8p7L09k68N7
3858aj30j46J39J39J9Qm1j02k3J48k2m02O31J22m12k1J93r0o5K60k31J43J83m51
3882a52J01J08j30J45l9P8k93J87j7j11l7N0K04k8r6pR7k07K19j68O5pN1J5q2
3907e4K46j18j65J44k01L09l28P0j27J89P1j36P6J2n9K61m0k17L1K3J2l1J08j90
3931a14P9P1k7K2l3K4l9J20j53R3Q5k19J17L10j83j97R0L2k60J18P5j97M85m4
3955B55k55J23j66J50L7l12R6J47j33j0J35k7K9oJj60J00K18l73L3J22L26m18
3978h8j32L11j93J80j23M5j15K4j59K74J00j11k65J92k02M21m45J13J26k82K00
$$ y = [76, -153, -44, 105, 57, -21, -135, -188, 165, 44, -2, 22, -37, -66, -104, 40, -65, 105, -114, -154, -84, 94, 191, -193, -60, 144, 123, -18, -71, 40, -77, -226, -57, 117, -100, 23, 59, 137, 59, 86, -197, 86, -90, -22, -99, 210, -58, -1, -131, -277, -138, 1, 20, 28, -13, -115, -138, 10, -12, -414, 217, 339, -73, -94, 99, 9, -56, 204, -27, 116, 299, -152, -51, 57, -73, 72, 33, 111, -182, 5, -12, -123, -160, -110, 94, 66, -30, -37, 60, -147, 72, -96, -31, -38, 13, 28, -54, 192, 74, -91, 53, -148, 161, -167, -97, -224, -35, 36, -100, -24, -12, -71, 190, 150, -67, -36, -13, -1, -32, 76, -114, -35, 36, 9, 31, -2, 22, -17, 103, -50, 43, 128, -91, 26, 336, 153, -44, 46, 78, -182, -64, 11, -186, 299, 255, 0, 123, -43, 107, 144, -168, -72, 75, -58, -68, 67, 40, 69, 63, 64, -96, 4, 222, -151, -118, 4, 330, -88, -220, 91, -102, 78, -45, 0, -115, -91, -250, 24, 124, 13, -252, -60, -262, 159, -286, -173, -47, -329, -129]
3999a29J95J29l49j13K73L17n63J55j1R5O7J42j26Pr5l1K92k51N4L1j01r8m3J07
4023d6j23JNM15n06K49o9J43r9L03J8l75K27j07j39P0K02r8P8J11l56N2o3J72
4047F5k07J14J55k61K08j67mK08q5q3J45j79O3Q4j30J20n6k69M27k46J46J89j27
4070A10q5J03N2j95P3Rj24K0O0R3j95J79j52r5J23J25K1j11Rn9j27P4R6J08k11
4095i9j07L62j32J1J71k10R3j98J97k39L87p6Nl40M27k02m1j3l09M19j27k5J2
4118c4k15Q9N8qK11J19K9k36j23m2K88j61Q0j2M9j72J52q5k08L63j38K85k32M5
4142A02r1K5M3j10j56K58J1k61J41Q3K16k97K05P2k58J07N0j10J65j77L7k00J22
4165b3K6K42J11j73j20K04k01M3J35l81L2K61j21l49K74jM9Q0k8q7J22j83J82
$$ y = [-129, 66, 195, -154, -267, 6, 323, -240, -85, -96, -1, 66, 208, 82, 89, -6, -37, 255, 4, 58, 89, -12, -110, -153, -46, -169, -168, -163, 252, -254, -5, -74, 69, -30, 273, 291, -84, 143, 36, -103, -33, 169, 71, 149, 260, -96, -44, -107, 65, -142, -28, 127, -134, 74, -93, -97, 111, 26, -57, 88, -91, -28, 56, -74, 46, -10, -279, 148, -98, 48, 237, 110, 25, 128, 180, -15, 58, 67, -57, -37, 23, 116, -79, 100, -52, -147, -24, 101, 122, 11, 20, -39, -166, -92, 4, 112, -99, -206, 156, 24, 35, 206, -4, 89, -109, 88, -151, 236, 160, 165, -175, 252, 50, 9, -4, -313, 106, -21, -46, -34, -249, -160, -102, -110, 101, 220, 249, 13, -110, -152, 136, -25, 55, 43, 92, -80, 72, -13, -221, 142, 4, 289, 57, 102, 11, 36, 79, -31, -187, 71, 82, -179, -38, 45, 261, -36, 169, 241, -17, 90, 140, 30, 195, 18, 55, -145, -23, 3, 245, 356, 183, 63, 267, 66, 109, 244, -137, -105, 156, 35, -314, -40, -41, 8, 88, 60, -27, 95, -88, 94]
4188I4Q2m11J33J69L2l86L85k19J01M5j1p3jJ8J49l5j91M41m96K33k72K78q2q7
4212a04J4J22O9k14L47j99r3m1j45Q6J19P5j06Q1J02l24K78J33j23M5k8Q1J43
4235C18k09j52K55r4k66K9rp6O7J03q4J65o4R9k05L13l45J05q6J5K7M4n8pJ22
4260Gk59r6N90j00j36L0j94K03q1j21M26l07p7K46JP3m56J10J07J4J20j33k02
4283b35j7M32q2m95M71K78q3n6k30k43M11r1k12K87j2mQk49J21O2j38J75k03J85
4307H0N2J59l07Q0k30J28mL3j35K34k60J42J80j72O7L5q2N3p1j43L80j90p5J25
4331G9J35k4k54Q8R1m0j62R3j63N5k12M81m01L00k16Q1K6j31J65MJ92k93J30J68
4355A92j35l37m6L56Ok99M01R6k20M5l11K43m2J08J42m68L76l3m2o5j21J49kO
$$ y = [94, 176, -235, -102, 67, 99, -287, 98, -121, -20, 25, 14, -59, -60, -42, 107, 72, -119, 322, -174, 59, -213, 65, -17, -104, -90, 32, 101, -113, 234, 35, -58, -99, -244, -158, -39, 36, -70, 11, 113, -211, 67, 200, 77, 122, 94, 175, 318, 109, -43, 212, 118, -148, -119, -128, -204, -137, -34, -118, 47, -17, 82, -123, 190, -155, -50, -136, -121, -94, -50, -108, -115, 7, -252, -348, 242, 142, 6, 36, -158, 45, -36, -157, 269, -38, -115, 131, 132, 205, -251, -141, -34, -20, 100, -33, -235, -252, 180, 98, -397, 74, 352, 269, 213, -17, -260, 151, 60, -152, 135, 123, 119, 127, -122, -1, 61, -77, 98, -105, 80, 132, 291, -16, 64, -166, -38, -42, -9, -144, 90, -170, -28, 152, -20, 47, 82, 0, 53, -18, -161, 219, 29, -46, 79, 214, 190, -64, 24, 115, 75, -87, 6, -157, -102, -314, 167, -234, 66, -150, -69, -43, -174, -9, -5, 187, -106, 24, 192, 57, -280, -326, 30, 36, -263, 138, 234, 14, 59, -252, -9, -51, 57, 199, -269, 107, 74, 32, -33, -154, -5, -7, -1]
4379aM8j45k01J65O3M7J1k50J60M22l43m3Q6P6R5R5k98J8P2J08Qk33J57Nj63K96
4405B55m92J84L92m60M4J26k87J04K92%l5J54l90J41k37N47j36k85R5K02l15K37
4427A36M4lj61o4pn1J28R0m01K95j26JK9L0J25r4J77k12O9o0K6K6j42J22J64k65
4453a24PM5J36n8P5R6m41L43j49K05q4j48K56l85K26j97J59OKM1J17j61j56K95
4477A06k03n1K18k6n9j49J84J6J15k44j5J88j68Q0O0P0j88N1j5k8L7J0k4j7J61
4502A09j32O3K40l28N3j51N1M0k11K71J33l7p5j09mK42l34J8O0L05j46j22J65
4525A01lJ15l60J53r9j79M24n30M53O2l97K19j07O0l6J60K7j61L4r3K17j96N1
4548h5r6rK07k14K57j2j63J18p7N3J6j75J52N2J88l94J69j01J24j31m8M48m65
$$ y = [-1, 47, -98, -299, -134, -71, -24, -13, -263, -103, 319, -24, -67, 19, 95, 190, 285, -13, 5, 77, 185, 193, -40, 117, 122, -41, 255, -237, -53, 339, -121, -77, 49, -238, -134, 158, 158, 123, 277, -113, 28, -209, 338, 202, -83, 12, 214, -101, 136, 180, 177, 16, -48, -55, -106, 22, 112, -289, 6, -120, -119, -90, -60, 65, -29, 148, -64, 5, -55, -29, -3, -145, -23, 141, -124, -117, -72, 64, 6, 81, 177, -264, 79, -70, 135, 51, -97, 159, -226, 0, -197, -38, -32, -30, 11, 128, -33, -189, 106, -97, -148, 70, 44, -15, -164, 20, 36, 151, -93, -108, 80, -88, -8, 52, 122, -66, -15, -30, -58, -21, -11, -35, -52, 109, -23, 40, 280, -48, 5, -146, -95, -55, -266, 5, 138, 101, 26, -83, -87, 155, -179, -161, -101, 204, 58, -64, 101, 98, 213, -147, 6, -93, -272, 152, -378, 75, 137, -260, -41, -148, -88, -124, 36, 63, -98, -64, -157, 60, -136, -85, -181, -190, 17, -197, 60, 48, -115, 3, -74, -21, -5, -180, -28, 24, 212, -182, -13, -114, 10, -121, -169, 279, -186]
4571a86K19j25J3J64K28k50j58J10Mk44R8J52j36K7O0J09l1q3J2K0j19Q2P2j2
4595B6O2j22q3K92N9j83l65L93Kl9j75m7P6N3o3J3J21J77o9P5j03k55J79M8J6
4620H8k22L18K1j37j8j31p7J52k52L01j17l14L28Q4j81M32m86J16nO6J19J29l21
4643a07%P8P5N7l66L68o6J35Pk94PJ58l04J36J15L8J36k03k7J22k18L94p1k53
4667h3L3k16M7Q9j79L24J5n5j7J15k58R0J80l12J96J03K61l80J18J08K18m92j41
4690b36K41J15o2l48M02P2k92J02o9J48j2j17QO7k1n8r0J83Q5P5l95L76m0j43
4714iK42j68L8k32K31J39J10k06l43L49j7j86J1K37Nk94j61K00K27j62J85l70
4736a74K09Q1l7j34M2j21N3j31L07p5K39j24J61m29L18k66P8m4J10k4q2n5L45
$$ y = [-186, 33, -92, -79, 85, 313, 63, -95, 15, 19, -225, -127, 25, -111, -84, -24, 85, 54, -29, -17, 3, -116, -34, 38, 26, 88, -34, -117, 175, 234, 51, -314, 79, 81, 42, -133, -180, -104, -51, -114, -101, 20, 197, 128, 203, 100, -155, 24, 72, 88, -134, 184, 205, 68, 50, -81, -158, -6, -258, 43, -74, -388, -60, 24, -157, 275, -211, -95, -100, -34, 85, 214, -107, -107, -29, 46, 103, -263, 105, 39, 174, 181, -113, -106, 52, -252, -116, -1, 37, 173, -30, -57, 65, -153, 241, 170, -83, -50, -266, -219, -130, -309, 15, 30, -25, -42, 73, -185, -95, 85, -227, -31, 72, 333, -47, 71, 179, 397, -95, -236, 5, 120, 58, -290, 112, 184, -108, -6, -75, 73, 61, -56, -48, 19, -2, -60, -150, 33, 118, 193, -202, 174, 134, -9, 233, 65, 103, -129, 102, 241, 351, 145, -198, 151, 134, -52, -41, 196, 201, -93, -254, -54, 173, 11, 196, -174, 35, 116, 79, -55, -13, -134, -81, -212, 95, 20, 259, 135, 296, -133, 185, -81, -3, -47, 63, 39, -43, -98, 247]
4759B47O6k64j07j93L10j88j67L92l5M9k17K91l29M9K70j26p1mK20k42K58K8j04
4782A33N3j41mq9M5J41k39J00P8k06K97j21KJ6j54KK34j75k2M1j8J26j19J80k16
4807e6m0j27K01J66k10J44j80K51Jj43K2m7J07k87K71k07K29j94K34J34j63k31
4829a25L48n39J66O4Q8k25L38j38R3J1J12Ok01J8J44j14K7k77J04J40j63j19L11
4852F9m01K70R7K8j61r9Q5N8K96l64K80j87L8L6K43J18m20K33k57j09K31l2r0
4875c8K69j05k17j27J82J22k13J50Ln5O2O7j74L8o6rO4J25p9L2o4K30m85M28J21
4900B61m4k12L8j24J22L4l09K16J75M4k20N4j2k15L81j49j8j06J36j37j5jqK00
4924I1j22J94j41J10k00J78K2j57M5j04K57l2m32J00J38k01L06M1M4K2k92J66
$$ y = [247, 313, 49, -58, -251, 59, -129, -296, 96, 61, 110, -107, 184, -145, -96, 174, 48, -23, -27, 193, -49, 209, 237, 133, 186, 45, 41, -48, -3, 138, -101, -1, 77, -129, 168, 47, 49, 65, -89, -87, 147, -28, -50, -9, -27, 99, -20, 160, -56, -96, -223, -22, 144, -66, 78, -102, 149, 150, 7, 29, -18, 89, -198, 73, -134, 95, -99, 135, 269, 106, -125, 223, -316, -150, -86, 2, -223, 115, -23, 70, 81, 193, 199, -2, 16, 160, 46, 73, -204, -100, 40, -123, -242, 69, -332, -62, 35, 63, -98, -197, -112, -54, 242, -122, 158, -29, 9, 45, 288, 406, -14, 219, -38, -147, 84, 52, -38, 231, 126, -91, -218, -36, 86, -127, 23, 26, -29, 33, 100, -74, -36, -102, -111, -47, 78, -1, 31, -33, 197, -288, 140, 261, 217, 5, 43, -81, 41, 75, -234, -18, 157, 201, -19, 35, 23, -192, 189, 40, 22, -84, 52, -85, -100, -101, -109, 91, -31, 163, 22, 132, -68, 110, 132, -25, 20, -84, 173, 141, -291, -191, -53, -254, 52, 93, 137, 159, -133, 33]
4946C3k00J65R9J03j09k18K33k0j08J47jj33NL7M6k38K73k27M5K77k60K19j77
4969iJ58k55r0K60j78L30k53j34k4K01J08o3j42J22L4J05j89K2m6M6j44j9K04
4992D4q6J38N6r9M0j65J9j96K75j1r4J69p4P5J44j20j03k02L58J8j61p8J42l9
5016E0q1N3j31N8o2P0p1J23J80j00m45K50R0L7j7j54J2q8K45Kq9J58j3R9p5k59
5042a58J90q0k8N9K24k47O9p3j20ql7K77Rj75mM6pJ8j46l6K65l10K39j5K1nk63
5069b95L21j77J02j43O6K62j82J31p6K81l69R3j7K91l88O9mJ20l9j75J44l1K0
5092Dm2K62m13Q7J16n2n8L52l20J59K3k6O1j85O3m5K99m27J22j43K39j38N0R5
5116H3j82m7R8q8J06l50J93J14M5L74m52o1J08J90Rj15K26l27K27j12r7J31Pr9
$$ y = [33, -167, -2, 97, 200, 91, -127, 106, 86, -22, 125, 124, -9, -4, 33, 79, -159, 114, -113, -68, 209, -51, 168, -9, 149, -106, -196, 64, -114, 216, -37, -171, -195, 6, 114, 51, -91, 31, 65, 170, -19, 3, -43, 3, -141, -160, 44, -42, 96, 152, 53, 93, -72, -53, -249, 26, 15, -79, 90, 16, 91, 235, 115, 12, -190, 168, 186, 25, -53, 89, 50, -31, 22, -109, -51, -113, -43, -114, 9, 189, 89, -356, -106, -16, 21, 4, -150, -138, -226, 19, 21, -68, 90, 77, 176, 101, -158, 32, -48, -76, -17, 207, -40, 29, -44, -164, -172, -209, 68, 77, -98, -102, -56, -63, -45, -191, -227, 38, -272, -33, -48, -27, -32, -295, 26, -151, -49, -192, -126, 136, -46, 85, 9, 290, -79, 14, -3, 288, -100, -31, -35, 85, 46, -129, 15, -16, 4, -38, 224, -189, -102, 14, -38, -96, 256, -64, 95, 118, 92, 153, -32, 31, -14, 285, -142, -20, -163, 76, -62, -12, 83, -99, -146, -48, -136, -30, -380, -187, -73, -28, 346, -106, -167, -59, 131, 140, 25, 251, -76, 151, 39, -58, 73, 80, -19]
5140a9N4K28j93K0l54K18J29j99J34p4j34k1K52N8lk64J92j41O8M2j59N1%J84
5164F9p2J86k13K7j02Q1K9L6o8l4q8J96r8Q4j77j46L53Q7j11q8J6o0J20J64j57
5189C4P5j37Ok53L89M9k29n6N4J80j71L19j80k30o1J95O7J13m45M92n9j82j24
5212a54J07M9J17qk1l27K00R7j41K29p6k45L48j98R6q8j19K89j24J97j77j28L
5235g4J07Q1j25n9K01j24M4N0J35l56K56k76J93j53J01o9J32p7j15M3j49N27j32
5258A61m28M57r3k50K00j88q8K63lJ39J2k0K9M2k98Q7O3k2J81j70M9l00o8L19
5282G4J32j61rp5j12J02NL23o13M44m4qN4k92J93J50j50J9j56PL42k02Ok9J53
5307A53j86J34J38k75K33k62O8n1m9K3M5m6Q8j56J01J00Mk60J72k7L23l97K27
$$ y = [-19, 35, 263, 70, 90, -264, -46, 83, -116, 18, -56, -190, -211, 41, 99, 96, -168, 24, -117, -49, -7, -166, -115, -115, 69, -3, 183, -30, -3, -105, -24, 5, 41, -27, -61, -149, 47, -51, 33, -144, -290, 63, 150, 39, -49, -33, -93, 27, 191, 34, 109, -28, -22, -275, 114, 163, -66, -122, -68, 112, -59, 260, 80, -150, -211, -16, 51, 164, -281, 211, 152, -30, -154, -47, 2, 119, 111, 90, -237, -37, 60, -81, 148, 72, -173, 175, -23, 73, -15, -134, 155, 31, 228, 51, -77, -74, 33, 114, -11, -70, 131, 7, 51, 101, 236, -120, 136, -140, 53, -100, 1, -68, 64, -13, -128, -85, -234, 293, 161, -267, 190, 97, -153, 47, -141, -229, 34, 31, 170, 182, 162, 191, 233, -65, 22, 85, 63, 244, 74, 123, -177, -245, 74, 206, 45, 36, -39, -151, -49, -44, 279, -334, 110, 66, 58, 112, -180, 13, 163, 13, 32, -124, -117, 225, 23, 29, 0, 153, -33, 101, 239, -36, 197, -65, 3, -48, -97, -74, -29, -75, 13, -143, -42, 58, 62, -198, -26, -53, 270, -127, 100]
5330A00j03J51j49K2O2j89P3J86P8k74J9K4J66o5r6L1j42K65j21j7r5L91m98J69
5354a2J0Nq2L6j66KL79k34Qk0LJ66j12J30k30J65j49Q0j2K8Q5J40k25j72O8l9
5380a48K7j22L2J00Q9o8n8K91k99K12j47J66j44mL80j72l20L22j99J84O3k04j09
5403a28K3J08o1O2P7R9J28r5m52K64Q7j32O3j38L0J00N0m26M35j62R6N3k36j73
5427c28L33J04j76o2J38j01J3o7J70kJ23p1l7J16j83J87p44N24P4p1K23k36K05
5450A32j10j34N0J59j38J52N3j42l96L07M2k11J76J74l44P5L23k15j33O4l4J94
5472D4j98K86k5r5r0J67p1J13J36m11L17l80J00J48N9j20r2N1J83j46J91n9m2
5495F6j48J92k2k01J20Mk6M5l10M73j13M9r6j24j41K50q9j4P5j96Q3Q3O6r0lK3
$$ y = [100, -3, 148, -1, 21, 83, -106, -33, 153, 231, -43, -24, 0, 166, 101, 5, 36, -106, 159, 38, 21, -74, 317, -181, -12, -2, 3, -79, -43, -209, -207, 172, -62, -54, -74, -71, 95, -17, 113, -117, 48, -101, -21, -33, -5, 80, 220, -5, -177, -109, -148, -121, -243, -211, -111, -22, -90, -148, 143, -156, 56, -91, 75, -69, -73, 307, 135, -185, 137, -62, 122, 185, -19, -128, -105, 3, -58, 4, 81, 180, 308, 213, -239, 25, 112, -20, 43, -95, -65, 35, 85, -341, 94, -68, 28, 81, -155, -328, 5, 109, -67, -129, 9, -92, -79, -146, 24, 22, 145, 74, 37, 153, -30, 157, -587, -63, 11, -60, 163, -73, 132, 22, -112, -62, 97, -41, 111, 164, 22, -374, -67, -25, -236, -60, 114, -230, -155, 168, -47, -180, -116, -150, 44, -154, 132, 107, 12, -78, 89, 18, 131, 267, -144, 173, -207, -107, 41, 100, -20, -112, -61, 122, -24, 167, 108, 66, -82, 110, 88, -113, 7, 11, -15, 30, -280, 193, 80, 129, 33, -91, -232, 18, -71, -85, -10, -206, -123, -40, 26, -64, -67, -44]
5521d4O2m3J56j57J92m26L13n8L2K47l84O3K0J60j80R1J41j96Q0l17Q5L12j51
5544bK9K3j67K21J8k0k51L66k89K32k9n2l9k7J73q9J36k92Q6n7J4J9k71K09j23
5569a82K02p4P9O6J4k28J56k06K01o1N0Q6k12Q7l8j09R5K63k09M2L5k32m0M72
5593B57j0o18M92k01K92k16j7J30j77j45L40m5j56K02o2J73j51k17m7O4j08M54
5615B34k22M4n8J46k43K22j34NJ16L3j40O8o8l65P1L05j19J2K23n72M13J78j90
5638d1j8m8K48k70N7M9K05k20j74J11L20p4j10q8J31r8p1n3J00j3k6J95m3M7j91
5663g5J99m6k20K17l8k9O2J11l56J57J05j01j25K72j37J11j06k2j75L1J17j94
5685b42L46j37kJ24j04qK51l39O5L76m97M8J46j0m3j0K12l32K51N0k43J98k59
$$ y = [-44, 18, -25, 131, -26, 166, -260, 53, -5, 27, 274, -110, -47, -27, 133, -47, 44, 185, -11, 69, -248, -163, 149, -2, 27, 50, -117, 104, 122, 102, -149, 217, -72, 160, 131, 79, 40, 13, 186, 97, 233, -59, 27, -30, -16, 3, -268, -59, -182, 20, -54, 25, 91, 105, -123, 33, -173, 28, -33, 17, 103, -109, -22, -60, -169, -74, 189, -20, 22, 57, -175, -215, 257, 247, -371, 121, -80, 212, -4, -21, 109, -68, -213, 127, 82, -74, 128, 66, 239, 88, -129, -176, -112, -220, 234, 12, 56, -2, 144, -99, 123, -11, -6, 110, 143, 3, 71, 3, -362, -291, 14, -105, -93, 130, -442, -29, 149, -41, -59, -107, 141, -129, -72, -23, 182, -38, -212, -101, 219, 145, 35, -53, 78, -20, -91, -144, -44, -57, -83, 112, 69, 116, -75, 124, 78, -142, 75, 37, 8, 70, 181, -175, -18, 87, -14, -139, 133, -4, 107, 1, -21, -196, -165, -48, -242, 104, -33, -35, 89, -15, -23, 228, -111, -46, 330, -167, -119, 27, 17, -26, -36, 176, -156, 95, 145, -98, 100, -159]
5708a59J96k2j29k2O7p4K43k9j44J21m16N12qPl9O5j10j79K00j02Q6P8Pl37J64
5733b4K21j13j87Q0R2l8J35j04r2j39Q2L03j70k24J36j33J94r0K39Mj04k65rk9
5757b35K35K49k87J47Plj68j32O8L54k57K01j36j54J54n6q2j5n6K38p9J94n8k06
5781g7j6l2MN33l39q2J07j00j39K69l03J43J08j58Qn4K91q3j34K65j29k47K83
5804A18%j5q9L2P1j83j03J81L0N5j41j83J36q0K27%K8j4n3l3k49K63l85M42o2
5829gP4O4p5M2j00q6p1K42rj0j05j44K96j14J2K70l61o5J34J76j07j66k9J95j3
5854D3r6N5Q3l13J30J3O4k16K11j3l5L40m27N6K6k9J47m9L58k66l84J47Q7m4J05
5879gj57J42j6P8L5J08j87K85k80k37J49rJ42j38K78L1j42j53K38r3Q4p0j3j1
$$ y = [-159, 37, 15, -114, -136, -69, -143, 100, 71, -73, 48, -368, 144, 136, 143, 104, 169, 59, -120, 80, -22, 64, 142, 149, -188, -24, 197, 84, -103, -23, 69, 31, 166, 62, -30, -169, -87, 216, 46, -178, -42, -175, 19, -71, 168, 172, 68, -197, -206, -235, 0, 249, -38, 109, 116, 113, -55, -187, -119, 235, -22, 179, 43, -111, 43, -13, -95, -110, -166, 72, -7, 187, 129, -77, -93, -125, -121, 412, 73, -9, 98, -2, -141, 128, -175, -32, 76, -82, -74, -128, 163, 80, -54, 211, 82, -165, 118, 118, 103, 14, 46, 117, -66, -169, 12, 42, 97, -44, -227, -91, -171, 56, 56, 84, 70, 17, -16, -265, -2, -387, 55, -7, 67, 131, 56, 98, -2, -88, -159, 83, 74, 64, -41, -185, 111, -3, 9, 279, -82, -147, -13, 163, 56, -110, -139, 56, 43, -53, 2, 85, -228, -98, -85, -21, -237, -26, -39, -74, 266, -161, -105, -79, -108, 39, -10, 348, 82, -302, -155, -68, -112, -7, -164, -22, -38, 40, 75, 183, -4, 281, 1, -236, -87, -96, 46, -92, 186, 217, 75, -78, 160, 67, 151, 81, 68, 57]
5903E7j31M4K6R3J66j97j56K34m21L83j8k23K34j87K52l26M11k04j2j67J25QJ26
5926A17j22J45m56N05j40j48J25o1J9k30J88Q6J6p2j56M19l22J96l3k83M36k81
5948e2P3K50l87J89j06J3J51n3kj56O4p5M9J55j53j24J96l33K64L7K13j26Q7l54
5972a80K02L1KK18k12L3qj14O6r2L9R4J05mn0j33J21l57L75p2K2pq2K02l27Q2
5998d6oJ48l9j15K0k4K55k66j0k7P4J9J57j02p0j30J28m5J78p5l81M95k38l9J88
6023D9K06l02N0PR4j87k4K96k14L3J7J37k21j39K31q5J3j61N7q0L39o6o7O1k18
6048a74K17n3R0j4p2j09J41Q7q3k5P7m5K6K5o17M53J91k34O5qN1p2R7R9P6l11
6074a22K37l56K34k10M70k03J33j84MJ27J4j00P7n39K90L96l71N9J26J7j17j5
$$ y = [57, -74, -30, -4, 89, 255, 58, -98, 136, -285, 98, 80, -143, 91, -96, 156, -170, 241, 37, 25, -142, -17, -9, 117, -5, 140, -316, 189, 49, -99, 26, -35, -16, -246, -58, 28, 44, -28, -184, 235, -87, 109, 76, -207, 229, -52, 21, 271, -116, 73, -33, -20, 131, 78, 76, -80, -16, -91, -42, 113, -40, -164, 32, -301, -37, 0, 213, 87, 174, -180, 22, 53, 55, 273, 61, 94, 86, -28, 38, -54, -15, 79, 184, 180, 130, -3, 118, -239, 136, 64, 86, 79, -3, 199, -128, -46, -52, 96, 57, -58, -38, -62, 193, -73, -83, -110, -36, -17, 140, 38, -32, -162, -34, -79, 99, 24, -357, 138, -100, -139, 49, 255, -47, 3, 10, 104, -83, -107, 189, -25, 8, 25, 162, -59, -198, 33, -52, -39, -200, -143, -223, 116, 50, -17, 44, -174, 43, -10, 80, 66, -6, -115, 26, 113, 30, 5, 82, 37, 63, 88, -529, -76, 115, -119, -54, -62, -11, -83, 14, 113, 189, -122, 115, -241, -7, -217, 253, 50, 183, -1, 3, 130, 144, 44, 121, -418, -128, 268, -103, -44, 82, 99, -18, -33]
6096c3J61K12n20M53j35J07l62J28P2P8o9p8k31K06j70L17j16j14J33J64j10j78
6118h5n3P6M5K04j98J65j70J90j14n4M3j7R4P4j35J07k67J79j38K18l25K23J06
6141A68l04O7k1J44J11J56k18k47j8L44k49o9J51n2K79k0j25J08l19k2J30M1J83
6164B18l46K22k75J86K3R6j88j17J39n8r5J3N8R2k2J65l2r4J56o3P0m45J19N6
6188a22O5j71M41j08n8Rk69P2J60M9r5QJ68J2k22J21j00J42k7M5k57L3K90m48
6212b62J20K64k06j54JK18k69K39n2J5R8Pl10L77j56Q0m0k26L54P1k33K22j65
6235go2p8J01J22l28K20K1K3j59J92L1j50J6K11l33K44N2q2k05K2M96m74J63K40
6259B76o4n26L11p5O8O8k62Q3L40r1l88L33K3o5k06L73k24P6m4l7j3j83O8K17
$$ y = [-33, 128, 340, -180, 273, 138, 245, -117, 11, 83, 161, 92, 14, -217, -11, -181, 136, 20, -94, 39, 203, 93, -85, -138, -62, -17, 187, -11, 154, -16, 174, 60, 6, 49, 32, 126, 200, 65, 172, -95, 84, -54, 164, -161, 62, 168, -136, -69, -90, 54, 165, 321, 103, -144, -162, 182, -67, -136, 15, -37, 242, 222, 97, 205, -114, -136, -6, 35, 218, -128, 94, -181, 5, 28, 124, -64, -181, -42, -100, -195, -182, -124, -32, -54, 111, 79, -15, 141, 78, 148, -297, -178, -122, -57, -228, 213, 105, 47, 56, -213, -141, 19, 68, -27, -19, 149, 161, -61, 60, -40, 102, 75, 120, -137, -104, 186, -262, -142, 122, -84, -238, -237, -19, -288, -49, -101, -86, 12, 19, -291, 86, -70, 10, -30, -256, 98, 169, -64, 158, -7, -69, -147, -46, 76, -252, -32, -11, 12, -147, 45, 76, -74, -58, 153, -180, 64, 116, 34, -171, -149, 347, -127, 36, 276, 212, -314, -3, -78, -10, 58, -204, -121, 219, 128, -260, 73, 96, 31, -175, 198, -26, 50, 6, -31, -44, -227, -159, 58]
6283E8p2o9r5J63q7P1R7j99K75o2k18j29L54k7j57P6L5j77p9K35O0j39N8N2L1
6308E5J83l58J14m1q5L98k43J17l91K7K49j95K40q6J56J7l83Q5J42L0K74k16k75
6331a86L7Q2n5J16L07j86l95K57J98j63j4j72K09j12K7J19K5o0j34O9P8j3j80
6354a46J5L01j53l5K21l17J18R5j32N6Q5j66j62J51L3J11j12O2J59k47K08j69
6376b4l0R4j89K19j20m8J03j56R7LoJ46K8j27P1l9l37L56k92K51l1m9m2J06j09
6401a25l7L06k90J54K26l02M78m6l50m5r8J58J2j26M3Q1L4l4Q7k4J89j38j35j42
6425a24K09q0J66O2k31m2L2J8J54n2o8j33k19J44J98j36j4L5L66j03n07K58K20
6448A53J85k97j55kJ95k97K83j73J45j33Q9p4P2J02L2j09j71J93j49L16j54j34
$$ y = [58, -14, -83, -178, -15, -102, -31, 66, -133, 142, 80, -138, -267, 87, 60, -97, -21, 14, -163, -242, -7, 53, -86, -28, 24, 55, 238, -120, -6, -47, -132, 266, 23, 140, -251, -224, 25, -170, 70, -16, 140, 157, -226, -141, 1, 31, 305, 89, -186, -149, -67, -122, -6, 301, 115, -280, -23, 175, 12, -2, -174, 35, -77, -50, 69, 94, 34, -100, -31, 47, 34, -146, -131, 170, 17, -18, 203, -114, 4, 99, -33, 23, 108, -58, -220, -69, -36, 75, -37, 25, 184, -63, 145, -24, -54, 40, -149, 70, -50, -98, 5, -151, -54, -51, -57, 89, 117, -10, 61, 22, -315, 41, -251, 0, -31, -80, -122, -16, -125, -162, 144, -146, 8, 234, -68, 410, 364, 14, -31, -129, 29, 41, -85, -42, 39, 73, 39, 126, 102, 291, 153, 18, -124, 85, 5, 171, 233, 2, -40, -8, 10, 164, 112, 44, -89, -308, -164, 34, -102, -116, -81, 285, 182, -325, -67, 153, 338, 41, -114, -116, 79, -218, 65, -108, 37, -96, -7, -81, -9, 93, 125, 16, -155, 38, -111, 205, 51, -83]
6470h3K08j38K77j71k37l5rO7jJ28L18o26K54M0k2O0n2J02k6k20j59L54p1k2J41
6495G7q2J1j97J71K14J22l54K67j08j96K56j18J82k98J74rk72J00J0J48k45L3
6517a14KJ94k03l8Q9p7R4J28k9l0k19K66J03j12J07k96p9K99J0J38m18J06P9M3
6541D3j26j2J58J4j03J87n5l31R6J41k14K98J9k50L13m17K04j3N8j34p2K27k7
6564DpJ18j92J8j35o7K12J44p4j22J21j89K43o5j48K81j46J2P8K33l75j98L61
6587A07j66p2J89j06j89L18L3k20Q8j00m9N6M7P3J69o4J0K48l81k9L9q7q1Q0L0
6612e7J03k06K06j73k12K73J25r7R3R2j56J53j28P3r0O3j63L86l67K62j30k1M6
6635G5J01k47N5M3o8J99J01j93K18k25k06K97k52L30l45J72j00j51K07j94J04
$$ y = [-83, 125, -13, 264, 93, -144, -179, -188, -121, -122, 6, 324, -302, -48, -8, -30, 30, -22, 80, 54, -166, -325, 29, -42, -64, 77, -5, 6, -191, -20, 194, 316, -38, 229, 121, -75, 181, 63, 245, -53, 121, 112, -160, -60, -50, 98, -147, -114, -112, 82, -121, -159, -70, -147, -53, 75, 46, 16, -203, 63, 166, 54, 161, -135, -214, 85, 95, 233, -185, -79, 0, 43, -83, -95, 63, 77, -26, 161, 106, -225, -129, 12, -202, 96, 115, -135, 178, -239, -35, -48, 10, -124, -196, 31, 4, -3, 115, -77, -59, -194, -261, -49, 95, 21, -101, 20, -169, 74, 9, -139, 142, -4, 8, 86, 319, -56, -254, 107, -59, -131, 58, -48, -237, 81, 114, -106, -18, -118, -167, -111, -64, 9, 178, 114, 124, 372, -9, -38, 1, -86, -167, -87, -57, 46, -160, 46, -127, -339, -66, 59, -38, 55, 147, -9, 144, 16, 89, -1, 62, -101, 285, -82, 180, 50, 29, 75, 176, -71, -16, 27, -41, 158, 259, 66, 284, 59, -147, 150, -102, 228, -117, 55, -45, -196, 11, -183, -79]
6656g9K63k52m6j06J45j6j3J25L7k9j35pJ19mN7J46j42k46L80n9j70O0j46K83
6680A65j41j52M38l15K1no3J88k44p8J88n6R5k25J40J7lpj73K24Jr8J16R4r3m07
6706c73L93k3j68K94P7j66q9M9l2Q9l8q0m9K71L7j85q4K03k29J33k75K23q9P2
6730c9O6j98J83N4Q8p2p2J37o2l68M96j91R8l27J13m7L11k83J58j47RQ5J95J25
6754C12m82j53L98Q8j38P8j71P4J34p1j23J30R0k08p9R5j49R5K37j25j04J35k52
6777a89M6J96J9j21J09k88J99J13k20j42L98J26l30R6J18j95J11K31l94M7n5L84
6799B59o1l97K7J13k5R1M2j04J39L8o1l63L61J03rj30O2j24M8o1j35L5M1K18m67
6824c60L90p8M9J42j94K9l9R0mL3k62L0K47k46J75k5J91k21j46K64m2Q5k21J07
$$ y = [-79, 184, -68, -114, -220, -75, -91, -104, 21, 58, 29, -106, -113, 6, 2, 59, 205, 63, -183, 197, 138, -32, 28, -118, 165, 24, -128, 310, -5, 16, 11, -52, 136, -108, -186, 2, -54, 41, -184, -44, -27, -30, -37, -210, 14, 15, -83, 33, 127, 34, -373, 20, -3, -171, 123, 200, 34, -55, -6, -38, 51, 13, -67, -116, 155, 192, 7, -77, 126, -103, 30, -245, -22, -111, -39, 27, -171, 12, 66, 154, 82, 10, 147, 85, -283, 213, 22, 120, -207, -94, -141, 170, -113, 45, -102, -93, -8, 187, 312, -170, -323, 75, 163, 25, 103, -68, 6, 140, 69, -54, 76, 166, -42, -121, -26, -175, -80, 157, 32, -72, 63, -189, -143, 53, 72, -49, 60, -228, -29, 84, -136, -278, 120, 246, -84, 12, 130, -65, 46, 277, -117, -70, -125, 259, 198, -199, -172, -59, -84, 7, 49, -55, 84, 122, 61, -302, 59, 162, 153, 23, 85, -39, 9, -52, -187, -152, -111, 107, -360, 30, -48, 1, 143, -51, -22, -61, 29, 25, 58, -204, -174, 73, -173, 2, -23, 168, -53, -199, 65, 23, 108, -113, -6]
6848fO3M3j83L2K51j50m6m9o3k21K77J99j33j21nL9K24k62r8N20l02j8K58j70
6872G9j16J7kL03j49j57L9kJ24o5J45j97Q1j29j31J97k05L47j73k34K00M8M7r2
6896b5j01J90o9J37l41P1J83k2R8j14M0k56J04p2K56K1j88R3J80rq5j68J67j43
6920e3q6N5L61l46Pl7j04O11k32j50p1L14m15J80J50p9p3K0k38Q5J44j22J1N9
6944ir4l0J30j86J86O0j79l8J9Q4L08o47M57N6p6j50J37r0J63M6m72M06k35K36
6968H2P0m7j38R1Q7j21k7K60l80K42J10o6m02K20J31k54K7M7l8p8K30l07K76J2
6992B7O2J27l0m91M89l39K04j21o9K10l21L45j02j13K26k79K93j22J93O7k71K97
7014B82n48J91K37l20L0L39j46k75Q0J95nQ0J29l89J07j28J92J29l90Q6K54l0
$$ y = [-6, 57, 100, -83, -51, 200, 50, 4, -45, -108, -329, -52, 147, 14, -107, -112, -73, 151, -111, -209, 311, 9, -9, 249, 79, -37, -20, -22, 281, 132, -25, 14, 12, 136, 71, 216, 19, 100, -29, -160, 37, -168, 179, 6, -228, -28, 20, 67, -25, -126, 64, -5, 132, -209, -138, 45, 23, 121, 7, 47, -209, -105, -177, 79, 100, -88, 5, 185, 176, 91, -77, 90, -53, -139, -84, 277, -69, -62, -99, -203, 408, 176, 26, -45, 269, -146, 34, 184, 105, 32, 52, -186, -101, 43, -79, -68, -9, -103, -133, -3, -189, -3, 57, -122, -160, -141, -57, 251, -396, 61, 117, 41, -109, 28, -62, 101, 147, -325, 81, -154, 82, 152, 105, -33, 58, 145, 24, -3, 257, -123, 119, 229, 163, -239, -19, 112, -142, -115, -68, -106, -184, 46, -261, 15, 27, 89, 216, 186, -305, 184, -155, 49, -72, -141, 69, -252, 93, -9, -122, 104, -175, 118, -4, 189, 256, -15, 282, -266, -75, 162, -158, -128, 211, 65, -210, -130, 65, 60, 140, 269, -120, -13, -141, 51, 180, -210, -124, 130, 100]
7036A00j23n2R5j98R8M9M9j69J33M3q5J83j27m6n8K70k38J27j47K53k18J3O0R5
7060A07k13Q1J22l8k5J40l92M00m2l03J00J0L6j68L01j83j15j0K54KJ06k37J25
7083E8j1j6P6m27J48J74rL1m2m3o3J41p6R6j69M05k95K1Om1L59l92l5J98l5k1
7109C8K9k2Q2j12N6J8j21M44m13l40K74J21k14nJ02k77L79p2j99L60l79M6Q0J55
7133C0j8k41J20K11k12L45N1k54l9L07m9m86L27j20k69K70q0J00o3j78R4KJ57
7156Ej28J71o6j92M09j93j08R1k83K66r5m5L10q6J84l39J79R6j73J57l66M8K89
7179A31Q8m00n4Q5J46K76k90k23J96K42j99k0P4k80J64l7N4M7q7J52r4N5Q9m9
7203F6m1P8L8j82K3j55L7n4j55J56K58j82K81K4q4J11m39K69J54k59j63K63N6
$$ y = [100, -23, -75, 20, -178, -80, -31, 18, -151, -18, 25, -60, 123, -4, -50, -108, 162, -76, 51, -96, 157, -61, -48, 12, 107, -106, -25, 97, 59, 34, 174, -218, 182, 140, -163, -63, -53, -17, -185, 116, -67, -182, -192, 62, 64, 170, -67, 58, 47, 31, 107, -320, -172, 2, -7, 24, -18, -61, -124, 17, -59, 37, -132, 273, -22, -1, 5, -36, 323, -69, -104, 94, 59, 38, 67, 45, 127, 15, 71, 89, -32, 412, -1, -341, -67, 54, -160, -165, -63, -340, 39, -33, -232, 128, -251, -205, -125, 30, 12, -229, -109, 102, -110, 235, 286, 32, -7, 300, 251, -235, 92, -28, -297, -27, -107, -7, -70, -248, -154, -152, 5, -123, 48, -18, -210, 199, 6, -102, -11, -294, -28, -123, -168, 142, 56, 240, -99, 80, 176, 3, 160, -206, -158, 131, 219, -181, -235, -150, -4, 272, -18, -241, -45, 197, -2, -22, 52, -228, -64, -101, -47, 0, -87, 65, -29, 26, 115, 66, 25, 103, 141, -41, -18, -173, -136, -190, -345, -189, 69, -113, 168, 192, 108, 219, -220, 49, 203, -56, -219, 44, 100]
7226A00k12K3K02k95J08l0K17j33j38J89m7P8j28k12J72j3K07N1j14N4m03K18
7248a06k2J06J19j21j92M38k73J24j77m6j12O2K32M9N0l31N7J18O2K3J4m2j18
7271h6K94l68L02k03l2L18k75J02j54J38k05R2J07j73J69J47m53K19L81m43J67
7292D4j47m4L24l09L90k4k30L30l61J35k55J32K33m48J64J13K2K04j20j81QP5
7314E5N4j62J10K21m34j7L3J32j20J50k63M49m31L12p2l0k7p0o1J39k15K37J61
7337A51k87N6m3r6L00j50J34j91K81k42M9P6J26jj20j92L4L29k29l9J80Q3p7m34
7361c02L25j0J71l85M3L48l68O3J83j59K35j85p3j3j2J78k17M6J51j99j27L40
7383C3j13k2K29r9O1j53J08k66J57J46m1j60K62m72O35j20%k92J97j97L9P0oj23
$$ y = [100, -112, -89, 113, -182, -74, -104, 113, -20, -158, 31, -16, 62, -66, -278, -106, -119, 88, 139, 25, 79, -324, -106, -128, -22, 97, -24, -216, 222, -51, 73, -104, -150, -262, -200, 32, 81, 131, -200, -143, -25, 37, 60, 74, 32, -86, 208, -160, 142, -61, -93, 225, -50, 52, -102, 36, -169, -77, 30, -143, 26, 173, -280, -61, 320, -123, 44, -103, -147, 177, -132, 258, 234, 4, 334, -27, 108, -147, -15, 218, -230, -66, 47, 69, 273, 153, -28, -20, 55, 109, -53, 57, 278, -156, -173, -140, -8, -128, 22, -241, 208, -223, 89, 17, -13, -40, -110, -171, -32, -247, -10, 151, -136, -80, -123, -219, 81, -69, 65, -126, 155, -87, -38, 38, 164, 163, 43, -149, -115, 214, -15, -54, 126, 209, 132, -302, 23, 13, 184, -201, -158, 190, -178, -115, 68, -91, 144, -41, -114, -127, -139, 39, -178, -132, 19, -180, -307, 33, -80, -102, 127, 28, 89, -64, 44, -222, -65, 81, 40, -120, 142, -330, 305, 185, 185, -107, 90, -107, -68, 2, -4, -127]
7407a27K18m3L6j05pR8j35L15l92K57j15j08J11J49j3l6k10K78k99j34L34j84
7429a12J17PJ63j82j46k45M51r6J65j07J4L09k86O8j64K3Pk3J29l08K90l7k84
7452b47K08K85k65J73k52l6J24J77r9j5J74j87l34M46k1o2j91J60K71m79N55n59
7474a74K15j14J96j60R2J8j19J73j63K0j77K56Nj69M00m17K64l09J84Q8k78K75
7496A06Jj51J74k83K31j77l1K68r1k43J31j7l5m7k3K34n2j22j77K14l8J75l13
7519b66K88J18j04R6k59NK51l92J76J31k51J38j90K80k1N6j7p5m5K1j14j11J46
7542a39K02M9p3l6r6L80j67J31j70J61j75j70J5L08l34K68j80J41r5k20K99k04
7564a05P6q8kK13m2N9j2k65K68k76J56k53L17j82J54j97O2L3J50K0jq7j88K39
$$ y = [-127, 91, 48, 84, -21, -28, 70, -65, 250, -142, 115, 0, -108, 3, 152, 139, 103, -107, 171, -128, -262, 72, -112, 5, 12, 175, -7, -153, -398, 53, -43, 122, 15, 29, 338, 52, 120, -44, -21, -14, -37, 92, -216, 74, 37, -247, -39, 246, -19, 154, -98, -134, -10, 167, 68, 53, 227, 40, -294, 152, 131, 69, -122, 38, 309, -170, 385, -174, 41, -73, 123, -37, 55, 73, -46, 127, -36, -16, -193, 63, 68, -101, 299, -118, 146, -163, 21, 109, -169, 106, 107, -44, 130, -153, 78, -99, -130, 138, 47, -196, -65, -82, -117, -164, -187, 47, -5, -127, -304, -90, -128, 47, -266, 22, 140, 36, 132, -127, -122, 129, -263, -87, 44, -207, -69, -259, 21, 0, 56, 39, -36, -81, -60, -174, -285, -139, 63, 112, 39, 3, -93, 287, 120, 251, 81, 242, 67, -103, -88, 220, -114, 154, -26, 115, 20, -200, 99, -105, -29, -117, -119, 94, 52, 111, 99, -166, 102, -174, -18, -271, 46, -136, 18, -179, -117, -84, 66, 86, 85, -2, -190, 49]
7588D9l11J74j14L78j29N0j79N2K04m94N53k80J49on1L22o08L01j07K6k94J7L84
7611H6oj18K35j78k42K19J86j36j6Qj07J23j88K52Pk09L58k59J20j6R6k44N2K80
7635C03n24J98P9J15k93M0J42m7j83K66M6k01K7K12l70J96j1K2J29l4Q4l13Q7
7658c0Q9n2J32k07J29L3Q1k31J52J48k54J47k09K00j12MQ8L9l6l70J46m7k2K31
7682D9m18M10M2j06J0j54j13L61k22N1L4K76l05l9K71j3j26K8j93Q8P4p0J36j56
7706h5L8j06J39k06J95p5N2Q5K1P3kJ68k65o9N3j84M6l9J92K6r9NJ9j9K1oJ33
7733A11j59J00K7K57j93l31J79P6K59k76K5j31J42j31j13O1M8q0K46j53M2L7j09
7756f6p5J27J13j46j5O0J99l44P2J86L8l21M6L03j32O7l02J52J12J13j4j74o1
$$ y = [49, -262, -88, -202, 176, 47, 97, -82, -30, 174, -320, 233, -47, 102, 96, 45, 367, -241, 60, -47, -21, -315, -298, 86, 80, -38, 197, 19, -223, -4, 182, 46, 30, 38, -69, 54, -134, 118, 125, -84, 274, 15, 135, 119, 215, -29, 23, 303, -221, -23, 56, 171, -122, -82, 60, 13, -170, 96, 142, -59, -32, 180, -190, 6, -5, 17, 146, 112, 196, -117, -30, 59, 7, 139, -68, 61, 94, 175, -56, 96, 244, -10, 137, -72, 128, 16, 20, 108, 147, 111, -259, -113, -160, -182, 49, -369, 41, 83, -23, -13, -167, -280, 81, -141, -90, -56, 220, -85, -124, 147, 134, 8, 36, -157, -69, 5, -65, 71, -85, -47, -153, -14, -220, -25, -100, -48, 37, 58, 131, 129, 297, 32, -37, 16, -168, -122, -161, 31, 57, -42, -37, -18, -37, -16, -22, 111, -48, 52, 79, 336, 143, -188, -9, 67, 326, 50, 75, -56, 86, -45, -158, -97, -49, -129, 117, -36, 6, 43, -66, -141, -14, 99, -47, -62, -2, 197, -147, -75, 111, 149, -172, -126, 177, 45, 112, -190, -38, 74, 187, 173, -1, -62]
7779f2l6L97j71J6R0m7J3j40l08M18l60N53l30O7k52j47L43j84l4L29j40l0m8
7802f3q7J55N4j08k7J60k88L6K4L30k53kJ99k63L21l98J72J0j78K67j97J67M5
7825G6j15J78j40O4J04j49r8NJ8J33r7N8j23K34Q8j37j91OJ16k44n0K53Q0j90
7849a21J54o8N4l2O9k03L64p0j66j08P1J42j73L1m7P2J11j86j17N77n60J34j35
7872b07L31n4m50K52Q7J37j29m6P6K7j28j9L0rL16n1L6k4k91P6J74j12k29J01
7896a06N8j26J96j25J37l8lj7n1K7l3J41k37K05j25N4M7r1K15l6l0j12q8J50k56
7921b44J12K04n5J25l15K33J34Nj51k23K42n6K16j70R4l32p3J65Lp2M5R9j80J41
7945e3j1j79L12r6m3L0j2N3r3J10OJ26j06l97M45k66J53R6q4Q9J65k1k22j13J50
$$ y = [-62, -98, 299, 128, 144, 234, 187, 200, 60, -248, 170, -190, 363, 33, 100, -152, -299, 44, -140, -174, 155, 15, -15, -63, -150, 5, 59, -49, -76, 84, -204, -168, -144, 186, -67, -69, 130, -133, 188, -210, -38, -28, -206, 61, -136, 31, 76, -39, 139, -1, 63, 167, 18, -80, -75, -57, 76, -21, 37, -86, 148, 236, 99, -92, -86, 30, -214, -264, -11, 69, -121, 33, -35, 19, -13, 56, -147, 217, 147, -19, -127, -56, 86, -87, -56, -103, -31, 80, -106, -223, 354, -206, -72, -207, 124, 70, -380, -128, -41, 96, -33, -79, -3, 24, -104, -123, -93, -102, 214, 163, 199, 175, -116, -40, 134, 22, -207, -106, -48, -174, 22, -103, 34, -4, -7, -24, -75, -48, -81, 60, -177, 28, -97, -43, 4, -87, 128, 92, 62, -50, -138, 12, -244, -132, 72, 17, 142, -173, 60, 194, 199, 48, -175, 67, 11, 227, 57, 151, -181, -254, -89, -86, -158, -113, -14, -194, -53, -64, -243, 69, -27, -70, -40, -52, 1, -92, 18, 24, 150, 44, -353, 92, -174, -21, 75, -9, 80, 245, 224, 2, -111, 39]
7970C9L6k39J14K63o2R3k81j20J03J4K15j77K74k60J57l23L06o3k0m0l29N05m13
7993b08P3L0M1K11mQ3l52j3J48K31j81p1R8k74O5J67o6O5Q1k20p6J70m0j43K63
8018G8Q0j46J38L9k13P0n2N9k08P0o5j34L02j61J76r1J43m5j32l4J8j6J70P7j66
8043d3M2j81M00k60L48l92L38l26%R1J13j49o0NN0MJ43j93L17m82pJ57n2N09l94
8068b2j03K45j27NJ02L7k09j59K09L13k19j43J31j30J99l56J90J3QK94k43O2p5
8091B2M4K4l57N58r8j62k81K99p1j8l53K70J37l17L14j98R7N0J15J16l98J41L57
8114B91l06P3J33j39j91J56P5j59J97J0l92L14p3On2j07l2K17J88l03K54j59n
8137dr6m2J22M3Qp1J55K9j24m4K62j13k40J03J04j75J06qJ35j68K29j46k42L83
$$ y = [39, 75, -164, -50, 213, 151, 244, -37, -157, -54, -40, 175, -2, 272, 12, 169, -154, 152, 89, 69, 29, -300, 205, -208, -135, -105, -64, 147, 143, 226, -126, -139, 9, 240, 59, -12, 86, -188, -123, 44, -22, 43, 124, -96, -172, -2, -42, -185, 78, 158, 12, 150, 189, -24, 46, -6, 53, -155, -85, -150, -284, 18, -143, 33, -58, 85, 40, -92, -126, -108, -124, 46, 123, -43, -1, -182, 218, -42, 306, -86, 252, -74, -74, 17, 130, -19, -79, -74, -24, -20, 123, -70, 247, -235, -242, -85, -137, 372, -22, -125, 120, -7, -2, 100, 137, -72, -231, -22, 291, 72, -71, 60, -70, 129, -227, -37, -24, -16, 278, 35, 97, 22, 66, 90, -267, 291, 193, 31, -250, 49, -22, -40, -393, -123, 14, -303, 11, -187, -90, -40, 75, 191, -207, -66, 291, -15, 58, 191, 52, -139, 17, 92, -67, 130, 140, -252, 62, -11, -5, -57, -164, -196, 21, 209, -94, 160, 1, -4, -100, -142, -20, 23, 31, -40, 115, 144, 20, -24, 238, 125, -115, -12, 92, -83, 23, 15, 150, -18, 211, 65, -177, 206]
8161B06l71J55J04k74K60j4K4J0l28J97n6K04M3j29J14p2n3k03lJ80P2J2m7J98
8185B29j79J19m1l97K93j34
$$ y = [206, -165, -10, 94, -180, 80, 66, 90, 100, -228, -31, -87, 117, 160, 31, 145, 73, 20, -183, -186, -6, 66, 78, 31, 229, 50, 169, 128, -269, 24, -110]
8191a10
$$ Imaginary data points
##PAGE= N=2
##DATA TABLE= (X++(I..I)), XYDATA
0@%%%%%%%%%%%%%%%qJ6j6J6j6J6k4L2l2M0m8N5o3P1q1R0j04J20j36J53j71J93
37A03k17K42k69K98l32L68m06M48m95N46o01O63p29Q02q85R75j077J191j321J470
57G74j640J838k072K356k706L153l745M565n777P748j1472K0813q4446j46974
71b17585K35613R8795j29203k1945N4346n6850J1941Q4206l5290n9805O5424J0245
83C9892q2783J1695P9738r719m6143j6695n534K8767M7499k9576n3154K6088L2882
96B2957k5006J370K5532k2781j7505L2683O98k7927J2556J7109j4421M567R538
109A9370k6161n09M4552q30m4038J697L1169k502k1003j993J4832O684k1314k0296
123b0342K0001K4759j3403j4117M890q979O81L3055j120m3749O906M0151k0994
$$ y = [0, 0, 0, 0, 0, 0, 0, 0, 0, 0, 0, 0, 0, 0, 0, 0, -8, 8, -8, 8, -8, 8, -16, 16, -16, 24, -24, 31, -32, 39, -42, 48, -56, 64, -72, 81, -90, 103, -114, 128, -141, 157, -175, 193, -213, 235, -260, 286, -315, 348, -381, 421, -464, 511, -566, 625, -696, 774, -866, 972, -1100, 1256, -1450, 1703, -2042, 2523, -3254, 4494, -6978, 13835, -70611, -217585, 18028, 116823, -12380, -34325, 20021, -36829, -24888, 59318, 24028, -35777, 29647, 39892, -42891, -31196, 48542, 38823, -7320, -24015, -29549, -782, 46717, 17141, -36013, -9925, 22957, -2049, -679, 24853, 2072, -15433, 17250, 17948, -9979, 2577, 19686, 5265, 9832, 19370, -6791, -7300, 37252, 36422, -7616, -5919, 25250, 22748, 1745, -248, 14584, 21268, -46, -20342, -341, 24418, 11015, -3102, 1788, -7191, -6510, 26545, 25425, -18324, -11418, 28733, 7739]
136G739l3511L6400L0188m0705k6169L3152J6578j6696J04O364j2183m611Q840
149E490q1N3Q750r854k4269M008K8045N850j9375j3542L358J0241M717k278j225
164a12K571l452j1577J049K0761J1411j8295j9777M534J7327R898m775j2848l721
178g006R765J087r806Q117J5201j4874k3984Q330J9562r12o470l244p561q59J1940
193g14M963n190P34j669j0513K091J5856N238q392r047l067P341J1899j30q637
208G63n98N21n134M239J2153m231j2603j07L321q9M555K346q561l930O311p30
224a774k770O769J775r607j39Q077P04l191J298J429P39P99m137l144P707P449
240A1984o394p821Q12M710L106Q36l933l920R73j192l041M569P231m474j1968
$$ y = [7739, -25772, 10628, 40816, 111, -26058, 7094, 23672, 6976, 7080, 13444, 1261, -3350, 5490, 5409, 5462, 14212, 4358, -19911, -15903, 12142, 17992, -1383, -14925, -11567, -1326, 3391, 1113, -112, 2459, -993, -12570, -11521, 9240, 20651, 2356, -17421, -12887, 4440, 14338, 9563, -3285, -7006, 2759, 3846, -5960, 2157, 17358, 2484, -21500, -13170, 6392, 5480, -990, -4234, -11795, -12654, -714, 4249, -941, -207, -1876, -12389, -10298, 5558, 10796, 2404, -6643, -9710, -2369, 9530, 9400, 763, 165, 686, -4448, -209, 11944, 7713, -4890, -4997, -1676, -1765, 2790, 5136, -3425, -7355, -1044, -1774, -4544, 2225, 4000, -5607, -5746, 2331, 3035, -156, 1142, 2571, 3310, 4109, -28, -3172, 4535, 11984, 5590, -2231, -1419, 3291, 6397, 7233, 3300, -620, 353, -839, -3880, 689, 7920, 3446, -8522]
255h522j386Q754O916P33n878q120o37Q209N928r18k948k904l554R12Q205N542
271A0332k711p763n724K402P942M599l456o908m817l06N456O949q42q394n687
286h928N44M541O080J754o476o341R02N033L763K798r72o532m110N167O565J530
302E318k343m740l666K784O236J545k781l510k173o82L079K650j179k395k950
317d807k148K833M650q10l268k96qo17K539K931j520j994J486J71j81K580J642
334C183j347r09P23j295j36K016J297j762j139j545r89J980K810j516k017j357
350b003j281Q03K926J730j822l027j457J164M266M558k240m942j104K137L209
365B917L727j72m837l790J750L915K859O26l479n528j171L941L751R86l457o048
$$ y = [-8522, -9908, -1154, 5762, 6495, 617, -7503, -8140, 69, 5997, 5079, 2131, -773, -4327, -3415, 4790, 10332, 7621, -142, -5866, -3464, 4478, 9077, 5621, -1287, -6104, -6410, -954, 5995, 5153, -3241, -8928, -8384, -3843, 2237, 3991, -2485, -8826, -7924, -2891, 872, 3670, 2698, -3834, -7944, -2777, 3788, 5318, 2975, -1765, -5431, -2647, 3589, 5134, 2353, -1157, -3330, -4012, -933, 1717, 538, -1857, -4807, -6955, -4122, 528, -282, -3550, -3846, -3854, -4471, -1932, 999, -521, -2515, -1029, -858, -1039, 1541, 3183, 1836, 927, 1650, 355, 219, 2235, 3532, 1770, 631, -914, -1903, 77, 2887, 1371, -646, -2003, -3284, -2481, 445, 2175, 353, -2674, -4131, -2967, 1299, 5857, 3617, -1325, -2429, -292, 2917, 6644, 6472, 1635, -2155, -405, 3510, 6369, 6995, 3516, -2012, -3183, 758, 4509, 5495, 2038, -4010]
381d010k584M046N980J169l209m974k979L347O291J207l155k271k090J60M619
396A547M601q44m311k820k32K999N507k73o090l099R48J634K860J232l215m195
412c751j82J302J418K449q87m905j198L135J285O90J491j992j983J001J218J201
428B92K955p80m979o68M965J113j727R7j219j155J880K86l005R45K701k363l546
445d208J271J474N50J339j536l446K313K668k441N13L570j279l875J408K409P60
461A490K979k09n539j524M423K787J477j270p446k338P789L545m158j294k26l834
477c348M26O209J31l056m5l078k962O257O151k638m637j583p8N042N501m215n871
494a794M199J192l953L619N818m518n085J943K02J26M339o74o553p00K072j322
$$ y = [-4010, -6594, -2548, 3432, 4601, 1392, -3582, -6561, -3214, 3077, 4284, 1129, -1142, -3232, -3072, 1547, 6148, 5304, 993, -1827, -2059, 940, 6447, 6174, 84, -3015, -2067, -433, 2427, 3659, 444, -3751, -3933, -2631, -1213, 1236, 349, -4556, -5754, -2619, -1334, -644, 847, -1145, -3128, -2127, -909, 292, 3247, 2467, -2512, -3180, 1785, 2898, 1171, 1268, 49, -1106, 774, 1060, -1945, -1000, 1701, -662, -4208, -2937, -1463, -913, 426, -1110, -4556, -2243, 425, -2016, -1503, 2067, 788, -3087, -1679, 730, 1490, 4469, 4260, -1279, -2803, 1620, 4407, 5884, 4614, -2832, -5170, 2619, 6164, 2006, 712, 486, -3348, -2922, 3287, 3418, 362, 317, -2761, -5723, 534, 6685, 4047, -590, -2173, -2251, 2791, 8292, 4077, -1794, 2405, 3597, -356, 3263, 9081, 4563, -522, 1421, 1623, 1749, 6088, 5414, -1139, -1839, 233, -1089]
510a089L621M390o464o402L814L444N48K608k351o480J207O640N5j696J377k058
526A164j973K357J643K57K273l752p200M479Q623m432o325K462J116j591K317
541A418k78n222J371M603k290l362P50K26J766L815l460m608L663L219k871J396
557A36L706n267l585N052K192j456K355k007o940J422P101J162l075l467n072
572g743K011R233k49q156k98K743j384J167L197j549k227J32j289O85N487O77
588B437m753m09K047j158K458L396m145k707L692j532l401M839L941n388l934
603d617J841R87J433K606k616m729J255J036M07M570L1o721j293M995K022J14
619A321J866m093m060M491M384j640r76J87l407R26M441p24k353J003j214k416
$$ y = [-1089, 2532, 6922, 458, -5944, -2130, 1314, 1862, 4470, 2119, -4361, -3154, 3486, 3541, 1845, 3222, 1164, -809, 1548, 3191, 3448, 5721, 1969, -5231, -752, 7871, 3439, -2886, -424, 692, -899, 1418, 1140, -4082, -2711, 1892, -398, -3760, -3010, -2784, -1018, 2797, -663, -5271, -1608, 1611, -1260, 136, 3842, -1425, -5010, 42, 2234, 778, 3133, 1126, -5814, -4392, 2709, 3871, 796, -2671, -7743, -5732, 3501, 3252, -4904, -5202, -2459, -3843, -2676, 521, -1028, -3255, -3123, -4412, -3727, 1760, 2437, -2316, -2725, -678, -1836, 622, 4018, -127, -2834, 858, -674, -4075, 764, 4705, -683, -4617, -2776, -1789, -356, 2250, -366, -5095, -3840, -2804, -2397, 2173, 2204, -4517, -5810, -815, 1207, 1321, 3187, -906, -4966, -475, 3909, 2269, 1293, 1480, -1927, -1001, 3440, 2716, 363, 1366, 152, -2264]
635b264K389K073l068n80K065j860j111K317J59j458J679K70k682R11J686o59
651a33J587K229l613k892M166K925j513q15n81k863J416L858n61k440k13j261
667g04r13K499J601k027q11q01k063K118L066j563j788O91o72p93L018J741k048
684E51o16k06q92J127L675p88k267n90m77O5K903J697l133k860l2O9K222K603
702C051j970m404l61K212J507J665k92m071j330K470J755L80J184j676k874J458
718a296K907R61n34p19k420l97K833J217j366p20p15o27M99J042l96l71M2j507
736a567o80J247M99J03O5r29p51R87J280J53k11K7p99j77R53J052J33L27j053
755F59j315Q10J524J59k38o91j413p76J154J313r63l38p46j415Q04J854N2l87
$$ y = [-2264, 125, 2198, -870, -1450, 615, -1245, -2356, -39, 120, -1338, 341, 611, -2071, -1160, 526, -133, 1454, 3683, 70, -2822, 1344, 4269, 2756, 1941, 1360, -1503, -87, 3771, 3210, 770, 557, -704, -1617, 882, 2483, 456, -355, -1156, -3219, -1101, 1965, 402, -1386, -695, -1367, -2160, 858, 2599, 551, -65, -271, -1163, -36, 3639, 2851, 584, -6, -483, -418, 2485, 4182, 1049, -1811, -1843, -1774, 448, 3051, 1081, -3323, -3684, -1472, 35, 1700, 1408, -2663, -3993, -1523, 232, 612, 1796, 120, -2754, -1296, 1611, 2572, 2038, 1319, -1101, -1498, 1335, 2552, 1186, 466, -249, -876, -377, 665, 269, -102, -60, -1567, -2247, -1000, -501, -398, -333, -1262, -2013, -1026, 254, 407, 196, 223, -576, -753, 200, 1252, 1385, 1712, 659, -656, 154, 1678, 1837, 1599, 908, -505, -1281, -127, 1186, 223, -115, -861, -2276, -1472, 382, 434, 47]
773D7q08j695K42K120J676o71j015r72p3J442K071N3j680j031n37P39K169P37
791B814j573j938j107P56J991J380j310k816o81N99J374J368m69j641j495L78
807b370J539J893K44j280j898J25J944J054N42o51j893l99J521J388M91o87j611
824d8j319R74J359J04p54j003j077o1J279M57k01k17r85l33M60J456k7l85m58
843g79r5L71P96Q05o6k0p56j69M75Q50J32p96l30k84k95K82R86j41q16j345k58
864a453L18Q31N00l16j252j20P7J045J152J78j215n21j43Q80J452O62q91j205
882b1l71P91J545P41p89j500q13J25J139J008n06k189o37J79R46J350m5j500j192
901a739LQ05J520M97n19j982m90J601J616L72r3j657q72R94J633J91m49r63j261
$$ y = [47, -761, -2456, -2214, -94, 1582, 911, -104, -1076, -1149, 293, 2364, 2417, 737, -294, -831, -92, 2077, 2814, 1241, -697, -1804, -1048, 943, 2323, 1013, -1803, -2484, -1885, -511, 857, 388, -1253, -2748, -2370, -831, 1062, 1306, 26, -1872, -1747, 197, 1251, 1793, 1142, -751, -1150, 371, 1759, 2250, 1563, -48, -1367, -393, 966, 1070, 316, -687, -1764, -1825, -546, -89, -290, -507, -1492, -1825, -1365, 91, 64, -321, -779, -874, -503, 293, 1098, 1032, 1012, 256, 87, 562, 1412, 1544, 748, 418, 134, -161, 121, 1107, 966, 150, -1195, -1453, -1135, -304, 196, -120, -1372, -1492, -1415, -370, 782, 960, -255, -776, -919, -39, 1413, 2075, 1184, -21, -392, 399, 1944, 2685, 1896, 396, -417, -292, 847, 1855, 1349, -840, -1477, -1298, -352, 998, 953, -547, -1739, -1736, -931, 589, 1086, 567, -1415, -1905, -304, 1312, 1684, 1591, -66, -938, 56, 1689, 1880, 1431, 468, -793]
920g93k07J959N60o18l96j728n81J336J443n37j037r65q01Q45J929l68r47K46
938f60K24p42J186Q57o66o37Q89q11j29J430M50j396k73M46n74L50J026p77q62
957f69M35j102o19J756P84j071r22L14q94K37K309k00j950j27N52J84J817O28
975A462k154k74P93KQ06J290n86k241J96Q87j58M67Q56j499j575R27L45N9Q79
994D82p98j684J26J167j81J131J162k720r20J715J034N4P55l71k359jK319J065
1012A976L17o82k499n70K861J139j267j076o24j747K005K491j352j641R9o46l22
1029a538K144N62j664o29N25n5J135J515j693j146J803O2j040J187P12j359J77
1046F98O64j162j89J471M9j046R2q96r00J988R50j837r54N73j097P34K416p81
$$ y = [-793, -1000, 959, 1519, 901, 505, -1223, -1804, -468, 975, 438, -599, -1564, -2365, -1520, 409, 41, -906, -660, -436, -1178, 8, 865, 199, -438, 451, -360, -489, 941, 1391, -5, -278, 168, -406, -56, 970, 193, -669, -234, -1336, -1955, -199, 585, -486, -1408, -1094, -1988, -1751, 558, 358, -1592, -1719, -1167, -983, 834, 1462, -692, -966, -173, -171, 635, 1925, 1339, -902, -706, 181, 23, 490, 1346, -153, -1728, -801, -456, -397, 482, -316, -2000, -1874, -707, -888, 243, 1405, -1315, -2235, -520, 514, 568, 1323, 952, -1407, -1408, 911, 1976, 2293, 1611, -888, -1458, 1403, 2542, 1275, 199, -425, -2172, -167, 2324, 972, -669, -570, -1216, -1538, 606, 1168, -496, -1125, -600, -655, 480, 1995, 302, -844, 959, 1021, -19, 1168, 1880, 521, 698, 1362, 200, 11, 1482, 1531, 485, 577, -319, -1219, 769, 1719, -118, -1072, -499, -1596, -862, 1554, 773]
1064G73k398O85J013o28J654N33j777r53J392L26N23P55j204j778J952Q88j621
1081A35M49J108j911j050J529l21p74J680P2k469L14P87m61M67J670j486k280
1098b541J550Q35P1J790q62l029O23K831K80l84Q4j621j948K674J692q46m78j064
1116c43k105J578K977j177k139J3l24n70K417P52k100o33Q33m27J22K057p16j461
1134a246R75K19q06R79J330j297L8P04j448n4K068m1j881jK71j161J414J276j371
1153c2j279N61m50L2J943j85k318N2J408m37Q87R53j680r53J415M12j99J083k3
1172A190j921N29J008k30j13N23q60m86R77m81o61J038L50k088j99R46k28M34
1190b72R15j030j636J140R66l1O79K38j926n40J863J180k49k20j325r43J708J546
$$ y = [773, -1625, -940, 73, -555, 1099, 1632, -145, -1098, 294, 620, 1143, 1898, 694, -1084, 868, 1756, 135, 584, 1692, -219, -1269, 260, -61, -835, 845, 917, -1552, -1238, -451, -912, -445, 1225, -261, -2541, -991, -156, -85, 1705, 843, -2186, -1563, 1268, 1548, 1164, 1248, -373, -2321, 353, 2045, 1199, 721, -343, -2448, -870, 2107, 930, -1209, -1196, -1520, -2090, 327, 1079, -1021, -1654, -821, -1248, -1126, 931, 215, -1246, -271, -52, -858, 121, 1451, 154, 192, 896, -552, -606, 1462, 1421, -460, -461, -190, -1351, 63, 1339, -32, -1311, -750, -1200, -1168, 775, 590, -1728, -1676, -268, -705, 182, 1135, -545, -1498, -83, 329, 130, 1213, 1190, -731, -202, 806, 576, 463, 986, 126, -360, 617, 136, -525, 513, 863, -1225, -1424, -478, -706, -272, 643, -387, -2023, -883, 83, 52, 731, 969, -957, -1497, 366, 1546, 1297, 1077, -248, -1191, 517, 2063]
1208B063l61p85n52j228L7J890K80r56n73p07n08J627R27r54j067J80k29J93J248
1227E25O9r95J03K90j96R80N41m69r65M23j22J55J285l46j147q7j08R7J067L43
1247A443j350o82K56k68N82N57n01j060Q0N61J34M68M80q71p30P11L97J01L47
1266F55M0p45J03M89Q7K79L66p19q07L59J21q8L10Rj064k67P44Mj7L87q24r56
1288a534L99O78L86L47m71o43q3Q04O92M16m94o46m10O04R02qk09p14o23Q6R90
1309D69L52m94n85q33J80K45J035k91n69p03k68N56J069J89m28n79m35K46R56
1328A12N26k45p79nL40K58O90M40j205n70L15l17Q55K03m72r79J8L31M06J72k0
1349G4p18p58L31N81M86j31l17o88L59N95M69j40K96o67r8R3R02o9J57o07m0j94
$$ y = [2063, 1702, 917, 365, -863, -826, 1064, 1344, 388, -185, -892, -1400, 227, 1154, 200, -867, -687, -916, -723, 525, 594, -401, -298, -8, -204, 776, 1317, 848, -117, 306, 184, 339, 1624, 1278, 131, 44, -64, 33, 1100, 1443, 93, -589, -333, -601, -19, 538, 37, -1023, -943, -382, -248, 220, 700, -171, -901, -190, 207, 308, 655, 695, -50, 53, 542, 629, 908, 1274, 555, -252, 107, 228, 140, 450, 459, -605, -872, -128, -124, -141, 246, -578, -1534, -1135, -457, -71, 276, -195, -838, -921, -117, 575, 991, 497, -149, -559, 45, 947, 939, 730, 16, -607, -521, 469, 821, 327, -258, -1091, -911, -666, 369, 78, -491, -1194, -1462, -906, 163, 352, -76, -655, -1090, -844, 112, 638, 393, -386, -391, -51, 207, 897, 1337, 132, -438, -123, -440, 415, 618, 146, -833, -815, -484, -78, 94, 74, -644, -1402, -1071, -490, -4, -135, -452, -1140, -781, -186, 283, 143, 439, -228, -326, -233, 669, 600, 757, 150, 110, -84]
1371h4K18M85r7n44r6l50j02M75N3k87l64j55J48M02J72J78p3o44K00L09M84L54
1393F82m38m96K14j76Q02M52m13j34r42L39L58P43%p96p34k54P38N82j57m72n56
1414f58j26M1O44M94o71m31k36M35P21O99r5p45l70L70N48L27j37l28r27L15O09
1435D79J82J35l29p15k36N13K53O6j43p19n05N94L4L32L00l33n75J58M14L75r
1456B71M30p75k35K16P14K39l8n76o91O78L92J9k74J16p74k08P36M93n59m70j38
1477d34l32J42O80k28m32M63l25j57M66N38l49j01N43o38j72J176j33o28N05n71
1497A3j59L72N16m21l0k9r83J13R30J80q90k16l50j80Q45J279q95j192K14Q0M81
1518c22R97J34j555O6O42j32R14L60q93o42N88N65o44O01j09j180L60O80n59J28
$$ y = [-84, 134, 619, 522, -22, -118, -468, -570, -95, -42, -329, -693, -848, -700, -298, -126, 52, -21, -665, -465, -156, 328, 682, 244, -252, -38, -214, 588, 1040, 627, 493, -449, -110, 248, 991, 991, 195, -539, -793, -55, 527, 370, -102, -658, -784, -743, -99, 395, -276, -707, -943, -508, 213, 912, 817, 72, -298, 72, 620, 947, 810, 482, -445, -130, 479, 661, 796, 467, -248, -484, 29, 282, 348, 205, -514, -1019, -425, -391, -59, 241, -92, -667, -509, -95, 280, 271, 701, -74, -309, -93, 621, 860, 822, 246, -445, 233, 625, 644, 370, 486, -288, -496, 240, 733, 174, -296, -434, -766, -624, 56, -172, -604, -141, -466, -623, -157, 381, 32, -69, 474, -164, -336, 840, 707, 79, 584, 13, -146, 226, 742, 321, 291, 262, -721, -608, 322, 502, -388, -604, -954, -1134, -289, 990, 95, -1097, -883, -803, -322, 675, 809, -746, -680, -38, -170, 744, 1104, 211, -431, 157, 722, 78, 679, 570, -610, -250, 430, -129, -1]
1538aL84r79k95P40J0l84O19J02j183K8P83j61l9Q38m22p22M42O99J00J21j42
1559E38j326L52J341M0n56J02q53l42J206L78q46m69K85n35R9J108m82o85K73
1578c72J83n41P55L36q65J70R73o15n86J196k30k79N44J54j017J14Q94l70L8J85
1598F67q77p17J441M74j096j45r4l50P64P32p93r51L22K00KJ255J15j480j68Q41
1618A42qL70P11r45o57P68L09n99Q19L8j118k0R16m81k83O57n82q37M05L37m82
1639e40N14N17j026m66Q17N1j92R32m40j295N24J167k15JL59j118l22J388M75
1658A131p74L0n14o76Q99N43m34o28K92j46l97J174l11n75m4j7l01M65N15n99
1678c67m6M85P1q38Q61O1n63M11J40p75L25J008l18k80Q0k70o88J059J49p24k46
$$ y = [-1, 383, -596, -891, -151, -141, -525, 94, 196, -987, -959, -176, -337, -376, 462, 40, -682, -240, 459, 559, 680, 538, -788, -436, 905, 945, 389, 491, -362, -704, 502, 880, 34, -435, -150, -685, -586, 522, 40, -645, -372, -189, -730, 25, 361, -504, -334, 639, 24, -562, 634, 404, 125, 669, 823, -194, -80, 814, 444, 482, 667, -210, -927, 514, 988, -108, -253, -347, -697, 67, 799, 6, -945, -623, -423, -421, 834, 949, -531, -699, 142, 134, 504, 1215, 270, -387, 381, 690, 91, 910, 948, -170, -190, 726, 245, -38, 619, 37, -800, -395, -58, -540, -26, 491, -535, -1001, -184, -133, -325, 607, 167, -1128, -604, 563, 348, 349, 708, -410, -732, 656, 1131, 357, 387, -127, -803, 96, 639, 205, -423, -131, -277, -674, 500, 189, -386, -430, -447, -748, -283, 232, -367, -413, 72, 143, -695, 166, 227, -336, 75, 215, -560, -235, 773, 455, 175, 255, -15, -703, 356, 505, -219, -465]
1699d65L2l16J23J319n48p62j67J10K31O31j17m44m91O97o1J81O99o22m82M01
1719e1N60m89M56Q7n30L3N8L7j01K33K6q52K19N36p39M97L99j079j68K54L88K46
1741B0J40l12m77K70N02K14p0K14o39k98R60J30k02l3m69M0M4P03Q6p33L8k01
1763g3l39M53L43n21m2O7m36J90P35l58l28M8K16j30J99L28m11K55j76KL06K81
1785F09K9k03j29j31k95M31L24m53m0o2q7J56K80k68m09j96K06K2K56R6j59l31
1807c54L36K00N1J1j06j13J63j73K70J49j6k22l15pM25J04j12J38l80k83J52K95
1829B13J27l89l19j76M37N2n4K89j76k55o4J06L90J28k06q2l42N67L09j51l5m43
1851g4K18Q4M4M37l45m96j88K28L49j42L32l35l77l42M44N9K79j62m64k21L21
$$ y = [-465, -433, -749, -626, 693, 145, -617, -784, -674, -443, 188, 71, -373, -864, -167, -228, -47, 652, 30, -452, -51, 509, 20, 476, 563, 33, 66, 124, 161, 60, 293, 319, -533, -314, 222, -517, -20, 379, -700, -868, -614, -226, 20, 160, -152, -629, -359, 143, 357, 287, 501, -138, -436, 524, 654, 452, 419, -50, -10, 34, 737, 823, 90, 128, -73, -412, 41, 384, -137, -179, -112, -548, -358, 377, 19, -309, -261, -45, -175, 24, 352, -59, 196, 20, 22, 328, 609, 638, 435, 306, 175, -120, 311, 635, 182, 142, 80, -7, 149, 429, 161, -248, -444, -238, -216, 40, 136, -23, -354, -18, 182, 233, 244, 138, 25, 188, 15, 285, 434, 418, 196, -119, -126, 299, 403, 291, 429, 49, -234, -82, 213, 340, -49, -368, -544, -107, -55, -109, 180, 4, -251, -315, -209, 181, 309, 103, 21, -321, 246, 555, 404, 369, -74, 144, 228, 272, 709, 364, -132, -320, -92, 257, 115, 447, 112, -265, -607, -163, -104, 175, 13, -451, -672, -351]
1872c51L46Q7J91l67m7j27L06M30j51j71J25k38K88p6J80j69k94r7j6l3L15m39
1894c08l1k15N9M9J87J90N1l83j02Q0P3J33L34m73J04J30K63J96p3j45j13j70
1916a64L33K62k66j89K6m49M41j59K51L49n73l51K06O6Q0q7m4J06j92L08k8K32
1938A58k47O4k23J38N70j18k47J06l05J43K74L34k74j81k82J5q1O09k94n40J64
1959b17M6q3R0M08k07m79R3j9J18L87q0k85J61j56M04M14l7l18j65J2M4J34L5
1982C00j06n6j09j80K24J38k24lj17m7k83L35J88m9n48L17L43n55M29L45k93m13
2004c64L71K13o9K39l54m53M74K95j14K26k55l12j87N94j45l09L12l10m19K16
2024c51O87m34mL41n13OO4J98j53L09k46l86M49L03k43n9L58j82l50J31L87p2
$$ y = [-351, -5, 82, 273, -94, -141, -268, 38, 468, 317, 146, 271, 33, 321, 245, 425, 256, -38, -135, -151, -184, 131, -308, -339, -554, -495, -446, -259, -69, -18, -401, -503, -423, -350, -217, 117, -356, -252, -122, 141, 337, 264, 119, 6, -164, 169, 431, 165, -24, 2, -447, -6, -165, 86, 435, -138, -489, -283, -217, -137, -224, -268, -162, -354, -46, -74, 158, -89, -25, -248, -110, 460, 342, 95, 201, -104, 39, 313, 647, 373, 192, -90, -75, -156, 453, 159, -381, -217, -171, -254, -164, 244, 37, -442, -349, -368, -250, 137, 57, -228, -67, -223, 181, 595, 558, 240, 75, 87, 131, 265, 300, 194, 138, 29, -151, 73, 211, -13, -16, -133, -180, -463, -128, 60, 11, -537, -220, 123, -432, -3, 342, 49, -364, 7, 220, 151, 390, 36, -417, 57, 352, 238, 464, 209, -103, -290, 304, 159, -150, 162, -148, -567, -351, 336, -98, -102, 239, -274, -268, -204, -6, -159, 150, -96, -482, -33, 270, 27, -32, 326, 144, -206, -75, 312, 240]
2046B40K9m4m41OP11l81j57mk72j21N18Kl33j50J84l34J03R76m99m39K25K95l10
2069a96P40j80n25J7L66J38j5J73m18k40M56J04o41o2L86j21j11L39l06n55J027
2090C76k62o98L67m7j10L82j4j62p7Q0K29J94K58q3p41K5P28k80M1K00o32k36
2112d62P42r7p8k96J80m95K53Q35p54o3j08r4K47L49ll87L26J78m87k8P05k60
2134B03n1m6j33l43N14L06k22O0K96p47q5O46J30l20j64k10l63K79O24l42m23
2155c91L27l22L42J92m7l50k48K94J13K45L74n27k04L58J26m41M65j75j63L45
2175C13k8l59l2P94q12k38N84k08m95N53J43k26j49m7K03jm3R4l83K01L75k04
2197C5K37m0m40N6N73k15q5L63l75m94N72J25k25N4j16j25k8L74k26k56J16k6
$$ y = [240, 269, 225, -216, -210, 501, 120, -37, -41, -313, -434, 84, 86, -247, -397, -213, -547, -444, 532, 33, -406, -181, 114, -196, 544, 364, -161, -144, 222, 360, 345, 518, 100, -140, 316, 420, -221, -283, 103, -18, -129, 210, -96, -651, 376, 114, -584, -217, -264, -374, 8, -6, -168, -245, -165, 64, 258, 516, 433, -308, -283, 445, 165, 206, 406, -226, -462, 280, 183, 105, -191, -11, -506, -253, 582, -172, -235, -343, -437, -190, 159, 156, -231, 95, 273, -214, -242, 463, 203, 152, 106, -27, -370, 144, 450, 228, 288, 584, -163, -248, 398, 528, 208, 44, -166, -529, -250, 374, 32, -391, -64, -386, -44, 148, 101, -249, -497, -203, -90, 155, 529, 2, -202, 156, 282, -159, 306, 131, -32, 313, 285, -74, -106, 688, -124, -362, 222, 14, -481, 72, 215, -11, -160, -207, -4, -5, -48, 46, -337, -136, 239, 35, 272, 232, -208, -152, 421, 206, 121, 484, 109, -385, 187, 312, 87, 141, 25, -100, -128, 246, 20, -236, -120, -146]
2219a46j62K03lJ83l23K02Q3j24K9l9k21L32jl26N53j71J53j99K03n59K33L46
2241B46J05j10k88K2m25K87L16l81p1J15Kj55L05P3n65K32M54j53k55K92j53r5
2263b02Q4j10L09J59J52l86j71L47L4j37m3%k39j91M45j21J01l46M2J0J54Rj76
2286b76L76n90K56J25J03K65l15K68p2j47L67l2j61L0L2l34K79K72l29K9k95J19
2308c0M00k61j54M3r8l24j9K77j91J56Q2P1l96R1N62l02N5J42K12m74Q8J9K52
2331B01r4RM4j75qL06k23mM1j02K41j39j46lR2j69J86k6P4k96m0J32RJ67lJ8j07
2358a5q0J34J35J73lj81m07N17j0n3J11k9l84L08j34J11J61k99j62J06m7J60p
2381A05r2j14k78K12j3L18q7P1k49L6J46J79J74k55j29O2M9p5J49k02l16K94j00
$$ y = [-146, -308, -105, -108, 75, -248, -46, 37, -87, -58, -97, -318, 14, 13, -313, 240, 69, 222, 23, 226, -333, -100, 246, 351, 241, -47, -25, -450, -163, 153, -228, -299, -184, -182, -337, -32, 41, -524, -292, 162, 9, -246, 46, -107, -202, -118, -228, 81, 240, 392, 6, -165, 182, 216, 79, 36, 36, -203, -394, 51, -70, 31, -315, -273, -263, -109, -100, -276, 100, -490, -234, -109, -6, 259, -56, 212, 140, -7, 360, 328, 167, 197, 229, -105, 174, 446, 117, 146, -149, -30, 370, 109, -45, -2, -100, -424, -443, -166, -357, -201, -119, -48, -444, -353, 209, -93, -38, 104, 316, -158, -70, -51, 201, 107, 116, 160, -15, -23, 283, 60, 56, 97, -5, 236, 97, -49, -52, 40, -129, 57, 31, 105, -191, -231, -99, -90, 77, 74, 92, -15, -95, 39, 174, 347, 344, 163, -244, 273, 263, 210, 321, 292, -92, 216, 82, 193, 354, 55, -107, -1, -48, 112, 105, 13, -101, -379, -167, -180, 138, 51, 122, -127, -91, 55, 234, 408, 153, 24, 86, 135, 60, 209, 7, -309, -15, -115]
2404a15K65n5J04M5k29j87KL78l89m0K82m49K15j60L74R3j04j84Q3K42R4jk38
2427B6k02l6K84J36p9k02L03m73K07K04k06j57N6r0j01J42J44N4k32J88k96K90
2449d0R3J15j9k95J0n9J03L48k67K40l61L77j74N1O8M9k62R5Q1K5j39J11k86l45
2473d81L33J68j83J45k1j85N0l1J86j17J09r2K86k95J57K3P5J51k92J84lK05m02
2496c0O8L9n8Nk9P4O6k70k56M52k12L55k37j37p6m0L09k6L7l14M10l84L57j6K7
2521A14o0O0k04R7J40J06l7q6O3n8j09L00o5j87o1k0R6j83M57l77r7J55j33j58
2545b47K29m0j66j7K29r2J84K7J2k72L59j15k9o5J01l21J46R4K%j75N7r4K03j7
2570gk35K44L2j63j62O32m27J7K59q4l24r0K87MK91l03ok12M38L0J32J6l38k27
$$ y = [-115, 150, 95, 199, 244, 15, -172, -170, 208, -181, -221, 61, -388, -173, -333, 41, 134, 30, -154, -71, 171, 265, 264, 26, -176, -212, 72, 208, 129, -73, 230, -243, -36, 168, -38, -195, -139, -229, -330, -188, -44, 10, -222, -34, -330, -40, 53, 168, 149, -146, -136, -195, -92, 256, -11, 229, -132, 245, 71, 122, 190, 239, -23, 72, 153, 178, 39, 150, -136, -481, -148, 20, -163, -18, -39, -224, -174, -205, -19, -136, -27, -119, 167, -128, 29, 52, 127, 278, -14, 170, 167, 372, -30, 38, 77, 19, 24, -5, 69, 135, -135, -391, 61, -151, 204, -33, -170, -246, -286, 23, -3, 34, -280, 130, -254, 103, 87, 114, 54, 114, -90, 7, 147, 253, 216, 130, 193, 135, 26, 326, 261, 74, 13, -7, 89, -94, 363, -14, -111, 44, -89, -247, -18, -58, -224, -241, -12, -104, 80, 107, 119, -153, 206, 91, 62, -3, 98, -223, -77, 17, 19, 19, -156, -99, -193, 10, -7, -242, 2, 34, -129, -291, 341, -86, -69, 190, 106, -218, -308, -21, -17, 274, -29, -35, -247, 191, 221, 353, 369, 31, -196]
2594a96J84K39k55K95j60j82j27L25k46lm0p1l04N34nj91j11R6J69J3L64j03l92
2617a67K90n0j16K03n3j32j56N24n87R0L55J70p03L92K59l46o9M34l49j70J34
2638d7l22J08L96Jm38J16J11m1J76n8m2j58K00L73j40J5o1m66J29N99j67k37P
2661E4n1K7K0L46m41O2m7j74K6J96j59j52L85j75k42J13o4J69O9J75J3k72L10
2684A88r4k7J74j67k19JN25m09L00j74j53r4M3L06k33J1n2k49J83M75m04l33J40
2707b62K71j18O5N1l18J5M71l52M91k62n3K58j15k04L41q0j05j15K41%j42k43
2729a65N02l20n5K23k44j17K59j88k8q5J01J79r4K9J82m89R1K63NO8k08j49K07
2752c3M56l61R6P5j46k13L13L4p9l69K53j34J06J22j8k05O5j02K25k17P6o6M8
$$ y = [-196, -12, 227, -28, 267, 107, -75, -202, 123, -123, -126, -166, -237, -541, -7, -12, -203, -314, -218, -49, -36, 328, 225, -167, 123, 73, -43, 160, 107, -25, -181, 343, -244, -154, 201, 371, -332, 60, 319, -27, -96, 338, -11, -181, -47, -369, -261, 135, 136, -302, -186, -75, -116, 60, 2, -40, -198, 2, 375, 235, 250, 189, -277, -148, 451, 284, 47, 54, 3, 30, 50, 396, -45, 17, -30, -204, -178, 18, -141, -293, 92, -83, -325, -212, -276, -107, -38, 137, 150, -122, 188, 94, 67, 241, 74, -145, -144, 381, -28, 272, 98, -55, -149, -106, 200, -33, -22, -74, -323, -140, 335, -69, -402, -262, 9, -109, -44, 7, -311, -296, 175, -177, 314, 52, -1, 257, 142, -62, 279, 199, 94, -21, 220, 220, 78, -165, 337, 17, -38, 185, -59, -176, 83, -105, -133, -218, -117, 62, -32, -3, 179, -310, -219, 44, 49, 117, -91, -240, -33, 423, 62, 158, 233, 87, -126, 187, 221, 142, -227, 26, -108, -2, 120, 102, -103, -38, -140, 85, -132, -56, -122, -74]
2775g4J40rk76P9L02j19K13j95l41K39K96n4l15J64j91K21L38j67j37j76k3k12
2797b97J61K97K5l49J33j95N2J45q9J20k57L58K3j07K29R3m58J42o5J64o3n1J29
2820A40k9j38K85j2j04j31L4k72J65J90n6l15r7K63k34K50N2J1n7j23J90P8J04
2843A94j56q1n2J54J07k14J40j72Q9j42J96j48J08K20k35o2PK75k21l33J82q0
2865b24j29J02L25p3l75L10l0j69M14j73J7J35j58K84k76MM1J72n5q4M50l55p3
2888H0p9j4N6j98lJ36M0j30J02k35L87k87R3j50J80q8K17j12J76m7M2M1k28K15
2912A94L7Pj98J15q9j14OJ01pQ9P2l49m9M35j11k47m5l1R7m4l8M1LL07j6j18P0
2939A18J6o1j13P1R1m05K75J10j56k7O8j2N9np1l91J83L47k04J25m3j95P6J32
$$ y = [-74, 66, 57, -219, -140, 162, 43, 256, 61, -280, -41, 255, 201, -114, 50, -141, 80, 418, 251, 114, -62, -85, -297, -136, 161, 186, -163, -30, -225, -173, -28, -117, 3, -254, 104, 127, 20, 249, 342, -116, 26, -39, 125, 62, 11, 140, 111, -27, 258, 246, 142, 11, 45, -227, -62, 128, 72, -243, -340, -77, -311, -61, -9, 2, -55, -178, 12, 90, 194, 38, -43, -95, 59, 166, -48, 92, -80, 9, -133, 63, -85, 23, 243, 8, -54, -47, 228, 7, -326, -144, -224, -353, -251, 74, 1, -374, -64, -94, -263, 151, -22, -5, 130, -28, 256, -20, -16, 25, 197, 142, 58, 508, 153, 80, 1, -13, 43, -155, -158, -22, 18, -112, -10, -245, 142, -145, -52, -202, -22, -110, 107, -5, 171, 124, 166, 207, -21, 194, 231, 238, 40, 155, 66, -48, -42, 59, 52, 141, 213, -136, -185, 250, 139, -108, -153, -184, -87, -131, -169, -128, -125, 182, 166, 48, 118, 134, 73, -40, 31, 122, -283, -8, 102, -54, -81, -13, -25, 34, 29, -42, -433, -250, 97, -107, 18, -25, -220, -144, -12]
2963a2O4j06RL56m27K69k24J14K5O8j57J42J7j05j98K95l88M23j15J78j00l41
2985b13R0l5K2J23J66n15K77J53k27P7j18L72l29r3K65J04k44J52O5j50M37o09
3007b30L14K3P1k97J22J60j38J44m15K98j26K64l22N8J8j15J13J79l9l03R0L3
3029i8n1O4m8K59j89M7O8j66o8K65O2L11l00j31j18L55j42j86J38k15J7K01n2
3052B3J86k39O4k55J15J04j99J32j12J19j24J70OJ78j12Jj12L2J71j31K10k37
3074a0L56m04J46r7R4k39K15l33l3L12Qj68O3KQ2l5k71J00L5J70j09N3J83p8j64
3099a22K4J81j21K10j0Mk83J59J92l16J57o6n0j3j54J84j44K06Mo6J59m1l62M85
3123B17l71Q7J23j87J70oK6j04k17J19m0J26J63j09oj87J40J17K07j73q5j16N5
$$ y = [-12, 52, -54, -45, 311, -116, 153, -71, 43, 68, 136, -21, 121, 138, 33, -165, 130, -258, 165, 50, 228, 128, -213, -123, -158, -136, -13, 153, -362, -85, 68, -159, -82, -200, 172, -157, -250, 15, 119, -125, 27, 92, -58, 379, -230, 84, 107, 178, -119, 3, 163, 25, 169, -246, 52, -74, 190, -132, -74, -56, -171, -58, 121, 82, -221, -131, -98, -149, -85, -133, 126, -63, -16, 52, -114, -182, 83, 145, 456, 156, 25, -93, 262, 120, -66, 72, -143, -126, 75, 23, 209, -30, 34, -221, -106, -2, -201, -69, -181, -62, -186, -16, -10, 168, 56, 57, -55, -23, 148, 17, 227, -10, 346, -58, 88, -9, 85, -154, 61, -272, -305, 7, 15, -153, -90, -88, -6, -41, -312, -212, -177, -7, -116, -63, 120, 42, -122, -98, 83, -38, 172, 162, 166, -117, 42, 234, -82, 75, 9, -41, -54, -208, -24, -168, 38, 42, -24, 135, 94, -268, 217, -154, -67, 56, -131, 39, 33, 59, -45, -262, -143, -183, -57, 106, -3, -9, -196, -56, 61, 268, 95, 10, -106, -51]
3146e1J83j34J72j55j37M5J90M6k83L25n26M12p9k3j55n9J81Q5j98L4J1J30K9
3169D3j33J2j01K96k58J15J79l44J7J53J37k00k23L48J47m03K71P8m89L56l0P2
3191D3J14k2l80K93R0n1r7R4J06m41L60l2j21K48k5j02J3J80j37j42K85l50r5
3214a69J75L8n2K4K6J04k90J47j41J0K01k38J47J4K08N6l67J95j81K10j95K09
3236A31m6j71K96j73K67j16j74o8pmQ5J29n3k26K4P7j6j8%J57j85J78k02K37r9
3261B3k5n3k2J99n50J48K98J0p7K03j23n6J74N0k56j3J41J92k20l4J26m33o6L81
3285A7L0L8k30k4M43l72m8R2J03N1l02O6J65Q0j67K26k32k00L31M3l23M13R7m73
3309a76R7K72n70K82J29J42O9j25k10J67j62J44k57K31l13J76p2M7K34r9j9J28
$$ y = [-51, 132, -2, 170, 15, -122, -77, 113, 159, -124, 201, -325, 87, 8, -15, -170, -229, -48, 37, -161, -127, -116, 14, 43, -90, -78, -179, 117, -141, -26, 153, -191, -174, -21, 116, -84, -307, 41, 188, -215, 56, 134, -355, 1, -29, 43, 157, 135, -245, 48, 138, 87, -10, 84, 190, -251, 109, 77, -44, 204, 179, 77, 90, 270, 133, -9, 276, -74, -169, 6, 44, -8, 16, 42, 146, -144, 3, -138, -128, 73, -165, -18, -4, 204, 260, -107, 88, -93, 117, -78, 131, 85, -86, 210, 37, 304, 188, 14, -54, -61, -65, 20, 149, 96, -130, -106, -29, -45, -63, -63, 94, -91, 87, -115, 122, 23, -2, -55, -77, 122, -428, -280, 18, 28, -49, 154, 31, -25, 149, 199, -57, -70, 71, 263, 43, 9, 135, -298, -364, 17, 47, 85, -145, -169, 274, -98, -146, -54, 49, 100, -202, -136, 29, 109, -58, 168, -64, -264, 67, 110, -213, 200, 297, -176, -79, 193, -377, -95, 34, 176, 245, 120, -90, 77, -85, 59, -198, 33, -280, -104, -176, -129, 105, 6, -13, 115]
3331A15k1q7J92k40J65J34q3j33j73K85k47J9K53j10m2Pj58L76l79o2l1Q1J39
3354@l23L36j0r1j02K70L0m14J80J14K66n02K16K42n1l91K93Pk97M78j65k18k4
3377a56J90l18M08L1l58K81l39K59j36L6M4LL82l91k2rJ94k05M3K66j89J7mj30
3401a03J98p9j41L59r8o6m9m4j26K49K9k17L40l23M9j18n2J11R2O0m2P1k57K82
3425A25n2p3Pj30K90j95K15k10L2o6r7L2K62O6j69J12k24J18j44J99J45j51k63
3448a71K43K19k50l7J67j50k18L42j59p2K60r5m36K36J70l8L0K19K31l23k08J13
3470G3m3l0l13K46k3K63j23J16m60K72k62m0J59J8J06j7j13L47k89L05k9j38j24
3493i9K09M0j51j3K2K22k07L88j94k17j92K94R0k35Q3q8Q9N2p1Km1r6J98k20K20
$$ y = [115, 94, 7, 199, -41, 124, 258, 175, 42, -131, 154, -93, -74, 179, 69, 27, 34, -124, 252, -127, -189, -220, -139, 0, -323, 13, 3, -88, -190, 80, 110, -304, -124, -10, 256, -246, -30, 212, 161, -230, 63, 70, -227, 251, 86, -132, -156, 34, -284, 124, 155, -203, 78, -261, -2, -138, -102, -58, -55, 327, -64, -86, -95, 99, -106, -63, 203, 14, 31, 27, -103, 95, 16, -125, 234, 136, 70, 21, -23, -149, 100, 129, -88, 252, -71, -22, -140, -192, -81, 11, 71, 29, 100, -157, 125, 73, 0, 7, -123, 167, -28, 187, -23, 9, -57, -154, -122, 140, 206, 37, 149, -75, 43, -101, 98, 243, 92, -171, 72, 291, 41, 4, 171, 21, -197, 145, -14, -86, 174, 79, -357, -121, 49, 11, 41, 260, 491, 168, -40, 73, 30, 0, -313, -67, -90, 173, 50, 166, -294, -22, -284, -324, -165, -147, -41, -58, -171, 176, -113, 192, 163, 25, -99, 110, 150, -1, -14, 8, 230, 23, 411, 217, 0, -192, 102, 192, -43, 40, -48, 41, 93, 22, 24, -17, -113, 85, -135, 85]
3518H5k00j14K25K52k03j29n8K41J86m19J88J20k17L3O6R3l63J28J77l13K05j55
3540a72K94P4l52M8k79M36k28j53K30j0P6N6j56nK89l29K02K92k40J0m7j63K33
3563A06j13K29l96L17j88r5K79M1q4j53j81PR4K48q6k4J08j22n2J6J9l72K51J39
3587a2k38N80m48M7J24J85j85j0k5j40J53K41l99J6K24j58K8L14k66j21k71J88
3609a73O5O7J52o8j15K7P4k62J42L59k60Q2j2l02K41P5j5q6J07J28j97j19K69
3632A79j22L6l9j96j07J32k30J86L15l7k32J18j37M4J93kj16l75M8N58k79j2K53
3655A78j87n7LK48m0m7Q5q3J15J6m72L30m1n2p3K4J23m21M26rN7j2k22J94p9m6
3681d2j09J59k3K61l45J77j08K71m79M76j12Mj2l1j51J81j31M07m44j88L19p8
$$ y = [85, -115, -229, -4, 248, 45, -84, -142, 99, 285, -134, 54, 174, -43, -10, 56, 149, -214, -86, 91, -222, -17, -172, 122, 196, -156, -108, -387, 49, -179, -332, -102, -112, -36, 20, -136, -141, 148, -181, 21, 313, 73, 83, 36, -127, 106, -7, 222, -174, 143, -45, -140, 139, 180, 96, -57, -238, -231, -137, 111, 25, 1, 109, -13, -65, -49, -30, -402, -151, -12, -250, 330, -118, -71, 53, 238, 53, 43, 18, -122, 31, 272, -127, -111, 113, -45, -17, 297, 31, -90, -361, -173, -108, -41, 111, 43, -72, -45, 29, -233, -91, 268, 8, 90, 78, -224, 17, 92, 77, -9, 98, 226, 29, -90, 179, 57, 93, 54, -142, -249, -117, -347, -161, 154, 117, -115, 3, -134, -90, 103, 101, -15, -390, -342, 216, -63, -75, 178, -9, -66, -63, 185, 145, 98, 183, 100, 215, 231, -241, 89, 48, -4, -77, -53, 70, -351, 75, 66, 123, 111, -111, 83, 4, -42, -151, 8, -15, 246, -99, 78, -30, 241, -238, 238, 126, 130, 118, 87, -64, 117, -14, 393, -51, -239, 80, 2]
3703BK7p5NL9j90J45J33j41m0j8JM97j15k06K25n26L68j62J43P2k5O7n88L31J66
3728A35m31M11j11N6r1j00K50j62l5J13K7j08LN1M0P4k51J22RK5k9k07K37r6K50
3753A82Kk37J04n8J60K0k33K77J2k46J3k23J77p8L92l15J77n5j95J98j29J60j16
3776a1R4J34j37j33J28o3j52J32j71J39M2r0l6j6J33O3m5JM3K79l03L6N6j04l0
3801a1P6J78k60q9J52k71O6M27l39J56n7j63J85j88J85j90J43J87m02L97qk11
3823c7P0m2m6L6J2R5k33J90k64Q7o0j66K90J6o2L38r9k65M2J91k3n8j11j8K81
3848A64l83J05L0P7k46M0J89k9K7K80l01Q5J71k22o4J44l37J4R0M19l10m2N8K8
3872a3l07K53Mj18M51l75K01J02p9j53Q8m5j54K64R5P1j50n6l2J21j75k66L16
$$ y = [2, 29, -46, -41, -2, -192, -47, 86, -55, -95, -113, -112, 385, 270, 64, 289, -237, 131, -31, 112, 184, 159, 226, -362, -31, 135, -296, 115, 4, 60, -31, -131, 119, -43, -78, 35, 62, -46, -43, 8, 48, 122, -129, -7, 2, 27, -2, -209, 28, -68, 182, 184, -53, 51, -7, 153, 173, -60, 217, 229, -17, -4, -227, -50, -128, 264, -51, 126, 71, -124, 74, -55, 105, -11, 83, 217, 80, -53, 75, 12, -140, -8, -179, -40, 2, -88, -124, -140, -7, 56, 11, 12, 55, 334, 31, 67, 123, 19, -11, 65, 243, -17, -106, 46, -225, -159, 268, -71, 85, 28, -135, 50, -138, 47, -143, 0, 187, -215, 182, 174, -37, 33, -9, -55, -19, -7, 88, -145, 45, -219, -132, -192, -358, -68, -52, -114, 224, 125, -140, -98, 93, 70, 12, -99, -117, 164, -219, -114, -84, -7, -253, -213, -24, -53, -26, 254, -47, 38, 209, -13, -77, 67, -270, -256, -166, 253, -57, -99, -41, -13, -320, -67, -63, -181, 270, -105, 96, 198, 119, -34, 54, 9, -145, 119, 214, 285, 135, 79, 47, 168, -7, -273, 43]
3895D3k32J72p8kjJ70j28K27q8J7k40RK77m29K72Q0q6K4r0K14j40p9K42j28q0
3920e4N8k02J7L07J2j2j62m7Qj07L15k38J90q6Q2L7m39K35L67l95KK98j81q8m9
3945a32J1K96l36R7L70k78j45J18j21J75j18j62J92J40k5M4k47N7J65p4Jk7j26
3968a25j42J02r1J11J6K72l1j94L19j62k68J77k2j06O0J67mJ44l01J2OP9O6j28
3992d3r3L08j97K71k40j75M07l26J27j37L00l11K02m53M92k68K93K32l00k5M1
4013A05k50K00p1J21k38K50j67P9p9q8L2J26M1o8k02Q7J24K0pJ83k91L20N9l83
4037i7J03o3K90j59m1Q8j61n6J52k4J39j21n5P0K0r9J25L9m2j72rR2j58K94p6
4062G9J82k02m8j0n2J3J41K2j13j58l29M05L35l32K13k75L26r2L3k05j6Q7R8Q2
$$ y = [43, -189, -17, -95, -97, -98, 72, -56, 171, 83, 100, -140, -131, 146, -283, -11, 69, -17, 7, -83, 131, -9, -88, 154, 26, -54, 4, -198, -181, 126, 138, 126, -36, -83, -75, -182, 133, -105, 85, -1, 81, 118, -321, -86, 281, -114, -112, 186, 5, -83, -132, -121, 175, -161, -64, 306, 28, -117, 1, -120, 55, -63, -225, -33, 107, 82, 126, -121, -64, 101, 27, 28, 1, -125, -267, -165, -256, -145, -129, 143, 112, -82, 237, 75, -193, -16, -38, -144, -84, 83, 79, 223, -78, -66, -60, 19, 85, -43, -136, 172, -25, 246, 6, -169, 238, -88, 39, -98, 202, -109, 93, -360, 132, -136, 157, 389, 89, 64, 105, -145, 55, -16, 105, -133, 117, -50, 29, -50, -138, -106, 20, 61, -7, -209, -122, 2, 22, 15, 198, -93, 227, 286, -97, 6, -57, 233, 74, 33, 121, -40, -96, 56, 32, 171, 50, -5, 65, 85, -14, 111, 150, 108, -64, -73, 19, -139, 155, 79, 261, 59, 11, 1, -51, -38, 103, 125, 12, -146, -475, -70, 265, -67, 146, -129, 197, 105, 138, -67, -83, 4, 102, 184]
4086A84mj35m2J2J00l7k40O4J29m3J54J06l30j04L92k91K72r3J3j39N5J12n9j56
4110h0O7K44l30M63m05M4j9P9r5l6J65j99J78O8l5l65N7K65q6J38J3m43L58L3
4134G9j55N7M67m38O7j80J53lj38J33M0j69K36m2l4j05nJ50M5j97n0q7k9J24N2
4159b9J54m6k07K2n8K01J11k13N6j61O11m68o0o0K58O5j04q5k6M2J34N2n9q3j08
4184f1j02K32j25R3k74J51K66j06m3j59J20k8j47J89j51j12K50p0J23r1J22r7
4206b0J71r8l07M34r5j87J67J2J63k84R3L9O6j4k00M5j14o5N3J32q2l1J80J55
4230B13m92L29l79L50j18Q2qM3J56k24P5m9J77l07M2J14Q5P1k70M3J3k03K85m1
4254a3PK07j09o4r8J36Q8j17j15J88k46J53l65L53R0k43J47j32J24J51rm9qo2
$$ y = [184, 180, 45, 3, 15, 115, 78, -162, -98, 31, -12, 142, 248, -82, -186, 206, -85, 187, 94, 107, -32, 23, 135, 76, -80, -13, 231, -99, 364, -41, 3, -16, 63, -32, -68, 97, -102, 76, 144, 109, -256, -199, 66, -20, 118, 131, -312, 46, 79, -76, -19, 448, 10, 77, -103, 50, 47, -91, 42, 82, -87, 149, 107, 73, -32, -37, 113, 158, -39, -89, -176, -205, -81, -29, 125, 79, -128, -106, -164, 37, 148, -65, -9, -170, 441, -27, -87, -147, 111, 176, 72, -13, -39, 3, 137, 189, 130, 47, -61, -163, 69, -56, 37, -237, -86, 180, 74, 31, -128, -8, -36, -183, 6, -145, -257, -7, -77, 46, -45, 77, -20, 151, 53, -254, 180, 85, -102, 65, 77, 240, -44, 49, 88, 154, 140, -60, -15, -129, -194, -141, -9, -91, -122, 58, 213, -279, 50, -329, 21, -97, -15, -23, 20, 176, -48, 27, -22, 155, -152, -110, 4, 89, 160, -110, -67, -54, -257, 28, -13, -6, 201, 92, 28, -70, 66, 154, 37, -78, 110, -136, 17, -348, 5, 95, -148, -1, -133, -9, 142, 133, 84, 76, 14]
4278A4J1j28J17R2l23K79J09k10j73N8O8N8k50L95j8j93N2j0J10k59P8N2J7J07
4302E3o8M7O4j74n0J05K91k57k16J25m1J39N5l1k24Q8L07j68o9O8O3j12J3m64
4326d56K25L7R7J20m3O8l4K8J74j73K14l12kk7N0J61j8j93K18j66r3k3L3O1K82
4351B28m22P4K04j58R6l51M26r8n9n3nnL83j59k39K58j7q6N1K4k7j92J50o1m2
4376h0J09p9R7r4J3K87l21R8k01m1K04k5o3Q7p8J01J24l47K22R3p7n1j0K07j54
4401B1k8J9j14J28k3J60j66N6k28K45j23k09J40q8K31k1j90J11Nj7J4k61K94M6
4425BL19l48k17O07m78P1L5%q5J19k55J5L6L38j12J3j83L99k38j49j27K34J11
4448A07j80J80l02L54J06n24K40j76J66K58j09j79R5N4k39N8L53k27j96K56j81
$$ y = [14, 25, -103, 14, 106, -217, 62, 171, -39, -212, -154, -86, -28, -278, 117, 99, -94, -42, -52, 58, -201, -123, -71, -54, 53, -15, 32, 96, -78, -128, -23, 268, 11, -205, -80, -121, 18, 73, 42, -182, -94, 213, 45, -24, 44, 107, -5, 8, -456, -231, -194, -97, 23, -20, 48, 14, 42, 216, 43, 257, -55, -57, -84, -34, 127, 109, -84, 134, -32, -125, -148, -115, -54, 228, -194, -120, 84, -74, 22, -329, 97, -1, -60, -113, -118, -123, 260, 101, -138, 120, 103, 17, 68, 92, 65, -127, 23, -38, -80, 29, -50, 47, -47, -34, 253, -68, 30, -171, -212, -8, -33, -96, -9, -87, 14, 138, -209, 13, 106, 29, -22, -32, 175, 21, -7, 12, -102, 26, 3, 163, -3, 53, -175, 70, -53, -262, -122, -210, 21, 0, -190, -79, -74, -91, -77, -338, -44, 2, 321, -27, -244, 363, -115, -44, -9, -9, -94, 25, -230, -215, -179, 159, 47, 60, -123, 276, 38, -111, -238, -4, 107, -73, 107, -195, 159, 265, -259, -19, -195, -29, 229, 120, -59, 36, 90, -149, -91, 262, 35, -161, 95, -86]
4469h6r1K07J56m9q8k0j28K54k05K51j79l07L9Q5K10k04k26L57j07K08r5M2j02
4492g8K14m18R7K01j02j80J95J68N9j52r2P4j71K78j92K29k10R4J75J0k1m73K18
4515g7K26k28R6j46K41o3J0j12J52j66J06p9J55JJ8j20K0L41m55lK36q3k33K92
4539A29k35P0J14j83k8Pj27J47Mr4J24J50j23L8m6J71k91N4j21L45R1k37O8J69
4563A96O4J4l12j72K86n3KmO1m1J00k94K36k16l4K35q4J03R6k7j98n4L63j99j60
4588i2K69l8l58K05J75r1N9p0O9m4N0r2j54n0J92K9k23J13l5J43J11k64J19l19
4612b96L73%j60K62m8j84j37J78n2K79j50k7N6j3r2K97k73J12p5J82k65j92J29
4635i6J91N1k23J75k09M36k86j23K07l1l35J52L0n5P8j97J49r4J81J82k67j9M9
$$ y = [-86, -177, 30, 186, 137, 49, 29, -99, 155, -50, 201, 22, -285, -246, -161, 49, -155, -381, -24, -131, 77, -18, 24, -78, 136, -282, -185, 16, -86, -266, -71, 97, 156, 4, -88, -14, -185, 93, -99, 130, -80, 14, 189, 199, 178, -295, -77, 149, -79, 17, -129, 112, 49, 59, -53, 99, -67, 39, -40, 115, 116, 134, 14, 34, 375, -80, -83, 153, 70, -163, 129, -106, -36, 78, -105, -133, -126, -253, -106, -102, -196, -72, 78, -45, -7, -53, 118, -173, -119, -240, 105, 196, -41, 27, 196, 260, 274, -38, -210, 76, 23, 25, 21, 82, 41, 141, -153, 83, -133, -167, 68, -16, 87, 183, 156, -42, -96, 267, 68, -92, 177, 139, -219, -14, 161, 70, 129, 59, 128, 84, 134, 42, -112, -162, 30, 59, -164, -51, -86, 57, 168, -96, 23, -296, 77, 77, -83, 179, 131, -53, -190, -12, -64, 215, 65, 38, 94, 81, -11, 286, 13, 125, 50, 232, -33, -225, -96, 95, 146, -77, 98, -111, 325, 39, -84, 123, 92, -243, -91, -61, -116, -38, -235, -86, -180, 1, 183, -84, -103, -54]
4658e4J64J50l47P9M4Jk55M31k46J06o9r2O5k10K83r9J12q3r6r8K18j98J57J15
4682G8m9P9j14P0j74J90j90K28k9J13k82K6L82k57J37k3ol27R7Q5j7k6j39J06
4706d2N2n9K55l26J34J64j85n4M2O4j70J38L7J55p0k36j95M58Mk01N1j6K32l36
4730a04L00o6r1lM4K23j17k27R9j17J35j89K50j01k02P4n1L45k79N7K1O7P4Q0
4754B22m3k95J7l2J00o6j4J29Pj86J93k48L12l57J38K63r2r4KJ2k7M4m3L5Q8l74
4780c09M45q0J38l36o3K38PK03j76j31n6j2J68J84l39J16j1m6N2j54K22kM9j38
4804c1m8K31p7R5k33q6K02j02L7J51m9l05L75j60mK19j29q4l9L09j40k18J89K3
4828A26j61J16l00J94M6p9J73n8J5j3m9j19K14j52j42K61m8J84p0l56L30k87q0
$$ y = [-54, 110, 260, -87, -8, 36, 37, -218, 213, -33, 73, 4, -88, -23, -233, 50, -49, 63, -20, -116, -214, 4, -194, -37, 78, 29, 108, -6, 64, -110, 80, -110, 118, 89, 202, -80, -54, 328, 71, 208, 185, 179, -148, -51, 34, 17, -9, -148, -42, 10, -49, 206, -120, 14, 178, -7, -61, -19, 45, -125, 13, 50, 205, 135, -101, -296, 162, 166, -35, 16, 0, 232, -104, 196, 130, 39, 36, 80, 303, 186, -41, 58, -59, 76, -113, 137, 36, -166, -92, -143, 202, -77, -20, 1, 68, 142, 222, 179, -116, -99, -131, -31, -97, -111, 18, 25, -161, 32, -216, 96, -261, -123, 140, 48, -46, -44, -32, -59, -15, -58, -23, 65, -309, 136, 56, 194, -142, -205, 33, 40, 243, 67, -64, -120, -132, 36, 220, -119, -3, -14, -60, -8, -162, 60, 58, 107, -31, -79, 152, 75, 170, -63, -149, 53, -49, -12, 139, 90, -215, 160, 0, -4, 215, 86, 2, -37, 272, 132, -86, 103, 126, -35, 81, -219, -25, 21, -58, 115, 57, 72, 59, 10, -109, 105, -47, -189, 72, 24, 208, 138, -218, 112, -175, -255]
4851b55L04k03J27j06l7K80K3p2m80M49Mr1j29M76l13j4rp1J12L0nj22R8k3m0
4876f7p9L49l58K69j95J93k67J30j70J72k35M71l17M1Q2K67m55K15lr8jj00K80
4899A24k53K40k57J23P7j55J28j03k00J50J99j99j60L16k45L98p1J35Po7r0j13
4921a6j26LK6O2Q3j51L0R5J41o3o8p1K41l45R5M3j56J38Kp3j52K91Q4l77L41M2
4947A19l19K61N4j4k4P5p7J12l03pK49j27J31j53q5J70p5r2L36j42M3k72J19K7
4971FJ75k19J44l9L55k77j32J12k98q0P5L52k31K37k99K29k51M78j10o8l9m0J61
4994B41j11M1J30m31J37K13l32R0k03K26j29K16j67M5q2J62K07k80j04J46kn9
5016d6J58l21L9K73j81R3k0n0L8J26Q3k87p3M22j88k90J08k15N27l20J36o1j44
$$ y = [-255, 49, -154, -27, -133, -170, 110, 133, 61, -419, 30, 34, -57, -186, 290, -23, -37, -46, -117, -5, 25, 20, -102, -4, -27, -67, -146, 203, -155, 114, -81, 112, -155, -25, -195, -23, -258, 213, -104, -63, 19, 286, -169, 46, 43, -55, -56, -156, 124, -129, 111, -146, -23, 54, -101, 27, -76, -276, -126, 73, -126, -286, 30, -215, 183, 112, 247, 254, 187, 97, -16, -142, -139, -113, -51, 32, -119, -89, 6, 147, 84, 16, -55, 186, -159, -64, -21, -177, -39, -37, -110, -262, 29, 113, -264, 77, 119, -200, 61, 115, 101, 77, 152, 75, 187, -116, -123, 126, -1, 130, -23, -108, 62, -13, -105, 231, 89, 132, -140, -21, 6, 181, -38, 106, 67, 422, 145, 13, 125, -173, -253, -178, 174, -57, 180, -119, 110, -141, 337, 227, 159, 120, 80, 241, 130, 171, 301, -130, 7, 220, -112, -22, -225, 1, -128, 88, -79, -34, -116, 46, 253, -27, -131, 15, 13, -46, 112, -209, -170, 103, -78, 15, -5, -55, -17, 109, 192, -95, -168, 254, 66, -224, -116, -331, 196, -124, 12, -49, -193]
5039a93J73n9J68l6M4j63K18j16pP4j79J25J60k77q2J88j4j18K79k29k42J6K77
5062GM4Nk1l5j17k90L79q5R4p6o6M16k72q0M9L8K38l96K27r9J75l40L9Q4L44k55
5088GnN3j77L88j90l08M6L2J07K07k25K36p6j79P8q6K57p5j06k58N42k77J54k00
5112e5P1N2j16O3k3n7j04M44l48Po1L10j25l80K36J19O6m47N41k60n1J55k7K4
5136C4o9k15L61J31k59r3R4m0J28J41l50m5J98r6K02j49l42P08o27M60k28J53
5158I7o7N7m4l38K82J3R1l8M7j60L7J16j44P1J48k21J68j94J01j63K71k45J9J46
5182E0r5K6l18K23n7qJ63o2L00j52Kr2k33R5MM02l59j57J37J82k02J60LK1J06
5207A39K3mKk42K33r8q6m0R8kK6J64j60k45N9M4M3J36r8K7N7J58j23o7j23J10
$$ y = [-193, -20, -79, 89, 53, 97, -66, 152, 36, 29, 103, -76, 49, 209, -68, -150, 38, 24, -94, 185, -44, -286, -270, 7, 51, 56, 35, 0, -117, -407, -28, -113, -19, -95, -161, 255, -17, -97, -48, -10, 228, -168, 59, -40, 135, -205, -166, -82, 262, 7, 2, 55, -122, 266, 76, -232, -186, -154, -47, 160, -65, 171, 95, -84, -6, -92, 165, 90, -16, -274, 268, -9, 145, -55, 16, 68, -48, 15, -8, -65, -169, 275, -73, -66, -127, 183, 58, -322, -86, 33, 99, -348, 193, -67, -118, 37, 10, 34, -35, -250, 111, 242, -17, -110, -16, -56, 72, 213, -137, -182, 16, -80, 122, -27, -369, 339, -288, 172, -56, 97, 30, 87, 43, -295, -13, 0, 91, 53, 100, -60, -23, 93, -51, 20, 168, -53, 115, -79, 22, -141, 130, -115, -96, 50, -45, -19, -337, -114, -171, -179, -16, -78, 222, 70, 72, -20, -253, -158, -154, 248, -111, -268, -131, 51, -151, 9, 12, 33, 139, 162, 158, 160, -82, 151, 53, -33, -73, 25, 23, 49, 213, 53, -192, -133, -89, -46, 90, -8, 19, 76, 234, 111, 44, -79, 31]
5233C1p1P7j7Pk47o2M30j09J50k09O4o3L18j21j40j07J70k08J12n8k38K76L9m9
5257b5p5R5M7k05J04O3J48j11j05J02p3j60L75k49l6K96j38N4K4J33k27J67k38
5280c4J32P0k62J20K76k22l01J54j08M62j37Q6k48O9k28R1K8O2J20j3p9r7K05
5303A46j55K3K3K49l53J97j28R4j16q7J24j11J27j46kP4k53K47J63j74J19j1m3
5326Gq6p0L9q8L04j20O5j31K44j41j57J94J20k09j71O7K43K08o17M57k57J29N
5349C5j38J86j08O9m3j13J86j22J89k43K42m3j01q0M7J19M9j46k15O9J32J38j52
5372d3J44r6J43R0j62p8J5j69K43j51K51k62L09l11K65l34J0L35L1k21k21J13
5394i9M1j31R2L72k70p3J70l8j67K8r3J78J9R0Mo4Jp0o9R4Q9k00K63l5j60j0m1
$$ y = [31, -40, 37, 20, 27, -220, -282, 148, 39, 189, -20, 44, -19, 299, 178, 38, -69, 101, -107, 5, -53, -291, -15, 24, -25, -100, -5, 42, -163, -59, 4, 152, 41, -64, 38, -35, -195, 180, -69, -105, 191, 53, 107, 131, 264, 37, 204, -34, 98, 168, -94, 26, 302, 80, -221, -67, -175, 287, 150, 236, -12, 57, -171, -80, -52, 10, 130, 117, 38, -59, 146, -9, 14, 37, 286, -67, 130, 2, 96, -20, -107, 17, -94, 33, -113, -115, -41, -294, -47, 116, -58, 61, 50, 7, -79, -149, -110, -198, 106, -14, 51, -80, 164, 23, -134, 60, 180, -29, -200, -133, 110, 318, -299, 158, -99, 30, 35, -103, 83, -25, 44, 1, -112, 74, -48, 141, -102, 140, 97, -4, -84, -37, 82, 131, -15, -230, -161, -29, 109, -43, 101, 5, 148, 238, 76, -2, 13, -156, 87, -64, 187, -75, 234, -77, 188, -146, -136, 199, 230, 9, -212, -99, -58, -189, -97, 275, 5, -68, 102, 64, -103, -75, -168, 10, 29, 119, 123, 59, 60, -10, -79, 15, 104, -96, 167, 132, -28, -38, -79]
5421g9J40l5o5q9J69j29K14j07oK2j62m1J12K24j55j5L6J69k51q1J2L53j04j0
5445A22k03O6k43L76j69K37k52J44k9n2K36k21p5K10j78j17L27j58l0N6J84k33
5467bJ21k72r0O4L23j89J11j2k65N3J58J79Nk74J26j14J37j01L9J61j66k17K55
5490C0k6j7P2l2j7O7p2o7J52J16r1k06J95j86O3J41j42J53j26r0l8j92K81j4K0
5515b6m2L4o5J25r5j24K08r8J5J80Jj3k69J80J18j54r4K01J24J3k05k72L25l30
5539b63J2J43L60l39O3J04k30P7J98j22j28K50j22JN5Jj84R7K74r3o1k4j64L55
5563B60j55J3p4M9J92k21j02L2L1j71L15k45K07k07L64k79l00L91j09j7m3J93
5585A24r2O0J79k46n0R3l7j10j53K65K5k1J41j52l4j98K60K46l21J01j18l5J10
$$ y = [-79, 61, 26, -39, -128, 41, -88, 126, 19, 13, 35, -127, -168, -56, 168, 13, -2, 34, 203, -48, -129, -117, 236, 132, 122, -81, -15, -258, 118, -51, 186, -66, 78, 49, -3, 233, 12, -63, 147, -31, -148, 179, 21, -9, 47, 231, -2, 119, -153, -243, -179, 144, -45, 66, 54, -211, -158, 0, 179, 184, -90, 36, -78, 59, -42, -3, 158, -8, -225, 30, 4, -13, 59, 27, 10, 77, 5, -62, 90, 206, 115, -91, 104, -82, -19, 122, -20, 133, 7, -83, -121, -313, -32, -46, -26, -68, -34, -99, 26, -69, -193, 15, -83, -68, 112, 113, 100, -169, 11, 129, -25, -119, 82, 206, 219, 14, -258, 67, -263, -251, -108, 252, -87, -24, 80, -150, -73, 125, 3, -125, 125, 3, 4, 59, 60, -124, -27, 247, 154, 93, 69, -95, 260, 105, 118, 44, 93, 285, 64, -38, -6, 25, -146, 169, -76, 131, -76, 288, 9, -291, 100, -9, -26, -69, 124, 32, 92, 271, 25, -25, 68, 31, -79, -232, 33, 58, 37, 178, 26, -8, -206, 54, 300, -21, 80, -38, -73, 37]
5608C7j61J51K84l40j19K55j41J9q1J44J57l69O0M0j34J26J07j70L03j93M0K52
5630B67l86j13K72Q4J74n02P7L90l98J78J42l89J39j8K29K4o5j88J19P9q9j73
5652a47K50k41J85n8j07m5K39o4M4p7J19o3n7n8k2J08k14K00r3q7j17L88K51j39
5676A95m08N32k91l0l1K00k35J04l1M9k91M38k61K76l34J47j00RK29N9n6k10j34
5699a74K83kJ00m18P8K11j88qP5M1q1J28p5K96k08R6k85J64k7Mj65J45J24J14
5723B28k65j25J45Rr6J94O8k77j8J27j28K04o2P8j95P5m02O25j50l16J69L24k09
5746CK1m6q9M8L0O3j64J66R0j40k2o0J82j71O8m2l7K99l1l44K98J03j06j32k7
5771d0P6J28j10k38L65j07q3M0J31j80n8p5jJ17l0M0L8P2K26M6l34M4k08J24k5
$$ y = [37, -124, 27, 311, -29, -148, 107, -34, -15, -96, 48, 205, -164, -104, -64, -198, -72, 35, -135, 168, -25, 15, 267, -119, -232, 40, 124, 298, -204, -127, 263, -135, 43, 185, -204, -65, -83, 146, 170, 105, -83, 36, 115, 26, -147, 103, -138, 47, -11, -118, -163, 76, 12, 56, -21, 98, 35, -22, -80, -102, 6, -208, -8, -101, -188, -305, 83, 334, 195, -213, 319, 28, -2, -33, 167, -68, 36, 5, 54, -237, 201, -60, 216, -118, 29, -71, -62, 167, 226, 170, -40, -174, 109, 107, 207, -211, -133, 78, -110, -118, -43, -2, -83, 45, -30, 266, 58, 154, -131, 33, 6, 10, -155, -10, 114, 228, -37, -162, -17, -8, -104, 90, 158, -119, -137, -10, -138, 66, 4, 82, -113, -38, -440, 185, 35, -281, -112, 212, 3, 24, -22, -111, -63, -33, 30, -134, 32, 122, -18, -40, -100, 82, -89, -21, -63, -100, 199, 168, -176, 122, 225, 119, -13, -40, 36, 164, 54, -184, 181, 74, -9, 31, 162, -18, -76, -151, -152, -35, -65, -25, 13, 85, 311, 357, 23, 67, -141, -17, -42]
5796d2j37JJ50j2Q2J27L7l07j4K26J90k02O0k42j01L7L13J6R7k05k78J40L38k74
5820@j31R9J39l10O75m42J6J4M6j34m9K28J27k65k44L58L7j41m11N85o1n5l20
5843b39K15m0P7J72p3p6jO0j32K13j57j54J65K0q8J69k69j47L40j22J24J61o4
5866A54l28J95p1J03P9R3n66O2l2L74n2nj22LJ74n0k26K29J76j78Q4j22o0j1p
5891a04k7J60J69l13L5J67l17K72L5Qj71j43J51m9Q8J03Q5m12L28J04k41m5J66
5914D9l3K47k54k6J11l28K04j31L6K05j8j03K7K99k57R4j56L37k83Q3k42K76k31
5937i4K97j85L4k09J35j06J31J21J6pj43M9j88J70L1n7pL7j8p0P0N0p0j97M74
5962B64l05J19J31j16N0j67K74l60K32j56J01j41j40L67l53L2J12K28j35p1J90
$$ y = [-42, -179, -178, -28, -40, 42, 169, 206, -101, -115, 111, 301, 99, 159, -83, -184, -147, 166, 182, 279, 74, -204, -64, 274, 0, -131, -32, 107, -203, 472, 30, 46, 60, 106, -28, -77, 151, 278, 13, -231, 127, 164, 23, -388, 197, 136, 81, -239, -24, -64, 13, 185, 112, 36, 35, 95, -37, 176, 19, -135, 30, 50, -38, 131, -138, -285, 55, -67, 57, 218, 154, -174, 21, -50, 53, 132, 225, -341, -279, -311, 63, 11, 6, -116, -113, 61, 11, -215, 14, 190, 12, 96, -26, -86, -97, -104, -131, 29, 198, -115, -80, 87, -230, 42, 77, 85, -86, -229, -78, -127, -39, 64, 149, -263, 65, 169, -72, -117, 49, 16, 263, 9, -17, 94, -234, -30, -161, -125, 80, 62, -41, -14, 285, 28, 122, -34, 303, 20, 103, -139, 137, -94, 203, 18, 52, -157, -22, -128, 3, 124, 140, 133, -10, 39, -149, 21, 52, -5, -12, 25, 7, -63, 7, 57, -13, -210, 264, -41, 78, 209, 93, 143, -24, 250, -110, 122, -34, 67, -74, -214, 153, -200, -168, -56, 172, 37, -34, 156]
5983A56o5j2j27K07j91j43J68R5j73kK79m44J5N29k69j37R0k02K56P3j64J5J78
6006A32k17O5j1OJ02j20j44L11l69L18p8Lo9N0r0J53k99M20k02QJ03j83K25k36
6030a22K59j30j20J98k2P3j79J13j2k56l01L78n5J85N0o2K07n4N2k61J22l40L12
6053C5J48k14J3p2j6J87j55k7K9P3p1K40j83J51R1k74o8K82l85M22Jk60KJ62K9
6078A40l9J19j86J14L2j90l5Q3k02J20j5LJ80K0j96j81L07n2J61o5j02j61K79
$$ y = [156, 91, 79, -48, 159, -32, -175, -7, 88, -85, -87, 192, -252, -237, 292, 23, -114, -24, -226, 30, 103, -61, -46, 132, -85, -20, -31, -25, 77, -43, -187, 124, -245, 73, -5, -2, -71, -21, -111, 42, -257, 163, -39, -31, 72, -111, 114, -122, 137, 7, -113, 85, 63, 136, -43, 70, 58, -198, -499, -121, -176, 9, 59, -3, 204, 150, 202, -59, 63, -277, 35, 183, -31, -18, -90, -106, 81, -74, -101, -72, 1, -70, 170, -13, 138, 229, -45, -113, 169, -216, 206, 207, -53, -51, 111, 140, 101, 220, 34, 148, 180, -10, -45, 38, -164, -44, -59, -56, 124, 144, -52, -233, 74, 22, 183, 118, 16, -145, 134]
$$ [...]
8191g0
##END NTUPLES=NMR FID
##END=
