##TITLE=1H_Ser Am-4-i
 CDCl3
 8 sc, 
 18.11.2022
##JCAMPDX= 6.0         $$ Bruker NMR JCAMP-DX V2.0
##DATA TYPE= NMR FID
##DATA CLASS= NTUPLES
##ORIGIN= UXNMR, Bruker Analytische Messtechnik GmbH
##OWNER= root
$$ XWIN-NMR		Version 3.5
$$ Fri Nov 18 13:57:05 2022 Russian Standard Time (UT+4h)  she@DPX200
##.OBSERVE FREQUENCY= 200.1313499994
##.OBSERVE NUCLEUS= ^1H
##.DELAY= (6, 6)
##.ACQUISITION MODE= SIMULTANEOUS
##.ACQUISITION SCHEME= undefined
##.AVERAGES= 8
##.DIGITISER RES= 18
##SPECTROMETER/DATA SYSTEM= spect
##.PULSE SEQUENCE= zg30
##.SOLVENT NAME= CDCl3
##.SHIFT REFERENCE= (INTERNAL, CDCl3, 0, 15.7039)
##AUDIT TRAIL= $$ (NUMBER, WHEN, WHO, WHERE, WHAT)
$$ ##TITLE= Audit trail, XWIN-NMR		Version 3.5
$$ ##JCAMPDX= 5.01
$$ ##ORIGIN= Bruker BioSpin GmbH
$$ ##OWNER= she
$$ F:/spectra/data/she/nmr/H-F/1/audita.txt
$$ ##AUDIT TRAIL=  $$ (NUMBER, WHEN, WHO, WHERE, WHAT)
(   1,<2022-11-18 13:55:41.37 +0400>,<she>,<DPX200>,
      <created by zg, POWCHK disabled, PULCHK disabled
       configuration hash MD5:
       00 E9 B6 7A A2 85 ED C7 34 08 36 98 17 FE 4E 26
       data hash MD5: 16K
       62 59 9B 5E F0 1E 3C 48 93 56 E3 07 A7 C8 F3 41>)
$$ ##END=
$$ 
$$ hash MD5
$$ 5B 3E 94 EC 2C 7A 6E 70 E3 8D B7 49 C5 7D 4D 77
##$RELAX= 
##$RELAX= 
##$RELAX= 
##$RELAX= 
##$RELAX= 
##$RELAX= 
$$ Bruker specific parameters
$$ --------------------------
##$DU= <F:/spectra>
##$EXPNO= 1
##$NAME= <H-F>
##$PROCNO= 1
##$TYPE= <nmr>
##$USER= <she>
##$AMP= (0..31)
100 100 100 100 100 100 100 100 100 100 100 100 100 100 100 100 100 100 
100 100 100 100 100 100 100 100 100 100 100 100 100 100 
##$AQSEQ= 0
##$AQ_mod= 1
##$AUNM= <au_zg>
##$AUTOPOS= <>
##$BF1= 200.13
##$BF2= 200.13
##$BF3= 200.13
##$BF4= 200.13
##$BF5= 200.13
##$BF6= 200.13
##$BF7= 200.13
##$BF8= 200.13
##$BYTORDA= 1
##$CFDGTYP= 0
##$CFRGTYP= 5
##$CHEMSTR= <none>
##$CNST= (0..31)
1 1 145 1 1 1 1 1 1 1 1 1 1 1 1 1 1 1 1 1 1 1 1 1 1 1 1 1 1 1 1 1 
##$CPDPRG= <>
##$CPDPRG1= <>
##$CPDPRG2= <>
##$CPDPRG3= <>
##$CPDPRG4= <mlev>
##$CPDPRG5= <mlev>
##$CPDPRG6= <mlev>
##$CPDPRG7= <mlev>
##$CPDPRG8= <mlev>
##$CPDPRGB= <>
##$CPDPRGT= <>
##$D= (0..31)
0 1.2 0 0 0 0 0 0 0 0.06 0 0.03 0 0 0 0 0.0002 0 0 0 0 0 0 0 0 0 0 0 0 
0 0 0 
##$DATE= 1668765340
##$DBL= (0..7)
120 120 120 120 120 120 120 120 
##$DBP= (0..7)
150 150 150 150 150 150 150 150 
##$DBP07= 0
##$DBPNAM0= <>
##$DBPNAM1= <>
##$DBPNAM2= <>
##$DBPNAM3= <>
##$DBPNAM4= <>
##$DBPNAM5= <>
##$DBPNAM6= <>
##$DBPNAM7= <>
##$DBPOAL= (0..7)
0.5 0.5 0.5 0.5 0.5 0.5 0.5 0.5 
##$DBPOFFS= (0..7)
0 0 0 0 0 0 0 0 
##$DE= 6
##$DECBNUC= <off>
##$DECIM= 32
##$DECNUC= <off>
##$DECSTAT= 4
##$DIGMOD= 1
##$DIGTYP= 9
##$DL= (0..7)
0 120 120 120 120 120 120 120 
##$DP= (0..7)
150 150 150 150 150 150 150 150 
##$DP07= 0
##$DPNAME0= <>
##$DPNAME1= <>
##$DPNAME2= <>
##$DPNAME3= <>
##$DPNAME4= <>
##$DPNAME5= <>
##$DPNAME6= <>
##$DPNAME7= <>
##$DPOAL= (0..7)
0.5 0.5 0.5 0.5 0.5 0.5 0.5 0.5 
##$DPOFFS= (0..7)
0 0 0 0 0 0 0 0 
##$DQDMODE= 0
##$DR= 18
##$DS= 0
##$DSLIST= <SSSSSSSSSSSSSSS>
$$ [...]
##$SUBNAM2= <"">
##$SUBNAM3= <"">
##$SUBNAM4= <"">
##$SUBNAM5= <"">
##$SUBNAM6= <"">
##$SUBNAM7= <"">
##$SUBNAM8= <"">
##$SUBNAM9= <"">
##$SW= 18.0517283424941
##$SWIBOX= (0..15)
0 0 2 0 0 0 0 0 0 0 0 0 0 0 0 0 
##$SW_h= 3612.71676300578
##$TD= 16384
##$TD0= 1
##$TE= 0
##$TE2= 300
##$TE3= 300
##$TEG= 300
##$TL= (0..7)
0 120 120 120 120 120 120 120 
##$TP= (0..7)
150 150 150 150 150 150 150 150 
##$TP07= 0
##$TPNAME0= <>
##$TPNAME1= <>
##$TPNAME2= <>
##$TPNAME3= <>
##$TPNAME4= <>
##$TPNAME5= <>
##$TPNAME6= <>
##$TPNAME7= <>
##$TPOAL= (0..7)
0.5 0.5 0.5 0.5 0.5 0.5 0.5 0.5 
##$TPOFFS= (0..7)
0 0 0 0 0 0 0 0 
##$TUNHIN= 0
##$TUNHOUT= 0
##$TUNXOUT= 0
##$USERA1= <user>
##$USERA2= <user>
##$USERA3= <user>
##$USERA4= <user>
##$USERA5= <user>
##$V9= 5
##$VALIST= <valist>
##$VCLIST= <CCCCCCCCCCCCCCC>
##$VD= 0
##$VDLIST= <DDDDDDDDDDDDDDD>
##$VPLIST= <PPPPPPPPPPPPPPP>
##$VTLIST= <TTTTTTTTTTTTTTT>
##$WBST= 1024
##$WBSW= 4
##$XGAIN= (0..3)
0 0 0 0 
##$XL= 0
##$YL= 0
##$YMAX_a= 172263
##$YMIN_a= -270585
##$ZGOPTNS= <>
##$ZL1= 120
##$ZL2= 120
##$ZL3= 120
##$ZL4= 120
##$ABSF1= 10
##$ABSF2= 0
##$ABSG= 5
##$ABSL= 3
##$ALPHA= 0
##$AQORDER= 0
##$ASSFAC= 0
##$ASSFACI= 0
##$ASSFACX= 0
##$ASSWID= 0
##$AUNMP= <proc_1d>
##$AZFE= 0.1
##$AZFW= 0.1
##$BCFW= 1
##$BC_mod= 2
##$BYTORDP= 1
##$COROFFS= 0
##$CY= 11.3945322036743
##$DATMOD= 1
##$DC= 2
##$DFILT= <>
##$DTYPP= 0
##$F1P= 2.36226072786647
##$F2P= -0.459571619588291
##$FCOR= 0.5
##$FTSIZE= 0
##$FT_mod= 4
##$GAMMA= 1
##$GB= 0.15
##$INTBC= 1
##$INTSCL= 1
##$ISEN= 128
##$LB= 0.24
##$LEV0= 0
##$LPBIN= 0
##$MAXI= 10000
##$MC2= 0
##$MEAN= 0
##$ME_mod= 0
##$MI= 1.114404
##$NCOEF= 0
##$NC_proc= 0
##$NLEV= 6
##$NOISF1= 3.799351
##$NOISF2= 2.8
##$NSP= 1
##$NTH_PI= 0
##$NZP= 0
##$OFFSET= 15.70392
##$PC= 1
##$PHC0= -18031.39
##$PHC1= 13.2007
##$PH_mod= 1
##$PKNL= yes
##$PPARMOD= 0
##$PSCAL= 0
##$PSIGN= 0
##$REVERSE= no
##$SF= 200.130013532006
##$SI= 16384
##$SIGF1= 3
##$SIGF2= 2
##$SINO= 400
##$SIOLD= 16384
##$SREGLST= <1H.CDCl3>
##$SSB= 0
##$STSI= 0
##$STSR= 0
##$SW_p= 3612.71676300578
##$SYMM= 0
##$S_DEV= 0
##$TDeff= 0
##$TDoff= 0
##$TI= <>
##$TILT= no
##$TM1= 0
##$TM2= 0
##$TOPLEV= 0
##$USERP1= <user>
##$USERP2= <user>
##$USERP3= <user>
##$USERP4= <user>
##$USERP5= <user>
##$WDW= 1
##$XDIM= 8192
##$YMAX_p= 0
##$YMIN_p= 0
$$ End of Bruker specific parameters
$$ ---------------------------------
##NTUPLES= NMR FID
##VAR_NAME=  TIME,          FID/REAL,        FID/IMAG
##SYMBOL=    X,             R,               I
##VAR_TYPE=  INDEPENDENT,   DEPENDENT,       DEPENDENT
##VAR_FORM=  AFFN,          ASDF,            ASDF
##VAR_DIM=   8192,          8192,            8192
##UNITS=     SECONDS,       ARBITRARY UNITS, ARBITRARY UNITS
##FACTOR=    0.0002768,     1,               1
##FIRST=     0,             0,               0
##LAST=      2.2672688,     0,               0
##MIN=       0,             -270585,         0
##MAX=       2.2672688,     172263,          0
$$ Real data points
##PAGE= N=1
##DATA TABLE= (X++(R..R)), XYDATA
$$ [...]
1910a839R04L394k992j939L899L52m408K090K935l347q88L754r00l740K605K465
$$ -1839 -935 2459 -533 -2472 1427 1779 -2629 -539 2396 -951 -1839 1915 1015 -2725 -120 2345
1926B345l594n94L547j559k722L152J323l689P17L423k259k136L454N70l909J582
$$ 2345 -1249 -1843 1704 145 -2577 575 1898 -1791 -1074 2349 90 -2046 1408 1978 -1931 -349
1942c49L060l052j440L254k22l650K170K618l703p64L736q30l265K799J659l556
$$ -349 2711 -341 -1781 1473 1251 -2399 -229 2389 -1314 -2078 1658 828 -2437 362 2021 -1535
1958a535N0L484j748k682L052J014l623J050K837k292j585L378J49l234J753K140
$$ -1535 -1485 1999 251 -2431 621 1635 -1988 -938 1899 -393 -1978 1400 1549 -1685 68 2208
1974B208k495j130L170n94l175K018J981l233l51L321j521k586K807J377l275
$$ 2208 -287 -1417 1753 1159 -2016 2 1983 -1250 -1601 1720 199 -2387 420 1797 -1478
1989a478M58K680k036j318K718J36l105J306K392k010j462K606m5k455J759J894
$$ -1478 -1020 1660 -376 -1694 1024 1160 -1945 -639 1753 -257 -1719 887 842 -1613 146 2040
2005B040k741p85L110p41j972J625J120k663L08K215j478j956K248N66k588J218
$$ 2040 -701 -1486 1624 883 -1089 536 1656 -1007 -699 1516 38 -1918 330 896 -1692 -474
2021d74J910j927j321K707J31k244J113J349j787m06K574r81j969J350J390k150
$$ -474 1436 -491 -1812 895 1026 -1218 -105 1244 -543 -949 1625 644 -1325 25 1415 -735
2037g35J5K303j332j595J915J006k048k23J740q00r56J494m2k023M67J726j354
$$ -735 -720 1583 251 -1344 571 1577 -471 -694 1046 246 -710 784 742 -1281 -814 912 -442
2054d42o57J476l00j366J295J136j235o95J644l99r95J304O14j999L19J073o15
$$ -442 -1099 377 77 -1289 6 1142 -93 -788 856 457 -538 766 1380 -619 -300 773 158
2071A58r18J072K35j226L66J548j221q99J370j0r73K77R21j140l78J146j93p64
$$ 158 -760 312 547 -679 -313 1235 14 -885 485 475 -498 -221 700 -440 -818 328 135 -629
2089f29N11M30r74Q0J131m38q06Q08N63r10J26J085p19q69R21Q0n56q8O95r56
$$ -629 -118 312 -662 -582 549 111 -695 113 676 -234 -108 977 258 -611 310 390 -166 -254 441 -515
2109e15j38Q93l32n33N80M53p15J76O31m37l63L69%n66Q1K83j35k27Q31l60J06
$$ -515 -653 240 -92 -625 -45 408 -307 -131 500 63 -300 69 69 -497 -416 -133 -268 -495 336 -24 82
2130H2k39M34j5k16K21P8l23J64r0r8j27K76j75p0q7k08L01l7J15L19m80NJ66
$$ 82 -157 277 262 46 267 345 22 186 96 -2 -129 147 -28 -98 -185 -393 -92 -129 -14 305 -175 -170 -4
2153dK17q7k03j3J96m58M19J22k13k38M37K43l80J05J09l45J06L36J27n95KL01
$$ -4 213 126 -77 -90 106 -352 67 189 -24 -262 175 418 38 143 252 -93 13 349 476 -119 -117 184
2175A84j07k81L57k93l88J25O31l97l94O21l92j85R16J48q06q5Q58m70j34M72
$$ 184 77 -204 153 -140 -528 -403 228 -169 -563 58 -334 -519 397 545 -261 -346 512 42 -92 380
2195C80k21q98M76J040n70o86Q57N3o58N50K32o90l66J117k00j163N17P40j014
$$ 380 159 -739 -263 777 207 -479 378 431 -227 323 555 -135 -501 616 416 -747 -230 510 -504
2214e04n6J207p36q74R03N45r50L62Q11q79o00J381K03j027J82J178j250o73J661
$$ -504 -560 647 -89 -963 -60 485 -465 -103 708 -171 -771 610 813 -214 -32 1146 -104 -777 884
2233H84k39j304N85R02j197j23J319m42j325J164P01j532r2J312j044q27J642
$$ 884 645 -659 -74 828 -369 -492 827 385 -940 224 925 -607 -699 613 -431 -1258 384
2250C84J76j648N25J039o83m50J388p5j623J106J352j577m46J452n10j380J108
$$ 384 560 -1088 -563 476 -207 -657 731 656 -967 139 1491 -86 -532 920 410 -970 138
2267A38R44j540m84J799r76q95J516L17j546K20J412j123q15J232L40j307O34
$$ 138 1082 -458 -942 857 -119 -1014 502 819 -727 -507 905 -218 -1033 199 539 -768 -134
2284a34J172j601p02J975o8j566R93J060j532k67K205r55j491J334O70j589j14
$$ -134 1038 -563 -1265 710 642 -924 69 1129 -403 -670 1535 580 -911 423 1093 -496 -610
2301f10J527j107j243J850K61j737N32J435q98p12J466j35j995J102J399j853
$$ -610 917 -190 -1433 417 678 -1059 -527 908 10 -702 764 629 -1366 -264 1135 -718
2317g18k83J895j86j775J164J204j985n6J931o56j371J582K32j939N89J589j025
$$ -718 -1001 894 708 -1067 97 1301 -684 -740 1191 535 -836 746 978 -961 -372 1217 192
2334A92j348J606J31j628Q99J266j727m80J797j05j779Q88J199j687l0J823n64
$$ 192 -1156 450 581 -1047 -148 1118 -609 -1089 708 603 -1176 -288 911 -776 -806 1017 453
2351D53j659J269J116k125J06K102j457r70J809M61j778J93J728j359o55J682
$$ 453 -1206 63 1179 -946 -840 1262 -195 -1165 644 1105 -673 -480 1248 -111 -766 916
2367I16l15j751R79J522j757o03J631l87j400J106Q78j607l86J896n00r88J156
$$ 916 601 -1150 -171 1351 -406 -1009 622 235 -1165 -59 819 -788 -1174 722 222 -766 390
2384C90N93j589J99J796j283j087J539R0j504N54J380j179p33J469K05j686J033
$$ 390 983 -606 -407 1389 106 -981 558 648 -856 -302 1078 -101 -834 635 840 -846 187
2401A87P77j369k95J768q63j506J164P09j596L04J676r24j467J649N09j556O00
$$ 187 964 -405 -700 1068 205 -1301 -137 572 -1024 -720 956 32 -1435 214 723 -833 -233
2418b33J420j170r50J544J24j508O14J192j360m4J295q50r85Q85Q01j423K7J484
$$ -233 1187 17 -933 611 735 -773 -159 1033 -327 -371 924 74 -911 -26 775 -648 -621 863
2436H63r26p94J237L29j256P4J182q84q18J498oj226L96J585j380n39J193q6r08
$$ 863 -63 -857 380 709 -547 -473 709 -175 -993 505 499 -727 -331 1254 -126 -665 528 442 -466
2455d66P15R91j662l0J172n56j010P04R73j458o6J437o70o82Q05M79j188J10J334
$$ -466 249 1240 -422 -452 720 164 -846 -142 831 -627 -693 744 74 -608 197 676 -512 -402 932
2474I32j040n60J225r6r71J77R12q27k98J156l51q16M13Q56p20n11J334l81r01
$$ 932 -108 -668 557 461 -510 -333 579 -248 -546 610 259 -557 -144 712 -8 -519 815 434 -467
2493d67O67M79q28m46J240p03m93O01K39q18M08Q07r38k58P87J51q98N93M94r33
$$ -467 200 679 -149 -595 645 -58 -551 50 289 -529 -121 686 -252 -510 277 428 -470 123 617 -316
2513c16l38J052m3p20K21N70p66K38N57q2q09P93J9n95L18K95n51m57M91K63n39
$$ -316 -654 398 355 -365 -144 426 -340 -102 455 373 -436 357 376 -219 99 394 -157 -614 -123 140 -399
2534c99R3P20q23j34P49j82n55J20Q24l65r5M38j02m94M06M02o57j69L12k93l7
$$ -399 -306 414 -409 -543 206 24 -531 -411 413 48 -47 391 289 -205 201 603 -54 -223 89 -204 -241
2555b41M07J58l98K0N12m15O2K55J1p48J86O74o69p5L0N1k43M61J40l03k31M07
$$ -241 166 324 -74 -54 458 43 105 360 371 -377 -191 483 -186 -261 -231 -180 -423 38 178 -125 -356 51
2577E1J54k42K71L3j13p3J14n7j57J98m6k63J86J37L6m05K50M7k30K68k75L1J23
$$ 51 205 -37 234 267 154 81 195 138 -19 179 133 -130 56 193 229 -176 74 121 -109 159 -116 -85 38
2600C8j8M1k56l66L42M26m01j92N00l04K7L06L2j85R2J46k85J82Nk39P1q8M99
$$ 38 20 61 -195 -561 -219 207 -194 -386 114 -190 -163 143 175 -10 82 228 -57 125 130 -109 -38 -126 373
2623C73l66J7q5j82J5P6K78k78k85O08k62o9K36K17m92R2K64r1k54L1M03j91k24
$$ 373 7 24 -61 -243 -228 -152 126 -152 -437 171 -91 -160 76 293 -199 -107 157 66 -188 -157 246 55 -169
2646a69N26k80p3N8M26p12K20lL20m47J59J78n16J68L93k93N7j14J32k55M1M67
$$ -169 357 77 4 62 488 -224 -4 -7 313 -134 25 203 -313 -145 248 -45 12 -102 30 -225 -184 283
2668B83l22j17L78p9k63q8N80p62M12J55j68j63K75L50o16L8N00m27K7J74m1k
$$ 283 -39 -156 222 143 -120 -208 372 -390 22 177 9 -154 121 471 -145 -107 393 -34 -7 167 126 124
2690A24m11N01l55m76Q18K08j065M14N17j46m47N46Q4o76M06M09p59K14N15k85
$$ 124 -287 214 -141 -617 201 409 -656 -242 275 129 -318 228 312 -364 42 451 -308 -94 421 136
2710A36m56M79J56o85K41N94j58o38O87R0q16K23Q40o40r3K72K3p32L44N57q09
$$ 136 -320 159 315 -370 -129 465 307 -331 356 446 -370 -147 693 53 -40 232 255 -477 -133 424 -385
2731c85p6M65j02k07M41K69m23l45P67n5q57P63p0l91L3O93n64n58P54L67p64
$$ -385 -461 4 -98 -305 136 405 -18 -363 404 349 -508 255 185 -206 -173 520 -44 -602 152 519 -245
2752b45K24N51q15j28N37K79r00J84R73j066p1O51j13p55K80P42o12k33J045k60
$$ -245 -21 530 -285 -413 124 403 -497 -313 660 -406 -477 174 61 -694 -414 328 -284 -517 528 268
2772B68r52R66J20o59j00Q09l53l66O54R9o20P4M73m60j97M70M3p81N28M18p06
$$ 268 -684 282 402 -257 -357 452 99 -267 387 486 -134 -60 413 -47 -244 226 269 -512 16 434 -272
2793b72l78J092l96n59P43J38p87p9P22J72j086Q73L00p07K18M00l90j02N31K6
$$ -272 -650 442 46 -513 230 368 -419 -498 224 396 -690 183 483 -224 -6 394 4 -98 433 459
2813D59q55L36O47o21k90N41q8m76J02P90r57n1O35n5l49L58K52n34l78R52m07
$$ 459 -396 -60 587 -34 -324 217 129 -347 -245 545 -412 -463 172 117 -232 126 378 -156 -534 418 11
2834A1l20L36M57j049M27N84n58k32P17P8p04L48J47k12m17Q29j79n05J7M73p21
$$ 11 -309 27 484 -565 -138 446 -112 -344 373 451 -253 95 242 30 -387 442 263 -242 -225 248 -473
2855d73K6R36m18m20M90L21o44n5P08k43m28M07q1k83J27M96o09j71O34l18p1
$$ -473 -447 489 71 -349 141 462 -182 -237 471 228 -200 207 126 -157 -30 466 -143 -314 320 2 -69
2876f9p3O20o41p5N22j08n88L25M55p29j16O19j20n97M61M44o37r5O44Q9o57M87
$$ -69 -142 478 -163 -238 284 176 -412 -87 368 -361 -477 142 22 -575 -114 330 -307 -402 242 331 -326 161
2898A61mm86P3P37n03k65M05j41m13K99O59o62o8O95j78o70N34K20q03J91O17
$$ 161 157 -329 -256 481 -22 -287 118 -23 -436 -137 522 -140 -208 487 309 -361 173 393 -410 -219 398
2919C98l29l88M60L9o01K92J49k91k39L66O50p74J12M69k98J3K41R9m91j14P37
$$ 398 69 -319 141 180 -421 -129 20 -271 -510 -144 506 -268 -156 313 15 28 269 368 -123 -237 500
2940E00m26j71K23K51p77O88l3l38j49M73k36k31K99K39o02mL97j44j62k8J71
$$ 500 74 -97 126 377 -400 288 255 -83 -232 241 5 -226 73 312 -290 -294 103 -41 -203 -231 -60
2961f0k45J28M22l59j86M78j40j41N2J98m6k32L48j52l38N19J72m90K1J04j6k33
$$ -60 -305 -177 245 -114 -300 178 38 -103 -51 147 101 -131 217 65 -273 246 418 -72 -51 53 37 -196
2983a96J59L17o39L84J25l60J11L4J37j63J34J07l39k1K12K34m07M5K40j23OK90
$$ -196 -37 280 -359 25 150 -210 -99 -65 72 -91 43 150 -189 -210 2 236 -171 -126 114 -9 -3 287
3005B87Jl16L24p8l58J31K73k53q8L24j96j83j06J82q9k9K30J95l79P9m5j28M7
$$ 287 288 -28 296 218 -140 -9 264 11 -77 247 51 -132 -238 -56 -145 -174 56 251 -128 -49 -94 -222 -175
3028a75K01J34j70j11J48m5k83N30j11m3j41J45j76M54n2j16k69L64j12k86j71
$$ -175 26 160 -10 -121 27 -18 -301 229 118 75 -66 79 -97 357 305 189 -80 284 172 -114 -285
3049b85K61n0r3M0O3J16l77N08l48L4K08N8J5k58K45l3j41K36J8j63J14q5Qk50
$$ -285 -24 -74 -167 -127 -64 52 -325 183 -165 -131 77 135 150 -108 137 104 -37 199 217 54 168 83 91 -159
3073a59L54k18k3j23J54R5J25l15N0J8O0j02K16l86K68k46K12mJ68m22L23l1l6
$$ -159 195 -23 -46 -169 -15 80 205 -110 -60 -42 18 -84 132 -254 14 -232 -20 -24 144 -278 45 14 -22
3096b2l55K70K48Mn0qo0lj5O6q1QK03k87l0P3R8j52q7J15j8jN5K9j12J64J32k39
$$ -22 -377 -107 141 145 95 87 27 24 9 75 -6 2 205 -82 -112 -39 59 -93 -180 -65 -83 -84 -29 0 -112 52 184 -55
3124e5j24J85J81k94n6L54j68k24K18K98k23n1J80k34k16K44J57k22J31M8k04
$$ -55 -179 6 187 -107 -163 191 23 -201 17 315 92 41 221 -13 -229 15 172 -50 81 129 -75
3145g5R6J16j21k44J84P3o7l22M37k08n1K38r6P7j48L32k77J44j29K92k69j25
$$ -75 21 137 16 -228 -44 29 -38 -360 77 -131 -182 56 -40 37 -111 221 -56 88 -41 251 -18 -143
3167a43M81m16J93L3l07J33J16L37k68p74O80M9j57l4K14j39k67N61k27k75J18
$$ -143 338 -78 115 148 -159 -26 90 427 159 -615 65 114 -43 -77 137 -2 -269 292 65 -210 -92
3188i2J41j38L1M61l57j96J38O1k41r5M02k63k19P21j99M7j84J27l58J01L85j99
$$ -92 49 -89 -58 403 46 -150 -12 49 -192 -287 115 -148 -367 354 155 202 18 145 -213 -112 273 74
3210G4m03K94q9o1o0M19j93j86Q5J66k14J8N03o31Q6N38j92k31J2J70n2k77K61
$$ 74 -329 -35 -124 -185 -245 174 -19 -205 -120 46 -168 -150 353 -278 -192 346 154 -77 -65 105 53 -224 37
3233C7lr9P5K50l07j90O30m12l85M16K96o00r3N32r9l76L31K40k36m6M96j77n23
$$ 37 34 -65 10 260 -47 -237 393 -19 -404 12 308 -292 -385 147 48 -328 3 243 7 -39 457 280 -243
3256b43L02L4N3l28K72l45k11L46J64l00K63K15j70l12M80k81k39M85J7m28J79
$$ -243 59 93 146 -182 90 -255 -466 -120 44 -256 7 222 52 -260 220 -61 -300 185 202 -226 -47
3277d7M02l28j78N2K17j03l3J74m78J9L97J92m31L87K11m32r0K87q0l47K87O3
$$ -47 355 27 -151 -99 118 15 -18 156 -322 -303 94 286 -145 242 453 21 -69 218 138 -209 78 141
3299A41l57o4M42l60K45K33P6m83P5L39k26l51J92M5kl2J06Qj92K92m5l09L38
$$ 141 -216 -280 162 -198 47 280 356 -127 -52 287 61 -290 -98 -53 -55 -87 19 27 -165 127 82 -227 111
3322A11K81m32j20J09K85l79J08K27mj48J22m0l29P0L29k64J25K12On26K26q2
$$ 111 392 -40 -160 -51 234 -145 -37 190 186 38 160 120 -209 -139 190 -74 51 263 269 -257 -31 -113
3344a13Lp8K35o9k85N61l09J3l8M55m67J82q1o2N0q4L90j97m29K30N56o54J12
$$ -113 -110 -188 47 -22 -307 254 -55 -42 -80 375 -92 90 9 -53 -3 -87 303 106 -323 -93 463 -191 -79
3367g9J93j02Q8ql87n3J91J42l2oK62k07N8r3Q9k9j75l0J31o4J09J84k90j8K85
$$ -79 114 12 100 92 -295 -348 -157 -15 -47 -53 209 2 60 -33 56 27 -148 -178 -47 -111 -2 182 -108 -126 159
3392A59k17r7K04J15j73J22R4k65j97L67L0R6l71K16j97p0K88m1k63L95j21l20
$$ 159 -58 -155 49 164 -9 113 207 -58 -255 112 142 238 -133 83 -114 -184 104 63 -200 195 74 -246
3414b46K78O9k78R7J88J67l24J20J3j62J16P5q2k01O4J33j77J54Q4r4R1k13M05
$$ -246 32 101 -177 -80 108 275 -49 71 84 -78 38 113 31 -170 -106 27 -150 4 88 -6 85 -128 277
3437B77m69K06j49J74k81J11J22j47L71k22r7o2J79j28m9N4N03n41j53J50J51
$$ 277 -192 14 -135 39 -242 -131 -9 -156 215 -7 -104 -166 13 -115 -164 -110 393 -148 -301 -151 0
3458@j96j41M04j30J79p6m3o6N5N7k62L43r6n2j18R8O4OO3q8j32J1N84l84m12
$$ 0 -196 -337 67 -63 116 40 -3 -69 -14 43 -219 124 28 -24 -142 -44 20 26 89 1 -131 -120 464 80 -332
3483c32K71r1K70k54J87L0l06K86N4p8K18j70o7mk11O83n10m1J04j55koM92n10
$$ -332 -61 -152 118 -136 51 81 -225 61 115 37 255 85 18 14 -197 486 -24 -65 39 -116 -118 -124 368 -142
3507a42O9r4J63J22o6j17Q0J48j02J47N6l57oj95L18J47k70M19j83j41k9P3l19
$$ -142 -73 -167 -4 118 52 -65 15 163 61 208 264 -93 -99 -294 24 171 -99 320 137 -4 -33 40 -279
3530b79L77k13L09k05k58K43J20j84R8k6J54j91p7J12O7o7K13J02k23j87K9L39
$$ -279 98 -115 194 -11 -269 -26 94 -90 8 -18 136 -55 -132 -20 47 -20 193 295 72 -115 -86 253
3552B53j04r9j35Q5J35m7j25J5j95J85N0k54K07k54J35nK38l5j66R6L55m21j04
$$ 253 149 50 -85 0 135 88 -37 -22 -217 -32 18 -236 -29 -283 -148 -153 85 50 -116 -20 335 -86 -190
3575a90L09k05K48j44Q3m2M23l74r7o0K61k55k4Rj29Q7N4J0J81k7l22K88j74K26
$$ -190 119 -86 162 18 101 59 482 108 11 -49 212 -43 -67 -58 -187 -100 -46 -36 145 118 -204 84 -90 136
3599A36j74p6p7L56j52k89L21k10k0K23J14J13j82M5j06L2j49k6J21r6%J8J6j9
$$ 136 -38 -114 -191 165 13 -276 45 -165 -185 38 152 265 83 128 22 54 -95 -121 0 -96 -96 -78 -62 -81
3623h1J19p2l07L29K6j8k9K52l79L92k13q5N4L78l11j83J60p6L7k9J8K72j51j58
$$ -81 38 -34 -341 -12 14 -4 -33 219 -160 232 19 -66 -12 366 55 -128 32 -44 -7 -36 -18 254 103 -55
3647e5K02k65K65j63p7j96J66Q0pJ03J88m04L52k66L46k89j5J27j75P4J6j4j04
$$ -55 147 -118 147 -16 -93 -289 -123 -43 -50 53 241 -163 189 -77 269 -20 -35 92 -83 -9 7 -7 -111
3670a11J81J89p1k92K05j84l1K60K7j69j05L64k89m0k02N18q4m5k13N2k73K97
$$ -111 70 259 188 -104 101 -83 -114 146 173 4 -101 263 -26 -66 -268 250 166 121 -92 -40 -313 -16
3692a6N1j30K18p8k02j4J34j08J41m2L61m96L07m3j89K44m3k4m4l6K59k51K5p5
$$ -16 35 -95 123 45 -157 -171 -37 -145 -4 -46 315 -181 126 83 -106 138 95 71 27 -9 250 -1 24 -51
3716e1L12l06J60M9j20j31jM0o4J70K5k59K13k67K0J36m1j1KJ80l4j35L7K23N4
$$ -51 261 -45 115 164 44 -87 -88 -48 -112 58 83 -176 37 -230 -210 -74 -115 -126 -124 56 22 -113 -76 147 201
3741B01l9q6J49j40ON2j79j56K64j51K22j52K20k42J15j00L51n90M0L86k39o2
$$ 201 162 76 225 85 91 143 -36 -192 72 -79 143 -9 211 -31 84 -16 335 -255 -215 171 -68 -130
3763a30K13l2n9Ok9k94jL83J62k65J9O5N6j57K26j97j57K9L27j62j01M51k19k55
$$ -130 83 51 -8 -2 -31 -325 -326 57 219 -46 -27 38 94 -63 163 -34 -191 -162 165 3 -98 353 134 -121
3787a21K47j19L2r9J30Qj34K35j67O0k27K03j8p5J47J22j78O9o9P7q8j11K42k55
$$ -121 126 7 39 -60 70 78 -56 179 12 72 -155 48 30 -45 102 224 46 115 46 123 35 -76 166 -89
3811h9O1K37k42P5J38m26J85r4J29J04l85K71L4q1o8K47k55L5K52rk42P4P7J90
$$ -89 -28 209 -33 42 180 -246 -61 -155 -26 78 -307 -36 -2 -83 -151 96 -159 -124 128 119 -123 -49 28 218
3835B18m62L18k16J02j30N4L44k77K01N9l0l0N5j91k04K56Q9l27J32M0P3j34K30
$$ 218 -244 74 -142 -40 -170 -116 228 -49 152 211 181 151 206 15 -189 67 156 -171 -39 1 74 -60 170
3858A70n62K75L38r8k30q2K38j45j4k53J46J3J78qL6j3K16j71j20J82J48k96L23
$$ 170 -392 -117 221 123 -107 -189 49 -96 -110 -363 -217 -204 -26 -34 2 -11 205 34 -86 96 244 -52 271
3881B71J8k30j54J01lP7j18O8J90j13j57j9J6m4M70l70P0j08p0J78o8K70j38m2
$$ 271 289 59 -95 6 3 80 -38 30 220 107 -50 -69 -53 -97 373 3 73 -35 -105 73 5 275 137 95
3905I5J24l82L02o7m0j06J22l17J12n5M58k8j80k15K49q7J53j02m2J12N0l03L4
$$ 95 219 -163 139 72 32 -74 48 -269 -157 -212 246 218 38 -177 72 -15 138 36 -6 106 156 -147 -113
3928a13j4RK82k44j30j50L27j56Q7J36J87r2ql61K05l7k9L09j79kK73l27J80r9
$$ -113 -127 -118 164 -80 -210 -360 -33 -189 -102 34 221 129 121 -240 -35 -72 -101 208 29 27 300 -27 153 54
3952E4r3R6j2j84O8N1P8k60J80j79K30N3J09R7l30K83k25K83n91L68O7j44j33
$$ 54 -39 57 45 -139 -71 -20 58 -202 -22 -201 29 82 191 288 -42 241 16 299 -292 76 143 -1 -134
3975a34J39J08J9l0j42j1q6mK3K00J1l99K06L10k18l78L10J0L2q0j34rJ97J99
$$ -134 5 113 132 102 -40 -51 -137 -141 -118 82 93 -306 -100 210 -8 -386 -76 -66 -34 -114 -248 -257 -60 139
3999A39j55N6k44L22j55J06j67L42l63K13m1p2j5j9m8M5j24J77p9J19nL8M6o3
$$ 139 -16 40 -204 118 -37 69 -98 244 -119 94 53 -19 -34 -53 -101 -56 -180 -3 -82 37 32 70 116 53
4023E3k75m2J81j12J01K44j31j72O1M4M3k30L64Mj96L82l68L29k47J06l42l3J69
$$ 53 -222 -264 -83 -195 -94 150 19 -153 -92 -48 -5 -235 129 133 -63 319 -49 280 33 139 -203 -236 -67
4046f7k46L83k49J10nJ99Q0j89p0J02k09J45J20Q2j05L2J8k01M81k74o5k19j50
$$ -67 -313 70 -179 -69 -74 125 205 16 -54 48 -161 -16 104 186 81 113 131 -70 411 137 72 -147 -297
4069b97L41j37J24K5j48Q1J21R4k66P4M6j81J64K83l05k2Q4j76L8j30J1J02J77
$$ -297 44 -93 31 56 -92 -11 110 204 -62 12 58 -123 41 324 19 -3 81 -95 -57 -187 -176 -74 103
4092A03j05K13L5k13Q9m4j6L4O3n3M2j49N3J22L7j17j81J00l65M91n9J77k50N1
$$ 103 -2 211 246 33 122 78 62 96 159 106 148 -1 52 174 211 94 -87 13 -352 139 80 257 7 58
4116E8j39L49k14l10L31m6J5P3r3j13OJ02R9k89MPL5K01N0J09l36J33J38k95M02
$$ 58 -81 268 54 -256 75 29 44 117 24 -89 -83 19 118 -171 -167 -160 -125 76 126 235 -101 32 170 -125 277
4141B77k23k34J46O7k64L32j17J04j81L6K59r8k65J88j76N2N3L7L3J16p4Km3j26
$$ 277 54 -180 -34 33 -231 101 -16 88 -93 -57 202 104 -161 27 -149 -97 -44 -7 26 142 68 70 27 -99
4165i9L03m29L88r5L1k91K10j87M05l79K64j08j18J76k70l7K72M4l1N7p9Kj01
$$ -99 204 -225 163 68 99 -192 18 -169 236 -143 121 13 -105 71 -199 -236 36 80 49 106 27 29 -72
4188g2q0L08m67K52M8j31j20K62J19L8r0o4J71l23M8J29L6j06k5L4k75K80j6J0
$$ -72 -152 156 -311 -59 -11 -142 -262 0 119 157 67 3 174 -149 -101 28 64 -42 -67 -33 -308 -28 -44 -34
4212c4l9R2j01J18J18p7j17L0k5l8r3K47J96k96J70r8j37J89o7L9m1j1P8k74K04
$$ -34 -73 19 -82 36 154 77 -40 -10 -35 -73 -166 81 277 -19 151 53 -84 105 38 77 36 25 103 -171 33
4237C3K38l49j21M30j67k14J06J2j0m8k7J2M14k92K48l9k98J46j01J78j02J68
$$ 33 271 -78 -199 231 64 -150 -44 -32 -42 -90 -117 -105 309 17 265 226 -72 74 -27 151 49 217
4259B17k04q3K53j80o6J61k1j0k60J78J72p0j13J21j29M4n7p9L02O6l19P4O6k6
$$ 217 13 -70 183 3 -63 98 77 67 -193 -15 157 87 -26 95 -34 10 -47 -126 176 242 -77 -3 63 37
4283C7P7j99k00M66l05J08J37q7n2Q8l70L87l57K18k71K7J65J36j01P5M4l23K71
$$ 37 114 -85 -285 181 -124 -16 121 34 -18 70 -300 87 -270 -52 -323 -296 -131 5 -96 -21 23 -300 -29
4306b9J29j92j59L76N2j38l8P1O5m7j85K16M6k30q0M22k89j57J78k98K12k1K10
$$ -29 100 -92 -251 125 177 39 1 72 137 90 -95 121 167 -63 -143 279 -10 -167 11 -287 -75 -96 114
4329A14Q5m12J88N6R2R9l05M32l91l8J05k93O2J1J73k33J06L85j73O8k00J73j52
$$ 114 199 -213 -25 31 123 222 -83 349 -42 -80 25 -268 -206 -195 -22 -255 -149 236 63 131 -69 104 -48
4352d8L00k72J6K11m56K59J1J09l2j99J95k10L32l3j50j12K2j06k5M53l76O3K02
$$ -48 252 -20 -4 207 -249 10 21 130 98 -101 94 -116 216 183 33 -79 -57 -163 -188 265 -111 -48 154
4375A54r0J32m4j23k3o6M6R8j75J5J52j92O0J47j17m9J54j6m5j25l8J18j55K44
$$ 154 64 196 152 29 6 -60 -14 84 -91 -76 76 -116 -56 91 -26 -75 79 63 18 -107 -145 -27 -182 62
4399F2%j58L80m61M6j36L11L4q5J6J03j99J23j6j5j50Q6K92j73j58r9K64Q6k87
$$ 62 62 -96 284 -177 -131 -267 44 78 -7 9 112 -87 36 20 5 -145 -59 233 60 -98 -197 67 153 -134
4423a34J24L2K32n09q4M02q1J06j21k91J79L38k63Oq8K38m13N35k97j13J10K6
$$ -134 -10 22 254 -255 -339 63 -18 88 -33 -324 -145 193 -70 -64 -152 86 -327 208 -89 -202 -92 -66
4445f6K97k74M33k58o3o8J39lj25l5nL6P2j11j14J64j8R9k00o2M2j65K72M0J10
$$ -66 231 -43 390 132 69 1 140 137 12 -23 -28 8 80 -31 -145 19 1 100 -100 -162 -120 -285 -13 27 137
4470A37j78j9J08j30K23k8l96L80k74j51L54L7R1O3j70j41O7J8O9j79m7k04K68
$$ 137 -41 -60 48 -82 141 113 -283 97 -177 -328 26 63 154 217 47 -94 -27 -9 60 -119 -166 -370 -102
4493a02L52l82J73k14K97k03J08j72Q7NJ24m4m0q7k83N66k44L8j31L09k76Rk08
$$ -102 250 -132 41 -173 124 -79 29 -143 -56 -51 73 29 -11 -98 -381 185 -59 -21 -152 157 -119 -110 -318
4516c18L85N9n3R4l76K73j12J06j89j08K24K57n8k29N7O0JQ5J25j87j48k6P7j34
$$ -318 67 126 73 167 -209 64 -48 58 -131 -239 -15 242 184 -45 12 72 73 158 283 96 -52 -78 -1 -135
4540a35K08q1Q1r9J10J61l70J76K11m23K04q9J72l6j32j76P2lQ0j7J04k2k20L10
$$ -135 73 -8 73 -26 84 245 -125 51 262 -161 43 -46 126 90 -42 -218 -146 -149 -69 -86 18 -4 -224 86
4564H6m20L64k6N9j04K46m26K38N8J0k08L42k42p4J51J92j05p7O7j34m9lK44j58
$$ 86 -334 30 4 63 -41 205 -221 17 75 85 -123 219 -23 -97 54 246 141 64 131 -3 -52 -55 189 31
4588C1m9p2K01J33j13k05Q0j0K08j50M6p4o2q0K1L3J71l3m4n0o1M7q4Q1QJ8M8
$$ 31 -18 -90 111 244 131 -74 6 -4 204 54 100 26 -36 -116 -95 -62 109 76 32 -18 -79 -32 -116 -35 -27 -9 39
4615C9n0p5J15N8k9J28ll44P0J90R3k80K12l8k21J30J09k37P8L2j6J34m5j2P5
$$ 39 -11 -86 29 87 58 186 183 -161 -91 99 192 -88 124 86 -135 -5 104 -133 -55 -23 -39 95 50 38 113
4640A13k2kR1k88J78L6N7l45K31m7j0j20K45mk6p0j70L00k01N7n2P6j91N0O6R8
$$ 113 91 89 180 -108 70 106 163 -182 49 2 -8 -128 117 113 87 17 -153 147 -54 3 -49 27 -164 -114 -48 50
4666E0r1J50l06M44l21j17M49o6l00J38l7J26q2M7j47K23j83kk70L31Q4j57J13
$$ 50 -41 109 -197 247 -74 -191 258 192 -108 30 -7 119 37 84 -63 160 -23 -25 -295 36 120 -37 76
4689G6P6j74j44L37j08j2j58J42O0m5J99k18j22N0l3J66J5k02J57l4oM3j83N7
$$ 76 152 -22 -166 171 63 51 -107 35 95 50 249 31 -91 -41 -74 92 107 -95 62 28 22 65 -118 -61
4713f1j1K64k69l6K04q9k1J31J33q3j13J09k75J21J87l99L64J13m62J34j35L71
$$ -61 -72 192 -77 -113 91 2 -19 112 245 162 49 158 -117 4 191 -208 156 269 -193 -59 -194 177
4735A77k54l4J81J5pj38p7K44k74K93O2k38K7J36OqJ24j68j14J33Mr4l9J52k39
$$ 177 -77 -111 70 85 78 -60 -137 107 -167 126 188 -50 -23 113 119 111 235 67 -47 86 90 -4 -43 109 -130
4760a30L45k32J78j68j4%k37K74L0k4k38L3R7J49j82J07K89k66J28k93K63k91
$$ -130 215 -17 161 -7 -21 -21 -258 16 46 22 -216 -183 -86 63 -119 -12 277 11 139 -154 109 -182
4782a82K85Kj63K00j96J79j12J10j91Q7j34J62j94M1J97j89K19L4l25J37K57j74
$$ -182 103 105 -58 142 -54 125 13 123 -68 19 -115 47 -147 -106 91 -98 121 155 -170 -33 224 50
4804E0q6K5n1pM6J7J10Q6k77o5J6L63rPr1l73J86Q2J6j42q7K27k33K82j22j26
$$ 50 -36 -11 -62 -69 -23 -6 104 190 -87 -152 -136 227 218 225 134 -239 -53 29 45 -97 -184 43 -190 92 -30 -156
4830a56lL06k56O3K1q9J42q5J68j97k5L92k26k84N57n13R8J24O3p0j2j0Q1j36
$$ -156 -159 147 -109 -46 -25 -114 28 -57 111 -86 -111 281 55 -229 328 -185 -87 37 100 30 18 8 89 -47
4854d7K58l11K42j49kL53k97o1k1J42j37J09o2l62L02k11K09L4n8q5O9L76l48
$$ -47 211 -100 142 -7 -9 344 47 -14 -35 107 -30 79 17 -345 -43 -254 -45 -11 -69 -154 -85 291 -57
4877e7l4J63P2k95L62j10J40m42L45K14l98Q6q6p4J15j58L08j53Oj51K12o4k9
$$ -57 -91 72 144 -151 211 101 241 -201 144 358 -40 46 -40 -114 1 -157 151 -2 4 -147 65 1 -28
4900b8J07k62P8J5J51j43l1J70j81o8L24l33J05K15l32n0L12J11l21K73n3j92
$$ -28 79 -183 -105 -90 61 -82 -113 57 -124 -192 132 -201 -96 119 -213 -263 49 160 -161 112 59 -133
4922a33K13k04K31J41m64K26j5L1J81k79J4J74j00j60J78O1J02q2k90N0J64l5
$$ -133 80 -124 107 248 -216 10 -5 26 207 -72 -58 116 16 -144 34 95 197 115 -175 -125 39 4
4944Dj43r0J41M0K2O3r9J64q9K6j04J74m4p0j79L84j91K65n0l02R2n7J00j73K25
$$ 4 -139 -229 -88 -48 -26 37 -62 102 13 39 -65 109 65 -5 -184 200 9 274 224 -78 14 -43 57 -116 109
4969A09k59J43R6l59J31p6J75K8j28J57J93m34K12K5Q3l21J95l8qK09j67J04K2
$$ 109 -150 -7 89 -270 -139 -215 -40 -12 -140 17 210 -224 -12 13 96 -225 -30 -68 -76 133 -34 70 92
4992I2o6j06J33j52o8L53j8k55L35k85l4J86j27j37k5N23l18j73P3J74j95l6K3
$$ 92 26 -80 53 -99 -167 186 168 -87 248 -37 -71 115 -12 -149 -174 349 31 -142 -69 105 -90 -126 -103
5015a03J75O9j59k55M02o8j34N7k38K89J22j31o4mJ0Kr2J98l06l7K16j17rk9P7
$$ -103 72 141 -18 -273 129 61 -73 -16 -254 35 157 26 -38 -42 -32 -30 -122 76 -230 -267 -51 -168 -177 -206 -129
5040a29k25O11k69j19N5K32j91K05Q2m36J84o5M7p8K54j12J08j65p5K03l24p5
$$ -129 -354 257 -12 -131 -76 156 -35 170 252 -184 0 -65 -18 -96 158 46 154 -11 -86 117 -207 -282
5062b82M64k84L08n27J56J75J1J27j53N3N1k67N2j23K50K36k85k0K96k10j76K12
$$ -282 182 -102 206 -321 -165 10 21 148 -5 48 99 -168 -116 -239 11 247 -38 -58 238 28 -148 64
5084F4J3j54J11K07j10k92J96Q9QJ18k24j21J96j22j17n6K50n6J23p2l6m4K50
$$ 64 77 -77 34 241 131 -161 35 124 132 250 26 -95 101 -21 -138 -194 56 0 123 51 15 -29 221
5107B21j41j40k5J12Q9J46k36J4L8K55k98j31J59k73KM50l18O9M0p1K30j51k23
$$ 221 80 -60 -85 27 116 262 26 40 78 333 35 -96 63 -210 -208 242 -76 -7 33 -38 192 41 -182
5130a82j2n7L41l3k47J76J23k40K34k02J63k30J37M06j61k23j07K80p9ql8K3R4
$$ -182 -194 -251 90 57 -190 -14 109 -131 103 -99 64 -166 -29 377 216 -7 -114 166 87 79 41 64 158
5153A58m0Pm4j69o1J59J16k67K16j85K49j08k29K61Ok66K33l21M29k68j37J77
$$ 158 118 125 81 -88 -149 10 126 -141 75 -110 139 31 -198 63 69 -197 36 -285 144 -124 -261 -84
5175h4Q7q9J72q7j14Q3j53J68j19QK12L2J30l17j3K32j87l4Qr2J24j73N7L70m03
$$ -84 3 -86 86 -1 -115 -32 -185 -17 -136 -128 84 116 246 -71 -84 148 -39 -73 -65 -157 -33 -206 -149 221 -182
5200a82N02j95l24J26k70L13j18L22k66N6j20L17j25K0M9n0n6o5J31l37K06j47
$$ -182 320 125 -199 -73 -343 -30 -148 174 -92 -36 -156 161 36 56 105 55 -1 -66 65 -272 -66 -213
5222b13K5L18j68J68o4M9k10L64l30LJ00q4J46p2O8j17J35j17j71K07J84r8j21
$$ -213 -188 130 -38 130 66 115 -95 269 -61 -58 42 -42 104 32 100 -17 118 1 -170 37 221 123 2
5245BN1j88K91j8l9k10J32K00k93j3J13R1q4n1m4k2j99L97o1j56J98J33l10j1
$$ 2 53 -135 156 138 99 -111 21 221 -72 -85 28 119 35 -16 -60 -82 -281 116 55 -101 97 230 -80 -91
5269i1j3J55k1J89j52l9%q9N1M6o2J16R6m4J43k85J01j72j60J94J11j74J2K40
$$ -91 -104 51 30 219 67 28 28 -61 -10 36 -26 90 186 142 285 0 101 -71 -231 -37 74 -100 -88 152
5293A52j77j64J86j13J54l60L36J13k23P4K27o1m0j88J31K95k59K07j01%j34K63
$$ 152 -25 -189 -3 -116 38 -322 14 127 -96 -22 205 144 104 -84 47 342 83 290 189 189 55 318
5315C18m23j29M31l50M3K08j25r3K04r0j05L8k3J37m1q4J9M9j43J31J67j78K42
$$ 318 -105 -234 197 -153 -110 98 -27 -120 84 -6 -111 -73 -96 41 0 -84 -65 -16 -159 -28 139 -39 203
5338B03n06K72m8NK99n07M57k10q0j20L78j42o8J01K31o0k04O3Q0k9m63L88J27
$$ 203 -303 -31 -79 -74 225 -282 175 -35 -115 -235 143 1 -67 34 265 205 1 64 144 115 -348 40 167
5361A67j30m3K84j96l10L88L5l01Q1p9j05K61oL29l39O3k01J04rj30n2J95r3m1
$$ 167 37 -6 278 82 -228 160 195 -106 -25 -104 -209 52 46 375 36 99 -102 2 -7 -137 -189 6 -87 -128
5385a28m9L60j81K87k07j41J72N3k55L5q7J52J09j93J33k41j7K0R4K67l15J87
$$ -128 -177 183 2 289 82 -59 113 166 -89 -54 -141 11 120 -73 60 -181 -198 -178 -84 183 -132 55
5407E5R9r6N3j98L58k54J95j95jj13K7J86m05L20J0r0J05q5n9p0L55j90m7j16
$$ 55 154 58 111 -87 271 17 212 17 16 -97 -70 116 -289 31 41 -49 56 -29 -88 -158 197 7 -40 -156
5431a56q2K64j10J43m0K3j07J08K0j49K75k70N0M3K4n9K6o7J45o0L7P7J0j86J54
$$ -156 -238 26 -84 59 19 42 -65 43 63 -86 189 -81 -31 12 36 -23 3 -64 81 21 58 135 145 -41 113
5456A13o4J21k76N4k07L6K08j75L3J85p0r0K64q0j94k00M90j48n1K81k11j24r8
$$ 113 49 170 -106 -52 -259 -223 -15 -190 -157 28 -42 -132 132 52 -142 -342 148 0 -51 230 19 -105 -203
5479b03J2J28o3K31J41j93j11J83j35j77L7K59k73J89l4o3Jo0K84j65p8K13k79
$$ -203 -191 -63 -126 105 246 53 -58 125 -10 -187 -150 109 -164 25 -9 -72 -71 -131 153 -12 -90 123 -156
5502a56K99p3l21J47N3J16n6j99Q6r6K84j48Q0j87K22l0P0O7n08K42J58lr1Km5
$$ -156 143 70 -251 -104 -51 65 9 -190 -104 -200 84 -64 16 -171 51 21 91 158 -350 -108 50 47 -44 -42 -87
5527h7J12J50j00j51K7p5L0K12n9j43k85N17J62j82k97K32j02j12K53r3j30L6
$$ -87 25 175 75 -76 -49 -124 -94 118 59 -84 -369 148 310 128 -169 63 -39 -151 102 9 -121 -85
5549h5K02k69R6K27k34P4K1l6l2jO1j08RLK97k59J74J72n03J0M31j29o3k6n4j87
$$ -85 117 -152 -56 171 -63 11 32 -4 -36 -37 24 -84 -75 -72 225 -34 140 312 -191 -181 250 121 58 32 -22 -209
5575b09K98j67K1p5J63J05p1k01K38l26L55l52K71k19l9L19j31K23J1k70M0J81
$$ -209 89 -78 -57 -132 31 136 65 -136 102 -224 131 -221 50 -169 -208 111 -20 203 214 -56 -16 165
5597A65k52K19j22j2k5M4Pq4J58j13R1N4l27K98r7l2K67l90L3J40J45j8k10j42
$$ 165 -87 132 10 -2 -27 17 24 -60 98 -15 76 130 -197 101 4 -28 239 -151 -118 22 167 149 -61 -203
5621b03K57N9k29K15j04k71K61K04j72j53J7L33j3l07L29k88K43m41K04J16K22
$$ -203 54 113 -116 99 -5 -276 -15 189 17 -136 -119 214 201 -106 223 -65 178 -263 -59 57 279
5642B79l09J23j39R7j58rJ92j67K44Rj50j84K70N8j00NP3j22J64k99n7J28J08
$$ 279 -30 93 -46 51 -107 -116 76 -91 153 162 12 -172 98 156 56 61 134 12 176 -123 -180 -52 56
5665E6n0L12l03j29K5P7K62k77J06L0r3Q3N5r3l24L68j47J86K6j52j92J45k99
$$ 56 6 318 15 -114 -89 -12 250 -27 79 109 16 99 154 61 -263 105 -42 144 170 18 -174 -29 -328
5688c28J52J71L05m42R0L04l17N8o2R2j15J09k9K21k24J64k26J6K82l47J79q3
$$ -328 -176 -5 300 -142 -52 252 -65 -7 -69 23 -92 17 -12 209 -15 149 -77 -61 221 -126 53 -30
5710c0J95lk3j22P8L2l30L31r5k0j18J30r5j37O3J54l9J01p6Q8o2k23lJ81J00
$$ -30 165 162 139 17 95 127 -203 128 33 13 -105 25 -70 -207 -144 10 -29 72 -4 84 22 -201 -204 -23 77
5735G7k59Q8M6R7j31rk7K47m2p5K23m95K58M7K1j78j4k30L93j09q4K40k17K81
$$ 77 -182 -94 -48 49 -82 -91 -118 129 87 12 235 -260 -2 45 66 -112 -126 -356 37 -72 -156 84 -133 148
5759A48j80K14j42K05J10k91K96m53J35K9q7J70r4m7l1q4kQ7j85K19q4K03j17
$$ 148 -32 182 40 245 355 64 360 -93 42 71 -16 154 60 13 -18 -102 -104 -17 -202 17 -67 136 19
5782A9L0R2K8j85J68m60J84J70oM0k73J87J08K1l0J69l53K08OK86o33K45j93J13
$$ 19 49 141 169 -16 152 -308 -124 46 40 80 -193 -6 102 123 93 262 -91 117 123 409 -224 21 -172 -59
5806e9l5J75J1j02m8j97M53m23J52Q7j38J96J3r7k57K55J03k1Q6k84q8M1jK72
$$ -59 -94 81 92 -10 -58 -255 198 -225 -73 14 -124 72 85 -12 -269 -14 89 68 154 -130 -218 -177 -178 94
5830I4k94J95O7Q4l8k95J75J74k8j14j48K87l15k8M07k96M9K1j04M3l35M03J6
$$ 94 -200 -5 62 146 108 -187 -12 162 134 20 -128 159 -156 -184 223 -73 -24 -3 -107 -64 -399 4 20
5853B0pJ34l81J99j78j5J66L6l7L1J83j57K31j29j04J51k12J84l52K97k43NK88
$$ 20 13 147 -234 -35 -213 -228 -62 -26 -63 -32 151 -6 225 96 -8 143 -69 115 -237 60 -183 -178 110
5876A10m10K01J49j10j57L13j58K70j38k67L22k16J53k9j65K76k45K07k63O6L07
$$ 110 -300 -99 50 -60 -217 96 -62 208 70 -197 125 -91 62 33 -132 144 -101 106 -157 -91 216
5897B16j76j8K17l57J96nQ3j99K07k14R7j32n0L7J38k64Q3M22k84rp1J90K23n77
$$ 216 40 22 239 -118 78 73 156 -43 164 -50 47 -85 -135 -98 40 -224 -141 281 -3 -12 -83 107 330 -247
5921b47K36R5r2j16J81L6J3k52J90n1j48K23P4m09O5P5OK28j93P0P0j3r2oK59
$$ -247 -11 84 -8 -124 57 93 106 -146 44 -7 -155 68 142 -267 -202 -127 -121 107 -86 -16 54 41 -51 -57 202
5946B02r4j05J02j01J55j44j05J53N1l13K61J6k6j74J37j38kJ30k9j05K24p2N7
$$ 202 108 3 105 4 159 15 -90 63 114 -199 62 78 52 -122 15 -123 -125 5 -24 -129 95 23 80
5969H0k11j45K56k16K20j81J55J84k04K10M6k80J88j72J95j53q3K05j78p2L03
$$ 80 -131 -276 -20 -236 -16 -197 -42 142 -62 148 194 -86 102 -70 125 -28 -111 94 -84 -156 147
5990A47P2k38JO8m4k28J57J61j47lk03K05j51J34KjL5L4n6K37j94l8l50K25J34
$$ 147 219 -19 -18 50 6 -222 -65 96 -51 -54 -257 -52 -203 -69 -67 -68 -33 1 -55 182 -12 -50 -400 -175 -41
6015d1o2Q7J27q3K24l15J42J15l86M27k54K87j83K01k57k03J87o4j62J18j4NL95
$$ -41 -103 -16 111 28 252 -63 79 194 -192 235 -19 268 85 286 29 -174 13 -51 -213 -95 -109 -104 291
6038B91l17Nj27L93k83j19J40J63j51k64M10J69k84L3m8K38l10q8R4O3J20k52
$$ 291 -26 -21 -148 245 -38 -157 -17 146 -5 -269 141 310 26 59 11 249 -61 -149 -55 8 128 -124
6060a24N0N8l9L4P3k12J65j75K8o0J2K58Nj45M6j20j04R4J21jP8k5k16M03o1k74
$$ -124 -74 -16 -55 -21 52 -160 5 -170 -142 -202 -190 68 73 -72 -26 -146 -250 -156 -35 -36 42 17 -199 204 143 -131
6086a31R0oJ44k85M36j60j84L02k49P9j08J3JJ74Oj70l45J66K55k97M0J57M3L1
$$ -131 -41 -47 97 -188 248 88 -96 206 -43 36 -72 -59 -58 116 122 -48 -393 -227 28 -269 -229 -72 -29 2
6110BJ04k7l8j49O2P4j60P0P9k15K96j34J28j48Q2j00l8k9k5J39j20J46M6k94
$$ 2 106 79 41 -108 -46 28 -132 -62 17 -198 98 -36 92 -56 26 -74 -112 -141 -166 -27 -147 -1 45 -249
6134b49K10J46j4o1j8j04L3J07j8L2N5l4J20k8k85L08k41j7J61j78J66k89K20
$$ -249 -39 107 93 32 14 -90 -57 50 32 64 119 85 205 177 -108 200 -41 -58 103 -75 91 -198 22
6157B2l0J2q7q2P7Q9q8M4Q8Or9K40qN4k35M3j51M16k48l16M32m18N84o09K26n
$$ 22 -8 4 -83 -165 -88 1 -87 -43 45 51 -48 192 184 238 3 46 -105 311 63 -253 179 -239 345 -264 -38 -43
6183d3K90l46J24j18J87j51O6j73L5J9M0k14J58j18K90J88l84K20k0k93K90K23
$$ -43 247 -99 25 -93 94 -57 9 -164 -129 -110 -70 -284 -126 -244 46 234 -150 70 50 -243 47 270
6205B70j92j73K11j26J28j18j09L32j98j8p2N8kk2K28j66P6k29K57j13J20j76
$$ 270 78 -95 116 -10 118 0 -109 223 25 7 -65 -7 -9 -31 197 31 107 -122 135 22 142 -34
6227c4Q1k08K20l7J6j8k37J79J59p8k00j21N29k09m3o8q4K38q9J1l19L93O3k31
$$ -34 47 -161 59 22 38 20 -217 -38 121 43 -157 -278 251 42 -1 -69 -153 85 -4 7 -312 81 144 -87
6251h7K9K24k03q7J57j70j04M01q2q2J47K12l71k5j80K76j01l0k6J00J7j27J24
$$ -87 -58 166 -37 -124 33 -137 -241 160 78 -4 143 355 -16 -41 -221 55 -46 -76 -102 -2 15 -112 12
6274A2j44L48j11J08k51K91l10o0J18j24J56j61j0J29J35k0o5o0r1r6J91O2Q1
$$ 12 -132 216 105 213 -38 253 -57 -117 1 -123 33 -128 -138 -9 126 106 41 -19 -110 -206 -15 47 128
6297A28k03r9J83J14k34M45m11J22J50l91K68P7p5j61M5j21M24k94K37j16%r9
$$ 128 -75 -174 9 123 -111 334 -77 45 195 -196 72 149 74 -87 -42 -163 261 -33 204 88 88 -11
6319a1J15k72m7J73L9PR4K24m33J17J26j80K10N4k13J8j66J94j31j02J61p7L4
$$ -11 104 -168 -215 -42 -3 4 98 322 -111 6 132 -48 162 216 3 21 -145 49 -82 -184 -23 -100 -66
6342f6J70k08M2Q5k2j3Q0k69L83j88q2K42k05k32K45RJ32j99k9N7j84m0K77j60
$$ -66 104 -104 -62 23 1 -12 68 -201 182 -6 -88 154 -51 -283 -38 -29 103 -96 -125 -68 -252 -292 -15 -175
6366a75M95l21J49l15L51m0L3k87L32j67k3J12o8N6n28N40j95K6j8P4lm8J18n3
$$ -175 320 -1 148 -167 184 144 177 -110 222 55 32 144 76 132 -396 144 -51 -25 -43 31 28 -20 98 45
6390D5L6L2j05J94k10l8j38J36k18K49J02j96J56N7k18K41k90J6P4q3J52K0j62
$$ 45 81 113 8 202 -8 -46 -184 -48 -266 -17 85 -111 45 102 -116 125 -165 -149 -75 -158 -6 14 -148
6413a48L9j37j13M27k8j67L39j09k87Q6o0J68j44J89J98q7o0k73M53r9n4r6L8
$$ -148 -109 -246 -359 68 40 -127 212 103 -184 -98 -158 10 -134 55 253 166 106 -167 286 187 133 37 75
6436G5k48j22J51O5J42n15N42j98J93j58L4k06M05l34J81K03k88L70l18M2N7j48
$$ 75 -173 -295 -144 -79 63 -452 90 -108 85 -73 -39 -245 160 -174 7 210 -78 292 -26 16 73 -75
6458g5J95r3J63n4m32L85j13K2Q7K7j50Q1j73LN7J69q1r4k0Q5j62l9J65R8K94
$$ -75 120 27 190 136 -296 89 -24 -2 85 112 -38 43 -130 -127 -70 99 18 -76 -96 -11 -173 -212 -47 51 345
6483C45k69J43j83j18J08O9j27o4J53p0n3o5K60p1r0l8J42l26M20j98M6j48J10
$$ 345 76 219 36 -82 26 95 -32 -96 57 -13 -66 -131 129 58 -32 -70 72 -254 166 -32 14 -134 -24
6506b4K6N4j37K16k16o3M36k32l8j01J33k87K78K62m98J58k0J44Ok88K21m4J81
$$ -24 2 56 -81 135 -81 -144 292 60 22 -79 54 -233 45 307 -191 -33 -53 91 97 -191 30 -14 167
6529A67j49L8j31Q0p3J03K39r9J69l31r7j2N9j24P2J85J42l26k7J77K5o9j67L0
$$ 167 18 56 -75 5 -68 35 274 175 344 13 -84 -96 -37 -161 -89 96 238 -88 -115 62 87 18 -149 -119
6553a19j33K23q5J01L2k06J36J77KJ43p7O7k78p2K39l22N9M1J83q7O0k11J47o
$$ -119 -252 -29 -114 -13 19 -187 -51 126 128 271 194 261 -17 -89 150 -172 -113 -72 111 24 84 -127 20 14
6577A4K04j97J37k86mK29k45L33l55J52j43J57M0l3j07J23q5rQQ8J40J44j56j04
$$ 14 218 21 158 -128 -132 97 -148 185 -170 -18 -161 -4 36 3 -104 19 -66 -75 -67 21 161 305 149 45
6601D5j23J29K25n15K70j13J7N0J0Q4p3K43j60j36l6K51j82M02n94K37M7M5q0
$$ 45 -78 51 276 -239 31 -82 -65 -15 -5 79 6 249 89 -47 -83 168 -14 388 -206 31 78 123 43
6624D3l04K15K61j10j65j15J22q4R1N6O4j65K74m8l63j9K90N0j45J08j47P0O0
$$ 43 -261 -46 215 105 -60 -175 -53 -137 -46 10 74 -91 183 135 -228 -247 43 93 -52 56 -91 -21 39
6647C9K7l1R6j18L6r6l9p1o4J23n4M6J91p7l01M24l23K04K08j34l24J71J8j5L11
$$ 39 66 35 131 13 49 -47 -86 -157 -221 -98 -152 -106 85 8 -293 131 -192 12 220 86 -238 -67 -49 -64 247
6672B47n19J5N37m25J88O6j96O0J73j66PQ4k2k09J06j5M9J08l42K41N1N9J4j58
$$ 247 -272 -257 280 -145 43 109 -87 -27 146 -20 -13 71 49 -160 -54 -69 -20 88 -254 -13 38 97 111 -47
6696d7M7j36J30Q7q7n9K80j9k51L8J88n5k38J42J04j81J96j11RR9k65N2M0j94
$$ -47 0 -136 -6 81 -6 -65 215 196 -55 -17 171 116 -122 20 124 -57 139 28 37 136 -129 -77 -37 -231
6720b31K84l6j56p9J60J32j08J25K5p0Nk98L63j79L6J5p8r1J52l3J87j29r5J95
$$ -231 53 17 -139 -218 -58 74 -34 91 116 46 51 -247 116 -63 -27 -12 -90 -181 -29 -62 125 -4 -99 96
6744I6k64J65J10j7l3l17J09K67j60K89k41r2K3Q9O5J79m46J53K25j42L3k22K10
$$ 96 -168 -3 107 90 57 -260 -151 116 -44 245 4 -88 -65 24 89 268 -178 -25 200 58 91 -131 79
6767G9M3m30L66lO8j54qj9J36Rr7l3K92k06j07J56p7j24j0j60J78P5J2J90k46
$$ 79 122 -308 58 55 123 -31 -39 -58 78 87 -10 -43 249 43 -64 92 15 -109 -119 -279 -101 -26 -14 176 -70
6792g0J33j00Q5k29MP9p3J37l1M7j73N9L13j29o9l35L88j23Q8q1O4K09j01j36
$$ -70 63 -37 48 -181 -177 -98 -171 -34 -65 -18 -191 -132 181 52 -17 -352 36 -87 1 -80 -16 193 92 -44
6816d4PR7k0J3J8O4j94J57j34l4q6Q5J43qM6j48P1J0J6l17L70l96L00P7j62q5
$$ -44 -37 60 40 53 71 135 -59 98 -36 -70 -156 -71 72 64 110 -38 33 43 59 -258 112 -284 16 93 -69 -154
6842a54K47j21J38j90R3k9l3J14q1q6O4J47K2k68J22P0J13k09j13M2J87j15J1
$$ -154 93 -28 110 -80 13 -16 -49 65 -16 -102 -38 109 131 -137 -15 55 168 -41 -154 -112 75 -40 -29
6865b9K3l4n1r7K03jN7k16K15k9o6J4o5R0j16q9L2K96k17J61L5l42L9L63k65P6
$$ -29 -6 -40 -91 -188 15 14 71 -145 70 41 -25 -11 -76 14 -102 -191 -159 137 -80 81 116 -226 -187 176 -89 -13
6891a3Ol4L4L7n0Kj2K95m00L69k94L04l00K35k32J38J07l78L23k1o6o8Q0M9J7
$$ -13 -7 -41 -7 30 -20 -18 -30 265 -135 234 -60 244 -56 179 -53 85 192 -186 137 116 50 -18 62 111 128
6916A28r5o3M1J37j66k1J21r4j97J18L14k62R9j29J39m0K7r9O8L27l73o3R5P2
$$ 128 33 -30 11 148 -18 -39 82 -12 -209 -91 223 -39 60 -69 70 30 57 -42 26 353 -20 -83 12 84
6940H4l4R4p6J63j96J23k56K89m23K71J12r2j42J84k44K09l3j76J83j15J08J79
$$ 84 50 144 68 231 35 158 -98 191 -232 39 151 59 -83 101 -143 66 33 -143 40 -75 33 212
6962B12pl76K90m23L44j9J7J62j49j26k6N1k11O4M22k49j67L56j95R1l7o1K2j05
$$ 212 205 -171 119 -304 40 21 38 200 51 -75 -101 -50 -261 -197 225 -24 -191 165 -30 61 24 -37 -15 -120
6986a20K68l36K31r4l1J04O4o3j36J7K00j93K86qj52J21r7J75p6J07k72J45m09
$$ -120 148 -188 43 -51 -82 22 86 23 -113 -96 104 -89 197 189 37 158 61 236 160 267 -5 140 -269
7009b69K21K67m15L22N7k09J20k66J15K17k60J7l5K11l16K22L5M7K76l13n5p1
$$ -269 -48 219 -196 126 183 -26 94 -172 -57 160 -100 -83 -118 93 -223 -1 34 81 357 44 -11 -82
7031h2J92l16K47k95K22j34J78K3R7l00L68lm7j09j02J33P8J37m31K51o1m14M39
$$ -82 110 -206 41 -254 -32 -166 12 35 132 -168 200 197 150 41 -61 72 150 287 -144 107 46 -368 71
7054G1j83j8j5K4J16K68k33k7p5N6K45m08L30k61J76r4M0O1J06p5j44J28k64K33
$$ 71 -112 -130 -145 -121 -5 263 30 3 -72 -16 229 -179 151 -110 66 -28 12 73 179 104 -40 88 -176 57
7078E7k42J64n16O45j04R8k87K90j83j58K42J48j59J84o1j46k5R6l0m4Q8j11L99
$$ 57 -185 -21 -537 108 4 102 -185 105 -78 -236 6 154 -5 179 118 -28 -53 43 13 -31 57 -54 345
7101C45m17j91K81J79k13K54j20j03j45J39j27K74k04r8K57l48J51Q8R3o7l91
$$ 345 -72 -263 18 197 -16 238 118 15 -130 9 -118 156 -48 -146 111 -237 -86 2 95 28 -363
7122c63K48mQ3K3Q6j86J03l9j5o6J99o3j53k3K61l8l29L35k51R9j10K58k69L0
$$ -363 -115 -119 -36 -13 73 -113 -10 -49 -64 -130 69 6 -147 -170 91 53 -276 59 -192 -93 -203 55 -214 -184
7146a84K42pk62J26L04j99P8l21M02k06n3J44j26%J92l99N61m34J42r8j95L06
$$ -184 58 51 -211 -85 219 20 98 -223 179 -27 -80 64 -62 -62 130 -269 292 -142 0 -98 -293 13
7168A3J26L07m35j92K87l20o5J53K01j2k1j11k03L66j82P6L9Jonj66o6L75m0j08
$$ 13 139 446 11 -181 106 -214 -279 -126 75 63 42 -69 -272 94 -88 -12 27 28 22 17 -149 -215 160 120 12
7193A2N4k00J05J67k56L15j09j41J30O7l12J3L18k0k20M5j45K92j21j38J68J18
$$ 12 66 -134 -29 138 -118 197 88 -53 77 144 -168 -155 163 143 -77 -32 -177 115 -6 -144 24 142
7215A42l18L0N18l75K57m02l8J53j27j30M02J35j61P1l01K31k52R8K23q0j42K03
$$ 142 -176 -146 372 -3 254 -148 -186 -33 -160 -290 112 247 86 157 -144 87 -165 -67 156 76 -66 137
7237A37l00M03j10j00N4p7J22k11j3N1O9J01k48O3J57Kj95J68q9J21q9k32kL49
$$ 137 -163 240 130 30 84 7 129 -82 -95 -44 25 126 -122 -59 98 100 -95 73 -16 105 16 -216 -218 131
7261A31o8J68K8k68j7rJ22J77j65l51J62K02j06l52M97j69rP2K77m56J69K2L2
$$ 131 63 231 259 -9 -26 -35 87 264 99 -252 -90 112 6 -346 151 -18 -27 45 322 -134 35 57 89
7284H9J54m27m2J48p4j9J73j08J91m6j9J44M1r8k16K38k0j47K3K21j7r1l36K66
$$ 89 243 -184 -226 -78 -152 -171 2 -106 85 39 20 164 205 107 -109 129 109 -38 -15 206 189 98 -238 28
7308B8k07j8j28K62M2J01j31m8j30p6L38j27n9J84j75L3J07m9J8j78K26j08K43
$$ 28 -179 -197 -325 -63 -21 80 -51 -99 -229 -305 33 -94 -153 31 -144 -111 -4 -53 -35 -213 13 -95 148
7331A48j99J91o1l8k30P7N7p9O1K76l23J98j21L95j84l2J5J0j39J00Qj2j23k53
$$ 148 -51 140 79 41 -189 -112 -55 -134 -73 203 -120 78 -43 352 168 136 151 161 22 122 130 118 -5 -258
7355b58M30j31N7j50M0J08m1j29K10j17K43k30L6j88L37Mk38l6P2L3P3J02j24
$$ -258 172 41 98 -52 -12 96 55 -74 136 19 262 32 68 -120 217 221 -17 -53 19 52 125 227 103
7378A03J11J3k83k4j47J38K44j69K0J21o6J65k2j79J20J38j75o0j9j64l1L04J93
$$ 103 214 227 -56 -80 -227 -89 155 -14 6 127 61 226 204 25 145 283 108 48 29 -135 -166 138 331
7401C31l39j04k78K30L2J20p9L17j78l31L44l8o7n8O9k64J74L66N3k37J33k26
$$ 331 -8 -112 -390 -160 -128 -8 -87 230 52 -279 65 27 -40 -98 -29 -293 -119 247 300 63 196 -30
7423c0J05l54L4O9K40j18L53l06k31J04J59J83j98j65K39j77k7K95pl88j39L71
$$ -30 75 -279 -245 -176 64 -54 299 -7 -238 -134 25 208 10 -155 84 -93 -120 175 168 -220 -359 12
7445A2R9r4L4q3J33k46j23L20J28j47J47j14j33K48l46N10k96r5J02J41p9k73
$$ 12 111 17 51 -32 101 -145 -268 52 180 33 180 66 -67 181 -165 345 49 -46 56 197 118 -155
7467a55L50j67j96K78P4j07J6j49QJ42q9%J84j01j82R4j33M5K53j66n3L2j98J16
$$ -155 195 28 -168 110 184 77 93 -56 -48 94 5 5 189 88 -94 0 -133 -88 165 -1 -54 -22 -220 -104
7491a04M6J62m6k89J91j08K6l0J61l4o1mM2j86J79K33o1j35n1N6L05l19qR6Q6
$$ -104 -58 104 58 -231 -40 -148 -122 -152 9 -25 -86 -90 -48 -234 -55 178 117 -18 -69 -13 292 -27 -35 61 147
7516A47kl04K7K10j06J51pk55K69J10k37J62l77Q4M9J05j10J61j5j51M9j05L02
$$ 147 145 -159 -132 78 -28 123 116 -139 130 240 3 165 -212 -128 -79 26 -84 77 62 -89 -40 -145 157
7539A57j38j63K38j69J51J1l21L16k94K52j6o0J58Q4n6m8k6j38n1J35j19L71l79
$$ 157 19 -144 94 -75 76 87 -234 82 -212 40 24 -36 122 206 150 102 76 -62 -113 22 -97 274 -105
7562a05R4j97L80j96l1j7prJ72p6J09k07J78l05L13k75k2M9L04m2j47j46N2P9
$$ -105 -11 -208 172 -24 -55 -72 -79 -88 84 8 117 -90 88 -217 96 -179 -201 -152 152 110 -37 -183 -131 -52
7586e2p0K90j55r6J51O2k30J31j81J07l9R2j65M65j31j87l9k5k25K86KN9l06L42
$$ -52 -122 168 13 -83 68 130 -100 31 -150 -43 -82 10 -155 310 179 -8 -47 -72 -297 -11 -9 50 -256 86
7610H6K8k87J02J24j00j5K92l48J37m41M75k3m0q1M04n21L05J34l53j19K02J51
$$ 86 114 -173 -71 53 -47 -62 230 -118 19 -422 53 30 -10 -91 313 -208 97 231 -122 -241 -39 112
7632A12m50L95j30j1J13K41k68%j9J27j15J61m99M00k09M38k85p8J16j63K50j86
$$ 112 -338 57 -73 -84 29 270 2 2 -17 110 -5 156 -343 57 -152 286 1 -77 39 -124 126 -60
7654f0NP8K4j01K53k21L43l27J23ok38M5k5k13K40j80p2N07m46K07J79j31J35
$$ -60 -55 23 47 -54 199 -22 321 -6 117 111 -127 -82 -107 -320 -80 -260 -332 175 -271 -64 115 -16 119
7677A19mj78n4J86j06J8o0L11p3k41j6J90l0j61K12k88J14K8l6R1r0K01p6k14
$$ 119 115 -63 -117 69 -37 -19 -79 232 159 -82 -98 92 62 -99 113 -175 -61 -33 -69 22 -68 133 57 -157
7701a57K71j11j22J00k6QL8k11K78m45M13m4J05P3k67K55n3k50J08j71K15MM0
$$ -157 114 3 -119 -19 -45 -37 1 -210 68 -377 36 -8 97 170 -97 158 105 -145 -37 -208 7 11 51
7724E1j04L14k94j47K55l09L94r7r1j47K67k53J51L8l7Q2j6j41nJ22n7O4p1J55
$$ 51 -53 261 -33 -180 75 -234 160 63 -28 -175 92 -161 -10 28 -9 73 57 -84 -89 33 -24 40 -31 124
7748A24k58O8j69K95r1r6M39k55o3l6K4R3J18o1J7m2j08L7j78J86J60k00Q3k25
$$ 124 -134 -66 -235 60 -31 -127 312 57 -6 -42 -18 75 193 132 149 107 -1 36 -142 44 204 4 87 -138
7772a38Q7J77j95R0O4r3j0Ml2J5K0J25j05j18l8K70k03L50j10l46K28p0K58k94
$$ -138 -51 126 -69 21 85 -8 -18 -14 -46 -31 -11 114 9 -109 -147 123 -80 270 160 -186 42 -28 230 -64
7796f4m7J61j78K20Q9j15J0k41J36j24K98l06K44K03k67jJ19k15K41J66k90j08
$$ -64 -111 50 -128 92 181 66 76 -165 -29 -153 145 -161 83 286 19 18 137 -78 163 329 39 -69
7818f9P3K78j54J31m26K15j92K66K6j54j16QL6Q2lo6k82K81J8j73L77j05mK6O0
$$ -69 4 282 128 259 -167 48 -144 122 148 -6 -122 -114 -78 4 1 -65 -347 -66 -48 -221 156 51 47 73 133
7843A33j38l06L07J7q2j16J04Q2N9q5j19J70lJ16j2j41k95K47K50k91Q4j92R7
$$ 133 -5 -311 -4 13 -69 -185 -81 1 60 -25 -144 26 23 139 127 -14 -309 -62 188 -103 -19 -211 -114
7866a14J94Lj28k3pR8J78k99J05Q7j99M9oMK0L6J1n7J3lj56K52k8Rj38j82L95
$$ -114 80 83 -45 -68 -75 23 201 -98 7 94 -105 -56 -62 -58 -38 -2 9 -48 -35 -38 -194 58 30 39 -99 -281 114
7893A14j72l7J96j6j50pJ38k85J22J82q1j1j15L25l32k02K59k78K20J04N9k20
$$ 114 -58 -95 101 85 -65 -72 66 -219 -97 85 4 -7 -122 203 -129 -331 -72 -350 -130 -26 33 -187
7915a87K33k36L4J7J35j71L51k30Q7r9Q9Q8j74k7k9K01k51J04K36q2j87J89l9
$$ -187 46 -190 -156 -139 -4 -175 176 -54 33 -66 23 111 -63 -90 -119 82 -169 -65 171 89 -98 91 52
7938E2J74l97P9l6J36m8q3j46N64l59N05n41J01O8r0J45j63l74L12L11n07L65
$$ 52 226 -171 -92 -128 8 -40 -123 -269 295 -64 441 -100 1 69 -21 124 -39 -413 -101 210 -297 68
7960F8J04j57k4M5q2N6j83Q5L06k57q1O3K8j58K44j11J40R2k11K44k53N5K2j57
$$ 68 172 15 -9 36 -46 10 -173 -88 218 -39 -120 -57 -29 -187 57 -54 86 178 -33 211 -42 13 35 -122
7984a22P7o4J16n3k4n6L7j0P1K08n6n5L05k73j21J54J2j39L2o9j3q5J03L6N8k96
$$ -122 -45 -109 7 -46 -70 -126 -89 -99 -28 180 124 69 374 101 -20 134 146 7 39 -30 -43 -128 -25 11 69 -227
8010b27L88k32o5K41k15J62n2K74o5j44O9j41J7K42k03j9j19j8lj3K12Kk37q9
$$ -227 161 -71 -136 105 -110 52 0 274 209 65 134 -7 10 252 49 30 -89 -107 -110 -123 89 91 -146 -235
8034b35L58j58J32Q2j84M1j14M2k16K03P2k7j34L04j22J30j38o6K9J38k11L3L
$$ -235 123 -35 97 179 -5 36 -78 -36 -252 -49 23 -4 -138 166 44 174 36 -30 -1 137 -74 -41 -38
8057c8J7o9K43k30j39K68l08J60k5N8J78P8k73O3Q6j82Q1K4j97K22o3m4n0L06
$$ -38 -21 -90 153 -77 -216 52 -256 -96 -121 -63 115 193 -80 -17 69 -113 -32 -8 -205 17 -46 -90 -140 166
8081A66j28j59J54l37L34j29L6RR9j07n2J16k43L75k10P1r4J37J72j3m93J26K
$$ 166 38 -121 33 -304 30 -99 -63 -54 45 -62 -114 2 -241 134 -76 -5 -99 38 210 197 -296 -170 -168
8104a68J28Q5K23l68j0p1L14j44OJ11l83M99k24J27j59L08j09j14j47R7k00K63
$$ -168 -40 45 268 -100 -110 -181 133 -11 -5 106 -277 222 -2 125 -34 274 165 51 -96 1 -199 64
8126F4RJ0j51l80L51J45J57k87K03o7j10J62j20O0J03j28n6K6j22L32j28j10k
$$ 64 73 83 -68 -448 -97 48 205 -82 121 54 -56 106 -14 46 149 21 -35 -9 -131 201 73 -37 -39
8149c9L6O1M8j7m56M27k8Q4j78Q9l0j14J52K48k37K29l11J0n4j07L02l37L74Q
$$ -39 -3 58 106 89 -367 60 32 116 -62 27 -3 -117 35 283 46 275 -36 -26 -80 -187 115 -222 152 160
8173A60l23L38N4j05j27j85L16q1K03m09R5l7P8J06l5j94J67r
$$ 160 -163 175 229 124 -3 -188 128 47 250 -159 -64 -101 -23 83 48 -146 21 12
8191A2
$$ Imaginary data points
##PAGE= N=2
##DATA TABLE= (X++(I..I)), XYDATA
0@%%%%%%%%%%%%%%Qj6J6j6J6k1K9l2L7m5N3o1P2q3R1j04J20j37J56j76K00k26
$$ 0 0 0 0 0 0 0 0 0 0 0 0 0 0 0 8 -8 8 -8 8 -13 16 -16 21 -24 29 -32 40 -43 48 -56 64 -73 83 -93 107 -119
36a19K52k82L15l52L92m34M80n32N87o45P14p88Q66r54J052j160J278j409J559
$$ -119 133 -149 166 -186 206 -228 252 -280 307 -338 376 -412 454 -500 552 -608 670 -739 820
55H20j729J921k143K405k718L096l563M159m949O049p681J0345j5398K8080j13962
$$ 820 -909 1012 -1131 1274 -1444 1652 -1911 2248 -2701 3348 -4333 6012 -9386 18694 -95268
70i5268j75317L71340P1508k71271O0854J74837j77291m3665K26392o6178k19725
$$ -95268 -270585 100755 172263 -99008 -38154 136683 -40608 -84273 142119 75941 -143784
81a43784J50625J31764k08714m1098K17167m8731j72248R3988P9188j12592L4970
$$ -143784 6841 138605 -70109 -111207 105960 57229 -115019 -21031 58157 -54435 -19465
92a9465R9219j26030o3697J77158J7426j56753M5251R9752r4168j8072J18177
$$ -19465 79754 -46276 -109973 67185 84611 -72142 -26891 72861 -21307 -39379 78798
103G8798n7905j07588J04758N4550j24542J3104J09523p4897o1343J08563r600
$$ 78798 20893 -86695 18063 72613 -51929 -38825 70698 -4199 -65542 43021 33421
114C3421j07231Q5204P2978j47881k1872J72121l6177j47404R6853Q9794j30704
$$ 33421 -73810 11394 84372 -63509 -85381 86740 50563 -96841 12 89806 -40898
125d0898l444J38994q0637j15806J39509N5472j75786P289J61401p2907j15572
$$ -40898 -44342 94652 14015 -101791 37718 93190 -82596 -75307 86094 13187 -102385
136a02385J16792M7210j23571L2566J06817q6655n2342J20028r290j14914P2928
$$ -102385 14407 61617 -61954 -29388 77429 -9226 -61568 58460 49170 -65744 7184
147G184Q2845j16982l1657J24783k9934j05961P4585N0943j10300M872J08138
$$ 7184 90029 -26953 -58610 66173 36239 -69722 4863 55806 -54494 -49622 58516
158E8516o1355p8981J02026L1006j10707L2996J03731p6304o6084J00363J6835
$$ 58516 -2839 -81820 20206 51212 -59495 -26499 77232 928 -65156 35207 52042
169E2042r3993L5352O1788q0028j8179R7767k8759q7642O6658N0989q9230m315
$$ 52042 -41951 -6599 55189 -24839 -43018 54749 25990 -61652 5006 55995 -33235 -37550
181c7550Q8836m2222o9332P0389K9479p8330J8539O7989n7514l8154Q0964L653
$$ -37550 51286 9064 -60268 10121 39600 -38730 -20191 47798 -9716 -47870 33094 36747
193C6747p6499L2943N1774o0649j6428P0628k1811o0969M7782L0378o3088P343
$$ 36747 -39752 -6809 44965 -15684 -32112 38516 16705 -44264 3518 33896 -29192 -21849
205b1849N8646m3142l9558O5055R667o7022K8962N7205n4096k7663O9507l942
$$ -21849 36797 -6345 -45903 19152 28819 -38203 -9241 47964 -6132 -33795 35712 31770
217C1770o1840L5631L5894o3000q613O6016k7146n8845M8617K9421o2251P039
$$ 31770 -30070 5561 41455 -21545 -30158 35858 8712 -50133 -1516 27905 -34346 -27307
229b7307O2185l6930m3061N8932K0041n7537J5516M5662m2259k0865O0506n856
$$ -27307 34878 -2052 -45113 13819 33860 -23677 -8161 37501 -4758 -25623 34883 29027
241B9027o0661K7587M0043m5189j3788M8819j7252m4864L5040K5512m2149J144
$$ 29027 -31634 -4047 35996 -9193 -22981 25838 8586 -36278 -1238 24274 -17875 -16731
253a6731L6806k8017k2538M6490N395m6758J2494L5515k6329j0979L4647j1192
$$ -16731 20075 -7942 -30480 16010 21405 -25353 -12859 22656 -3673 -14652 19995 8803
265H803l0702L0020J8862l7796R15L3096k2590k2625L5063L830m0155J1760K9067
$$ 8803 -21899 8121 26983 -10813 -9898 23198 608 -22017 13046 16876 -23279 -11519 17548
278A7548k6240r807L5660j0681l3563L0306K4149l5575l872L4072j8353k4747
$$ 17548 -8692 -18499 17161 6480 -27083 3223 27372 -8203 -12075 21997 3644 -21103
290b1103L4143Q406m2385O312L2734k3527j6551L3504l923l4354K2669K7441l0159
$$ -21103 13040 21446 -20939 -14627 18107 -5420 -21971 11533 7610 -26744 -4075 23366 -6793
303f793q136L4700j0240k6249K8461J4214l6261N85L0208j8436j8572K7434k256
$$ -6793 -14929 19771 9531 -16718 11743 25957 -10304 -9719 20489 2053 -16519 10915 8659
316H659l3975J6975K6976k7398j1538K9832p187k3754K6111J4300l3237J153L1360
$$ 8659 -25316 -8341 18635 -8763 -20301 9531 2344 -21410 4701 19001 -14236 -13083 18277
329A8277j5154j8453K8829J942l3134J5576K8312k7033j3580L0756p001k8726
$$ 18277 3123 -15330 13499 15441 -17693 -2117 26195 -838 -14418 16338 9337 -19389
341a9389K3984J6568l6532l265L4540j4698k4657K8700O752l5395J3575L3688
$$ -19389 4595 21163 -15369 -18634 15906 1208 -23449 5251 12003 -23392 -9817 23871
353B3871k6763j8586L5684J40l2356K1442K2849l5828p191L8926j3589l2255K7988
$$ 23871 -2892 -21478 14206 14346 -18010 3432 26281 -9547 -16738 22188 8599 -23656 4332
366D332J3357l8125N953L7238k4089k4360L6308P204l6456J6359K9608l2893j3287
$$ 4332 17689 -20436 -14483 22755 -1334 -25694 10614 17818 -18638 -2279 27329 -5564 -18851
379a8851M0511o518l8285K3386K2154l7717l289L9531j9119l2452L5023J5703
$$ -18851 21660 15142 -23143 243 22397 -15320 -18609 20922 1803 -30649 4374 20077
391B0077m0636O742L6821k5810k0712M0814J905m2646J9618L4069l4672j4684
$$ 20077 -20559 -13817 23004 -2806 -23518 17296 19201 -23445 -3827 30242 -4430 -19114
403a9114M1144r034l7547K9446K2283m2237k278M2345k1251l2419L7306J2339
$$ -19114 22030 12996 -24551 4895 27178 -15059 -17337 25008 3757 -28662 8644 20983
415B0983m5589Q636L9922k8900k3585M1334P72m1607K4432L4580l9701j5087M7177
$$ 20983 -24606 -15970 23952 -4948 -28533 12801 13573 -28034 -3602 30978 -8723 -23810 23367
428B3367o347l8707K8223K0869m2844k3M3888k3191l4948L7527J2926m5106J0308
$$ 23367 17020 -21687 6536 27405 -15439 -15462 28426 5235 -29713 7814 20740 -24366 -14058
441a4058M1138l1344k4162M3609K465m2757K2547L3420m1134j4614M8698p770
$$ -14058 27080 -4264 -28426 15183 17648 -25109 -2562 30858 -10276 -24890 23808 16038
453A6038m4213K7239K4943m1342r75M3540k3001l4868M1029J7108m5096Q742L9686
$$ 16038 -28175 -936 24007 -17335 -18310 25230 2229 -32639 8390 25498 -19598 -10856 28830
466B8830l0901k3116M5946J421m7107K1245L3599m0423j2979M9059j1936m6448
$$ 28830 -2071 -25187 20759 22180 -24927 -3682 29917 -10506 -23485 25574 13638 -32810
478c2810L1060K9647m3357n214M4341k0767l5492M0461J7834m7500M329M2053
$$ -32810 -1750 27897 -15460 -20674 23667 2900 -32592 7869 25703 -21797 -17468 24585
490B4585k5717k4544M2365K937m5626K0053L8014l4701j7004M1899q787l8918
$$ 24585 -1132 -25676 16689 19626 -26000 -5947 32067 -2634 -19638 22261 13474 -25444
502b5444L1440K5164m7640p170M6996j6646l7850L4740J7979m4554M448M2866
$$ -25444 5996 31160 -16480 -23650 23346 6700 -31150 3590 21569 -22985 -18537 24329
514B4329k4129k6727L9693O093m2720J8151L7181l5200k0531M1327k346l7112
$$ 24329 200 -26527 13166 19259 -23461 -5310 31871 -3329 -23860 17467 15121 -21991
526b1991K3931K1365m1806j102M6993j9874l9391L6016K2321m2831K016M0602
$$ -21991 1940 23305 -18501 -19603 27390 7516 -31875 4141 26462 -16369 -14353 26249
538B6249k4751k7436M0080P930m5351J2902L7542l0730k2138L9363R36l6969J8354
$$ 26249 1498 -25938 14142 22072 -23279 -10377 27165 -3565 -25703 13660 14596 -22373 -4019
551d019K4871l2642m966L8258j5596l3611L2348K1046m0265q49L6471j8990k3238
$$ -4019 20852 -11790 -16756 21502 5906 -27705 4643 25689 -14576 -15425 21046 2056 -21182
564b1182L5031N354m1757J4854L7693l0362k3738L8492L326l7710J5365K5803
$$ -21182 13849 19203 -22554 -7700 29993 -369 -24107 14385 17711 -19999 -4634 21169
576B1169l1235r401L5427j1105l1502K8101J9171l7260o48L7811j5339k5309L0107
$$ 21169 -10066 -19467 15960 4855 -26647 1454 20625 -16635 -17283 20528 5189 -20120 9987
589I987Q909l5503J1683L2255k7990k1231L5896K985l6676J3991K6471k8249j2399
$$ 9987 18896 -16607 -4924 27331 -659 -21890 14006 16991 -19685 -5694 20777 -7472 -19871
602a9871L3705m735l0186K0210J9400k8469k989K9912j2703k2695K5044Q895l0163
$$ -19871 13834 9099 -21087 -877 18523 -9946 -12935 16977 4274 -18421 6623 15518 -14645
615a4645O632K6171k1308j5895K9830J926k9877J3085K2053k3832p516K9467p490
$$ -14645 -8013 18158 -3150 -19045 10785 12711 -17166 -4081 17972 -5860 -13376 16091 8601
628H601k7483K0453J7741k7602l808K7194j1861k0439K3284Q461k7970N078K4803
$$ 8601 -18882 1571 19312 -8290 -12098 15096 3235 -17204 6080 14541 -13429 -8351 16452
641A6452j7237j4394K4229J47k6391J3296K1051k3306j0161K5744l783k1979J6868
$$ 16452 -785 -15179 9050 9197 -17194 -3898 17153 -6153 -16314 9430 5647 -16332 536
654E36J5124k3894k529K5340p580j7847J7848P068k3143M151K1535j4389j5947
$$ 536 15660 -8234 -10763 14577 6997 -10850 6998 14066 -9077 -4926 16609 2220 -13727
667a3727J7752K923j8491P664J3374j7047n785K1605l176j8014J2311J1443j7257
$$ -13727 4025 6948 -11543 -3879 9495 -7552 -13337 8268 5092 -12922 -611 10832 -6425
680f425jJ8853q549j4745J4732O375j6597L252J4114j2957q712J7862Q39j7420
$$ -6425 -6426 12427 3878 -10867 3865 10240 -6357 -3105 11009 -1948 -10660 7202 8041 -9379
694i379P097J2249j3222m279J5660m409j3753J0602P814j4946K18J4095p998j0171
$$ -9379 -2282 9967 -3255 -7534 8126 3717 -10036 566 8380 -6566 -6348 7747 -251 -10422
708a0422J4300L476j4803L480J2527q575o371J2021j813j1555Q018Q396j2272
$$ -10422 3878 7354 -7449 -3969 8558 -17 -6388 5633 3820 -7735 283 8679 -3593
721c593k862J2223l493r430R847L992j1774K043J1346o825o330R521k53j0161
$$ -3593 -6455 5768 2275 -7155 2692 6684 -5090 -3047 8299 1474 -4856 4665 4412 -5749
735e749N390P077j0107l655J0042l059p852P894L779j0232J701J0116m357n241
$$ -5749 -359 6718 -3389 -7044 2998 -61 -7913 -19 3760 -6472 -4771 5345 988 -4253
749d253Q179K89q042N501O861r093l485R339k312p498O179K878r302J188Q207
$$ -4253 3926 4215 -3827 1674 8535 -558 -4043 5296 2984 -4514 1665 4543 -4759 -3571 4636
764D636n182m446P511m98q513N602P427q871l374Q461j919n972P041K312r840
$$ 4636 -546 -4992 2519 2021 -6492 -890 6537 -2334 -5708 2753 834 -5138 1903 4215 -5625
779e625K251R636n121n634Q299J78q873N280P482r197l612R210k349p013O721
$$ -5625 -3374 6262 1141 -4493 3806 3984 -4889 391 7873 -1324 -4936 4274 1925 -5088 1633
794A633L180j0883J583J0806m821p439Q224J629r596N396Q199j0041n223J0787
$$ 1633 4813 -6070 -4487 6319 1498 -5941 2283 3912 -5684 -288 7911 -2130 -7353 3434
808C434q53r151O585M879j1645N69J3183n359q857R430L515j0101M108J0262r509
$$ 3434 2581 -6570 15 4894 -6751 -6182 7001 1642 -7215 2215 5730 -4371 -263 9999 490
823D90o379J2087M92j1788N078O781j1863k033J3774m422j2214Q678O538j1393
$$ 490 -5889 6198 6690 -5098 -20 6761 -5102 -7135 6639 2217 -9997 -1319 5219 -6174
837f174J464J2339q405r222J3373L799j3298L446J1114j0275n713J4561q77j4269
$$ -6174 -4710 7629 -776 -9998 3375 7174 -6124 -2678 8436 -1839 -7552 7009 6132 -8137
851h137P589J0095j2258k737J4069n025j2610J1718O405j5554M66J4333q862j0270
$$ -8137 -548 9547 -2711 -5448 8621 3596 -9014 2704 9109 -6445 -5979 8354 -508 -10778
865a0778J4352K458j5953N503J3735j1485o869J5927j258j5322R820J1115j4994
$$ -10778 3574 6032 -9921 -4418 9317 -2168 -9037 6890 5632 -9690 130 11245 -3749
878c749l803J6236n160j3722J2341P022j6286J190J6204r171j1658J5571L815
$$ -3749 -7552 8684 3524 -10198 2143 9165 -7121 -5931 10273 1102 -10556 5015 8830
891H830j6521N404J3811j2912p860J6310r91j6524Q517J1090j4956m092J7177
$$ 8830 -7691 -2287 11524 -1388 -9248 7062 6071 -10453 -1936 9154 -5802 -9894 7283
904G283m761j4427J2863Q506j6216R25J7083r397j2600J6173M883j8114M243J5021
$$ 7283 2522 -11905 958 9464 -6752 -5827 11256 1859 -10741 5432 10315 -7799 -3556 11465
918A1465j2856q336J7645p52j8304R229J3242j5552m585J7671m744j6270J3313
$$ 11465 -1391 -9727 7918 7166 -11138 -1909 11333 -4219 -8804 8867 4123 -12147 1166
931A166R335j7685m94J7135r347j2360J6447N465j9190L651J7617j1634r525J7224
$$ 1166 10501 -7184 -7678 9457 110 -12250 4197 9662 -9528 -5877 11740 106 -9419 7805
945G805J46j8117Q921J4659j5609p609J7193k753j5316J1563R454j8142j322J9032
$$ 7805 7951 -10166 -1245 13414 -2195 -9804 7389 4636 -10680 883 10337 -7805 -9127 9905
959I905p150j3175J3979N022j7285M379J6783j2658j1262J6664J892j7208P523
$$ 9905 2755 -10420 3559 8581 -8704 -4325 12458 -200 -11462 5202 7094 -10114 -2591
972b591J3208j5601o232J9242j722j6844J0362J0737j5960j308J8706p713j5371
$$ -2591 10617 -4984 -11216 8026 6304 -10540 -178 10559 -5401 -6709 11997 4284 -11087
985a1087J3931P465j6593K040J4599j1924j0244J7510K737j8616N947J3896j3116
$$ -11087 2844 10309 -6284 -4244 10355 -1569 -11813 5697 8434 -10182 -4235 9661 -3455
998c455o222J7558k519j7037J0517J1900j5640l564J7328n350j4759J3318Q551
$$ -3455 -9677 7881 5362 -11675 -1158 10742 -4898 -8462 8866 3516 -11243 2075 10626
1011A0626j6247p5J5532p748j0502J4447K595j6641M461J4157j1402q462J4727
$$ 10626 -5621 -5696 9836 2088 -8414 6033 8628 -8013 -3552 10605 -797 -9259 5468
1024E468j156j4844Q754J0845j4489l686J6527l786j4022J1738Q725j5470m44
$$ 5468 4312 -10532 -1778 9067 -5422 -9108 7419 3633 -10389 1349 10074 -5396 -5840
1037e840J5093p131j1030J2701L744j5174L671J3470j0262p955J3881O31j3294
$$ -5840 9253 2122 -8908 3793 7537 -7637 -3966 9504 -758 -8713 5168 5799 -7495
1050g495O654J0069j2584l454J4916m279j2794R759P345j3951n93J4025o893j0680
$$ -7495 -841 9228 -3356 -6810 8106 3827 -8967 792 8137 -5814 -6407 7618 725 -9955
1064i955J1919M442j3442K827J2569q508p460J2503J457j2873N025J0350j0412
$$ -9955 1964 6406 -7036 -4209 8360 -148 -7608 4895 6352 -6521 -1496 8854 -1558
1077a558m215J2124k811j1060Q428P130j1815j693J2097m734r149R909L942j2976
$$ -1558 -5773 6351 3540 -7520 908 8038 -3777 -5470 6627 1893 -7256 2653 6595 -6381
1091f381J589J1421o774p907J0286J440j1036M938R316q755m735J1101l91r004
$$ -6381 -4792 6629 -145 -8052 2234 3674 -7362 -2424 6892 -1863 -6598 4503 4112 -4892
1105d892N983O047r628j397J0761m114q661O748L751r285J346R161o195o726R038
$$ -4892 1091 7138 -2490 -3887 6874 2760 -5901 847 4598 -4687 -3341 5820 -375 -7101 1937
1120A937K498r139L029O994p337l192R399o09q981M038N721o871r49P899l783
$$ 1937 4435 -4704 -1675 5319 -2018 -5210 4189 3580 -5401 -1363 4358 -2513 -3462 4437 654
1135F54o500O634L880p138M68O665m854l745P680Q60q639K533N941m922k507O359
$$ 654 -5846 788 4668 -2470 -2002 4663 -191 -3936 3744 4604 -4035 -1502 4439 -483 -2990 3369
1151C369j807o686M894M580o108j742O596k422m658N372J945o801M64O000l312
$$ 3369 1562 -5124 -230 4350 -1758 -3500 3096 674 -3984 1388 3333 -3468 -3004 2996 -316
1166c16l329N064K79n535L191M604l980k357M975m37m157L631K529n336m72M389
$$ -316 -3645 1419 1698 -3837 -646 3958 -22 -2379 2596 2159 -1998 1633 4162 -1174 -1646 2743
1182B743j981l116K659P32m337J295L557k652j948L599J33l095K211K575l148
$$ 2743 762 -2354 305 1037 -3300 -2005 1552 -1100 -3048 551 684 -2411 -200 2375 -773
1197g73p41L615j097k467K012R50l250J047K920k154j419K633j25k262K070J134
$$ -773 -1514 2101 1004 -1463 549 1499 -1751 -704 2216 62 -1357 1276 1151 -1111 959 2093
1213B093k670k90K603j503j709K399k83k800J432K000k616r26K848l47k290K468
$$ 2093 -577 -867 1736 233 -1476 923 640 -2160 -728 1272 -1344 -2270 578 231 -2059 409
1229D09J059l084P85L153j754k191K804k92k279J521K352l110j057L590o63k204
$$ 409 1468 -1616 -831 2322 568 -1623 1181 889 -1390 131 2483 -627 -1684 1906 1243 -961
1245i61K063J016l152K0L456k365k337K667K76l011J541J822l097q47L951n88
$$ -961 1102 2118 -1034 -1014 2442 77 -2260 407 683 -2328 -787 1035 -2062 -2909 1042 454
1261D54k712K658J150l130J364L970k842k701L505P61l526J726K023m302j109
$$ 454 -2258 400 1550 -1580 -216 3754 912 -1789 1716 2477 -1049 677 2700 -1602 -2711
1276b711N024o22m296K227K297l887K48M972k740m161M019K231m712N75M286m146
$$ -2711 2313 1691 -2605 -378 1919 -1968 -1720 3252 512 -3649 370 2601 -2111 -1536 2750 -1396
1292a396k265N922L22n937K344L826m109n21N686j950n572M354L315n272m11N055
$$ -1396 -3661 2261 2583 -3354 -1010 2816 -1293 -1814 3872 1922 -3650 704 4019 -1253 -1664 3391
1308C391l229m275N922J626o662J119N613m018k821O112m53o688L766N036n850
$$ 3391 162 -4113 1809 3435 -3227 -2108 3505 -513 -3334 2778 2325 -4363 -597 4439 -1411
1323a411k133O414j946n761N177L768o930n94P019k788m414N824K172p448J769
$$ -1411 -3544 2870 924 -4837 340 4108 -2822 -3416 3603 815 -3599 2225 4397 -3051 -1282
1338a282O492m685m170O450m2o997L438N385o880k233P368j311o745N375L750
$$ -1282 5210 525 -3645 2805 2763 -4234 -796 4589 -2291 -4524 2844 1533 -5212 163 3913
1353C913p071J1P631l354n885O073K370p458J519P560n877m191P248J231q058
$$ 3913 -3158 -3147 4484 1130 -4755 1318 3688 -3770 -2251 5309 -568 -4759 2489 3720 -4338
1368d338L508O275p108k334Q420j073p933M539N199p869p01P939l882o591O960
$$ -4338 -830 5445 -1663 -3997 4423 3350 -4583 -44 5155 -2714 -3415 4524 642 -5949 1011
1383A011L334q586Q84P881n000m859Q047J322q504K980O902o244l443Q217j157
$$ 1011 4345 -4241 -3357 4524 -476 -5335 2712 4034 -4470 -1490 5412 -832 -4275 3942 2785
1398B785q147N150N793p899j838Q518k525o647O391L632q641P24Q576m990o227
$$ 2785 -5362 -212 5581 -2318 -4156 4362 1837 -4810 1581 5213 -3428 -2704 5872 882 -5345
1413e345O675K297q627K657P387o762m456Q652L88p763M620N325p465j403R153
$$ -5345 1330 3627 -5000 -2343 5044 -1718 -6174 2478 2866 -4897 -277 5048 -2417 -3820 5333
1428E333k625p628N709M585p887j33P917m390o566P550K885q686J635P277n926
$$ 5333 2708 -4920 789 5374 -2513 -2646 5271 881 -5685 1865 4750 -3936 -2301 4976 -950
1443i50m075Q586K4q978L674O603o625k679P994k145p388O023N138p639j286Q372
$$ -950 -5025 3561 3585 -5393 -1719 4884 -1741 -4420 3574 1429 -5959 64 5202 -2437 -3723 4649
1459D649l721n267P006K417q274P00Q209n088n164P336J76p962L547O461o381
$$ 4649 928 -4339 2667 5084 -3190 -2490 5719 631 -4533 2803 2979 -4983 -1436 5025 -1356
1474a356l577P727p41o649M570M884p614j357Q160k232o641N421L065p674J041
$$ -1356 -4933 2794 2053 -4596 -26 4858 -2756 -4113 4047 1815 -4826 595 3660 -4014 -2973
1489b973P673m248n448O824J943p287K730O180n404l784P306l78o893L618M783
$$ -2973 4700 452 -4996 1828 3771 -3516 -786 5394 -10 -3794 3512 3134 -3759 -141 4642
1504D642o572k258P761j968o440M663L627o352k14O822l282n052N928K211o691
$$ 4642 -1930 -4188 3573 1605 -4835 -172 3455 -2897 -3111 3711 429 -4623 1305 3516 -3175
1519c175J349N769m583l520O901J84o768K962N060n130j993O747j500o180M463
$$ -3175 -1826 3943 -640 -4160 2741 2925 -3843 -881 4179 -951 -2944 3803 2303 -3877 586
1534E86L951n858j213N570k421m635M742K257o603R58N687l229l480N079O79n294
$$ 586 4537 -1321 -2534 3036 615 -4020 722 2979 -3624 -2666 3021 -208 -3688 1391 2070 -3224
1550c224K358M835m607k380N623o65n065L161L274n111o54N523j912m413L736
$$ -3224 -866 3969 -638 -3018 2605 1940 -3125 36 3310 -1801 -2455 3068 1156 -3257 479
1565D79K519m633N27M637k871l766M773R99m922J000L633l400k087M607k02m656
$$ 479 2998 -1635 -1108 3529 658 -3108 1665 2664 -2258 -1258 2375 -1025 -3112 1495 1293 -3363
1581c363K274L248l272r75M322j330l670L374K594m310o95M077j544k573L096
$$ -3363 -1089 2159 -1113 -2088 2234 904 -2766 608 3202 -1108 -1803 2274 730 -1843 1253
1596A253Q75m173P05L864k285k222L282j34l123J818K396l104j565L111r9k874
$$ 1253 2128 -2045 -1340 2524 239 -1983 1299 1165 -1958 -140 2256 -848 -2413 698 599 -2275
1612b275K210J330l273K20L443j135k093K225Q48k629J368K082k072j689K578
$$ -2275 -65 1265 -2008 -1788 1655 520 -1573 652 1500 -1129 239 2321 249 -1440 1138
1627A138M05k174O95J276k178o47K706l37k067J054Q69j619O1K251j125j829J437
$$ 1138 1543 -631 64 1340 -838 -1485 1221 884 -1183 -129 740 -879 -818 1433 308 -1521 -84
1644h4M38j390N98R51j390n06J829K40j582O55J023o61k01J366o18j046O75M15
$$ -84 354 -1036 -438 513 -877 -1383 446 686 -896 -241 782 121 -80 1286 668 -378 297 712
1662G12n06J04K56q63m69J106K1j012J06N88n27L61M77j84r52O51M53n25M82Q7
$$ 712 206 310 566 -297 -766 340 361 -651 -545 43 -484 -123 354 170 -782 -131 322 -203 279 366
1682C66r22j9J001k82m99M37J42k51O18K71p06k30O46j55m57M79l91j100Q60Q59
$$ 366 -556 -575 426 144 -355 82 224 -27 591 862 156 -74 572 417 -40 439 48 -1052 -192 667
1702F67j241j69P87l94p12J177L30j168Q9J439m93p60R97J3j213N52R16r50p37
$$ 667 -574 -743 44 -350 -1062 115 445 -723 -634 805 312 -448 549 562 -651 -99 817 -133 -870
1721h70J469j49j330J207O25j686J83J879j112j120J679J90j966N74J410j363
$$ -870 599 450 -880 327 952 -734 -551 1328 216 -904 775 965 -1001 -427 983 -380
1737c80j348K101L30k044J098J153j930l05K597p50j960J602J323k413L39K337
$$ -380 -1728 373 703 -1341 -243 910 -1020 -1325 1272 522 -1438 164 1487 -926 -587 1750
1753A750j837j464K186J188k908L39K433j976q63K679j58l203J244K408k261p95
$$ 1750 -87 -1551 635 1823 -1085 -746 1687 -289 -1152 1527 1369 -1834 -590 1818 -443 -1238
1769a238K471p91k764K280J621l156k41K960r82j843K473J081l366Q43L113j979
$$ -1238 1233 442 -2322 -42 1579 -1577 -1818 1142 160 -1683 790 1871 -1495 -652 2461 482
1785D82k112L027R7l100J643K361l012j198L186p05k805K390J785l441n28L815
$$ 482 -1630 1397 1494 -1606 37 2398 -614 -1812 1374 669 -2136 254 2039 -1402 -1930 1885
1801A885j293k709K754J082l821O28L732k302k554L287N71l189J396L296l246
$$ 1885 592 -2117 637 1719 -2102 -1474 2258 -44 -2598 689 1260 -1929 -533 2763 -483
1816d83j666M126j97l233J633K240l688j63L869j351l635K610J924l683M46L481
$$ -483 -2149 1977 1780 -1453 180 2420 -1268 -1431 2438 1087 -2548 62 1986 -1697 -1251 2230
1832B230k230k981L870J465m570J220L255k961j523L852j6m362J952L312l247
$$ 2230 0 -2981 889 2354 -2216 -996 2259 -702 -2225 1627 1611 -2751 -799 2513 -734
1847g34q97L922j314l488L305K355m088m07L865j674l177L338R97m336Q10L740
$$ -734 -1631 2291 977 -2511 794 3149 -939 -1346 2519 845 -2332 1006 2003 -2333 -1523 2217
1863B217k519k439L485L64l691K039K873l234j382M279r45l371K803K005l637
$$ 2217 -302 -2741 744 1108 -2583 -544 2329 -905 -2287 1992 1047 -2324 479 2484 -1153
1878a153o66M201j892l059L210J630l819N45L991k752k715L831R30m287J248L151
$$ -1153 -1819 2382 490 -2569 641 2271 -1548 -1003 2988 236 -2479 1352 2282 -2005 -757 2394
1894B394k975j895M135m28m178K407K978l463j309L940j091l259L464K005m413
$$ 2394 -581 -2476 1659 1231 -2947 -540 2438 -1025 -2334 1606 515 -2744 720 2725 -1688
1909a688K9M010j882k739L468P41m115R83L795k895j956L493L92l476J698K809
$$ -1688 -1659 2351 469 -2270 1198 1939 -2176 -1193 2602 -293 -2249 1244 1636 -1840 -142 2667
1925B667l389j230L854m54l703J974K207l595k98L819j391l107K897J674l283
$$ 2667 -722 -1952 1902 1448 -2255 -281 1926 -1669 -1967 1852 461 -2646 251 1925 -1358
1940a358M09L717k753k276L573O15l706J493K584k720j690L759O9l839J713K450
$$ -1358 -949 2768 15 -2261 1312 1927 -1779 -286 2298 -422 -2112 1647 1716 -2123 -410 2040
1956B040l022o90L720j325k994K598J697l396n3L070j835k449L367R31l458O75
$$ 2040 -982 -1672 2048 723 -2271 327 2024 -1372 -1425 1645 -190 -2639 728 1659 -1799 -1124
1972a124L011j927j729L246j78l162J569K886k698j510L199o20l047K479J711
$$ -1124 1887 -40 -1769 1477 1299 -1863 -294 2592 -106 -1616 1583 963 -2084 395 2106
1987B106l265o18L190j037k070K183J147l526N95L124j650k168K540L11k649J298
$$ 2106 -1159 -1777 1413 376 -1694 489 1636 -1890 -1295 1829 179 -1989 551 862 -1787 -489
2003d89K122k122j576L104O5k335J254J661k279n36L134p58k517J648J114k174
$$ -489 1633 -489 -2065 1039 1104 -1231 23 1684 -595 -1131 2003 1245 -1272 376 1490 -684
2019f84j40K428j775j498K152N11k493N83K056j686r57K402Q3k435J171J730j742
$$ -684 -824 1604 -171 -1669 483 994 -1499 -916 1140 -546 -1503 899 982 -1453 -282 1448 -294
2036b94l68J604m31j918J470J184j954l31K101o66j452J766N90k105M14J755j099
$$ -294 -662 942 511 -1407 63 1247 -707 -1038 1063 397 -1055 711 1301 -804 -390 1365 266
2053B66j345J469J94j780Q85J335j632p26J579J58j177O68Q63j036k01J566n21
$$ 266 -1079 390 584 -1196 -311 1024 -608 -1334 245 403 -774 -106 757 -279 -480 1086 565
2070E65j279P61Q90j344L6J245p34q57J363J38j273M72O43o11o59J306k67j133
$$ 565 -714 47 937 -407 -371 874 140 -717 646 784 -489 -17 626 15 -644 662 395 -738
2088g38O90N96p41m75J176n69q27O60O23r72K51N79l34m89P48L49p32J98O10m87
$$ -738 -48 548 -193 -668 508 -61 -888 -228 395 -577 -326 253 -81 -570 178 527 -205 -7 603 116
2108A16l51N49K1o11K07M43k63m17O23j97r7K24L5m51j62K17K23j55j7j85l08
$$ 116 -235 314 335 -276 -69 374 111 -306 317 120 23 247 282 -169 -331 -114 109 -46 -63 -248 -556
2129e56N5P26j81k67J68j41M64j20K02k23j75p4O29j20n14J66l59M98j51k19J38
$$ -556 -501 225 44 -223 -55 -196 268 148 350 127 -48 -122 507 387 -127 39 -320 178 27 -192 -54
2150e4k05J59K62l48J88j80Q0J1J05K22l62j54j50O72n33J06Ml2j83N45M56o83
$$ -54 -259 -100 162 -186 2 -178 -98 -87 18 240 -122 -276 -426 246 -287 -181 -177 -209 -392 153 609 -74
2172g4J70N47l24j46N88n38l35K21J51M9o49L03J1m85L93M11o82k27Q92p1q14
$$ -74 96 643 319 173 761 223 -112 109 260 309 -340 -37 -26 -511 -118 293 -389 -616 276 205 -609
2193f09Q12L22j106L73Q04m31q27Q20J87p90L81J044j173l57J270P6j215P11K24
$$ -609 203 525 -581 -208 596 165 -662 158 345 -445 -64 980 -193 -550 720 796 -419 292 516
2212E16q95j87J061n76p12N97O56q11n62J253n25j002J116N06j046M61Q88o98
$$ 516 -379 -566 495 -81 -793 -196 460 -351 -913 340 -185 -1187 -71 435 -611 -150 738 40
2230D0p04J226M3j157M26R18q07o25J062J67j469J054Q88j177p04J694l85j323
$$ 40 -664 562 605 -552 -126 792 -15 -640 422 589 -880 174 1062 -115 -819 875 490 -833
2248h33J080L40j649L99J631j193q55J065M95j303J53J252p72p17J562r8r99O68
$$ -833 247 587 -1062 -663 968 -225 -1080 -15 480 -823 -670 582 -190 -907 655 557 -442 226
2266B26J034j668k64J641n80j423J159Q36j568K14J255p78j348J563O53j343L6
$$ 226 1260 -408 -672 969 389 -1034 125 961 -607 -393 862 84 -1264 299 952 -391 -355
2283c55J017r60r01J796k6j670M26J521j415m96J765k18j612J080J449j703M9
$$ -355 662 -298 -1199 597 571 -1099 -673 848 -567 -1063 702 484 -1128 -48 1401 -302 -253
2300b53J264n59j302J423P34k251K66J812r90j107J418L46j798P20J406j375q77
$$ -253 1011 452 -850 573 1307 -944 -678 1134 144 -963 455 801 -997 -277 1129 -246 -1123
2317a123J936j66j531Q06J304j570o94J884n80j387Q77J254j626N9J708n64j680
$$ -1123 813 647 -884 -78 1226 -344 -1038 846 266 -1121 -244 1010 -616 -557 1151 587 -1093
2334a093J618O16j927O15J629j590j175J775N74j687L07J304j325o25J853j90
$$ -1093 525 1141 -786 -171 1458 -132 -1307 468 1042 -645 -338 966 -359 -984 869 679
2350F79j638O74J259j458n48K006p53j446J504R57k216L03J719j135j045J877
$$ 679 -959 -285 974 -484 -1032 974 221 -1225 279 1236 -980 -677 1042 -93 -1138 739
2366G39K07j720N21J862j575j015J784L21k135O22J493j613l90J711n65j580J318
$$ 739 946 -774 -253 1609 34 -981 803 1124 -1011 -389 1104 -509 -899 812 247 -1333 -15
2383a5R62j505k54J841q76j451J503P32j746l9J824p25j400J818K13j687P12J061
$$ -15 947 -558 -812 1029 153 -1298 205 937 -809 -848 976 251 -1149 669 882 -805 -93 968
2401I68j273m59J797k85j689J067R50j324m36J417m32j186R58P77j605l51J739
$$ 968 -305 -764 1033 748 -941 126 1076 -248 -684 733 301 -885 73 850 -755 -1106 633
2418F33o23j109J324N29j431L80J155j033o10J326O0j642J007J230j526l14J303
$$ 633 10 -1099 225 754 -677 -297 858 -175 -785 541 601 -1041 -34 1196 -330 -644 659
2435F59j93j227J009Q00j397j76J545p95j078P08O02j187Q7J477r09q32J027K94
$$ 659 466 -761 248 1048 -349 -525 1020 225 -853 -145 457 -730 -643 834 -75 -907 120 414
2453D14q81R5J243r39p01J409J21j431N97J181j365l0J237o52j319R88P11j016
$$ 414 -467 -372 871 -68 -769 640 761 -670 -73 1108 -257 -287 950 298 -1021 -33 678 -338
2471c38M0R71m55j087J457J16j246J99P47n48j81Q55j41j111M30Q38o01o65J051
$$ -338 -298 673 218 -869 588 704 -542 -343 404 -144 -325 530 389 -722 -292 546 -55 -720 331
2490C31j10r63J021O99r80l70J035l45q57P37L00r80j64J063m03m57K92N44p82
$$ 331 221 -742 279 978 -2 -372 663 318 -539 198 498 -482 -646 417 14 -443 -151 393 -389
2509c89J05Q93n72m62O68J0p31M80J69m85k00O30J79q00O37J86n98J16O41k65
$$ -389 -284 609 37 -425 243 253 -478 2 171 -314 -514 116 295 -505 132 318 -280 -164 477 212
2529B12o41P37L44p02m8N19k32o62N66K89m65j64M63j82l62M18J28m57n7M51l40
$$ 212 -429 308 652 -50 -98 421 189 -473 93 382 -83 -247 216 34 -328 90 218 -239 -296 155 -185
2550a85j37K60J15l17L78L30o94k9N84l92q8M01j15o1p1L46n7n77L43J74l95N
$$ -185 -322 -62 53 -264 114 444 -250 -279 305 -87 -175 226 111 50 -21 325 268 -309 34 208 -187 -182
2572a82L97k79k25J89J72m57R2M30nl34M93j44o43L13M27j84K36l68K16m29J19
$$ -182 215 -64 -289 -100 72 -385 -293 137 132 -202 291 147 -496 -183 244 60 296 -72 144 -285 -166
2593a66L80l24J53J24j80K57m16J69j20j2J4K38k94J1N3m7q6j34L52j41J7J91
$$ -166 214 -110 43 167 -13 244 -172 -3 -123 -135 -121 117 -177 -166 -113 -160 -246 -380 -28 -169 -152 39
2615C9J00j44j18J30j28K11K94o9o19L94J05k79J48K73k66l76N56j66k84J25q
$$ 39 139 -5 -123 7 -121 90 384 315 -304 90 195 -84 64 337 71 -305 251 85 -199 -74 -82
2636h2J00J47m6rj79k7J3n9r1J63p3j50K88M96l76m46L93J33k49j54M83l13j59
$$ -82 18 165 119 110 -69 -96 -83 -142 -233 -70 -143 -293 -5 491 115 -331 62 195 -54 -208 275 -38 -197
2659a97M26q5k73K90Q4l62L35K34n03l17K68L48o61L44J45l85j6L93j3m20J13
$$ -197 229 144 -129 161 245 -117 218 452 -51 -368 -100 248 -413 -69 76 -309 -325 68 55 -365 -252
2680b52N75l85l28P48l01n03N92J97k73k39O89n70m99Q73K9p16J59N60m87J9L54
$$ -252 323 -62 -390 358 57 -446 146 343 70 -169 520 -50 -549 324 353 -363 -204 356 -131 -112 242
2701B42K5p51J78O63l95n04Q60k24l31OL55j49m19R72n73n67O76L65q08L4N29
$$ 242 267 -484 -306 357 -38 -542 318 94 -237 -231 124 -25 -444 528 -45 -612 64 429 -379 -345 184
2722A84R9p10N82K23n75Q5M81n17l00Q50p3p36L94K90q43L29K90M22j073N60K45
$$ 184 283 -427 155 378 -197 -112 369 -148 -448 402 329 -407 -13 277 -566 -237 53 475 -598 -38 207
2743B07l78p0N86n20j22M44K62k05n30Q84o55p5J83J74m80o7Q42n51k88O84lp34
$$ 207 -171 -241 345 -175 -297 147 409 204 -326 558 -97 -172 11 185 -295 -362 480 -71 -359 325 322 -412
2765d12M51O41j135lO22j50o21N50L71q19K68O30k61l27N29J99p64R9Q24p53n50
$$ -412 39 680 -455 -458 164 14 -607 -57 314 -505 -237 393 132 -195 334 533 -231 -132 692 -61 -611
2786f11M76N43p05L79L21l57p03J153J28p74J92K59l09m07P75n34m23N39O33p33
$$ -611 -135 408 -297 82 403 46 -657 496 624 -150 42 301 -8 -415 360 -174 -597 -58 575 -158
2806a58j0M93m41n22J045k67m60r7J090q93M5M38J46p90L59M75j60m64K30J00
$$ -158 -168 325 -116 -638 407 140 -320 -417 673 -220 -175 263 409 -381 -22 453 293 -171 59 159
2826A59o74N14L30m36k58O10m5o99N00L05p66K67N71l50o17P52K91n53n7P91m79
$$ 159 -515 -1 329 -107 -365 245 200 -499 1 306 -460 -193 378 28 -589 163 454 -99 -156 635 156
2847A56o75R92J07j047O02M10q67k06R92j11o66N03k5l10j46N63k51n69O97M5
$$ 156 -519 473 580 -467 135 545 -322 -528 464 353 -313 190 165 -145 -291 272 21 -548 149 194
2867A94m33p8J101j112k68Q89J21p99M04L56k27n89N47J63m73K17N59o87j80Q54
$$ 194 -239 -317 784 -328 -596 293 414 -385 19 375 148 -441 106 269 -204 13 572 -115 -295 559
2887E59l47n66J93N78o77K3K55J66n25N51P0o78L76L82k52l92M99K12o68K33L65
$$ 559 212 -354 -161 417 -260 -237 18 184 -341 210 280 -398 -22 360 108 -284 215 427 -241 -8 357
2908C57k76l99L61n5j84j31Q63m40j89N47k61j71j9L54n44R4K14J62o16L33R2
$$ 357 81 -318 43 -12 -196 -327 536 96 -93 454 193 22 3 357 -187 -93 121 283 -333 0 92
2929I2k48K48L6k05k82N45J10p66N09L11n46o7M43Q5j63L3J29n15k08O85kn98
$$ 92 -156 92 128 -77 -359 186 296 -470 39 350 -196 -263 180 265 102 135 264 -251 -459 226 224 -374
2951c74K29M81o79M6P77m20m18N65Mm92J61L72l07n20M49L06n18K46J77n9k60
$$ -374 -145 336 -343 -297 480 60 -358 207 211 -281 -120 252 -55 -575 -126 180 -338 -92 85 26 -234
2972b34L21K16m04K43M00o23n1O93l75j62L17J40o09n1J66j5k59K89mk01j03N35
$$ -234 87 303 -101 142 542 -81 -132 561 186 24 341 481 -128 -179 -13 -28 -287 2 -2 -203 -306 229
2994B29l77j00K85p9k55J18M62n40N8J03K21k92L17J59l42J24J94k28k6j1K57
$$ 229 -148 -248 37 -42 -297 -179 283 -257 -199 -96 125 -167 150 309 -33 91 285 57 31 20 277
3015B77l10j1K13j04k4o5K98l06j3R9j01k06J59J75j90J02M8l06k9L10Qm3J84
$$ 277 -33 -44 169 65 41 -24 274 -32 -45 54 -47 -253 -94 81 -109 -7 41 -265 -294 16 24 -19 165
3038A65J04k01j52J73J94l14j44M92k53J96k05n5j15J88O2l36j05M03k79J54k34
$$ 165 269 68 -84 89 283 -31 -175 317 64 260 55 0 -115 73 135 -201 -306 97 -182 -28 -262
3059b62M82m00n6M53j36m7q8K58k23J21k50L03k75M17l11M6n7J20K7j38J05k13
$$ -262 220 -180 -236 217 81 34 -54 204 -19 102 -148 155 -120 297 -14 32 -25 95 122 -16 89 -124
3081a24P8K06J19l41j42J30L70m56J81J32k15j28J93kJ3j08Q6kr6J19J61k21r8
$$ -124 -46 160 279 -62 -204 -74 296 -160 21 153 -62 -190 3 1 14 -94 -8 -10 -106 13 174 -47 -145
3104a45K40Q8k89J17Mpq8L03l05j09M85j36j81p0L94n50K1K98J21l77R4O2j3j97
$$ -145 95 183 -106 11 15 8 -80 223 -82 -191 294 158 -23 -93 301 -249 -228 70 191 -186 -92 -30 -43 -240
3128b40K64j36o6K4K08JL39j85j96J03m0m1M2r8j60J51J44J64r9k44K94j74k4
$$ -240 24 -112 -178 -154 54 55 394 209 13 116 76 35 77 -21 -181 -30 114 278 179 -65 229 55 31
3151C1j79J36J86k98K43j50k11R1K17j57j76J97J51m04kL75L0k16K43J01k72O0
$$ 31 -148 -12 174 -124 119 -31 -242 -151 66 -91 -267 -70 81 -323 -325 50 80 -136 107 208 -64 -4
3173dL61l12j93L19p5k04j34J44O1j31oJ9p3L96k9j96o9J29R7l02J21M85n13J62
$$ -4 357 45 -148 171 96 -108 -242 -98 -37 -168 -174 -155 -228 168 139 -57 -126 3 100 -202 -81 404 -109 53
3197E3j46N9j13J76L31l60l63O41j36m13K98K39k82pK46l54m6L56k13n0N4J38
$$ 53 -93 -34 -147 29 360 0 -363 278 142 -271 27 266 -16 -23 223 -131 -177 179 -34 -84 -30 108
3219A08k67M7K41J61m41n0N51k18j70P3J51n23M14K43l74j65M85l14n2J86J95
$$ 108 -159 -112 129 290 -151 -201 350 132 -38 35 186 -337 77 320 -54 -219 266 -48 -100 86 281
3240B81m45J35Q7m2k15K79K74o00Q5J81J81k39N3q2N2P1R2p2n3J83j00m98N13
$$ 281 -164 -29 58 16 -199 80 354 -246 -161 20 201 -38 15 -67 -15 56 148 76 23 206 106 -392 121
3263A21Q4l29K85K13n12O7P1Q2p4j83O21k63m51N74p6l87L20J45k45l78N59k02
$$ 121 205 -124 161 374 -138 -71 0 82 8 -175 446 183 -268 306 230 -157 163 308 63 -315 244 42
3285D2k44L26k5o4k28J50Qj91M51k17j30L23L8j26j74O3l4j75J32L85k90r5K99
$$ 42 -202 124 99 35 -193 -43 -35 -226 225 8 -122 201 239 113 -61 2 -32 -207 -75 310 20 -75 224
3308B24j93J38l24J32Q4j97M88m87l2Q9M5j28j48M11J64n56L62J9j28J04j53J68
$$ 224 31 169 -155 -23 61 -136 352 -135 -167 -78 -33 -161 -309 102 266 -290 72 91 -37 67 -86 82
3330H2j83J41m6P5l6J84j96j99K02N01p74N2M35l67k6J29j18j3K62Q1l29J84J60
$$ 82 -101 40 -6 69 33 217 21 -178 24 525 -249 -197 238 -129 -155 -26 -144 -157 105 186 -143 41 201
3353B01j7j54j48K68j50j28K40q9j92L63K01n96J16L06l28K04O7Q6l52j35L87
$$ 201 184 30 -118 150 0 -128 112 23 -169 194 395 -201 -85 221 -107 97 164 250 -102 -237 150
3374A50k52l56O00k25j67J64j02J23R9J1r7p1K24m0l66K11M54m93L6M36m74k00
$$ 150 -102 -458 142 -83 -250 -86 -188 -65 34 45 -52 -123 101 61 -305 -94 360 -133 -97 339 -135 -335
3396c35J93L29k9m03M60K18n77O9K75m1j70L9oJ02j31o5o0K50Lk32j15O00m37
$$ -335 -142 187 158 -245 215 433 -144 -75 200 159 -11 28 22 124 -7 -72 -132 118 121 -111 -226 374 -63
3419f3L6j79mK14m4J13j6p8j20K81k22K06j7K40n81P4K34j23O3J75j20j14K66
$$ -63 -27 -206 -210 4 -40 73 57 -21 -141 140 -82 124 107 347 -234 -160 74 -49 14 189 69 -45 221
3442B21l80j10O0L82k24m2J23n7k97K82K89j34l03J82Q0lk30M32rm25p2K34l9
$$ 221 -159 -269 -209 173 -51 -93 30 -27 -324 -42 247 113 -190 -8 72 69 -161 271 262 -163 -235 -1 -40
3465d0j40L58k24J62K19j44l64K81J0j01j46J93j25m3n7J78j43J46Q6k41J69J90
$$ -40 -180 178 -46 116 335 191 -173 108 118 17 -129 64 -61 -104 -161 17 -126 20 106 -135 34 224
3487B24m2k72J79K9j95J4J19m3j85K19OQ8q7p0N9M3k8k2j62j8L67k25N4k41L9
$$ 224 182 -90 89 118 -77 -63 56 13 -172 47 53 141 54 -16 43 86 58 36 -126 -144 223 -2 52 -189 -150
3512a50l1M66k96K14j04j49j22K92l31L37r2j86K40J36k40m7J92M5J1k92J53K3
$$ -150 -181 285 -11 203 99 -50 -172 120 -211 126 34 -152 88 224 -16 -63 129 174 185 -107 46 69
3534F9j2j15p0J85k21j35K41K31l03J35Nj61K44k29J7N6J22m35M63m8p2j9jJ42
$$ 69 57 -58 -128 57 -164 -299 -58 173 -130 5 10 -151 93 -136 -119 -63 59 -376 87 39 -33 -52 -53 89
3558H9p0k51M78l90o5M15n0k48K41j9k35K74r0j58j12L06l01J11J39j12m6J18
$$ 89 19 -232 246 -144 -209 206 156 -92 149 130 -105 169 79 -79 -191 115 -186 -75 64 -48 -94 24
3580B4m5N9n7j03K50j88J56k55k8J57N0lMKJ77j0l05J93q8j41K16J44l2k52j82
$$ 24 -21 38 -19 -122 128 -60 96 -159 -187 -30 20 17 21 23 200 190 -115 78 -10 -151 65 209 177 -75 -257
3605b57R6n1P3M52m48j50J3M62l70K17m0J67j09o4J98j75j14K79l53J57k9K49
$$ -257 -161 -212 -139 313 -135 -285 -272 190 -180 37 -3 164 55 -9 189 14 -100 179 -174 -17 -46 203
3627B03j70j11K97k80l1%K26M8k78J2j39R9K19k18QJ49L7LJ06j65K58k61K8J64
$$ 203 33 -78 219 -61 -92 -92 134 182 -96 -84 -223 -124 95 -123 -115 34 71 74 180 15 273 12 40 204
3651B04j98M6j24J76L1j79j22jK34K02l51K7j13J96j28o2Q2J60q0P6p3k15K37
$$ 204 6 52 -72 104 135 -44 -166 -167 67 269 -82 -55 -168 28 -100 -162 -80 80 0 76 3 -212 25
3674B5j79P7J56k23o6N0L23j18r2j7K46k41n1L63l83L9L61j00m35M80k60J01m
$$ 25 -154 -77 79 -144 -210 -160 163 45 -47 -64 182 -59 -110 253 -130 -91 270 170 -265 215 -45 56 52
3697E2j9Qr0J42J29k78n6N8M85n56P7K44j74N6n1J91j50k27J00J25q1l2Rk20L98
$$ 52 33 41 -49 93 222 -56 -112 -54 431 -125 -48 196 22 78 27 218 68 -159 -59 66 -15 -47 -38 -258 140
3722A40j77N4j09K39k12k28K25J49l0j42K8M7J5J3p9j17J80L4N2j82l1R5o1j26
$$ 140 -37 17 -92 147 -65 -293 -68 81 51 -91 -63 -16 -1 12 -67 -184 -4 30 82 -100 -131 -36 -97 -223
3746b23Q0J17J2K32k09P0M2J80n61J80J84O4l33M64l03P4j97K30l73J12m3lJ13
$$ -223 -143 -26 -14 218 9 79 121 301 -260 -80 104 168 -165 299 -4 70 -127 103 -270 -158 -201 -204 -91
3769i1qL38k94m6N7L0j86J23R4PK6J00j56j33n2M41l03J83P7j89j68k6L61l02
$$ -91 -99 239 -55 -101 -44 -14 -200 -77 17 24 50 150 -6 -139 -191 250 -53 130 207 18 -150 -176 185 -117
3793a17N2J54J7j42J30n1n7k01J91J9k56L93k62j88J05M80l80Q7n8M7M0J99l54
$$ -117 -65 89 106 -36 94 43 -14 -215 -24 -5 -261 132 -130 -318 -213 267 -113 -26 -84 -37 3 202 -152
3816a52L34N8l09p5L31k08J90j62j10J04q2J40J6P2p0K76k88p3J66l1p0k14l2
$$ -152 182 240 -69 -144 187 -21 169 7 -103 1 -81 59 75 147 77 353 65 -8 158 127 57 -157 -189
3839a89M15m22K13R0Q3k26N3R2j80K18k1j44J70j37j05K32p6L1L9p0j10O7J1R6
$$ -189 226 -196 17 107 190 -36 17 109 -71 147 126 -18 152 15 -90 142 66 97 136 66 -44 23 34 130
3863A30K8j89O0M29m83r8L9NJ87j54J76k03j14J53M6j16J35j71K15k57J44R3p8
$$ 130 158 -31 29 458 -25 -123 -84 -79 108 -46 130 -73 -187 -34 12 -104 31 -140 75 -182 -38 55 -23
3886b3K3J5K2j79L21L7k72N2J75j75Q4k13J07m1jK13Mk84L22k07J74k35K12j10
$$ -23 0 15 37 -142 179 216 -56 -4 171 -4 80 -133 -26 -67 -68 145 149 -135 187 -20 154 -81 131 21
3910B1k7K65j45j37n8K16l17K65j6p6P4j3j82pQ7J10k16k6L16k44q2m5J09J33
$$ 21 -6 259 114 -23 -81 135 -182 83 67 -9 65 52 -130 -137 -50 60 -156 -182 134 -110 -192 -237 -128 5
3934EK50k5l39j72L49q3j47K18k57N52o34L36M2l85L16K63l84j04KJ17j41L06
$$ 5 255 230 -109 -281 68 -15 -162 56 -201 351 -283 53 95 -290 26 289 -95 -199 -197 -80 -221 85
3956H5J67j59Lj02O2o5j59L51k89J82j15L9K7j35J09r5K09j35J99n4m7L7k27K04
$$ 85 252 93 96 -6 56 -9 -168 183 -106 76 -39 0 27 -108 1 -94 115 -20 179 125 78 115 -112 92
3980I2j3j5j84Q4J82K6j15l4Mr4M1k2J14j10J09m9j25J33J9l7j14J72L4k36J90
$$ 92 79 64 -120 -36 146 172 57 23 27 -67 -26 -48 66 -44 65 16 -109 24 43 6 -108 64 98 -138 52
4005E2Q8k18J31j91N6j65L22r8k40J50J70j66j07K97q0l23M02O5j22O6m2k46k7
$$ 52 140 -78 53 -138 -82 -247 75 -23 -263 -113 57 -109 -216 81 1 -322 80 145 23 89 47 -199 -226
4028b26N2K15J10l14J47l4J19k69p0J13J10J41k14K86k65J99k94J34J24j37k47
$$ -226 -174 41 151 -163 -16 -50 69 -200 -270 -157 -47 94 -120 166 -99 100 -194 -60 64 -73 -320
4049c20J85L6p0l9J39m5q4J44J3J4K62j40j11q9K43J22m15j4K0J79j02K43k02
$$ -320 -135 -99 -169 -208 -69 -114 -198 -54 -41 -27 235 95 -16 -105 138 260 -155 -169 -149 30 -72 171 -31
4072c1r1J63N0r5K43k00j67J91J35L6k39l6m2N4L0J52j41m7j5J12j03J48R8j13
$$ -31 -122 41 91 -4 239 39 -128 63 198 234 -5 -41 -83 -29 1 153 12 -35 -50 62 -41 107 205 92
4096I2p4j44M38j26Q2k80K29j68k50K33k9oP4j0l5k11k8L3RM02j87O6k39K38j98
$$ 92 18 -126 312 186 268 -12 217 49 -201 32 3 -3 71 61 26 -185 -213 -180 -171 231 44 110 -129 109 -89
4121h9QJ63J14j47j00J36o7m2J73j7n4k52J93l78M55o3R0j65J94o1j67Q0K07j26
$$ -89 -81 82 196 49 -51 85 18 -24 149 132 78 -174 19 -359 96 33 123 -42 152 91 -76 4 211 85
4145H5p8j51K33Q3k45J41j01m3K36j35o7j86K22M4m47N45p7j05n7J59j67o3K50
$$ 85 7 -144 89 172 -73 68 -33 -76 160 25 -42 -228 -6 38 -409 136 59 -46 -103 56 -111 -174 76
4168G6j45N9M1J36n14J79L53j08%r6J98k98L80l04M6j38P9K00m7k08J10K7j86
$$ 76 -69 -10 31 167 -347 -168 185 77 77 -19 179 -119 261 -43 3 -135 -56 144 97 -111 -1 26 -160
4191a60j09L30j02OK82j61k69K23L4o3J5J17k25N5J73k01k3O7OK4k5O6q0l7K04
$$ -160 -269 61 -41 -35 247 86 -183 40 74 11 26 143 -82 -27 146 -55 -78 -11 -5 19 -6 60 -20 -57 147
4216A47j68o2jN8K8J7p4j49k48N12Nn9j23J10k31M5p8N60l82K92k42j52Q9L96
$$ 147 -21 -83 -84 -26 2 19 -55 -204 -452 60 65 6 -117 -7 -238 -193 -271 289 -93 199 -43 -195 -106 290
4240B90k41j16q2R4j10m0K82j30K3j39k2L38k03M7J38j76J04J84j54j16K9m03
$$ 290 49 -67 -149 -55 -165 -205 77 -53 -30 -169 -191 147 -56 -9 129 -47 57 241 87 -29 0 -403
4262d03O24k17J61k4l02J90O0j93K30j60M3j88K07k01J9K31m9k4j40J86l39K09
$$ -403 221 4 165 141 -161 29 89 -104 126 -34 9 -179 28 -173 -154 77 28 4 -136 50 -289 -80
4284h0K73j23q2l8J2J64k28L25Q6n72L01K8J4j6o5lo3K47k18j18J61J25k40m9
$$ -80 193 70 -12 -50 -38 126 -102 223 309 -263 38 66 80 64 -1 -4 -67 180 -38 -156 5 130 -110 -159
4308a59Q4L17lj92j70n3K29R9l23K01l34J42j35K39L6J66j89P4J83l64K27o1n9
$$ -159 -75 242 239 47 -123 -176 53 152 -171 30 -304 -162 -297 -58 -22 144 -45 29 212 -152 75 14 -45
4331d5j14K62N0k68J33J24l49K01J20J07p5p8O3r4o8k46k4K95j03Q4J63j03K7
$$ -45 -159 103 153 -115 18 142 -207 -6 114 221 146 68 131 37 -31 -277 -301 -6 -109 -25 138 35 62
4354F2j64K03j74R2N9k42J91p2J06J2P9j68k5k8N9R8l2j22n7L68k46j2r4O6r3
$$ 62 -102 101 -73 19 78 -164 27 -45 61 73 152 -16 -41 -69 -10 88 56 -66 -123 245 -1 -13 -107 -41 -134
4379a34k6J80j8j01N8J29q0n9L6qk0R6K14n20J31L24k04K18j35j80R9j1k07j68
$$ -134 -160 20 2 -99 -41 88 8 -51 -15 -23 -43 53 267 -253 -122 202 -2 216 81 -99 0 -11 -218 -386
4403c86J96L6L51K8r4m6j25J32K17l99l4K77j37j19J06rm1L2p9j08M64k45J12
$$ -386 -190 -154 197 225 131 85 -40 92 309 -90 -124 153 16 -103 3 -6 -47 -15 -94 -202 262 17 129
4426A29j02j23o0o8J62J76j72oJ3J0K32O1j61J34Lk30o1J65J76j57j73J43p5j44
$$ 129 27 -96 -156 -224 -62 114 -58 -64 -51 -41 191 252 91 225 228 -2 -63 102 278 121 -52 91 16 -128
4450a28K96J35k69R4j08Q7O8j80r5K43k22Po8J28J73p5m4J05n7j5J0O1j44M2l4
$$ -128 168 303 34 128 20 107 175 -5 -100 143 -79 -72 -140 -12 161 86 42 147 90 75 85 146 2 44 10
4475A0M7Mn9kM7k03J77R7k8M6l6J27j33l7j45L14k45J19K1j00j32J76k05J6K52
$$ 10 57 61 2 0 47 -156 21 118 90 136 100 227 94 57 -88 226 -19 100 121 21 -111 65 -140 -124 128
4500A28J0p0p0j1P7M1N7k15J01J43j93n3l8O2K0MO6r9omm4K20j1k54J11j10Q8
$$ 128 138 68 -2 -13 64 105 162 -53 48 191 -2 -55 -93 -31 -11 -7 59 -40 -46 -50 -94 126 115 -139 -28 -138 -50
4527e0N8j51K34j72K5k1J93j87K47j74j0j2j13j20q4M39o0r7k33K07m7J51J14
$$ -50 8 -143 91 -81 -56 -77 116 -71 176 2 -8 -20 -133 -253 -337 102 42 -55 -288 -81 -128 23 137
4550A37j2j27K05j64k88L23j41J08L6j4J68J2l96K49m66L41J05n2J18l12QK32
$$ 137 125 -2 203 39 -249 74 -67 41 77 63 231 243 -153 96 -370 -29 76 24 142 -170 -162 70
4572G0j43L8P5J6j22J35m1P7N2j0k2k73J4k6K41l2j13J13j05J69l0k69K51l8J5
$$ 70 -73 -35 40 56 -66 69 28 105 157 147 125 -148 -134 -160 81 49 -64 49 -56 113 83 -186 65 27 42
4597D2k7r3R3K8j62J69n4J5p4J12k4J19j32j85q2M86j33k92J76K89j27o5k72J78
$$ 42 15 -78 15 43 -119 50 -4 11 -63 49 25 144 12 -173 -255 231 98 -194 -18 271 144 79 -193 -15
4621a5Q7j05K75k38J88k60J24j25k2J98k65L30j61K57k81R6l3N1j01J86O1j52
$$ -15 72 -33 242 4 192 -68 56 -69 -91 107 -158 172 11 268 -13 83 50 101 0 186 247 95
4643I5j77n8J6J70N4k66J72N3L7k33J97o9N8j74J07k5j7K91j7k5j81p5j20K34
$$ 95 -82 -140 -124 46 100 -166 6 59 96 -137 60 -9 49 -125 -18 -43 -60 231 214 189 8 -67 -187 47
4667D7k20J58J07j70K90k88M9L86m52q8K07j20J90J43k64K31m6k16Q1j47L34Q2
$$ 47 -173 -15 92 -78 212 -76 -27 359 -93 -181 26 -94 96 239 -25 206 160 -56 25 -122 212 294
4689B94l36K30m5j83n6j47J62J99m27O43k52p9j08K94l4r3n9Q2j12J93j37j20
$$ 294 -42 188 143 -40 -96 -243 -81 118 -309 334 82 3 -105 189 155 62 3 85 -27 166 29 -91
4711i1k78K45N22p74J88K02M9o3q4J82K6l9M7l3j39L96m02r3J56k61J86J02J12
$$ -91 -369 -124 398 -376 -188 14 63 0 -84 98 124 85 132 99 -40 356 -46 -139 17 -244 -58 44 156
4734A56k74J86J50j30m0mL8j56j09M11j12k5j44J29J64m54K58N7l90K23J79j95
$$ 156 -118 68 218 88 48 44 82 -74 -183 228 116 91 -53 76 240 -214 44 101 -289 -66 113 -82
4756h2q2K17p9K03j89K20Jl60J11q3J87j75J46k93L31j99J02J98K0j33K2l38L86
$$ -82 -164 53 -26 177 -12 208 209 -151 -40 -123 64 -111 35 -258 73 -126 -24 174 194 61 83 -255 131
4779A31j5k63J60l46O29k12l0m6k73N3l3K02M6q6J77k31L58k62K48l11l8j7J84
$$ 131 116 -147 13 -333 296 84 54 8 -265 -212 -245 -43 3 -83 94 -137 221 -41 207 -104 -142 -159 25
4802B5L6N5j78J52j18n1j36L84l05J42k03K40k96R5l38M78K09m49M04J4j98j02
$$ 25 61 116 -62 90 -28 -79 -215 169 -136 6 -197 43 -253 -158 -496 -18 191 -258 146 160 -38 -140
4824a40K46k21l3m9ML11l4r1j8r1K93k45J9r7m5j38L64P8j9k74J24j50J75j89
$$ -140 106 -115 -148 -197 -193 118 84 -7 -25 -116 177 -68 -49 -146 -191 -329 35 113 94 -180 -56 -206 -31 -220
4848b20J76J64k22J91J56j11o6j02J3j74J98O9q4R8k21K37j8j51K41k52K47k71
$$ -220 -44 120 -102 89 245 134 68 -34 -21 -195 3 72 -12 86 -135 102 84 -67 174 -78 169 -102
4870a02j21L57j42j54J47j57K41M7l05K07k17L07J49n12K23Q3J63m4l27J29J63
$$ -102 -223 134 -8 -162 -15 -172 69 116 -189 18 -199 108 257 -255 -32 51 214 170 -157 -28 135
4891A35j93J34K1J4l71K64k12K67J5m3m4Q7k29O5J36K8J77k11k9M7L0j32l3J45
$$ 135 -58 76 97 111 -260 4 -208 59 74 31 -13 74 -155 -90 46 74 251 40 11 58 88 -44 -77 68
4915F8k10K98l61K82j51p9J14N0K13m02K31k97J56R6j34J93r0J50k61J91L9j85
$$ 68 -142 156 -205 77 -74 -153 -39 11 224 -178 53 -244 -88 8 -126 67 -23 127 -134 57 96 -89
4937h9J94l6O8j25N3j38N5j3N5J36l3n01M74N6j60j00j79N15l41Q8R8R7j91j88
$$ -89 105 69 137 12 65 -73 -18 -31 24 160 127 -374 100 156 -4 -104 -283 232 -109 -21 77 174 -17 -205
4961b05nJ81rj06J93j80K97Q3k87L25k38k21O5j76K00K33N1k00j2k52J70K63r1
$$ -205 -210 -29 -38 -144 49 -131 166 249 -38 287 49 -172 -107 -283 -83 150 201 1 -11 -263 -93 170 79
4984G9k21j72J71R2j51K90j18p9K36m47J97L54j66j51J62k14J57kj46J62r1J17
$$ 79 -142 -314 -143 -51 -202 88 -30 -109 127 -320 -123 231 65 -86 76 -138 19 17 -129 33 -58 59
5006E9k39R5OL49Kl43J72k19J29j90J15L7j90J81J27m3j7L3j89j16J85j75K54
$$ 59 -180 -85 -79 270 272 -71 101 -118 11 -179 -64 -27 -217 -36 91 48 31 64 -125 -241 -56 -231 23
5029B3k18K08j58P3P3J45q9rJ90k21j05J11q2O1J2O7lj62L16k59k68J87N2q8M3
$$ 23 -195 13 -145 -72 1 146 57 48 238 17 -88 23 -59 2 14 81 78 -84 232 -27 -295 -108 -56 -144 -101
5054a01K7j14Q9l2K23k84K3L12J02k56k39M08j74j99K66L4mp8q4l1q5M32k53O3
$$ -101 -74 -188 -99 -131 92 -192 -169 143 245 -11 -250 158 -16 -215 51 85 81 3 -81 -112 -197 235 -18 45
5078D5j00P3j7o5J75o6q1J26R8k04L58m30J58j3N3j64J4J36O9n9q2J26o7j79Q8
$$ 45 -55 18 1 -64 111 45 -36 90 188 -16 342 -88 70 57 110 -54 -40 96 165 106 24 150 83 -96 -8
5103hl2N5M1o1J26J12n32L95j91J20J8j17J14j58J58j06j3J33J54k45J15n2l4
$$ -8 -40 15 56 -5 121 233 -299 96 -95 25 43 -74 40 -118 40 -66 -79 54 208 -37 78 26 -8
5126hJ25J4j24k06J73O2R8j48J8r3K54k71R1m3j23J95j7j0mj67N2J0JO5O9j22
$$ -8 117 131 7 -199 -26 36 134 -14 4 -89 165 -106 -15 -58 -181 14 -3 -13 -17 -184 -132 -122 -121 -56 13 -109
5152a09M6j6N7O9k75J81L21j74l29O43m49RK54q6j14O7l1r7K03j77j08j39J64
$$ -109 -63 -79 -22 47 -228 -47 274 100 -229 414 -35 -26 228 142 28 95 64 -33 170 -7 -115 -254 -90
5175i0K44k52J07Q7M0j94K07k39l5j8K48m1q1J63j6j34K0k12K00R4o1j11j68K96
$$ -90 154 -98 9 96 136 -58 149 -90 -125 -143 105 64 -17 146 130 -4 16 -196 4 98 37 -74 -242 54
5199E4K2l0O4k50J19l2J40M8n3j83n3K1J32l1K40j57k09L12m59R3J90j31J51J04
$$ 54 76 46 110 -140 -21 -53 87 135 82 -101 -154 -133 -1 -32 208 51 -158 154 -305 -212 -22 -153 -2 102
5223A02j76J69l6k24K65O7j12L3j81k5J06K6J34K9l29l7J09j00J21j7O9O4j23
$$ 102 -74 95 59 -165 100 167 55 88 -93 -118 -12 14 148 177 -152 -189 -80 -180 -59 -76 -7 57 -66
5246f6K4L40k02J12j47rK0m8R5n5k26J57Mj01Q4j23j0J25J96j16pkk50m8J18J82
$$ -66 -42 298 96 208 61 52 72 24 119 64 -162 -5 -1 -102 -18 -141 -151 -26 170 54 47 45 -205 -253 -135 47
5272D7n3J52j39O3J6K12k75M0k26J38L04k79p4K43j15j55L6J34k71L00j80P2P3
$$ 47 -6 146 7 70 86 298 23 63 -163 -25 279 0 -74 169 54 -101 -65 69 -202 98 -82 -10 63
5295F3Q2k81jK08j14j74J31K08j12K13k42p2J68j93K55j68j60L9P7j06J45j16
$$ 63 145 -136 -137 71 -43 -217 -86 122 10 223 -19 -91 77 -116 139 -29 -189 -150 -73 -179 -34 -150
5317a50J02kr3L01l47L48l07K47Qk20K64j29k39n1K61J73J21j72j84J28K5J07
$$ -150 -48 -50 -143 158 -189 159 -148 99 107 -113 151 22 -217 -268 -7 166 287 115 -69 59 84 191
$$ [...]
8191A66
##END NTUPLES=NMR FID
##END=
