##TITLE=1H_Ser Am-4-i-2
 CDCL3
 8 sc, 
 21.11.2022
##JCAMPDX= 6.0         $$ Bruker NMR JCAMP-DX V2.0
##DATA TYPE= NMR FID
##DATA CLASS= NTUPLES
##ORIGIN= UXNMR, Bruker Analytische Messtechnik GmbH
##OWNER= root
$$ XWIN-NMR		Version 3.5
$$ Mon Nov 21 14:52:17 2022 Russian Standard Time (UT+4h)  she@DPX200
##.OBSERVE FREQUENCY= 200.1313499994
##.OBSERVE NUCLEUS= ^1H
##.DELAY= (6, 6)
##.ACQUISITION MODE= SIMULTANEOUS
##.ACQUISITION SCHEME= undefined
##.AVERAGES= 8
##.DIGITISER RES= 18
##SPECTROMETER/DATA SYSTEM= spect
##.PULSE SEQUENCE= zg30
##.SOLVENT NAME= CDCl3
##.SHIFT REFERENCE= (INTERNAL, CDCl3, 0, 15.7039)
##AUDIT TRAIL= $$ (NUMBER, WHEN, WHO, WHERE, WHAT)
$$ ##TITLE= Audit trail, XWIN-NMR		Version 3.5
$$ ##JCAMPDX= 5.01
$$ ##ORIGIN= Bruker BioSpin GmbH
$$ ##OWNER= she
$$ F:/spectra/data/she/nmr/H-F/1/audita.txt
$$ ##AUDIT TRAIL=  $$ (NUMBER, WHEN, WHO, WHERE, WHAT)
(   1,<2022-11-21 14:50:41.43 +0400>,<she>,<DPX200>,
      <created by zg, POWCHK disabled, PULCHK disabled
       configuration hash MD5:
       00 E9 B6 7A A2 85 ED C7 34 08 36 98 17 FE 4E 26
       data hash MD5: 16K
       4B 41 E2 20 A5 96 8E FD 80 BD 65 A2 00 A8 73 46>)
$$ ##END=
$$ 
$$ hash MD5
$$ B6 52 B2 8B C0 C4 2A F6 AB 40 8E 7C 91 6C FE C0
##$RELAX= 
##$RELAX= 
##$RELAX= 
##$RELAX= 
##$RELAX= 
##$RELAX= 
$$ Bruker specific parameters
$$ --------------------------
##$DU= <F:/spectra>
##$EXPNO= 1
##$NAME= <H-F>
##$PROCNO= 1
##$TYPE= <nmr>
##$USER= <she>
##$AMP= (0..31)
100 100 100 100 100 100 100 100 100 100 100 100 100 100 100 100 100 100 
100 100 100 100 100 100 100 100 100 100 100 100 100 100 
##$AQSEQ= 0
##$AQ_mod= 1
##$AUNM= <au_zg>
##$AUTOPOS= <>
##$BF1= 200.13
##$BF2= 200.13
##$BF3= 200.13
##$BF4= 200.13
##$BF5= 200.13
##$BF6= 200.13
##$BF7= 200.13
##$BF8= 200.13
##$BYTORDA= 1
##$CFDGTYP= 0
##$CFRGTYP= 5
##$CHEMSTR= <none>
##$CNST= (0..31)
1 1 145 1 1 1 1 1 1 1 1 1 1 1 1 1 1 1 1 1 1 1 1 1 1 1 1 1 1 1 1 1 
##$CPDPRG= <>
##$CPDPRG1= <>
##$CPDPRG2= <>
##$CPDPRG3= <>
##$CPDPRG4= <mlev>
##$CPDPRG5= <mlev>
##$CPDPRG6= <mlev>
##$CPDPRG7= <mlev>
##$CPDPRG8= <mlev>
##$CPDPRGB= <>
##$CPDPRGT= <>
##$D= (0..31)
0 1.2 0 0 0 0 0 0 0 0.06 0 0.03 0 0 0 0 0.0002 0 0 0 0 0 0 0 0 0 0 0 0 
0 0 0 
##$DATE= 1669027841
##$DBL= (0..7)
120 120 120 120 120 120 120 120 
##$DBP= (0..7)
150 150 150 150 150 150 150 150 
##$DBP07= 0
##$DBPNAM0= <>
##$DBPNAM1= <>
##$DBPNAM2= <>
##$DBPNAM3= <>
##$DBPNAM4= <>
##$DBPNAM5= <>
##$DBPNAM6= <>
##$DBPNAM7= <>
##$DBPOAL= (0..7)
0.5 0.5 0.5 0.5 0.5 0.5 0.5 0.5 
##$DBPOFFS= (0..7)
0 0 0 0 0 0 0 0 
##$DE= 6
##$DECBNUC= <off>
##$DECIM= 32
##$DECNUC= <off>
##$DECSTAT= 4
##$DIGMOD= 1
##$DIGTYP= 9
##$DL= (0..7)
0 120 120 120 120 120 120 120 
##$DP= (0..7)
150 150 150 150 150 150 150 150 
##$DP07= 0
##$DPNAME0= <>
##$DPNAME1= <>
##$DPNAME2= <>
##$DPNAME3= <>
##$DPNAME4= <>
##$DPNAME5= <>
##$DPNAME6= <>
##$DPNAME7= <>
##$DPOAL= (0..7)
0.5 0.5 0.5 0.5 0.5 0.5 0.5 0.5 
##$DPOFFS= (0..7)
0 0 0 0 0 0 0 0 
##$DQDMODE= 0
##$DR= 18
##$DS= 0
$$ [...]
##$SUBNAM2= <"">
##$SUBNAM3= <"">
##$SUBNAM4= <"">
##$SUBNAM5= <"">
##$SUBNAM6= <"">
##$SUBNAM7= <"">
##$SUBNAM8= <"">
##$SUBNAM9= <"">
##$SW= 18.0517283424941
##$SWIBOX= (0..15)
0 0 2 0 0 0 0 0 0 0 0 0 0 0 0 0 
##$SW_h= 3612.71676300578
##$TD= 16384
##$TD0= 1
##$TE= 0
##$TE2= 300
##$TE3= 300
##$TEG= 300
##$TL= (0..7)
0 120 120 120 120 120 120 120 
##$TP= (0..7)
150 150 150 150 150 150 150 150 
##$TP07= 0
##$TPNAME0= <>
##$TPNAME1= <>
##$TPNAME2= <>
##$TPNAME3= <>
##$TPNAME4= <>
##$TPNAME5= <>
##$TPNAME6= <>
##$TPNAME7= <>
##$TPOAL= (0..7)
0.5 0.5 0.5 0.5 0.5 0.5 0.5 0.5 
##$TPOFFS= (0..7)
0 0 0 0 0 0 0 0 
##$TUNHIN= 0
##$TUNHOUT= 0
##$TUNXOUT= 0
##$USERA1= <user>
##$USERA2= <user>
##$USERA3= <user>
##$USERA4= <user>
##$USERA5= <user>
##$V9= 5
##$VALIST= <valist>
##$VCLIST= <CCCCCCCCCCCCCCC>
##$VD= 0
##$VDLIST= <DDDDDDDDDDDDDDD>
##$VPLIST= <PPPPPPPPPPPPPPP>
##$VTLIST= <TTTTTTTTTTTTTTT>
##$WBST= 1024
##$WBSW= 4
##$XGAIN= (0..3)
0 0 0 0 
##$XL= 0
##$YL= 0
##$YMAX_a= 91275
##$YMIN_a= -141926
##$ZGOPTNS= <>
##$ZL1= 120
##$ZL2= 120
##$ZL3= 120
##$ZL4= 120
##$ABSF1= 10
##$ABSF2= 0
##$ABSG= 5
##$ABSL= 3
##$ALPHA= 0
##$AQORDER= 0
##$ASSFAC= 0
##$ASSFACI= 0
##$ASSFACX= 0
##$ASSWID= 0
##$AUNMP= <proc_1d>
##$AZFE= 0.1
##$AZFW= 0.1
##$BCFW= 1
##$BC_mod= 2
##$BYTORDP= 1
##$COROFFS= 0
##$CY= 11.3945322036743
##$DATMOD= 1
##$DC= 2
##$DFILT= <>
##$DTYPP= 0
##$F1P= 2.36226072786647
##$F2P= -0.459571619588291
##$FCOR= 0.5
##$FTSIZE= 0
##$FT_mod= 4
##$GAMMA= 1
##$GB= 0.15
##$INTBC= 1
##$INTSCL= 1
##$ISEN= 128
##$LB= 0.24
##$LEV0= 0
##$LPBIN= 0
##$MAXI= 10000
##$MC2= 0
##$MEAN= 0
##$ME_mod= 0
##$MI= 1.114404
##$NCOEF= 0
##$NC_proc= 0
##$NLEV= 6
##$NOISF1= 3.799351
##$NOISF2= 2.8
##$NSP= 1
##$NTH_PI= 0
##$NZP= 0
##$OFFSET= 15.70392
##$PC= 1
##$PHC0= -18032.5
##$PHC1= 14.0007
##$PH_mod= 1
##$PKNL= yes
##$PPARMOD= 0
##$PSCAL= 0
##$PSIGN= 0
##$REVERSE= no
##$SF= 200.130013532006
##$SI= 16384
##$SIGF1= 3
##$SIGF2= 2
##$SINO= 400
##$SIOLD= 16384
##$SREGLST= <1H.CDCl3>
##$SSB= 0
##$STSI= 0
##$STSR= 0
##$SW_p= 3612.71676300578
##$SYMM= 0
##$S_DEV= 0
##$TDeff= 0
##$TDoff= 0
##$TI= <>
##$TILT= no
##$TM1= 0
##$TM2= 0
##$TOPLEV= 0
##$USERP1= <user>
##$USERP2= <user>
##$USERP3= <user>
##$USERP4= <user>
##$USERP5= <user>
##$WDW= 1
##$XDIM= 8192
##$YMAX_p= 0
##$YMIN_p= 0
$$ End of Bruker specific parameters
$$ ---------------------------------
##NTUPLES= NMR FID
##VAR_NAME=  TIME,          FID/REAL,        FID/IMAG
##SYMBOL=    X,             R,               I
##VAR_TYPE=  INDEPENDENT,   DEPENDENT,       DEPENDENT
##VAR_FORM=  AFFN,          ASDF,            ASDF
##VAR_DIM=   8192,          8192,            8192
##UNITS=     SECONDS,       ARBITRARY UNITS, ARBITRARY UNITS
##FACTOR=    0.0002768,     1,               1
##FIRST=     0,             0,               0
##LAST=      2.2672688,     0,               0
##MIN=       0,             -141926,         0
##MAX=       2.2672688,     91275,           0
$$ Real data points
##PAGE= N=1
##DATA TABLE= (X++(R..R)), XYDATA
$$ [...]
1838a207J79J046o73RQ62Q5o17J025J05m47Q7P80l27l77M65J17j178K21N85r82
1858b42m50J82j7o01J82L58n40j13R16j90m12P45M50o13N74O90k79n69J066K08
1878A345r27M02K19l14m12K08j37o45j24K96q99k07Q39j44r62O54N06q11L93J026
1898C06q17J99J014J11o27M45P18p69J2N37j39q35L67L79j305%P75n34j159P47
1918e75K45r43J78R63o83J38N55J29o64Q51O07q95J24Q70L0o92N29K62n05m24
1938A00Q56o99j082Q52K89j213K94O50o55l06N39K16r09N80O76m94pQ75r0p95
1958c23O51O03o51q3Q51o01p72J139k45r80l7P45n53m64N93J27j091P25O70r41
1978f37r1J318l58n97O20P25q50j02R91l37o65M49N89j216P2P99q98n91Q25j94
$$ y = [-1207, -1028, 18, -655, -646, 216, 301, -316, 709, 814, 367, 454, 1234, 907, 530, 995, 1112, -66, 155, 740, -242, -692, -510, -527, -1128, -946, -588, -1128, -1241, -325, -515, -927, -182, 268, -345, 229, 919, 640, 71, 1137, 1345, 418, 820, 1039, 725, 313, 521, 384, -261, -385, -89, -988, -1195, -356, -500, -1462, -808, -302, -1113, -720, 306, -511, -312, 702, 813, 186, 631, 1349, 580, 592, 1129, 990, 155, 522, 901, -404, -404, 371, -163, -1322, -575, -330, -1273, -1095, -132, -815, -677, -122, 7, -657, 194, 801, -94, 30, 900, 930, 238, 767, 1029, 524, 100, 956, 257, -825, 27, 316, -897, -603, 47, -608, -914, -375, -159, -1068, -488, 188, -306, -313, 562, 472, -323, 328, 931, 280, 197, 1048, 447, -325, 814, 569, -411, -448, 297, -256, -720, -127, 0, -1091, -366, 304, -637, -728, 590, 232, -365, 255, 980, 130, 28, 1019, 682, 17, 466, 1055, -161, -89, 710, -188, -779, 46, -148]
1998a48q39L23R17r81j82J055k94o54N52Q20p17K1J026j39m84N76J92q79J55O76
2018I96p76n91M61J10r07L97N31r12q23J239q4r88P60M92p12K11J093k04q53J268
2038G08K16p56K9J004o75o81J053J17j200L12P01j054n70Q61l29r29M26M15m71
2057h23l47O80L5n06P34N33p79L28J383p11n30P82O60j072K65O14q35n43Q25j77
2077E16j153L67N00p83p82R40J13r84N64N25l88m1R70k68p05R12M67o94L72O16
2097A064k57q02R31K56j392M37O40r25k00O41k90j113P07J08o47j61O69k4n92
2116i50P77K83k81P6Q68j51q56Q48L82r21J70R02p24n22O30j82r30N05K49n14
2136c41m26R81m56r28P34P74r11r4J018l90l03P15M69j189N83R91j264j00Q34
$$ y = [-148, -987, -664, 253, -728, -910, 145, -149, -803, -251, 569, -148, -127, 899, 760, 276, 852, 1044, 165, 320, 996, 220, -371, 90, 200, -707, -310, 221, -691, -1514, -275, -359, -1347, -587, -95, -807, -596, 497, 293, -560, 708, 924, 168, 197, 1201, 526, -155, 898, 1015, -185, 127, 828, -226, -796, 65, -264, -1193, -767, -352, -823, -1170, -490, -455, -961, -227, 306, -473, -145, 1238, 527, -3, 779, 1439, 367, 632, 1246, 411, -132, 693, 516, -637, -270, 230, -553, -1335, -395, -282, -1266, -702, -177, -565, -606, 364, 96, -609, 303, 770, 76, 448, 1064, 807, 5, 936, 1192, -200, 237, 877, -48, -248, 393, 103, -1010, -303, -195, -842, -1003, -334, -358, -950, -173, 110, -171, -95, 773, 622, -234, 614, 996, 75, 245, 1147, 423, -99, 531, 349, -581, -76, 173, -341, -767, 214, -242, -1170, -436, 338, -573, -667, 351, -39, -342, 373, 842, -347, 236, 1227, -37, -137, 697]
2155F97J4j025O64J53o49p12R85m7q75K99N54r64K09Q35n9p29R86J23o01J90Q57
2176I05o37JP14k00m47p0O12q59m97R11q0r31L39N21p57l56P03j33o72N84M66
2197A17o14R3P37J9m73M84M92p79M37N85m27n82P14j42q88N36k63n10k80N55j42
2218c31n76K80J55m22K85L54j69l3K83O97n54L13M46j18k18N01l9l41j57L25m81
2239B00l14L53j37q04L91K82p41M6L05k82j78O08J5m48L91M88mk65M62J44j40
2260C72J65M81l39k10K91q4p42J36K76n17m33O37k2q45N37K18p68K89J78J58m96
2281g18P03L6l47M99M74o22J39N18Q3p57M52R8m19K8K41j00n39K28j12m93J99
2302d09J08p7l31M29K72n00M40L18l69l49N68K77k10L17J10m07J9K49l43Q0J83
$$ y = [697, 711, -314, 350, 503, -146, -858, 127, 80, -795, -496, 58, -906, -697, 138, 79, -650, 336, 459, -142, 48, 905, 268, 269, 983, 783, 336, 266, 878, 19, -478, 433, 353, -578, -239, 282, -475, -831, -128, -261, -933, -349, 117, -497, -404, 333, 352, -121, 363, 855, 76, 513, 1098, 671, 89, 803, 661, -227, 309, 46, -464, -744, -189, -331, -907, -627, -472, -894, -609, -255, -424, -457, -174, 523, -31, 282, 728, 610, 392, 893, 854, 513, 356, 681, 200, -114, 239, 102, -702, -311, -29, -770, -724, -419, -701, -879, -271, -256, -704, -313, 175, 171, -94, 368, 512, 372, 537, 1018, 679, 469, 760, 676, -66, 70, 346, -171, -604, 33, 11, -834, -297, -79, -847, -558, -380, -222, -718, -15, 21, -326, 173, 647, 25, 164, 682, 765, 8, 460, 558, 139, 167, 408, 308, -231, -3, -115, -608, -409, -301, -378, -709, -280, -8, -508, -68, 250, -119, -468, 100, 377, 167, 484, 594, 187, 206, 455, 112, 192, 375]
2323C75k19m22N7K49n24J67o4j68J26L5M73l81J42J79O5j06M27J88m89L36J15
2344E61j55k74M22j26n10n3K38j41m09j2J58l41K24j64K28r8N68j14q8R2J96k42
2366d0k4N87l9j78L32p4r94N96M34o85P8j9m0l31j7N3j49l4K22k1j82J67J38j33
2390c53J60L91l54k1O27j62J14L7K07r0l00M02j50m22K84m07j40j25l8o7k40L40
2412c07k32k01k2O35k38L62J71j35j38L08L18l25K69L38k54m79N04J02n48M3K75
2433D46l38o75N04k00j13N3L6j3l39j16P04l97L73M40l54j3K44J65k19J76M57
2454H21n45J48J09o8k03K04j94m58o9L09m80J53qj1k18M6J23j24J62J92K8q1L11
2477A47O0j45R2L66m0j62K48k02p2j89K29n29n1K29P7m65J14J69k36k33M94j14
$$ y = [375, 156, -266, -209, 40, -484, -317, -381, -549, -423, -388, 85, -296, -154, 25, 90, -16, 411, 599, 110, 446, 561, 406, 132, 554, 428, -82, -135, 103, -38, -447, -459, -301, -642, -418, -582, -354, -452, 116, 2, -86, 6, 202, -40, -64, 523, 484, 306, 638, 564, -430, 166, 600, -85, -7, -26, -66, -397, -414, -361, -510, -544, -322, -343, -525, -358, -220, -353, -193, 198, -156, -177, 450, 288, 402, 439, 646, 556, 256, 658, 508, 86, 370, -37, -177, -302, -340, -407, -647, -307, -539, -740, -762, -127, -365, -3, 168, 33, -105, 203, 521, 196, 465, 803, 549, 70, 574, 676, 128, 171, 446, 108, -567, -63, -263, -376, -323, -287, -300, -639, -755, -51, -448, -75, 365, 11, -2, 242, 407, 188, 364, 821, 276, 424, 533, 465, 262, 466, 272, -186, -255, 54, -426, -273, -281, -292, -510, -464, -341, -465, -303, -111, -83, -164, 147, 207, 62, 154, 520, 480, 318, 566, 364, 292, 103, 332, -197, -248, -19, 58, -407, -293, -124, -360, -593, -99, -213]
2499b13k52M32K26k34m5L50o6j85P06l44n02L76J91m90rL00N7o63j48N53l21r3
2521c74M10k13n80N63K99m39jP30j87k11L25J61j30l4J59r0n16M35K20p90L23
2542F0J82o95J03K39K73o47J62J29k12P4M30k66j57M42K02n05M10M00k40m44Q34
2563G74m86l17L86J96n56m8l9m0q17P49K39l22m52L30K29k63J63J59k05J13O26
2584D19r0k77L61R6l37L56L08n51j62N10j79o97J13M68p20Q9K00q8n38L39k4l73
2606g77K2K68K98l72O67J64l30K88K16j42j3L76N3n90K60K12n37j56K81O9l14
2627e7l28L22l70j44L42K11p46M33J59k27l8O47k11j83L11R3l04L43L60m99J37
2648B51K56j63k16lK17k32k27Q6J54o23J46K8l51M18L15l63k55O22J60m91L21
$$ y = [-213, -465, -33, 193, -41, -86, 264, 198, 13, 719, 375, -127, 249, 440, -50, -59, 241, 298, -365, -513, 40, -281, -374, 36, -177, -757, -194, 105, -334, -335, 395, 208, -3, 322, 483, 353, 319, 478, 388, -128, 307, 527, -263, 60, 242, -453, -350, -111, 162, -485, -323, -194, -406, -332, 98, -168, -325, 117, 319, -186, 224, 624, 384, -60, 774, 288, -29, 357, 553, -3, -51, -90, -130, -947, -198, 41, -281, -733, -403, -174, -437, -274, -115, -320, -207, 419, 329, 52, 413, 509, 172, 528, 836, 285, 123, 633, 454, -243, -130, 338, -382, -293, -93, -181, -719, -380, -404, -777, -755, -487, -189, -561, 106, 270, -60, 228, 444, 302, 289, 665, 718, 128, 388, 600, 63, -93, 188, 257, -57, -385, -63, -433, -577, -235, -24, -770, -337, -178, -405, -443, 204, -7, -190, 121, 214, -90, 253, 613, 114, 251, 507, 344, 128, 125, 342, 110, -117, -31, 123, -500, -354, -326, -677, -259, 56, -307, -562, 60, 220, -271, 50]
2669E0K73k04J0P7J1l6L4J46m30j01K02k19n6K4K82m47j26M60P1n47K15L18m39
2692d32J57M79j15m16P66j50m11K51K83l64J00K75j88l76P1K56m71m3J52J41n14
2713e49N04p8j82q1J81L03l05J08L77n06M97K07k70j23L27r9q8j61L46l03o2K20
2735B63m82r2M9oq0q2L48j2k15L45Q7m34L67J61j60P4K46K6l27KM08l5l23K68
2759C96j01m61M6J91m23l9LK41m63J66J22k11K53J51j58K10L28J25m28K20J8M4
2781B30J4Q2pm3J16Q2k78k06P4r5j20j10P5j63r3K70j80Q9Q2L0k67M24K91j83
2805A14K08l83M98k41q4O08k45n56M05J5k21j93K42l82m3J16K4l65K87J75k48
2826b69jL4q3J39J77p8J15j8J79j5J62j46q0k5N5K63j15k17j03R9j83N6M8k27
$$ y = [50, 323, 119, 129, 206, 217, 181, 215, 361, -69, -170, 32, -187, -243, -219, 63, -384, -510, -50, 21, -526, -311, 7, -432, -275, 204, 89, -327, 439, 289, -122, 129, 412, 48, 148, 423, 235, -141, -70, 186, -285, -328, -176, -35, -549, -45, -123, -305, -386, -205, 98, -207, -99, 278, -228, 269, 476, 206, 83, 410, 311, 223, 62, 408, 105, 43, 263, -219, -311, -262, -268, -348, -430, -82, -94, -309, 36, 123, -311, 56, 217, 57, 131, 377, 403, 76, 78, 486, 451, 128, 396, 295, -166, -120, 71, -352, -391, -388, -147, -610, -444, -322, -533, -280, -129, -287, -77, 251, 376, -52, 168, 186, 230, 244, 326, 319, 276, 392, 474, 196, -10, 64, -31, -151, -261, -186, -349, -442, -172, -352, -263, -181, -151, -418, 6, 297, 114, 322, -61, 437, 196, 112, 720, 475, -81, 324, 339, 118, -75, 167, -215, -258, -142, -118, -483, -196, -21, -269, -270, -236, -319, -180, -3, -81, 34, 16, 195, 180, 342, 196, 116, 91, 146, 409, 294, 77, -26, 73, -110, -54, -6, -233]
2850b33j6J89k53j8P0K60l15K69J11k46M01j53n7J8L46j61J03N2j15l26M3p5N2
2873e4R7j63J72l92j7L5J20k2j47K28J1J65j50K33o6J64j11q4L08q1j03l14L68
2896A97j59j4k24K00O1m6j90Jj13K48J34l41K2K59M7j73p8K07J28N8K83l07q6
2919A14J4j09J84J00j13K28m75m3n7k73M11l45K3Q2R3K0k88J73K45N2%K47j87
2942I6J84k39K30k33J94k0k29K33j98J40k63L74k42k06L10k46j62lR7Q5j70N9
2964b09K37l46M75Q5j60j42J49M55l43J20K82n52J3J48j00j36j67J07qj35K53
2985B6l12Qj97K82q7k11K22J49j37L77K10n07N41j64N5J10J51j13m07J89M4K14
3007D43n69K29j66J56O0m01O7r6R3k07LL90j92k01M48j04j3r3K74K45j21J71o8
$$ y = [-233, -249, -60, -313, -331, -261, -1, -316, -47, 64, -182, 219, 66, 9, 27, 373, 212, 315, 367, 252, -74, -31, -106, -54, 43, -120, 52, -340, -357, -322, -202, -224, -371, -143, -132, 33, -117, 116, 50, 214, 103, 19, 327, 246, 143, -171, 197, 38, 24, -200, 0, 61, 15, -175, -174, -287, -39, 95, -246, -224, 35, 82, -91, -169, 38, 166, 224, 507, 200, 114, 128, 19, 203, 303, 190, 418, -57, -100, -157, -430, -19, -364, -341, -259, -166, -146, -434, -261, -16, 36, 36, 283, 96, 280, 41, 271, 38, 232, 212, -17, 216, 18, 158, -105, 269, 27, -179, 131, -115, -277, -280, -183, -98, -268, -209, 28, -318, 157, 242, 82, -60, 89, 544, 201, 321, 603, 51, 64, 212, 112, -24, -191, -84, -92, -227, 26, -286, -278, -475, -193, -280, -491, -269, -120, -257, 120, 330, -177, 364, 200, 255, 365, 516, 403, -4, 185, 229, 443, -126, 103, -63, 93, 153, -248, -181, -277, -184, -391, -388, 2, -190, -391, 57, -47, -60, -153, 121, 366, 245, 416, 348]
3030C48l01P3K70m56l6L30Pl74Q5j71L81m39P0J41J51k06j22j4J16J48J16k14
3052i7K15l7J5J68k81K81k36J40R9m28R2K61l39j89K61M4o06M82l0J21j27N3K10
3075G2j64q7L20n3L9j25N2K88l08L12M6l77K86j75l30J68J14n9l16L77q2k21j6
3098b39M34p18N26P1n7j74L16j56Q7o7K93j65j40L12k60K01o0r0j59J12k57K22
3120C2l14oL4r4Q6j3J75j04K70K9l97K33M7J67j10K09Q1l53J44J40j41j4N8j13
3144D6R7K1n6l84J86O8j95J44j71o6j96K76K62j51lj5M57m06K39J10l14K8L21
3167B98j69j47J26J67l32K7O2K50l53k2Qj92P1K4N3k2p5L63j95n8J93p8M7J9J41
3192B06l01L74J01p7k91L69k61j10M4j24o2k52M24k70O3J53j15p1qK55Q3j47K32
$$ y = [348, 47, 120, 390, -66, -102, 228, 235, -139, -54, -225, 156, -283, -213, -72, 79, -127, -249, -263, -147, 1, 117, -97, 118, 81, 96, 264, -17, 264, 28, 168, 267, -161, -69, 192, -147, -336, -75, -31, -637, -155, -185, -64, -191, -138, 72, -92, -179, 141, 88, 127, 2, 54, 342, 34, 346, 392, 15, 301, 126, -204, -36, 78, 19, -297, 80, -2, -223, -239, 195, -523, 3, 74, 17, -157, 159, 3, 90, 23, 316, 151, 11, 323, 63, 264, 204, 114, -45, 67, -190, 32, -282, -288, -254, -348, -262, -275, -100, -204, 66, 95, -302, -69, -22, 145, 35, 244, 325, -28, 116, 256, 115, 101, 159, 46, 143, 164, 108, -276, -90, -22, -217, -73, -244, -310, -506, -230, 32, -119, -122, -137, 320, -86, 153, 263, -51, -23, 298, 129, -18, 108, 275, -57, -30, 32, 282, -71, -93, -85, -277, -206, -182, -129, -151, -226, 137, -58, -116, 77, -1, 46, 65, 206, -95, 279, 380, 303, 12, 381, 120, 10, 54, -70, -132, -384, 40, -230, -167, -14, -129, -200, -208, 47, 130, -17, 215]
3215B15J54j71k37K3K49j31j44J08k36R8K78l90p5L03J42l46J81J58o23K64J6
3236a64r6M47l01K56j35k4J65q0j18K15k9o1n1J49J72k10k16jn3r5R5L94n35K18
3260e8n9J26j90j0J13j7m6K03k8kK3o8L02n3r1q4J8J09k47mK55l00pJ5j38J21
3286a17k7j2m5j33J75j3j80K96k51N3O06m44K90q2K5j31J31Q5k2P0k25L03n04
3309a52n9J06J5j6q5J9K70l79Q0j66M04k53J58J34l42L61j86J61J71j49J74J68
3331D34j21k04j64M04l10Pk0j32O3l03J55Q8j17p8J67j09q9L44J11l26J80k61
3353b81J26J31L77j01j3n8k52K70j9kk06Q4j6q5j18j15L45j30J15M1k20j72J05
3376a94R6L17k59O5R9k97M51k15M1R3P1q8k2j60L9N7k69M32j91j08O2j00J58k15
$$ y = [215, 369, 198, -39, -16, 233, 102, -42, 66, -170, -72, 206, -184, -259, 44, 186, -160, 21, 179, -444, -180, -164, -260, 187, -114, 142, 7, -17, 148, 68, -50, 165, 136, 75, 24, 173, 345, 135, -81, -82, -135, -230, -135, 259, -276, -58, -117, 9, -181, -191, -78, -95, -141, 62, 34, 32, 55, -13, 289, 236, 145, 61, 79, 188, -59, -63, 192, -108, -115, -100, -238, -117, -144, -156, -201, -334, -159, -172, -352, -56, -307, -254, 352, -92, 198, 116, 141, 10, 141, 226, 204, 274, 49, 352, -152, -211, -105, -90, -106, -191, -172, 98, -281, -201, -367, 37, -216, -58, 76, -266, 95, -91, 70, 241, 92, 266, 434, 313, 109, -55, 349, 39, 46, 26, -106, -43, -346, -191, -103, -220, -298, -131, -240, -329, 15, 126, -200, -20, -281, -155, -24, 353, 252, 239, 181, -71, 199, 180, 178, -28, 56, 40, -45, -163, -278, 67, -63, 52, 93, -127, -299, -194, -98, 219, -40, 25, 124, -173, 278, 63, 104, 197, 268, 180, 158, -2, 37, 94, -175, 257, 66, -42, 20, -80, 78, -137]
3400a37p6K57k25%P8J44N9j45J14j99K62q7L1J09O5p7j23l6O9k00J96j1l61L42
3424D9j48K77o01L03J9J36j8j58LN9M16m17Q5j67L55k25J80j43m2k47K02J0L34
3447B62k78K27l62Rr9k6J64j48M0j32O46m81K42k8J85o9j23J22Q1m20M63k73J47
3470A49mj41m2o0J6K5j43J07M6j31L20j49K4k63J64M7J33j23K44l03R8O4M5N7
3494A80o0m6J31n1j9q5k64K78P5k7k12M5p6O2j31J54m13O71l01K04L1k83J94k08
3518a51L35Qk89k7N99k29j47j03k2J77k38K84k71n1J16P0m34K66J62k73J54Q4
3540B0k5j29J64n8m5K96k17K36n4m9j41L5J1Lj19R7L0M0l45k73O58p1J67l76k
3565a47R5j77J85M5q9L3K25k28Q7O2J55ml02J57n3P0l2q4M92l72k21j23K74k39
$$ y = [-137, -213, 44, -181, -181, -103, 41, 100, -45, 69, -130, 132, 45, 76, 185, 250, 173, 50, 14, 83, -117, 79, 68, -293, 49, -99, 178, -423, -120, -101, 35, 17, -141, -138, -79, 337, -80, 5, -162, 193, -32, 148, 5, -37, -284, -82, -72, 262, -16, 211, -151, -142, -241, -267, -103, -251, -211, -343, 303, -178, 64, 36, 221, 152, 29, 151, 232, -188, 275, 2, 149, 145, 4, -38, -98, -82, -57, -200, -93, -47, -178, 142, -7, 17, -246, -82, -35, 98, -25, 219, -84, 14, 78, 123, 180, 120, 74, 205, 154, 135, 50, -214, 64, 139, 112, -100, -55, -131, -69, -200, -46, -459, 212, -89, 115, 146, -137, 57, -151, 184, 192, -97, -124, 475, 246, 99, -4, -26, 151, -87, 197, -74, -125, -9, 61, -373, -107, 55, -218, -64, 20, -5, -134, 30, -28, -73, 223, 6, 242, 188, 139, -2, 33, 44, 47, -72, 25, 55, 95, -250, -523, 135, 64, 231, -145, -147, -52, -229, -44, 1, -88, -55, 170, -58, 29, 91, 246, 242, -60, 97, 44, 114, 82, -2, 490, 118, -103, -226, 48, -191]
3589a91O7oJ07O8j09J6l8J8OK07j35o0l1M16k91Q7J45l20J06N8J00l96K07k2O6
3614G5j82Qj16L5K50r1J5L4M0M4j24L8j06l2J72J83k37Q0j91L27k9L9k91j96K83
3639B8k20M11l78J21j86O7m1K3J69r6J68j22J96l00M88l15m5J64N3j48n0J66l1
3662A22o9j94K12j52J36J9l40K92k38p9K23k95K79l8K85l81K5J44l8L32k42o5
3684f2J66J92k96k3R3r5J10mq5p9J18j03k27J02KK07l42L64o9o2J8q8K19j65L6
3709g3j87L49k2j42qQJ42J78j64k15P6j3J07J89j74o8j8j05nR1J67j66q2J35n6
3734e6l03K85K42j15j64L61j51K39k59M8k45K10P4q2r6Q6o8J5Oj51p8J06J30p5
3758d1o6j26K12j74K32m0N7j72P2Q6l42L09nJ9k01O29m72j9R9L2Jj61J4R3j50
$$ y = [-191, -124, -130, -23, 45, -64, -48, -86, -68, -62, 145, 10, -50, -81, 335, 44, 131, 276, -44, 62, 120, 220, -176, 31, 9, 75, -107, -99, -215, -180, 70, -21, -6, 28, 68, 112, -12, 26, -80, -112, 60, 243, 6, 86, -105, 222, 193, 232, -59, -255, 28, -192, 219, -159, -38, -224, -157, -198, -175, -6, -102, 66, -56, 140, -160, 328, 13, -32, 132, 185, 37, -13, 153, 122, 53, -141, 71, -81, 55, 74, -266, 26, -212, -291, -68, -363, -84, -122, 163, -218, -193, -49, -87, 245, 3, -62, 104, 296, 0, -23, 70, -25, 85, 81, -4, -83, 35, -68, -295, -193, -191, 16, -326, 38, -31, -93, -75, -163, 56, -109, -73, -260, 89, 67, -75, -83, -75, 67, 245, 81, -134, -58, -71, 36, 225, 51, -17, -35, -140, -145, -54, 113, -53, -135, 0, -56, -359, -74, 168, 53, -111, 250, 99, 338, 79, 127, -118, 92, 166, 84, -12, 74, 6, 21, 27, -124, -202, -96, 34, -41, -107, -233, -21, -195, 37, -3, 54, -118, -46, 40, -302, 7, 2, 21, -180, 449, -23, -42, 57, 89, 90, -71, -57, 36, -114]
3783a14j27K97m18j2L79k29K55r5Q1kj46J90K75l35k4K05q1N6k51K0J87l00M7
3806a42Q6K07k64m9N3K34k26N6P0k87J63J03O4p6O6R1o7P6j55K77k28j11J47r2
3830dR0o8K47k88r2O3k7J16J35j56m6J88j09J47k4l12K22k28K14j09M9o8K05p3
3854G2l07N54l17P1k8l3k05K84k67Q4O6l67K54j77L15j68p3L98j36j14O5J99j48
3877B2k43L65n3j17J78j14l25L86q0k2J92l04P8j09J30J41m23K67J01K8j81j48
3899b31J99j66J43N01l00m5J13j90J89j20k78M37j71J67K8j24k0O7k07j26J66
3920C2k60J39J39M3k10j97Q6M41m08L74k53j47J05K50j06l64K76K8J77p8J14r0
3942I1J13l21K45Q3l51J86j42K34k03j48nK83lj25K02j16p3N7j57L03Ll21K16
$$ y = [-114, -241, 56, -362, -374, 5, -224, 31, -64, 17, 15, -131, 59, 334, -1, -25, 180, 99, 155, -96, -76, 111, -189, -142, -56, 151, -113, -162, -109, 125, -101, -45, 25, -262, -99, 4, 68, -8, 58, 149, 82, 158, 3, 280, 52, -59, 88, -4, 86, 18, 265, -23, -115, -52, -79, 37, 172, 16, -30, 158, 49, 196, 172, -140, 82, -146, 68, -41, 8, -60, 145, 72, -235, 319, 2, 73, 45, 12, -193, 91, -176, -92, -26, -393, -139, -316, -1, -169, -242, 156, 20, -94, -29, 170, 22, -221, 144, 91, -26, 152, 38, -287, 99, 19, -3, 189, -115, -37, -146, -16, 125, -298, -31, 70, 98, -83, -231, -32, -198, -55, 446, 146, 101, 214, 24, 213, 93, -185, 252, 81, 248, 276, 152, 132, 199, -8, -134, 32, -228, -89, 50, 93, -117, -314, -228, 213, -195, 179, -74, -221, -116, 134, 28, -336, -60, -32, 145, 67, 181, 91, 204, -117, 128, 211, -140, 46, -96, 138, -65, -213, -218, 65, 62, -63, 139, 23, -50, 7, -150, 153, 156, -165, 51]
3965E1M15m59q0J40p5P7j68p4K12j57J23r9K24j03q7m6j69L52j8j75J37J64k27
3988d2K55l45K12L9Q0m6k11J28kk13L3l8K9J59K7j18J03j84J9j33J93J02k05J89
4012C1j9q6K95m6j76M9m0P4Q0k9j47j41L7q1J54k69J2L64K5k34K4Q1k7J57PNK3
4039A23j11K4K85j09j06L1M4Q0J9k44q5J80j44J6R0kk27J32k39J54J33j13r9O3
4063a05j35J21J54k78L30k50N0P4N0m9J33j45L4J87k61L12j29k41K46J15n07N73
4085B79k27q8O7j58K3p3J75J3J23j44J40K4M1j69n3K4j03J08kJ51r6n6J06Q4j89
4110@J1p5J66jl11J15K12J11j70j71j0j1M7L67j29k06K21j9l44L25r2R8k01m8
4134a15K58r7N5K8l69J91R6k97J24j80L93K9l8K9k11M1K63l66MJ56K17M4j10l33
$$ y = [51, 466, 7, -73, 67, -8, 69, -99, -173, 39, -118, 5, -94, 130, 27, -60, -106, -275, 77, 59, -116, 21, 185, -42, 213, -132, 80, 119, 199, 153, -58, 70, 68, -145, -112, -150, -121, 38, 65, -53, 50, -134, -115, -248, -55, 47, -158, 31, 12, -74, 221, 175, -1, 48, 8, 82, 162, 133, -14, -155, -118, -199, -45, -314, -302, 62, 87, -147, -123, -42, -69, 88, 95, 100, 123, 12, 36, 321, 212, 106, 137, 181, 261, 280, 36, -49, 131, -13, 3, 93, 91, -136, -4, -243, -89, 44, -69, -168, -105, -240, -119, 35, -243, 87, -163, -113, -39, 11, -38, 95, -50, -16, 171, -90, 222, 93, -148, 98, 213, -294, 279, 52, -36, 31, -127, -104, -177, -2, 11, 134, -10, 130, 154, 195, 26, -27, -3, -106, 2, 0, 151, 55, -1, 105, 189, 0, 11, -64, 102, 101, -210, -95, 117, 228, 58, -113, -123, -134, -87, 280, 151, -55, 166, 147, -197, 128, 36, 134, -67, -115, 143, 46, 101, 129, -240, -49, 47, -250, -126, -306, 87, 116, 78, 107, -104, -63, 200, -166, -162, -6, 211, 255, 145, -188]
4158a88J70N5p4J50lj2o4j82N62l69m38J68J65j55L36j76m4L27j40P3j38J91j42
4181G2r6J83l3j17n0J28k67K41j25n2J31k7k55J17j47K40k44K53o6n4K28r7N1
4204A4r7K38pq3n8J09j12l2kQJ7J05j32L6M8M5j58o6J28l68N71l10O1l04K75J16
4230D2J00p5O2m4n1J52j38L2L5j98J69l21K77j77M7J89j26J77k90J64l02J18L7
4253a21m1L25j81j72M05k70k86L96p5J31p5Q3o4j00K62j40J31J05l20q3Q2j12
4275a20j96J98L23k99J12k22K31k19J45K76l43K62Rp6J72o3l03K72j58j36mJ08
4297c1K14k13Q2M1r8m5P3q4R5PPk64K88l72L72k05J98k1j34J2J12J36j44J21j03
4322D4J48m12L28j06Jk73J06L82l10O2N0q3L45l94M4R1J26n8j82p7P9kP3k05K44
$$ y = [-188, -18, 37, -37, 113, 110, 98, 34, -148, 414, 45, -393, -225, -60, -215, 121, -55, -99, 228, 88, 161, 23, 214, 72, -24, 159, 126, 9, -41, 87, -180, 61, -64, -116, 15, -12, -267, -150, -297, -57, -301, -48, -114, -168, 60, -37, 14, -83, 155, 148, 65, 7, 116, 4, -28, -30, -22, -5, 100, -32, 4, 52, 97, -61, -127, 1, -367, 204, -106, -45, -349, -74, 42, 142, 67, 129, 85, 34, 186, 48, 80, 115, -83, 86, -235, 42, -135, -88, 101, -25, 152, -138, 26, -276, -158, -121, -162, 163, -18, -190, 215, -55, -341, 55, -20, 111, 36, 119, 55, -45, 217, 77, 208, 313, -7, -90, -8, -120, -316, -118, 205, -94, 18, -204, 27, -192, -47, 229, -114, 148, 157, 81, 253, 190, -113, 159, 1, -135, -139, -31, 183, -30, 52, 93, -5, -50, 23, -61, 34, 41, 48, -216, 72, -300, 72, -133, 65, 44, -90, -78, 34, 170, 26, 147, 44, 192, -220, 108, 2, 3, -270, -164, 218, -92, -30, 20, -63, 282, -112, -68, 23, 149, 91, -91, -168, -89, -91, -18, -223, 21]
4347B1N7m0L41k19P7j33m6j14p6R6l3m5J64k57K22j2k14O6J14l77L74j27K49K88
4371C76k68R1p4k56K17j84J89R7n9j80M43j15m56J61j89J26O2K1j17J83j90j5
4393a37l3J12KP9L8J72l28K94k72J21J36r2j53K40r6L2o0L4O4m17L9K95j9m84
4417d33K12m0K93L5j51L97k50j72K24K1J08j50k3n8R0k33L48k14K4Pj80L36N5
4440B46l76L31l06r4J68r2N1J6k4N8k0M1l4rJ86N4k54J53j08O6l1j16J07J95k43
4465c5j03Q3P4J82Nk37P5L9L3N0k30j10K28J5po9R3O7k46k6K52PJ61k34j46J65
4491H6L5k67p7L6J05Q4j13l0J54j63Q2M0nL70o31N02q2o0R0j86pJ87O8k13J34
4516A39k31K7l6m1K51k20J1R6j65l8L93k84j5J26M4Kj59J15K62p2l04L97o3l39
$$ y = [21, 78, 38, 379, 160, 237, 104, 58, -56, -132, -36, -69, -114, 50, -207, 15, 3, -211, -145, -31, -408, -34, -161, 88, 376, 108, 199, 125, -131, 86, -98, 91, 188, 129, -51, 392, 277, -179, -18, -207, -81, -19, 2, -115, 68, -122, -137, -170, -58, -56, 23, 61, 233, -95, 199, -73, 48, 184, 92, -61, 179, 83, 115, 55, 89, 153, -264, -225, 70, 51, -433, -221, -261, 32, 67, -84, 313, 63, -109, 115, 136, 244, 94, 71, 13, 103, -130, 218, 4, 28, 35, -145, 191, 246, -130, 201, -105, -199, -31, -123, -72, -56, -80, -22, -42, -1, -35, -44, 142, 196, -58, 95, -13, 53, 22, -94, 13, 208, -35, -138, -55, 19, 201, 206, -31, 44, 83, 116, 166, -64, -174, 54, 69, 62, -7, 86, 153, -93, -119, 133, 140, 301, 67, -79, 86, 121, -146, -223, -187, -82, 2, -111, -141, 13, -150, -68, -28, -33, 337, -294, 208, 126, 66, 156, -30, -37, 150, 218, 5, 139, -92, -65, -101, -142, 109, -111, -100, -4, -169, -207, 186, -98, -113, 13, 57, 59, -100, 15, 277, 205, -99, 298, 235, -104]
4540a04J33j34J6O6l5J72k14j8k8J04l1k4J34l50L11J20j02L1k14J20Q6j23M04
4563C20k54L2m9j35L06k19J37j7K3r0r7j5k6j24J54k6lj34K60k2j12j15Q6K94
4587A74k50l9K19j47J37o5K18r1J28m41L03k5p4j34j43J59j43J97k10J31J84l94
4609c06J51J91k81k4P1L24m04N75j01j20J77k88K18j30k0J56l79M37q7j73p1R0
4631Fj97K03j42n7K88l74K50k12J38j08K09n4m6K94J7m45L96l17K91k2N8J19k25
4654G0k10J57o4R0q4k8Q1nj35N6R3P5j98K61l08P1M0J20j40r5K54m4k4k66L01
4679F8k02L84k50Q0pJ24k60Q2j09J23o7J11q4P0j80K18j07J61l27N9L28L4k08
4702D1l7J96k89J23J63k31J65J8k6K6k99J3kP9l7J80q9l05M76k35j47P4M80k41
$$ y = [-104, 29, -105, -89, -23, -58, 114, -100, -118, -146, -42, -73, -97, 37, -313, -2, 118, 16, 47, -167, -47, 39, -84, 320, 66, 98, 49, -86, 220, 1, 138, 121, 144, 54, -43, -58, -84, -208, -54, -80, -83, -217, 43, 21, -91, -206, -120, 174, -76, -115, 104, -43, 94, 29, 247, 156, 284, -157, 146, 121, 47, -87, -230, -71, -214, -17, -227, -96, 88, -306, -155, 36, -245, -269, -198, 126, -278, 297, 196, 76, 253, -35, 183, 53, 33, 189, -190, 247, 160, -13, -84, 6, -191, 12, -130, -187, 101, -273, -23, -235, -97, -205, 4, -50, -96, 198, 215, -230, 166, -151, 140, 118, 176, 295, 70, -140, 17, -47, 43, -41, -69, 12, 7, -128, -72, 21, 96, -102, 159, -149, -78, -38, 82, -58, -153, 101, 57, 33, -233, 68, -134, 250, 0, 80, 73, 197, -63, 19, -90, 33, -34, 77, -7, 63, -117, 101, -6, 155, -172, -113, 215, 249, 41, 4, 200, -89, 34, 197, -34, 131, 149, 123, 149, -150, -137, -139, -60, -97, 83, -6, -311, 165, -70, -217, -143, 337, 96]
4726I6j79L76j49j6O7Q6j21j8j45j0M3j09q6j46J93P1j13M2m6J08l1J53p5LK91
4751B85k18j47J59J3N2J5j89K42m3Rk50J87n1j16L4R2l02L77k48K2p2j54K32j77
4775b48K71k01k3J89j03J25l7P8pp2M1r7K73M0N8k62q8M7O0L3j91J28J42j9l78
4800b41L46q3q8K3J06n3J4o2J51j23J14j76P6N3M1N3K9j12j98J55k09L05j91p
4824g7jo8J45k15O2Q8j22K30L0j75Q0J46n4j85L7M54m65kj31K53R3j03j73K56
4848A03j19p7L12j09l15r1K43qj40M8J81n6j08R2J58l09J42k6L88n48O9J18n8
4871a10L58j2j77j9j89K11j86N3P2n9J47j65j7L01k91J96j93J88p8L1L3p7J14
4894A31j1O7O9k47l2K05l83J0J22O7J32k66P9J35k26q3J10J25k34J63L1JN2j25
$$ y = [96, -83, 293, 144, 128, 195, 281, 160, 142, -3, -13, 30, -79, -165, -311, -118, -47, -160, -118, -164, -56, -87, 66, -9, -6, 285, 67, -80, 79, 92, 144, 159, -30, 212, 169, 178, -72, 115, 64, -52, -18, 74, -228, 149, -99, -77, -149, -303, -71, -248, 23, -178, -201, -12, -115, 10, -27, 51, 44, -28, 13, -84, 189, 229, 287, 25, -63, -16, 44, 77, -114, 14, 156, 137, -241, 105, 22, -66, -43, 63, 10, 24, -38, 113, -10, 104, -72, 4, 57, 98, 151, 180, 68, -130, 25, -184, 121, -70, -77, -78, -146, -1, -216, -154, -66, -188, 42, 72, -103, -23, 123, 69, -116, -79, 375, -90, -92, -223, 30, 123, 20, -153, 103, -16, -93, 219, 110, -205, -296, -53, -61, -201, -153, 28, -28, -136, -44, 114, -195, -53, -79, 309, -239, -170, -52, -110, 248, 236, 59, 40, -149, 62, -124, -71, 1, -58, 89, -76, -93, 208, -83, 113, -80, 108, 30, 61, 94, 17, 131, 120, 187, 256, 9, -23, 182, -201, -191, -69, -2, 130, -136, -57, 78, -148, -231, -121, 4, -230, -67, -36, -35, 17, -108]
4918a08L96k69M1L0J48n1l95J66J49K2j08p9j7K03j85k5k4O6K1nJ63j97o1J85
4942F6l55L76j7q6L7R8K9N5j86j17J63L1P9p3p5K1J10k72r5J43J35j29q2o6K07
4967cJ29j03q1k3oK5l5O6K64J03l95m8K70j12n8J23k96O9L49j78j66j6K17k01
4991a06K39k00n3K37J22o6l75L50L1P3m62J93J38j76K2M28l88k6R7P7j80k35K86
5014B6N9l10K01p5Q8k4n2m3J31j12j77K38O8m2j9o2L08l18L5N2P6Q6m6o9R4q2
5040C1K31j9k19M0k57J65r5J64j38O6j65J98K30m01L58k42K29j51j92L43k48K25
5062A53j0j13kj59P3k1k8M54k91M8l22P0L32l0l19K57o5j1N4J37k58Qj20L12j61
5087a2N6J99j12m6J5k27K1j67L29j57J43k04J32k59J20J08j26N3J70J04j06n8
$$ y = [-108, 288, 19, 60, 90, 238, 187, -208, -42, 107, 129, 21, -58, -75, 128, -57, -82, -106, -40, -19, -24, 139, -58, -119, 66, -289, 87, 70, -16, 21, 119, 148, 203, 17, -100, 63, 94, 173, 100, 25, 46, 156, -116, -211, -68, 67, -62, -144, -210, -3, 126, 23, -58, -81, -87, -62, -97, -31, 233, 336, -59, -107, 163, 51, -7, 116, -180, -111, 238, 60, -106, -122, 95, -106, 133, -67, -120, 117, 239, 173, -202, 148, 179, 252, -210, -17, 121, -55, -33, 395, 7, -19, 78, 155, -25, -260, 26, 85, -225, -24, -99, -11, -35, -87, -130, 1, -111, -288, -50, 18, -24, -43, -105, 203, -115, -80, -28, 48, 134, 88, 19, 113, 31, 262, 243, 24, 64, -193, -28, -123, 41, -97, -31, -196, 2, 232, -169, 189, -53, 176, 25, -167, 176, -72, 153, 143, 30, 28, -131, -58, -79, -107, 347, 56, 104, -218, -148, 184, 154, -165, 92, 27, 16, 70, 207, -51, -43, -163, 149, -12, 44, 243, 131, 85, 100, -127, -106, -273, 56, -101, 42, -162, -30, -289, -169, -61, -187, -134, 36, 140, 34, -24]
5109b4j0o0L04L30m29k4j05J91Nj16K93k70P9m0k77K02j04j28L3J42k05M60j65
5132H2j30j34K07J80k74J68q4J19m3k13J30N6k10M62l27j17J77R9k35j27J89N7
5154C2j61J71j68J90k38J38l14K34J64%J23j32n1nj40N65n29j83M44k32N7K64
5176B29k31K59l43J3M9J7j35N6q0J5K26p5J64j27j90P8J76oP7l73J71O5r5M3j8
5201c5m2P8j0m6L5L5r2K11J7j83o4J63j40J86J04l44L58q0j27r7K12j82M2K62
5225B61k71n7lO9K11k48R0j25K42k84O4j04K95j47j4j35J96R3k79R7J78o9K2O4
5249A46m2o3P1J11L6m78J13M2L4J24j16J58j38j47K62l81K60J22mj98J43j7p1
5272c3l1J19Q6m0m5j08J47J01k70J6K36j31j69J31k28oJ71m5J24M2o4K09j03l1
$$ y = [-24, -34, -94, 210, 540, 111, 87, -18, 173, 178, 62, 355, 85, 164, 124, -153, 49, -55, -183, -150, -8, -213, 247, 82, -48, -182, 25, 205, -69, 99, 15, 134, 91, -122, 8, 64, -146, 316, -11, -128, 49, 148, -87, -214, -25, 32, -129, 42, -126, 64, -174, -36, -350, -116, 48, 48, 171, 39, -12, -17, -157, 408, -121, -304, 140, -92, -35, 229, -2, 257, -86, -73, -24, -7, -142, -86, -166, -151, 75, 0, 164, 37, -153, -75, 101, 95, 172, -201, -30, 35, -60, -17, -35, -77, 1, -9, -55, -20, 15, -77, 134, 151, -32, -96, 67, -73, 113, 217, -127, 231, 151, 24, -73, 139, -43, -1, 261, -10, -67, -70, -1, 210, -38, 52, -73, 169, -115, -51, -155, 140, -7, -21, -156, 40, 133, -146, -49, 129, 60, 82, 146, 104, 41, 112, 223, 259, -219, -106, -64, -30, 94, -22, 136, -2, -149, 113, -268, -8, 114, 110, -88, 55, 38, -33, -64, 55, 141, 101, 56, -52, 95, 196, -74, -58, 178, 47, -122, 9, -219, -225, -54, -99, 25, 67, 3, 212, 109, 78]
5296G8j28rJ84J91l86P6K50k02K7j16K07l65K56L7k37M28o88L13K45m25J54l07
5318d17J44K41j23J07J28j85o9K66o0k8j00J63j53M57k46Q7k04J03OR7k56l7J00
5341B1l3J29j51Q6j62m6K13j17j72M34k07j26K22Q0o53N03j34J05j68N8m2K29
5363F9J87k93K19n1O3l50L23k30r9l7n7J12K41k05j67J63K26j92R8k4k8R5Jj1
5387E3J57j57k36M4J92P1j00r7l1J71n4L5k49K46j83J85j85J62m8k06K26PK7N1
5411H1L4k04P8K2Rm1J91j18M5j3k07L45j10j76R1J31j58J41L2l15J14k03J03K70
5435A42J18l32P5j2lj13L94j24k85J55j02PK80j88q2nR0J0k3j18O7J01l5j17r6
5460a96J49o6M6J66k44L02K2pN4k10K51j27l65J58j21K99Ql01K34m3K13l21J75
$$ y = [78, -50, -59, 125, 316, -70, 6, 256, 54, 81, -35, 172, -193, 63, 100, -137, 291, -397, -84, 161, -264, -110, -417, -273, -32, -155, -48, 80, -105, -174, 92, 32, 4, -96, 67, -86, 371, 125, 212, 8, 111, 117, 214, -42, -79, 21, -12, 117, -34, 52, -110, -156, 57, -60, -232, 202, -5, -131, 91, 171, -482, 21, -113, -8, -176, -118, -160, 69, 256, -37, 182, 131, 194, -156, 167, -63, -162, -199, -256, -144, 97, -108, -275, -112, 114, -78, 20, -4, -32, 63, 64, 53, 210, 53, -183, -139, 53, 124, 24, -73, -104, 67, 13, 48, -201, 45, -138, 47, -138, 24, -24, -230, -4, 3, 30, 81, 115, -89, -11, 11, 20, -21, 170, 52, 97, 84, -123, 222, 112, -64, 27, 158, 0, 141, 173, -142, -28, -231, -128, 142, 260, -72, 3, -9, -12, -125, 269, 145, -140, 15, -87, -80, 200, 12, -70, -75, 15, 25, 2, -116, -49, 52, 17, -100, -196, -47, -113, -67, 99, -145, 157, 179, 172, 226, 16, 267, 140, -225, -67, -188, 111, 119, -182, 52, 9, 222, -99, 76]
5483G6l88L46L1j20N6J77k38M9J35J96k58L8m0j20K28l11J35R1j16Rm5po9J09
5507c6P2j19j0k2J30k60J36j37M19l73o8L00k41J58J93j47J25j48j09M66m78L61
5529B12m21R3K9K02k01J64p5Q4r4k02P6k9J65N3r9j0J08l63L38OJ85k42M2J87
5553B08j31R8j95l0k38K21P2q5p7J73K56j89j99K59n15Q4L08J4J54k40P7L32j82
5576A75J3j39oP8m6j40J90r5K02j78l01L88l30L65k20j81J73pj7M07k27q5R5n6
5600E8N8k93L52j07J86l3l1m56J19J91J46j00p5o3J3p7o9J21p8L28k99L6J93l18
5624a98R0q8K59N8j88L91j36j57O9J14j68q5K01j8o6m7k4K48k23K7k9k42K08L22
5648C18o35J06J06q4R7J17j13J99j99L57k1p8n7p4Qj40J55k27L76l69K19j33J18
$$ y = [76, -312, 34, 65, -55, 1, 178, -60, -11, 124, 320, 62, 100, 60, -60, 168, -143, -8, 83, -33, -24, -69, -76, -145, -36, 36, -83, -93, -115, 15, -245, -109, -246, 173, -200, -268, 32, -209, -51, 142, -5, 120, -28, -137, 329, -149, 212, -209, -116, -87, 115, -86, 78, 3, 87, -7, -209, -133, -162, 3, 56, -43, -53, 55, -308, 30, 36, 221, -21, 21, 208, 77, 175, -20, -50, -288, -67, 5, -80, -157, 16, 272, 83, -116, 143, -372, -288, 20, 34, 188, -52, 25, 357, 175, 188, 49, 43, 121, 75, -65, 125, 30, 232, 54, -247, 141, -189, 176, -44, -225, -52, -59, -76, 331, 104, 19, 114, 58, 116, -177, 175, 68, 254, 221, 190, -266, -147, 44, 190, 90, 15, -48, -35, -112, -181, -60, -138, 190, -109, -73, 120, -198, -108, -196, 63, 121, -67, 324, 188, 31, 100, 214, 46, -39, 162, 144, 78, 31, 7, 255, 32, 59, 30, -212, -4, 318, -317, -211, -105, -189, -92, 25, -88, 111, -88, 269, 248, 170, 113, 39, 47, -93, 62, -165, 211, -158, 61, -72, 46]
5671D6k5j74J63j22n0L18j55PK37k99j11P5J37J31l45p3L74m2j3o1J44r2l4j17
5695h1j75L12j55J44k27M5J9L3M4n8K52k13J89m9p2J40O4l38J65J7l6Q6n9k3N2
5720G6K51l41J6P5J23j63R9L0l57K81l18K84o3j87K49l7P8o7j48j14K64J90k00
5743B1M0kj17N5n4J18j71K10j23R0l8r1kl2K39j4q1J33k55k16K36J53j43q2K6
5768a00L79k71J15q6L3L6r4r1J37j10j0j02J15J14M4n8q2q5n1J99p2J91j2j82
5792d3J09O3l96K01K5m6K48m29L80k51j93M88r7j61M1k91O63k44k6j55L6N9J77
5815A58Oj78p2M4K70q8j13J56l03K38j31m4j28N08n08K3J03J42J09l23Q5O1J4
5838B9l6k96LJ46o4K53j08l2K8J56l00J01K60j31J19p2J94j76j62k22L21p1NP9
$$ y = [46, 21, -153, 10, -112, -162, 156, 1, 8, 245, -54, -165, -90, 47, 178, -167, -240, 134, 92, 79, 18, 162, 70, 36, -81, -256, 56, -99, 45, -182, -137, -118, -85, -41, -99, 153, -60, 129, 80, 8, 148, 212, -126, 39, 56, 20, 106, 47, 24, 76, 327, -14, 2, 77, 200, 37, 136, 166, -191, 90, -228, 56, -7, -194, 55, 18, 96, 29, -119, -233, 31, 221, 21, 61, 59, -58, -3, -57, 61, -110, 100, -23, 67, 29, -62, -64, -96, 143, 129, 48, 181, -74, -290, -54, 99, -44, -126, -100, 279, 8, 123, 37, 70, 106, 12, -79, 58, -52, -62, -164, -49, 65, 109, 51, -31, -116, -167, 32, -40, 151, 139, -43, 66, 129, -267, -66, -41, -87, 161, -268, 112, -139, -332, 156, 59, -102, -61, -352, 311, 67, 41, -114, -78, -19, 158, 164, -14, -86, -42, 228, 140, 27, 183, -120, 118, -13, -57, -185, 323, -185, -162, -59, 83, 192, -131, -46, 15, 29, -7, -303, -300, -154, -218, 35, -73, -105, -77, 79, -221, -120, 140, 9, 128, 56, 250, 74, -88, -310, 11, -60, -55, 24]
5862B4k08K29r7J9J46M8j63L22k41j94J33O7Nk56K48j15J49k00J44N8j12j38L57
5885B25k71%J02j66M5j80j2P9lk5M05k04j05J32l9n4P3p6k2J34j15NJ76J58K7
5910B89Q5j33k95J22j30J16ml49M28l67M1J70J38o0N9l13J17J23Q8l0R1j66p9
5933e9K82l60K58K6k48J98k68K15L4lj74K15K2j39j79J58j4Q9J0k18m8K43J61
5956B01k24P8j38p6K23J94l89K69k09J38j17J42J36k06q7J19k9r8J10r8M5n4n1
5979a21J46J74l73J38K36k86K41k43J22K31k39O9r4j38K66j02j5R2j86J42K31
6000B91l56Pp5J48k79J71Q1j8J71j80J05j90J40J94k15J72j12J21l43K92j02o
6022A7K92n66J4L0K04j0r6L0j50J80R7r6R2q9L5J18n5O8L7o9q3j44j12J55l3J89
$$ y = [24, -184, 45, -52, -33, 113, 161, -2, 320, 79, -115, 18, 85, 90, -166, 82, -33, 116, -84, 60, 118, 6, -132, 225, -46, -46, 56, -110, -65, -245, -257, -178, -181, -206, 199, -5, -110, 22, -17, -71, 2, -74, -96, 38, -77, -72, 104, 262, 289, 374, 241, -54, 68, -62, 54, 50, -299, 129, -238, -197, -27, 111, 51, 110, -203, -86, 37, 125, 95, 186, 20, -59, 223, -137, 121, 147, -101, 97, -171, 44, 78, 75, -99, 116, 138, -1, -180, -22, -36, 53, 63, -155, -203, 40, 201, -23, 55, -83, -159, 64, 258, -131, 138, -71, 67, -50, 92, 228, 22, -65, 54, 25, -73, 37, -61, -16, -70, -121, 25, 199, -174, -36, 200, -86, 155, -88, 34, 265, 26, 95, 1, -137, 129, 27, 12, 104, -82, 60, 291, -65, -58, -133, 15, -264, -93, -12, -30, 141, -39, 66, -124, 16, 210, -5, 167, 55, 176, -167, 125, 23, 17, 309, -257, -243, -213, -9, -19, -115, -85, -235, -55, 42, -54, 38, -51, -16, 102, 47, 115, 152, 83, 0, -144, -256, -101, -134, 55]
6048E5P2l21K8L24l2k39J54N7J87l32k18J34m3KJ36J46j46K2K94n05N09j18o4
6071A02M2j41J13p3N6m0k77Q3J55k5K69k83P7j30J18l0P8J10k53R9r9J1P0P6q7
6096B1Q9k02K36j75K11l58O3J10j36NJ60n6J22j55N5k18M05k42q0K90k25J90j45
6119c5O5j41M20k62K75pk30o1j7o6k19L74k6j32LJ00j23L7p7K04k34L9J86Q3l43
6144a87M66l40J63K7l09K07k65R1L3J40j4r5K59k43K36k19O5R8k77L7o9J14J71
6167H9n8K8j35j74M45p9L7N7o5m9N6j13n9j9RJ16K29l45K65l16K3J34m7n1q2j47
6193b51K03N6J6L2q2n4p3J01J02k12K30o8P1l08O20k07n6Oo0l8P6j93k3J81q4
6218a5Q1l0K37k95K8J06n9j98J91j99O2j5J74L9n0p6j88K64Pj00j14J76j93K01
$$ y = [55, 127, -194, -166, 158, 126, -113, 41, 98, 285, -47, -265, -131, -174, -172, -36, 110, -36, -14, 280, -225, 284, 166, 102, 144, 3, 116, 43, 99, 59, -218, -135, 20, -5, 264, -19, 58, -72, 46, 16, 94, 204, -49, 50, -49, -38, 32, 108, 21, 110, -92, 144, -31, 180, -178, -115, -5, -141, -136, 24, -32, 90, -65, -10, -228, 177, -65, -145, 145, -80, 110, -35, 30, -111, 309, 47, 322, 315, 85, 24, 7, -59, -278, 96, 70, -62, -59, 41, -82, -45, -122, 82, -152, -113, 73, 156, -187, 279, -61, 102, 129, -180, 27, -238, -147, -114, 26, 12, -83, 176, -67, 169, -50, 15, 113, -164, -127, -196, -82, 89, 31, 59, -76, -250, 195, 116, 153, 210, 145, 96, 152, 39, -20, -39, -30, 86, 315, -30, 235, -81, -58, 76, 29, -22, -104, -251, -48, 8, 24, 56, -26, -80, -153, -52, 50, -162, 68, 0, 71, -237, 383, 176, 120, 126, 66, 28, 104, -89, -112, 69, -15, 66, 36, 273, -22, 6, 112, 53, -145, 46, -153, -91, -106, 68, 107, 57, -19, -207, 57, 64, -36, -150, 26, -167, 34]
6242C4M7j06k2Q1rj44Q2l1Q3J09j46Q0j37R2j24J67j03J61k01k3K2l20M15P7m22
6267c38Q5J06K41o3k05M14j62j81J82j21K24k12J7L1j48L12j91j6r3p2L39j1j51
6290a3R9J00nk8J7l74K63K50l74j26J91K3k63L26p6p0lm0J54k8P9j71K10M3k89
6315a05L9j17J35J44q7j2P6J1j3k51O6J5K1K0rM9J2J47o5k69J45J86k02J01L15
6340C52m9j59n25K30K69l55M1J66LjpJ21l4N6j76K18q7K2k59L07k6l7L7j93M00
6365C14j81L8k66L27j95n6J71J89k94j03J53j97J43j72L76k18L17o11P7Q4J84
6386H0j61J07r4M8j20qo4K26r6lJj7J32K68l11k33J74J49oL9j33r2q4P5K57k75
6412a41K75q0%j20J49k25J27L9Q1m5j37L4K11j24j24P2K56k55Q9k0J55k12k16
$$ y = [34, 81, -25, -47, 34, 25, -119, -37, -68, 15, 124, -22, 58, -79, 13, -111, 56, -47, 114, -87, -110, -88, -408, 7, 84, -338, -253, -147, 94, 31, -174, 240, 78, -103, 79, -42, 182, -30, -13, 18, -130, 182, -9, -25, -118, -190, 149, 138, -13, 86, 186, 181, 153, 170, -204, 59, 309, -65, -191, 0, 23, -240, 86, 10, -60, -63, -103, 51, 23, 102, -69, 141, 184, -105, -66, -183, -48, 96, 9, -3, 73, 84, 71, -180, -114, -99, -78, -58, -67, -18, -6, 141, 76, -193, -48, 138, -64, 37, 352, 303, 144, -381, -151, 118, -237, -196, -30, -27, -28, -35, 86, 52, 108, -68, 150, 63, 85, -174, 133, 107, 70, 107, -86, 314, 133, 171, -95, 232, 37, -19, 152, 341, 47, -56, 97, -100, 43, -129, 247, 29, 346, -265, -188, -104, 80, -81, 26, -68, -20, -140, -148, -212, 14, -82, -85, -84, -101, 31, 299, -12, -245, -71, 78, 72, 111, -22, -114, -198, -123, 134, -141, 134, 54, 54, -66, 83, -142, -15, 24, 105, 60, -77, -43, 168, 44, -80, -8, 248, -7, 82, 62, 217, 5, -211]
6435b11K37K03m80l3L54l35J79K15k91j2j48M81k73k3N3K85k95O5r0K64K2k29
6457f2K23OJ46l27K11J64m14J45j03j54K18k05R8J59r3J5j3m5n0p2K79j64L98
6480C60n41J92q2K24k68J47N8R2k13p9N5p5N4k4J47j23Rrn8J89m9j95L17k02J10
6505C6j31L03l35KP5Q8p4j28L30k01k2J38n8o0j25L36k47O9r5J28n8K25J2j33
6529G5p4K42l63J82r3J27j37qJ34k43J28K04r7q0q0J30J92j65q4N6j07K8n9K33
6553A41j88O8J99J6k02n9P1p3r3J77m7k51J89q6K20O0J63j55j96m6J7j79J68j20
6577b06J46L50j91p7j07J09r2L67j61P6j12o3J71k19j54K40k52K15j01J06p3o8
6599i6k90N17j2j46l2N2O5k42P1k9J50O2j86K14j35M4j8J76M2k92J56k52J38K87
$$ y = [-211, 26, 229, -251, -284, 70, -265, -86, 129, -162, -174, -322, 159, -114, -137, -84, 201, -94, -29, -119, 145, 167, -62, 161, 167, 313, -14, 197, 361, -53, 92, -11, -165, 53, -152, -54, 105, 12, 27, 14, -31, -81, -153, 126, -38, 360, -181, 11, -71, 153, -115, 32, 90, 182, -31, -110, -55, -130, -76, -100, 47, -76, -67, -76, -134, 55, 6, -189, 128, -74, 36, -95, 208, -127, -125, -50, 38, -36, -164, 166, -35, -57, 81, 23, -37, -162, 174, -73, -4, -99, 29, -29, 196, 208, 75, 1, 243, -120, 62, -31, 96, -41, -49, 85, -158, -30, 174, 77, -3, -83, 47, 239, 74, -10, 46, -61, -33, -92, 141, -47, 21, 220, 236, 34, -25, 46, -27, -120, 57, 10, -241, -52, -138, 82, 142, 305, 150, -46, -92, -75, -254, -86, -206, -60, 290, 99, 22, -85, 24, -68, 299, 138, 214, 102, 39, 210, -9, -163, 77, -175, 40, -61, 45, -28, -96, -386, 131, 119, -27, -59, -7, 58, -184, -113, -142, 8, 70, -116, 98, -37, 7, -11, 165, 207, -85, 71, -181, -43, 244]
6623B44k80K45l38k3l2J10R6k0Q5k13R0j39J89oK1l13K88N3k14J59K01j96r0K78
6647A95l93K63k05J9n3J20k0M1M9j40K58j84l7M98k59k42j64K48K4K11j62m6J51
6670A72j67M9k1q8M7r8J46R7l13J18J4J39j35J24r0O1n2k81L16j56K26l03m7M83
6694B41r9o7K1q3J8N6L3J0j60J24kj77rj6J70k31J05j04N69k48j97o8Mk1J35N8
6720F2j5l18J19J98k70L81j53K85k83JkK34k84K45k12q5m0L15q0j20j5j25J27
6743c5k1M7J75j00Qj05l48M37j38rK74l09k4K67j16o8J3k5L2r9K2K09l7l35K47
6768c8o4J5p1o1K65o7j28J84J15n5l42K56j35K13K53k50k19L06k99J18J22j72
6790e4J0O6q6Q3J19k8q2P5j09j96j6L53l07L76j22M0N2JR6k14l4O4J45j43j58
$$ y = [244, -36, 209, -129, -152, -184, -74, 22, 2, 87, -126, -36, -175, 14, 8, 29, -284, 4, 57, -157, 2, 203, 7, -83, 195, -198, 65, -140, -121, -174, -54, -74, -33, 16, -124, 134, -50, -87, 411, 152, -90, -254, -6, 18, 229, 67, 21, 172, 5, 54, 33, -55, -8, -106, 40, 137, -176, -58, -44, 95, -40, 84, -6, 55, 3, -278, 38, -118, 108, -195, -242, 241, 142, 75, 96, 13, 31, 87, 120, 130, -30, 94, 92, -85, -94, -110, 60, -171, -66, -170, 399, 151, -46, -114, -110, -131, 4, 62, 47, -271, -152, 46, -224, 157, 4, 289, 6, 7, 5, 239, -45, 200, -12, -97, -137, 178, 98, -22, -37, -162, -35, -56, -9, 166, 66, 74, -31, -379, 58, -80, -89, 185, -124, -148, 119, 3, -65, -52, -77, -45, -144, -122, 87, 50, -285, -38, -102, -87, -158, -219, 46, -21, -149, 35, 150, 95, -247, 9, -126, 87, 340, 90, -129, 177, -122, -4, 118, -54, -44, 22, -64, 19, 138, 110, 28, 103, -6, -202, -218, 135, -172, 204, 82, 122, 174, 175, 271, 57, 23, 87, 232, 89, -69]
6815f9j64nL37L7n50N81k48O1j06J82L8k96K47n6L2l00M62j01r7j20P7Q4L6j27
6839f5J48M8j4N3p2o5j24J36j8J11j00J33j65K5m6J50Rl14J14J9j90M07m27M68
6863B21l57J53M0j11J62k46o4K55rj09K4J54q1j43N0R6J32k42O0P4O4j04J11j25
6887EJ30J68n07M75l13K53J1n22K94Q9J30p0J08m46J50m9K50j74K1j12MN1pj70
6911b31J78N5R5j65j29J72l5o8L00j77j23K26l0j86L11jj63P3j42j8M5j62J89
6934A4P7k21J05j50L96l69J1J27j27K11j09N4n7q6j95J28K18p9L1O4K8j76k1N2
6958g4l8j25K36O0k75J55j06j84J92Q1k8m5P4K08m70L61k9K82k40o9k6j50K89
6981G9M1j36K4j24J12M7J09k31J64K5l14J37K07L8o9J03k45J65p2J9l9j7J85J8
$$ y = [-69, -233, -238, 99, 136, -414, 167, -81, -20, -126, 56, 94, -202, 45, -11, 21, -279, 183, 82, -15, -135, -58, 26, 62, -65, 83, 131, 117, 170, 98, 33, -91, 45, 27, 138, 38, 171, 6, 31, -15, 135, 144, -170, -56, -37, -227, 180, -247, 221, -136, 17, 57, -54, 108, -138, -202, 53, 44, -65, -41, 113, 32, -111, -61, 35, 167, -75, -15, 59, 123, 19, 130, 5, 135, 303, -204, 271, -42, 211, 222, -300, -6, 83, 213, 143, 251, -195, -45, -94, 156, -18, 3, -109, -105, -54, -61, -231, -53, 2, 97, -68, -197, -25, -60, -128, 172, -5, -128, 98, 68, -118, 193, 192, 29, 102, -40, -58, -13, -175, 14, 91, -130, -25, -175, 221, -148, -137, -10, -137, 74, -35, 19, -38, -124, -319, -191, 27, -52, -21, 43, 71, -105, -126, -74, -112, -237, -1, 59, -216, -61, -167, -351, -159, -78, -106, -151, -77, 131, -339, 22, -7, 275, 35, -34, -60, -210, 79, 120, -16, 8, -116, -4, 43, 152, -79, 85, 110, -204, -67, 140, 178, 109, 212, -33, 132, 60, 79, 40, 23, 208, 226]
7005B26k54J38l14K87o6k90L80r3p1p4k35K57J87q1K32k43j67P4m2K05j07R1q7
7028d7k1K70j48o1p9J51l7p1J7R9m6o8Ok19K93m3k84M24k32J48J02j26Pm6Q6O2
7054A37j69L31l35l6J36j53J6L09k98J53j13MJ43j06N2j96K83m1l12J71o9J63
7076G0q2J44q0J76k41L1n5l3J13k53J35q5J83J80o3N1k00n8L53m69L45k8l6j60
7100f2K95l85J88J26k52J04k91L47o8K20k59J68p9l03K70K58l12J02o8K97k42
7121E4J02q2P5r7j17J16j3M4J33l95R7L04m00K68k56K49J50m81J18L27k23j23
7143a50J30q8K39K21l77k0J08p5J28j46j40M3R7L5K8K8j27q0K6p8L40l0Jj72j90
7168b49L87k23m5Q8K7qJ0m0kP1L7L2Jl2j77L1j68R3L09j02rm1k6j45l16N90q8
$$ y = [226, -28, 110, -204, 83, 17, -273, 107, 14, -57, -131, -366, -109, 78, -3, 229, -14, -181, -107, -149, 56, -51, 40, -47, -68, 202, 54, -7, -86, 65, 28, -43, -26, 73, 27, -41, -35, -254, 39, -4, -288, 136, -96, 52, 154, 28, 35, -11, 75, 137, -32, 299, -36, -72, 64, -89, -73, 236, -62, 91, -22, -18, 125, 19, 71, -125, 158, 117, -195, -24, -93, 70, -12, 132, 52, 228, -13, 18, -37, -70, 43, -210, -75, -160, 23, 203, 140, 191, -9, -67, 286, -183, 162, 134, 98, -62, 233, -152, 36, 162, -90, 14, -277, 70, 2, 222, -37, 131, 52, -251, 19, 277, -35, 67, -1, 296, 54, 156, 74, 149, 52, -65, 51, 38, 82, 215, -180, -83, 221, -179, 89, -167, 82, 232, -249, -131, 196, -27, -150, -20, -108, 131, 352, -25, -45, 63, -12, 116, -30, -170, -127, -30, 5, 33, 61, -66, -146, -120, -198, 142, 112, 113, -59, -249, 138, -85, -130, -42, -15, -23, -13, -53, -55, 16, 53, 85, 86, 54, -123, -92, -260, -167, 142, 40, 31, -10, -36, -181, -497, 93, 5]
7195EO4o2K1J32p8k07J68M4j07J24j05L6Q5j44j23o2L24q5j46J88M4P7k14P9k3
7220C5k49N7K11j30k18OJ10J32L1j8J99l36J30K46n3J5r9M1j00n0K83r5k03N3
7244bj18K70j00j77K65j92j2J85l8l4np5o5L9o6N1r9l4LL47Lk08L1j21M50l40
7270d2J11J00l74K38j03K39j79J37j22L8k69K82P5M2qP6m28K61j73L41j20l55
7292b33J66j6l16O35l09oJ56J07k87N6J94J85n94M10j63N9R6j89k8J30O3l05K39
7315E0J50j36j91L6K82p6j64j75J61m5k4J25m3J67o8K15J36m00P0k12J22mk89
7338c13K54qJ30o4J09r5K23k09j31M8J6J60m13R9j9K66j65K69l36J17L1K45m06
7361a92K06j29K68j05k34K64Q8l25k0L63p9%K38j26kj17r6j2k84L64pmp6R9k03
$$ y = [5, 69, 7, 28, 160, 82, -125, 43, 87, -20, 104, -1, 35, 120, -24, -147, -209, 115, 30, -116, 72, 116, 193, -21, 58, 35, -214, -157, 54, -76, -294, -288, -178, -46, -15, -33, 166, -170, -40, 206, 153, 168, 69, 110, 10, -40, 243, 148, -55, -2, -120, 150, 50, -127, 138, -54, -66, 119, 81, 47, 42, -33, -98, -59, -125, -74, -173, -207, -204, 143, 146, -62, -31, -152, 298, -42, 69, 169, -205, 33, -70, 169, -10, 127, 5, 43, -226, 56, 131, 173, 165, 241, -187, 74, -99, 242, 122, -233, -67, -83, -399, 236, -73, -79, 77, 184, -103, -47, 147, 332, -262, 148, -15, 44, 140, -49, -77, 53, 116, -189, 50, 200, 64, -127, -91, 191, 115, -49, -224, -63, -108, -132, -7, -50, 117, 49, 264, 400, 0, 70, -142, -20, -24, -313, -59, -67, 63, -1, 108, 13, 236, 27, -104, -56, -40, 120, -293, -194, -213, 53, -112, 157, -179, -62, -31, 214, -192, 14, -115, 153, 48, -186, 78, 166, -159, -179, 184, 105, 105, 343, 217, 215, 98, 2, -10, -294, 70, 63, 59, -17, 82, -121]
7386a21K15j82P4J25J5k64J2m9J6m5J51jJ8ml3L7J00j94M8R8j85J62J9l10N3J59
7412h6Q9k7n6J09k42K78k81J82j68K78j84J43J67k69Q6k83M7J60M3J08l6r0q2
7435a14J93k51R5J12K3m5j23J38M2k10J09j1r5L2K53k12J42o4j82L41k07L0j53
7458a57j35N8J98lk26K72q7K25l26K75k77K01M3m6j1J87k64J30l58J08N2J29n
7481a7o4J81j70j05L58j02q1K02j33Q6j39k86O16j68j83Q2L3l61K04K95j14m04
7503b70L18j72J68j20J53p6j15J72l02J71M9m4k48K36JL3l7J38Q9k22Oj5J13p7
7527e1N0l76L80lj92J77K29%q5j83K08j49J79N5l61o7O3J3J89k10K48k60K04J57
7551B15j93J80n17M71k68J96j62N3K64l36K18j5k98J69j8M6M0k00J82r7J51Q8
$$ y = [-121, 94, -88, -14, 111, 126, -138, -126, -175, -159, -204, -53, -54, -36, -40, -73, -36, 64, -130, -82, 16, -169, -7, 12, -298, -245, -86, 3, -24, -80, 29, -213, 65, -216, -34, -202, 76, -108, 35, 202, -67, 19, -264, -217, -57, -14, 94, 58, -32, -114, 79, -172, -77, 35, 58, 13, -110, 28, 70, -140, -31, -42, -137, -105, 148, -64, 78, 14, -168, 173, -34, -4, -157, -292, -234, -36, -39, -265, 7, -80, 145, -181, 94, -183, 18, 61, 15, 4, 191, -73, 57, -301, -193, -141, -12, -17, -81, 100, -70, -175, 183, 81, 0, 202, 69, 155, 16, -270, 346, 178, -5, 77, 110, -251, -47, 248, 134, -270, 48, -124, 44, -76, 77, 1, -114, 58, -244, -73, -24, -68, -316, -80, -79, -46, -83, 55, 144, -78, -72, -87, 26, -51, -1, -377, 3, 0, -192, -15, 214, 214, 129, -54, 154, 5, 184, 239, -122, -189, -126, -113, 76, -134, 114, -146, 58, 215, 22, 202, -315, 156, -112, 84, -78, -25, 239, -97, 121, 106, -192, -23, -41, 5, 45, -155, 27, -70, 81, 169]
7573A69j69j22J90p5j70J40l4J32p9J88n6o9j32K14K10o07K79J27m6J15k25K69
7595B49k17j7L0k2k8k27K44K33m52K81k99L04j95j65L81k15P3l96M47j43j3K00
7617E3k92K43J77N3l73M2l1J13J39j67K07n23M55J29l9l22J24m9J0J22o0j50K64
7640A25q9j84J37o3K9K69k89o7lJ27MQ5j10M6k55J63m6J15K56k55n1j00K65kj77
7665g0J27m1J18jk78K99l08No8K56n8N7q4J4K2j14J00K05k39k73L08j19J7K98
7689A73k86K27j51p8k6L21j49J30L0m51K99j99J95k18J13k7K09r3K6l00K33j04
7711a26j3M0k69L00R8J91k21J8j96K87k57L01j57p0K4J2j54OK53pj17j28M55j85
7735H5p0R2K2k55K30l23K90k21k6J16j34L48m7k78J21P3j14J14K08k34p5k3P9
$$ y = [169, 0, -122, 68, -7, -177, -37, -71, 61, -18, 170, 114, 45, -87, 127, 337, -270, 9, 136, 90, 205, -20, 249, 32, 15, 45, 23, -5, -232, 12, 245, -207, 74, -225, 79, -116, -281, 100, -115, -42, -438, 9, -134, -147, 53, -239, 4, 181, 234, -139, -97, -128, -15, 124, -43, 164, -359, 96, 225, 186, -136, -12, -61, -51, 71, 11, -139, 125, 36, -148, -11, -74, -45, 224, -65, -132, -135, -8, -4, 81, -29, 17, -238, -75, -121, -6, 250, -5, -56, -156, 109, 107, -70, 57, 16, 134, 133, -145, 154, -154, -149, -217, 39, -19, 38, -46, -32, -10, -124, -24, 181, -58, -331, -23, -142, -125, 173, -113, 114, -37, -115, -141, 180, 31, 161, 191, -260, 39, -160, 35, -183, -70, -97, 112, 19, 45, -255, -22, -126, -139, -99, -368, -68, 30, 221, 0, 18, -178, 109, -148, 153, -4, -74, -50, -38, -192, -186, 67, 60, -57, -185, 270, 85, 15, 107, 129, -126, 104, -219, 71, -150, -176, -60, -194, 154, 107, -171, -50, 23, -91, 23, 231, -3, -78, -101, -22]
7758b2n0KJ8K34n7j66J46n5k19l8K93n3K31n89N22k10n8n0L7J83j78J53j6j16
7782e8j07K41n4M3j47K10j83K52j93o0k2m1M7J94l18K09m1K08k24J5J05k11J82
7805D7O6l2J10k76O4M4j46Q4m0n6R2j24L07J92l20l5J21l1Jl40K32L65j16m61
7829b52J85M0J07j43%K28m1j81q0L53k20L6j17m0N8l7J4K18l72M00k24K36l04
7852a36K00k61J28J41j03j09K87j52N3L3l35L54j90j7m2L29k47J19j87K61o6k30
7874a70L00l7p4qO1j79P5j94J92n9J39j48l9j10M77l11M7J23J91j90k18M4k8K11
7898I5J1rj86J26P5k8k74j41N49j31j46J06k20J69J08j92R1j72K6L29k58P0j87
7921a89J51r0L03m59K91k66K14J32j11N5k46O4J61K49r1j64o2MJ17j30J3k0O3
$$ y = [-22, -72, -70, -52, 182, 125, -41, 105, 50, -169, -207, 86, 33, 264, -325, 197, -13, -71, -121, -84, 99, -79, 74, 58, -58, -165, 76, 22, 65, -82, 128, -55, 197, 4, -56, -78, -119, -72, 122, -196, 13, -28, 180, -44, -29, 76, -135, 47, 113, 81, 191, -85, -21, 23, -123, -39, -79, -135, -43, -167, 140, 332, 12, -23, 98, 67, 68, -272, -40, 325, 209, -252, -67, -27, 80, -63, -63, 165, 124, -57, -137, 216, -4, 32, -85, -125, -67, -104, -90, 128, -244, 156, -68, 168, -136, 64, -197, -69, 72, -31, -140, 147, -5, 48, 81, -254, 100, -90, -107, -149, 180, -67, 52, -135, 126, 60, -170, 130, 93, 19, 11, 72, -107, -32, -226, -34, -93, 46, -102, -141, -251, 226, -85, -38, 85, 276, 86, -132, -88, -116, 95, 106, 97, -89, 37, 112, 84, -190, -331, 218, 87, -59, 47, -173, -4, 104, -88, 3, -169, -143, 186, -72, -2, -189, -38, -128, 175, -284, 7, -259, -45, 87, -24, 31, -215, -151, 10, 259, 168, 4, -58, -54, 63, -67, -54, -74, -11]
7944a1j15lL06l12J43l3J94j0K6N2q2k42K44Ol69J01j17L85m3p8p8nMO9O4l6L0
7971I0j77M7J5o8p8J57M2j01K77m41J62O9k88M43l8j14R7l26J53j5J23l7M2j64
7995a30N5n7K43j65R7j80J50K02k95K13n1k8J83j35j7j3J46l30K27k56J25K02
8017A86M9j90N8k58Q1K87m41K12o0k51K89j9Q4p2JK94j96NJ16k18L7J90l82L30
8041A32k59J17k09K10J52j81K33l23o1o9J98J15k65K16R4o3j08m1J67j40Q5p3
8063g3L09l39M10m68N0K13k9J03r8J38l51L4J37j1j88m2K39Pj55K54j52j27L87
8086B48m13P3O5q3J59l06L68l39L08K8j00J6J47j63J3o5M5L5O6R5k38O2j45l2
8110a56J73P6Q7j20J13k44J75o9K3k64J50K2r8M06p0Nj67k78K80k41L40J79m49
$$ y = [-11, -126, -129, 177, -135, 8, -25, 169, 159, 185, 237, 155, -87, 157, 163, -206, -105, -222, 163, 120, 42, -36, -41, -37, 32, 96, 60, 90, -87, -40, -25, -93, -171, -14, 28, -73, 204, -237, -75, -6, -294, 149, 111, -3, 94, -232, -79, -94, 29, -8, 34, -130, -75, -132, 111, -54, 43, -137, 13, 215, -80, 133, 82, 54, 237, 102, 85, 72, 218, -112, 115, -141, -16, 186, 235, 45, 103, -155, -74, 213, -228, -16, -76, -327, -38, -57, 27, -45, -44, 250, 54, 59, 175, -43, -6, 184, -198, 132, -127, -10, -219, -9, 143, -38, 195, -128, -189, -258, -60, 55, -210, 6, 100, 37, -71, -112, 55, -85, 0, -73, 236, -103, 307, -161, -111, 102, 73, 176, 78, 216, -135, -101, 36, 25, -163, -205, 34, 41, -114, 140, -12, -139, 248, -165, -92, -27, -110, 49, -257, 111, -228, 80, 108, 8, 24, 171, 8, 21, -44, 1, 36, 102, 197, -41, 21, -124, -156, 17, 93, 180, 60, 173, -71, 104, 35, 58, -206, -56, -34, -132, 274, 204, 209, 42, -236, 44, -197, 143, 322, -127]
8133a27J96j88M8K2j01J84J82j17J3l1KO2k36j27L60k1j59j58O7K50j09K4K10
8156B46j78j71o4p6J21K31M3k02J57j41j36j25L15PL52m22J29l07K00j0J03n0
8178B2j02K14l31K4R8J58j40j2k91K51J23k55l1
$$ y = [-127, 69, -119, -71, -49, -150, 34, 216, 99, 112, 81, 83, 145, -91, -218, 142, 121, -38, -196, -129, 121, 12, 36, 246, 68, -103, -167, -243, -122, 109, 152, -50, 107, -34, -170, -295, 20, 27, 379, -43, 86, -221, -21, -31, 72, 22, -80, 134, -197, -173, -75, 83, -57, -69, -360, -109, 14, -241, -272]
8191b72
$$ Imaginary data points
##PAGE= N=2
##DATA TABLE= (X++(I..I)), XYDATA
0@%%%%%%%%%%%%%%%%Nj3J6j6J6j6J9k7L2l2M0m8N3o1P1q2R1j03J16j30J46j62
38h5J81k03K25k50K77l05L37l74M13m54N01n52O07o69P37q12R00r99J109j238
58f54J388j566J781k046K386k834L453m367N852q650J5610o2676q9603J92462
72E0536M0739j31450K7676R0752p9060k2345J05079k7502j03208O7195O0541j01008
84b2055k8580R7555j8864q4100K9520L2843m5261J5760M1503n6743k8024Q0899
96A4453J4351o2337K1037M2683l7358j459N4637k3586m4398M5029K0455n2671
108i164Q313M3918l8204k7798M2993j2243m6259M2095K5982p4943r338Q3780j3198
121A5934o8701M2041M1890n6271K659O7413l6126n5615O5662L2811p7712K75P4706
$$ y = [0, 0, 0, 0, 0, 0, 0, 0, 0, 0, 0, 0, 0, 0, 0, 0, 0, 5, -8, 8, -8, 8, -8, 11, -16, 16, -16, 24, -24, 29, -32, 39, -43, 48, -55, 61, -69, 77, -85, 96, -107, 118, -132, 145, -160, 177, -197, 216, -238, 263, -289, 318, -351, 386, -426, 474, -525, 584, -654, 734, -832, 949, -1097, 1289, -1545, 1908, -2459, 3393, -5257, 10353, -52323, -141926, 50536, 91275, -40175, -12499, 78253, -807, -23152, 81927, 54425, -48783, 18412, 78953, -22055, -50635, 46920, 28056, -56044, -26524, 6319, -38942, -23182, 18321, -38422, -66446, 14453, 28804, -33533, -12496, 30187, -7171, -8630, 46007, 22421, -21977, 23052, 43507, -9164, -851, 43067, 4863, -22935, 20058, 7815, -38444, 3651, 29633, -45310, -54648, 29132, 15934, -52767, -10726, 31164, -25107, -22448, 44965, 8839, -46776, 18886, 51697, -26015, -25740, 48966]
134D8966l1276n5442N1995K3876n8630P617M5701l9514k5630N3114n348n5377
146c9948L2122M0999n2860j5170O0142j3197n0702L8469L1236n1497j782N3805
158C1617k3887l7508M8841J5749n8065J3199N3887l6471l9209M5517R896m7580
170b4014J4547L2390l9910j4306M9170j0061m4300L2334K8381m5186l291N0599
182B6353j4352l7450L3218K0476l7467P420L6463k8888k5526L9016M349m1476
194a7864J1716K6214l3413j2939L8105q160l5730K2468J9914l2165K901L6114
206A7161j8924k4041L6339J3084l5321J1716L5276k6856k1324L7702L050l9849
218a1987J2439K5347l3612j4365L6941r256l8820K2352K3311l5118m663L9497
$$ y = [48966, 17690, -37752, 14243, 38119, -20511, -12894, 32807, -6707, -32337, 20777, 15429, -39948, -7826, 33173, -19687, -34857, 25285, 12088, -38614, -145, 31091, -20406, -22188, 31617, 7730, -29778, 19063, 34812, -23253, -10054, 43833, 7362, -31847, 13670, 23566, -24014, -9467, 22923, -16987, -31293, 17877, 7816, -36484, -4150, 24231, -20955, -24246, 26353, 12001, -25449, 7769, 28245, -9222, -1802, 34661, 5773, -19753, 19263, 23612, -17864, -6148, 20066, -13347, -26286, 11819, 3659, -32071, -9603, 10311, -21854, -18953, 17161, -1763, -25804, 10535, 23619, -11702, 14, 35290, 8434, -12890, 24812, 27862, -11987, 452, 25799, -7813, -22178, 14763, 5507, -33313, -10961, 12350, -22768, -27431, 12066]
230A2066j3474l1133L1693K1750l2416J879L4223j7302j9609L4544O584l8358
242i553R252L0512k5195j9651K9771j176l4174J3186K1428k7058q674K8331j0692
255c693k4791K4219J5306k9604J390L0284j1849j7003K5125O576k5144J1763K2655
268B5234k2016j1363K7476m294k6347J5559J5247k7298m925K5843j1431k2615
280b0930K0983Q754k8342M764K5956j6669j6166K6653M078k6343J2429K3503k1113
293b443j0552K8581k361k4695J6298J6880k4222m385K5757j0503k2345J8792J0547
306A5349k7407L23K3573j5017j7826K1812N077k3781Q496K0502j7179r867K5140
319I195K79k1284J3904J6327j9968m054K3679p545k0009J5863R135k3043L19K0196
$$ y = [12066, -1408, -32541, -848, 20902, -11514, -9635, 24588, 7286, -12323, 22221, 28805, -9553, -301, 30211, 5016, -14635, 15136, 13960, -20214, -7028, 14400, -12658, -21332, 6999, -3693, -28484, -4265, 11041, -18563, -17173, 13111, 1262, -15741, 9384, 15960, -9184, 2579, 25234, 3218, -8145, 19331, 15037, -11310, 4249, 19496, -7802, -12727, 13116, 1685, -20930, 53, 8807, -19535, -14771, 11185, -5484, -21650, 5003, 9081, -17262, -4833, 18670, -2443, -12995, 15586, 13225, -11470, 4828, 21708, -2514, -6899, 18858, 8355, -13990, 4802, 15349, -12058, -11735, 11838, -3179, -21005, 807, 5884, -17897, -9401, 11101, -6078, -15945, 9195, 9474, -11810, 2094, 18421, -1547, -5601, 18078, 10533, -9476, 6387, 15522, -7521, -7202, 12994]
333A2994j4237j6081J9544L704k2967P689J8182j6700q542K3277r31k0654J4069
346f53J6093j8738k552K2790q240j7350J7697Q958k3441R32J9620j4032j5191
359a4107J8805J471k3016P435J7044j7525q064K1946k073j8330J4632J4588j8117
372e311j688K2702p173j5702J7505P790k1179K378J8025j3758j3746J7288R24
385H055k2003P135J5261j7553r074K0868k003j9074J2658J3508j7128j094K1438
398A0994o945j4995J7802R880k0111K188J9773j1202j3070J6828J808k0705O849
411i06J4554j7816r952J9177k703j9663J0505J2326j7685k839K0066o601j4312
424a5849J7220R063j9038L043K1081r845j2834J7087L833j7700O845J4491j6500
$$ y = [12994, -1243, -17324, 2220, 5924, -17043, -9354, 8828, -7872, -16414, 6863, 5932, -14722, -653, 15440, -3298, -5850, 16940, 8700, -8650, 9047, 18005, -5436, -4504, 15116, 1084, -14107, 4698, 6169, -16847, -9412, 7632, -9893, -17957, 3989, 1916, -16414, -1782, 12806, -5311, -6999, 15703, 8530, -7172, 10333, 18123, -3056, -678, 17347, 3589, -10157, 7131, 8055, -13948, -6813, 8448, -9105, -18179, 2689, 686, -18388, -5730, 7778, -9350, -10444, 10994, 4049, -10946, 6856, 16736, -3375, -1187, 18586, 7384, -5686, 11142, 12950, -7755, -906, 13648, -4168, -14120, 5057, 2354, -17309, -6804, 5522, -12163, -15002, 5064, -1537, -15849, 1371, 10434, -8604, -5561, 15520, 5675, -7159, 9928, 13761, -3939, 2906, 17397, 897]
437H97q995J9432k480k0502R732J1493j8001l927J8280q027j6347J5807Q849j9659
451a3448K067K0112r776j2390J8717N858j7852O678J6409j3715p921J9472j459
464A2752j9176R864J1215j8060m839J7980q129j6649J4130P083j9939J584J8940
477F756j0942j2648J8519N328j8914O520J8535j2333r449J8952J251j7191Q690
490C074J2287j5963m321J7537o649j7329J2229Q958j7584j784J5200r171j1421
503a4937J6412L708j9413O609J8688j2611j0720J8660M142j6906P105J3512j4234
516A5m788J7157m414j7237J1284R596j7942l220J6392p486j2534J3962L503j7911
530a3623O132J8212j3051j1493J8815M678j7008O685J4038j3798n894J8261k606
$$ y = [897, -8098, 11334, 8854, -11648, -1916, 9577, -8424, -12351, 5929, -2098, -18445, -2638, 6211, -13448, -11381, 8731, -1045, -13435, 5282, 11140, -6712, -34, 16375, 2660, -5261, 14211, 12752, -6424, 3440, 14655, -3405, -8244, 9736, 1607, -15042, -912, 6171, -13768, -12184, 6756, -4186, -16834, 1685, 7013, -11901, -5381, 13154, 821, -8628, 10324, 11575, -5616, 3074, 15361, -602, -4923, 12614, 5965, -11364, 865, 9823, -7761, -9545, 5655, -3516, -14937, 1475, 5183, -14230, -7621, 11067, -1544, -12264, 6396, 10538, -6368, 737, 14249, 15, -4773, 12384, 7970, -9267, 2017, 11613, -6329, -9549, 6843, -643, -13177, 785, 4288, -13623, -7491, 10721, -2330, -13823, 4992, 9670, -7338, -653, 13385, -413, -6307, 11954, 9348]
543I348j8100J0272J1860j6326n059J5248n261j2288J0276M055j5308L985J4532
556G234j2053r641J7480L176j6177O724J3495j1839m418J7259k794j5765J1439
569D120J1076j6341l961J6526n228j5330J0720O021j5614Q90J3984j0546j0735
582a4418J5272K777j6149O058J3486j1835n608J7728q79j5599R368J2904j2865
595B40m255J6081l823j4000J0773Q296j5868j993J3664o996j2329J1196L897j4848
609i965J956J1114q795o350J3418n08j3002Q448J1896j1364l422J5152k075j1051
623d548J0140P601j4101k49J3686o764j1549J0079M173j4917J413J1413r522q439
637a1584J2350O79j3797N929J1375j0691m235J4023j225j1305J0095Q436j1910
$$ y = [9348, -8752, 1520, 13380, -2946, -8005, 7243, 1982, -10306, -30, 4025, -11283, -7298, 7234, -4819, -14460, 3020, 6196, -9981, -3257, 10238, -1601, -6019, 11240, 8446, -7319, 4120, 15196, -1145, -5106, 11420, 6192, -9138, 1582, 7603, -8011, -7121, 6863, -3683, -14418, 854, 3631, -12518, -6460, 7026, -4809, -10417, 7311, 6432, -9167, 201, 13105, 240, -4015, 12066, 8243, -5757, 5016, 13312, -2556, -4549, 9115, 2119, -10210, 986, 4883, -9965, -8009, 3105, -5690, -12040, 1378, 870, -12132, -3684, 8212, -3152, -6574, 8578, 6503, -4548, 5592, 13193, -908, -1157, 12529, 5765, -5784, 4295, 8468, -6449, -5036, 6377, -3145, -11584, 766, 1445, -12352, -6423, 4952, -5739, -9974, 4049, 2824, -8481, 1614, 10050, -1860]
650a860r61J4219m636j1381J0224N638j3341j16J1170p898q522R915J019j3040
664i570M013R822r882n139J2076N70j0671O339Q450r045q95J1892l802r054R418
679D522M681j1284Q75J0662p021q551R539K120j1424K581Q156q355m519J0619
693B601j187j0663O287Q158q799k457J1079k716q225Q403N523j0070K28R995n240
708B917o965Q708J940j0823K005Q272p291n599Q850m59r923N098P074q238k464
723f898R645j698p082P084N234r118Q49R783m194o935P740K788r250J779P370
738G097o953m546P587q78q998M444O097q637k917Q877j417p628O394M562p792
753d708R54Q717l452n058P889K399q011K258P741n771m812P196k65q374L653M463
$$ y = [-1860, -2821, 11398, 6762, -4619, 5605, 11243, -2098, -2214, 8956, 1058, -7464, 2451, 3470, -9570, -5557, 4265, -5617, -10756, 1320, 1890, -8781, -2442, 6008, -3037, -3932, 7960, 4158, -4896, 4522, 9203, -2081, -1206, 9456, 2435, -6116, 3423, 5543, -5881, -3300, 4856, -3499, -8018, 2601, 1414, -9249, -2962, 5196, -3603, -6060, 5019, 2303, -5922, 2481, 8004, -2066, -1838, 8157, 2917, -4048, 4660, 6600, -4223, -2218, 6054, -1237, -6836, 2014, 1555, -8368, -3270, 3804, -4434, -6898, 2747, 1049, -6033, 1051, 6285, -2833, -1984, 7799, 3605, -3330, 4410, 7198, -2052, -273, 7097, 144, -4402, 3185, 2307, -6691, -2247, 3850, -4787, -7704, 1173, -244, -7872, -1478, 3084, -4708, -3754, 4963, 1511, -3547, 4342, 6741, -1270, 988, 8729, 2958, -1854, 5342, 5077, -3297, 356, 4819]
769D819q083k515O976k310o938N211L229o859O67P980l630n016P420K905o003
784b147K642O437m647l381P860j51p247L289M385o789k494O444k452p218M043
799a426K920p012j04N743l587m466O455K299o391K437O686l992k045P282K49o012
815i64L913M581n679j874O483k457o304M018K385p277m49N795m034m989N532J423
831A03o642K239N850m366k063O700K97n588M136M825n452o19O418k104n301M593
847C026K542o129j07N043m078m646N650N44o816J873M827m788j961N664o33n064
863e053M122M729n394o37O411j417m699M820K289o213P88N394l788m178N047Q1
879B302n943K010M455n158k268N546r31m866L768L648n462o44O861j885m447M790
$$ y = [4819, -3264, -5779, 1197, -1113, -8051, -2840, 389, -6470, -5803, 2177, -1453, -6469, 951, 3856, -2147, 495, 6932, 2285, -1096, 6764, 6613, -634, 2655, 7040, 251, -2243, 4201, 1749, -5469, -1426, 1494, -5518, -5622, 121, -3466, -7932, -1477, 822, -5569, -3132, 3554, -438, -2483, 4799, 5048, -964, 2949, 7530, 1851, -23, 6460, 4003, -2301, 1717, 4102, -3175, -3624, 2171, -1863, -6852, -1320, 103, -6539, -4300, 1550, -2816, -4879, 1821, 2118, -3470, 666, 5491, 39, -580, 5838, 3734, -1567, 3026, 5568, -561, -668, 4375, 297, -4349, 1301, 1845, -4971, -3098, 1729, -3059, -5020, 644, 11, -5053, -931, 3798, -1596, -2233, 4178, 2761, -1938, 2882, 5171, -1042, -254, 5140, 1352, -2826, 2221, 2302, -3641, -1631, 2824, -2334, -4602, 944, 13, -4853, -1085, 2563, -2899, -3543, 3318, 1433, -3014, 1776]
895A776K771n704J236N517l980l683N271O31o400J952L900m897k457N385j406
910h8n544L691L470n412m12O033j681m434N558K660n083J037N964l520l413N699
926D525M46o035J996M235n769k532N498j438n995L294L098o227l63O100k643m116
942e926N408K385n516J626O338l610l339O632J214n840K459M727n058k021N482
957D961j550o153K876K905n640j665N089l070m358M793J929n599J358N863l288
972a549l145O144J942n564K854N240m332k132O128q99n607L096L415o001j579
987a989N181k503m969L956J279o019J008N463l649m287O095J643n631K316N456
1002C350m105k127O936k53n637L454M784n319j800N659j875n382L689K174o294
$$ y = [1776, 4547, -1157, 79, 5596, 1616, -2067, 3204, 3835, -2565, -613, 3287, -1610, -4067, 1318, -88, -5632, -1941, 1529, -3883, -4295, 1738, 57, -4377, 1181, 3841, -1242, -205, 5759, 2239, -1174, 4525, 4971, -1064, 932, 5167, -602, -3134, 2364, 926, -5069, -1775, 1323, -4904, -5267, 833, -1810, -5926, -518, 1867, -3649, -2023, 4315, 705, -2634, 3998, 5212, -628, 1831, 6558, 1500, -521, 4961, 3411, -2742, 134, 3039, -2601, -4266, 823, -2247, -6605, -1812, 117, -5482, -4124, 1739, -1549, -4694, 1450, 3392, -2172, 682, 5922, 1590, -542, 5586, 4687, -920, 2176, 5591, -410, -1989, 3192, 689, -4280, -324, 955, -5064, -4056, 1407, -2242, -6529, -434, 1209, -4422, -2106, 3350, -755, -2882, 4054, 3801, -1836, 1618, 6402, 1083, -717, 4942, 3067, -2315, 1374, 3548, -2746]
1017b746m6M915l327m099M565J505n814J701N665m243k613O381J03n140L502M785
1033E094n141j805O329j376m911L844K982o034p07N508l159m620M297J384n442
1048c757J009M447l782k954N947K21n290K729M779m476j230O242j072n074L936
1063A675L485n593o20N602k972m522M096J317n484M01M457l566l049N141K02n047
1079d477K412M767l982j638N388l28m417L372L656n318l40N585k147m863M281
1094A951J785n547p9M696l708l680M853P95n740J388N113m082j949N361j43m376
1110c362L467M013m482q41O055j846m153L820K601n432n18M684k862m028L583
1125F99Q93n556Q76M473l761k843M626N00m175K722L617m067n45N329o52l704
$$ y = [-2746, -2792, 2123, -1204, -5303, -738, 767, -5047, -3346, 2319, -1924, -4537, 1844, 1947, -3193, 309, 5094, -47, -1852, 4477, 3101, -1810, 2034, 5016, -1018, -1725, 3783, 624, -3996, 301, 1685, -3757, -2748, 1699, -2083, -5037, 910, 1131, -4159, -1430, 3349, -1127, -2357, 3885, 2813, -2261, 1675, 5160, -433, -1053, 4549, 1577, -2945, 1151, 2468, -3016, -2615, 1842, -1724, -4773, 368, 570, -4477, -2065, 2702, -1280, -2918, 2470, 2142, -2275, 1097, 4753, -565, -905, 4680, 2533, -2330, 1951, 3736, -1811, -1890, 2806, -902, -4582, 271, 1066, -4674, -3286, 1827, -2255, -4204, 1157, 1014, -3362, 105, 4118, -364, -1205, 4850, 3004, -1149, 2671, 5272, -160, -678, 4006, 1144, -2884, 699, 1592, -3964, -3088, 1385, -2376, -5219, -593, -93, -4268, -1546, 2071, -1996, -2541, 2788, 2136, -1568]
1141a568L463K583m324L80M592k829l416L689J076n320Q00L640m045k693M132
1156A60J12n156K135L384l713j230M906o44l733L939K740l531o0M520j405k992
1172e68L528J407m566N91L784l119k826L650n9m697J135L325l721j877M077o13
1188e49l915K614L059l526l05M438j001l138L693K096l744O12L629k110k533L638
1204B958J13m207O28L145l143k116L450o29l660J967K136l293p60M029q56k730
1220b968L067J921l392Q07L671j884k040K917P13l322J166K600l003j620L054
1235A687q33l234J735J730l202p11L620j121k881K772J686l323P83L278j316k199
1251a529L464O77l177Q59K821k227j490K522l06l095R01J975k734q07K435q59
$$ y = [-1568, 1895, 4478, 154, 534, 5126, 2297, -1119, 2570, 3646, -1674, -874, 2766, -1279, -3972, 160, 272, -4884, -2749, 635, -3078, -4308, 598, -46, -3779, 160, 2900, -631, -691, 3829, 2424, -568, 2960, 4367, -199, 392, 4176, 1057, -1769, 1881, 1822, -2875, -1740, 1585, -2136, -4013, 64, -549, -4464, -1850, 1209, -2317, -2622, 1816, 815, -2323, 1370, 3466, -278, 334, 3963, 1853, -680, 2958, 3071, -1136, -508, 2637, -506, -2622, 828, 199, -3461, -1494, 642, -2651, -3411, 618, -238, -2968, 99, 2020, -1372, -565, 3106, 1222, -818, 2099, 2812, -510, 656, 3256, 253, -1367, 1687, 854, -2380, -645, 1085, -2117, -2828, 792, -329, -3210, -438, 1248, -2075, -1292, 1986, 670, -1529, 1935, 2612, -565, 294, 3115, 888, -602, 1920, 1614, -1481, -580, 1395, -1339, -2146, 289, -570]
1267e70k662J947J779k701K23L111r69j659K879P76k334P74K281j994r72K383
1283B292j17k665J243J437k785j092K724j332k125J383Q40k541K67K541j381j333
1299b644K536R76k042R68K271j583n22K773k69k354J667J570k621m55J831j181
1315I21k361J712O78k905j2J633j482j565K459M14k391J279K388j646o99K850
1331A273n9j775J948J278j578l39K054r28j846J713P06k831j37J818j646j808
1347b157J622K55k794R05J582j641l14K283l12j547J916J477j714L97K231o09
1363A580j283J860P09k271K66J448j628j266J698m29k503Q91J235k009o44J810
1379e36l73j881J750J210j609K04K491q05j288K474P4j861Q23K149j508j352K024
$$ y = [-570, -3232, -1285, 494, -2207, -1984, 1127, 158, -1501, 1378, 2154, -180, 594, 2875, 881, -91, 2292, 2175, -490, 753, 2190, -595, -1687, 1037, -295, -2420, -1037, -197, -2738, -2471, 70, -1311, -2644, -108, 868, -1174, -206, 2065, 482, -40, 2733, 2464, 110, 1777, 3347, 726, 271, 2102, 921, -1440, 272, 950, -1955, -1967, -334, -1816, -3381, -922, -508, -2899, -1620, 768, -878, -1577, 1273, 1214, -561, 1387, 2665, 1087, 748, 2802, 1874, 28, 1741, 2447, -384, -521, 1297, -349, -2157, -535, -280, -3074, -2169, -587, -2228, -2542, -259, -571, -2118, -202, 1275, -439, -42, 2189, 1580, 297, 2157, 2866, 595, 861, 2309, 681, -585, 1113, 684, -1819, -928, 307, -1702, -2346, -536, -909, -2790, -1040, 170, -1439, -1235, 1256, 451, -837, 1637, 1711, -150, 673, 2822, 1314, -38, 1986]
1396A986k71k349J040Q54k144n85J957q56j871J429Q94k201N28J963p86j455K265
1413C98J254k336Q61K094j515j066K134K0k498J237J777k616r31K241p96k125
1429a867J338J167k454K3K327j448r76J987M91k017Q33K511j664q26K099o0j766
1446c02J382J278k113m59J986r74k270J509P75k242j26K222j955j491K326L60
1462i4j849O34K237j609m69K705j92k069J513J829j963n89K540r89k102J496P45
1479A774k639j32J989j538j867J904O97k533L54K301j630r37K456K08k023J475
1495a41K331k101k33K424m99j830J724J148k533l51K264j586j854J493O30k750
1511a864J17K120j890j254K643m62k046J478J845j635l81K770o38j560J774J881
$$ y = [1986, 1715, -634, 406, 1260, -884, -1469, 488, -368, -2239, -810, 84, -2117, -1589, 374, -412, -1867, 398, 1652, -684, 177, 2271, 756, -310, 1824, 1844, -654, 583, 2360, -256, -1187, 1054, 258, -1867, -529, 638, -1816, -1793, 534, -914, -1890, 97, 588, -1429, -596, 1915, 251, -575, 1524, 1464, -302, 1080, 2358, 245, -214, 1772, 798, -1472, 37, 812, -1430, -1556, 666, -1289, -2780, -454, -94, -1943, -1309, 928, -681, -1150, 1555, 1363, -706, 807, 2636, 673, 84, 2624, 1635, -467, 1029, 1774, -865, -997, 992, -546, -2413, -509, 188, -2345, -1991, 310, -1320, -2257, 199, 407, -1616, -141, 2190, 89, -144, 2280, 1781, -49, 1675, 2823, 290, -61, 2203, 617, -1237, 256, 886, -1864, -1747, 373, -1517, -2771, -128, -590, -2636, -1158, 687, -948, -1329, 1441, 803, -757, 1017, 2898]
1527B898k338k29K418j062j924J602P33k934L56J839j805j659J880K27k458R78
1543a478J757k026p20K555j4k080J762J629j891j91K948q90j718J875Q78k287
1559A09Q3J960j426k110K198R0k621P25J738k074j240K456o9k405J913J621j877
1576i29n46K727n69j673J737J198k339J21K615j354j346J452N50k326J72J918
1592A408j951j112J916K08k153P72J745k174n49K167j39j490J328J533j775l74
1608f40K619j174j547J981R08k629J18K084j734j077J719k16k237J074J432j962
1624a281o05K230k90j805J384J407j838J13K152n99j388J605Q23k195K33J979
1640A925j212j600J826M6j791n5J624j502j228J718m7j780R37J753k168m3K312
$$ y = [2898, 560, 331, 2749, 1687, -237, 1365, 2098, -836, -480, 1359, -446, -2105, -225, 2, -2456, -1478, 279, -1747, -2467, 88, 74, -2006, -244, 1385, -506, -697, 2251, 1361, -357, 1518, 2396, 109, 192, 2152, 726, -1384, 814, 904, -1717, -992, 746, -1328, -2568, -112, -181, -2586, -673, 948, -929, -1475, 1252, 683, -990, 747, 1945, -394, -273, 2342, 988, -358, 1094, 1644, -682, -510, 1408, -543, -1655, 261, 469, -1684, -912, 833, -1341, -1890, 277, 138, -1352, -24, 1509, -266, -640, 1979, 805, -742, 1239, 2147, -482, -364, 1720, -14, -1091, 628, 412, -1825, -751, 681, -1281, -1886, 344, 54, -1751, -367, 1040, -798, -685, 1467, 868, -520, 1085, 1908, -287, -54, 1925, 713, -887, 939, 985, -806, -861, 763, -739, -1967, -249, -296, -2076, -1139, 614, -1554, -1597, 715]
1657G15k80j551J635J237j512O8J738r68j079J555M38k214M19J210j517j326J772
1674C40m33j717O49J342j678n47J953m07j167J421R94j525J33J912n38q72J537
1691A397K36j135R0J620j477p63J055N2j833N46R08j512r19J662l89j707R37J101
1709a31j321K13J313k33j049J546R70j387L57J440n97r51J310K60j590O72O73
1726A495j240r31J034k55j336Q30L84j427j20J366n09q20J292M60j078L82J327
1743H54p23o49J405M12j109M84J307j463o28J312k66j292N29M30j301k29J127
1760B00n24j370R84Q84j295J01J252m49n71J286M5r44P83R90p53m54R03k38r83
1779a53L11P20j205N7N65n66o21L50M92j055J63R64n67o23R78M40r78Q16O73o57
$$ y = [715, 435, -1116, 519, 1756, 244, 312, 2050, 1082, 3, 1558, 1996, -218, 201, 1411, -106, -1432, 340, -93, -1810, -1161, 181, -1497, -2044, -91, -498, -1665, -244, 750, -775, -642, 1270, 732, -140, 1397, 1633, 498, 588, 2208, 731, -32, 1023, 1075, -758, -212, 696, -816, -1735, -73, -462, -2169, -1232, -131, -1452, -1239, 74, -159, -1208, 338, 1308, -79, 278, 1718, 1121, 170, 1480, 1740, 150, 822, 1495, 255, -676, 358, 103, -1233, -403, -19, -1446, -1566, -200, -709, -1529, -237, 223, -855, -473, 854, 131, -518, 887, 1299, 190, 674, 1981, 518, -110, 1202, 936, -356, 173, 603, -698, -927, 200, -324, -1694, -710, 174, -1121, -1020, 232, -217, -788, 498, 543, -401, 382, 1372, 619, 165, 1068, 830, -153, 158, 878, -327, -270, 295, -271, -892, -542, -50, -1105, -942, 22, -545, -1168, -190, 250, -728, 88, 761, 104]
1799A04k09J289O1j237N74M39j002K02M41n62q15N79J56r43J37N60n04l12P28
1818c14K00q78O56P07n14j77J199j16n59O85M51p86m26J060n77r44O73m1p40n
1838d46P05r78m36N29J23q59N36P52o60P0P62n3l15O33N18p02K94Q95o12k45P10
1859A221Q5r54o7N40p37p01O23j71j041L17K54l17l86R18m7o79R67J87p5J25N88
1880F50l97r5Q38J32q31L22P05p17n19R32o57o58M04J37q44m56O61n30j75M14
1900f84J03n76J94R46o38Q6P45J55l31N03O59n67k12Q65l08r19P39R4r34j2O14
1921E22p48p51M21K25p92K45L94j80l70R48k21k56O62O13q05K70O21K27r31M56
1941E50N48q47j14O34m37p98R33l34q96R8Q40o71m70P60J41q37M82M55n90L62
$$ y = [104, -105, 1184, 1245, 8, 582, 1021, 19, 221, 662, 100, -715, -136, 20, -923, -786, -226, -730, -1042, -314, -114, -992, -336, 371, -143, -320, 879, 763, 204, 889, 1340, 554, 128, 1188, 611, -333, 340, 299, -441, -446, 259, -719, -1155, -626, -503, -1362, -826, -74, -734, -664, 98, 45, -270, 363, 881, 179, 473, 1368, 756, 511, 1221, 1306, 352, 285, 825, 88, -613, 10, -161, -1202, -885, -631, -948, -1334, -416, -463, -1142, -175, 12, -63, 62, 650, 253, 158, 996, 1128, 297, 619, 1324, 607, 88, 1020, 363, -295, 109, 246, -598, -1054, -393, -923, -1098, -684, -581, -1157, -963, -17, -655, -569, 176, 331, 0, 503, 1162, 595, 383, 1248, 940, 21, 760, 854, -80, -92, 522, -226, -977, -556, -331, -1123, -878, -484, -664, -1034, -86, -307, -563, 99, 712, -93, 177, 798, 1025, 94, 550, 1098, 251, 137, 771, 334, -464, 469, 135, -761, -663, 177, -494, -964, -204, -63, -900, -418, 37, -553, -191]
1961a91R01j33p09N55N43r60N10P10q89m95Q96j74j008K00R47j015r00J336n70
1980d46n25L58P81q08k05J116k39o87J030K85o21J42Q27m30o43O00N87q67l91
1999a36Q03o86m31P91k76r83L14L21o03j90J123r4j110J036O47j006M06R88l42
2018E72o42R11K99r38J43P19l80j015Q27J68j297L38K77o34m70P17kr91O13Q33
2038D8o98L2R57k18l77P87R4n31L67R53l11p49O36M1j237M61M26p38p01Q03R1
2059A36j066L89N46j070l40J299m99n48P90N63l58k50J122l57o14J095N11q35
2077E14L6Q01p08o60O62J27j126K70L93j057k13R55m02r26O92N53r22r7J249k40
2097i9p20R97N18p81K36P20m81j23P00r9r97K88P80j207r4Q25k92q20L01M06p70
$$ y = [-191, 710, 577, -132, 423, 966, 6, 516, 1226, 337, -158, 738, 564, -444, -244, 703, -312, -1212, 124, -446, -971, -613, 168, -640, -845, 271, 32, -655, 375, 660, 39, 181, 1008, 578, -65, 535, 1122, 255, -136, 667, -19, -450, 341, 65, -918, -604, -283, -886, -1076, 47, -47, -1157, -121, 526, -480, -74, 914, 572, -70, 841, 1140, 202, 345, 1064, 684, -331, 496, 664, -633, -295, -18, -652, -1122, -405, -407, -1398, -785, 48, -650, -618, 339, 121, -256, 531, 625, 94, 461, 1414, 1103, 354, 990, 1031, -206, 255, 681, -57, -758, 45, 136, -930, -541, 5, -1065, -1405, -106, -605, -1153, -363, 200, -158, -408, 714, 357, -257, 838, 1349, 514, 550, 1351, 643, -17, 645, 772, -354, -84, 309, -748, -961, -6, -408, -1334, -642, -89, -1011, -1108, 141, -99, -819, 178, 696, -85, 151, 871, 390, 267, 967, 868, -129, 159, 939, -268, -362, 463, 171, -649, -348, 58, -712]
2118g12q2P31m23m70O40Q12j002J46R52j19o61J025J24j113M30O10n86n59P17
2137D60J33j137L23O00p53l19N99q9q77O73O16p88j14J069k97p20P70L96q88L98
2157E5P31k39n87O74K30r29K18O02p60o53P51R1r31L51N26o68l21Q18o7o57N00
2178b65P56p15K73O41k77o75J018j29k90J31L21o12k19N77k59q38L8M39o98PO06
2199a70j48q79R07J28o40P1J051j18m43O99L72q26L68O95l93n46O79k1p20j57
2219i1O05o32m34L75m7n50K36K63o53J87M50j21j11N31M40o68K05R05l54q7J15
2240E64N44p04J27N40o48l66M64o5q74L02M33o17k46K69o8m69K00L34m45L16P47
2261C38k98k32O15J02n24J97O73n24L1L55K32q33K10L05o45l34K65j96l73M14
$$ y = [-712, -794, -63, -486, -956, -316, 496, -506, -360, 592, 473, -188, 837, 961, -152, 278, 888, 302, -257, 460, 593, -544, -221, 379, -374, -693, -94, -183, -1060, -387, 229, -559, -673, 396, 99, -621, 149, 545, -343, 55, 786, 547, -40, 634, 864, -65, 153, 755, -5, -658, 93, 184, -747, -396, 130, -538, -859, -41, -108, -765, -265, 491, -224, 49, 690, 413, -262, 756, 627, 337, 468, 789, 177, -42, 535, 276, -562, -524, -85, -783, -776, -170, -318, -1197, -290, -162, -802, -731, 320, 202, -241, 458, 830, 4, 372, 1067, 674, 128, 807, 786, 66, -91, 514, -118, -552, -177, -224, -774, -538, -275, -928, -741, -291, -412, -523, 8, 448, -220, -15, 890, 536, 449, 564, 1108, 404, 531, 1071, 423, 57, 521, 456, -418, -116, 317, -300, -546, -277, -345, -814, -614, -280, -725, -409, 338, 40, -192, 423, 525, 1, 198, 871, 347, 378, 733, 965, 132, 342, 647, 2, -332, -67, -263, -636, -222]
2281b22n3m70KM88K2k62L15J69l68K37P34n42j92J028m34k38M31m5l99r7J90r4
2303B00l57M70l20o37J0M05j15k53N11k68n9J7N77k50k19M78K37o23O75R7n59
2324A7L96l3J28n31K39l6l85k28K73l2j77J58N5m67K91J61l5k24M43j4k91N17
2346B25l1J85k55M60m21J60J26k49j56N8K60m42l59L57n5m25J16M6J00o4J80J3
2368a71l04L03J63OK33L85k90o9J84k9J5N5m2k26m27M62k14l73O9J05n32K25J92
2391b80j89J81j63L55l01J08J69L0J85K46Mr2P2K97j33j59L73j38j92l26K40l81
2413i4k11J31l01j06N9K7k26L49M47m38j1R6J94L0K72L20k95p2N37j57k65M07
2435F93o1m12k8J81l34m30M78n6o12J72L07p25P8K88n4n4L92K15m31J94N26j96
$$ y = [-222, -275, -745, -743, -255, -233, -495, -180, -11, -379, -142, 592, 50, -142, 886, 452, 214, 645, 600, 201, 104, 294, 200, -157, 313, -7, -644, -634, -229, -344, -597, -86, -354, -413, -396, 181, -69, -288, 190, 427, -196, 479, 576, 17, 413, 380, 508, -23, 216, 180, -205, -433, -160, -192, -369, -211, -156, -623, -332, -171, -206, -430, 13, -1, -292, 225, 194, 379, 124, 584, 163, 323, 449, 200, 44, 102, 362, -80, -439, -82, -137, -562, -446, -400, -300, -364, -184, -171, -475, -172, -9, -3, 230, 615, 325, 256, 440, 411, 426, 481, 439, 213, -214, 248, 34, -339, -270, -165, -697, -472, -280, -469, -288, -451, -96, -397, -289, -120, -90, 95, 341, 345, 253, 325, 622, 489, 330, 703, 565, 373, 47, 287, -94, -305, -174, -475, -581, -522, -495, -721, -372, 75, -363, -374, -278, -84, -54, 218, 538, 243, 171, 708, 551, 286, 693, 632, 220, 192, 373, 39, -391, 87, 31, -581, -409, -102, -827, -749, -461, -515, -569, -177, 38, -393, -199, 327, 131]
2457A31k80P29J35m94Q7L17l31j65N9%n0k00J34m28q3M46j06m95K01L05n03L4
2479e57O39j15j71N54j70l31K27M51o5m33M53o0k50J31J86l02l69K72j82l27K97
2500a22l7l46N8K76P3k35N09j77k3q4Q30q35L21L75J02o27j8L48k65p7L68j74
2522B40l23Ok5j32l60M60l18r7L03K46k81K7K47J46j63K51J29j46J00J69k54m39
2544b14P15j71l46J88P6n73J10L38l84l51K20L56m72m8N93k64k41N66L61o17J19
2565c9M90M4m50K87K21l60M9K26l73k27M41o9n89L0%l51J67L39j74k54J15L35
2587a42k79K99K27j13p3N58pl37mM76k10k53M30jm49q3M16p89Q3J41q1n01K39
2610d53L34m21L2L50j85O4O6L19m54M20N17n27m1N27L5l33J65J98o19r5O39k47
$$ y = [131, -149, 580, 715, 221, 308, 625, 294, 129, 188, 188, 138, -62, 72, -356, -439, 7, -99, -594, -393, -88, -591, -557, 82, -33, -204, 350, 180, -151, 76, 527, 462, 29, 482, 422, 172, 303, 489, 187, -182, 90, -92, -419, -122, -159, -505, -447, -171, -98, -333, 176, -1, -24, -108, 722, -113, 208, 583, 685, 58, 40, 388, 123, 46, 414, 240, -83, -77, -102, -234, -594, -134, -452, -549, -246, 0, -281, -254, -7, 139, -24, 227, 356, 210, 310, 479, 225, -214, 501, 330, -16, 172, 248, -325, -215, 123, -261, -612, -392, -36, -508, -556, 37, -227, -468, 98, 459, -158, -39, 451, 495, 45, 332, 553, 193, 242, 468, 95, -132, 309, 240, -349, -319, -319, -670, -503, -164, -338, -592, -477, -142, -421, -122, 105, -8, -81, 477, 470, 133, 129, 605, 395, 142, 572, 571, 122, 39, 455, -334, -251, -110, -191, -692, -453, -119, -540, -508, -158, -343, -279, -213, 106, -348, 72, 589, 62, 21, 548, 583, 250, 415, 613, -6, -101, 538, 291]
2632B91l65l4L54n91j36M34l12l26M70N2l26nO21j32k37O01l30J5K18L59o11J40
2654A50K88l9o58N66J94n41k23L18R9l45j56J59l51r2O12k25k0K07M30n55L78
2675A96or6j26L57J16m24K1L86j33j27J38n7m34K30K11n06o9J76Pl88L34P3q6
2698b07N9L53j97l5J87L08n37L27K85k58n69O89j01j81r6K69m56q8K69m0m11j13
2720e43M81m26L03K63j95j05J93M7j66N43L8j6j96M29k79l59Q5L12l33j37Q9n0
2742b2l21M83l75j69P5Q5K7k45M38l0j92O0N50k38l1K72J28k49R8K90m95K34Q0
2765D53j95k90j91L96m51j04N4J10j78j1K29j65j21L13j87j3L65J74k34R8mL03
2787C51j47K81m5l59K30O7l51k79K04qm31M92k95jk35L57l18J69p1K38m0k68L75
$$ y = [291, -74, -108, 246, -345, -481, -47, -359, -685, -215, -163, -489, -494, 127, -5, -242, 359, 29, 44, 262, 621, 10, 150, 438, 399, -259, 307, 501, -40, -263, 55, 154, -191, -347, -188, -539, -631, -19, -244, -264, -57, 373, -182, 196, 190, 94, -32, 325, 441, 17, 38, 424, 291, 164, 302, 245, -189, 41, 252, -254, -323, -147, -140, -528, -194, -121, -207, -148, 205, 8, -27, 160, 468, -69, 258, 543, 285, -284, 405, 304, 123, 27, 296, -160, -248, 21, -19, -430, -543, -62, -488, -185, 78, -117, -222, -29, 18, -148, 395, 433, 417, 221, 650, 371, 12, 97, 409, 76, -61, 28, -22, -343, 140, -235, -404, -329, -244, -217, -462, -24, -54, -246, -186, 364, 126, 95, 367, 495, 246, 344, 634, 139, 373, 453, 258, -32, -223, 173, -278, -382, -328, -218, -396, -407, -178, -343, -464, -151, -338, -351, 14, 188, -46, 52, 48, 351, 204, 485, 440, 81, 311, 378, 27, -252, -48, -56, -487, 5, -290, -291, -526, -169, -487, -318, -389, -151, -191, -459, -84]
2810h4J73lK41K00n07M64j98m2p9J37j0k35Q3p7o6J10k26j66q8J27J89l68j9L44
2834a00j86r2M00k06R1j30N27m57L71%J72m00N01j53k20O0j20j37j58J04O9J9
2856d5j67j02j01J31l6L03l56M96J2j43J73J46k05j48K83k21L21k9k54j6N3J04
2878A99k42k04M9J09l08J48J42O0j60%j42K20o1J97q0N0K58j5j96O4L09j65M2
2901B74j40J63k19J38k70j98r3n3K91j81k6Nr8Q5j14M56J8L9J08j09k8L31k22
2924A57n0K58r4K7K32m38JJ05k5k34M8l17Q0j28n8K29j94k20N32Nk48L46j11j99
2948b96O38l03K18j41L17k8l38K89J22k40o4K09k82m67J04J61k87l5J12o3J0J75
2970a89k7n5J70J50l1M0L07j2k42j9K44k33P6L20j24l31M2j41K0O2n5j94j11J04
$$ y = [-84, 89, 86, 327, 527, 20, 484, 286, 244, 165, 302, 292, 57, 140, 63, -3, 107, -119, -285, -373, -246, -57, -425, -444, -100, -286, -378, 22, -184, -93, -223, 304, -153, 218, 218, 390, -10, 491, 338, 118, 178, 58, -79, -237, -133, -64, -45, -212, -314, -415, -284, -320, -17, -373, 123, 135, -8, 165, 311, 106, -42, 241, 20, 341, 312, 58, 42, 95, 199, -43, -247, -198, -89, -397, -249, -107, -47, -207, -207, -349, -129, -190, 7, -73, -23, 235, 220, 24, 88, 397, 232, 274, 134, 297, 78, 216, -54, -252, -345, -398, -107, -288, -314, -309, -407, -322, -436, 20, 38, 77, 185, 76, 48, 379, 157, 107, 365, 271, 298, 530, 92, 93, 198, 173, -61, -13, -330, -250, -378, -436, -207, -401, -621, -89, -84, -332, 14, -97, -296, 342, 39, 257, 116, 433, 405, 67, 356, 478, 238, 174, 383, 101, -366, -262, -101, -388, -423, -311, -374, -364, -189, -216, -271, -101, 49, 18, 58, 365, 353, 111, 92, 336, 103, 179, 499, 375, 44, 86, -55, -35, 27, -28, -222, -333, -229]
2994b29ON6j39J77j40j22M75m05K71J29n0j9P5L04j9l04q2L51j98lL7K9n76O54
3018B78l33j05k2R0N1j96J30J2j02j3K16j16j32K93K00j55J4J9j4j77K95r6l44
3041b07M52j96L0r6J94m62K60j2o4j15J59K65l18Q9K7kj80L46Q7r5n8K69N9k39
3065A93L5J53m65j42L61j44j93oJ93j73k21M10p0k86K32K53m08J56M51n91J47
3086a15K30K51j95m9L9m7l06L85Q8j67j65J35l38j99L49o6j08J3N3j46J38J24
3108i6N6k3K51Nj76L25n5p2J13j69O6j22M08k74k0k85J10k44p6k44L73l6m08N32
3132f1j41j26L82k11r9J44L40l97J06K15K70k98j71M19o8j20J0k07J8M5r2j31
3154a73j21K72k15l0K27k5k00NJ19l4k44M09K69m53N91R0j80m4J10j39j33j22
$$ y = [-229, -223, -167, -306, -129, -269, -391, 84, -321, -50, 79, 29, 10, 85, 389, 370, 66, -16, 335, 137, 134, 171, 200, -376, 278, -55, -160, -182, -92, -41, -237, -107, -95, -197, -210, 6, -110, -242, 51, 251, 96, 110, 129, 115, -62, 233, 137, -207, 245, 49, 79, -17, 177, -285, -25, -37, -101, -216, -57, 208, -110, -21, 6, 4, -176, 170, 257, 162, 104, 373, 432, 193, 228, 381, -84, -226, 135, -9, -202, -208, -15, -188, -409, 1, -69, -355, -123, 130, -278, -122, 329, -262, -115, 115, 366, 171, 122, 161, 114, -192, 193, 281, 114, -51, 84, -254, -453, -104, -170, -278, -265, -212, -358, -220, -96, -40, -63, 188, 193, 17, 342, 287, 215, 328, 159, 225, 103, 511, 237, 217, -68, 42, -202, -278, -522, -149, -185, -593, -61, -202, -328, 54, -157, -256, -112, 228, -169, -63, 152, 422, 124, -47, 372, 304, 184, 194, -13, 5, 50, -42, -173, -294, -22, -237, -267, -40, -65, -265, -260, -141, -175, -419, -10, 259, -194, 397, 487, 307, 263, 373, 234, 101, -21]
3176b1M06r5j98L70o41J07M6m3j50J55K14n29N6pl0J62J40K05l11K25j70J13J61
3199A65J38o0m66N41j74K98l46n0K08m12J1K24Kl99K28N5l07J86K6j5J41j75o
3222a87J87M4j81L24o76Q79m19r2M9J94j12j32J30J0n0j14K25j25n6J58l53J43
3244a54J63J35j61k3K15k30Q2J67j78J44r5J60k43J21rj3Q1j06j22k55J8K63K2
3267a8k93K64k23J91j58M8P0k6O4q1L69k60M42j94J15p5l9K22m70L13m31J7j6
3290a69J55J22l47n3j23J03K88j02o3M7J4rK48K37j07m99N50k49k5O7Q4J55k18
3313A06K65o6m77K78k95j19J31q1L00j38rn4j18K16p0l1j19L52J10Qj46k7J15
3336A31K8L2jJ7m00M82J3n60J38k9O3R5j01q5R1k40J46k38M32k18Q7K73l16PJ29
$$ y = [-21, 385, 290, 92, 462, -179, -72, -26, -69, -219, -64, 150, -379, -323, -330, -360, -198, -58, 147, -164, 61, -109, 4, 165, 303, 243, -223, 318, 144, 442, 96, 46, 254, -158, -147, 77, 79, -320, -92, -37, -344, -158, -132, -147, -6, -181, -187, 0, 44, -137, 187, -489, 390, -29, -121, -72, 122, 10, -122, 8, 18, -32, -146, 79, -46, -102, 56, -297, -154, 9, 144, -17, -40, 175, -55, 27, 194, 16, 160, 65, 225, -18, 103, 94, 81, 162, 56, -66, -321, -303, -40, -18, -311, -47, -270, -79, -237, -189, -119, -145, -81, -162, 207, -53, 389, 195, 310, 235, 196, 418, -52, 261, -170, -153, -169, -14, 108, -239, -292, -415, -312, -24, -126, -189, -142, -128, -137, 111, 348, 241, -258, 292, 43, 18, 85, 169, 324, 106, 371, 305, -172, 106, -189, -308, -177, -258, 42, -96, -105, -159, -277, -61, -131, -162, -281, 71, 181, 189, 43, 16, 131, 159, 191, 190, 207, -193, 289, 302, -258, -120, -149, -86, 9, -92, -177, -86, -326, -180, -418, 14, -204, -117, 156, -160, -153, -24]
3361b4O9q0L92j66j10O3R6p0Rl7j05O8l0l29J20J07Kmj81J84K1L2r6j59K42j35
3387a21J57j60J00J39j19K1K1N6o8K62j31m1qk12N5p4L54n9k78l3J02rj50K19
3411B3p9J1j25J24J03k06L15k5j2J21j61lK4o6Rj12j05K00N6j15k28J32j16K01
3435c4j9J16j44N3K6j23J54J58j14n8p8j96L65O9k16J60oj53j62Q8N8J56l55K68
3459A3o6m4o7J84r2Nm9J61m8J8J79j6o5J81Mk08R5k11J68K05m27q1L66j02j5l94
3485c06q9J96J88j62mJ67k22N4R6J41l4M6r9J97j90P2J04K25p8j47j4P8m02K21
3509C8k88O0K70m9l30L34m67j4M72j23j45m1K37P7j25M35j99Q2k11L5Q8k57L43
3532B22q8k05l2J20j49J83j7M9k4o3J58l52q1K9K65o4j73L51J64l58K00Q1k93
$$ y = [-24, 45, -35, 357, 191, 81, 144, 240, 170, 179, 142, 37, 105, 75, -254, -134, -27, -25, -29, -210, -26, -5, 27, -69, -228, 14, -121, 36, -124, -24, 115, -4, 17, 38, 94, 26, 288, 157, 116, 108, -104, -49, -123, 231, 172, -106, -139, -37, -46, -196, 23, -56, -45, -170, -46, 57, -149, 166, 141, 129, 250, 89, 86, 110, 44, 53, -59, -164, 36, 92, -23, -251, -119, -235, -34, -53, 63, -81, -28, -2, -125, 29, 187, 73, 15, -63, -259, 106, 175, -41, 119, 113, -40, -202, -114, -56, 100, -255, 13, -53, -97, -164, 20, -72, -67, -116, 45, -3, 15, 194, 178, 113, 294, 298, 90, 185, -26, 142, 347, -80, -161, 205, 103, 88, -306, -395, -199, -11, -173, -177, -10, -232, -178, -82, 59, 25, 71, -28, 169, -21, 51, 155, 380, 302, 155, 141, 219, -183, 38, -250, -190, 80, 31, -299, 35, -432, -446, 26, -97, -242, -283, -46, 31, -94, 341, 142, 224, 13, 48, 136, -121, 222, 134, -71, -103, 17, -132, 51, 34, 83, 59, -4, 154, -198, -279, -250, 15, -49, -222, 129, 293, -65, 135, 216, -77]
3555g7R6J33pP8k00K62m03kK72j28r9n7M2k23M25k97R3p9J19j99j76M58j23O9
3579b3k2rO6J9N1J46j85K33l34J12o1L71m09p5k2J30K73m03P2R1p4J1R8j36j16
3604a96JM12J4r8O1k74J37J92k98p7J38qq6R4J26k72K25l54J92j73K81J45k23
3627d1K3K04k41R5k57J85P9kj6p6n5J69j39%K0J8K1ml7Q1n0q1N0j66K6J57k29
3654b66K92K9o8j30N35m66J05j65P1L05k77q6N68k88j69J35j69J38p0M5l47K20
3676e8J04j01l2M6j68J8k82L13j51J90J8L40k92J5J84j04o7K96k63M5M2k9K09
3699B73m74K80m85K17J72K2j52J22J09k81N6P0J01L4j70n4K17k12N3K44j98L67
3721C11k79L3J86%j16K3q6p1m2J09j61n6N4K78j73k77MK42r6P6J17M1j47N8q1
$$ y = [-77, 19, 152, 145, 223, 23, 285, -118, -120, 152, 24, -75, -132, -90, -313, 112, -185, -92, -171, -52, -251, -427, 31, -92, -23, -45, -54, 12, 31, 82, 228, 43, 276, -58, 54, -7, 364, -45, -120, -142, -12, 261, -142, -70, 21, -53, -42, 56, -80, -196, -195, 217, 231, 133, 194, -80, 57, 249, -49, -126, 12, 4, -82, 12, 138, -134, 91, -263, -71, -244, 37, 182, -41, -18, 186, -55, 40, -217, -32, 47, 45, 29, -47, -102, 67, -72, -72, -52, -34, -13, -17, -54, 27, -23, -104, -54, -220, -194, -37, -266, 26, 55, -13, -143, 392, -74, 31, -134, -63, 242, -35, -121, 447, 159, -10, 125, -44, 94, 24, 69, -278, -58, 46, -55, -87, -41, -209, -191, -473, -160, -311, -121, -103, 237, -55, -40, 144, 40, -27, 269, 6, 51, 93, 64, 273, -201, 79, -406, -189, -17, 5, -147, -25, 84, -197, -141, -71, 30, 64, -106, -160, 57, -155, -102, 142, -56, 311, 32, 65, 251, 251, 135, 158, 72, 1, -41, 68, -93, -149, -95, 183, 10, -267, -263, -21, -117, -41, 76, 117, -30, 28, -53]
3746e3p9J42RJ12k94J95J80l94K85J39j81j84k5J97N1k29J16j75K3j64K55j38
3768b12K66o8J18j99K5M55l43j08J70j18q6OK61j29k47M04j49J00l52L5J1RL11
3791A60k74j12lK89j94J09o6k5J68K2J10r0M5j6K5j02k4j33J41J86k61K25k15
3814c5J7j34J89m6j47R2K32j63j4j00j5j0L43M9k11k9K82j42n4L2j63J1K44l7
3838A91k27j7J88j32j51j24Q2J28mj40J50k0r7k3k1J69J4K19k26L30k57r9k1K29
3862A41k23N5k05N5L9J52Q7k57M9l5L03k87O1K24r3k59J48J52m0P7l57M91j22
3885A56j23K52o5l0j99j21qQ8K98l36K9L08l14p5J09j53J79k42M58j89o4j26P1
3908i7J50Q4J50m66K4J43K3M3k5K10m57m4L17o3l21N25K1l87J85M5o4j0p0J84
$$ y = [-53, -132, 10, 19, 131, -163, 32, 212, -182, 103, 242, 61, -123, -148, 49, 100, -129, -13, -188, -165, -329, -74, -212, 54, -14, 104, -95, -70, 385, 42, -66, 104, -14, -100, -94, 167, 38, -209, 195, 46, 146, -206, -171, -160, -151, 160, -114, -226, -229, 60, -134, -25, -91, -116, 52, 74, 184, 94, 139, 123, 148, 46, 22, -111, 30, 216, -45, 180, -35, -18, -152, 37, -9, -156, -64, 168, 5, -9, -109, -124, -134, 209, 258, 47, 18, 300, 158, 104, 136, -27, -16, 228, 191, -36, -53, 135, 3, -148, -272, -190, -62, -66, -206, -56, -76, -173, -196, -217, -48, -34, 185, -41, 289, 32, -67, -88, 141, -82, -27, -232, -177, -138, 14, 101, -156, -107, -142, 161, -126, -65, 159, 66, -193, -45, 107, 67, 144, -213, 278, 156, 33, 285, 220, 190, -9, -130, -138, -50, 248, -88, -59, 249, -65, -140, -31, -184, -5, -247, 211, 22, -42, -168, -97, 53, 137, 287, -179, -155, -12, 11, 54, 29, 239, -218, -262, 55, -8, -329, 196, 217, -170, 15, 60, -4, -14, -84, 100]
3932A00k27M9J08r9KKJ92K1k16P4j1j17N2q0K86O9j36j93Q3k28K02R0o6n4K35
3957A38k17M5o1N8O1j06R7P0k78J54R2P4j45N4l6m6K3r3J53m2p2j23J91j84K93
3982A00j76l33L93K6k43L22J7qO2j71k63K93L2j2j13L11q7k46N9J81l02L21k95
4005a32rL2oj58L61j94k01L34j54J91k27K99k45J90l82L52J7n6j1l4L29k27J24
4028A93l04K87k29j30mJ83L5q1K1j54J50j03J9J62k90K17p4K3J84k35R2M9j1m7
4052d7K23k61O0J01r7m7O2O9j06J1Q2j16j78L38k58J54O3m24J67k09N19o8j55
4075a17K24k44P3L25j29J8j40m0K95j51j23r5Q0J92j67r4J32m13J84K19J31k42
4097h2Q3k19JK9J09M25m97L07L9j22j8j91L53k77J46k60N9O0L22m5l72K79k14
$$ y = [100, -127, -78, 30, -69, -67, -65, 127, 148, -68, 6, -5, -122, -70, -150, 136, 205, 69, -124, -41, -269, -67, 23, -43, -97, 138, -79, -34, -95, -37, 24, -82, 15, 85, -193, -39, 53, 127, -18, 36, 0, -46, -23, -116, 37, -5, -77, -200, -9, -193, 100, -76, -409, -16, 10, -233, 89, 106, 98, 160, -11, -274, 19, 51, 39, -74, 237, 150, -96, -37, 144, -158, 163, -132, -141, -109, -115, -273, 88, -106, -307, 27, -127, 64, -163, 136, -109, 81, -301, 51, 68, 12, 1, -33, 296, 69, 193, -111, 176, -53, -183, -187, -4, 31, -50, -29, -183, -33, -136, -117, 45, -245, -28, -102, -79, 105, -130, -38, 11, 0, -47, 176, -85, -25, 76, -21, -68, -6, 63, -43, -32, 50, -66, -244, 94, -164, -10, 53, -371, -204, -413, 106, 38, -117, 107, -137, -64, 261, 132, 150, 10, -30, 265, 114, -9, -104, -24, 168, 1, -93, 39, -374, -190, 29, 160, -82, 1, -218, -217, -188, -79, 346, -151, 156, 195, 73, 55, -136, 217, -60, 86, -174, -115, -55, 267, 222, -150, 129, -85]
4120h5j35L01K3j40k33L07N0ol5m30M57k70L32Ln7K73l59j2Q6L8j35J62k4Rk81
4145a61J1L13k99J22j28Q6k4j99J45J30k61J2K80O5K9m7K3k5j75L77l67J55J74
4168B36l65K36j59P9j11l7m5J43RJ20K9l13Q8L55n91L62O2K77l15J60k97N9K52
4191B34r0j92K27k25J78j0j42N4k71O6P3r4L2M39k23m4m43M96q8L55j73o0j28
4214b9O2p3J13J79k52R7O9l4k27P8j94L55k71n5o0K29j80J37j08N8J22j17R3q3
4238i1K44m3n6J39p3j3m7N4m4N3Jl08M57m12K86L6m60L66l34J89J21p9j03K77
4262A60k15Q5n8R6ll8k03J92J41j65J1p7K62L5p6q7J0l55K48O7k33j12K63Rj43
4287a86J57K73k44k16J63j66j08M96k99n8M44k05K9j16N9J93l08m8j8J91k10M56
$$ y = [-85, -220, 81, 104, -36, -269, 38, 88, 82, 47, -383, 74, -196, 136, 139, 82, 355, -4, -16, 70, 108, -27, 135, 111, 120, -161, -150, 163, -136, -14, -142, -56, -80, -279, -134, -4, -265, -253, 27, 92, 121, 74, 97, 72, -103, 274, -93, 62, 236, -129, 107, -52, 27, -84, -121, -166, -23, -14, 106, 135, -178, -90, 265, -326, 36, 98, 375, 60, 220, -77, -18, 234, 144, -48, 179, -46, 132, 122, -20, 34, -237, -171, -98, -192, -160, 279, 56, 12, -431, 65, -23, 332, 159, 99, -29, 33, -40, 73, 252, 0, 97, 166, 132, -95, -17, -211, 144, -127, -182, -242, -13, -193, -56, -164, -106, 16, -101, -8, -91, 153, 110, 54, 193, 120, 107, 60, 114, 70, 123, 124, -184, 273, -139, 147, 183, -277, 89, -245, -56, 65, -14, -117, 160, -55, 30, -28, 68, 65, 27, -176, 16, 157, -8, 3, -74, 188, 223, 147, 60, 70, -285, -37, 30, -203, -315, -52, -43, -186, -29, 244, 0, -216, -53, -219, -327, 169, -130, -188, 256, 51, 80, -36, 23, 216, -92, -140, -158, 33, -177, 279]
4309B79l47m6R3j47J32l3P4j01K5K15K28l04k67O16n58J14Q9j48K28M1j30M0K11
4332C04k71j97NQ9n7l9j64K16J8j49J09J34o4L04l24Pj6R0j61J52j70J59m8L9
4356c4L60l1k80q9j0m1R7l9R1k19J5n3L74l65j3J87L0jNo6J83m6J39j52M0J29
4382B11m74K46j08L20k75J34j52j39J15n5K41l03K48n1Q2j04j78J62J6qj74K90
4404D4Q7j56J49j76J28n6P2j71j4K92l21L02pl46PK22n8K4j07M3j29K09Ll5j84
4429a78j5Q0Q5m5M7J37j70J46l3q5N0j63K41J53k60n0J48k08J09p8j54J42j0J
4453a10q7K33M5q9J92r3K01k46n3K94l15o9J09M1q0J25j1L58o96K51k67n4M45
4476A24q9j54J18j75J14L1j0p3M2M9j62K75P9j35p6J10k8m2j03J34n0k11L96l36
$$ y = [279, -68, -114, -21, -168, -36, -69, 5, -96, -71, 144, 372, 68, -199, 417, -141, -27, 62, -86, 142, 183, 53, 93, 304, 33, -164, -159, -70, -127, -166, -330, -114, -96, -245, -136, -2, -66, 238, -86, -79, -95, -5, -166, -14, -184, -25, -73, -34, 326, 295, 15, -74, -84, -125, -28, -67, 24, -195, -180, -233, 141, -224, -237, -50, -20, -21, -16, -82, 101, 55, 194, 42, 82, 211, -263, -17, -125, 195, -80, 54, -98, -237, -122, -177, 64, -239, 9, -42, 40, -64, -242, -80, -64, -72, -246, 44, 131, -25, 124, -52, 76, 20, 92, -79, -93, 199, -122, 180, 173, -173, -166, 56, -2, 22, -85, -42, -171, 38, 41, 6, -178, -193, -113, -28, -73, -26, 111, -59, 87, 54, -31, 19, -144, 97, 250, -10, -60, 88, -120, -11, -89, -243, -101, -111, -110, -197, 36, 81, -8, 184, 91, 292, 46, -7, 287, -28, -97, 12, 53, -27, 98, 87, 445, -251, 0, -267, -321, 124, 35, -119, -1, -176, -62, -31, -41, -114, -72, -23, -185, 90, 169, 34, -42, 68, 40, -2, -105, 29, -21, -232, 164, -172]
4500a72K20j10P0j81J48J00m6j92J40O7l3J90k16P1R9l59J56Q7k9J84n8k98K20
4523E8j10k8K64j16n5j77O4K35l17M6m6L82j25o3Q6K7O6j05jk16J4M52l80K16
4547A71K09o62K47K17k80J50P9M2k57o8L45k00k69L86l58L91k88K1J10o4P3M0
4569C5p3J06J00m0p8j1k42L18k06J79p2j12J36k89K75l02K75n4k14L48j41N7j47
4592a52J2K33l2j74n4J15Q1n4q6J44J07k01J57N1j20j34N4j05j71L81J8l13J47
4615i6l5J00O5j25J58J9pk48L30l41L5L14l31L27Qk59o3R1P7j47O0K63J43o24
4639b86M23l3l37J35j4j22L6K67j65J49p6p8J68k43K28n2NM29n83K57j4m8Pj91
4663a38K13j00r3MK5K04l17K48o7j29K45l81J93M1O4j20N9K48k27K33k29j86K11
$$ y = [-172, 48, -62, 8, -173, -25, 75, 29, -163, -23, 44, 11, 201, -15, 56, 155, -204, -48, 39, 10, 194, 136, -162, 58, -52, -80, 184, 68, 13, -164, -100, 135, -182, -136, -182, 200, 75, 12, 98, 125, 191, 86, 85, -131, -117, 335, -45, 171, 380, -282, -35, 182, -98, 52, 131, 173, -84, -152, 193, -7, -276, 110, -248, 143, -145, -124, -14, -78, -5, 35, -38, 68, 168, 128, 50, 39, -203, 115, -91, 88, 16, -96, 40, -249, 26, -276, -1, -55, -269, 79, -62, -5, -152, -140, 93, 61, -113, -167, -52, 29, -25, -111, 33, 140, -61, 96, 147, 27, -107, -53, -158, -329, 52, 70, -243, -96, -131, -31, 34, -91, 67, 86, 79, -169, 161, -180, -145, 169, -162, 165, 173, -86, -149, -58, 19, -128, -68, 195, 338, -286, 137, 104, -233, -98, -112, -234, -198, 69, -96, 53, -23, -101, 67, -176, 52, 0, 5, 434, -149, 108, 94, 46, 53, -138, 75, -25, -118, -114, -89, 115, -202, 46, -21, -150, 95, -286, -93, -52, 12, -108, -49, 199, -28, 205, -24, -210, 1]
4686Ak95K24K04r2j08J13o0J01j85j06j05J29J24o1J82j97K01p6k55L65Kj5l15
4709b24M39j92O6J0j52N4k1K52l14K39l24J85j42J24K6r8J10k72K52M7l00K55
4731B0K54m86K34J7L7k86M91k05l0j47L5qJ86j68R4l1p2q2M2K5p1K05k5l01O3
4756b09K16J8J43j82J94j33K85j73p5j31R2K60j95n2n8J10j69j09L59k30K49k72
4778f2O0p8n6K72j62k30K25J36j96J54K16o1k96J39j68K15K22j99J24l33J06j38
4800a10j2K52m37K16q8J44q0O6j57J6J5J19R9j39J53J07j02k5k44K57j6O6lm7
4824E0l3o2j18K3K63J04k13L2j15p1J32o6J9k3J3o2K50P0k72m6J41l15p5N42k03
4849c5K23L3k20j36RJ18j12Q9P1j64J3O2L7k32M6L72l17o7L69l46J36J60nj23
$$ y = [1, -294, -70, 134, 42, -66, 47, -13, 88, -97, -203, -308, -179, -55, -116, 66, -131, 70, -6, -261, 104, 106, 91, -224, 215, 23, 89, 99, -53, 1, -20, 232, -82, 157, -167, 18, -124, 0, 26, -72, 38, -234, 18, 65, -235, 20, 274, -212, 22, 39, 76, -210, 281, 76, 46, -101, -66, -74, 112, -56, 38, 7, -65, -147, -105, -80, -151, 54, 29, -272, -209, 7, 25, 168, -14, 180, 47, 332, 159, 84, -47, 45, 305, 110, 58, 0, 110, -59, -168, 191, -39, 210, -62, -2, -80, -136, 136, -26, -256, -31, 105, -91, 63, 279, 218, -78, 61, -107, 108, 330, 131, 255, -78, 28, -110, -122, 130, -307, -91, -179, -35, -115, -49, -206, -190, -175, -56, 43, -96, 57, 164, 62, 37, -207, 50, 34, 100, 97, 50, 17, -45, -163, -140, 123, 227, 14, 46, -69, -140, -8, -74, -55, -78, -65, -127, 123, 193, -79, -125, 16, -299, -374, 168, -35, 188, 221, 1, -135, -126, -8, -120, -31, 40, -124, -111, -49, -12, -244, -198, 174, -143, -210, 159, -187, -51, 109, 104, -19]
4873a9Q7j79L35k39j37K87m15L83o6j96L27m6l98J47J78j73O7R9l6j60K60q5J08
4896A29k43Q5K58r9j75J07J46j56l37K07K16j24m4k27K26O1J63m07M19k05k05
4917b05L99j58m2q2P0J5JK57l78J02R8Q2j89N4L7k42N29k93j0J98j76n3k8k3j8
4942e5j08KO0q1K51q2P4j36J89K00k36k7k57L98j58J6n8Q5l48L03j57L04r4N0
4966A35m45K01J60R5j20m30M51PK0k19J32p4K22k86R6m0L6J63k23K45k25K6K76
4989B03j0j30j44K48j88j28L53k66J95j0l50rJ42j72K01J07l6M1m6O7j10L1K39
5012B28k50Q8q7K68k92N1kk03L96j15N3k83j64L73L4m40L97K39m41k1K57J64j09
5035A41k57M0L77k47p7J33j03J98K5k55K88l76J51j2q0M6o2J83k23J23o5l8k76
$$ y = [-19, 68, -111, 224, -15, -152, 135, -280, 103, 37, -159, 168, 122, -276, -129, 49, -124, -57, 42, 6, -154, 106, 21, 129, -114, -29, 229, 130, -45, 62, 208, 52, -285, -78, 138, 14, -30, -257, -31, 30, 193, -214, 205, 0, -205, 194, 36, -6, -88, -18, -3, -2, 255, -123, -21, 77, 159, -30, 24, 61, -181, 348, 55, 45, 243, 67, 14, -14, -37, -55, -163, -161, -101, -182, 69, -13, 61, -75, 114, 314, 78, 51, -206, 192, 34, 50, -8, 77, -271, 32, -125, 179, 85, 135, -310, -109, 51, 146, 26, -404, 47, 54, 74, -145, -13, -87, 135, -151, -55, -95, -59, 104, -119, 126, -99, -73, 203, 193, 63, -81, 167, -21, -149, 204, -62, 133, 123, -227, -236, -94, -266, -65, 42, 6, 47, 1, 68, -42, -11, 228, -22, 66, -21, 247, -45, 6, 4, -199, 197, 82, 135, -148, -312, 61, 95, -345, 52, 291, -150, -171, 86, 250, 141, -116, -76, 301, 54, -23, 110, 7, 205, 230, -25, 263, -113, 38, 26, -54, -8, -70, 113, -110, 13, -52, -90, -366]
5058c66N22n9j69M3M6m3L23j73J00j66o8j89K09J78l08P4j7K14l84K19j43J00
5080e7J73j89J8r8jK26j36R1J21l76K87J0R2l08L52l42K24j65K91k88R6O3J9j73
5104g0j7K6r3J50j25K40k35M5L2J59K1p9q4J08QK27j84j74J19K40l01j26M1O0
5128a2k77M01n5j83l5J45j13N4K22j12k38J90K09q3q9R0%q1j47L24j36K10k6k30
5152B8k13p1M36j01j00l3k42J44jjr4k17M16J50k3k20J55R0N7l03J97j06J84j52
5176b0K66k39L6K12Rk20J66m2k76M66l11m55M13J1N5k47P4L10l21Q7J8l3L0l5
5200d6J24k95P8J72k07K68m2K9M5m4oJ65J29m85J96l21K27o7j03J89K22j58j9
5223E1qO6Q0k00J89P7q1k2j04l2N8k08M9K00p6k13K62ol7j23J90k00k01J00q5
$$ y = [-366, 156, 97, -72, -29, 17, -26, 297, 124, 224, 58, -10, -199, 10, 188, -120, -46, -63, 151, -233, -14, -157, -57, 116, -73, -55, -153, -154, 72, -64, 27, 148, -228, 59, 69, 161, -147, 205, -137, 87, -78, 213, -75, 21, 84, 103, -70, -87, -61, -154, -4, -129, 111, -124, -79, -47, 112, 133, 54, -30, 78, 86, 313, 129, -45, 74, 314, 13, -113, -72, -12, -289, 112, 57, -126, -161, -16, -129, -75, 147, 35, -203, -13, 196, 113, 24, 114, 114, 33, -114, 210, 74, 284, 258, 28, -185, -256, 180, 79, -21, -54, -296, -152, -153, -154, -248, -465, -49, 101, 78, -142, 13, 103, 160, -143, 54, -52, 132, -20, 246, 7, 43, 255, 264, 44, 210, 168, -108, 358, 47, -408, 5, 16, 71, -176, -102, 208, -113, -26, -8, -41, -11, -46, 78, -217, -139, 33, -174, 94, 52, 81, 126, 82, 76, 241, 370, -115, 81, -240, -13, -80, -183, 6, 228, 70, 51, 43, 109, 189, -11, 178, 255, 174, 152, 48, 16, 74, -134, -85, 115, 39, -174, 88, 82, 45, -78, 112, -88, -289, -189, -274]
5248b74K48K81k15J45K8k53J89o7k93N2M97l30j07K09q3j26J74k8k48J95j05m1
5270a52K2l8L04k37P4Q0R6J05m29K72j41K04J85j67k74PQ1R7j6j86K82j65k54
5293b50L52j68Rk02K47k17K38L6j47L13r2m4j03J87n7k13K2J85m3K4J56m22K80
5316I1O3kj47k65J55q1L61l30J61J89l13j32O8J6J13M8N2j73OL6M20r7j03k4j21
5341ik0J27QJ50j74Q7k25R0j50P7%P0J35j76lM3j81o8M21j95Nl8K9K21k18m7J07
5368F6k70L90j14R5J93l24R8k80K23P7k63qL33l01j35K19Lk25J52j80O3J90J27
5391A29%n5k13L87Qk82n7J28J9l58J67J22J00L8k78K81n0k18J4j29L60k83J06
5414f4j44J86O4j84J29r2L06J1j82n2L80j98k30M7j71M28k41o6j3J08j15Q3p1
$$ y = [-274, -26, 255, 40, 185, 213, -40, 149, 82, -211, -159, 338, 8, -99, 110, 27, -99, 75, 47, -201, -6, -111, -152, -130, -168, 136, -101, -27, 53, 149, 254, -175, 97, -44, 160, 345, 178, -96, -89, -8, 89, 73, -113, 169, 4, -250, 102, -66, -57, -259, -12, -229, 9, 45, -102, 211, 119, 75, -28, 159, 102, -111, -89, 96, 53, 77, 233, -189, 91, 154, 152, 5, -260, -105, -186, 175, -155, 6, 195, -118, -250, -182, -166, -53, -5, 47, -126, -120, -84, 336, 239, 136, 112, -9, -29, 98, 106, 256, 82, 169, -56, 34, -116, -39, -39, 31, 166, -10, -13, 30, -151, -219, 202, 7, 12, -26, 3, 224, 6, -41, 66, -204, 186, 72, 167, 360, 36, 134, -146, 77, 154, -109, -117, 216, -85, -220, -1, 2, -223, -71, -251, -188, 2, 129, 129, 74, -139, 248, 256, -26, -83, 45, 64, -294, -127, -5, 95, 133, -145, 136, 86, -132, -118, -247, 113, -170, -64, -208, -22, 42, -142, -13, -105, 201, 212, 30, -22, 358, 160, -70, -23, -194, 234, -7, -73, -86, 22, -93, -10, -81]
5437h1j6Q1o5M0J13Q2M2j21m3p2K56l13K05L1rJ44l96J23rK36k73K28k23%j07
5462a47J27m3L2M6j42K05m4j00J62j48J42k12J29oK09k29K29r4J20m33J82J60
5484A45o7R1l29K5J76l35K22M9J6n0L0Q8l8p1j94K58r1K03j00L18l81jJ00k72
5508b08K63j69M3J56Q2r1N8M8j25j36M41o23L47k70k33M92k01o6K73L6k2K7q8
5531C4K87k70j53K00j67QJ21k03P9j40L3J95L6qk97J2Q0K13J41k15J25j24l3J08
5555F2k2J61%m5j01J7k67J43J80n2k68K3R7j82J14K92j13l97K37K04j51PJ00J98
5579B37n26L47j68J10p5k1O3K78j54k3l81N59j55j77R7j4j46K61l89J52K14l28
$$ y = [-81, -97, -16, -81, -41, 72, 154, 196, 75, 32, -40, 216, -97, 108, 139, 130, 274, -122, 1, -8, 228, -45, 183, -40, -40, -147, -20, -63, -31, 15, -127, 78, 34, -66, 96, -52, 90, -122, 7, 1, 210, -19, 210, 116, 236, -197, -15, 145, 78, 169, -160, -135, 41, -294, -72, -23, -7, -57, -27, 61, 23, -48, -242, 16, -75, 128, 28, 346, -35, -36, 64, -208, 55, -114, -71, 85, 167, 76, 134, 182, 57, -79, 362, -261, 86, -184, -417, 75, -126, -192, 81, 117, 95, 122, 34, 321, 51, -102, 98, -69, -61, 60, -143, -64, -204, -171, 24, 60, 52, -245, -233, -153, 60, 201, -14, 111, -13, -46, 62, 40, 201, 201, 156, 55, 72, -195, -52, 128, 76, -192, -169, -72, -254, -140, 152, 39, -358, -121, 83, -68, -61, 39, 237, -289, 58, -110, 0, -75, -96, -33, 245, 91, 68, -313, 246, 91, -86, 11, -3, -149, 112, -277, -125, 89, -239]
$$ [...]
8191E0
##END NTUPLES=NMR FID
##END=
