##TITLE=1H_Ser Am-247
 CDCl3, 8 sc, 
 1.9.2021
##JCAMPDX= 6.0         $$ Bruker NMR JCAMP-DX V2.0
##DATA TYPE= NMR FID
##DATA CLASS= NTUPLES
##ORIGIN= UXNMR, Bruker Analytische Messtechnik GmbH
##OWNER= root
$$ XWIN-NMR		Version 3.5
$$ Wed Sep  1 16:18:15 2021 Russian Standard Time (UT+4h)  she@DPX200
##.OBSERVE FREQUENCY= 200.1312
##.OBSERVE NUCLEUS= ^1H
##.DELAY= (6, 6)
##.ACQUISITION MODE= SIMULTANEOUS
##.ACQUISITION SCHEME= undefined
##.AVERAGES= 8
##.DIGITISER RES= 18
##SPECTROMETER/DATA SYSTEM= spect
##.PULSE SEQUENCE= zg30
##.SOLVENT NAME= CD2Cl2
##.SHIFT REFERENCE= (INTERNAL, CD2Cl2, 0, 15.7039)
##AUDIT TRAIL= $$ (NUMBER, WHEN, WHO, WHERE, WHAT)
$$ ##TITLE= Audit trail, XWIN-NMR		Version 3.5
$$ ##JCAMPDX= 5.01
$$ ##ORIGIN= Bruker BioSpin GmbH
$$ ##OWNER= she
$$ F:/spectra/data/she/nmr/H-F/1/audita.txt
$$ ##AUDIT TRAIL=  $$ (NUMBER, WHEN, WHO, WHERE, WHAT)
(   1,<2021-09-01 16:16:51.17 +0400>,<she>,<DPX200>,
      <created by zg, POWCHK disabled, PULCHK disabled
       configuration hash MD5:
       00 E9 B6 7A A2 85 ED C7 34 08 36 98 17 FE 4E 26
       data hash MD5: 16K
       5D 94 57 FC 24 E5 A4 6B 85 1C 90 26 D4 4D 58 A6>)
$$ ##END=
$$ 
$$ hash MD5
$$ 31 28 37 60 81 D6 77 50 E7 FE CA 94 74 39 AF 33
##$RELAX= 
##$RELAX= 
##$RELAX= 
##$RELAX= 
##$RELAX= 
##$RELAX= 
$$ Bruker specific parameters
$$ --------------------------
##$DU= <F:/spectra>
##$EXPNO= 1
##$NAME= <H-F>
##$PROCNO= 1
##$TYPE= <nmr>
##$USER= <she>
##$AMP= (0..31)
100 100 100 100 100 100 100 100 100 100 100 100 100 100 100 100 100 100 
100 100 100 100 100 100 100 100 100 100 100 100 100 100 
##$AQSEQ= 0
##$AQ_mod= 1
##$AUNM= <au_zg>
##$AUTOPOS= <>
##$BF1= 200.13
##$BF2= 200.13
##$BF3= 200.13
##$BF4= 200.13
##$BF5= 200.13
##$BF6= 200.13
##$BF7= 200.13
##$BF8= 200.13
##$BYTORDA= 1
##$CFDGTYP= 0
##$CFRGTYP= 5
##$CHEMSTR= <none>
##$CNST= (0..31)
1 1 145 1 1 1 1 1 1 1 1 1 1 1 1 1 1 1 1 1 1 1 1 1 1 1 1 1 1 1 1 1 
##$CPDPRG= <>
##$CPDPRG1= <>
##$CPDPRG2= <>
##$CPDPRG3= <>
##$CPDPRG4= <mlev>
##$CPDPRG5= <mlev>
##$CPDPRG6= <mlev>
##$CPDPRG7= <mlev>
##$CPDPRG8= <mlev>
##$CPDPRGB= <>
##$CPDPRGT= <>
##$D= (0..31)
0 1.2 0 0 0 0 0 0 0 0.06 0 0.03 0 0 0 0 0.0002 0 0 0 0 0 0 0 0 0 0 0 0 
0 0 0 
##$DATE= 1630498610
##$DBL= (0..7)
120 120 120 120 120 120 120 120 
##$DBP= (0..7)
150 150 150 150 150 150 150 150 
##$DBP07= 0
##$DBPNAM0= <>
##$DBPNAM1= <>
##$DBPNAM2= <>
##$DBPNAM3= <>
##$DBPNAM4= <>
##$DBPNAM5= <>
##$DBPNAM6= <>
##$DBPNAM7= <>
##$DBPOAL= (0..7)
0.5 0.5 0.5 0.5 0.5 0.5 0.5 0.5 
##$DBPOFFS= (0..7)
0 0 0 0 0 0 0 0 
##$DE= 6
##$DECBNUC= <off>
##$DECIM= 32
##$DECNUC= <off>
##$DECSTAT= 4
##$DIGMOD= 1
##$DIGTYP= 9
##$DL= (0..7)
0 120 120 120 120 120 120 120 
##$DP= (0..7)
150 150 150 150 150 150 150 150 
##$DP07= 0
##$DPNAME0= <>
##$DPNAME1= <>
##$DPNAME2= <>
##$DPNAME3= <>
##$DPNAME4= <>
##$DPNAME5= <>
##$DPNAME6= <>
##$DPNAME7= <>
##$DPOAL= (0..7)
0.5 0.5 0.5 0.5 0.5 0.5 0.5 0.5 
##$DPOFFS= (0..7)
0 0 0 0 0 0 0 0 
##$DQDMODE= 0
##$DR= 18
##$DS= 0
##$DSLIST= <SSSSSSSSSSSSSSS>
$$ [...]
##$SUBNAM2= <"">
##$SUBNAM3= <"">
##$SUBNAM4= <"">
##$SUBNAM5= <"">
##$SUBNAM6= <"">
##$SUBNAM7= <"">
##$SUBNAM8= <"">
##$SUBNAM9= <"">
##$SW= 20.0189188712717
##$SWIBOX= (0..15)
0 0 2 0 0 0 0 0 0 0 0 0 0 0 0 0 
##$SW_h= 4006.41025641026
##$TD= 16384
##$TD0= 1
##$TE= 0
##$TE2= 300
##$TE3= 300
##$TEG= 300
##$TL= (0..7)
0 120 120 120 120 120 120 120 
##$TP= (0..7)
150 150 150 150 150 150 150 150 
##$TP07= 0
##$TPNAME0= <>
##$TPNAME1= <>
##$TPNAME2= <>
##$TPNAME3= <>
##$TPNAME4= <>
##$TPNAME5= <>
##$TPNAME6= <>
##$TPNAME7= <>
##$TPOAL= (0..7)
0.5 0.5 0.5 0.5 0.5 0.5 0.5 0.5 
##$TPOFFS= (0..7)
0 0 0 0 0 0 0 0 
##$TUNHIN= 0
##$TUNHOUT= 0
##$TUNXOUT= 0
##$USERA1= <user>
##$USERA2= <user>
##$USERA3= <user>
##$USERA4= <user>
##$USERA5= <user>
##$V9= 5
##$VALIST= <valist>
##$VCLIST= <CCCCCCCCCCCCCCC>
##$VD= 0
##$VDLIST= <DDDDDDDDDDDDDDD>
##$VPLIST= <PPPPPPPPPPPPPPP>
##$VTLIST= <TTTTTTTTTTTTTTT>
##$WBST= 1024
##$WBSW= 4
##$XGAIN= (0..3)
0 0 0 0 
##$XL= 0
##$YL= 0
##$YMAX_a= 31582
##$YMIN_a= -53509
##$ZGOPTNS= <>
##$ZL1= 120
##$ZL2= 120
##$ZL3= 120
##$ZL4= 120
##$ABSF1= 10
##$ABSF2= 0
##$ABSG= 5
##$ABSL= 3
##$ALPHA= 0
##$AQORDER= 0
##$ASSFAC= 0
##$ASSFACI= 0
##$ASSFACX= 0
##$ASSWID= 0
##$AUNMP= <proc_1d>
##$AZFE= 0.1
##$AZFW= 0.1
##$BCFW= 1
##$BC_mod= 2
##$BYTORDP= 1
##$COROFFS= 0
##$CY= 11.3945322036743
##$DATMOD= 1
##$DC= 2
##$DFILT= <>
##$DTYPP= 0
##$F1P= 2.36226072786647
##$F2P= -0.459571619588291
##$FCOR= 0.5
##$FTSIZE= 0
##$FT_mod= 4
##$GAMMA= 1
##$GB= 0.15
##$INTBC= 1
##$INTSCL= 1
##$ISEN= 128
##$LB= 0.24
##$LEV0= 0
##$LPBIN= 0
##$MAXI= 10000
##$MC2= 0
##$MEAN= 0
##$ME_mod= 0
##$MI= 1.114404
##$NCOEF= 0
##$NC_proc= 0
##$NLEV= 6
##$NOISF1= 3.799351
##$NOISF2= 2.8
##$NSP= 1
##$NTH_PI= 0
##$NZP= 0
##$OFFSET= 15.70392
##$PC= 1
##$PHC0= -13359.48
##$PHC1= 10.20097
##$PH_mod= 1
##$PKNL= yes
##$PPARMOD= 0
##$PSCAL= 0
##$PSIGN= 0
##$REVERSE= no
##$SF= 200.130013532006
##$SI= 16384
##$SIGF1= 3
##$SIGF2= 2
##$SINO= 400
##$SIOLD= 16384
##$SREGLST= <1H.CDCl3>
##$SSB= 0
##$STSI= 0
##$STSR= 0
##$SW_p= 3612.71676300578
##$SYMM= 0
##$S_DEV= 0
##$TDeff= 0
##$TDoff= 0
##$TI= <>
##$TILT= no
##$TM1= 0
##$TM2= 0
##$TOPLEV= 0
##$USERP1= <user>
##$USERP2= <user>
##$USERP3= <user>
##$USERP4= <user>
##$USERP5= <user>
##$WDW= 1
##$XDIM= 8192
##$YMAX_p= 0
##$YMIN_p= 0
$$ End of Bruker specific parameters
$$ ---------------------------------
##NTUPLES= NMR FID
##VAR_NAME=  TIME,          FID/REAL,        FID/IMAG
##SYMBOL=    X,             R,               I
##VAR_TYPE=  INDEPENDENT,   DEPENDENT,       DEPENDENT
##VAR_FORM=  AFFN,          ASDF,            ASDF
##VAR_DIM=   8192,          8192,            8192
##UNITS=     SECONDS,       ARBITRARY UNITS, ARBITRARY UNITS
##FACTOR=    0.0002496,     1,               1
##FIRST=     0,             0,               0
##LAST=      2.0444736,     0,               0
##MIN=       0,             -53509,          0
##MAX=       2.0444736,     31582,           0
$$ Real data points
##PAGE= N=1
##DATA TABLE= (X++(R..R)), XYDATA
$$ plain form
0 0 0 0 0 0 0 0 0 0 0 0 0 0 0 0 0 0 0 8 -8 8 -8 8 -8 16 -16 16 -23 24 -31 32 -39 40 -48 55 -63 71 -79 87 -95
39 -95 110 -119 135 -149 165 -182 203 -222 245 -271 299 -329 362 -400 440 -487 537 -598 664 -743
59 -743 833 -945 1079 -1245 1461 -1755 2175 -2830 4009 -6805 31582 -5205 -30942 31332
73 31332 5662 -24713 1826 14811 -18930 -11896 345 -15023 -16945 -5966 -17863 -13260 6013
86 6013 6245 -8006 -5029 2575 5021 9860 7554 2016 13071 11845 431 11462 19995 -3400
100 -3400 -12978 9443 7745 -13560 -1386 5419 -14145 -9074 7883 -7980 -22368 -3190 4879
113 4879 -8696 959 12965 -2414 -10366 2181 8290 2450 1793 5530 4303 5777 4791 -2646 -3657
128 -3657 -2376 -3027 1681 6385 507 -7695 -3604 -10 -3224 282 2664 -2527 -450 5556 4335
$$ packed form
0@%%%%%%%%%%%%%%%%%Qj6J6j6J6j6K4l2L2l9M7n5O3p1P9q8J03j18J34j50J66j82
39i5K05k29K54k84L14l47L85m25M67n16N70o28O91p62Q40r27J024j135J262j407
59g43J576j778K024k324K706l216L930n005O839j0814L8387l6787k5737O2274
73C1332k5670l0375K6539J2985l3741P034J2241j5368j922J0979j1897M603J9273
86F013K32j4251K977P604K446M839k306n538J1055j226j1414J1031Q533k3395
100c400r578K2421j698k1305J2174O805j9564N071J6957j5863j4388J9178Q069
113D879j3575R655J2006j5379p952J2547O109n840o57L737j227J474r86p437j011
128c657J281o51M708M704n878q202M091L594l214L506K382n191K077O006j221
$$ plain form
143 4335 402 -205 -1281 -2308 5559 5031 -5460 -3385 3303 -1155 -5854 -443 960 -10181 -8734
158 -8734 4668 5198 -2785 -3873 628 1554 441 2005 2261 4059 6043 4312 4998 5658 397 -4249
174 -4249 -1484 5297 4960 -1740 -5015 -4186 -1468 -4420 -8074 -2724 -1626 -5978 -3785 3304 1200 -7744
190 -7744 -3851 4604 2162 1913 6114 3320 -985 4984 9968 859 -2090 5721 2738 -2496 2921
205 2921 6239 -2608 -8130 -603 2294 -5237 -6253 -2333 -1432 -3223 -1755 1073 -3781 -6735 -1325
220 -1325 2272 1477 1243 3424 1091 -1781 4026 5662 -1714 -1237 6407 6086 -1079 2078 4949 -4506
236 -4506 -5426 5110 4416 -4669 -3578 2772 -1366 -5492 425 145 -6673 -4335 2297 1557 -3616 -1958
252 -1958 829 -1959 -1101 2525 1666 -1693 125 5612 3720 59 2153 2193 -941 228 5608 3775
$$ packed form
143D335l933o07j076j027P867n28j0491K075O688m458m699N411J403j1141J447
158h734J3402N30p983j088M501R26j113J564K56J798J984j731O86O60n261m646
174d249K765O781l37o700l275Q29K718k952l654N350J098m352K193P089k104q944
190g744L893Q455k442k49M201k794m305N969M984r109k949P811k983n234N417
205B921L318q847n522P527K897p531j016L920R01j791J468K828m854k954N410
220a325L597p95k34K181k333k872N807J636p376M77P644l21p165L157K871r455
236d506r20J0536o94r085J091O350m138m126N917k80o818K338O632p40n173J658
252a958K787k788Q58L626q59l359J818N487j892l661K094M0l134J169N380j833
$$ plain form
268 3775 -2918 -120 4160 -914 -3214 165 -226 -4484 -1891 3377 -1466 -5904 -2194 -1592 -3259 -1494
284 -1494 1937 -642 -3312 1957 3146 -934 -678 2389 2208 552 3233 5620 419 -925 2218 3124
300 3124 266 -1189 1553 362 -2068 808 1171 -2955 -4245 -1206 -233 -3326 -1412 846 -3261 -3367
316 -3367 916 669 -3239 -2124 2878 1051 -625 3561 2780 -1472 -262 4226 2829 -786 1954 3571
332 3571 -104 68 2448 427 -2916 -1342 2100 -1217 -2476 -118 -1041 -3709 -2725 538 -1453 -4635
348 -4635 -668 1641 -1519 -1838 1325 724 -2371 207 4619 801 -658 3207 3305 31 645 3607
364 3607 889 -1816 2596 3164 -689 -1304 753 -303 -3753 -850 1002 -3234 -3138 -299 -551 -3320
380 -3320 -2617 364 -1495 -2807 1114 2082 -513 -850 2643 2563 -821 1545 3824 986 505 3463 3228
$$ packed form
268C775o693K798M280n074k300L379l91m258K593N268m843m438L710O02j667J765
284a494L431k579k670N269J189m080K56L067j81j656K681K387n201j344L143R06
300C124k858j455K742j191k430K876L63m126j290L039R73l093J914K258m107j06
316c367M283k47l908J115N002j827j676M186p81m252J210M488j397l615K740J617
332C571l675J72K380k021l343J574L442l317j259K358r23k668R84L263j991l182
348d635L967K309l160l19L163o01l095K578M412l818j459L865R8l274O14K962
364C607k718k705M412N68l853o15K057j056l450K903J852m236R6K839k52k769
380c320P03K981j859j312L921R68k595l37L493q0l384K366K279k838m81K958k35
$$ plain form
397 3228 -600 -217 2715 -399 -2179 998 773 -2604 -2888 590 -1369 -4722 -1621 268 -2840 -2900
413 -2900 117 321 -2807 -1118 2072 85 -1109 2145 2752 519 624 3641 1786 -378 2025 2777
429 2777 -117 -202 2394 1107 -2787 -821 970 -1894 -3000 -267 -87 -2728 -2313 980 -1089 -3117
445 -3117 338 1088 -1398 -865 2602 1480 -1846 833 2984 -19 -832 1823 2337 -772 -78 2220
461 2220 344 -1605 419 1342 -380 -636 1341 345 -2079 400 1017 -1291 -1491 559 505 -1895 -562
478 -562 1389 -1776 -2947 -203 902 -1619 -1711 1105 -83 -1790 1098 1683 -830 -540 2578 2595 -96
495 -96 1653 3146 697 -477 2383 2864 -516 -1327 1758 283 -2251 -1118 -879 -2831 -3383 -1463 -1053
512 -1053 -3348 -2335 -802 -2049 -1630 925 922 -1355 530 4157 2345 657 3141 3735 1271 1282 4055
$$ packed form
397C228l828L83K932l114j780L177k25l377k84L478j959l353L101J889l108o0
413b900L017K04l128J689L190j987j194L254O07k233J05L017j855k164K403P52
429B777k894q5K596j287l894J966J791k864j106K733J80k641M15L293k069k028
445c117L455P50k486N33L467j122l326K679K151l003q13K655N14l109O94K298
461B220j876j949K024R23j722k56J977r96k424K479O17k308k00K050n4k400J333
478e62J951l165j171K744J105k521r2K816j188j707K888N85k513K90L118J7k691
495i6J749J493k449j174K860M81l380q11L085j475k534J133K39j952n52J920M10
512a053k295J013J533j247M19K555lk277J885L627j812j688K484N94k464J1K773
$$ plain form
529 4055 2787 -975 433 1575 -345 -2307 -1260 -1129 -4137 -2991 -361 -2844 -4809 -2020 -320
544 -320 -2341 -2205 1605 918 -1385 1423 3719 1974 704 2575 3463 1402 2103 3270 706 -420
560 -420 949 1013 -1666 -1347 27 -2225 -3744 -548 317 -3127 -3773 -10 630 -2552 -759 1517 -146
577 -146 -1186 1866 2811 -170 -485 2657 1647 -22 1412 1498 -1156 -1473 1764 956 -2033 -755 994
594 994 -50 -995 379 435 -1594 -640 1579 625 -663 212 200 -1103 -333 1713 -512 -2627 -32 787
612 787 -1086 -1826 223 112 -2158 -754 1502 33 -1835 258 1613 860 538 2277 705 -275 2385
629 2385 2791 798 -200 1135 449 -1083 35 353 -1927 -2494 -971 -548 -2182 -2275 -1736 -2134 -1106 299
647 299 177 -955 -237 1693 1076 671 2315 2198 891 1390 3097 2701 -317 -183 1702 703 -617 -326
$$ packed form
529D055j268l762J408J142j920j962J047J31l008J146K630k483j965K789J700
544c20k021J36L810o87k303K808K296j745j270J871Q88k061P01J167k564j126
560d20J369O4k679L19J374k252j519L196Q65l444o46L763O40l182J793K276j663
577a46j040L052R45k981l15L142j010j669J434Q6k654l17L237q08k989J278J749
594I94j044r45J374N6k029R54K219r54j288Q75j2j303P70K046k225k115K595Q19
612G87j873p40K049j11k270J404K256j469j868K093J355p53l22J739j572r80K660
629B385M06j993r98J335o86j532J118L18k280n67J523M23j634r3N39l98J028J405
647B99j22j132P18J930o17m05J644j17j307M99J707l96l018J34J885r99j320K91
$$ plain form
665 -326 -35 -1901 -2500 -346 -800 -2596 -2209 -1185 -1580 -1199 92 -204 -1615 -24 1814 783 200
682 200 1263 1621 724 1493 3210 1387 -389 484 1664 837 171 450 -65 -1572 -335 609 -1387 -2480
700 -2480 -1090 128 -1460 -1144 239 -1490 -2130 195 1652 -106 -1427 919 1193 80 1035 1811
716 1811 -187 -693 1640 2463 -221 -213 1450 -34 -242 1037 800 -1071 -1518 614 462 -882 -612 -436
734 -436 -1266 -1291 302 423 -2172 -1211 532 -345 -1176 109 574 -748 -920 1813 1238 -852 214 1371
752 1371 633 98 1728 1673 -557 229 2000 379 -697 105 395 -900 -298 850 -892 -2489 -839
769 -839 182 -579 -1481 -329 -243 -1720 -100 1050 -81 -1147 194 1543 310 332 1436 837 41
786 41 1215 2072 840 -543 778 887 -411 332 622 -974 -1747 125 413 -1824 -1553 -371 -1086 -1412
$$ packed form
665c26K91j866n99K154m54j796L87J024l95L81J291k96j411J591J838j031n83
682B00J063L58q97P69J717j823j776Q73J180q27o66K79n15j507J237R44j996j093
700b480J390J218j588L16J383j729o40K325J457j758j321K346K74j113R55P76
716A811j998n06K333Q23k684QJ663j484k08J279k37j871m47K132j52j344K70J76
734d36q30k5J593J21k595R61J743q77q31J285M65j322j72K733n75k090J066J157
752A371p38n35J630n5k230P86J771j621j076Q02K90j295O02J148j742j597J650
769h39J021p61r02J152Q6j477J620J150j131j066J341J349j233K2J104n99p96
786D1J174Q57j232j383J321J09j298P43K90j596p73J872K88k237K71J182p15l26
$$ plain form
804 -1412 -330 -150 -1372 -1347 577 966 -437 123 695 95 388 1933 1538 -6 312 1595 1158 524
822 524 744 891 -557 -497 910 61 -1382 -863 119 -596 -1156 49 -674 -1967 -792 435 -314 -1081
840 -1081 -196 528 -431 90 1579 117 -386 821 1726 383 203 1223 803 -70 959 1445 243 -871
858 -871 -103 876 -589 -797 -18 -727 -1181 -241 431 -1271 -1847 -417 -392 -1138 -83 -49 -521 -954 908
877 908 1130 -203 62 1251 621 410 1144 1388 -69 -295 1688 829 -284 161 387 -416 -847 637
895 637 159 -1723 -963 -124 -712 -1385 -571 -255 -1247 -1021 795 -75 -964 -208 909 451 190 1267 952
914 952 -23 822 1481 913 -205 522 884 -369 85 439 44 -933 -356 312 -561 -1384 -169 -799 -1042
933 -1042 -600 -23 -630 -1598 -286 422 -435 -107 413 274 -374 640 1602 360 -170 1183 1089 333 569
$$ packed form
804a412J082J80j222K5J924L89j403N60N72o00K93J545l95j544L18J283m37o34
822E24K20J47j448O0J407q49j443N19R82p15n60J205p23j293J175J227p49p67
840a081Q85P24r59N21J489j462n03J207R05j343j80J020m20q73J029M86j202j114
858h71P68R79j465k08P79p09m54R40O72j702n76J430K5p46J055L4m72m33J862
877I08K22j333K65J189o30k11P34K44j457k26J983q59j113M45K26q03m31J484
895F37m78j882P60Q39n88o73Q14L16r92K26J816q70q89P56J117m58k61J077l15
914I52r75Q45O59n68j118P27L62j253M54L54l95r77N77O68q73q23J215o30k43
933a042M42N77o07r68J312P08q57L28N20j39o48J014R62j242n30J353r4p56K36
$$ plain form
952 569 1230 378 -129 654 823 -564 -404 -10 -371 -945 -281 -76 -1463 -1352 -62 -292 -1072 -672 -122
971 -122 -620 -731 542 580 -483 496 1156 599 353 1120 1276 414 752 1222 752 -176 257 726 133 -524
991 -524 -44 -443 -1300 -800 -486 -722 -1786 -747 -266 -994 -614 -198 -502 -813 63 824 379 266 1096 916
1011 916 675 918 1340 696 297 935 560 -198 -96 275 -305 -908 21 63 -1294 -1312 -315 -458 -1146 -750
1031 -750 -88 -796 -875 145 325 -471 169 802 564 -29 1022 974 -382 80 1206 515 -189 -234 570 -94
1051 -94 -568 323 223 -482 -423 133 -235 -750 -80 43 -793 -237 394 -346 -785 40 412 -434 -591 410
1071 410 8 -438 137 823 275 -315 707 511 -247 470 1032 561 67 357 925 70 61 788 47 -509
1091 -509 -188 180 -399 -1021 -160 -436 -1086 -893 -243 -765 -810 -118 43 -428 34 566 364 21 584 953
$$ packed form
952E69O61q52n07P83J69j387J60L94l61n74O64K05j387J11J290k30p80M00N50
971a22m98j11J273L8j063R79O60n57k46P67J56q62L38M70m70r28M33M69n93o57
991e24M80l99q57N00L14k36j064J039M81p28L80M16l04l11Q76P61m45j13Q30j80
1011I16k41K43M22o44l99O38l75p58J02L71n80o03R29M2j357j8R97j43o88L96
1031g50O62p08p9J020J80p96O40O33k38n93J051m8j356M62J126o91p04m5Q04o64
1051i4m74Q91j00p05N9N56l68n15O70J23q36N56O31p40m39Q25L72q46j57J001
1071D10m02m46N75O86n48n90J022j96p58P17N62m71m94K90N68q55rP27p41n56
1091e09L21L68n79o22Q61k76o50J93O50n22m5O92J61m71M62N32k02l43N63L69
$$ plain form
1111 953 754 539 1174 1085 181 371 659 138 -413 55 366 -707 -599 -375 -770 -1310 -972 -396 -1299 -1208
1131 -1208 -44 -313 -455 -56 347 49 -78 603 938 385 695 1339 905 591 660 1083 423 4 614 90
1151 90 -589 -83 -166 -528 -942 -159 -500 -1064 -617 -236 -130 -707 -172 4 -516 -195 376 124 36 364 572
1172 572 642 258 948 719 344 478 475 354 -362 203 176 -506 -168 383 -37 -768 -288 306 -629 -605 10 -404
1194 -404 -552 -198 1 -174 -703 202 111 -85 212 370 121 4 350 696 54 86 701 242 218 386 894
1215 894 35 -113 392 84 -161 -419 -171 -94 -461 -480 -288 -952 -712 -144 -231 -568 -336 -84 -82 -336 491 -2
1237 -2 -369 191 990 596 170 723 1093 80 300 790 545 100 91 540 -257 -252 -93 -57 -1118 -754 -122 -708
1259 -708 -1396 -467 -444 -632 -359 59 -171 -409 136 678 53 283 488 696 428 693 938 578 -119 853
$$ packed form
1111I53j99k15O35q9r04J90K88n21n51M68L11j073J08K24l95n40L38N76r03R1
1131a208J164k69j42L99M03k98j27O81L35n53L10O44m34l14O9M23o60m19O10n24
1151I0o79N06q3l62m14P83l41n64M47L81J06n77N35J76n20L21N71k52q8L28K08
1172E72P0l84O90k29l75J34lj21p16N65k7o82L38N51m20p31M80N94r35K4O15m14
1194d04j48L54J99j75n29R05r1j96K97J58k49j17L46L46o42L2O15m59k4J68N08
1215H94q59j48N05l08k45k58K48P7l67j9J92o64K40N68q7l37K32K52Kk54Q27m93
1237bl67N60P99l94m26N53L70j013K20M90k45m45rM49p97NJ59L6j061L64O32n86
1259g08o88R29K3j88K73M18k30k38N45N42o25K30K05K08k68K65K45l60o97R72
$$ plain form
1279 853 601 373 40 -12 -57 -264 -57 -61 -927 -764 -422 -348 -426 -529 -148 -338 -557 224 71 -66 -140 349
1301 349 475 90 601 846 84 96 630 454 236 16 688 -93 -421 281 164 -338 -306 257 17 -796 -388
1322 -388 -430 -471 -429 121 -276 -542 -351 91 -12 -361 159 27 -77 263 563 181 96 328 317 307 308 642 358
1345 358 -140 264 553 -59 -610 -76 -85 -424 -307 123 -387 -704 -429 -45 -359 -475 -196 -212 -311 12 308
1366 308 -295 70 344 430 181 742 693 65 446 685 554 104 -273 307 201 -95 57 -181 -496 -241 -269
1387 -269 -210 -623 -601 -222 -787 -371 -265 -217 -422 -51 209 118 2 229 230 184 301 630 395 234 536 498 68
1410 68 201 137 96 -235 -136 97 -456 -612 -460 -392 -553 -704 -184 -428 -896 44 31 -360 -198 -3 7 -66 9
1433 9 481 56 -7 554 353 55 341 754 188 153 388 245 -239 -507 -22 -18 -677 -254 -293 -649 -765 -451
$$ packed form
1279H53k52k28l33n2m5k07K07mq66J63L42P4p8j03L81j90k19P81j53j37p4M89
1301C49J26l85N11K45p62J2N34j76k18k20O72p81l28P02j17n02L2N63k40q13M08
1322c88m2m1M2N50l97k66J91M42j03l49N20j32j04L40L00l82q5K32j1j0JL34k84
1345C58m98M04K89o12n51N34rl39J17M30n10l17K75L84l14j16K79j6r9L23K96
1366C08o03L65K74Q6k49N61m9o28L81K39j31m50l77N80j06k96J52k38l15K55k8
1387b69N9m13K2L79n65M16J06M8k05L71K60r1j16K27Jm6J17L29k35j61L02l8m30
1410F8J33o4m1l31R9K33n53j56J52O8j61j51N20k44m68R40j3l91J62J95J0p3P5
1433IM72m25o3N61k01k98K86M13n66l5K35j43m84k68M85Mo59M23l9l56j16L14
$$ plain form
1455 -451 -470 -663 -767 32 -47 -456 249 -75 51 364 436 477 18 483 755 466 415 410 322 24 -29 311 152
1478 152 -43 56 -314 -747 -434 -64 -308 -522 -332 245 -32 -332 -97 -156 -285 -108 582 -230 -146 432 300
1499 300 63 311 336 357 -98 269 347 -232 264 71 75 -463 231 -35 -276 -305 -329 -386 -456 -287 -35 -281 -332
1522 -332 -44 -136 -101 -158 64 279 -250 404 476 -108 139 356 326 83 173 563 289 202 470 284 -17 55 350
1545 350 186 -310 57 117 -332 -234 -255 -257 -699 -363 -32 -410 -522 -197 142 49 -300 181 0 -131 250 504
1567 504 527 292 716 619 152 229 661 -27 28 145 301 17 -385 -295 -231 -742 -164 -357 -613 -642 -336 -313 -638
1590 -638 -64 189 -211 -174 144 186 393 451 719 442 504 680 535 227 385 352 41 -29 -101 16 -378 -371 -222
1613 -222 -420 -548 -306 1 -713 -413 -264 -376 -601 -257 -31 210 -83 105 376 49 440 547 161 390
$$ packed form
1455d51j9j93j04P99p9m09P05l24J26L13P2M1m59M65K72k89n1nq8k98n3L40j59
1478A52j95R9l70m33L13L70k44k14J90N77k77l00K35n9j29J77O90q12Q4N78j32
1499C00k37K48K5K1m55L67P8n79M96j93Mn38O94k66k41k9k4n7p0J69K52k46n1
1522c32K88r2L5n7K22K15n29O54P2n84K47K17l0k43R0L90k74q7K68j86l01P2K95
1545C50j64m96L67O0m49R8k1km42L36L31l78j12L25L39r3l49M81j81j31L81K54
1567E04K3k35M24r7m67P7M32o88N5J17J56k84m02R0O4n11N78j93k56k9L06K3l25
1590f38N74K53m00L7L18M2K07N8K68k77O2J76j45l08J58l3l11p0p2J17l94PJ49
1613b22j98j28K42L07p14L00J49j12k25L44K26K41k93J88K71l27L91J07l86K29
$$ plain form
1633 390 70 506 120 2 538 420 -162 -237 156 -29 -191 -32 -106 -469 -450 -128 -110 -265 -110 -32 -293 -145
1655 -145 208 7 -58 29 274 60 19 129 435 210 2 390 445 -34 398 233 -84 13 37 67 -205 -93
1677 -93 50 -134 -182 -112 -359 -385 -677 -295 -246 -426 -21 -83 -119 -243 -71 333 -55 -13 414 179 215 436 439 194
1701 194 382 345 87 112 105 58 52 -18 -327 -205 -489 -231 27 -296 -380 -192 -292 -292 -287 27 -176 -354 26 63 407
1726 407 100 498 443 88 342 461 386 305 215 444 105 -88 42 -8 -83 -248 16 -73 -417 -369 -313 -605 -276
1749 -276 -147 -218 -209 -95 73 -236 187 133 -269 495 517 389 386 240 273 343 72 122 -27 2 148 188 -25 -348
1773 -348 -2 221 -402 -223 -260 -305 -63 -393 -117 -308 -262 -42 -86 -159 -185 103 177 -68 409 513 -161 -76 510
1796 510 186 195 159 367 155 196 206 -29 195 -308 80 -55 3 -159 -318 -304 -223 -218 -58 -249 -178 -48 -121 4
$$ packed form
1633C90l20M36l86j18N36j18n82p5L93j85j62J59p4l63J9L22J8j55J55P8k61J48
1655a45L53k01o5Q7K45k14m1J10L06k25k08L88N5m79M32j65l17R7K4L0k72J12
1677i3J43j84m8P0k47k6k92L82M9j80M05o2l6j24J72M04l88M2M27k35L6K21Lk45
1701A94J88l7k58K5pm7op0l09J22k84K58K58l23q4J88j00%NL14k03j78L80L7L44
1726D07l07L98n5l55K54J19p5q1r0K29l39j93J30n0p5j65K64q9l44M8N6k92L29
1749b76J29p1RJ14J68l09M23n4m02P64K2j28lj46L3P0k71N0j49K9J46M0k13l23
1773c48L46K23o23J79l7m5K42l30K76j91M6K20m4p3k6K88P4k45M77J04o74Q5N86
1796E10l24Rl6K08k12M1J0k35K24n03L88j35N8j62j59J4Q1NJ60j91P1J30p3J25
$$ plain form
1820 4 -14 -76 37 80 103 -45 188 462 496 51 124 317 222 225 124 236 -45 -174 -253 154 -148 -315 201 -369
1844 -369 -268 -27 -90 -116 -420 -218 -286 -278 -352 -7 195 193 206 297 83 186 353 61 462 270 328 -12 141 292
1868 292 106 -139 34 -85 -258 -375 -172 -77 -143 -362 -151 -265 -27 -403 -75 -329 -36 101 18 42 210
1889 210 201 216 360 -172 463 167 407 383 356 274 190 312 -117 7 280 6 -77 -31 -322 -143 -532 -312 -364
1912 -364 -533 -142 102 37 -186 26 279 -240 60 328 -156 274 452 404 379 111 431 147 0 210 471
1933 471 139 189 -85 -90 -271 -120 -302 -152 -366 -426 -450 -385 -268 -158 -273 -438 51 -253 -79 179 216 39
1955 39 -259 210 71 380 241 197 245 2 183 194 147 -256 -222 -101 9 -41 42 -430 -4 -13 -215 -184 -194 -26
1979 -26 -60 55 -104 -250 -165 65 133 30 69 44 -84 263 62 286 221 145 28 132 309 230 185 -90 17
$$ packed form
1820Dj8o2J13M3K3j48K33K74L4m45P3J93r5Lj01J12k81j29p9M07l02j67N16n70
1844c69J01K41o3k6l04K02o8Qp4L45K02kJ3R1k14J03J67k92M01j92N8l40J53J51
1868B92j86k45J73j19j73j17K03R5o6k19K11j14K38l76L28k54K93J37q3K4J68
1889B10rJ5J44n32O35k96K40k4k7q2q4J22m29J24K73k74q3M6k91J79l89K20n2
1912c64j69L91K44o5k23K12K53n19L00K68m84M30J78m8k5k68L20k84j47K10K61
1933D71l32N0k74nj81J51j82J50k14o0k4O5J17J10j15j65M89l04J74K58L7j77
1955C9k98M69j39L09j39m4M8k43J81J1m7m03L4J21J10n0Q3m72M26rk02L1j0J68
1979b6l4J15j59j46Q5K30O8j03L9k5j28L47k01K24o5p6j17J04J77p9m5k75J07
$$ plain form
2002 17 -239 -118 -29 -358 -327 -291 122 -71 -277 -239 -38 -51 -143 -257 -36 -118 91 285 243 39 138 222 399 258
2026 258 241 225 182 330 226 141 53 -9 -301 224 53 -117 -369 -144 -278 -487 -442 -151 -1 -305 -303 -77 -13
2049 -13 -259 13 75 243 338 11 93 385 204 472 398 143 111 -70 128 131 -225 -284 -102 -147 -24 -123 1 -350
2073 -350 -554 -144 -76 -352 -345 -373 325 65 36 85 168 191 287 275 339 233 321 61 99 172 266 -65 -104 -31 -19 -17 -141
2100 -141 -199 221 -179 -177 -238 -171 -126 -128 -51 -19 -330 -95 235 -184 -338 205 106 58 156 257 166 361 143 52 175
2125 175 109 116 44 167 127 178 -356 -57 -96 -213 -286 -9 -65 -371 81 -175 -179 -205 -183 -13 -43 -64 97 59 -56
2150 -56 245 14 25 -107 -22 81 6 153 103 216 -146 -116 279 142 143 15 -10 21 -301 -25 -202 -367 -203
2173 -203 -34 -128 -124 -308 -94 -50 -156 -77 -132 68 -213 20 238 156 232 167 206 31 59 232 279 180 -97 -250
$$ packed form
2002A7k56J21Q9l29L1L6M13j93k06L8K01j3r2j14K21q2K09J94m2k04R9Q4J77j41
2026B58j7j6m3J48j04q5q8o2k92N25j71j70k52K25j34k09M5K91J50l04KK26O4
2049a3k46K72O2J68R5l27Q2K92j81K68p4k55l2j81J98Ll56n9J82m5J23r9J24l51
2073c50k04M10O8k76Pk8O98k60k9M9Q3K3R6j2O4j06Q8k60L8P3R4l31l9P3J2Kj24
2100a41n8M20m00Ko1O7M5kP7L2l11K35L30m19j54N43r9m8R8J01r1J95k18r1J23
2125A75o6Pp2J23m0N1n34K99l9j17p3K77n6l06M52k56mk6K2J70l0k1J61l8j15
2150e6L01k31J1j32Q5J03p5J47n0J13l62L0L95j37Jj28k5L1l22K76j77j65J64
2173b03J69r4Mj84K14M4j06P9n5K00k81K33K18q2P6o5L9j75K8J73M7r9k77j53
$$ plain form
2197 -250 43 -77 -130 -181 -188 -13 -203 -136 -50 -324 16 150 -280 -80 -33 90 36 0 48 -40 79 103 276 139
2221 139 206 221 110 201 139 62 -43 -45 76 -29 -37 -401 -104 -201 -69 5 -270 -79 -394 -169 42 -208 -67 -27
2245 -27 -295 55 100 327 123 169 60 147 82 431 149 140 -17 147 -29 159 -116 176 27 31 16 -1 -30 -130
2269 -130 -56 -118 -406 -46 58 88 -289 74 -62 166 -71 121 167 -118 168 267 100 264 215 322 162 -170
2291 -170 5 65 86 -89 -177 -239 37 -172 10 -31 19 -64 -321 22 -308 -143 -11 -16 -4 -181 129 87 -17 64
2315 64 -31 207 359 -50 329 130 242 -4 252 113 115 120 -25 49 11 31 27 -269 -255 114 115 -204 -202 -113 -72 97
2341 97 -27 -111 175 107 71 440 230 237 266 97 296 59 232 -80 -149 -35 -85 -144 189 75 35 -75 48 -152
2365 -152 -330 -187 -207 11 -120 -280 -38 92 -97 -48 -159 -11 130 216 237 389 292 70 341 46 139 111
$$ packed form
2197b50K93j20n3n1pJ75j90O7Q6k74L40J34m30K00M7J23n4l6M8q8J19K4J73j37
2221A39O7J5j11R1o2p7j05kJ21j05ql64K97r7J32P4k75J91l15K25K11k50J41M0
2245b7k68L50M5K27k04M6j09Q7o5L49k82rj57J64j76J88k75K92j49Mj5j7k9j00
2269a30P4o2k88L60J04L0l77L63j36K28k37J92M6k85K86R9j67J64m9J07j60l32
2291a70J75O0K1j75q8o2K76k09J82m1N0q3k57L43l30J65J32nJ2j77L10m2j04Q1
2315F4r5K38J52m09L79j99J12k46K56j39KNj45P4l8K0mk96J4L69Jl19KQ9M1J69
2341I7j24q4K86o8l6L69k10PK9j69J99k37J73l12o9J14n0n9L33j14m0j10J23k00
2365a52j78J43k0K18j31j60K42J30j89M9j11J48J41Q6K1J52r7k22K71k95R3k8
$$ plain form
2387 111 225 -73 1 25 -18 -141 -62 26 -247 -29 -193 19 134 -279 -46 -97 -325 34 26 110 -57 140 106
2410 106 162 232 -1 95 217 228 148 180 8 59 133 140 211 140 -88 -62 185 58 -247 -104 305 99 32 59 -102
2435 -102 -201 -262 -113 -235 -27 -20 -26 187 64 85 50 -108 16 -71 252 70 -13 245 -61 -53 157 -13 -55 -62 -257
2460 -257 7 -448 -157 -168 -82 -32 118 -61 -202 -36 -173 -22 -115 -142 15 29 -86 84 119 46 64 72 336 55
2484 55 -123 238 65 115 47 5 230 158 -49 -69 7 -84 -234 -129 54 38 76 -214 -158 -242 -344 -295 -66 95
2508 95 -25 -72 70 45 12 -23 92 121 293 107 -70 -30 -124 -72 -225 127 -48 -17 -336 320 -180 -301 -250 -271
2532 -271 -100 -238 -256 -26 -107 -195 196 -34 151 -65 107 32 47 432 249 265 51 5 134 46 113 124 -142
2555 -142 210 80 43 201 -226 -51 -18 -95 -22 -170 -302 -270 -35 29 -3 -45 128 54 60 117 92 -30 202 247 160
$$ packed form
2387A11J14k98P4K4m3j23P9Q8k73K18j64K12J15m13K33n1k28L59qQ4j67J97l4
2410A06N6P0k33R6J22J1q0L2j72N1P4PP1p1k28K6K47j27l05J43M09k06o7K7j61
2435a02r9o1J49j22K08PoK13j23K1l5j58J24q7L23j82q3K58l06QK10j70m2pj95
2460b57K64m55K91j1Q6N0J50j79j41J66j37J51r3k7J57J4j15J70L5p3J8QK64k81
2484E5j78L61j73N0o8m2K25p2k07k0P6r1j50J05J83j6L8k90N6q4j02M9K29J61
2508I5j20m7J42k5l3l5J15K9J72j86j77M0r4N2j53L52j75L1l19O56n00j21N1k1
2532b71J71j38j8K30q1q8L91k30J85k16J72p5J5L85j83J6k14m6J29q8O7J1k66
2555a42L52j30l7J58m27J75L3p7P3j48j32L2K35O4l2m2J73p4ON7k5j22K32M5q7
$$ plain form
2580 160 -91 285 163 231 59 242 163 46 267 -137 -115 36 -248 -60 -164 -70 -160 -224 -31 -159 -43 142
2602 142 131 29 15 -7 -246 79 -273 -172 190 342 207 91 125 194 24 164 -116 66 -6 -139 50 155
2624 155 -122 194 0 -159 -255 -274 -112 -268 83 -24 64 52 -121 94 231 -184 74 -57 -55 54 -14 94
2646 94 118 76 405 64 12 39 -80 -22 25 -33 -124 -7 -114 -65 -102 -287 -215 -156 -52 191 -149 -184 41 12 48
2671 48 395 228 254 500 57 16 242 -46 -230 -23 129 -101 0 -197 3 82 -258 -32 -192 -401 -30
2692 -30 -53 86 -171 -148 -190 -96 -46 -103 -114 98 128 -105 142 33 132 101 -49 184 182 -200 -51 214 46 -35 182
2717 182 59 42 -76 -10 -12 74 -349 -156 5 -193 42 -203 -41 -150 -166 228 12 -18 17 -57 -70 199 180 -4
2741 -4 71 22 117 -54 106 -17 174 241 46 16 129 -106 -20 -72 -28 -90 -100 -87 -167 64 -50 74 -5 -259 106
$$ packed form
2580A60k51L76j22O8j72J83p9j17K21m04K2J51k84J88j04R4r0o4J93j28J16J85
2602A42j1j02j4k2k39L25l52J01L62J52j35j16L4O9j70J40k80J82p2j33J89J05
2624A55k77L16j94j59r6j9J62j56L51j07Q8j2j73K15J37m15K58j31KJ09o8J08
2646I4K4m2L29l41n2K7j19N8M7n8r1J17j07M9l7j85P2N9J04K43l40l5K25k9L6
2671D8L47j67K6K46m43m1K26k88j84K07J52k30J01j97K00P9l40K26j60k09L71
2692c0k3J39k57K3m2R4N0n7j1K12L0k33K47j09R9l1j50K33kl82J49K65j68q1K17
2717A82j23j7j18O6kQ6m23J93J61j98K35k45J62j09j6L94k16l0L5p4j3K69j9j84
2741dP5m9R5j71J60j23J91O7j95l0J13k35Q6n2M4o2j0J3q0K31j14J24p9k54L65
$$ plain form
2766 106 150 -116 -114 -120 171 -39 40 406 158 241 85 -51 223 -242 119 -82 69 -180 -19 3 -42 -238 213
2789 213 -63 113 -60 -31 -162 -63 -112 -453 208 -232 -291 -4 101 -26 123 449 322 28 232 412 -95
2810 -95 157 65 174 93 17 32 -141 219 -21 -45 -380 113 99 -78 -154 -38 -90 -99 -287 -321 28 271 -80 26
2834 26 -170 -239 151 31 244 60 -88 245 -174 55 -4 -98 201 24 105 107 71 98 4 -199 -105 94 -353 -303
2858 -303 -170 -82 -130 101 192 -52 39 201 283 28 44 -158 -225 -238 -2 221 151 139 -61 23 -211 74 73 88 168
2883 168 -30 -180 -187 173 -197 17 -52 -347 227 -71 -112 -69 -193 -22 35 -43 428 149 20 -176 -66 106
2905 106 149 216 458 -139 72 -38 -102 -193 -166 49 -71 90 48 -117 -3 -32 -210 -101 -35 -31 -104 27 -103 -256
2929 -256 180 69 14 -99 -27 277 85 227 72 167 253 116 63 79 66 -260 -254 337 -71 -67 -233 -105 40 -257
$$ packed form
2766A06M4k66KoK91k10P9L66k48Q3j56j36K74m65L61k01J51k49J61K2m5j96M51
2789B13k76J76j73K9j31R9m9l41O61m40n9K87J05j27J49L26j27k94K04J80n07
2810i5K52r2J09q1p6J5j73L60k40k4l35M93j4j77p6J16n2rj88l4L49K43l51J06
2834B6j96o9L90j20K13j84j48L33m19K29n9r4K99j77Q1Kl6K7r4k03R4J99m47N0
2858c03J33Q8m8K31R1k44R1J62Q2k55J6k02o7j3K36K23p0j2k00Q4k34K85jJ5Q0
2883A68j98j50pL60l70K14o9k95N74k98m1M3j24J71N7p8M71k79j29j96J10J72
2905A06M3O7K42n97K11j10o4r1K7K15j20J61m2j65J14k9j78J09O6Mp3J31j30j53
2929b56M36j11n5j13P2L04j92J42j55R5Q6j37n3J6j3l26ON91m08Mj66J28J45k97
$$ plain form
2953 -257 -152 -99 146 9 -112 -158 78 70 103 -18 -135 84 26 -221 -155 40 -104 -15 -43 91 -4 133 55 -99
2977 -99 259 16 -35 56 -63 43 -116 -416 66 -43 -257 -10 -148 2 -145 -9 -335 -140 5 -185 -74
2998 -74 -90 -72 -298 335 5 230 -67 133 126 166 109 61 -40 70 66 75 389 -84 12 -544 -358 -38 -244 -155 -476
3023 -476 -124 -133 -207 -126 -224 312 260 -106 -51 -256 391 156 130 109 98 -240 298 165 313 32 -40 314 66 43
3047 43 97 42 -97 -92 -43 -130 -88 -75 76 95 54 6 -7 -124 -162 175 173 150 13 94 12 95 -39 164 138 -16 122
3074 122 -102 -120 -131 310 26 -116 82 -140 -101 -173 -9 -166 -104 -354 -37 -271 127 172 237 -255 -43 -183
3096 -183 218 62 103 77 37 344 -4 -150 -36 221 -18 -144 -119 158 -179 -4 11 84 -42 -2 17 -41 -387
3119 -387 -114 -46 -195 -119 -166 -117 -1 256 24 -85 -68 -92 141 253 -42 -63 83 84 -131 -33 166 27 -52 -233
$$ packed form
2953b57J05N3K45j37j21m6K36qL3j21j17K19n8k47O6J95j44Q9k8J34r5J37p8j54
2977i9L58k43n1R1j19J06j59l00M82j09k14K47j38J50j47J36l26J95J45j90J11
2998g4j6J8k26O33l30K25k97K00pM0n7m8j01J10mRL14m73R6n56J86L20k06Q9l21
3023d76L52rp4Q1r8N36n2l66N5k05O47k35k6k1j1l38N38j33J48k81p2L54k48k3
3047D3N4n5j39NM9q7M2J3J51J9m1m8j3j17l8L37kk3j37Q1q2Q3j34K03k6j54J38
3074A22k24j8j1M41k84j42J98k22L9p2J64j57O2k50L17k34L98M5O5m92K12j40
3096a83M01j56M1k6m0L07l48j46J14K57k39j26K5K77l37J75J5P3j26M0J9n8l46
3119c87K73O8j49P6m7M9J16K57k32j09J7k4K33J12k95k1J46Jk15R8J99j39p9j81
$$ plain form
3143 -233 340 75 374 -162 178 33 58 -102 -71 -75 -126 22 262 -77 137 192 -205 205 61 -44 -176 82
3165 82 -15 -44 -198 117 222 165 -209 290 -140 -216 125 38 -160 94 -45 -67 -86 -62 -34 -37 -143 -118 -30 -44 100
3190 100 -123 -58 82 -230 136 37 102 176 -26 144 -38 -23 189 73 -112 -104 61 -10 -35 63 -25 125 137 -19
3214 -19 -91 -154 -105 74 241 -34 -142 131 11 -131 -26 -43 -243 122 -158 224 129 339 39 -151 -5 170
3236 170 163 -80 210 82 -234 -56 16 -136 165 -296 92 117 -2 -196 -188 50 101 -174 -216 241 -131 160 -123
3259 -123 -130 -89 40 191 48 -128 -94 143 11 380 -92 76 260 147 107 115 -217 -319 31 -189 63 -85
3281 -85 -154 -86 177 71 32 55 100 -257 221 21 -8 -5 52 89 143 28 15 -70 137 180 -107 41 244 159 -58
3306 -58 14 -67 -131 -183 154 30 -37 52 -280 -311 -170 -181 256 -41 -202 -353 2 127 66 13 206 163 -146 222
$$ packed form
3143b33N73k65K99n36L40j45K5j60L1mn1J48K40l39K14N5l97M10j44j05j32K58
3165H2r7k9j54L15J05n7l74M99m30p6L41q7j98K54j39k2j9K4K8lj06K5Q8j4J44
3190A00k23O5J40l12L66r9O5P4k02J70j82J5K12j16j85QJ65p1k5R8q8J50J2j56
3214a9p2o3M9J79J67k75j08K73j20j42J05j7k00L65k80L82r5K10l00j90J46J75
3236A70pk43K90j28l16J78P2j52L01m61L88K5j19j94QK38N1k75m2M57l72K91k83
3259a23pM1J29J51j43j76L4K37j32L69m72J68J84j13m0Ql32j02L50k20K52j48
3281h5o9O8K63j06l9K3M5l57M78k00k9LN7L7N4j15j3q5K07M3k87J48K03q5k17
3306e8P2q1o4n2L37j24o7Q9l32l1J41j1M37k97j61j51L55J25o1n3J93m3l09L68
$$ plain form
3330 222 102 -7 201 -24 -105 243 311 -336 -266 -78 45 169 -205 -18 -88 68 -168 -40 -155 -172 56 209
3352 209 14 -1 -192 -6 38 23 93 77 277 68 -1 -7 169 -157 171 211 -88 210 33 -88 -100 137 -29
3375 -29 1 107 -208 -158 -261 -51 -257 132 -91 -17 76 -78 -49 137 -141 215 -71 -200 15 168 236 187 88
3398 88 -36 -318 -6 72 -249 -71 -49 49 -165 -85 134 -4 -103 -207 43 -267 -251 100 -205 177 117 -117 -99
3421 -99 99 -187 153 -202 -45 116 7 -13 71 216 237 260 -17 51 -126 58 152 -240 -208 -138 -62 -38 43 -58
3445 -58 -200 -59 -191 -22 -13 -66 38 -86 -46 88 386 104 22 157 74 119 128 -59 87 188 193 11 -50 -164
3469 -164 271 -151 -213 -8 -348 -7 -120 -29 81 -251 -267 -46 219 -137 159 202 -57 -87 245 11 92 -159
3491 -159 -41 -171 137 -158 371 143 -57 88 2 -80 -255 104 -61 232 162 -43 -102 -91 -31 -74 -115 -11 -249
$$ packed form
3330B22j20j09K08k25q1L48O8o47P0J88J23J24l74J87p0J56k36J28j15j7K28J53
3352B09j95j5j91J86M4j5P0j6K00k09o9oJ76l26L28M0k99K98j77j21j2K37j66
3375b9L0J06l15N0j03K10k06L89k23P4R3j54K9J86k78L56k86j29K15J53O8m9r9
3398H8j24k82L12P8l21J78K2R8k14Q0K19j38r9j04K50l10J6L51l05L82o0k34J8
3421i9J98k86L40l55J57J61j09k0Q4J45K1K3k77O8j77J84R4l92L2P0P6K4Q1j01
3445e8j42J41j32J69Rn3J04j24M0J34K98k82q2J35q3M5Rj87J46J01Nj82o1j14
3469a64M35m22o2K05l40L41j13R1J10l32j6K21K65l56K96M3k59l0L32k34Q1k51
3491a59J18j30L08k95N29k28k00J45q6q2j75L59j65K93p0k05n9J1O0m3m1J04k38
$$ plain form
3514 -249 -221 120 -7 -288 70 276 -38 -45 -219 -102 275 248 249 93 -126 55 -6 58 66 -119 188 -100 93
3537 93 37 -38 -21 -15 -69 107 -39 -124 -106 245 24 -21 229 -55 78 -282 310 -158 249 -12 -153 -74 -93 175
3561 175 -15 88 230 -50 252 281 94 -61 -32 78 -116 -62 -112 83 155 52 86 2 -20 99 -48 142 144
3584 144 45 129 177 -188 111 301 -67 -77 277 30 48 53 -8 159 35 -63 -70 -147 -106 188 -189 -42 -167 27
3608 27 -79 41 15 -26 19 -99 333 305 110 9 272 26 19 -41 212 -208 0 -60 187 -18 -33 71 -27 65
3632 65 -82 74 -92 50 209 -131 136 -46 -131 87 48 -67 -112 35 -224 -227 9 -30 53 -265 -311 205 263
3655 263 167 3 -35 -60 -2 13 31 84 -87 80 73 214 -11 81 -12 -181 -276 -58 -14 -69 123 7 -137 -35 -51
3680 -51 -16 79 23 -16 -37 -232 47 90 155 17 -46 21 -219 -133 208 -26 228 -56 -34 -114 36 -125 -156 73 31
$$ packed form
3514b49K8L41j27k81L58K06l14pj74J17L77k7Jj56k19J81o1O4Qj85L07k88J93
3537I3n6p5J7On4J76j46q5J8L51k21m5K50k84J33l60N92m68M07k61j41P9j9K68
3561A75j90J03J42k80L02K9j87j55K9J10j94N4n0J95P2j03L4q4k2J19j47J90K
3584A44r9Q4M8l65K99J90l68j0L54k47J8No1J67j24r8pp7M1K94l77J47j25J94
3608B7j06J20k6m1M5j18M32k8j95j01K63k46po0K53m20K08o0K47k05j5J04r8R2
3632F5j47J56j66J42J59l40K67j82q5K18l9j15m5J47k59lK36l9Q3l18m6N16N8
3655B63r6j64l8k5N8J5J8N3j71J67pJ41k25R2r3j69r5K18M4n5J92j16j44J02j6
3680e1L5R5n6l9k1j95K79M3O5j38o3O7k40Q6L41k34K54k84K2q0J50j61l1K29m2
$$ plain form
3705 31 -67 27 59 -33 -91 202 -172 -132 159 123 101 150 178 70 -114 48 202 -21 87 11 148 -253 -50 -156
3729 -156 141 -147 -60 65 -160 -179 179 -185 5 -8 191 -161 93 -54 157 128 -142 -2 -77 145 -65 160
3751 160 -66 144 61 -28 188 -4 -70 34 -87 -44 -61 -79 -191 -223 -124 -101 99 -67 -239 -124 -39 -235 -124
3774 -124 92 79 -175 -253 -374 -177 -1 181 138 66 100 193 7 -114 -117 158 -91 145 -182 64 -124 -178 -220
3797 -220 -338 31 -80 -215 -244 -89 13 -161 -263 -107 84 132 30 -184 -20 117 140 2 -93 165 -275
3818 -275 -67 282 55 -72 -9 480 22 -78 4 -54 153 -61 -55 -108 -76 14 34 -271 113 -120 38 -188 143
3841 143 38 -69 -25 128 61 135 -42 39 110 42 351 141 6 46 143 38 -166 47 -226 14 -133 218 -123
3864 -123 -90 75 -137 -102 -9 228 -81 59 106 280 -122 -102 -14 115 -121 -15 -125 -7 89 -30 -12 -57 69
$$ packed form
3705C1r8R4L2r2n8K93l74M0K91l6k2M9K8j08j84J62J54k23J08p6J37m01K03j06
3729a56K97k88Q7J25k25j9L58l64J90j3J99l52K54j47K11k9k70J40p5K22k10K25
3751A60k26K10q3q9K16j92o6J04j21M3j7j8j12l2R9K3K00j66j72J15Q5j96J11
3774a24K16j3k54p8j21J97J76J82m3p2L4R3j86j21lK75k49K36l27K46j88n4m2
3797b20j18L69j11j35k9J55J02j74j02J56J91M8j02k14J64J37K3j38r5K58m40
3818b75K08L49k27j27O3M89m58j00Q2n8K07k14On3L2R0K0l05L84k33J58k26L31
3841A43j05j07M4J53o7P4j77Q1P1o8L09k10j35M0R7j05k04K13k73K40j47L51l41
3864a23L3J65k12L5R3K37l09J40M7J74m02K0Q8J29k36J06j10J18R6j19J8m5J26
$$ plain form
3887 69 267 88 198 12 -173 -15 -173 286 -147 -95 -167 -240 -207 -54 25 101 -289 -350 159 -347 -56 285 -10
3910 -10 188 -100 59 -161 19 -105 327 -133 198 220 2 142 155 149 119 4 -207 92 120 -178 -38 -210
3932 -210 256 125 -114 -157 -197 -175 -1 -122 170 307 2 109 -19 -239 181 72 97 35 -52 85 237 135
3954 135 -96 -55 -22 12 63 81 -44 23 -249 58 -47 -114 -76 -153 -2 -107 -111 -81 -60 -188 107 -160 -90 -69 -99
3979 -99 350 184 95 27 -74 26 239 107 64 60 30 -26 34 174 -17 -396 188 46 90 71 76 2 192 -213 -20
4004 -20 45 104 -75 12 -123 -41 33 59 12 103 -37 -150 132 215 -46 -64 128 -124 65 0 -2 -81 -9 -196 -253 -85
4030 -85 245 182 -170 -177 -208 60 -83 -17 -123 -196 119 -68 114 154 16 -16 -33 246 -54 314 177 31 -3 266
4054 266 -39 37 147 48 -35 -386 -30 -12 28 -312 -289 -64 -141 -77 91 -265 78 -58 120 5 -288 145 242
$$ packed form
3887F9J98j79J10j86j85J58j58M59m33N2p2p3L3J53P9P6l90o1N09n06K91L41k95
3910a0J98k88J59k20J80j24M32m60L31K2k18J40J3ol0j15k11K99K8k98J40j72
3932b10M66j31k39m3m0K2J74j21K92J37l05J07j28k20M20j09K5o2q7J37J52j02
3954A35k31M1L3L4N1J8j25O7k72L07j05o7L8p7J51j05mL0K1j28K95k67P0K1l0
3979i9M49j66q9o8j01J00K13j32m3ml0n6O0J40j91l79N84j42M4j9Np4J90m05J93
4004b0O5N9j79Q7j35Q2P4K6m7R1j40j13K82Q3k61j8J92k52J89o5kp9P2j87n7J68
4030h5L30o3l52pl1K68j43O6j06p3L15j87J82M0j38l2j7K79l00L68j37j46l4K69
4054B66l05P6J10r9q3l51L56J8M0l40K3K25p7O4J68l56L43j36J78j15k93M33R7
$$ plain form
4077 242 38 70 75 226 361 -129 284 243 -89 70 96 174 -57 39 -56 95 63 60 23 -56 48 183 -212 -12
4101 -12 -298 -184 -113 -139 -58 -159 -128 -79 91 173 236 15 34 92 -89 107 195 -259 -35 12 161 -4 -119 -250
4125 -250 -325 -41 -166 -72 -164 18 -76 73 18 -42 -101 -44 -61 131 36 36 -290 326 -13 239 40 162 65 214
4149 214 190 112 137 73 -128 37 67 6 -329 110 90 -116 -155 -97 -111 -187 57 -228 53 -104 -110 -47 2 138 -46
4174 -46 -97 129 -199 192 -97 -97 -238 168 244 148 126 319 -11 169 -14 190 -138 -11 -28 -129 170 53 -139
4197 -139 -245 -72 117 -1 -199 -212 -254 167 183 38 8 -199 261 -231 90 267 24 -11 15 -88 103 188
4219 188 152 -140 210 -338 -32 -159 -117 -236 -118 -157 -136 -132 -186 -74 -265 59 248 -157 -58 -19 118 8 -69
4242 -69 156 131 -78 -44 -27 -60 17 184 40 -28 143 -37 -159 -32 -158 -102 29 -100 -195 -6 17 -113 89
$$ packed form
4077B42k04L2NJ51J35m90M13m1l32J59K6P8k31R6r5J51l2ll7p9J04J35l95K00
4101a2k86J14P1k6Q1j01L1M9J70Q2O3k21J9N8j81J96Q8m54K24M7J49j65j15j31
4125b50p5K84j25R4r2J82r4J49n5o0n9N7j7J92r5%l26O16l39K52j99J22r7J49
4149B14k4p8K5o4k01J65L0o1l35M39k0k06l9N8j4p6K44k85K81j57oO3M9J36j84
4174d6n1K26l28L91k89%j41M06P6r6k2J93l30J80j83K04l28J27j7j01K99j17j92
4197a39j06J73J89j18j98j3m2M21J6j45l0k07M60m92L21J77k43l5K6j03J91Q5
4219A88l6k92L50n48L06j27M2j19J18l9K1Mn4J12j91L24J89m05R9L9J37j10p7
4242f9K25k5k09L4J7l3P7J67j44o8J71j80j22J27j26N6J31j29r5J89K3j30K02
$$ plain form
4265 89 -69 64 -80 -108 -6 20 -69 59 280 -101 149 -70 167 148 -218 -53 10 66 -69 -68 110 15 2 -217
4289 -217 211 15 -117 -45 -108 -201 -178 62 91 16 -21 -108 -17 164 99 31 270 116 50 230 -15 103 -132 29
4313 29 -140 61 36 230 -79 -38 -155 -55 97 -307 -91 -76 -20 -234 75 -25 56 -29 -96 27 -78 131 -142
4336 -142 229 24 104 291 82 210 30 349 -104 63 246 -8 221 95 -147 -14 47 19 176 15 -172
4357 -172 58 42 -116 -276 -121 -120 -214 -169 270 50 10 -93 188 140 -93 28 274 72 -233 -6 -209 218
4379 218 -39 215 160 -193 29 -34 35 -71 -112 -172 -138 -5 192 -62 -129 -90 -167 -17 -76 92 -214 147 -213
4402 -213 42 38 174 -38 -71 -22 242 -80 27 234 -54 -25 139 -33 79 253 -72 -70 -159 68 88 -274 76
4425 76 -158 201 -181 -3 -104 -200 -59 -48 -56 17 357 21 -18 -126 351 -123 57 54 -89 5 232 -40 142
$$ packed form
4265H9j58J33j44k8J02K6q9J28K21l81K50k19K37j9l66J65O3N6j35JJ78r5j3k19
4289b17M28j96j32P2o3r3K3K40K9p5l7q7R1J81o5o8K39j54o6J80k45J18k35J61
4313B9j69K01k5J94l09M1j17J00J52m04K16J5N6k14L09j00Q1q5o7J23j05K09k73
4336a42L71k05Q0J87k09J28j80L19m53J67J83k54K29j26k42J33O1k8J57j61j87
4357a72K30j6j58j60J55Jr4M5M39k20m0j03K81m8k33J21K46k02l05K27k03M27
4379B18k57K54n5l53K22o3O9j06m1o0L4J33J97k54o7L9p7J50n9J68l06L61l60
4402b13K55mJ36k12l3M9K64l22J07K07k88K9J64j72J12J74l25Kq9K27K0l62L50
4425G6k34L59l82J78j01r6J41J1qP3L40l36l9j08M77m74J80lj43R4K27k72J82
$$ plain form
4448 142 -158 -114 155 -6 -250 -116 -212 -94 -137 290 67 28 8 -64 180 120 55 -25 -113 -28 36 4 -100 -3 315
4473 315 -174 129 189 -76 264 -211 84 -125 93 64 -244 -160 23 -67 -149 34 -210 206 66 71 132 111 150
4496 150 -134 23 -11 -99 -64 274 120 -38 268 135 1 172 -124 -69 120 -357 319 27 11 -4 -391 -211
4518 -211 -44 -71 -24 -92 -139 -221 -224 111 24 -72 99 -74 21 222 -82 115 252 -122 33 162 5 -4 -44 100
4542 100 -133 -88 -81 -22 -131 -104 -80 47 -122 -41 127 238 47 -65 34 -99 -253 -211 -415 56 139 -16 219
4565 219 -18 24 121 266 234 -72 -65 134 30 169 2 124 294 10 -55 177 8 -14 -86 -43 -106 -79 -214 -101
4589 -101 -206 -90 100 -171 171 -137 -152 380 -229 40 76 20 133 -129 -30 137 -143 -128 -59 -138 12 -81 0
4612 0 -157 125 221 -119 -19 -242 270 -138 57 46 150 389 181 -322 -270 126 107 -35 16 402 7 -67 -147
$$ packed form
4448A42l00M4K69j61k44J34r6J18m3M27k23l9k0p2K44o0o5q0q8Q5O4l2j04R7L18
4473C15m89L03O0k65L40m75K95k09K18k9l08Q4J83r0q2J83k44M16j40NO1k1L9
4496A50k84J57l4q8L5L38j54j58L06j33j34J71k96N5J89m77O76k92j6j5l87J80
4518b11J67k7M7o8m7q2lL35q7r6J71j73R5K01l04J97J37l74J55J29j57rm0J44
4542A00k33M5PN9j09K7K4J27j69Q1J68J11j91j12R9j33j54M2k04M71Q3j55K35
4565B19k37M2R7J45l2l06PJ99j04J39j67J22J70k84o5K32j69k2p2M3o3K7j35J13
4589a01j05J16J90k71L42l08j5N32o09K69L6n6J13k62R9J67k80J5O9p9J50r3Q1
4612@j57K82R6l40J00k23N12m08J95j1J04K39k08n03N2L96j9j42N1L86l95p4q0
$$ plain form
4635 -147 377 406 46 28 29 235 -50 173 -21 -272 55 -74 -46 23 23 15 -106 -37 -21 40 83 -56 -41 52 66 56
4661 56 213 11 343 194 -129 -72 -4 99 56 7 141 250 -96 245 55 -199 -77 328 15 62 4 41 13
4684 13 -36 157 -18 151 -242 21 32 75 -52 238 -104 108 15 -19 -171 68 70 60 4 -239 9 -31 160 106
4708 106 298 100 -187 -158 171 -74 -372 -16 -167 -31 -253 79 -165 -27 17 218 -97 -89 -21 132 13 131
4730 131 320 198 102 150 19 100 47 -129 -6 -101 -74 295 19 -178 135 31 212 -113 -15 -31 -291 -115 -112
4753 -112 -46 94 -120 75 -35 -28 -58 260 -70 76 11 -128 239 -59 -76 101 -149 -97 81 157 182 -53 -89
4776 -89 65 -114 56 -162 117 -16 -277 35 -136 -74 143 -200 130 211 0 46 -7 62 145 -30 207 44
4798 44 29 -77 238 57 244 155 -22 224 -147 -9 -3 25 -135 -123 -158 185 27 69 -173 17 -290 -83 -15
$$ packed form
4635a47N24K9l60j8JK06k85K23j94k51L27j29K8O9%qj21O9J6O1M3j39J5R3J4j0
4661E6J57k02L32j49l23N7O8J03m3m9J34J09l46L41j90k54J22M05l13M7n8L7k8
4684A3m9J93j75J69l93K63J1M3j27K90l42K12r3l4j52K39Kj0n6k43K48m0J91n4
4708A06J92j98k87K9L29k45k98L56j51J36k22L32k44J38M4K01l15QO8J53j19J18
4730A31J89j22r6M8j31Q1n3j76J23r5K7L69k76j97L13j04J81l25R8j6k60J76L
4753a12O6J40k14J95j10Pl0L18l30J46o5j39L67k98j7J77k50N2J78P6K5k35l6
4776h9J54j79J70k18K79j33k61L12j71O2K17l43L30Q1k11M6n3O9Q3j75K37j63
4798D4j5j06L15j81J87q9j77K46l71J38OK8j60J2l5L43j58M2k42J90l07K07O8
$$ plain form
4821 -15 -123 125 94 122 137 341 124 72 92 76 -76 143 -33 223 334 154 19 -60 -33 -133 133 -59 -148
4844 -148 -124 -47 -106 200 -177 -56 -128 129 -32 49 77 -316 -22 22 88 -22 68 112 -2 226 36 13 208 268
4868 268 36 294 38 262 238 -171 159 95 -154 -213 20 -139 -69 8 6 253 -54 -82 14 -12 121 -120 -46 92
4892 92 -84 -138 176 -187 -107 -49 -59 -56 20 150 -5 -35 -23 76 71 -40 -111 154 -163 -318 31 12 -244 -102 -75
4917 -75 123 -319 139 -23 -259 -46 -105 141 162 90 -213 -155 -59 89 3 17 227 69 -36 -187 -270 -251 -12
4940 -12 101 -147 -172 81 -112 161 66 -103 -173 61 -44 -43 197 185 -28 170 -47 134 0 5 150 124 203 155
4964 155 106 -72 22 -95 193 211 -93 -93 134 -224 -109 6 96 219 251 158 -73 -168 16 -311 0 40 -145
4987 -145 10 288 -216 -270 26 11 213 -65 113 -117 -117 105 100 67 -13 63 -4 -93 97 -96 52 50 -97 -39 25
$$ packed form
4821a5j08K48l1K8J5K04k17n2K0j6j52K19j76K56J11j80j35p9K7j00K66j92q9
4844a48K4P7n9L06l77J21p2K57j61Q1K8l93K94M4O6j10R0M4j14K28j90k3J95O0
4868B68k32K58k56K24k4m09L30o4k49n9K33j59P0P7kK47l07k8R6k6J33k41P4J38
4892I2j76n4L14l63Q0N8j0LP6J30j55l0J2R9nj11p1K65l17j55L49j9k56J42K7
4917g5J98m42M58j62k36K13n9K46K1p2l03N8R6J48q6J4K10j58j05j51q3J9K39
4940a2J13k48k5K53j93K73r5j69p0K34j05JK40j2k13J98k17J81j34NJ45k6P9m8
4964A55m9j78R4j17K88J8l04%K27l58J15J15R0J23L2r3k31r5J84l27L11M0j85
4987a45J55K78n04n4K96j5K02k78J78k30%K22nl3q0P6o7q9J90j93J48kj47N8O4
$$ plain form
5012 25 -277 40 -78 79 -7 195 37 -157 147 237 98 -27 -229 88 111 83 65 111 -75 352 105 99 -12
5035 -12 6 -85 -206 -183 -133 237 -136 -53 13 -215 -240 68 17 -148 77 -30 250 -154 214 -9 268 103 1
5058 1 -21 148 -9 -126 -101 -162 -88 -250 80 -13 119 -21 193 -189 -14 -150 -294 235 163 -23 -38 21 -168
5081 -168 12 -154 78 -21 -90 -74 443 248 9 36 119 -38 28 193 51 -68 100 100 -149 86 34 -205 33
5104 33 46 -53 -204 -414 -403 -225 0 -55 81 -19 222 -56 215 193 100 364 184 -95 -44 74 -41 42 63
5127 63 54 37 33 93 -121 182 9 -97 -109 53 -48 -158 -84 -280 74 94 194 113 -77 64 -102 -38 36 -46 -115
5152 -115 8 26 -311 78 90 22 -158 17 -7 -2 146 74 113 233 -40 61 104 53 73 -73 23 -156 71 -73
5176 -73 144 215 -187 -123 31 -125 104 179 -115 -13 -130 222 195 -33 185 33 -93 279 183 -84 -144 148
$$ packed form
5012B5l02L17j18J57q6K02j58j94L04R0j39j25k02L17K3k8j8M6j86M27k47oj11
5035a2J8r1j21K3N0L70l73Q3O6k28k5L08n1j65K25j07K80m04L68k23K77j65j02
5058Ak2J69j57j17K5o1P4j62L30r3J32j40K14l82J75j36j44N29p2j86j5N9j89
5081a68J80j66K32r9o9J6N17j95k39K7Q3j57O6J65j42j19J68%k49K35n2k39K38
5104C3J3r9j51k10J1J78K25n5J36j00K41k78K71k2r3K64j80k79N1J18j15Q3K1
5127F3rj7mO0k14L03j73j06j2J62j01j10P4j96L54K0J00q1j90J41j66O4P4q2o9
5152a15J23J8l37L89J2o8j80J75k4NJ48p2L9J20k73J01M3n1K0j46R6j79K27j44
5176g3K17P1m02O4J54j56K29P5k94J02j17L52k7k28K18j52j26L72r6k67o0K92
$$ plain form
5198 148 249 -207 259 2 -152 164 -172 25 31 -281 244 79 -144 -95 -216 202 -56 75 -160 102 137
5219 137 78 221 -59 69 -180 111 -11 80 143 101 168 178 -56 -84 -119 -221 40 169 -154 11 -239 -171 -156
5242 -156 72 201 -172 126 175 63 -47 -9 -37 95 4 17 103 -23 -140 -23 81 65 239 120 -133 -134 -4
5265 -4 28 -114 24 -144 -121 -2 0 -211 196 -36 -81 -178 -288 26 -11 -15 -117 126 -250 77 95 -89 -136 -79 355
5290 355 -8 90 81 -140 -15 133 8 -275 -186 -6 -335 83 -64 -36 0 4 -207 -25 -110 -5 174 73 -238
5313 -238 -36 49 121 -136 79 208 -230 -31 32 109 50 -77 27 -112 230 154 311 -13 -19 252 101 -255 47
5336 47 -57 122 -122 193 34 -121 -60 100 241 16 145 21 55 6 75 403 -39 -42 30 54 -8 -141 -106 111
5360 111 71 93 -220 -59 157 -37 -157 -53 60 -78 -279 -255 -343 5 178 -105 9 58 71 150 -171 -30
$$ packed form
5198A48J01m56M66k57j54L16l36J97Ol12N25j65k23M9j21M18k58J31k35K62L5
5219A37n9J43k80J28k49K91j22R1O3m2O7J0k34k8l5j02K61J29l23J65k50O8J5
5242a56K28J29l73K98M9j12j10L8k8J32r1J3Q6j26j17J17J04j6J74j19k53jJ30
5265dL2j42J38j68K3J19Kk11M07k32m5r7j10L14l7mj02K43l76L27J8j84m7N7M34
5290C55l63R8rk21J25J48j25k83Q9J80l29M18j47K8L6Mk11J82q5J05J79j01l11
5313b38K02Q5P2k57K15J29m38J99O3P7n9j27J04j39L42p6J57l24oK71j51l56L02
5336D7j04J79k44L15j59j55O1J60J41k25J29j24L4m9O9L28m42lP2K4o2j33L5K17
5360A11m0K2l13J61K16j94j20J04J13j38k01K4q8L48J73k83J14M9J3P9l21J41
$$ plain form
5382 -30 106 97 46 123 107 20 101 18 153 152 -33 108 5 188 80 76 67 -56 -298 -309 4 -120 31 202 -152
5407 -152 -1 -23 -23 -30 -307 -56 93 -59 -28 -31 189 -90 105 312 -142 14 -49 434 412 -164 -59 -27 -24 -234
5431 -234 -80 -52 -166 -43 -87 -293 -99 -309 -335 299 -186 253 30 -142 89 0 186 -28 173 109 74 -28
5453 -28 -53 229 -124 -18 24 84 69 54 -121 -200 -26 19 -213 -25 77 19 -91 -336 122 -67 147 -44 -7
5476 -7 105 9 -138 -4 -112 -38 -152 72 -49 138 -322 93 260 167 -32 -4 -409 381 186 147 -130 62
5498 62 -128 37 -19 -269 -333 -180 -85 77 174 298 104 81 -75 -44 72 -102 -39 13 243 70 -1 -200 11
5521 11 238 -58 93 251 -68 7 14 1 -130 7 -288 -48 -1 6 24 -10 307 15 -196 189 64 -34 -75 -47
5545 -47 -71 -61 11 -192 56 -107 -59 46 112 -20 138 82 -374 362 1 111 -38 -5 -73 -112 -147 -126 -87 -273
$$ packed form
5382c0J36rn1P7j6q7Q1q3J35jj85J41j03J83j08mrj23k42j1L13j24J51J71l54
5407a52J51k2%pk77K51J49j52L1lK20k79J95K07m54J56o3M83k2n76J05L2Lk10
5431b34J54K8j14J23m4k06J94k10k6O34m85M39k23j72K31q9J86k14K01o4l5j02
5453b8k5K82l53J06M2O0j5j5j75p9J74M5k32J88J02n8j10k45M58j89K14j91L7
5476gJ12r6j47J34j08P4j14K24j21J87m60M15J67r3j99K8m05P90j95l9k77J92
5498F2j90J65n6k50o4J53R5J62R7J24j94k3j56L1J16j74O3N2K30j73p1j99K11
5521A1K27k96J51J58l19P5Pj3j31J37k95K40M7PJ8l4L17k92k11L85j25r8m1K8
5545d7k4J0P2k03K48j63M8J05O6j32J58n6m56P36l61J10j49L3o8l9l5K1L9j86
$$ plain form
5569 -273 -2 -92 -10 2 293 94 214 360 105 81 -52 254 -220 -71 156 155 48 116 -348 -309 221 116 -339
5592 -339 -53 162 -214 -136 -142 -15 -44 -137 -64 -219 51 107 100 -133 33 23 266 -225 268 128 184 -90 -212 27
5616 27 -41 173 -239 90 -27 165 -118 1 -67 -145 -199 47 -356 -219 13 -19 30 -136 -107 -257 158 207 -58
5639 -58 -184 7 351 103 160 61 -5 -187 15 213 115 94 -312 -101 -135 -208 -12 -91 -67 -200 -136 139 22 -139
5663 -139 145 -154 20 -70 -68 -109 -128 -212 186 62 108 14 -245 100 184 -13 14 -24 32 181 -29 -96 10 52 -175
5688 -175 83 -168 -300 -96 -1 8 -287 26 92 -30 121 -58 -242 -134 172 21 -125 319 -105 -9 -50 138
5710 138 37 -1 164 307 -66 75 57 10 94 112 217 -138 23 262 69 -215 -30 -393 -91 -88 -131 205 226
5733 226 65 82 -147 176 71 -46 8 -120 248 -52 25 103 -82 -39 228 -42 -141 98 -145 188 -18 107
$$ packed form
5569b73K71r0Q2J2K91j99J20J46k55k4j33L06m74J49K27jj07O8m64L9N30j05m55
5592c39K86K15l76P8oJ27k9r3P3j55K70N6pk33J66j0K43m91M93j40N6k74j22K39
5616B7o8K14m12L29j17J92k83J19o8p8n4K46m03J37K32l2M9j66K9j50M15M9k65
5639e8j26J91L44k48N7r9o6j82K02J98r8k1m06K11l4p3J96p9K4j33O4K75j17j61
5663a39K84k99J74r0Km1j9q4L98j24M6r4k59L45Q4j97K7l8N6J49k10o7J06M2k27
5688a75K58k51j32K04R5Rk95L13O6j22J51j79j84J08L06j51j46M44m24R6m1J88
5710A38j01l8J65J43l73J41j8m7Q4J8J05l55J61K39j93k84J85l63L02Lm3L36K1
5733B26j61J7k29L23j05j17N4j28L68l00P7P8j85M3K67k70r9K39k43L33k06J25
$$ plain form
5755 107 -302 -99 61 -107 -166 179 -41 -222 68 -32 -56 39 -171 -5 11 -31 77 112 14 59 36 -65 47
5778 47 225 -215 75 -123 50 -252 201 -38 -190 150 -139 -268 -60 106 -6 -130 -83 -7 -45 -5 210 -78
5800 -78 23 12 -132 -281 -172 -157 77 56 -117 -86 175 196 49 -25 101 249 -287 -51 -260 -74 160 -166
5822 -166 -143 0 -271 72 -138 -81 68 265 -56 239 -73 3 92 97 101 -93 135 37 -27 -11 -212 214 93 -180
5846 -180 -119 -15 -108 -9 143 -313 -263 114 177 4 -72 37 146 -91 -282 -117 5 -120 68 -246 -34 68
5868 68 227 95 -60 166 -246 -49 141 157 -260 -11 -22 -233 43 86 130 31 41 136 91 -74 -241 68 41
5891 41 48 -172 -24 59 -138 112 -91 -1 120 -54 242 -173 23 162 -26 20 118 84 184 217 -100 -316 -53
5914 -53 -196 54 -191 -245 -14 347 -108 6 -110 -176 42 -165 -86 9 9 98 327 -68 28 87 162 -14 58 -91
$$ packed form
5755A07m09K03J60j68n9L45k20j81K90j00k4R5k10J66J6m2J08L5r8M5k3j01J12
5778D7J78m40K90j98J73l02M53k39j52L40k89j29K08J66j12j24M7P6l8M0K15k88
5800g8J01j1j44j49J09J5K34k1j73L1K61K1j47p4J26J48n36K36k09J86K34l26
5822a66K3J43k71L43k10N7J49J97l21K95l12P6Q9NMj94K28r8o4J6k01M26j21k73
5846a80O1J04r3R9J52m56N0L77O3j73p6J09J09k37j91J65J22j25J88l14K12J02
5868F8J59j32j55K26m12J97J90J6m17K49j1k11K76M3M4r9J0R5m5j65j67L09k7
5891D1Pk20J48Q3j97K50k03R0J21j74K96m15J96J39j88M6R8l4J00L3l17k16K63
5914e3j43K50k45n4K31L61m55J14j16o6K18k07P9R5%Q9K29l95R6N9P5j76P2j49
$$ plain form
5938 -91 306 -113 -130 -140 -86 -100 -23 219 -16 74 112 86 -11 28 -79 -1 59 2 -101 165 88 -10 74 40 -182 221
5964 221 181 8 -19 234 57 11 131 77 -43 93 40 193 5 51 -172 29 -41 90 -62 81 60 -31 -269
5987 -269 -250 39 -31 -145 -259 -104 -35 244 109 43 145 111 -41 88 156 38 283 -6 -3 40 343 33 70
6010 70 -144 -111 285 -41 151 -33 -19 -41 63 176 11 -97 -310 72 -162 191 -198 111 -110 21 126
6031 126 -199 270 93 166 139 -77 45 112 -22 88 -20 -50 36 -1 -50 -151 -43 124 -195 -11 -117 -15
6053 -15 -380 40 136 -75 92 52 -222 245 67 17 64 -152 161 109 -32 272 150 39 161 -165 22 214
6075 214 98 1 -197 52 1 -8 53 -107 -123 163 147 228 42 -110 -141 139 -38 58 67 -61 -24 181 144 34 79
6100 79 168 131 292 65 289 -87 -177 122 117 142 404 -67 -159 61 141 133 -216 -98 -266 -61 -37 -124 159 25
$$ packed form
5938i1L97m19j7j0N4j4P7K42k35R0L8k6r7L9j07P8O0n7j03K66p7r8Q4l4k22M03
5964B21m0j73k7K53j77m6J20n4j20J36n3J53j88M6k23K01p0J31j52J43k1r1k38
5987b69J9K89p0j14j14J55O9K79j35o6J02l4j52J29O8j18K45k89LM3L03l10L7
6010G0k14L3L96l26J92j84J4k2J04J13j65j08k13L82k34L53l89L09k21J31J05
6031A26l25M69j77P3k7k16J22O7j34J10j08l0Q6l7m9j01J08J67l19J84j06J02
6053a5l65M20R6k11J67m0k74M67j78n0M7k16L13n2j41L04j22j11J22l26J87J92
6075B14j16r7j98K49n1rO1j60j6K86j6Q1j86j52l1K80j77R6Rj28L7K05l7j10M5
6100G9Q9l7J61k27K24l76r0K99nK5K62m71r2K20Q0ql49J18j68K05K4q7K83j34
$$ plain form
6124 25 -124 -63 -166 -53 304 154 206 33 -69 39 -154 109 -24 -141 31 88 94 169 33 -60 27 -42 248
6147 248 -228 80 79 246 -57 295 -240 -208 -126 3 92 -44 -261 -229 36 119 271 -3 94 122 -170 182 -1
6170 -1 -71 169 9 -94 194 -214 34 -149 -268 240 -207 186 -94 -76 -23 -212 -358 22 -20 359 -282 -64
6192 -64 104 123 348 198 171 25 65 141 -27 265 151 11 1 -18 -52 -60 40 32 142 -50 70 -93 -276 -21
6216 -21 140 -122 -49 79 4 -9 7 -25 168 96 -124 154 -58 -213 -27 -205 94 -27 -258 -253 40 -122 270
6239 270 172 -76 -177 68 -49 27 154 -114 -2 2 -266 43 145 -287 224 -9 301 -48 120 -31 -139
6260 -139 101 -19 -16 152 178 146 -97 -15 165 -43 85 -20 76 -109 28 215 -35 19 -184 -93 146 -177 -9
6283 -9 -3 87 -233 -237 148 -15 -50 -265 141 -165 66 -19 -30 -43 -98 117 49 -4 48 -36 -54 82 166 -156 42 90
$$ packed form
6124B5j49O1j03J13L57j50N2j73j02J08j93K63j33j17J72N7OP5j36r3Q7o9K90
6147B48m76L08jJ67l03L52n35L2Q2J29Q9j36k17L2K65Q3J52k74R7K8k92L52j83
6170ap0K40j60j03K88m08K48j83j19N08m47L93k80J8N3j89j46L80m2L79o41K18
6192f4J68J9K25j50k7j46M0P6j68K92j14j40j0j9l4qJ00qJ10j92J20j63j83K55
6216b1J61k62P3J28p5j3J6l2J93p2k20K78k12j55J86j78K99j21k31NK93j62L92
6239B70r8k48j01K45j17P6J27k68J12Mk68L09J02m32N11k33L10l49J68j51j08
6260a39K40j20LJ68K6l2k43Q2J80k08J28j05R6j85J37J87k50N4k03R1K39l23J68
6283iOR0l20mL85j63l5k15M06l06K31q5j1j3n5K15o8n3N2q4j8J36Q4l22J98M8
$$ plain form
6309 90 133 -165 -9 -89 246 41 125 104 -98 158 -109 -141 -9 72 -143 -112 -46 50 212 134 -243 3 -60 349
6333 349 -169 -28 -139 29 -82 -290 332 -184 46 -23 339 -79 -221 -104 159 -56 -228 90 -59 -10 -115
6354 -115 132 -242 83 -13 -205 2 34 -47 308 206 69 237 176 -82 -58 -88 20 227 -72 -186 -112 -309
6376 -309 -195 114 -123 106 71 -130 -8 284 -230 -127 141 -229 60 -74 -106 -27 145 83 191 135 44 61
6398 61 -80 29 92 -32 83 -154 -47 -75 176 -107 -272 -43 255 5 -73 -215 49 161 97 -174 -173 -74 -64
6421 -64 16 -42 -13 102 -149 -144 -201 -206 -10 -251 103 142 7 -177 115 284 -40 -208 61 104 -161 -156 7 95 -15
6446 -15 -128 -42 -65 -108 192 21 -94 88 27 -232 67 64 308 -188 107 67 169 9 247 78 -90 -218 89
6469 89 -199 155 -28 168 -230 -213 282 -122 -448 -59 94 98 -21 106 -52 -40 -8 115 -97 243 27 -15
$$ packed form
6309I0M3k98J56q0L35k05Q4k1k02K56k67l2J32Q1k15L1O6R6J62p8l77K46o3M09
6333C49n18J41j11J68j11k08O22n16K30o9L62m18j42J17K63k15j72L18j49M9j05
6354a15K47l74L25r6j92K07L2q1L55j02j37J68o1k58K4l0J08K07k99j14P4j97
6376c09J14L09k37K29l5k01J22K92n14J03K68l70K89j34l2P9J72o2J08n6r1J7
6398F1j41J09O3j24J15k37J07k8K51k83j65K29K98k50p8j42K64J12o4k71JR9J0
6421f4Q0n8K9J15k51Nn7nJ96k41L54L9j35j84K92J69l24j68K69M3k65NJ63Q8j10
6446a5j13Q6k3m3L00j71j15J82o1k59K99lK44m96K95m0J02j60K38j69j68j28L07
6469H9k88L54j83J96l98J7M95m04l26L89J53Mj19J27j58J2L2J23k12L40k16m2
$$ plain form
6491 -15 88 164 4 211 67 71 -160 127 194 -32 -226 -197 -316 11 -11 -26 -72 -163 276 -348 16 88 105 -2
6515 -2 209 7 -1 -87 214 332 121 104 -45 97 257 101 231 -102 -115 77 258 40 17 10 -153 24 69 -41
6539 -41 -10 11 -124 -5 -195 -253 38 83 -17 66 33 105 34 47 -195 -32 -21 -270 -64 -222 148 197 -271 100
6563 100 -81 68 61 -136 -35 123 -4 -329 -8 -298 -18 -60 -153 94 -104 67 -7 10 30 38 -74 28 161
6586 161 121 121 146 139 -84 -26 33 323 103 31 -47 129 74 -132 -51 0 -69 -104 -275 -53 -31 240 43 18 141 -66
6612 -66 61 -96 -21 -3 176 32 12 -83 130 -6 -59 236 -264 18 -99 -169 -158 86 4 221 120 110 -342
6635 -342 -33 -123 -90 146 -30 -45 -166 -178 20 -82 -105 -98 16 -146 4 16 66 192 -143 174 201 -112 -145 5
6659 5 -273 67 224 57 -17 2 -87 -147 -42 54 182 -26 53 -108 -215 -3 184 176 31 1 196 -227 -54 -122
$$ packed form
6491a5J03P6j60K07j44Mk31K87O7k26j94K9j19L27k2j5m6r1M39o24L64P2J7j07
6515bK11k02qq6L01J18k11j7j49J42J60j56J30l33j3J92J81k18k3pj63J77M5j10
6539d1L1K1j35J19j90n8K91M5j00Q3l3P2p1J3k42J63J1k49K06j58L70M9m68L71
6563A00j81J49pj97J01J58j27l25L21k90K80m2r3K47j98J71p4J7K0Qj12J02J33
6586A61m0%K5pk23N8N9K90k20p2p8J76n5k06Q1N1o9l5j71K22K2K71j97k5J23k07
6612f6J27j57P5J8J79j44k0r5K13j36n3K95n00K82j17p0J1K44q2K17j01j0m52
6635c42L09r0L3K36j76j5j21j2J98j02k3PJ14j62J50J2N0J26l35L17K7l13l3J50
6659Ek78L40J57j67p4J9q9o0J05R6J28k08P9j61j07K12J87qj45l0J95m23J73o8
$$ plain form
6683 -122 70 12 86 240 -150 51 98 31 -47 221 5 200 166 232 -66 178 69 -81 -29 -49 -88 -92 46 44 -233
6708 -233 -151 69 -136 -126 -130 -48 -18 -212 -185 -6 -315 -145 -246 -299 -160 -252 252 -187 -130 257 -159 -88 129 24
6732 24 -24 -83 -243 -120 78 -250 -51 -282 153 -38 -74 -117 57 -53 2 39 73 445 179 122 -6 143 -69
6755 -69 143 243 36 227 134 161 -182 123 -113 -257 -46 -293 -7 -15 54 9 -18 -61 -7 -114 10 -74 22 56
6779 56 95 119 25 -14 -209 -197 163 134 3 487 58 273 54 143 70 58 41 -79 122 344 -186 86 -26 -97
6803 -97 -46 -45 238 -37 36 113 201 37 177 137 56 165 183 23 181 -101 -53 23 -192 -159 -5 65 2 117 -247
6828 -247 -106 -187 -116 91 151 -186 151 -184 -348 -140 8 172 -25 184 323 152 130 -182 -9 -31 109 251
6850 251 55 -152 -133 98 363 31 104 79 -20 1 131 -84 87 83 -201 -228 106 -50 81 -42 -196 -145 87
$$ packed form
6683a22J92n8P4J54l90K01M7o7p8K68k16J95l4O6k98K44j09j50N2k0l9mJ38kk77
6708b33Q2K20k05J0mQ2L0j94K7J79l09J70j01n3J39r2N04m39N7L87m16P1K17j05
6732B4m8n9j60J23J98l28J99k31M35j91l6m3J74j10N5L7L4L72k66n7j28J49k12
6755f9K12J00k07J91r3K7l43L05k36j44K11k47K86qO9m5k7m3N4j07J24q4R6L4
6779E6L9K4r4l9j95J2L60k9j31M84m29K15k19Q9p3j2j7j20K01K22n30K72j12p1
6803i7N1JK83k75P3P7Q8j64J40m0q1J09J8j60J58k82M8P6k15L3J54P0o3J15l64
6828b47J41q1P1K07O0l37L37l35j64K08J48J64j97K09J39j71k2l12J73k2J40J42
6850B51j96k07J9K31K65l32P3k5r9K1J30k15J71mk84k7L34j56J31j23j54N1K32
$$ plain form
6873 87 -46 -187 -1 -44 -94 -6 -209 -94 186 297 90 118 -130 284 86 -6 5 -52 -97 109 167 -168 160
6896 160 -76 53 -67 0 -192 -276 -256 -133 -231 277 97 294 135 13 94 0 -9 -13 221 25 -120 119 135 46
6920 46 174 235 114 36 -8 88 80 -121 169 1 -141 -99 -188 253 106 41 -41 138 278 12 136 16 30 -154
6944 -154 -162 117 90 -182 -86 1 -47 192 -12 22 14 54 53 -82 115 -147 -20 -121 -50 -93 185 163 22 426 175
6969 175 -226 -136 119 89 33 -99 9 -338 7 29 -268 -90 -180 72 -96 95 169 94 188 94 -193 314 201
6992 201 -12 7 326 98 -205 -191 -66 -198 -121 335 -142 -208 129 204 15 80 -56 -12 15 24 339 89 219
7015 219 -37 415 -18 231 -188 75 -3 -95 -52 30 -162 -137 -270 19 101 -287 13 270 -33 -100 63 95 -118
7038 -118 80 200 -136 -113 100 131 329 -112 -131 90 163 174 -97 58 -50 -133 -126 -93 43 55 118 95 -288 -139
$$ packed form
6873H7j33j41J86m3n0Q8k03J15K80J11k07K8k48M14j98r2J1n7m5K06N8l35L28
6896A60k36J29j20O7j92q4K0J23r8N08j80J97j59j22Q1r4rmK34j96j45K39J6q9
6920D6J28O1j21p8m4R6qk01K90j68j42M2q9M41j47o5q2J79J40k66J24j20J4j84
6944a54qK79k7k72R6Q7m8K39k04L4qM0jj35J97k62J27j01P1m3K78k2j41M04k51
6969A75m01R0K55l0n6j32J08l47L45K2k97J78r0K52j68J91P4p5R4r4k87N07j13
6992B01k13J9L19k28l03J4J25j32P7M56m77o6L37P5j89O5j36M4K7RL15k50J30
7015B19k56M52m33K49m19K63p8r2M3Q2j92K5j33K89Q2l88L00K57l03o7J63L2k13
7038a18J98J20l36K3K13L1J98m41j9K21P3J1k71J55j08q3PL3J36J2O3k3l83J49
$$ plain form
7062 -139 142 -19 -188 -112 -73 87 47 -56 59 62 106 -29 -103 -95 -116 -24 115 -8 194 125 -132 -201 74 128 -198
7087 -198 -214 -52 -38 72 -49 147 485 -187 75 -241 -68 39 63 123 152 132 -247 147 -68 14 206 -356
7109 -356 -172 11 -107 -74 93 171 -64 -41 -93 126 -8 78 214 -89 88 -68 -135 154 49 -57 -18 269
7131 269 -72 -48 172 315 -34 -92 -246 74 124 -60 34 -103 -332 0 275 62 113 88 -157 -72 -76 100 65
7154 65 80 110 107 65 125 -335 -378 -257 -121 -131 195 102 120 -84 73 79 -169 140 -155 20 86 165 -226 -154 336
7179 336 411 -190 17 -59 1 109 110 20 -94 -140 -203 31 89 -72 10 379 25 135 -135 -125 130 -135 -224 182
7203 182 205 -117 34 -90 87 165 37 227 -268 227 -214 -164 -124 51 -350 -103 13 218 -312 24 215
7224 215 -4 -112 -111 4 -71 -34 -270 -20 -95 116 -40 -96 71 -55 -126 268 330 -95 -65 152 180 52 -150
$$ packed form
7062a39K81j61j69P6L9J60m0j03J15LM4j35p4Qk1R2J39j23K02o9k57o9K75N4l26
7087a98j6J62J4J10j21J96L38o72K62l16J73J07K4O0K9k0l79L94k15Q2J92n62
7109c56J84J83j18L3J67P8k35K3n2K19j34Q6J36l03J77j56o7K89j05j06L9K87
7131B69l41K4K20J43l49n8j54L20N0j84R4j37k29L32K75k13N1k5k45Q5mJ76l5
7154F5J5L0lm2O0m60m3J21J36j0L26r3J8k04J57Ok48L09k95J75O6P9l91P2M90
7179C36P5o01K07p6O0J08Jr0j14m6o3K34N8j61Q2L69l54J10k70J0K55k65q9M06
7203A82K3l22J51j24J77P8j28J90m95M95m41N0M0J75m01K47J16K05n30L36J91
7224B15k19j08JJ15p5L7k36K50p5K11j56n6J67j26p1L94O2m25L0K17K8j28k02
$$ plain form
7247 -150 219 100 237 -13 -188 2 -250 -55 78 22 -96 -23 -101 62 -72 -115 140 65 135 -125 252 206
7269 206 -90 -249 -92 76 -62 -95 33 -180 -53 12 -43 70 121 -146 94 -300 258 -25 139 123 119 81 -44
7292 -44 277 77 -135 -27 135 54 -44 107 -102 -160 119 -6 -99 164 86 181 48 -2 157 48 126 106 -66
7315 -66 -58 281 -132 59 -435 -144 -169 -98 208 143 -180 14 91 -54 106 -162 -167 -75 -108 114 102 -72 -118 375
7339 375 -127 179 -188 38 117 97 78 -91 51 -108 -76 -135 -60 38 213 -146 215 -213 146 176 208 239 209 -191
7363 -191 -137 96 -16 109 39 -147 41 190 -50 -67 -108 30 -119 -47 219 -35 -49 -102 36 -35 -170 -83 -20
7386 -20 54 -164 113 287 219 -109 -241 -167 68 189 150 -76 -23 122 -120 -22 -89 48 117 28 -109 -10 -94 -209
7410 -209 15 -98 129 -181 46 -42 -165 17 86 111 -22 277 158 55 -174 136 83 -159 -64 162 -31 158
$$ packed form
7247a50L69j19J37k50j75J90k52J95J33n6j18P3p8J63j34m3K55p5P0k60L77m6
7269B06k96j59J57J68j38l3J28k13J27O5n5J13N1k67K40l94N58k83J64j6ml8j25
7292d4L21k00k12J08J62q1r8J51k09n8K79j25r3K63p8R5j33n0J59j09P8k0j72
7315f6QL39m13J91m94K91k5P1L06o5l23J94P7j45J60k68nR2l3K22j2j74m6M93
7339C75n02L06l67K26P9k0j9j69J42j59L2n9P5R8J75l59L61m28L59L0L2L1l0m00
7363a91N4K33j12J25p0j86J88J49k40j7m1J38j49P2K66k54j4n3J38p1j35Q7O3
7386b0P4k18K77J74o8l28j32P4K35J21l9k26N3J45k42R8o7J37O9q9j37R9q4j15
7410b09K24j13K27l10K27q8j23J82O9K5j33K99j19j03k29L10n3k42R5K26j93J89
$$ plain form
7432 158 194 -155 -46 -51 -50 106 60 1 137 -25 -136 41 67 128 -152 137 85 32 26 -138 -135 -94 -213 79 -14 -90
7458 -90 142 -11 295 91 -51 109 99 -6 20 215 189 -182 -127 127 -88 25 -18 -2 32 -76 -280 -49 113
7481 113 88 -13 56 -45 -6 161 -7 119 -443 -23 61 61 186 -248 -70 96 -168 -30 -36 123 143 -98 -120
7504 -120 209 28 89 -41 42 39 -103 -220 69 -291 36 -213 113 -265 5 -195 193 -212 155 133 -84 -97
7526 -97 103 10 42 21 2 -32 17 93 -121 77 -48 35 108 50 29 117 -110 -58 78 -9 98 -198 -134 -11 -149
7551 -149 135 -30 -75 198 263 39 129 42 178 -96 100 -75 48 -104 -45 121 -69 38 89 222 104 -59
7573 -59 -272 195 -4 118 -264 -123 32 -346 -64 -83 -4 -42 -245 -187 -238 -129 -34 111 -252 175 -125 16
7595 16 119 97 -162 164 82 62 -60 189 219 -12 34 3 17 -217 -2 284 -108 9 -170 -145 -62 251 100
$$ packed form
7432A58L6l49J09nJJ56m6n9J36j62j11J77K6O1k80K89n2n3oj64LM1j19K92r3p6
7458i0K32j53L06k04j42J60j0j05K6J95k6l71N5K54k15J13m3J6L4j08k04K31J62
7481A13k5j01O9j01L9J67j68J26n62M20Q4%J25m34J78J66k64J38oJ59K0k41k2
7504a20L29j81O1j30Q3lj42j17K89l60L27k49L26l78K70k00L88m05L67k2k17j3
7526i7K00r3L2k1j9l4M9P6k14J98j25Q3P3n8k1Q8k27N2J36q7J07k96O4J23j38
7551a49K84j65m5K73O5k24R0q7J36k74J96j75J23j52N9J66j90J07N1J33j18j63
7573e9k13M67j99J22l82J41J55l78K82j9P9l8k03N8n1J09R5J45l63M27l00J41
7595A6J03k2k59L26q2k0j22K49L0k31M6l1J4k34K15K86l92J17j79K5Q3L13j51
$$ plain form
7618 100 -173 -82 -119 -333 122 120 -60 98 248 112 -59 -20 -79 79 -28 -1 -41 -41 122 102 8 -55 -159 76
7642 76 -154 -29 -74 214 134 -45 136 -83 -152 240 -109 -70 35 88 238 -78 64 82 -94 100 -65 46
7664 46 -257 75 -115 139 12 83 105 -145 155 -103 186 132 -6 -218 -68 32 -185 -254 -155 73 -74 273
7686 273 -124 209 233 481 -42 9 47 -123 -44 91 -101 -255 92 -66 -65 18 105 26 -5 -245 -59 -77 126 7
7710 7 9 64 153 -181 -124 -192 -97 110 -119 34 -306 -127 14 -103 -178 59 50 -196 330 -233 -86 32 115 -34
7734 -34 -49 29 102 -32 -146 32 -92 -150 82 291 -2 -141 39 -35 149 133 -28 -66 211 173 229 11 62 2
7758 2 -202 -70 -7 -151 39 -56 101 392 -76 103 6 -140 -155 -109 69 -185 191 -84 134 73 -218 -117 -30
7781 -30 -111 269 -15 -23 123 40 -190 178 83 29 12 -308 -394 -131 -183 -109 32 -183 -17 -120 -52 67 62 -81 86
$$ packed form
7618A00k73R1l7k14M55kj80J58J50j36j71L9n9J58j07K7m0%J63k0r4o3j04K35
7642G6k30J25m5K88q0j79J81k19o9L92l49L9J05N3J50l16J42J8j76J94j65J11
7664D6l03L32j90K54j27P1K2k50L00k58K89n4j38k12J50J00k17o9R9K28j47L47
7686B73l97L33K4K48n23N1L8j70P9J35j92j54L47j58JQ3Q7p9l1k40J86j8K03j19
7710GKN5Q9l34N7o8R5K07k29J53l40J79J41j17p5K37rk46N26n63J47J18Q3j49
7734c4j5P8P3j34j14J78j24n8K32K09k93j39J80p4J84j6j61l8K77l8N6k18N1o0
7758Bk04J32O3j44J90r5J57K91m68J79r7j46j5M6J78k54L76k75K18o1k91J01Q7
7781c0q1L80k84qJ46q3k30L68r5n4j7l20q6K63n2P4J41k15J66j03O8J19nj43J67
$$ plain form
7806 86 -84 -154 222 206 -131 64 58 -52 37 2 -130 -206 279 -137 82 69 -185 79 29 -56 37 113 -38 277
7830 277 -182 -35 -58 60 68 -145 496 76 110 -189 129 42 -60 173 -132 -190 -289 -62 -169 29 -296 176
7852 176 167 -180 133 293 13 -55 22 76 270 18 127 -129 -94 -34 -250 66 141 136 -53 -132 -139 92 -101 -80 74
7877 74 30 -185 -288 -55 -169 40 -21 -41 -314 63 -63 -90 -12 37 184 38 133 -25 12 -56 -30 2 -165 137
7901 137 68 -90 -139 110 -33 244 189 29 12 257 -344 -54 318 92 -47 -122 -73 -98 196 308 8 94 -51
7924 -51 -133 -22 54 234 231 -180 45 232 -66 132 119 -42 -249 68 -22 238 38 -99 -52 219 422 -108 94
7947 94 195 -200 -64 95 145 100 120 151 -58 -133 -37 254 -272 -334 64 -63 8 14 73 13 148 -125 115 -60
7971 -60 -133 -302 54 161 178 -330 -104 -174 81 7 24 -89 70 182 -67 121 -86 -187 21 -40 80 -125
$$ packed form
7806H6j70p0L76j6l37J95oj10Q9l5j32p6M85m16K19j3k54K64n0q5R3P6j51L15
7830B77m59J47k3J18Qk13O41m20L4k99L18q7j02K33l05n8r9K27j07J98l25M72
7852A76rl47L13J60k80o8P7N4J94k52J09k56L5O0k16L16P5nj89p9pK31j93K1J54
7877G4m4k15j03K33j14K09o1k0k73L77j26k7P8M9J47j46R5j58L7o8K6L2j67L02
7901A37o9j58m9K49j43K77n5j60j7K45o01K90L72k26j39p5M9k5K94J12l00Q6j45
7924e1q2J11P6J80lm11K25J87k98J98j3j61k07L17r0K60k00j37M7K71K03n30K02
7947I4J01l95J36J59N0m5K0L1k09p5R6K91n26o2L98j27P1ON9o0J35k73K40j75
7971f0p3j69L56J07J7n08K26p0K55p4J7j13J59J12k49J88k07j01K08o1J20k05
$$ plain form
7993 -125 -33 98 -257 -31 -116 232 45 93 -125 251 -130 1 -12 118 201 -127 -28 -12 48 -39 43 -201 -28
8016 -28 187 -113 -23 175 -374 142 18 -125 -209 156 171 -110 -83 63 30 -107 -242 189 -10 -228 91 -36
8038 -36 42 20 175 63 116 -102 -95 70 -77 15 113 97 132 -9 150 104 -147 -44 44 -83 201 139 122 100 20
8063 20 93 182 -29 129 -93 -97 -6 -68 73 -138 -41 120 -155 71 21 137 -27 -103 -26 -38 112 -92 -155 27
8087 27 87 27 9 -47 0 101 184 190 11 -101 -62 -82 -35 40 82 -54 86 47 -8 119 211 -3 62 -64 -118 125
8113 125 370 180 45 -214 309 -214 4 -91 72 -103 132 95 114 108 18 -40 -13 127 31 31 -70 24 -176 -217
8137 -217 -138 83 130 -141 107 143 150 50 5 136 180 11 -158 -147 -83 324 47 26 -65 -66 -83 -111 68 179 -108
8162 -108 -120 -185 -171 -150 103 347 26 -146 18 25 -241 -292 -12 363 66 -41 -5 -8 -37 7 -168 30 181 -111
$$ packed form
7993a25R2J31l55K26q5L48j87M8k18L76l81J31j3J30Q3l28R9J6O0q7Q2k44J73
8016b8K15l00R0J98n49N16j24j43q4L65J5k81K7J46l3j37j35M31j99k18L19j27
8038c6P8k2J55j12N3k18PJ65j47R2R8j6L5j41J59m6k51J03Q8j27K84o2j7k2q0
8063B0P3Q9k11J58k22mR1o2J41k11R7J61k75K26n0J16j64p6P7j2J50k04o3J82
8087B7O0o0j8n6M7J01Q3Oj79j12L9k0M7P5M2j36J40l9n5J27R2k14O5j26n4K43
8113A25K45j90j35k59N23n23K18r5J63j75K35l7J9or0n8K7J40r6%j01R4k00m1
8137b17P9K21M7k71K48L6Pj00m5J31M4j69j69J1O4M07k77k1r1jj7k8J79J11k87
8162a08j2o5J4K1K53K44l21j72J64Pk66n1K80L75k97j07L6lk9M4j75J98J51k92
$$ plain form
8186 -111 -87 -56 51 -156 121
$$ packed form
8186a11K4L1J07k07K77
8191A21
$$ Imaginary data points
##PAGE= N=2
##DATA TABLE= (X++(I..I)), XYDATA
$$ plain form
0 0 0 0 0 0 0 0 0 0 0 0 0 0 0 0 0 0 0 0 0 -5 8 -8 8 -8 8 -8 16 -16 16 -20 24 -24 29 -32 37 -41 47 -52 58 -65 72
41 72 -80 89 -99 108 -120 132 -147 161 -177 194 -213 237 -261 288 -319 354 -395 444 -502 573 -657
62 -657 767 -912 1115 -1417 1914 -2879 5424 -27061 -53509 14197 4964 -33567 -11018 12596
76 12596 -18183 -20395 3900 -4231 -12871 5260 2296 661 18963 18367 -834 1208 12859 11555
90 11555 9900 8320 -189 5855 7293 -6701 -2378 6669 -12553 -22342 1039 5277 -17490 -9691
104 -9691 5215 -10530 -10574 9023 -1169 -15895 3385 17336 1149 2129 14932 729 -9717
117 -9717 5214 11737 2742 -778 3226 1361 -883 -981 -7051 -6489 -1177 -598 1463 3896 -1746 -8419
133 -8419 -3149 4069 267 674 4345 -711 -390 5354 2815 -2622 -3124 -1350 -2099 2432 3057 -6843
$$ packed form
0@%%%%%%%%%%%%%%%%%%%nJ3j6J6j6J6j6K4l2L2l6M4m8N3o1O9p8Q8r9J10j23J37
41G2j52J69j88K07k28K52k79L08l38L71m07M50m98N49o07O73p49Q39r46J075j230
62f57J424j679K027k532L331m793Q303l2485k6448O7706r233l8531K2549K3614
76A2596l0779k212K4295q131q640J8131k964j635J8302n96j9201K042J1651j304
90A1555j655j580q509O044J438j3994M323R047j9222r789K3381M238k2767P799
104i691J4906j5745m4J9597j0192j4726J9280J3951j6187R80J2803j4203j0446
117i717J4931O523q995l520M004j865k244r8o070N62N312N79K061K433n642o673
133h419N270P218l802M07L671n056L21N744k539n437n02J774p49M531O25r900
$$ plain form
149 -6843 -5650 2962 -272 -5847 -912 2751 -4784 -3931 9650 9313 -1776 -2575 3593 4988 2215
164 2215 2914 3330 2429 3324 493 -1157 -698 -4772 -7720 -2942 2669 919 -6386 -8011 -4865 -1230
180 -1230 -1877 -4563 542 4037 -405 770 6670 4896 -3075 275 9726 6497 1617 4940 2484
195 2484 -2403 1807 5792 -2478 -7851 647 359 -6354 -2187 1629 -5833 -10424 -1758 3257 -4307
210 -4307 -5352 1166 2119 311 426 2790 -111 -2419 3475 6846 4135 1859 2815 1873 -1149 2356
226 2356 4472 -2392 -3199 4165 3380 -4352 -3220 1216 -5258 -7261 3336 3467 -6352 -5582 2269 -254
242 -254 -5598 349 2463 -3734 -1635 5114 4313 -1790 -717 3960 1256 953 4045 2998 -618 431
258 431 5007 3050 -2328 -584 882 -1890 -1026 2852 939 -5582 -3370 1746 -2546 -5652 -757 164
$$ packed form
149f843J193Q612l234n575M935L663p535Q53J3581l37j1089p99O168J395k773
164B215O99M16r01Q95k831j650M59m074k948M778N611j750p305j625L146L635
180a230o47k686N105L495m442J175N900j774p971L350R451l229m880L323k456
195B484m887M210L985q270n373Q498k88o713M167L816p462m591Q666N015p564
210d307j045O518R53j808J15K364k901k308N894L371k711k276R56r42l022L505
226B356K116o864q07P364p85p732J132M436o474k003J0597J31r819P70P851k523
242b54n344N947K114o197K099O749q01o103J073M677k704l03L092j047l616J049
258D31M576j957n378J744J466k772Q64L878j913o521K212N116m292l106M895R21
$$ plain form
274 164 -3386 -1659 3520 -174 -5332 -253 2614 164 1147 3786 1832 -1390 3051 4972 -126 -528
290 -528 2882 2527 81 1203 2953 -1584 -3961 103 990 -1859 -3406 -1066 -421 -3342 -1540 37
306 37 -3332 -4097 -346 1761 -1374 -789 2455 -347 -1386 3074 3005 -1040 78 4751 3256 -415 2806
323 2806 2977 -2019 -1140 3049 2022 -2442 -357 1865 -2212 -3012 -132 -1251 -3858 -2412 1405 -946
339 -946 -3370 -599 -156 -2505 -1412 1955 1120 -1813 1350 4226 770 -77 2736 2721 -494 975 5210
356 5210 1409 -1753 1633 2405 -1742 -1560 1228 -324 -3562 168 1396 -3145 -3625 -914 -1030 -3547
372 -3547 -1299 1394 -1678 -2515 1444 1278 -1570 -642 2847 1667 -567 2994 3904 607 -165 2734
388 2734 2593 -1007 474 3224 208 -1709 773 681 -2912 -3310 461 -1190 -3909 -732 45 -3208
$$ packed form
274A64l550J727N179l694n158N079K867k450R83K639j954l222M441J921n098m02
290e28L410l55k446J122J750m537k377M064Q87k849j547K340O45k921J802J577
306C7l369p65L751K107l135N85L244k802j039M460o9m045J118M673j495l671L221
323B806J71m996Q79M189j027m464K085K222m077q00K880j119k607J446L817k351
339i46k424K771M43k349J093L367q35k933L163K876l456q47K813j5l215J469M235
356E210l801l162L386P72m147J82K788j552l238L730J228m541m80K711j16k517
372c547K248K693l072q37L959j66k848R28L489j180k234L561R10l297p72K899
388B734j41l600J481K750l016j917K482r2l593l98L771j651k719L177P77l253
$$ plain form
404 -3208 -3308 361 -114 -3713 -585 2345 34 -948 2726 2625 -484 439 4001 1976 24 2561
420 2561 2981 218 -416 1926 768 -2252 -213 943 -1918 -2596 5 -551 -3694 -2548 749 -1514
436 -1514 -2902 176 1072 -1248 -1172 2170 1430 -1667 1489 3088 247 317 2927 1912 -1447 74 2629
453 2629 -167 -1522 1458 1704 -1426 -1503 1454 -184 -2786 -349 1199 -820 -1127 532 412 -2145
469 -2145 -657 1156 -1469 -1748 614 920 -1516 -854 1829 -769 -2047 973 2280 -231 -641 1945
485 1945 1622 -478 1575 2622 203 143 2520 2535 -585 -221 1633 -836 -2622 128 720 -2775 -3197
502 -3197 -648 -601 -3462 -2308 -983 -2011 -2003 222 1082 -563 149 2349 1321 1488 3419 3243 1185
519 1185 1930 4434 2574 -784 1485 1710 -1268 -1570 421 -424 -4160 -3561 -877 -2858 -4014 -2229
$$ packed form
404c208j00L669m75l599L128K930k311r82L674j01l109R23L562k025j952K537
420B561M20k763o34K342j158l020K039J156k861o78K601n56l143J146L297k263
436a514j388L078Q96k320P6L342p40l097L156J599k841P0K610j015l359J521K555
453B629k796j355K980K46l130p7K957j638k602K437J548k019l07J659j20k557
469b145J488J813k625k79K362L06k436O62K683k598j278L020J307k511m10K586
485A945l23k100K053J047k419o0K377J5l120L64J854k469j786K750N92l495m22
502c197K549M7k861J154J325j028QK225Q60j645P12K200j028J67J931j76k058
519A185P45K504j860l358K269K25k978l02J991q45l736N99K684j981j156J785
$$ plain form
535 -2229 -1326 -2845 -1653 1691 -442 -1941 1237 3354 1338 958 4012 3773 569 2070 4199 1926
551 1926 -524 890 1920 -562 -1316 132 -2035 -3172 -1152 -1291 -3162 -2851 -734 -1495 -2743 442
567 442 1459 -1784 -1902 2279 3136 -296 424 3641 1645 -72 2026 2502 -329 -1315 1780 1249 -1399
584 -1399 -227 593 -1838 -2158 776 729 -2433 -1258 1529 0 -924 617 671 -1268 -459 2188 642
601 642 -917 -160 481 -985 -580 1106 -609 -2378 -232 1828 -417 -1361 844 978 -1021 613 3366
618 3366 865 -834 1062 2604 947 -192 1085 125 -1428 756 1294 -1198 -2413 -895 -734 -2305
634 -2305 -1474 -412 -2076 -2298 -335 528 -759 -1333 741 862 1311 2461 1804 934 1020 2574 2319 953
652 953 1476 1428 -236 -160 966 253 -2202 -2591 -244 -801 -2664 -2218 -1229 -2234 -2315 14 135 -1413 -994
$$ packed form
535b229R03j519J192L344k133j499L178K117k016l80L054k39l204J501K129k273
551A926k450J414J030k482p54J448k167j137K020j39j871L11K117p61j248L185
567D42J017l243j18M181Q57l432P20L217j996j717K098M76k831r86L095n31k648
584a399J172Q20k431l20K934m7l162J175K787j529r24J541N4j939Q09K647j546
601F42j559P57O41j466M05J686j715j769K146K060k245r44K205J34j999J634K753
618C366k501j699J896J542j657j139J277r60j553K184N38k492j215J518J61j571
634b305Q31J062j664k22J963Q63j287n74K074J21M49J150o57q70Q6J554k55j366
652I53N23m8j664P6J126p13k455l89K347n57j863M46R89j005q1K329J21j548M19
$$ plain form
671 -994 852 1064 1127 1454 1876 542 1550 3171 1683 488 1262 1717 415 390 863 -499 -2356 -917
689 -917 430 -800 -1908 -1180 -1084 -2248 -894 109 -1238 -1739 -142 1279 -355 -321 1481 362 -899
706 -899 1230 2539 244 -719 1330 1978 -109 482 1516 -231 -1089 867 1483 -1227 -1616 554 -480
723 -480 -1225 258 -113 -1597 -1878 250 273 -1616 -775 56 -809 -876 645 1001 -771 -720 1668 974 -143
742 -143 700 1218 283 -57 2155 1760 -818 -149 1393 800 -262 24 452 -1799 -1238 938 -467 -1969
760 -1969 -818 -108 -1008 -1386 436 -1034 -2061 -30 892 98 -764 399 1082 -239 961 1933 446
777 446 -279 957 1914 925 232 853 612 -420 510 787 -519 -1766 -413 84 -1427 -845 -363 -1436
795 -1436 -1946 -224 748 -1271 -1181 507 32 -483 1122 1118 -372 -32 1857 1662 413 661 1030 496 103
$$ packed form
671i94J846K12O3L27M22j334J008J621j488j195P74M55j302k5M73j362j857J439
689i17J347j230j108P28R6j164J354J003j347n01J597J421j634L4J802j119j261
706h99K129J309k295r63K049O48k087N91J034j747q58J956O16k710l89K170j034
723d80p45J483l71j484k81K128K3j889Q41Q31q65o7J521L56j772N1K388o94j117
742a43Q43N18r35l40K212l95k578O69J542n93j062K86M28k251N61K176j405j502
760a969J151P10r00l78J822j470j027K031R22p94q62J163O83j321J200R72j487
777D46p25J236R57r89o93O21k41j032R30K77j306j247J353M97j511N82M82j073
795a436n10J722R72k019R0J688m75n15J605mj490L40J889j95j249K48L69n34l93
$$ plain form
814 103 1160 839 -962 -369 865 -75 -743 -698 -388 -1208 -1399 210 -245 -1776 -1280 256 -534 -853 -10
833 -10 126 -968 229 1606 751 54 704 1477 575 662 1662 671 -387 944 1608 284 -648 251 128
852 128 -1189 -170 265 -1064 -1906 -622 321 -1031 -1408 -277 -614 -1162 150 512 -327 -971 589 811
870 811 -69 820 1127 442 -44 1286 1694 -185 -129 1092 284 -266 545 749 -809 -1207 467 113 -1399
889 -1399 -966 -454 -791 -1274 -222 -155 -1677 -748 518 131 -559 176 666 -319 -70 1482 961 -205 863
908 863 1636 766 159 1303 753 -513 236 897 72 -899 -831 22 -860 -898 11 -871 -1365 -711 34 -575
928 -575 -1219 -49 4 -612 184 676 352 -372 768 1524 149 142 1241 891 -26 417 1191 236 -333 596
948 596 446 -599 -462 89 -550 -1195 -183 -56 -1304 -940 22 -492 -902 -467 39 -869 -745 618 430
$$ packed form
814A03J057l21j801N93J234r40o68M5L10q20j91J609m55j531M96J536p90l19Q43
833a0J36j094J197J377q55o97O50P73r02Q7J000r91j058J331O64j324r32Q99j23
852A28j317J019M35j329q42J284R43j352l77J131l37n48J312L62q39o44J560K22
870H11q80Q89L07o85m86J330M08j879N6J221q08n50Q11K04j558l98J674l54j512
889a399M33N12l37m83J052O7j522R29J266l87o90P35M90r85K49J552n21j166J068
908H63P73q70o07J144n50j266P49O61q25r71O8Q53q82l8R09q82m94O54P45o09
928e75o44J170N3o16P96M92l24p24J140P56j375pJ099l50r17M43P74r55n69R29
948E96j50j045J37N51o39o45J012J27j248L64R62n14m10M35N06r08J24J363j88
$$ plain form
967 430 -184 68 995 329 519 1219 1310 27 646 1236 988 -173 249 664 -651 -248 415 -603 -1272
986 -1272 -1018 -462 -910 -1404 -818 -616 -1688 -660 -72 -400 -798 243 851 -150 329 973 809 472 1048
1005 1048 1742 795 -32 1231 782 60 273 445 -215 -764 -264 94 -1182 -1086 -560 -944 -1182 -697 -20
1024 -20 -809 -983 125 47 -127 289 870 647 6 1006 1226 227 516 940 342 109 429 905 -392 -385
1044 -385 601 80 -599 -599 270 -399 -989 50 -178 -900 -706 101 46 -633 -109 419 -507 -239 470 -217 -647
1065 -647 375 542 112 -317 618 534 -17 412 937 335 -64 675 701 -350 -42 700 -118 -362 -117 78
1085 78 -853 -836 -8 -122 -1085 -403 -17 -321 -1320 -300 -18 -593 -61 466 274 -79 722 911 376 411 1295
1106 1295 801 525 1096 835 521 -70 482 269 -827 -385 -311 -785 -1194 -714 -437 -1226 -1055 -511 -649 -644
$$ packed form
967D30o14K52R27o66J90P00R1j283O19N90k48j161M22M15j315M03O63j018o69
986a272K54N56m48m94N86K02j072J028N88l28l98J041O08j001M79O44j64l37N76
1005A048O94r47q27J263m49p22K13J72o60n49N00L58j276R6N26l84k38M85O77
1024b0p89j74J108p8j74M16N81k23o41J000K20r99K89M24n98k33L20M76j297P
1044c85R86n21o79%Q69o69n90J039k28p22J94Q07n5o79N24N28r26K68P09o87m30
1065f47J022J67m30m29R35q4n51M29N25o02l99P39K6j051L08P42q18k44K45J95
1085G8r31J7Q28j14r63O82L86l04r99J020K82n75N32N27j92l53Q01J89n35L5Q84
1106A295m94k76N71k61l14n91N52k13j096M42P4m74m09M80K77p89J71N44j38N
$$ plain form
1126 -644 -428 684 -90 -78 1018 751 380 861 1163 1021 190 1003 1386 37 530 550 321 -195 -302 255
1146 255 -645 -957 -247 -630 -1222 -773 -566 -671 -961 -55 -99 -410 19 580 207 -48 588 1037 176 381
1166 381 990 925 227 99 543 192 -185 367 349 -482 -36 -80 -220 -868 -225 -21 -676 -436 64 -246 -841
1187 -841 -508 175 -15 -310 -74 -23 -208 257 380 275 -163 424 790 -45 192 791 656 -67 353 719
1207 719 -147 -151 360 235 -342 -57 -61 -74 -709 -281 -118 -827 -685 -60 -113 -712 -360 193 -506 -197 544 175
1229 175 70 160 647 577 216 977 786 198 296 552 305 -227 56 532 -501 -265 -89 -389 -1139 -752 -198
1250 -198 -776 -895 -360 -544 -676 -334 320 -139 -468 129 679 125 312 936 544 432 678 828 551 405
1270 405 772 225 -109 -187 -17 -245 -750 -85 9 -846 -509 -274 -574 -468 -241 -179 -283 -540 58 161 -63
$$ packed form
1126f44K16J112p74J2J096k67l71M81L02j42q31Q13L83j349M93K0k29n16j07N57
1146B55r00l12P10l83n92M49K07j05k90R06m4l11M29N61l73k55O36M49q61K05
1166C81O09o5o98j28M44l51l77N52j8q31M46m4j40o48O43K04o55K40N00l10n95
1187h41L33O83j90k95K36N1j85M65J23j05m38N87L66q35K37N99j35p23M20L66
1207G19q66mN11j25n77K85mj3o35M28J63p09J42O25n3n99L52N53o99L09P41l69
1229A75j05R0M87p0l61P61j91n88R8K56k47n32K83M76j033K36J76l00p50L87N54
1250a98n78j19N35j84j32L42O54m59l29N97N50n54J87O24l92j12K46J50k77j46
1270D05L67n47l34p8J70k28n05O65R4q55L37K35l00J06K27O2j04k57N98J03k24
$$ plain form
1291 -63 131 398 294 53 497 648 150 491 912 633 266 395 477 -106 -197 374 184 -376 -474 43 -189
1312 -189 -335 -509 -215 -485 -793 -112 -177 -658 -401 54 -309 42 440 -204 -76 319 558 373 169 442
1332 442 630 298 217 684 64 -212 184 110 -103 -65 86 -89 -431 -389 107 -544 -542 -302 -212 -173 -466 -7 -141
1355 -141 -562 398 88 -111 109 524 333 479 482 724 295 498 519 582 191 333 566 -55 -105 152 -20 -635
1377 -635 -428 -448 -45 -502 -504 -412 -686 -310 -98 -135 -256 -302 282 255 48 474 576 172 293 778 467 6
1399 6 387 904 174 114 221 22 -548 -205 387 -271 -472 -129 -569 -779 -547 -501 -323 -562 -252 128 -360
1420 -360 -107 106 232 56 50 651 299 300 564 637 252 701 647 81 -14 313 -22 -388 -353 19 -127 -334 -207
1443 -207 -188 -643 -481 -392 -378 -536 -370 201 -315 -411 69 -136 106 166 405 610 225 640 591 375 452 610
$$ packed form
1291f3J94K67j04k41M44J51m98L41M21k79l67J29Q2n83r1N71j90n60r8N17k32
1312a89j46j74K94k70l08O81o5m81K57M55l63L51L98o44J28L95K39j85k04K73
1332D42J88l32q1M67o20k76L96p4k13L8J51j75l42M2M96o51KK40R0L9k93M59j34
1355a41m21R60l10j99K20M15j91J46LK42m29K03K1O3l91J42K33o21n0K57j72o15
1377f35K07k0M03m57kR2k74L76K12l7j21m6N84k7k07M26J02m04J21M85l11m61
1399FL81N17p30o0J07j99n70L43N92o58k01L43m40k10K32M6J78k39L10L80m88
1420c60K53K13J26j76oO01l52JK64P3l85M49n4n66r5L27l35l66L5L72j46k07J27
1443b07J9m55J62Q9J4j58J66N71n16r6M80k05K42O0K39K05l85M15m9k16P7J58
$$ plain form
1465 610 532 111 -127 245 -170 -80 251 -254 -481 -381 -66 -456 -629 -490 -270 -575 -300 133 -125 -325 88
1486 88 492 45 328 439 460 462 170 418 191 76 377 615 200 78 180 -44 -225 97 29 -290 -500 -394
1508 -394 -27 -479 -475 -217 -278 -391 381 -11 -167 -253 351 185 -103 664 363 -23 212 464 197 295 229 443
1530 443 5 208 303 228 2 -167 201 -41 -85 -8 -58 -409 -214 -42 -251 -553 -105 66 -158 -499 66 -210
1552 -210 -149 -93 136 83 -93 400 122 199 291 442 410 329 628 425 185 -36 305 227 -415 203 -116 -484 -814
1575 -814 -495 -330 -343 -513 -206 -419 -419 11 31 -222 -103 -127 429 382 360 747 379 95 741 520 185 213 472
1598 472 155 53 -115 -147 -108 -213 -313 -463 -500 -304 -263 -542 -561 -279 -462 -109 -354 -77 -109 -174 -10 199
1620 199 246 366 604 400 362 276 497 155 419 323 4 -14 -105 298 -108 -224 -392 -292 -496 -106 -271 -375
$$ packed form
1465F10p8m21k38L72m15R0L31n05k27J00L15l90j73J39K20l05K75M33k58k00M13
1486H8M04m47K83J11K1Kk92K48k27j15L01K38m15j22J02k24j81L22o8l19k10J06
1508c94L67m52MK58o1j13P72l92j56q6O04j66k88P67l01l86K35K52k67R8o6K14
1530D43m38K03R5p5k26j69L68k42m4P7n0l51J95J72k09l02M48J71k24l41N65k76
1552b10O1N6K29n3j76M93k78P7R2J51l2q1K99k03k40k21L41p8o42O18l19l68l30
1575h14L19J65j3j70L07k13%M30K0k53J19k4N56m7k2L87l68k84O46k21l35K8K59
1598D72l17j02j68l2L9j05j00j50l7J96M1k79j9K82j83L53k45K77l2o5J64K09
1620A99M7J20K38k04l8q6K21l42K64r6l19j8r1M03m06j16j68J00k04L90j65j04
$$ plain form
1642 -375 -324 33 -82 -328 -101 28 -221 136 -177 40 -38 264 184 339 193 141 400 13 -48 295 105 -33
1664 -33 -130 58 183 -116 42 -104 -411 -432 -217 -26 -130 -485 -53 -203 -626 1 -44 -110 -207 -29 165 -260
1686 -260 123 496 53 215 414 540 45 347 363 332 66 162 29 111 60 -88 -207 -421 -263 -400 -326 -260
1708 -260 -365 -450 -464 -191 -122 -186 66 -161 83 73 239 377 280 275 463 450 346 310 386 496 71 26 224 53
1732 53 -274 -186 -99 -424 -243 -92 -292 -371 -187 -66 -354 -321 42 22 -358 157 325 298 410 334 544 404 420
1755 420 541 525 275 383 251 189 169 268 -19 -439 -287 25 -74 -417 -272 -480 -298 -131 -107 -204 -246 -226 -349
1778 -349 -345 -324 82 221 126 552 242 251 249 457 434 331 244 358 -2 -50 72 187 -55 -223 84 -18 -133 -286
1802 -286 -205 -412 -260 -7 -280 -183 -333 -184 -85 -166 80 210 30 -57 232 232 -16 412 308 116 353 416 140
$$ packed form
1642c75N1L57j15k46K27J29k49L57l13K17p8L02q0J55j46n2K59l87o1L43j90j38
1664c3r7J88J25k99J58j46l07k1K15J91j04l55M32j50m23O27m5o6r7J78J94m25
1686b60L83L73m43J62J99J26m95L02J6l1k66R6j33Q2n1j48j19k14J58j37P4O6
1708b60j05q5j4K73O9o4K52k27K44j0J66J38r7nJ88j3j04l6P6J10m25m5J98j71
1732E3l27Q8Q7l25J81J51k00p9J84J21k88L3L63k0l80N15J68k7J12p6K10j40J6
1755D20J21j6k50J08j32o2k0R9k87m20J52L12r9l43J45k08J82J67K4r7m2K0j23
1778c49MK1M06J39r5M26l10RkK08k3j03q7J14l60m8J22J15k42j68L07j02j15j53
1802b86Q1k07J52K53k73R7j50J49R9q1K46J30j80q7K89%k48M28j04j92K37O3k76
$$ plain form
1825 140 123 279 275 72 -63 84 85 -251 -62 51 -297 -386 -315 -154 78 -87 72 -39 -312 -180 126 209 132
1848 132 131 250 -47 291 346 256 260 350 127 416 -15 207 -3 -87 -43 -62 -153 -386 -245 -404 -475 -255 -564 -341
1872 -341 -211 -326 -103 -220 -36 193 -50 -134 159 275 68 175 472 144 203 263 313 104 67 164 10 57
1894 57 -218 68 -6 -75 -62 -149 36 -326 -163 -205 -323 40 77 -86 100 -129 88 213 27 248 338 354 315
1917 315 345 252 14 271 402 134 252 145 -75 -270 -41 37 -205 -9 -142 -86 -208 -545 -220 -298 -130 -58
1939 -58 -178 -127 -49 -94 117 -136 219 450 244 196 381 324 304 77 452 -104 -105 270 -155 -43 29 201 32
1962 32 -126 40 -193 -387 -120 -382 -246 -323 -204 -389 24 -39 -42 88 -17 -2 101 241 -89 223 385 147
1984 147 224 -25 -20 294 158 197 -36 59 295 -161 -96 159 -117 -498 -458 -164 -483 -427 -546 163 -265 -305 -25
$$ packed form
1825A40j7J56mk03j35J47Jl36J89J13l48q9P1J61K32j65J59j11k73J32L06Q3p7
1848A32jJ19k97L38N5r0MR0k23K89m31K22k10q4M4j9r1k33J41j59p1K20l09K23
1872c41J30j15K23j17J84K29k43q4K93J16k07J07K97l28N9O0N0k09l7R7j54M7
1894E7k75K86p4o9J3q7J85l62J63m2j18L63L7j63J86k29K17J25j86K21R0J6l9
1917C15L0r3k38K57J31k68J18j07k20j95K29P8k42J96j33N6j22l37L25p8J68P2
1939e8j20N1P8m5K11k53L55K31k06m8J85n7k0k27L75n56jL75m25J12P2J72j69
1962C2j58J66k33j94K67k62J36p7J19j85M13o3lJ30j05J5J03J40l30L12J62k38
1984A47P7k49NL14j36L9k33R5K36m56O5K55k76l81M0K94l19N6j19P09m28m0K80
$$ plain form
2007 -25 -133 177 42 88 152 292 391 50 324 13 196 138 462 99 88 365 234 -3 -82 -218 -235 -80 -124
2030 -124 -188 -225 -62 -423 -509 -394 -215 -156 -169 -27 193 -211 33 131 -117 286 151 218 108 338 134 248
2052 248 331 199 331 73 11 152 3 -240 -191 -291 -223 -117 -170 -347 -102 -2 -231 -186 -110 61 -73 31
2074 31 86 476 70 123 111 181 310 24 288 127 136 177 -4 -12 414 -85 -147 203 -429 -68 -170 -207 -341 -115
2098 -115 -236 -151 11 -148 -60 165 91 99 151 15 -53 170 78 303 35 297 421 135 62 -108 326 -169 26
2121 26 2 96 66 245 -153 22 -240 60 -66 -357 -179 -382 -268 -163 -246 -8 -49 -104 -212 184 12 53 88
2144 88 94 15 289 123 74 152 -115 248 119 371 179 161 -80 95 -106 -62 -308 -436 -362 -95 -203 -255 -264 -270 -105
2169 -105 -189 -94 74 75 -8 -21 22 -57 460 304 239 167 289 402 238 166 35 279 -164 -165 55 -74 -186 45
$$ packed form
2007b5j08L10j35M6O4J40R9l41K74l11J83n8L24l63j1K77j31k37p9j36j7J55m4
2030a24o4l7J63l61q6J15J79N9j3J42K20m04K44R8k48M03j35O7j10K30k04J14
2052B48Q3j32J32k58o2J41j49k43M9j00O8J06n3j77K45J00k29M5P6J71j34J04
2074C1N5L90m06N3j2P0J29k86K64j61RM1j81qM26m99o2L50o32L61j02l7j34K26
2098a15j21Q5J62j59Q8K25p4QN2j36o8K23r2K25k68K62J24k86p3j70M34m95J95
2121B6k4R4l0J79l98J75k62L00j26k91J78k03J14J05q3K38m1n5j08L96j72M1L5
2144H8Op9K74j66m9P8k67L63j29K52j92j8k41J75k01M4k46j28P4K67j08n2roJ65
2169a05q4R5J68Jq3j3M3p9N17j56o5p2J22J13j64p2j31K44m43jK20j29j12K31
$$ plain form
2193 45 -128 -82 -2 -352 -386 -149 -361 -41 -134 -165 -187 55 -103 -5 75 248 -38 155 267 227 -12 36 216 -162
2217 -162 140 -75 2 -111 90 49 160 -246 95 -98 123 -300 -189 -48 -275 -22 60 -145 -82 -1 -60 41
2239 41 172 17 192 111 126 -61 144 -20 -46 -146 44 230 160 -49 9 -108 -198 -440 -120 -211 -438 -150 -22
2262 -22 -126 -50 89 -47 101 -90 148 -66 142 352 117 245 378 87 130 229 184 166 95 151 75 282 290 -193
2286 -193 76 -132 -2 -74 -173 -74 -320 -2 -8 60 133 -225 -243 -148 -151 52 70 32 123 104 35 -71 124 242 265 385
2312 385 174 229 46 -16 39 -86 -82 -65 286 -118 -65 -187 -32 -268 -44 -242 -229 -15 -271 -147 -219 -96 80
2335 80 115 401 -160 103 414 262 371 281 84 187 19 -4 31 -124 -32 -233 32 183 -86 -78 10 -179 78
2358 78 -298 -12 -99 -209 115 -270 -53 97 140 -24 -102 18 144 -65 259 144 18 373 176 321 9
$$ packed form
2193D5j73M6Q0l50l4K37k12L20r3l1k2K42j58R8Q0J73k86J93J12m0k39M8J80l78
2217a62L02k15P7j13K01m1J11m06L41j93K21m23J11J41k27K53Q2k05O3Q1n9J01
2239D1J31j55J75q1J5j87K05j64k6j00J90J86p0k09N8j17r0k42L20r1k27K88J28
2262b2j04P6J39j36J48j91K38k14K08K10k35J28J33k91M3R9m5j8p1N6p6K07Qm83
2286a93K69k08J30p2r9R9k46L18oO8P3l58j8R5lK03J8l8R1j9o9j06J95J18K3J20
2312C85k11N5j83o2N5j25MJ7L51m04N3j22J55k36K24j98J3K14k56J24p2J23J76
2335H0L5K86n61K63L11j52J09r0j97J03j68k3L5j55R2k01K65J51k69QQ8j89K57
2358G8l76K86q7j10L24l85K17J50M3j64p8J20J26k09L24j15j26L55j97J45l12
$$ plain form
2379 9 -103 20 -37 -77 106 21 299 -249 114 -174 -279 -351 63 -447 51 -1 -354 -75 -234 122 -75 -21 38
2402 38 -81 213 -118 16 173 222 30 17 225 191 153 167 -70 -16 -21 -340 -71 -195 -75 -239 8 71 193
2425 193 47 -223 -361 154 -50 75 25 -22 -119 203 -96 211 277 -23 101 143 333 109 -42 -3 -90 136
2447 136 -29 224 39 -92 -55 -99 -112 -168 -133 -68 -240 -18 70 -17 88 -235 283 -54 -11 -17 -143 -60 -232 -36
2471 -36 569 -60 124 351 267 234 246 -18 203 -29 212 -20 -250 0 -48 -105 -129 -277 -112 -163 -155 -90 -30 -203
2495 -203 35 51 2 -37 19 -83 -12 288 159 167 -56 315 120 153 245 156 47 -28 351 7 276 -334 -30 -63
2519 -63 191 -1 -273 -387 -206 151 -160 -288 8 -114 -153 68 67 46 67 69 143 -35 289 102 545 -107 -52
2542 -52 27 292 12 47 237 -34 59 -337 -24 -383 -67 88 0 -158 124 -367 -172 10 -4 6 -42 -66 -241
$$ packed form
2379Ij12J23n7m0J83q5K78n48L63k88j05p2M14n10M98n2l53K79j59L56j97N4N9
2402C8j19K94l31J34J57M9j92j3K08l4l8J4k37N4nl19K69j24J20j64K47O3J22
2425A93j46k70j38N15k04J25n0m7r7L22k99L07O6l00J24M2J90k24j51L9q7K26
2447A36j65K53j85j31L7m4j3n6L5O5j72K22Q8q7J05l23N18l37M3oj26Q3j72J96
2471c6O05o29J84K27q4l3J2k64K21k32K41k32k30K50m8n7k4j48J65n1QO5O0j73
2495b03K38J6m9l9N6j02P1L00j29Qk23L71j95L3R2q9j09p5L79l44K69o10L04l3
2519f3K54j92k72j14J81L57l11j28K96j22l9K21jk1K1KP4j78L24j87M43o52N5
2542e2P9K65k80L5J90k71R3l96L13l59L16J55q8j58K82m91J95J82j4J0m8k4j75
$$ plain form
2565 -241 -44 52 245 272 29 91 144 12 99 41 -49 277 93 153 -101 -137 -20 -141 -27 -64 -77 -380 -239 -8
2589 -8 140 -182 189 -95 129 -139 4 135 236 52 127 162 285 -48 145 140 221 202 -66 362 206 110 65
2612 65 159 -247 24 38 -17 -11 179 45 -70 -74 -361 -114 -22 -96 -138 -193 -156 258 -26 -52 31 -39 262 64 182
2637 182 206 247 28 77 88 -91 61 186 11 -179 297 -53 90 -157 -334 -99 -36 -174 -284 -370 -255 -123
2659 -123 -62 27 -164 177 29 -80 -46 331 275 16 103 346 246 73 45 32 153 20 90 4 43 -214 68
2682 68 -39 2 -161 -123 -289 -69 -501 -263 9 -281 108 112 -152 3 105 220 -35 -60 88 317 -189 244
2704 244 61 -85 -86 212 73 -12 88 3 -231 -179 -142 -15 57 -66 60 -64 -75 -17 -120 0 -68 -98 -113 123
2728 123 -231 31 182 -42 -20 86 217 116 236 70 268 220 179 192 332 110 232 -120 -53 -213 -126 -129 -144
$$ packed form
2565b41J97R6J93K7k43O2N3j32Q7n8r0L26j84O0k54l6J17j21J14l7j3l03J41K31
2589hJ48l22L71k84K24k68J43J31J01j84P5L5J23l33J93nQ1j9k68M28j56r6m5
2612F5R4m06K71J4n5OJ90j34j15mk87K47R2p4m2n5L7M14k84k6Q3p0L01j98J18
2637A82K4M1k19M9J1j79J52J25j75j90M76l50J43k47j77K35O3j38j10q6J15J32
2659a23O1Q9j91L41j48j09L4L77n6k59Q7K43j00j73k8j3J21j33P0q6L9k57K82
2682F8j07M1j63L8j66K20m32K38K72k90L89Mk64J55J02J15k55k5J48K29n06M33
2704B44j83j46jK98j39q5J00q5k34N2L7J27P2j23J26j24j1N8j03J20o8l0j5K36
2728A23l54K62J51k24K2J06J31j01J20j66J98m8m1J3J40k22J22l52O7j60Q7lj5
$$ plain form
2751 -144 -110 113 -180 -36 -44 21 28 34 102 -123 -62 202 27 121 -23 -64 40 -274 -84 138 233 121 -146 239
2775 239 94 103 -19 -209 -109 22 66 -203 -60 -74 10 -201 -99 -450 -81 -192 242 42 206 119 304 202
2797 202 197 -86 174 28 304 156 47 60 -155 -29 84 67 -189 -43 -237 -59 -187 -186 -88 -292 -134 -272
2819 -272 -72 263 -70 -91 113 -93 179 20 -76 36 39 109 75 63 432 97 119 129 -38 269 -208 67 211
2842 211 -393 -231 -14 -125 -239 -228 -106 -164 -226 -225 -176 83 -127 -157 242 79 -101 40 169 160 78 69 12 -31 -67
2867 -67 -71 285 90 27 236 26 -268 -101 133 -146 -30 38 -67 -21 4 -54 -100 -8 -447 -8 -45 98 -72 -122
2891 -122 72 20 203 236 75 -121 32 155 239 21 -57 -229 105 86 -80 -20 -46 -234 -4 -83 -71 -186 -199
2914 -199 50 -56 -90 -148 -6 200 6 -77 84 472 97 101 351 -9 -50 -158 366 -35 19 -26 -149 -110 -98
$$ packed form
2751a44L4K23k93J44qO5POO8k25O1K64j75R4j44m1J04l14J90K22R5j12k67L85
2775B39j45Rj22j90J00J31M4k69J43j4Q4k11J02l51L69j11M34k00J64q7J85j02
2797B02nk83K60j46K76j48j09J3k15J26J13j7k56J46j94J78j28JR8k04J58j38
2819b72K00L35l33k1K04k06K72j59r6J12LP0l4j2L69l35K2J0j67L07m77K75J44
2842B11o04J62K17j11j14J1J22n8o2JM9K59k10l0L99j63j80J41J29rq2rn7m3l6
2867f7mL56j95o3K09k10k94J67K34k79J16O8j05M6K5n8m6R2m39M39l7J43j70n0
2891a22J94n2J83L3j61j96J53J23Q4k18p8j72L34j9j66O0k6j88K30p9J2j15j3
2914a99K49j06l4n8J42K06j94q3J61L88l75MK50l60m1j08N24m01N4m5j23L9J2
$$ plain form
2937 -98 -173 135 54 -25 64 -58 -154 -74 -124 -89 -166 -90 -230 -393 -36 -291 35 -14 7 194 316 130 335 -14
2961 -14 321 370 -89 151 168 -50 -7 -27 -142 30 130 196 -40 -1 -186 -214 44 112 133 25 -124 -32 -107 -71
2985 -71 20 50 268 -68 2 61 65 49 123 20 103 184 112 205 9 -93 -57 215 116 -190 51 -146 -170 -50 -85 -92
3011 -92 -440 -198 -197 -145 67 110 -40 -17 -94 -192 -411 81 34 32 44 298 443 215 -219 -14 194 154 -178 65
3035 65 220 -153 30 -128 -86 -196 46 -305 -237 -148 140 -372 -71 68 5 -99 -97 -119 128 -187 -137 -43 295
3058 295 271 -220 152 127 12 167 233 179 111 54 101 -162 -116 93 -66 -32 -64 -25 -286 2 -177 75 -349 -112
3082 -112 -142 -40 -88 -112 21 -294 101 47 356 136 -2 70 306 -131 -233 -1 -157 102 295 42 -95 -124
3104 -124 -14 -372 -220 -232 -362 -29 156 -261 -256 104 -166 -8 -4 125 -122 -170 385 120 -53 63 -248 205
$$ packed form
2937i8p5L08q1p9Q9j22r6Q0n0L5p7P6j40j63L57k55L26m9K1J87J22j86K05l49
2961a4L35M9m59K40J7k18M3k0j15J72J00O6k36L9j85k8K58O8K1j08j49R2p5L6
2985g1R1L0K18l36P0N9Mj6P4j03Q3Q1p2R3j96j02L6K72r9l06K41j97k4J20l5p
3011i2l48K42JN2K12M3j50K3p7r8k19M92m7kJ2K54J45k28m34K05K08m0l32K43
3035F5J55l73J83j58M2j10K42l51O8Q9K88n12L01J39o3j04Kk2K47l15N0R4L38
3058B95k4m91L72k5j15J55O6n4o8n7M7k63M6K09j59L4l2L9k61K88j79K52m24K37
3082a12l0J02m8k4J33l15L95n4L09k20j38P2K36m37j02K32j56K59J93k53j37k9
3104a24J10l58J52j2j30L33J85m17NL60k70J58MJ29k47m8N55k65j73J16l11M53
$$ plain form
3126 205 50 154 187 71 283 91 -47 -2 -124 47 20 100 -157 -62 -255 -179 127 -10 7 -394 -131 -62 -40
3149 -40 -71 -214 -278 -124 84 -143 -47 -45 49 128 -7 52 -165 138 300 -179 22 -2 24 -89 -389 -241 -15 187
3173 187 -175 -151 122 -33 -411 -177 -111 -283 143 60 198 -246 106 95 -205 234 363 -41 190 -172 -50
3194 -50 -105 62 -215 -98 83 -25 -203 54 37 55 -139 -39 -274 -4 34 -44 -166 -59 4 -115 -44 77 109
3217 109 116 -83 133 -115 312 95 134 -148 89 98 188 182 -44 39 190 -40 -128 14 -136 -5 -106 -339 -369 124
3241 124 -253 31 -107 145 51 32 -30 -106 -238 102 -118 -133 80 -93 107 -30 -103 115 211 24 119 204 -94
3264 -94 -57 -221 118 177 -332 -155 -185 -15 -454 65 -220 -45 84 -127 -149 -52 -27 -188 -116 23 205 28 104
3287 104 232 120 306 28 25 98 28 -31 -60 -67 -49 401 -135 194 -133 -149 -55 -233 78 -155 -353 31 46 113
$$ packed form
3126B05j55J04L3j16K12j92j38M5j22J71k7Q0k57R5j93P6L06j37J7m01K63O9K2
3149d0l1j43o4J54K08k27R6KR4P9j35N9k17L03J62m79K01k4K6j13l00J48K26K02
3173A87l62K4K73j55l78K34O6j72M26q3J38m44L52j1l00M39J29m04K31l62J22
3194e0n5J67k77J17J81j08j78K57j7J8j94J00k35K70L8p8j22J07O3j19P1J21L2
3217A09Pj99K16k48M27k17L9k82K37RR0ok26Q3J51k30q8J42j50J31j01k33l0M93
3241A24l77K84j38K52r4j9o2p6j32L40k20j5K13j73K00j37p3K18R6j87R5Q5k98
3264i4L7j64L39N9n09J77l0J70m39N19k85J75J29k11k2R7K5j61P2J39J82j77P6
3287A04J28j12J86k78lP3p0n9k9pJ8M50n36L29l27j6R4j78L11k33j98L84J5O7
$$ plain form
3311 113 34 178 -408 -38 222 -63 86 -139 6 -135 -25 207 58 -8 228 81 214 53 47 -75 -248
3332 -248 -260 -96 -106 93 -50 -260 -2 -5 -265 -8 119 178 -149 -137 53 -91 46 -165 158 280 181 154 -162
3355 -162 -116 161 0 22 330 76 123 -19 137 147 -66 20 85 -123 -5 54 88 -109 -265 73 -38 47 -8
3378 -8 57 -111 156 -89 153 19 84 -90 75 77 218 249 33 -101 -140 120 91 -231 -292 -38 -175 24 -96
3401 -96 -113 -70 23 158 79 56 91 -66 -220 -283 -140 258 3 -50 245 -117 -2 75 317 -175 89 41 -84 99
3425 99 -117 62 142 -202 262 21 69 47 246 -7 -26 -208 43 87 -18 116 -86 -8 -52 88 -58 -167 -143
3448 -143 -140 35 86 78 -112 39 169 138 196 -38 21 76 -95 45 66 169 -6 -114 91 -52 -21 -218 182 -221
3472 -221 -103 56 -54 206 -10 126 110 88 11 7 96 -61 25 149 0 164 112 92 142 -410 60 -6 -164 -80
$$ packed form
3311A13p9J44n86L70K60k85J49k25J45j41J10K32j49o6K36j47J33j61oj22j73
3332b48j2J64j0J99j43k10K58lk60K57J27N9l27J2J90j44J37k11L23J22r9k7l16
3355a62M6K77j61K2L08k54M7j42J56J0k13Q6O5k08J18N9L4j97j56L38j11Q5n5
3378hO5j68K67k45K42j34O5j74J65KJ41L1k16j34l9K60k9l22o1K54j37J99j20
3401i6j7M3R3J35p9k3L5j57j54o3J43L98k55n3K95l62J15P7K42m92K64m8j25J83
3425I9k16J79Q0l44M64k41M8k2J99k53j9j82K51M4j05J34k02P8m4J40j46j09K4
3448a43LJ75N1qj90J51J30l1N8k34N9N5j71J40K1J03j75j08K05j43L1j97M00m03
3472b21J18J59j10K60k16J36j6k2p7mQ9j57Q6J24j49J64n2k0N0n52M70o6j58Q4
$$ plain form
3496 -80 -51 88 -80 -239 -243 -145 -227 -100 -139 -208 -154 -36 -168 -102 -138 -71 143 -114 171 165 135 217 -198 153 30
3521 30 30 32 153 304 27 -6 -94 80 -422 -111 -213 -48 35 -144 -163 -246 -95 -156 -141 26 65 -152 -148 35 -123
3546 -123 174 -168 28 -109 209 125 272 133 182 317 -31 -24 -25 31 -193 162 88 -23 28 -35 -154 59 -192
3569 -192 191 -209 -141 -228 -161 168 65 -24 -290 45 164 -73 262 -197 12 -15 -65 -77 130 86 33 103 -73
3592 -73 218 407 -10 -11 128 -204 -126 -215 39 132 -99 -96 -89 375 36 165 -121 -53 140 131 75 113 284 193 63
3617 63 229 -95 13 202 235 190 26 -67 118 -172 26 67 -248 -24 7 -142 -282 -137 -19 7 67 -77 -172
3640 -172 -21 -118 -27 -181 -97 212 -138 168 16 -58 100 187 143 -168 -21 28 6 -192 98 -87 -76 26 -165
3663 -165 147 -47 -64 200 -198 -141 46 -182 2 73 -109 -11 44 14 219 99 -74 68 -40 -12 0 -65 64
$$ packed form
3496h0K9J39j68j59mR8q2J27l9o9N4J18j32O6l6O7K14k57K85ol0Q2m15L51j23
3521C0%KJ21J51k77l3q8J74n02L11j02J65Q3j79j9q3J51o1J5J67L9k17MJ83j58
3546a23K97l42J96j37L18q4J47j39M9J35l48PjN6k24L55p4j11N1o3j19K13k51
3569a92L83m00O8q7O7L29j03q9k66L35J19k37L35m59K09k7n0j2K07m4n3P0j76
3592g3K91J89m17jJ39l32P8q9K54R3k31LPM64l39J29k86O8J93rn6L8J71r1j30
3617F3J66l24J08J89L3m5j64r3J85k90J98M1l15K24L1j49j40J45J18K6O0j44r5
3640a72J51r7R1j54Q4L09l50L06j52p4J58Q7m4l11J47M9k2j98K90j85J1J02j91
3663a65L12j94j7K64l98N7J87k28J84P1j82R8N5l0K05j20j73J42j08K8J2o5J29
$$ plain form
3686 64 -3 149 36 3 -238 -51 48 185 -179 -50 -246 -45 -41 -198 15 -76 66 128 -101 268 20 127 -197
3709 -197 128 260 -167 276 143 168 -182 -92 81 -5 130 -31 -85 104 136 142 -49 8 31 -22 -223 -218 -390 -279
3733 -279 -233 -4 126 200 9 249 17 184 -14 -13 -61 142 -20 26 -104 14 134 -32 51 251 175 -103 -159
3756 -159 76 234 -264 -29 -141 152 -142 286 155 -173 46 122 1 29 345 -135 151 -120 -30 49 130 139
3778 139 -173 -105 68 -69 43 60 15 160 -221 -122 116 264 224 -43 -61 -154 -180 -57 -38 -250 72 -30 240
3801 240 -62 -130 -103 233 188 120 137 -66 -36 104 91 -42 231 -8 -28 225 92 89 -223 44 94 51 -166 -72
3825 -72 226 -69 -125 -117 -176 -288 -29 -347 -79 -213 -202 -16 -21 194 -45 14 108 -32 -188 36 -124 -142 -130 78
3849 78 -64 124 53 250 -209 -71 -215 87 31 -225 251 156 41 -9 -196 -212 -39 -148 -116 138 142 -153 155
$$ packed form
3686F4o7J52j13l3k41J87R9J37l64J29j96K01Mj57K13r1J42O2k29L69k48J07l24
3709a97L25J32m27M43j33K5l50R0J73q6J35j61n4J89L2Oj91N7K3n3k01Nj72J11
3733b79M6K29J30P4j91K40k32J67j98Jm8K03j62M6j30J18J20j66Q3K00p6k78n6
3756a59K35J58m98K35j12K93k94M28j31l28K19P6j21K8L16m80K86k71R0P9Q1R
3778A39l12O8J73j37J12J7m5J45l81R9K38J48m0k67j8r3k6J23J9k12L22j02K70
3801B40l02o8K7L36m5o8J7k03L0J40j3j33K73k39k0K53j33ll12K67N0m3k17R4
3825g2K98k95n6Qn9j12K59l18K68j34J1J86nK15k39N9R4j40j56K24j60j8J2K08
3849G8j42J88p1J97m59J38j44L02n6k56M76r5j15n0j87j6J73j09L2K54Mk95L08
$$ plain form
3872 155 118 -57 -100 -171 149 191 -221 167 -18 -136 200 -16 117 34 29 20 -86 32 -217 -309 49 -113 101
3895 101 -118 -212 78 -197 81 -53 -116 189 1 -27 42 -146 113 108 -20 -222 -214 202 -167 -73 -1 41 103 -147
3919 -147 122 277 -58 -50 1 -202 -44 -232 30 -23 -55 -124 -144 -133 108 62 -128 -132 -47 -15 -31 155 -363 75 158
3944 158 -9 216 -90 45 181 -6 161 -7 178 -210 -138 -151 -46 -147 -54 -117 -132 -11 -138 -23 -168 173
3966 173 -40 -178 -76 117 -3 -73 191 14 5 184 150 -6 190 286 84 135 278 162 -82 -133 99 -61
3988 -61 -147 34 -26 -140 -249 64 -42 -70 52 -48 118 -187 24 -9 29 -119 -21 -118 113 -75 49 271 -154
4011 -154 -365 127 -23 -33 244 -42 30 -136 -385 -16 122 -10 -161 -318 -132 -12 -46 -112 -66 -201 -22 40
$$ packed form
3872A55l7j75m3p1L20M2m12L88j85j18L36k16J33q3nrj06J18k49r2L58j62K14
3895A01k19r4K90k75K78j34o3L05j88k8O9j88K59nj28k02QM16l69R4P2M2O2k50
3919a47K69J55l35QN1k03J58j88K62n3l2o9k0J1K41m6j90mQ5L2j6J86n18M38Q3
3944A58j67K25l06J35J36j87J67j68J85l88P2j3J05j01R3o3j5J21j27J15j45L41
3966A73k13j38J02J93j20p0K64j77rJ79l4j56J96R6k02N1J43j16k44n1K32j60
3988f1q6J81o0j14j09L13j06k8J22j00J66l05K11l3L8j48R8r7K31j88J24K22m25
4011a54k11M92j50j0K77k86P2j66k49L69J38j32j51j57J86J20l4o6M6j35J79O2
$$ [...]
8191g0
##END NTUPLES=NMR FID
##END=
