##TITLE=1H_Ser Am-2-i
 CDCl3
 8 sc, 
 7.10.2024
##JCAMPDX= 6.0         $$ Bruker NMR JCAMP-DX V2.0
##DATA TYPE= NMR FID
##DATA CLASS= NTUPLES
##ORIGIN= UXNMR, Bruker Analytische Messtechnik GmbH
##OWNER= root
$$ XWIN-NMR		Version 3.5
$$ Mon Oct  7 15:45:49 2024 Russian Standard Time (UT+4h)  she@DPX200
##.OBSERVE FREQUENCY= 200.1318
##.OBSERVE NUCLEUS= ^1H
##.DELAY= (6, 6)
##.ACQUISITION MODE= SIMULTANEOUS
##.ACQUISITION SCHEME= undefined
##.AVERAGES= 8
##.DIGITISER RES= 18
##SPECTROMETER/DATA SYSTEM= spect
##.PULSE SEQUENCE= zg30
##.SOLVENT NAME= CDCl3
##.SHIFT REFERENCE= (INTERNAL, CDCl3, 0, 15.7039)
##AUDIT TRAIL= $$ (NUMBER, WHEN, WHO, WHERE, WHAT)
$$ ##TITLE= Audit trail, XWIN-NMR		Version 3.5
$$ ##JCAMPDX= 5.01
$$ ##ORIGIN= Bruker BioSpin GmbH
$$ ##OWNER= she
$$ F:/spectra/data/she/nmr/H-F/1/audita.txt
$$ ##AUDIT TRAIL=  $$ (NUMBER, WHEN, WHO, WHERE, WHAT)
(   1,<2024-10-07 15:44:19.37 +0400>,<she>,<DPX200>,
      <created by zg, POWCHK disabled, PULCHK disabled
       configuration hash MD5:
       00 E9 B6 7A A2 85 ED C7 34 08 36 98 17 FE 4E 26
       data hash MD5: 16K
       75 71 49 B5 B2 99 8B A3 1A FE E1 DD 05 23 7A F9>)
$$ ##END=
$$ 
$$ hash MD5
$$ 8B 80 85 E7 0C C6 FA 8B 94 AE 9B 45 BC DD D0 F7
##$RELAX= 
##$RELAX= 
##$RELAX= 
##$RELAX= 
##$RELAX= 
##$RELAX= 
$$ Bruker specific parameters
$$ --------------------------
##$DU= <F:/spectra>
##$EXPNO= 1
##$NAME= <H-F>
##$PROCNO= 1
##$TYPE= <nmr>
##$USER= <she>
##$AMP= (0..31)
100 100 100 100 100 100 100 100 100 100 100 100 100 100 100 100 100 100 
100 100 100 100 100 100 100 100 100 100 100 100 100 100 
##$AQSEQ= 0
##$AQ_mod= 1
##$AUNM= <au_zg>
##$AUTOPOS= <>
##$BF1= 200.13
##$BF2= 200.13
##$BF3= 200.13
##$BF4= 200.13
##$BF5= 200.13
##$BF6= 200.13
##$BF7= 200.13
##$BF8= 200.13
##$BYTORDA= 1
##$CFDGTYP= 0
##$CFRGTYP= 5
##$CHEMSTR= <none>
##$CNST= (0..31)
1 1 145 1 1 1 1 1 1 1 1 1 1 1 1 1 1 1 1 1 1 1 1 1 1 1 1 1 1 1 1 1 
##$CPDPRG= <>
##$CPDPRG1= <>
##$CPDPRG2= <>
##$CPDPRG3= <>
##$CPDPRG4= <mlev>
##$CPDPRG5= <mlev>
##$CPDPRG6= <mlev>
##$CPDPRG7= <mlev>
##$CPDPRG8= <mlev>
##$CPDPRGB= <>
##$CPDPRGT= <>
##$D= (0..31)
0 1.2 0 0 0 0 0 0 0 0.06 0 0.03 0 0 0 0 0.0002 0 0 0 0 0 0 0 0 0 0 0 0 
0 0 0 
##$DATE= 1728301458
##$DBL= (0..7)
120 120 120 120 120 120 120 120 
##$DBP= (0..7)
150 150 150 150 150 150 150 150 
##$DBP07= 0
##$DBPNAM0= <>
##$DBPNAM1= <>
##$DBPNAM2= <>
##$DBPNAM3= <>
##$DBPNAM4= <>
##$DBPNAM5= <>
##$DBPNAM6= <>
##$DBPNAM7= <>
##$DBPOAL= (0..7)
0.5 0.5 0.5 0.5 0.5 0.5 0.5 0.5 
##$DBPOFFS= (0..7)
0 0 0 0 0 0 0 0 
##$DE= 6
##$DECBNUC= <off>
##$DECIM= 24
##$DECNUC= <off>
##$DECSTAT= 4
##$DIGMOD= 1
##$DIGTYP= 9
##$DL= (0..7)
0 120 120 120 120 120 120 120 
##$DP= (0..7)
150 150 150 150 150 150 150 150 
##$DP07= 0
##$DPNAME0= <>
##$DPNAME1= <>
##$DPNAME2= <>
##$DPNAME3= <>
##$DPNAME4= <>
##$DPNAME5= <>
##$DPNAME6= <>
##$DPNAME7= <>
##$DPOAL= (0..7)
0.5 0.5 0.5 0.5 0.5 0.5 0.5 0.5 
##$DPOFFS= (0..7)
0 0 0 0 0 0 0 0 
##$DQDMODE= 0
##$DR= 18
##$DS= 0
##$DSLIST= <SSSSSSSSSSSSSSS>
$$ [...]
##$SUBNAM2= <"">
##$SUBNAM3= <"">
##$SUBNAM4= <"">
##$SUBNAM5= <"">
##$SUBNAM6= <"">
##$SUBNAM7= <"">
##$SUBNAM8= <"">
##$SUBNAM9= <"">
##$SW= 24.0689170037331
##$SWIBOX= (0..15)
0 0 2 0 0 0 0 0 0 0 0 0 0 0 0 0 
##$SW_h= 4816.95568400771
##$TD= 16384
##$TD0= 1
##$TE= 0
##$TE2= 300
##$TE3= 300
##$TEG= 300
##$TL= (0..7)
0 120 120 120 120 120 120 120 
##$TP= (0..7)
150 150 150 150 150 150 150 150 
##$TP07= 0
##$TPNAME0= <>
##$TPNAME1= <>
##$TPNAME2= <>
##$TPNAME3= <>
##$TPNAME4= <>
##$TPNAME5= <>
##$TPNAME6= <>
##$TPNAME7= <>
##$TPOAL= (0..7)
0.5 0.5 0.5 0.5 0.5 0.5 0.5 0.5 
##$TPOFFS= (0..7)
0 0 0 0 0 0 0 0 
##$TUNHIN= 0
##$TUNHOUT= 0
##$TUNXOUT= 0
##$USERA1= <user>
##$USERA2= <user>
##$USERA3= <user>
##$USERA4= <user>
##$USERA5= <user>
##$V9= 5
##$VALIST= <valist>
##$VCLIST= <CCCCCCCCCCCCCCC>
##$VD= 0
##$VDLIST= <DDDDDDDDDDDDDDD>
##$VPLIST= <PPPPPPPPPPPPPPP>
##$VTLIST= <TTTTTTTTTTTTTTT>
##$WBST= 1024
##$WBSW= 4
##$XGAIN= (0..3)
0 0 0 0 
##$XL= 0
##$YL= 0
##$YMAX_a= 228750
##$YMIN_a= -228190
##$ZGOPTNS= <>
##$ZL1= 120
##$ZL2= 120
##$ZL3= 120
##$ZL4= 120
##$ABSF1= 10
##$ABSF2= 0
##$ABSG= 5
##$ABSL= 3
##$ALPHA= 0
##$AQORDER= 0
##$ASSFAC= 0
##$ASSFACI= 0
##$ASSFACX= 0
##$ASSWID= 0
##$AUNMP= <proc_1d>
##$AZFE= 0.1
##$AZFW= 0.1
##$BCFW= 1
##$BC_mod= 2
##$BYTORDP= 1
##$COROFFS= 0
##$CY= 11.3945322036743
##$DATMOD= 1
##$DC= 2
##$DFILT= <>
##$DTYPP= 0
##$F1P= 15.6554695791079
##$F2P= 12.8336369535428
##$FCOR= 0.5
##$FTSIZE= 0
##$FT_mod= 4
##$GAMMA= 1
##$GB= 0.15
##$INTBC= 1
##$INTSCL= 1
##$ISEN= 128
##$LB= 0.24
##$LEV0= 0
##$LPBIN= 0
##$MAXI= 10000
##$MC2= 0
##$MEAN= 0
##$ME_mod= 0
##$MI= 1.114404
##$NCOEF= 0
##$NC_proc= 0
##$NLEV= 6
##$NOISF1= 3.799351
##$NOISF2= 2.8
##$NSP= 1
##$NTH_PI= 0
##$NZP= 0
##$OFFSET= 15.70392
##$PC= 1
##$PHC0= -26347.94
##$PHC1= 15.78747
##$PH_mod= 1
##$PKNL= yes
##$PPARMOD= 0
##$PSCAL= 0
##$PSIGN= 0
##$REVERSE= no
##$SF= 200.130013532006
##$SI= 16384
##$SIGF1= 3
##$SIGF2= 2
##$SINO= 400
##$SIOLD= 16384
##$SREGLST= <1H.CDCl3>
##$SSB= 0
##$STSI= 0
##$STSR= 0
##$SW_p= 3612.71676300578
##$SYMM= 0
##$S_DEV= 0
##$TDeff= 0
##$TDoff= 0
##$TI= <>
##$TILT= no
##$TM1= 0
##$TM2= 0
##$TOPLEV= 0
##$USERP1= <user>
##$USERP2= <user>
##$USERP3= <user>
##$USERP4= <user>
##$USERP5= <user>
##$WDW= 1
##$XDIM= 8192
##$YMAX_p= 0
##$YMIN_p= 0
$$ End of Bruker specific parameters
$$ ---------------------------------
##NTUPLES= NMR FID
##VAR_NAME=  TIME,          FID/REAL,        FID/IMAG
##SYMBOL=    X,             R,               I
##VAR_TYPE=  INDEPENDENT,   DEPENDENT,       DEPENDENT
##VAR_FORM=  AFFN,          ASDF,            ASDF
##VAR_DIM=   8192,          8192,            8192
##UNITS=     SECONDS,       ARBITRARY UNITS, ARBITRARY UNITS
##FACTOR=    0.0002076,     1,               1
##FIRST=     0,             0,               0
##LAST=      1.7004516,     0,               0
##MIN=       0,             -228190,         0
##MAX=       1.7004516,     228750,          0
$$ Real data points
##PAGE= N=1
##DATA TABLE= (X++(R..R)), XYDATA
0@%%%%%Pj5J6j6J6k4L2l2M0n2O3p8R4j10J31j55J82k14K46k85L32l81M33m90N56
30B96o30P10p99Q97j003J120j248J390j545J712j899K105k330K580k855L160l505
47a844L892m332M835n414O095o909P899r131J0714j2839J5861k0532K8963o9095
61e1837K80587j67688k70833L65922l6268k08385J54000N2983k16371P9127J13744
72I4981k03862J3427K17321k21759l3377L11175j64437j54869K85443m0857j92512
83h9326J17539M3295j23677K3062M9459r6537K5485J30325j37238l2507K11484
94A21364j08744r8618K02510p2780j37302J41257j852j24347N4084N3536p7725
105d8617J7374J07522q5507m1420J65197p6180j15276J62018l6521j45154J04562
$$ plain form
0 0 0 0 0 0 0 7 -8 8 -8 8 -16 16 -16 24 -28 35 -43 51 -59 72 -83 99 -115 131 -154 178 -203 230 -260 296
30 296 -334 376 -423 474 -529 591 -657 733 -812 900 -999 1106 -1224 1356 -1499 1661 -1844
47 -1844 2048 -2284 2551 -2863 3232 -3677 4222 -4909 5805 -7034 8827 -11705 17258 -51837
61 -51837 228750 61062 -209771 156151 119883 -88502 65498 118481 -97890 -18763 94981
72 94981 -108881 -95454 121867 -99892 -133269 177906 13469 -141400 144043 103186 -89326
83 -89326 28213 71508 -52169 -29107 20352 -76185 -50700 79625 -57613 -90120 121364
94 121364 12620 -85998 116512 43732 -93570 47687 45835 -78512 -24428 29108 -48617
105 -48617 -31243 76279 -9228 -50648 114549 38369 -76907 85111 48590 -96564 7998
116G998J2519j07177N0245N0260p0268J2374J11782n3946o6675J44674k7742j34252
128g0208J37050P587j67649R0711O2628j32746K1511R4280o6738l5348J11237
139E2315j6064r0923J08991R901j39840J00615M9314j59048N3867Q5396j09633
150e5109R205Q9981n8804l4930R6105l996q3032O8551K3820r9809O3998L4912
162E0892j22332N9118P4970j13113J6876R8160o9486l6227R2070k0133q1299P1227
174B0723K2916j09903M5061O2325j01815K5833P9884q5321J1050J03634o2926
185A1461m9901R4999j409q8150M6912L4522r4541J7802O8194q4508j0663Q8509
197C3227m7658k8184Q3644k0400n3410O6603J3591p8919K8658M9946p6226j0994
$$ plain form
116 7998 20517 -86660 -36415 13845 -56423 -44049 67733 13787 -52888 91786 64044 -70208
128 -70208 66842 74429 -93220 -2509 60119 -72627 -51116 43164 -23574 -58922 52315
139 52315 36251 -54672 54319 64220 -75620 24995 74309 -84739 -30872 54524 -55109
150 -55109 -45904 44077 -14727 -49657 46448 42452 -40580 27971 51791 -48018 15980 50892
162 50892 -71440 -12322 62648 -50465 -33589 64571 -4915 -41142 50928 30795 -50504 20723
174 20723 43639 -66264 -21203 41122 -60693 -34860 45024 -40297 -29247 74387 11461
185 11461 -38440 56559 55150 -33000 13912 48434 -46107 -28305 39889 -44619 -55282 33227
197 33227 -14431 -42615 41029 20629 -32781 33822 47413 -31506 -2848 47098 -29128 -40122
209d0122P0122m7567k9208P2791k3816m1337P2830L595o6332M3888L2225o9239
221b2170J0275M8147o0272j3599O4608l3206l5085O0566m776m4072N0307J0469
233C1192o0508L4314L1229o9131R988N3135n3809j2382O3054k4830k7724N6924
245C1452j993m8042M0964J9749o3852J4640L6027o2894N12N3037n0098j2576O5063
258B1989j9851k6963N2671N070m2960K8051K3755n6680L506M2751n6342j3097
270c8100N9522l8166k3213O1106j3155l0592M4995R386m3593J3458L3877m5430
282i905j7443M9622l4727k8768O1777k0804l6568N8606k63m0340L1835J6550l9060
295i488j517L4279l0057k9496N1893j2924m3375N8676J641m5191M8580N663m5323
$$ plain form
209 -40122 30000 -17567 -46775 26016 2200 -39137 33693 37288 -29044 14844 47069 -22170
221 -22170 -11895 36252 -24020 -37619 26989 -6217 -41302 19264 14488 -29584 20723 31192
233 31192 -29316 4998 36227 -32904 -22916 30219 -23590 -35972 27082 2252 -25472 31452
245 31452 29459 -18583 22381 42130 -21722 -7082 28945 -33949 -33437 19600 -30498 -43074 21989
258 21989 2138 -24825 27846 32916 -10044 18007 41762 -14918 -11412 31339 -25003 -38100
270 -38100 21422 -16744 -39957 21149 7994 -22598 22397 31783 -11810 1648 35525 -9905
282 -9905 -27348 22274 -12453 -41221 20556 -248 -36816 21790 21527 -18813 13022 29572 -9488
295 -9488 -11005 23274 -6783 -36279 15614 2690 -40685 17991 19632 -25559 23021 28684 -16639
308a6639K6918J4741m0739o839L2252j9525l2459M7733K136m6537N7793J5230
320C4065n6143M6180J8598n4855K0515J8895m2650p701L1021j6672l6042M5360
332E71J4979n5369M6024L2594o1965L3591L2190n8623J2484L0562l8161j2160
344b3283L0440n440l1461L1541K3505n2043K9541M1194o3904J5777M3099n8004
356a9038K422L6869l4532j1325L2296q20k8630K3840L0336m6819J1710M6859n9580
369a6412P94N1755n6574q902M9439l1195j6464L6390L764k6258J8635L2359m1944
382d613k227N0792n1890j8558N6665m6719k2791N3609k6751k1928M1027L896k6146
395a5634J7916L1709l4155r011N0655m1606k6488O0519l7912l4790N8889j9655
$$ plain form
308 -16639 10279 25020 -15719 -22558 9694 -9831 -42290 5443 7579 -38958 18835 34065
320 34065 -22078 24102 42700 -12155 8360 27255 -15395 -23096 7925 -8747 -44789 571
332 571 15550 -39819 6205 38799 -23166 10425 42615 -16008 -3524 27038 -11123 -23283
344 -23283 7157 1717 -29744 1797 25302 -26741 2800 43994 -19910 -4133 38966 -19038
356 -19038 -16616 20253 -14279 -25604 6692 5872 -22758 1082 31418 -15401 -3691 43168 -16412
369 -16412 -15618 36137 -20437 -29339 20100 -11095 -27559 8831 12595 -13663 4972 37331 -4613
382 -4613 -6840 43952 -7938 -26496 30169 -16550 -39341 14268 -12483 -34411 6616 10512 -15634
395 -15634 2282 33991 -164 -9175 41480 -126 -26614 33905 -4007 -38797 20092 437
407D37l3088M2456L906l0706J6062K8610l2401j3888M8981l0349l6598O0883k1101
420C204m4364N9381o328m2340M2228J1370l6183J1606K8319k7042j9685M1844
432B2010j7940m1131N3134n704m9811N3093P215m7000L6522J7095l8678Q563K6079
445B3447k6070k1495L6026r882m2527M5180P132n0360M6106J9817n0046L2243
457I571K7560m2364M713K9746k6471k4118L2776n640m4255L7276J6109n3244L5249
470c092L1086n1362K1226L6421m1435j856L4315k3234k4603L1912P14m0523K9603
483h28K2254m7096K3854L5372m8662J0142L8646m0338r354L6280k1701k5926L1962
496D605L739l6449K6052K6093m2721J5448L9061m5057j492M1749l6363j8636L8747
$$ plain form
407 437 -32651 9805 13711 -16995 -933 27677 -4724 -18612 30369 20 -36578 24305 3204
420 3204 -41160 18221 11893 -30447 11781 23151 -13032 -1426 26893 -149 -19834 22010
432 22010 4070 -37061 16073 10369 -39442 13651 20866 -26134 10388 27483 -11195 -2632 23447
445 23447 -2623 -24118 11908 2026 -40501 4679 11811 -38549 7557 27374 -22672 9571
457 9571 37131 -5233 -520 29226 2755 -21363 11413 5773 -38482 -1206 14903 -38341 -3092
470 -3092 27994 -23368 -2142 34279 -7156 -9012 25303 2069 -22534 9378 10092 -30431 -828
483 -828 21426 -25670 -1816 33556 -15106 -4964 33682 -6656 -16010 20270 -1431 -27357 4605
496 4605 8344 -28105 -2053 24040 -18681 -3233 35828 -9229 -10721 31028 -5335 -23971 14776
509A4776j5961l0167L2898J0530l4788K1519L0933l7426O093L9518l7867j2989
521a2931M0145k8876k7863L6562q695l3227K9840J5342l2862J8208L2458l3271
533e170P52L9877l1064j9236L9410k0723l2128L5617l06l7617K8109K0574l5931
546a7836J2798L4003l3669o582L8615k6420k4419L7879j1357l4462L4002J0466
558A3018l7426K2529K6818l4754O935L4188l2904j2179L6122k2541k5825L3091
570G072m151l2114K9066J6764l4819J7064L1403l4736m92L5177l0639j7479L3701
583A5817j8356k6613L0122J445k9571K2979K2756l0133R789L3305l0430o693L6749
596C1166k7912k2376L3965j4026k8484K7551N250k8710J7431K4033k7084Q98L5274
$$ plain form
509 14776 -1185 -31352 1546 12076 -22712 -1193 29740 -7686 -1593 37925 58 -12931
521 -12931 27214 -1662 -29525 7037 -1658 -34885 -5045 10297 -22565 -4357 28101 -5170
533 -5170 -4418 35459 4395 -14841 24569 3846 -28282 7335 7029 -30588 -2479 18095 -17836
546 -17836 -5038 28965 -4704 -11286 27329 909 -23510 14369 3012 -31450 2552 13018
558 13018 -24408 -1879 24939 -9815 -2880 31308 -1596 -13775 22347 -194 -26019 7072
570 7072 2921 -29193 -127 16637 -18182 -1118 30285 -4451 -4943 30234 -405 -17884 15817
583 15817 -2539 -29152 970 2415 -27156 -4177 18579 -11554 -1765 31540 1110 -5583 31166
596 31166 3254 -19122 14843 817 -27667 -116 5134 -23576 -6145 17888 -9196 -8298 26976
609B6976k6328j6090L9263j9644k8355L6218o033l0641K7043J1521k7433R760
621c743K4886k1708q524L1429j9535k3364L6680j3137l2154L5586m38l0683K6810
634B105J3134k5813R288K2348j8897j0616K7297j4671k7063L4263p073l4618L5021
647D705N022l4583K7700J6761k7470P444K2117j6419j3984K3342o769l0134K5876
660C608L566l6207K6730J2546l2881K0591J9220k3529M994J8174j1245j1495J7118
673A1190k39k6800J7042J1343l3197J8306J8337l3655J3158K3223k4484k77J8133
686A2080r955j3731J4745O041k6845J0754K2820l1063P141L0389l0260Q98K9159
699B2173k0472q372J7953p040j5929R980R990k3738L892K6103k6208M96L4584
$$ plain form
609 26976 648 -15442 23821 4177 -24178 12040 6007 -24634 2409 13930 -13503 -3743
621 -3743 21143 -565 -9089 22340 2805 -20559 16121 2984 -29170 6416 5978 -24705 2105
634 2105 15239 -10574 -1286 21062 2165 -8451 18846 4175 -22888 11375 4302 -30316 4705
647 4705 9727 -24856 2844 19605 -7865 -421 21696 5277 -8707 14635 7866 -22268 3608
660 3608 7174 -29033 -2303 10243 -22638 -2047 17173 -6356 -1362 16812 5567 -5928 11190
673 11190 10951 -15849 1193 12536 -20661 -2355 15982 -17673 -4515 18708 -5776 -6053 12080
686 12080 2125 -11606 3139 9180 -17665 -6911 15909 -15154 -8013 22376 -7884 -6986 22173
699 22173 1701 -6671 11282 4242 -11687 -1707 8283 -15455 -11563 14540 -11668 -11172 23412
712B3412k7449n295L3339k1457j2215K2325r966j8360J3265Q519k3313M155K8030
725A4990k4887l286L9868k5697j2921L9044j8939k0738K6843q096k2764J3668
737b915R788k1832Q28K6236j7944j0243L6276j6616j8577L3993j2814k1462K6001
750A0719n994j9797J4189P725j4807J621K0263j3090j1206K9675j1192k3138K8022
763A2990p916k4419K3426j745k0811J4235J1063j2970M28J9784p463j5517K5307
776A6392l483k8376K1808K236k8920J7678P635k1145J0415J4776j0787k339J9033
789A4923l631j8802K0085K406l0632J6456Q540l0825J3383J5213k2930P116J8889
802A0191j1953l612J9434l670j8950J7591N647k9537J3758J3840l0478J0322K1368
$$ plain form
712 23412 -4037 -9332 24007 2550 -9665 12660 2694 -15666 -2401 6118 -17195 -13040 14990
725 14990 -9897 -13183 26685 988 -11933 27111 8172 -12566 14277 6181 -16583 -2915
737 -2915 6873 -14959 -14131 12105 -5839 -16082 20194 3578 -14999 18994 6180 -15282 10719
750 10719 4725 -15072 -883 6842 -7965 -6344 13919 829 -10377 19298 8106 -15032 12990
763 12990 5074 -19345 4081 2336 -18475 -4240 6823 -6147 -5719 14065 6602 -8915 16392
776 16392 12909 -15467 6341 8577 -20343 -2665 4970 -16175 -5760 9016 -1771 -4110 14923
789 14923 11292 -7510 12575 14981 -15651 805 9345 -21480 -8097 7116 -15814 -8698 10191
802 10191 -1762 -5374 14060 10390 -8560 9031 14678 -14859 -1101 12739 -17739 -7417 13951
815A3951k3744K164K1544j3317p065J8593n136j9832J4355P432k5682J0134J6548
828I945k4427P350K2561j9469M0K1490j2882r329J6229m426j8505J0687O639k1692
842a5789P182J6968j9206K431K2917j3918m815J9681r501j1730J4221k010j8754
855a2323P445R765j7662J871J8508j3599l250K3145q298j2220J9668k427j7604
868f981J1330M990j9788M026J4090j7030k645K1086j0575j0105K1858l572j7242
881a0558J7054L268k1092R704J1586k0138K426J8756j5826m049K2669r735j2844
894h779K1049k875k0343J5299N416k4279Q091J5328k1528J220K2156j5949m581
907i775K4753j0288j3252K1496k594k0079J3131O349k3131O426J6749k0880j172
$$ plain form
815 13951 -9793 -7629 13915 598 -6467 12126 6990 -12842 1513 8945 -16737 -6603 9945
828 9945 -14482 -7132 15429 -4040 -4000 17490 4608 -4721 11508 7082 -11423 -736 5903 -15789
842 -15789 -8607 8361 -10845 -8414 14503 585 -4230 15451 5950 -5780 8441 6431 -12323
855 -12323 -4878 4887 -12775 -10904 7604 -5995 -9245 13900 5602 -6618 13050 10623 -6981
868 -6981 4349 9339 -10449 -6423 7667 -9363 -12008 9078 -1497 -11602 10256 6684 -10558
881 -10558 6496 9764 -11328 -1624 9962 -10176 -7750 11006 -4820 -8869 13800 4065 -8779
894 -8779 12270 9395 -10948 4351 9767 -14512 -6421 8907 -12621 -11401 10755 -5194 -9775
907 -9775 14978 4690 -8562 12934 10340 -9739 3392 9741 -13390 -6964 9785 -11095 -12267
920a2267K4011j4829o455K4168r046j2699J8341j975j7808R840P434j9125J657
933h753J6352j6030l826K2100j1389r100K2511o023j3283J6080Jj5329O923Q468
947H702j5392j844J7388j0632r798K1305o133j4410K0413k601j7058J3276L222
960F438j5802M135J0178j0568n148J7859m187j2945K0588L0j9159J7714K294k0814
974i387J1061N470j7588L207J1206r665o242J7110p66j5287J9718M154k2464J6440
988F967O388k4187J0526Q492j9557L038J2966j0021n181J6336O91j5278J6414
1001G594P650k3805J2940J0971k5866P654J2092j9704K305J3273q758n032J2941
1014D255K207j3664J0186J0067k1656P081J3752k2844M222J5520j7309J740J4442
$$ plain form
920 -12267 11744 -3085 -9540 14628 5582 -7117 11224 9249 -8559 1281 8715 -10410 -8753
933 -8753 7599 -8431 -12257 9843 -1546 -10646 11865 5842 -7441 8639 8640 -6689 234 8702
947 8702 -6690 -8534 8854 -1778 -11576 9729 3596 -10814 9599 6998 -10060 3216 6438
960 6438 -9364 -5229 4949 -5619 -10767 7092 2905 -10040 10548 10578 -8581 9133 11427 -9387
974 -9387 1674 7144 -10444 -7237 3969 -5696 -11938 5172 4406 -10881 8837 12991 -9473 6967
988 6967 13355 -10832 -306 8186 -11371 -8333 4633 -5388 -10569 5767 6458 -8820 7594
1001 7594 15244 -8561 4379 15350 -10516 -2862 9230 -10474 -8169 5104 -3654 -8686 4255
1014 4255 6462 -7202 2984 13051 -8605 -1524 12228 -10616 -6394 9126 -8183 -6443 7999
1027G999p374m062J0498K398j2892N137R885j9470Q55J5908k0121p02J9061j5099
1041g979j251J7604n674n727J0363L279j1696J271J1372j6732n027J8572j5925
1054g550o487K1962j1334o291J8986m173q261R254M023j1827r94J1723j3401p801
1068a2171J8999j1209j0554K2627p424j0802J9554k855j0856J0089K896j1380
1080c086n78J1195j0600q227J8573o874j3013K2207m236j4766J8177j038j4655
1093f921Q836L620j2629j51J0086o528q355J7488k323j3413J9782L27j6677J5570
1107H712J674j6502P741L752j2029q08Q961m754q388J4274J167j2781J5566L868
1121A0453j7443J2459M790j7139N888O639j1928j550J0370l505q460J2189M045
$$ plain form
1027 7999 625 -3437 7061 9459 -3433 1704 11589 -7881 -7026 8882 -11239 -11941 7120 -7979
1041 -7979 -9230 8374 2700 -3027 7336 10615 -1081 190 11562 -5170 -10197 8375 -7550
1054 -7550 -14037 7925 -3409 -9700 9286 5113 -3148 6106 10129 -1698 -2692 9031 -4370 -12171
1068 -12171 6828 -4381 -14935 7692 268 -10534 9020 6165 -4691 5398 8294 -3086
1080 -3086 -3664 7531 -3069 -11296 7277 403 -12610 9597 5361 -9405 8772 7734 -6921
1093 -6921 1915 5535 -7094 -7245 2841 -3687 -12042 5446 3123 -10290 9492 9819 -6858 8712
1107 8712 10386 -6116 1625 5377 -6652 -7460 1501 -3253 -11641 2633 3800 -8981 6585 10453
1121 10453 -6990 5469 10259 -6880 -992 5647 -6281 -7831 2539 -966 -9426 2763 6808
1134F808j4490J1861P811j8415P889R622j7133K360J0221j0990l315J0766j832
1147A163q985R915N080j4011P585R609j7029L552J1948j4885q05J3279r226m495
1161g305J2286j028r038R603N088j3472M579R948j6215K29J2831j4020l769J4696
1175D413p548o322J3280J61r277Q897O649j3098L135J0510j3595k885J3192j0927
1189c415o842J4264m361q666J2202K257j0250P022P540j2064Q20J0976j1605n076
1203g198J2757p412q317J2834j058j0685J1262M476j1589N733Q647j2116o82J1355
1217H007r996n703J3076m959r243J2060J839j1604Q529O764j2754L141R234j2388
1231c997k809J2143q744o769J2720k066r039J1453M770j1099O097Q985j2510j91
$$ plain form
1134 6808 -7682 4179 11990 -6425 1464 11086 -6047 -3687 6534 -4456 -7771 2995 1163
1147 1163 -7822 2093 7173 -6838 747 10356 -6673 -3121 8827 -6058 -6863 6416 -2810 -7305
1161 -7305 4981 3953 -5085 4518 9606 -3866 713 10661 -5554 -5325 7506 -6514 -10283 4413
1175 4413 -3135 -9457 3823 3984 -5293 3604 10253 -2845 290 10800 -2795 -5680 7512 -3415
1189 -3415 -10257 4007 -354 -9020 3182 5439 -4811 2211 9751 -2313 -1493 9483 -2122 -7198
1203 -7198 5559 -1853 -10170 2664 1606 -9079 2183 6659 -4930 803 9450 -2666 -3348 8007
1217 8007 -1989 -7692 5384 425 -8818 3242 5081 -6523 2006 8770 -3984 -843 8391 -3997
1231 -3997 -6806 5337 -3407 -10176 2544 478 -8561 2892 7662 -3437 2660 11645 -865 -1056
1245a056J0804j1939n609J2077p425p878J2554j194q906J0076O004j0251L379
1258F36R949j1230k663J2166j0668o756J3323o320q666J2758J25r033Q295O324
1272H240r589O67J0132r643n641J2744p631r770J4060l313j0069J2578J973r535
1286d797N969O405q557k108R076o331q129J1989l341j0860J3833L78j0842J2018
1300D703L191j0171N516N276q786l196P749n984q800J1036q47j1969J3134L622
1314D474j2368J1874N443j2136N018O173q252l126O308l415r426R194L205j3152
1328a0186R920P310j3493Q607P359j2336K926O225p751k771N160j000p607O565
1342a072N410j1172O511R178j3560N571R004j3141J612P034p585k865O004J62
$$ plain form
1245 -1056 9748 -2191 -7800 4277 -3148 -11026 1528 334 -8572 1504 7508 -2743 636
1258 636 10585 -645 -3308 8858 -1810 -8566 4757 -1563 -10229 2529 2654 -6379 1916 8240
1272 8240 -1349 -682 9450 -193 -5834 6910 -721 -10491 3569 256 -9813 2765 4738 -4797
1286 -4797 1172 7577 -980 -3088 5988 -343 -8472 3517 176 -10684 3149 3527 -7315 4703
1300 4703 7894 -2277 3239 8515 -271 -3467 4282 -1702 -10502 534 -313 -12282 852 4474
1314 4474 -7894 3980 9423 -2713 2305 8478 226 -2900 3408 -7 -9433 -239 2966 -10186
1328 -10186 -266 7044 -6449 2158 9517 -2819 107 6332 -1419 -4190 970 -30 -7637 -1072
1342 -1072 4338 -6834 -323 8855 -4705 866 9870 -3271 -1659 5375 -2210 -5075 929 1091
1356A091o713M820P578j0589L035J1624j3369J64J1635j2641k558R188o721l857
1370g313O312J869n891L228R180p990n54J2499j1271l012J2803j0518n620J0300
1384D022o341n401P617N67n987L402Q320p197k208J2885r581n933J4627q936q051
1399h195J2637m749p082Q664J426o445K654P283n707m057J1666o803q633J3586
1413F245n373r637J2067k315q002Q864J698o129K445N227m577m158Q918l918r347
1428g992J1698k252j0749J1627O92r584R061L011o288J884N044m565m825P934
1442D696k403j1105R295J389j2009R615L837j0690P151O524p057Q02O610l903
1456B752n970O981K82j1541P210M283j2144O585O811j1367M876Q221p740j033
$$ plain form
1356 1091 -5622 -802 6776 -3813 -778 10846 -2523 -2359 9276 -3365 -5923 3265 -3456 -7313
1370 -7313 -1001 868 -5023 -1795 7385 -605 -1159 11340 69 -2943 9860 -658 -6278 4022
1384 4022 -2319 -7720 -103 464 -5523 -2121 6199 -998 -3206 9679 98 -5835 8792 -144 -8195
1399 -8195 4442 -307 -7389 1275 2701 -3744 -1090 6193 486 -3571 8095 1292 -7341 6245
1413 6245 872 -8765 3302 987 -7015 1849 3547 -2582 -137 5090 513 -3645 5273 1355 -7992
1428 -7992 3706 1454 -9295 2332 3024 -6560 2501 5512 -776 1108 6152 1587 -3238 4696
1442 4696 2293 -8812 483 1872 -10137 -522 3315 -7375 -224 6300 -757 45 6655 2752
1456 2752 -3218 3763 4045 -7496 -286 3997 -8147 -1562 5249 -6118 -1242 6979 -761 -1794
1470a794P219l684o361O481J318j0757O021O234j2031N570Q924j1328K577R757
1484H146q557k507Q268m164o882O606J424r665N751O766j0237L525R685j0064
1498a905K17R735q159l509P635m129p256O352K263q208M434P187q116L014R269
1513H824p715j521Q293n871n337O471k755p284N034K961p291L116O895n883m1
1528b104Q891n162m094Q166l659o681N912K26p329L613N005o424J127Q484n464
1543E07k844Q794l645o572O516p07q553N142L946q481K707P723o310p49R533n496
1559A511m619Q708l127q067O623P26r369N221N588q178K640Q960o941j303J0182
1574H555n870n555Q486l437q551O116J253q583L786O806q014J321J0725p247k361
$$ plain form
1470 -1794 5425 1741 -4620 1861 3179 -7578 -1557 4677 -7354 -1784 7140 -4188 -1611 8146
1484 8146 -411 -2918 5350 1186 -5696 910 2334 -7331 -1580 5186 -5051 -1526 8159 -1905
1498 -1905 -1688 8047 -112 -3621 4014 -115 -7371 -1019 1244 -6964 -2530 4657 -3459 -445 8824
1513 8824 1109 -412 7881 2010 -3327 3144 389 -6895 -1861 1100 -6191 -3075 3820 -2063 -2104
1528 -2104 6787 1625 -2469 5697 2038 -4643 1269 1495 -5834 -2221 2784 -3640 -2513 5971 507
1543 507 -2337 6457 2812 -3760 2756 2049 -6504 -1362 2584 -5897 -3190 4533 -1777 -2526 7007 1511
1559 1511 -3108 5600 2473 -5594 1029 1755 -7614 -2393 3195 -4983 -2343 6617 -324 -1627 8555
1574 8555 2685 -2870 5616 2179 -6372 -256 997 -7586 -3800 3006 -5008 -3687 7038 -209 -2570
1589b570J0980n841o039Q380k713p437N537J861p652L109O049n734j212R101n063
1604G56m269R645m492p029Q135j849o796M910K367n054J466O375l754k732P877
1619E556k385p217Q101j499q503P072O23p650M742L551m106k94O300k131m578
1634b418P354n08r606O929J173j0137N906L300q442M000N427m324n39O644r08
1649C851n982O415J053r806O094L031j1548N433M907r543L422N935n762K20O013
1664C733j520n483N934J725r388N261M667j1392M908O721r949K996P216o704j61
1679a436N688k279m684M143K137q297K821O035r681K707P826q459J205P951n944
1694b67j168N225k284l355J581K763o354L69O965p569k26R312o370p33Q153m891
$$ plain form
1589 -2570 8410 2569 -3470 4910 2197 -5240 297 2158 -5494 -2385 3664 -2070 -3282 5819 756
1604 756 -3513 6132 1640 -5389 2746 897 -5899 -989 1378 -3676 -2210 4165 411 -2321 5556
1619 5556 3171 -4046 4055 2556 -5947 1125 1748 -5902 -1160 2391 -1715 -2009 4291 2160 -2418
1634 -2418 4936 4428 -5178 1751 2924 -7213 -1307 1993 -6449 -2449 2978 -1346 -1885 4759 3851
1649 3851 -2131 4284 5337 -4469 1625 4656 -6892 -1459 3448 -6095 -2673 3262 -2500 -2280 3733
1664 3733 2213 -3270 2664 4389 -4999 262 4929 -6463 -1555 5166 -4783 -1787 5429 -1275 -1436
1679 -1436 4252 1973 -2711 1432 3569 -4728 -1907 4128 -5553 -2846 4980 -3479 -2274 5677 -267
1694 -267 -1435 3790 1506 -1849 -268 2495 -3859 -3490 3475 -4094 -4320 4992 -1378 -2111 6042 1151
1710A151k332N457j918m318P80L058n316j831P385n221k729J0277m602l713R655
1725E783l206m693N747k07n577J270L308m311k674P378l632m508R723k476o344
1740d419R184k263o280N922j67n911J963L545m021k058P999k628n507R861j839
1755C381p223Q442r31q377N965R06o520K129L523l482j346O741j141n514Q214
1770D767j28p964O971K75q943M448K024o891K333M007k648j142N737N5m508N737
1786D130J066p933N105J712q554L353K653n868J382M023k309j694M965J010n676
1801b635M517K360p451L013L792q051J977N451n912N11N692k527k790M755J389
1816D091n828K353L292p763J188N696p133j55P049m051j670O409j095m099N127
$$ plain form
1710 1151 -1181 4276 2358 -1960 -1180 1878 -3438 -5269 2116 -3105 -5834 4443 -159 -3872 5783
1725 5783 2577 -2116 3631 3424 -2153 -883 2425 -1886 -4560 2818 -814 -5322 4401 1925 -4419
1740 -4419 4765 2502 -3778 2144 1977 -3934 -1971 1574 -2447 -4505 3494 866 -4641 5220 3381
1755 3381 -3842 4600 3669 -4708 1257 2163 -4357 -2228 1295 -2187 -3533 3208 2067 -3447 4767
1770 4767 4639 -3325 3646 3921 -5022 -574 1450 -5441 -3108 899 -1749 -2891 2846 2901 -1607 4130
1786 4130 5196 -2737 2368 4080 -4474 -1121 1532 -4336 -2954 1069 -1240 -2934 2031 3041 -2635
1801 -2635 1882 4242 -3209 -196 3596 -4455 -2478 2973 -2939 -2428 3264 737 -2053 2702 4091
1816 4091 -1737 616 3908 -3855 -2667 3029 -4104 -4259 2790 -1261 -2931 3478 2383 -1716 3411
1831C411N25o085K105L530p408J41O476n987j244P647l401k431P008j106m556
1846a375M210J453o759J724M150p207n11O725n321j572O950k210l636O655j63
1861C113m948L964J891o461J486L805n106r71N875l314k669O265j389m041M870
1876B370L39n514K484K908n557K97M966m486j264O048k048k922N894n29m724L464
1892A726J722n732J232L828n626p28O025m058k183O050q17l835N193L38m652K382
1908H65L040o226j26N155n287j823N951k562l099O171j23m294N033R74m844J796
1924F01L416n099j277M903m071k976O756k507m326O899p36m603M820J441n206
1939a965J590L255m355j582N502k841l522O431n43n107O065L26n359M010R82m845
$$ plain form
1831 3411 3936 -2149 -44 3486 -3922 -3781 2695 -3292 -4536 3111 -290 -2721 4287 3181 -1375
1846 -1375 2835 4288 -2471 -747 3403 -3804 -4315 2410 -2911 -4483 2467 257 -3379 3276 3113
1861 3113 -1835 2129 4020 -2441 -955 2850 -2256 -3227 2648 -666 -3335 2930 1541 -2500 2370
1876 2370 2709 -2805 -321 2587 -2970 -2673 2293 -2193 -3457 2591 543 -2379 3515 2986 -1738 1726
1892 1726 3448 -2284 -1052 2776 -2850 -3578 2447 -1611 -3794 2256 1439 -2396 2797 3135 -1517 865
1908 865 3905 -2321 -2447 2708 -2579 -4402 1549 -1013 -4112 2059 1936 -2358 2675 3649 -1195 601
1924 601 4017 -1082 -2359 2544 -1527 -4503 2253 -254 -4580 2319 1583 -3020 1800 3241 -1965
1939 -1965 -375 2880 -1475 -3057 2445 -396 -3918 2513 1970 -3137 2928 3254 -2105 1905 2887 -1958
1955a958P34K735l078k107M641p93m608O448M76n602N689J202n508L076J858n110
1971a905L51K812k646k130M103J19m683N671J869o161M862K240o273K514K445
1986C188n273k35K966k152k717M156J321m717M174L187o081K940M199o793J416
2001d21L881n251o44L414j772k179L364J810m411K348M197o116J092M610o600
2016b678L12M493m651m09L923j383j651L234K143l957J208M364n490n40M924o125
2032b283j290N490m130j307M481p67k078K934K360l532o7M594m412k371N545m918
2048a751k771N690k640j902M482k93k309K954K091l241n27M005l538l170N917
2063B997l674l992O381k103l259N448k83l151K140K106k481j364L359k559l658
$$ plain form
1955 -1958 -1224 1511 -1567 -3674 967 174 -4434 2014 2490 -3112 2577 3779 -1729 1347 3205 -1905
1971 -1905 -1554 1258 -1388 -3518 585 704 -3979 1692 3561 -2600 2262 4502 -1771 743 3188
1986 3188 -2085 -2320 646 -1506 -4223 -67 1254 -3463 711 3898 -2183 757 4956 -1837 -421
2001 -421 3460 -1791 -2435 979 -793 -2972 392 2202 -2209 139 4336 -1780 -688 3922 -2678
2016 -2678 -2366 2127 -2524 -2933 990 -393 -2044 1190 3333 -624 584 4948 -542 -1082 3842 -2283
2032 -2283 -3573 1917 -2213 -3520 961 194 -1884 1050 3410 -122 -189 4405 -7 -2378 3167 -1751
2048 -1751 -4522 1168 -1472 -3374 1108 815 -1494 1460 3551 310 -217 3788 250 -2920 2997
2063 2997 -677 -4669 1712 -391 -3650 1798 1515 -1636 504 2610 129 -1235 2124 -435 -4093
2078d093N799j676m422O111om279M946Q22l813J524J866l384j172K737j528l800
2094d368M727K27n304N752J252m294M332J204m326J499K128l322j292K736j299
2109c48l435M034J101n187M510K495n289L569K814n344R49K845l281j703K668
2124C98m70l740L338K294m898K915L844n639J963L593m601j45L669k665j995K883
2140G44K13l813K829K414m460J964L779n305N70M163m751p40L884k618k122L430
2156A81L78k935K670L052m473J553L991m922j81L706l770k069M013j906k369L540
2172D59L06l036K220K900l616Q59L636l617j529M099k614k908L656r07l168L359
2188I9J025l267J790K858k735N3L447l034j998L951j797k939K943k2l138K657
$$ plain form
2078 -4093 1706 30 -4392 1719 1713 -2566 2380 3202 -611 913 2779 -605 -1777 960 -568 -4368
2094 -4368 359 586 -4718 1034 2286 -2008 2324 3528 -798 701 2829 -493 -1785 951 -348
2109 -348 -3783 251 1352 -3835 675 3170 -2119 1450 4264 -1080 -131 2714 -567 -2270 398
2124 398 -72 -3812 -474 1820 -3078 -163 3681 -1958 5 3598 -1003 -1148 2521 -144 -2139 744
2140 744 957 -2856 -27 2387 -2073 -109 3670 -1635 -1065 3098 -1653 -2393 1491 -1127 -3249 181
2156 181 559 -2376 294 3346 -1127 426 4417 -505 -686 3020 -750 -2819 1194 -712 -3081 459
2172 459 765 -2271 -51 2849 -767 92 3728 111 -1418 2681 67 -2841 815 -92 -3260 99
2188 99 1124 -2143 -353 2505 -230 -177 3270 236 -1762 2189 392 -2547 396 374 -2764 -107
2204a07K176l631R49L484l288r12L837k299k940L720m29l518L172J678l824J788
2220a44L317l284k85L852l174j906L620k083l151L368l71l309K643K261l048J336
2236c58L781l426m72M141l068k469M052k042l323L507J59l560K480K389l228Q19
2252f18L756k700j741M622k818k987M400j765l729L665N01l289K013K565k740
2267h65K76L392k334j833L895j933l356L844p21l141L132Q50k623J699K180k166
2283B96j260L027j156l259L192n83l788L225N27l217K793J932k355J079K628j615
2299A466j800K416q54l302K535M01m803K968K070l803K143K826k815N50K780j540
2315A238k068K030K12l946K187J715m655K182L162m393K134K895l248N49K749
$$ plain form
2204 -107 2069 -1562 -613 2871 -417 -1329 2508 209 -2731 989 560 -2958 214 1892 -1932 -144
2220 -144 3173 -111 -396 3456 282 -1624 1996 -87 -3238 130 -241 -3550 -907 1354 -1694 -358
2236 -358 3423 -3 -475 3666 598 -1871 2181 139 -3184 323 482 -3078 -598 1791 -1437 -618
2252 -618 3138 438 -1303 3319 501 -2486 1914 149 -3580 85 586 -2703 -690 1875 -865
2267 -865 -589 2803 469 -1364 2531 598 -2758 1086 365 -2776 356 1206 -1417 282 2462 296
2283 296 -964 2063 907 -2352 840 257 -3531 -306 221 -2996 -203 1729 -626 453 3081 1466
2299 1466 -334 2082 1228 -2074 461 862 -3941 -973 1097 -2706 -563 2263 -552 -2 2778 1238
2315 1238 -830 1200 1412 -2534 -347 1368 -3287 -1105 2057 -2336 -202 2693 -555 -6 2743
2330B743k372j321J807ol323K000K012m405J698L771m411J391L722l870j92K898
2346B142k257j757J836L68k699J575K817l802R40L949l357J66L557l397j163L148
2362B066k768j219J584j54j583N24K448k085MM336k762j329M461l213j275K441
2378A476j582j844J836L26j742j0K888j475j186L984k117j976M038k099k632L224
2394A109r26k181J653O74j511j33K857j238j994L831p56l478M050o66l941L393
2410G43J23l118J812J801k432K81K714j201k209L653r98m107M052n54l715L059
2426i6P67l393K450J356k036P83K335r20j968K958k40l792K533K69l858K466J136
2443G50l438K137J824k175N27K067m75k169K087N17l346K070O58l288J443K004
$$ plain form
2330 2743 371 -950 857 851 -2472 -472 1540 -2865 -1167 2604 -1807 -416 3306 -564 -756 2142
2346 2142 -115 -1872 -36 332 -2367 -792 2025 -1777 -837 3112 -245 -79 3478 81 -1082 2066
2362 2066 -702 -1921 -337 -491 -2074 -1550 898 -1187 -1183 3153 391 -938 3523 310 -965 1476
2378 1476 -106 -1950 -114 212 -1530 -1540 1348 -127 -1313 2671 554 -1422 2616 517 -2115 1109
2394 1109 183 -1998 -345 329 -1182 -1315 1542 304 -1690 2141 1385 -2093 1957 1291 -2650 743
2410 743 866 -2252 -440 1361 -1071 -790 1924 723 -1486 2167 1169 -2938 1114 560 -3155 -96
2426 -96 671 -2722 -272 1084 -952 -169 2166 1246 -722 2236 1996 -1796 737 1006 -2852 -386 750
2443 750 -2688 -551 1273 -902 -375 1692 1217 -952 1135 1652 -1694 376 1034 -2254 -811 1193
2459A193l110R99K386j839r9J643Q9k046J357O47k881J302J716l438Q18K838k614
2476a039J54K602j380j068K208l52k701J457J263k760j76L120k571l08L539k091
2492a03l42K555j067j813K080J13k727N90J256k469J28K559k223Q6L404j843r98
2509h14L131r16k210K157j59k714J181J856l309M24K690k428k4L137j634j407
2525a039K837o38k357J710M70k856J193J345k160L91K753j921n93K461q08j209
2541d21J629l72k108J345N56k296O90K007k054L0K996j763p20K179m53k262J654
2558F37K67k853P98J656j922j70K732j544n34K835n38j777J960J36k468J114O66
2575I95k344j7J924j831n29L068j316j374L390p11k261K066j78k302J335J059
$$ plain form
2459 1193 -1917 -918 1468 -371 -470 1173 1262 -784 573 1220 -1661 -359 1357 -2081 -1263 1575 -1039
2476 -1039 -885 1717 337 -731 1477 1125 -1576 -119 1144 -1616 -1792 1328 -1243 -1551 1988 -103
2492 -103 -445 2110 1043 -770 1310 1423 -1304 -714 542 -1927 -1799 760 -1463 -1377 2027 184 -814
2509 -814 2317 1401 -809 1348 1189 -1525 -344 1512 -1797 -1373 1317 -1111 -1135 2002 368 -1039
2525 -1039 1798 1160 -1197 513 983 -1873 -680 665 -1495 -1104 1649 -272 -865 1596 788 -421
2541 -421 1208 836 -1272 73 629 -1667 -977 1030 -1024 -994 2002 239 -481 1698 1245 -1017 637
2558 637 904 -1949 -1151 505 -1417 -1587 1145 -399 -933 1902 1364 -413 1547 1683 -785 329 995
2575 995 -1349 -1366 558 -1273 -1802 1266 -50 -1424 1966 1255 -1006 1060 882 -1420 -85 974
2591I74k306j13K218j467q14L319j465j600K970m50k493K105p7k571J223J242
2607F95k423J84K355r23j180K607m10k280K702l78k587K223J01k493J182J122
2623D97j440P4K080p12j247K562k04k384J915P6k924J883L92k690J417J173j319
2640h51k62J883j89j280J878O27k796J576Q74k988J184J131k169M66J809j478
2656e85l51J665j1j448J343J333k920J060J520l334R45K135k618J50K355j576
2672c37l66J519J67j562R59J179k618L53K002k605O4K554k277k75K586j306m01
2689c64J500J3j615P91R72k173k94K334k677k1K536j460j033K810j114m03J635
2706A437k01j548N67J071j921n70K276k113j055L069j618p83K411m78r08J762
$$ plain form
2591 974 -1332 -1445 773 -694 -1508 1811 346 -1254 1716 1266 -1227 878 801 -1770 -547 695
2607 695 -1728 -1544 811 -112 -1292 1315 905 -1375 1327 949 -1638 585 686 -1807 -625 497
2623 497 -943 -869 1211 499 -748 1814 1610 -774 1141 1217 -1707 176 568 -2122 -705 468 -851
2640 -851 -1113 770 581 -699 1179 1806 -990 586 1460 -1528 -344 787 -1382 -916 893 -585
2656 -585 -936 729 718 -730 613 1946 -974 86 1606 -1728 -783 1352 -1266 -1116 1239 -337
2672 -337 -703 816 983 -579 380 1559 -1059 -706 1296 -1309 -1245 1309 -968 -1243 1343 37 -364
2689 -364 1136 1149 -466 325 1297 -876 -1170 1164 -1513 -1534 1002 -458 -1491 1319 205 -198 1437
2706 1437 1236 -312 255 1326 -595 -1165 1111 -1002 -2057 1012 -606 -1389 1022 544 -364 1398
2722A398n37j259J70J015j017j042J796p24j232K308l59j605K688r18j385J906
2738A203l26j289r5Q95p26j458J998J14k084K748K27k347K458K9k061Q68N97j286
2756e35l83J250r19j086J984J70j644K109L83k040J560J063k926J338M29j682
2772i29l26J071m25q11J565L47j394J513J083k472J638P57k245K47J402j934l44
2789a257J368r2r70J418O84j981J325J190k519P78J379k229j34J897j917m67K067
2806E40p08n89J226R69j958R52Q77k115N22J476k563M64J458j132k55J279k31
2823B12r86J885M98j662J84J157j978l14J670j776m49K114j216o45J986j21p10
2840a51R46P46j848M17J358j887k26J260j183j050J978n86q02J517j65j066J279
$$ plain form
2722 1398 861 -398 -228 787 -230 -1272 524 -200 -1432 876 517 -1088 1600 682 -703 1203
2738 1203 877 -412 -507 388 -338 -1796 202 316 -1768 980 1207 -1140 1318 1347 -714 154 751 -535
2756 -535 -918 332 -587 -1673 311 481 -1163 946 1329 -711 849 1912 -1014 324 753 -929
2772 -929 -1255 -184 -609 -1420 145 492 -902 611 1694 -778 860 1617 -628 -381 1021 -913 -1257
2789 -1257 111 19 -951 467 1151 -830 495 1685 -834 -56 1323 -906 -1040 857 -1060 -1527 540
2806 540 -168 -757 469 1438 -520 432 1309 -806 -284 1192 -1371 -907 551 -581 -836 443 212
2823 212 -774 1111 1609 -53 131 1288 -690 -1004 666 -1110 -1559 555 -661 -1306 680 559 -151
2840 -151 795 1541 -307 110 1468 -419 -645 615 -568 -1618 360 -226 -1028 489 324 -742 537
2857E37M42j324K68Q72j518m71J839p20o93J568l02j068J200L82j505N92J061
2874A160j805k02J527j424l55J522k83j279J488M68j347J203O86j534P2R65j223
2891c61o68J546j089o51J512J15j094J295K84j286O89R19j430k61J483j542p00
2908a239J875j216q05J665k5j040J276R0j096O00J230j545n16J764j442o38J721
2925F59q75q76J814l50j137J290K65r76n7Q46q67n52J422q16j073J706j68j401
2943a146K023j49j354Q34P39j100j62Q24q36p07J240k32j578J921K23j567J405
2960C78N33j491J157K98p89q17R33n6j279Q14K10j499J289J134j568J231R36j863
2978d49J041M99j054k48O04m06j206J098M02j508J120R96j773J087J349k063L85
$$ plain form
2857 537 979 -345 -77 795 -723 -1194 645 -75 -768 800 498 -570 630 1012 -493 99 1160
2874 1160 -645 -847 680 -744 -1099 423 140 -1139 349 817 -530 673 1359 -175 -103 862 -361
2891 -361 -1029 517 -572 -1223 289 404 -690 605 889 -397 292 1211 -219 -480 1003 -539 -1239
2908 -1239 636 -580 -1385 280 255 -785 491 581 -515 85 1315 -230 -746 1018 -424 -1062 659
2925 659 -216 -1092 722 372 -765 525 790 -186 -243 603 -264 -816 606 -210 -1283 423 255 -1146
2943 -1146 877 728 -626 208 947 -153 -315 509 -327 -1034 206 -26 -1604 317 540 -1027 378
2960 378 911 -580 577 875 86 -731 202 146 -1133 -319 -109 -1608 -319 815 -753 478 1414 -449
2978 -449 592 1091 37 -211 393 -13 -1219 -121 281 -1227 -107 889 -884 203 1552 -511 -126
2995a26P94j051k07M50M1j079J112Q17j339N76J303j701K03J668j843J10J332
3012A060j803r5Q31l87k84L58R66j333N56J416j454r6K117k258k45J048p85l99
3030g87P17J09p60O50O18n94J16J331j316l26J413j195q62J393j152n97R01j12
3048d53j4L64Q51n43p92J726q26j112J419n78j301J749m77j128J439J92q98K75
3066a07N67k41o16J338p30j511J812p27j234J799q7j322J329K27k58KO14k13j156
3085e14Q65r3j423J337n35j682K222K54j229R29K31l61K03N64q17k72Q09m99j036
3104a047R81J33j458J638k3j196J449M81q94K21O84j073K3K06Kp76Q30L03j305
3123h21J072L03j257P13N96m72j40P72j072m62O44J15m97O28N04j039K77J256
$$ plain form
2995 -126 668 -383 -590 -140 -99 -1178 -66 751 -588 -12 1291 -410 -207 1461 -382 -272 1060
3012 1060 -743 -838 -7 -394 -678 -320 646 -687 -131 1285 -169 -265 1852 -406 -651 397 -388 -787
3030 -787 -70 39 -721 -71 547 -47 69 1400 84 -242 1171 -24 -886 507 -645 -1242 -341 -453
3048 -453 -467 -103 748 205 -587 1139 313 -799 620 42 -1259 490 13 -1115 324 516 -382 -107
3066 -107 460 219 -397 941 211 -1300 512 -215 -1449 350 263 -1059 270 497 239 241 855 642 -514
3085 -514 351 258 -1165 172 -363 -2045 177 431 -798 131 362 1 204 768 -49 -321 488 -11 -1047
3104 -1047 -66 67 -1391 247 224 -972 477 958 64 285 969 -104 -81 125 127 -649 181 484 -821
3123 -821 251 554 -703 10 606 134 -6 766 -306 -768 -124 -9 -506 122 626 -413 -136 1120
3141A120j207n5R44p45k28L70O0r90M51M93j013O27J028j022J38J173j194m33
3159d83J515o47r41Q96k32p43P20L0j112O40J093j125N0J399j124l33J657j209
3177E1n19N96m2j301Q84O11r08N52J038j370K73J063r56q5P35m65q35R35K63j077
3197e57M35Q37r93K43R27j174J54J083j249n4N04l5r36Q30K49q27L85N84n00M0
3217e4R95p29m54Q70n29p92J075l82n49M54l5k57Q6Q17n71K14P78q01l23R68o41
3238A40p36P96k58p79M14O34n20j33J195l41o47J273n58j007J207p82q33P24L56
3257A45p78K58O31o37L3P18np09R05l60j190J287k27q32P43q4n33N47Q04l93l19
3278DJ148q85o46R87n05j011P05K08q99O90N19p62O83M58m80k04M38j53p38O54
$$ plain form
3141 1120 -87 -142 802 57 -171 199 259 -731 -280 213 -800 -173 855 -167 -29 1144 -50 -483
3159 -483 1032 385 -556 340 108 -635 85 115 -997 -357 736 -389 -339 1060 -64 -397 1260 51
3177 51 -468 128 86 -1215 -331 280 -628 -76 962 -408 -135 928 -28 -113 622 157 -678 257 520 -557
3197 -557 -122 715 -278 -35 892 -282 -128 955 -294 -348 156 121 -815 15 264 -563 -178 406 -94 -54
3217 -54 941 212 -242 628 99 -693 382 0 -549 -95 -130 -387 -301 516 -55 159 937 136 -187 781 140
3238 140 -596 200 -58 -837 -423 211 -309 -442 753 412 -235 1038 480 -527 680 -102 -935 -211 145
3257 145 -633 -375 256 -381 -348 370 365 -344 561 201 -989 298 71 -761 -18 -102 -635 -88 716 323 4
3278 4 1152 267 -379 608 103 -908 -203 5 -894 -204 315 -447 236 694 214 10 448 295 -443 211
3298B11oq71M01K70r00O74L10m52N81M69n72O0J48K08r10M71M77j294K31Q45q71
3319e20M31O52p94L33K94%n04K4N37r07M70N24j122K33J018r32%J123p13n16P39
3340C70J83r14K02L96r19k0Q78p79J71J315j325K48J286q61m98P25j77q57M59
3359a17P7m65J84L74n55j80J323q26j8P99k77o13J055p69l77M54k87l11J08Q10
3379C89n51l68R41l68n56J273m90n39Q76m83o61L82K05k21j30P31o29j04P07j80
3399B24o70P21k56n53P72j24o23M64J5K05m70O85m6o66J356m40j066O24M00j134
3419e82M70L5m30K91N18o75J66L15j71j03O56J27p83N59n5r00N74Q2p17M26J97
3440@k04M3N22j36l44N99Kr43P87k8r00N07L87r25L84K18k20K8N63O4m73K07J86
$$ plain form
3298 211 205 -666 -265 5 -895 -221 89 -363 218 687 115 175 323 531 -379 92 569 -725 -494 351 -520
3319 -520 -89 563 -231 102 396 396 -108 -84 453 -454 16 540 -582 -349 669 -263 -263 860 147 -369 370
3340 370 553 -361 -159 237 -682 -702 176 -603 -432 883 -442 -194 1092 231 -267 458 281 -576 -117
3359 -117 -40 -505 -321 53 -502 -682 641 -185 -203 596 319 -294 761 -8 -385 69 -218 -529 -421 389
3379 389 -162 -530 411 43 -513 760 270 -269 607 124 -537 -155 50 -171 -301 430 -199 -303 404 224
3399 224 -446 275 19 -534 238 114 -509 -45 -30 175 -295 390 344 -322 1034 594 -472 152 552 -582
3419 -582 -112 -77 -507 -216 302 -373 -207 108 -63 -166 490 617 -166 393 338 -562 12 94 -623 -197 0
3440 0 -204 -161 361 225 -119 480 482 -461 326 298 -602 -95 292 -633 -249 -31 -251 -223 340 404 -69 138 324
3463C24q44L77M67r96M92J78n25O62j67L31k97L33m2q46O60%n75L22M48q38L41
3484a95M93o49K27N29m92J10L60K30o23Q3K45p21N4M85n57p9P50k70o8L58q5k39
3506e4K19N6n10L88K58n38k36N45o18J55O17l41J79M87p3l75M5m6m58J90J45l67
3528c32k55Q49m36j76M97J51n94M55K63o61O3pk95L20L39l97j03P63k48l94O87
3549D89o8o81P60K2q99L02J84k81m80P88j98j16N68o37M8O51m0n58M40J49n39
3570i6j96M26l20l31O52l00k38P47j74j27j63L51m11J20M04o23K44M6k43J56K01
3591A25j65p1L71j87k10L86K7l86q9M09L6l11L78m19QL65j13l67N38P1l46J49
3613A99j09o12K77J85l17J70K0J47J01j48M91m42M58o2m65M08k00k34j29O24q17
$$ plain form
3463 324 -520 -143 324 -672 -180 -2 -527 135 -32 299 2 335 293 -553 107 107 -468 -146 302 -536 -195
3484 -195 298 -351 -124 405 -87 23 383 613 -10 73 318 -403 -349 136 -421 -500 250 -20 -88 270 185 -54
3506 -54 165 221 -289 99 357 -181 -417 128 -490 -335 282 -59 120 607 534 159 204 158 -300 -110 35 -332
3528 -332 -587 262 -174 -350 147 298 -296 159 422 -239 -176 -183 -478 -158 181 -216 -319 444 196 -198 489
3549 489 421 -260 500 522 -377 -75 109 -172 -652 136 -62 -178 390 -247 -199 452 412 -146 294 443 -96
3570 -96 -292 134 -186 -517 135 -165 -403 344 170 43 -120 231 -180 -60 344 -279 -35 11 -232 -76 125
3591 125 -40 -111 260 73 -137 249 276 -110 -199 210 246 -65 313 -106 -98 267 154 -213 325 396 50 199
3613 199 90 -522 -245 -60 -377 -207 -187 -40 61 -87 404 -38 420 358 -107 301 101 -133 -262 362 -455
3634d55N06O3K4k85J69K87m35L01m4l74K74j3J64l20K68l55o0L58m9j11K73J61
3656C47l64N0L68m83P8N30r05m6P35o75R0M94l2j53L09J51p21J20M27p06L36K02
3678A52l72n0L99M9k82J58j04k06M17L05o83l4L08k74k77O29j33O3K20l79J35
3699D1k2k3j34m6O07k62k71L95m70k52N64n18M30m5l6m8K76r1K2j91K57k40j07
3722a64Q6j9l14L58K71o03O05K26l56L1k27J97Q8Kj29m1J3k61l5O99l47p0R9J69
3746B78p9L1k57j32J54j41L8r3L88k05l23K35J96Qj91M54k38J84n2k07k8j48K13
3769H5j14J52k4k51N39n0o36N4L41k31J38J70k77k27K27J13k0k50M54o4j02L09
3791C36m47l4K60n38M15K15l54mK46R5m12L15k4j06K04K18l51k24M84n02lN8K47
$$ plain form
3634 -455 51 114 138 -147 22 309 -126 175 131 -243 31 18 182 -138 130 -225 -285 73 24 -87 186 347
3656 347 -17 33 401 -82 -4 526 -379 -425 310 -365 -275 219 187 34 343 494 -227 -107 320 -386 -50 152
3678 152 -220 -270 129 178 -104 54 -50 -256 161 466 -217 -251 57 -217 -494 135 2 65 285 -94 41
3699 41 19 -4 -138 -184 423 161 -110 285 -185 -437 127 -391 39 -6 -42 -90 186 95 117 -74 183 -57 -164
3722 -164 -78 -97 -411 -53 218 -385 220 446 90 121 -106 91 179 181 52 11 24 -237 -272 427 80 10 109 278
3746 278 199 230 -27 -159 -5 -146 -108 -201 187 -18 -341 -106 90 98 -93 361 123 307 255 48 20 -128 85
3769 85 -29 123 99 -152 387 337 -299 -245 96 -135 3 173 -104 -331 -104 9 -11 -261 193 129 27 336
3791 336 -111 -145 115 -423 -8 207 -147 -151 95 190 -222 93 69 -37 167 385 34 -190 294 -208 -211 -153 94
3814I4n8k08L1J08K51K34k58j04L17j79m24L44M1j91n8nk05O99k29n06J39M51
3836B84j11j14m4q4m8R1K04n17M31lk41J90%J48j15K3P2k04J95m00Q0N33m25k76
3860c31L63j96j61L94p7P2J49P1j17j05o9J24l63M01l52j27K44j37Q8n7P17o57
3882a26m1M41l2k71K69k13m33N6J39m0J27J70O2n9j6J32j73O9L6k83O12k16o02
3905c92P50p0k65l43K57L5k54J74J27l81N50j48j97M63k57K9j60J83j60M72o05
3926a92K52J6j1J12k34R1K9l29M42p2m41K66k2j29O5K72k81K53J19j26l92M32
3948A20L9m02K20k20J86J45k18J79j15J24q7J74j21JK1j7Q3j13l2M47m99k32L50
3971C3l5l4J16k2O8K15n60L02n76L62O1j73M68j86k94L23j22R9R6k60J04J5OJ07
$$ plain form
3814 94 36 -172 -141 -33 218 452 194 90 407 228 -196 148 189 -2 -60 -65 -270 429 200 -306 -167 284
3836 284 173 59 15 -69 -117 -26 178 -339 92 89 -152 38 38 186 71 94 166 -38 157 -243 -163 370 -55 -331
3860 -331 32 -164 -325 69 -8 64 213 284 167 62 -7 117 -246 155 -197 -324 -80 -217 -129 -186 531 -126
3882 -126 -167 274 242 -29 240 27 -406 -350 -211 -251 -124 46 108 49 33 165 -8 61 97 -186 426 210 -392
3905 -392 358 288 23 -320 -63 -28 -282 -108 19 -362 188 40 -157 306 49 78 -82 101 -59 413 -192
3926 -192 60 76 65 177 -57 34 63 -266 176 104 -337 -71 -93 -222 -157 115 -166 87 206 80 -312 120
3948 120 159 -243 -23 -243 -57 88 -130 49 -66 58 -29 145 24 25 46 29 112 -1 -33 414 -85 -317 33
3971 33 -2 -36 80 58 126 341 -219 83 -493 -131 -70 -243 225 39 -255 68 -54 45 141 -119 -15 0 6 113
3995A13j96J39J92j1J7o0j21K05l02k06J40K26p9j39Rk35L42Q3n8k11K56J3k83
4018a66N3K68k0j74j00Po9O8K8k74L50R2J91l16K43m03J51k3pK59j08P8j97l30
4042c99J49L49k3K42m87PL55n11J02M73m58J10M23o66J89J02K76o9l04R6J1K38
4064B05O6n91K48l12L04k81K87j6Jrlj17P8M10m07L60O9m67J22R9j93k4J79j54
4088a46J24j21J91j87n3j6K43L1mj16K0K86l66PL24O8n71J93N1j0J91M6j43j05
4112f3L29m19J42N8j02j47O34m50j87L75k22J03Jq3j93L48k6p3k43L48k52J51
4134B9k01J74ok03O20l90Q1L5k37J76K46l06k90Q9Q2j41K23j09j98K06m3K71o4
4157D4j6K28k48L6Kn6J9M3J21P7j89l08J84M0L69o63J79M75k93o7L8k43J1K90
$$ plain form
3995 113 -83 56 248 237 254 194 73 278 -24 -230 -90 136 57 -82 -73 -308 34 117 59 -152 104 117 -166
4018 -166 -113 155 135 -39 -139 -132 -201 -133 -105 -379 -29 63 254 -62 181 -222 -71 -94 -101 158 50 128 -69 -399
4042 -399 -250 99 76 318 -169 -162 193 -318 -216 257 -201 -91 332 -334 -145 -43 233 164 -140 -44 -33 205
4064 205 271 -320 -72 -384 -80 -361 -74 -90 -89 -98 -101 -218 -140 270 -137 223 292 -175 -53 46 -147 -171 8 -146
4088 -146 -22 -143 48 -139 -192 -208 35 66 62 -54 -34 252 -114 -107 217 285 -286 -93 -42 -52 139 185 42 -63
4112 -63 266 -153 -11 47 -55 -202 432 -18 -205 170 -52 51 52 -31 -224 124 98 25 -218 130 -122 29
4134 29 -172 2 -4 -207 413 23 104 139 -98 78 324 18 -272 -183 -101 -242 -19 -128 -326 -120 -163 108 44
4157 44 28 256 8 44 46 -10 9 52 173 250 61 -247 -63 -23 346 -317 -138 337 44 -23 15 -228 -217 73
4181G3k31j10J09J15p6J62m4on3N3k18N9K87k8m8J05k44j71J74k25L83K43l88
4204g9J71o1j97J38K48m45L2J89J03l6l20M15k19L64j2l1j37l49L19l39J62J88
4226A04j78j39Q1K34j78n1K58j09k6M4r7N0J24l91J07j48K4K06J46N3l96M27M9
4249A94l28Q2J36k23K1L16l70l2L0K00m2K45k51m6M3J3N5k50K49j03o2K69l32
4272a86N3On1J93M9N5j12M0J25n55M69M7j86R1j97K0m46P96r2j67%L09m26R5L01
4297B31pk70Rj10K41j10j33R3K73J22n11K89j87q5M36O3m84J70J05L8l72K25r
4320A7K6j56K49k06r3M20k39k9K88m42j04O1J07j47l9L59J13j29K03j74J78l34
4342g1N7k2M78o60Q2Rk3j2J06L47k22Q2O0m38L41j68M1l17M68k10l28O31j07k62
$$ plain form
4181 73 -158 -268 -159 -44 -120 42 -2 -8 -61 -8 -226 -167 120 92 44 149 -95 -266 -92 -317 66 309 -79
4204 -79 92 31 -166 -28 220 -225 -193 -4 99 63 -257 158 -61 303 291 260 123 -226 93 -246 -84 104
4226 104 -74 -213 -132 102 -76 -127 131 22 -4 40 -57 -7 117 -274 -167 -315 -291 -85 61 114 -282 145 194
4249 194 -134 -52 84 -139 -118 198 -172 -204 -174 26 -16 229 -22 -68 -25 -12 43 -207 42 -61 -123 146 -186
4272 -186 -133 -127 -178 15 64 119 7 47 172 -383 86 133 -53 38 -159 -139 -585 211 119 -48 -48 261 -165 -70 231
4297 231 224 -46 -37 -147 94 -16 -149 -56 217 339 -172 117 -70 -155 281 344 -140 30 135 173 -199 26 17
4320 17 43 -113 136 -70 -163 257 18 -11 277 -165 -269 -208 -101 -248 -287 72 185 56 259 85 263 -71
4342 -71 -14 -36 442 -218 -136 -127 -150 -162 -56 291 69 151 211 -227 114 -54 -13 -330 138 -72 -400 231 124 -138
4366a38K40M4m14M01l18J09n1M72n24l3L39j12k45N85m58m2K40r0p4m2K02m5j89
4389a43J13K1n43M00n7J41K49l10N8P9L03l10N1LJ73n24K29j12j59L97R6k99j98
4412c42O10m54j09N64k98j31N0L2k7K32L8l43M85m10k23J08N61O7m56L42k42l40
4434b86O77j62l18l22L11j07K15K44l49L16j60k81M35n3Nn33M36M9k19K08j67
4455f1r7K82Q4j45J96j36j30K53j09l33K77j00K71o50N77k07LL77j43m5j76k6
4477c8L11k30L29j47o59L25O8Q9q0O6j07R6L66n21M02J80n40q8J78K27k74N3K8
4500C4j67R0N4k71L55K89k44j18q2K09k10L67k63j92J35J31l62K98mJ90m32L77
4522A84j19l01K18K11k20Mj77rK6M28L6k38M54l28j43N45q09j31P14k65m17M2
$$ plain form
4366 -138 102 146 -268 133 -185 -76 -127 345 -179 -212 127 15 -230 355 -103 -145 95 5 -69 -111 91 46 -143
4389 -143 -30 -9 -552 -152 -209 -68 181 -129 -71 8 311 1 52 55 228 -296 -67 -179 -338 59 155 -144 -342
4412 -342 268 -186 -295 269 -29 -160 -110 -78 -105 127 165 -178 307 -103 -326 -218 343 410 -46 296 54 -286
4434 -286 391 229 -89 -411 -100 -207 8 252 -97 219 59 -222 213 160 165 -368 68 117 -102 106 -61
4455 -61 -158 124 208 63 259 123 -7 246 137 -196 81 -19 252 -398 179 -28 -25 352 209 164 -12 -38
4477 -38 273 43 372 225 -434 -109 -41 48 -32 34 -73 23 389 -132 270 450 -90 -178 0 227 -47 6 34
4500 34 -133 -43 11 -260 95 384 140 22 -60 149 -61 306 43 -149 -14 117 -245 53 49 239 -193 184
4522 184 65 -236 -18 193 -27 -23 -200 -209 -183 245 281 43 497 169 26 571 -238 -369 345 80 -337 -295
4544b95j4J29O7J47k5M0J32k2k71K69m4k09N27o31N5J05M1o5j4K60P1r6L6M8q7
4569A54L9j78k30N09j47l60O20k84j94q1P34l07k61K61r8k81K41L3l89K90j58
4590h7j31L26j52l38N80j96j0j39J77J50m90K0M40n78O4L59k82J40L94m00n4K27
4612B0j23O8k3Q3l49K30L78k97l11N56m30l9O67j29m74M10k29q4K11l71J2M7J27
4635e0j96K95J92k52J75k0j73O9P8M2k54R9J64l78j7K56j76K2R3Q8j33K10n32
4658c98N88O7k10k95K50J23m36K8L10k25j50Q56l25l41K13k31K1Q0J60j43j03
4679a61N6j36j50O72j70l09L96j17j21L04M4l01J08j8m21K36J10k81J4L39L41
4700D35m48L10j96k21Q9n7l1J43k44J48n5q4J15k79L85L19r19P84Q3m38K57k72
$$ plain form
4544 -295 -309 -180 -113 34 9 49 181 159 -112 157 113 -96 431 -200 -145 -40 1 -64 -78 182 253 157 193 241 154
4569 154 193 15 -215 294 147 -213 407 123 -71 -152 582 275 14 275 177 -104 137 170 -219 71 -87
4590 -87 -218 108 -44 -382 198 2 -8 -147 30 180 -310 -290 150 -428 -364 -5 -287 -147 247 -153 -207 20
4612 20 -103 -35 -58 25 -324 -94 284 -13 -324 232 -198 -237 430 301 -173 237 8 -76 135 -236 -224 -177 -50
4635 -50 -246 49 241 -11 164 144 -29 40 118 160 -94 5 169 -209 -226 30 -146 -124 -31 57 -76 134 -398
4658 -398 190 257 47 -248 2 125 -311 -283 27 -198 -348 508 183 -158 55 -176 -155 -75 85 -58 -161
4679 -161 -105 -241 -391 281 111 -198 198 81 -40 264 308 7 115 97 -324 -88 22 -259 -245 94 435
4700 435 -13 297 101 -120 -31 -88 -119 24 -220 -72 -127 -211 -96 -375 10 329 -590 194 277 -161 96 -176
4722a76K50k25Q0j18o7J14J81J20Q0j19k33Q0L71m17J74J0m12J83J09K6Lk54J02
4745a38K03J19O0l31K54K39p11M29j69j7J15L8k46j21N23l13J03K92j54l90L00
4766H5K87m91K8P7n76R6L06n2K50P3K53n20K35K24l12o5N19p22L63J32o59L19
4788a50J48l5J59J29j56r9j16J82l03J89J06l81L62K31l37k0K23k10M27j84L3
4809A98p1J2M8k97j89L49l0l35M8J25J72n4Q0Q9J29j78j92l24O11j01m68K63l0
4832a45p0J19p8N6N55k22m83M69j56K27k24lj10k14R1J83j33K17K18n55N17N1
4854C10k03l16N95o58J5L53k98N3J31J12l66N47k09j09M79L2l93J35j42o7p4K11
4876A38j77k66L70J48m61K46k0k5K71K41n61k95M63k70j25L76j05k7J41O4m41
$$ plain form
4722 -176 74 -151 -71 -189 -256 -142 39 159 239 120 -113 -33 338 -79 95 105 -307 -124 -15 11 14 -240 -138
4745 -138 65 184 244 -87 167 406 -305 124 -45 -62 53 91 -155 -276 247 -66 37 329 175 -215 85
4766 85 372 -119 -91 -14 -590 -494 -188 -240 10 83 336 -184 51 275 -37 -102 417 -305 58 190 -469 -150
4788 -150 -2 -37 122 251 95 -4 -120 62 -241 -52 54 -327 35 266 -71 -91 132 -78 349 165 198
4809 198 127 139 187 -110 -299 50 20 -315 -267 -142 30 -24 56 145 274 96 -96 -420 191 90 -378 -115 -145
4832 -145 -215 -96 -174 -118 437 215 -268 201 45 272 48 45 -65 -279 -188 -5 -138 79 297 -258 259 310
4854 310 107 -209 386 -272 -257 96 -202 -149 -18 94 -272 275 66 -43 436 468 75 210 68 1 -73 138
4876 138 -39 -305 65 213 -248 -2 -22 -47 224 465 -96 -391 72 -198 -323 53 -52 -79 62 126 -315
4897c15M72%k17J74k7l60K10l3k81L50J54O3o22N36j11k26J29L61k75K55k30O4
4919G1l36P4L99l91j01M91o64M71L26l93m1K85k43NK43n67K85J36L13o65L67j22
4941e7N3K51J87l30k4J22k63k13N40k89k23K31j43Mj74M18j45R5L48l87J64K70
4963D35l42j49K49m37J92j15J7M2O1K25m06J90J99j58L3M39p21J49Q0k11M8J43
4985c7q3N8l09O62k48NL06l81j72M77k32n23P00m14K11N6Q5m64J92L14j19j60
5007g6L20l09p4M9k4m32O70l00p1N36p0J72k69L62j41n68L70j10k47L39j38m55
5029d66N70M3l72L99l42L30K7m7J5o25O88j26p99M44j1nL16J43m62N00J07j83
5051A44k63L41j11n46J93N11l89J55L12m37L96k99j74M51K1l0k36K77n79Q7q2
$$ plain form
4897 -315 157 157 -60 114 87 -273 -63 -96 -377 -27 127 190 -432 104 -7 -233 -104 257 -18 237 7 71
4919 71 -265 -191 208 -183 -284 207 -457 14 340 -53 -94 191 -52 -47 196 -371 -86 50 363 -302 65 -57
4941 -57 -4 247 434 104 80 202 -61 -274 266 -23 -246 -15 -158 -154 -328 90 -55 40 388 1 165 435
4963 435 93 -56 193 -244 -52 -167 -150 -108 -47 178 -228 -38 161 3 36 475 -246 -97 -17 -228 -180 -37
4985 -37 -120 -62 -371 291 43 48 354 -27 -199 278 46 -477 223 -191 20 76 161 -303 -111 203 84 -76
5007 -76 244 -65 -139 -90 -114 -546 124 -176 -247 289 219 391 122 484 343 -225 145 35 -212 127 -11 -466
5029 -466 104 147 -225 174 -168 162 189 142 157 -468 220 94 -705 -261 -272 -277 39 182 -280 220 327 144
5051 144 -119 222 111 -435 -242 269 -120 35 347 -90 306 7 -167 284 305 275 39 316 -263 -176 -258
5072b58L76n40M3P30n47M64K96o44J81P53j012j89Q77o34l2R0L51q25O8N47o32
5093e37O33M39n12K16J11k64j29J2k96R4Q7K59j24r0M15n53K8L09j33J76J23m90
5115b26q8L03L58n31L0L64l08j07N60n02J9M53k51r2M17l54j23K11l24k2N3K22
5137F2l00O9M65%m30N13m12l24N13R3p93O02l3p8O6M32n65qL30j11m3N3K45p49
5161d03P61m62l28M68l6k44K22K82k90K30L38l18n07L13J25k45J18J98l89L1M46
5182C10k81K8K24n31L17M41m11j17Q5J15l82O5J41q3l59P13m16L76K5K09o43M82
5204C08l32j90K19J75p17Q58n49o0L71m0K79k66K18j59l10M13l56k16L97n5k51
5225b63J74J01l43NN30k41J6M17m58K03k40L16o05M87L62p02K41J90p3r4NK80
$$ plain form
5072 -258 118 -422 -379 351 -196 268 564 -80 101 854 -158 -347 530 -104 -136 -46 305 -520 -452 95 -537
5093 -537 96 535 23 239 350 86 -43 -31 -327 -233 -146 113 -11 -101 314 -239 -211 98 -35 141 264 -226
5115 -226 -314 -11 347 -184 -154 210 -98 -205 355 -147 -128 325 74 -18 399 45 -78 133 -191 -213 -160 62
5137 62 -238 -169 296 296 -134 379 -33 -357 156 249 -544 58 25 -53 13 445 -120 -128 202 91 48 101 346 -403
5161 -403 358 -104 -432 36 0 -244 -22 260 -30 200 538 220 -287 26 151 -94 24 222 -167 -136 310
5182 310 29 57 281 -250 67 508 97 -20 65 180 -202 -137 4 -79 -438 275 -141 235 260 469 -174 308
5204 308 -24 -214 5 180 -537 321 -228 -288 83 43 322 56 274 115 -195 218 -138 -354 43 -12 -263
5225 -263 -89 12 -331 -326 204 -37 -21 396 -62 141 -99 217 -388 99 461 -241 0 190 117 23 28 308
5247C08Ppq9o16L17K76q22K07K07j01J82N77j9m76K73j55n41N04L81q72J22J6
5269c21J22j01N95n81N55J29n26K31K4K98l61q7M2l20J55N63o06N7L83l45J08
5290A4M98j31l80R7M1m1n9n4l20K35Q1P6k72O08l86j32O44m65j94k8Q2j55n6P
5314b90J07o0M01j42j23J94J51l74L28j17l76K46K07k52j23L35j67k03L58R6l10
5335a14N24j96n05L45j34m25L91J75l87J72M4J29j84K31J37m29K13Qq4N38n01
5356e2m2J3K43k25k24K13K86m99O35N3o25P49l75o71O77m8n35M73J79l10J88J05
5378B08l52O0M89j20j88K74m8n35L36K28n19J16K80l66j18L47Q9j16J31L42o76
5399a38Q6L42n94L29L00l28k40L08p2p5K13K2R0l66N20n73K57J62k96n07R27n64
$$ plain form
5247 308 315 308 219 -397 -80 196 -626 -419 -212 -313 -131 446 427 -49 224 69 -472 32 413 -459 -337 -321
5269 -321 -199 -300 295 -286 269 398 -128 103 127 425 64 -23 19 -301 -146 417 -189 -132 251 -94 14
5290 14 512 381 1 98 139 98 39 -15 -335 -100 -19 57 -215 393 7 -125 519 54 -140 -168 -86 -241 -297 -290
5314 -290 -183 -243 158 16 -107 87 238 -136 192 75 -301 -55 152 -100 -223 112 -55 -258 100 196 -114
5335 -114 410 214 -291 54 -80 -505 -114 61 -326 -154 -110 19 -165 66 203 -226 -13 -5 -89 449 -52
5356 -52 -94 -81 162 -63 -287 -74 212 -287 348 401 -224 525 150 -521 156 108 -427 46 225 -85 103 208
5378 208 -144 -84 405 285 97 371 323 -212 124 352 -167 -51 229 -137 -255 92 181 65 196 538 -138
5399 -138 -52 290 -304 25 325 -3 -243 65 -7 -82 131 153 243 -123 397 -176 81 243 -53 -560 367 -197
5421a97j43m3M66j51J42K0j51M48P1m48J39P7n12J2M07m82l0N30n79K10Q13k49
5443C50p45M91j66J05m6RM2k80L34j59j68K43J19p8K15O1m40L61l01p2j43L13
5465D5l50k65O65L4k84M83k9k07K96j26k54j96J44j77k2K88J06o22N00R1j62J61
5487A19L12o35K77J95m31J29Q7k16K7J83P6n00N97k39L43k11K87n11J84J62o33
5508c98K79q3l5NM7K36k23L59N3J34l26K76o05K58n2l44J27L12q6m68O64J15m09
5531a64OM94l22j34K05m79L35J73m54J96J37R6o69J054r8m22N58k09j90j95K98
5552B16o29N36j77k17r2N64k80K28k52M50l25K87l9k55J9K77l14l49J14M91n69
5573c16N20l10Q7J51P7j33J38N4m07K55J63m73j38M39l09M47J83m6m99K16M30
$$ plain form
5421 -197 -340 -383 83 -68 74 94 -57 391 462 14 153 230 -282 -270 137 -345 -375 155 -424 -214 599 350
5443 350 -395 96 -70 35 -11 -2 40 -240 94 -65 -233 10 129 51 266 327 -113 248 -53 -125 -268 45
5465 45 -305 -570 95 129 -155 328 299 92 388 262 8 -188 -44 -221 -243 45 151 -471 29 120 -42 119
5487 119 431 -204 73 268 -163 -34 53 -163 -136 47 123 -377 220 -19 324 113 400 -111 73 235 -398
5508 -398 -119 -202 -237 -232 -185 51 -172 187 240 374 48 324 -281 -23 -75 -419 -292 20 -66 -534 130 245 -164
5531 -164 -158 336 14 -120 85 -394 -59 114 -340 -144 -7 89 -580 474 376 -46 512 303 113 -82 216
5552 216 -413 123 -54 -271 -363 201 -79 149 -103 347 22 309 270 15 34 311 -3 -352 -238 253 -316
5573 -316 204 -106 -19 132 209 76 214 268 -139 116 279 -194 -332 107 -202 245 428 382 -117 99 529
5594E29l50n2J08k25m34O84m45jL94j8k53k1Q3r6L53N68j166K60N42o55o4O87
5616D28n94j17M70J02m01j63P55n53L41Mj13l47N30m41o9J44O3j89N47n71j0L99
5638B15K39m27l23N27j04m22O11l09k73J86Q9l06O40q5J63l86M7K2l45L67m70
5659c44j91K42K76l95K84J72j06M46l04l34N95k55J63m16P9K20k95JP5j42K07
5680b2J06l45P50O1o08K94j6r5j79k84L51o38N01M59n66N13l4j69J49K30m21j2
5702B5K28o65L84r0K1k85M63l4l46M61K73n64R3K93o22K84J23j79j18J28O1m35
5724e01N82K17n07K15N10n51N07J0q61M0M32l22l13L05Q9j60K30L92k75R2J05
5745B36l84M3O39p59l21M34O4m32K70J48j53%N71n16K15M13l71k34K53l76k15
$$ plain form
5594 529 179 127 235 10 -424 260 -185 -186 208 190 -63 -84 -1 -97 256 824 -342 -82 460 -195 -259 428
5616 428 -166 -283 187 289 -112 -275 480 -73 268 272 159 -188 342 -99 -168 -24 39 -150 397 -174 -184 215
5638 215 454 27 -296 231 127 -295 316 7 -266 -80 9 -297 343 258 421 35 82 104 -241 126 -344
5659 -344 -535 -293 -17 -412 -128 44 -62 384 80 -254 341 86 249 -167 -88 132 -163 -162 -87 -229 -22
5680 -22 84 -261 489 550 -58 236 220 125 -54 -338 13 -625 -124 335 -231 282 248 79 228 458 37 25
5702 25 253 -412 -28 -118 -97 -382 81 47 -299 162 435 -129 -36 257 -365 -81 42 -137 -255 -127 -66 -501
5724 -501 81 298 -209 6 516 -35 472 482 -379 -339 93 -229 -542 -237 -148 -308 -78 314 39 131 236
5745 236 -148 -105 534 -225 -546 -112 -48 -480 -210 -62 -215 -215 356 -160 55 468 97 -137 116 -260 -475
5766d75L60j82M8L40j49J82p4K29j22M8J08on79K02k94k23O11j05k10J48L16k12
5788c9J08L10j3m22K11n1j16r1J2m75L97J02j19n2M38j4m30P08k17m85J48p1n23
5811f84R35k35l94M08j96Q1J50M4J56k24J82m64J0O12m84n55P23j51j29L61m74
5832c28J06L04K93j79k50N42n80k4J06K4l17J76L07o27P06n0P1k99L33j02l80
5853a68M29n14k36L77K56n89M31K5J50J44M80q42R0J92j54m54M05M4o69O38l20
5874b85J27P3L44l77K45J73j49k43K37j47n0O6M9k04J81L6k63R5L75k8j3K80l72
5897A50l25J81M0m00M84K2m34Q5L84o25K53P30m97j87L75l26%J44km42L80K09
5919A99p75K77N35l11J19K70m67L10K46j05l43J18k2l55k77O78p41O21K96j44
$$ plain form
5766 -475 -115 -297 -249 91 -58 124 50 279 157 205 313 307 -272 -70 -364 -587 24 -81 -291 -143 173 -39
5788 -39 69 379 366 -56 155 104 -12 -103 -91 -566 -169 -67 -186 -238 200 186 -244 464 247 -238 -90 -161 -684
5811 -684 251 16 -378 30 -166 -85 65 109 265 41 223 -241 -231 381 -103 -658 65 -86 -215 146 -328
5832 -328 -222 82 375 196 -54 488 -92 -116 -10 14 -303 -127 180 -447 259 209 280 -19 314 212 -168
5853 -168 261 -253 -489 -112 144 -445 -14 11 161 305 785 -57 33 225 71 -383 22 66 -603 35 -285
5874 -285 -158 -85 259 -118 127 300 151 -92 145 -2 -52 14 63 -141 40 76 -187 -92 283 255 242 522 150
5897 150 -175 6 46 -354 130 152 -282 -197 187 -438 -185 545 48 -139 236 -90 -90 54 52 -390 -10 199
5919 199 -576 -299 236 -75 44 314 -153 157 403 298 -45 73 51 -304 -581 97 -644 -23 273 129
5939A29k44P61l94q36Q21l46p5J64j26K4K1Q4J02l61N63l44j76O45n85M47j1j95
5961F8j82J4j44n4K98O6J05o16J179n60l55O55n25k99P14m45n12M60m6J26j69
5982b22O07l69k3L78k09j5L61n42k74R8J40j39j26M17l66J78Q63n50K4K40j26
6003C45p30L73K78p95K97P6m94O45J36%l4N15k46k41K50J84q06L03k17p09O24
6024b46j4m8K15K80j95J14M52n6l18k72L43o24M28m17m95O59O29l52m7J07j37
6045FK71N5k20l04M31j75m90o4O15p96N86L98k96K65J90l76J57J40M2l73m39M28
6067E1m71k28N66j32q0L55M2M8K46k6n5l1j85j78j93L76n78L37N01o24O5Q61n60
6090A07l21L86j19k86K73j05k89K67j11k6k65R49o15k58R27r2l75N39j88p93N87
$$ plain form
5939 129 -115 646 252 -584 237 -109 -184 -20 -146 -122 -101 -17 85 -276 287 -57 -233 412 -173 274 263 68
5961 68 -114 -100 -244 -298 0 66 171 -445 734 174 -181 474 -51 -350 364 -81 -593 -133 -179 -53 -222
5982 -222 385 16 -7 371 162 147 508 -34 -308 -210 -70 -209 -335 82 -284 -106 757 207 231 471 345
6003 345 -385 -12 266 -529 -232 -156 -650 -5 131 131 97 612 366 125 375 559 -247 56 -161 -870 -246
6024 -246 -260 -308 -93 187 -8 106 558 502 184 -88 255 -369 59 -358 -853 -194 435 83 36 143 6
6045 6 277 332 112 -192 239 64 -426 -490 125 -671 -85 313 17 282 472 96 253 393 435 62 -377 51
6067 51 -420 -648 -82 -214 -294 61 103 151 397 371 316 285 100 -78 -271 105 -473 -136 365 -259 -194 667 107
6090 107 -214 172 53 -233 40 -65 -354 -87 -198 -224 -489 460 -155 -413 514 422 47 586 398 -395 192
6111A92j98j01J0l4o8j41P45k51k05L96j10k53M1J3n9L4R4l97P9M75l43k38N46
6134B27k25K33K1J65l40m7j58l16L43j19l42L32K96l42j32Q07l61q6Q3K06j98
6155D7j33q7K01l69M49l28K01L57m25J41K26K73o94Q8N13o73M35r1n00K39L01
6176A71k27RJ40J31k60K26L58o79K55Q6k93J48P9l61k88N36k44k11P55j14n07
6197b90M03N56r27K28J69k03q0P8k63J1M91j81p6L67L42r31P84k2m80J1Nk78P3
6220b13K21k32l38O90k81Q3J67L88m61M58j82o95O01l42n05L10M89k54J56K00
6240B60k14M9L53rm97J85R9n46J85K98k65j73M19j82j79M30j34J53k08M31n08
6261e3K4k52j73PL55l75J1Q36l09q2j9J46j44k57P71m07j82N6j36l91O87m66J15
$$ plain form
6111 192 -6 -107 -97 -131 -199 -340 405 154 -51 345 235 -18 23 36 -23 11 105 -292 -213 262 -81 -319 227
6134 227 2 235 256 421 81 34 -124 -440 -97 -216 -558 -226 70 -272 -404 403 42 -44 39 245 47
6155 47 -86 -173 28 -341 108 -220 -19 338 -87 54 280 553 -141 -53 460 -213 222 131 -369 -130 171
6176 171 -56 -47 93 224 -36 190 548 -131 124 210 -83 65 144 -217 -505 31 -213 -424 331 217 -290
6197 -290 113 669 -258 -30 139 -64 -144 -66 -329 -318 173 -8 -84 283 625 -306 478 456 -24 -13 -8 -286 -213
6220 -213 8 -224 -562 128 -153 -70 97 485 24 482 300 -395 206 -136 -641 -331 158 -96 60 260
6240 260 46 95 448 439 -58 127 226 -320 -135 163 -102 -275 144 -38 -217 213 79 232 24 455 -53
6261 -53 -29 -281 -454 -447 -92 -467 -456 380 71 -11 -30 116 -28 -285 486 79 -103 -47 -183 -574 113 -353 -238
6284b38M34o8m88P35m5o76K78K34k47k10K45j14n34J160l24j49M15l43K69m9J9
6305C04k93n6q7j73l9P44n59k09J107n69n28O77k63k8J45l4p5k90J59L10p00N80
6327A23k32j52N69j6j60R7J34m71j03N44m89j50J44K41r07N02N21n35N25k7k11
6348e3M64P2p35K43N0O7o8qm6p5L89k25k3j15L69n84K18R3l89L41R9j36l79O20
6372A89j46k53K55M84n46M03J45p68K51L84p86K7M39o22J04L70Q6J57k4L72m19
6393A02k2K60m59L7K75n67N6M08o59K83M73p0q4K68J83m01j20M46k52l03Q44j249
6415e51L02J18J1o2M5J29j86J84L86l80K2M71m91n46M63j28j87O18j88k55M59
6436B34K2n5k52N99j59n34L58k80k58o5j35M5O90k36k75M85K14j05J19L54o02
$$ plain form
6284 -238 196 128 -360 375 330 -346 -68 166 -81 -291 -46 -160 -694 466 142 -7 408 65 334 285 304
6305 304 11 -45 -132 -305 -344 400 -159 -368 739 170 -358 319 56 28 173 139 64 -226 -67 243 -457 123
6327 123 -109 -261 308 292 132 229 363 -108 -211 333 -156 -306 -162 79 -828 -326 195 -340 185 158 -53
6348 -53 411 483 -252 -9 41 108 40 32 -14 -89 300 75 52 -63 306 -278 -60 33 -356 -15 84 -52 -431 189
6372 189 43 -210 45 529 -17 386 531 -237 14 398 -388 -361 78 -544 -440 -70 16 173 149 521 102
6393 102 80 340 -119 -82 193 -374 -318 90 -569 -286 187 117 33 301 484 83 -37 409 157 -146 698 -551
6415 -551 -249 -131 -120 -182 -137 -8 -194 -10 376 -4 18 489 -2 -548 -85 -213 -400 218 30 -225 234
6436 234 256 201 -51 548 389 -145 213 -67 -325 -390 -525 -480 210 -26 -301 184 398 293 412 766 164
6457A64m14K80j23k08N2J14m76O96Q0m78K71K08M0j11M1l66J26n5L4o08N23J04
6479a06l73N36N5k6L2N54m23l57M3l1m2J99j40l98N53L4n40P52O8l84L46k17J7
6502A52k75K20l98k89L83j5l0K94Qk35N37K20l51ML4j39k21L0L4m00K12J10k58
6525c73N51N30p58P5M51m95k51K59l91P2K37j98j3Q3J80j75o6P79j11m06P45n71
6547A54l79K54O2o24N58k04l41N62K7l74N32L4k61m5K74q9l37K37P1o61N96p1
6569b5m2RM45k80j81N48p37J92J66k70k65M89k73j12O98j99m66L70K28l40j26
6590a71Q41r10M17J19l66m19L02LJ4q3N81j11m84M81k11J9N55o18J52j76k87J98
6612a54j54O6kL00J70j22J47M8j92k45N97k92p02P72j90m14J21M96j37q9K27k10
$$ plain form
6457 164 -250 30 -93 -301 -249 -135 -611 85 165 -313 -42 166 206 95 136 -230 -104 -159 -125 -733 -210 -106
6479 -106 -479 57 112 86 118 672 249 -108 -65 -96 -138 61 -79 -477 76 110 -430 322 390 6 352 135 152
6502 152 -123 97 -301 -590 -207 -222 -252 42 50 -185 352 572 221 225 259 120 -101 -71 -37 -437 -225 -115 -373
6525 -373 178 708 -50 25 476 -19 -270 -11 -402 -330 -93 -291 -304 -221 -41 -216 -282 497 386 -20 725 154
6547 154 -225 29 91 -533 25 -179 -520 42 69 -305 227 261 0 -45 229 140 -197 40 111 -550 46 -25
6569 -25 -67 -58 387 107 -74 474 -263 -71 95 -175 -440 49 -224 -336 362 163 -303 67 295 -45 -171
6590 -171 670 -240 177 296 -70 -489 -187 -184 -170 -253 328 217 -267 214 3 22 577 -41 111 -65 -352 -154
6612 -154 -308 -242 -244 56 226 104 251 299 107 -138 459 167 -535 237 47 -367 -246 250 113 24 251 41
6634D1nQ42q14n36N07j79l61Q52l35m96M57K06o0J58j33J74l96P16k74o92K82
6655d6J24o90N53J41m94O91O1n22J92J75K93m71K98j66m06M08l26k64O21J9k67
6676g6M9M87m26n7K90j16j66K57j44q15R19k61n78N12M01m64J22R5P8J70o7o0
6698A50l78M37m79k1L6N80n40k36L73K59m3J41j59k10L68k39n52j41N70j68l2
6719b84M98l90kP61n08k2N18m73N2k6j0n29J26M22l94m09J022m91N47L33q42j26
6741b27L94j42l4r5m4r9j36L94m52L3O96k20j46M26j41o8N83o64j96K97m84J10
6763b15J53N1n6K77K67l75J7J72j11l74M70k93n09J50L28m71J9N99O9k24L18j85
6785G7LJ89q8m22J96K79m92m3J70j45L20O1m4Q6K46k58Rj5K78p28K61J50p97N20
$$ plain form
6634 41 36 878 64 -472 35 -144 -505 347 12 -484 -27 179 119 277 144 318 -78 638 364 -328 -46
6655 -46 78 -612 -59 82 -412 279 340 -182 10 185 478 7 305 139 -267 141 -185 -449 172 191 -76
6676 -76 -27 460 34 -23 267 151 -15 242 98 -717 202 -59 -637 -125 276 -188 -66 29 107 277 210 150
6698 150 -228 209 -270 -291 -255 325 -215 -451 -78 181 138 279 120 -90 278 39 -513 -654 -84 -252 -284
6719 -284 214 -176 -178 583 75 53 571 98 150 124 114 -415 -289 133 -261 -670 352 -139 408 741 -101 -227
6741 -227 167 25 -9 -104 -148 -247 -383 11 -441 -408 288 68 -78 348 207 139 722 58 -138 159 -325 -215
6763 -215 -62 -11 -67 210 477 102 119 291 180 -194 276 -17 -526 -376 -48 -519 -500 99 168 -56 262 77
6785 77 80 269 181 -241 -45 234 -258 -301 -131 -276 44 105 61 147 393 135 144 129 407 -321 -60 90 -707 -187
6809a87J4K00j37K76j0k2K12P0l38N25l79o16K28J65l54N1L48k39J39K29k03J24
6831I6K06j63l21Q6O2m61M96R3l29K31P1j03J5K74j44k76K38K35n04N9n9l67L79
6854a86K33J41k84M45k29j12K24O7j70r0Oj83N1k7j7m4J99l66P1M19ok24M44j16
6878B46m85K60O2l25m9L79p17O83Q8j35J54M11l03p05O99j11j61M0l35k28K80
6899b52M14m22K9M38j94k71N49Rj77j37P3j72j07r9O8j50M63q6l37Q94j83J6k76
6922I0n0k55M35l0n10J24R8m2l00M46m50L23K0M02p0j06Q1l13j38N21m14j21J3
6945b46j11J1N63k32r3L84J37k41L53j71l07m40M28j81p83R17J4m17P08Q8n15
6966a34Q24m41k10Q1J6n08J58R4j47j75L12o0l73R33l16n8N74m39m01N79n06l93
$$ plain form
6809 -187 -173 27 -110 166 156 134 346 416 78 603 224 -392 -164 1 -353 -302 46 -193 -54 175 -28 96
6831 96 302 139 -182 -96 -34 -495 1 94 -235 -4 67 -36 -21 253 109 -167 71 306 -198 -139 -198 -565 -186
6854 -186 47 188 -96 349 120 8 232 299 129 39 45 -138 -87 -114 -131 -175 24 -342 -271 148 142 -82 362 246
6878 246 -239 21 83 -242 -291 88 -629 54 142 7 161 572 269 -436 263 152 -9 31 -304 -532 -252
6899 -252 162 -260 -231 207 13 -258 291 300 123 -14 59 -113 -220 -319 -251 -401 62 -24 -361 533 350 366 90
6922 90 40 -215 220 190 -320 -196 -98 -140 -440 6 -444 -121 -101 301 231 125 206 -107 -245 276 -138 -259 -246
6945 -246 -357 -346 217 -15 -108 276 413 172 525 354 47 -393 35 -146 -929 -12 2 -415 293 381 -134
6966 -134 690 249 39 120 136 -372 -214 -120 -267 -442 -130 -190 -563 370 54 -4 570 131 -270 309 -197 -590
6988e90K23K3J04M60j19K67j82l1K09l05L9J68p22M02j18p5j57L88J76l35M09
7009B34n5O9j70K85l07qJ20j89j86N2k54L7N94k74J0N5L19m84K81M59p25L42J69
7032C74q64J55N68p55J65M64L9j72m6O70n23L3M35r32L77Q0o04M89p4j61o0L59
7054A7O5J35J63r5l24J18L14o72j86N99p04K47N08j59R4J88j70p2J48Q7n5k13
7076C3j45l7o00Q37k82k34O25k45K72KM2L6k90P1K8l62Q8j56J2M42j65l05N89
7099B56k41j24N87k62K45o73R0mo2L7O4k17N56j84k66M60K21n73N02k61k04j34
7121a87R0L03p03M86l61J30M39k15L3N44n22N4K83j47l08K23nk08m00M29M1l31
7143c32M13j15k13N59o0m35L87l2l50J13p7j95j93P17l62j49K86K75l02M74j89
$$ plain form
6988 -590 -367 -344 -240 220 101 368 186 155 364 59 98 266 -456 -54 -172 -247 -404 -16 160 -175 234
7009 234 179 248 78 363 56 48 168 -21 -207 -155 -409 -372 222 -52 -42 13 332 -152 129 588 -137 205 374
7032 374 -490 -335 233 -522 -357 107 146 -26 -72 598 75 108 543 -389 -12 68 -536 -47 -121 -282 -342 17
7054 17 82 217 380 285 -39 79 393 -279 -465 134 -570 -323 185 26 120 308 138 66 214 301 246 33
7076 33 -112 -149 -749 88 -194 -428 197 -48 224 226 268 304 14 85 113 -249 -161 -317 -305 137 -28 -333 256
7099 256 15 -109 478 216 461 -212 -122 -126 -188 -151 -87 -304 252 68 -198 262 483 -90 412 151 -53 -187
7121 -187 -97 206 -497 -11 -372 -242 197 -18 15 559 37 91 374 227 -81 142 137 -71 -471 -42 -1 -332
7143 -332 81 -34 -247 312 252 -183 204 172 -178 -65 -142 -337 -530 187 -175 -324 -38 237 -65 409 220
7164B20m29K40K53o03L63K30k19l26M57k48j66K04L01m60K82J57k72J1J90k73
7184h8k02k4o4K09M18k78M6J51L29m19P1L0n35L85k11k74Q9K58J1j21K98L05n06
7207a22L97Nm9k82N08n86j6Q5L11l95L70j73l36J82N43n31K02K97o03r6O52m52
7229h9q6K67k82KK14M5l99J98O61n72J86L97n79J4J97l73j31K46P7j62J64R6n2
7252C9K97Qm54K45j77j26m50N79j52k3M58m02J81L8K58Q6j33j14k38j50M28l54
7274a56r0M50o61M2M69j04Q9N0L99o58L26J69p9q57O19j59p1M86k34k89N50j47
7296A44k87M00k12L40j71M3l38n50P62l0l24M30J5n30L98j2J46O4k67J73j01K24
7318C17o86j95M15pl12O69r4k15O28l78K4J86m8q7j87j48rj7j00K97l03N65K1
$$ plain form
7164 220 -209 31 284 -319 44 274 55 -271 186 -62 -228 -24 277 -183 99 256 -16 -5 185 -88
7184 -88 -290 -314 -378 -169 249 -29 17 168 497 78 149 179 -356 29 -182 -456 -367 -109 -98 -219 79 384 -122
7207 -122 275 280 231 -51 457 -129 -145 -60 251 -144 226 53 -283 -101 442 -89 113 410 -193 -289 363 -89
7229 -89 -175 92 -190 -188 26 71 -328 -130 531 -41 145 542 -37 -23 174 -199 -330 -84 -7 -169 -5 91 39
7252 39 336 344 -110 135 -42 -168 -618 -39 -191 -214 244 -158 23 61 319 405 272 158 -80 -230 198 -156
7274 -156 -246 204 -457 -415 54 -50 39 89 488 -170 156 325 246 -611 8 -151 -222 264 30 -259 291 144
7296 144 -143 257 45 385 214 257 -81 -631 131 101 -223 207 222 -308 90 78 224 288 21 194 93 317
7318 317 -369 -564 -149 -156 -468 201 107 -108 520 142 166 352 304 217 30 -118 -127 -144 -244 53 -250 315 336
7341C36p08O39r6j59M3Pp5o5p1K46n55O22l05j18L07J81R7J96Oo37R7m6j54j04
7365c16K04pJ95l1J37l17K08J35m83N44l7m11K69j70p8j43J77K50l41L71K26n14
7387a32k38R30n28J17L15p61J74j41j84L27J88o4n0O4J57l45L3P40n85l69O39
7408B87l18l17K55j62j24K13J23J50n8M16m64J16K09l04l88M34j08l12K27n21
7428f46L51L74RK5k03L11M7k49M34m15l61O26n79K21J21m54J83O1K38j41ML73
7450C30j15k16J53k05k58J96N9n23M82J50N9j61L78pJ0j00j86j30O5j65l96N62
7472a8o8m22M47rj09L01K59m17Q5j0k1l74J66j41K53Qj40q5N25K1l80J7R46m69
7496C65m50M73l53j13j59J04k82L04L13o33M39M27k11k76L05k23m42K89L7l12
$$ plain form
7341 336 -372 267 171 12 55 62 -13 -78 -149 97 -458 164 -141 -259 48 229 326 522 528 -109 -12 -58 -212 -316
7365 -316 -112 -119 76 45 182 -135 73 208 -275 269 232 -179 90 -80 -158 -301 -124 126 -215 156 382 -132
7387 -132 -370 560 32 149 464 -297 -123 -264 -448 -121 67 3 -47 17 174 -171 -138 602 17 -352 287
7408 287 -31 -348 -93 -255 -379 -166 -43 107 49 465 1 117 326 22 -366 68 -40 -352 -125 -646
7428 -646 -295 79 88 113 -90 221 268 19 453 38 -323 303 -276 -55 66 -388 -205 -144 94 -47 -43 330
7450 330 215 -1 152 -53 -311 -115 -56 -579 -97 53 112 -49 329 322 332 232 46 -84 -19 -184 -580 -18
7472 -18 -86 -508 -61 -70 -179 122 381 -36 49 39 18 -356 -190 -331 -78 -70 -210 -295 230 251 -129 -112 834 365
7496 365 -85 388 35 -78 -237 -133 -415 -111 202 -431 8 435 224 -52 253 30 -412 -123 -86 -398
7516c98K07L71m76K31M51m62K19N1k51O6K3r5j47J11J60k54j9K07n13M98K34j61
7538E3k04O15m35j34M03m50j97J94J05j40nr3o8M03K91j22J00J04k49j90j8k51
7560b88L0j13K78n08M88M80k50k54M42m52K15o9J09K82l53l27K54n5K81l91J21
7581h0O20n82P9L03p6k72J09l49J73j27L61l24j44O8J11J43J65n0j33L94m55k08
7603b74L30J43n05L8L80p0k40J35K43j06N67n49k59L18k0Mk56m11K40J26J48k61
7625b79J29L78j36j19K30K2k47L01m35j37M89n7l83L63l74J52r6J51M9K14J61
7646C76m26l07M33k49rN0J18l25J89p6J71j57N11n5j83r2J72l43L57l25l15O08
7668A23l10j51K88J46l4l11K71L54o16M02M1m15J57M7m64K71J99k11J87R6O8j93
$$ plain form
7516 -398 -191 180 -296 -65 386 -76 143 194 -57 9 32 -63 -210 -99 61 -193 -212 -5 -518 -20 214 53
7538 53 -151 464 29 -105 298 -152 -349 -155 -50 -190 -195 -288 -356 47 338 216 316 420 171 -19 -37 -288
7560 -288 -258 -371 -93 -601 -113 367 117 -137 305 -147 68 -1 108 390 37 -290 -36 -91 190 -201 -80
7581 -80 540 -42 37 340 264 -8 101 -248 -75 -202 159 -165 -309 -241 -130 13 178 128 -5 389 -66 -274
7603 -274 56 199 -306 -268 112 42 -198 -63 180 74 641 92 -167 151 131 135 -121 -532 -292 -166 -18 -279
7625 -279 -150 228 92 -27 203 225 -22 279 -156 -293 196 139 -244 119 -255 -103 -199 -48 1 215 376
7646 376 -50 -357 76 -173 -182 -132 -14 -339 -150 -226 -55 -212 299 244 61 -31 141 -202 155 -170 -485 123
7668 123 -187 -338 -50 96 62 -249 22 376 -240 162 203 -212 -55 -8 -472 -201 -2 -213 -26 70 138 -55
7690e5L69l49k38J23J89l16n1j90j59L06M47m71N64k5j05m3M25n7p03N17k5l94
7712b41n4M84n24K65J93n01M64R8o3Q1J27l18m4q1K16m24M1K47k93J94M50m97
7734a80L73M46n41k5r2K12k57r4K47k77j67L69j44L51M8q5j49K97k94N1K31q48
7756e28L89k11K52j87j4N36l3N3K24k65l60L79k81l3K54m11Q5k75n0L87l44P42
7778C09k45k49N71o9P0l3k65k69L82j37m18l7K23L72n44P10j91j30K79k93k46
7799b10N10m50l89L69rq0J55J34qj02M48r0k23L19n30l78N37j97J43j03j2L5j02
7822b33M17j71J2K40l3m10M78l9p30M57j36m44O81n1N4J8J85j38k87L68k60J49
7844A27r3R8l04K6L48o85K68K54j06J85K24J33n13L46j90j35k36M49n66K31kJ94
$$ plain form
7690 -55 314 -35 -273 -150 39 -277 -328 -518 -677 -371 76 -395 169 144 39 -4 421 364 -339 178 153 -241
7712 -241 -295 189 -335 -70 123 -378 86 184 121 202 329 11 -33 -114 102 -322 -281 -34 -327 -133 317 -180
7734 -180 193 639 98 73 -19 193 -64 -158 89 -188 -355 14 -130 221 269 184 35 332 38 89 320 -528
7756 -528 -139 -350 -98 -285 -299 237 204 257 481 216 -144 235 -46 -79 175 -236 -151 -426 -476 -89 -433 309
7778 309 64 -185 386 317 387 354 89 -180 202 65 -353 -390 -167 205 -339 371 180 50 329 36 -210
7799 -210 300 -150 -539 -170 -179 -259 -104 30 22 -80 368 278 55 374 -156 -534 3 -194 -51 -154 -166 -131 -233
7822 -233 184 13 25 265 232 -178 300 261 -469 -12 -148 -592 89 38 92 110 295 157 -130 238 -22 127
7844 127 34 132 -172 -146 202 -483 -215 39 -67 118 342 475 -38 308 118 -17 -253 196 -370 -139 -141 53
7866E3l10N14k09j44M84j80j59J19K05k78k07m1k84K76K64l56j6J03L65m4m53
7887b98O70n59K00j7k13P9Q1l12K20MK13K9K00j48p8K01K43q31J46L30m10j0K30
7910c0l89K38M39m7k73J52rj06J27k3k95J63L79j031N51J86L3k68K73K3L20j65
7932B48j97J00r3K4k62p1M58m89r0N23n58K93L13k99L76Ok88K56k72L23k12l85
7954b96K17n18N61j8O8J23J10N6l61N04Q1o23j82K98nj64k9K78J85l37K67L3m7
7977B01l2m18M04l4j46L43l15l24K25q2Kp2M33j14k60O05r8k43k51k5l2k06K28
8000b11M38l65J93M0k26K09N08n81L03k56m61J005p02l32J09O1K82l75L58K84
8020B81k53L76k0m58j30L55k25m24L72j22J90N4k29L95K8L35m82J17K76n54J57
$$ plain form
7866 53 -257 257 48 -96 388 208 49 168 373 95 -112 -153 -437 -161 103 -253 -269 -166 199 155 -298
7887 -298 372 -187 13 -4 -217 -138 -57 -369 -149 -145 68 97 297 149 71 272 515 -316 -170 160 -250 -260 -30
7910 -30 -419 -181 258 211 -62 90 81 -25 102 79 -216 -53 326 -705 -154 32 65 -203 70 93 413 248
7932 248 51 151 58 82 -180 -251 207 -282 -372 151 -407 -114 199 -100 276 282 -6 250 -22 301 89 -296
7954 -296 -79 -597 -36 -54 14 137 247 303 -58 446 527 -96 -278 20 15 -149 -178 100 285 -52 215 248 201
7977 201 169 -249 155 121 -25 318 3 -321 -96 -178 -176 -248 185 71 -189 416 318 75 -176 -201 -233 -439 -211
8000 -211 227 -138 55 95 -131 78 586 5 308 52 -409 596 -106 -438 -329 -268 14 -361 -3 281
8020 281 28 404 384 -74 -204 151 -74 -498 -126 -248 -58 -4 -233 162 190 525 43 160 436 -118 39
8041C9Q9j43j69J70o50M87K40J03m33N31J32k87k06L49j29m58K70o71M95N69n33
8062b05L17j40L71m97n2N30q2j8n4j24j40K97n12K06n4j09O0P01n14J84oK2k02
8085b1r6L09l43J81lk00L2K58l63J64L38j08k02M0J16m62L36J41n41J16L77j66
8107i7n2M18k4j85Q2k5j35K52j33k4j76M2m6j61M35j24l52K03K70l00M87n6l04
8130eM6P4K79m80LJ66m55K71K88m32K68L85k02k89J27J41q5M7k05p1J08l72k15
8153f08P14P4l23L49q0k17M17nl74k46J13L59k10l02J04lK08Q5j4J98K00m42j20
8176a23M15m17l53M16K7l77j0N24l91K61J31L5O9p0j28
$$ plain form
8041 39 128 -15 -184 -14 -664 -177 63 166 -267 264 396 109 -97 252 123 -335 -65 -736 -241 328 -205
8062 -205 112 -28 343 -154 -206 324 242 224 170 46 -94 203 -309 -103 -157 -266 -206 495 -19 165 159 181 -21
8085 -21 -117 192 -151 30 27 -173 -141 117 -246 -82 256 148 -54 -14 102 -360 -24 117 -424 -308 69 -97
8107 -97 -149 269 245 60 142 117 -18 234 101 77 -99 -57 -103 -264 171 47 -305 -102 168 -132 355 299 -5
8130 -5 41 115 394 -86 -83 83 -372 -101 187 -245 23 408 206 -83 44 185 100 147 -58 -129 -21 -393 -608
8153 -608 106 180 -143 206 126 -91 326 321 -53 -299 -186 173 -37 -339 -235 -238 -30 55 41 239 439 -3 -123
8176 -123 292 -125 -478 -62 -35 -412 -422 102 -289 -28 103 138 207 137 9
8191I
$$ Imaginary data points
##PAGE= N=2
##DATA TABLE= (X++(I..I)), XYDATA
0@%%%%Qj6J6j6K4l2M0m8N6p2Q8j04J20j44J71k03K41k79L21l69M25m88N59o36
28c38P19q12R16j031J156j292J442j609J792j990K207k445K707k998L320l676
44a932M072m515N016n584O234o990P878q939J0237j1861J3961j6798K0859k7179
58a5541L8398o3997K13267M0453m40770L34658O8243k94303Q4674J32131k16647
69a19434K2062J65877j35463o2322K45902j17209j31451K95573o3206k58104K50063
80I2288M2307k59408Q8339J11710j33206k216Q9593n4497j4365J29157p6914r4547
92h1759J89708l8116j79349J68490L851j90743J19829O3893j41146M0660R4016
103D9334n9885j3547J00566m6005q7195J31694j6537j63461J26522L7714j73512
$$ plain form
0 0 0 0 0 0 8 -8 8 -8 16 -16 24 -24 32 -40 48 -56 64 -80 91 -112 129 -150 171 -198 227 -261 298 -338
28 -338 381 -431 485 -546 610 -682 760 -849 943 -1047 1160 -1285 1422 -1576 1744 -1932
44 -1932 2140 -2375 2641 -2943 3291 -3699 4179 -4760 5477 -6384 7577 -9221 11638 -15541
58 -15541 22857 -41140 172127 212580 -228190 106468 174711 -119592 -34918 97213 -119434
69 -119434 -97372 68505 -66958 -129280 116622 -587 -132038 163535 100329 -157775 92288
80 92288 134595 -124813 -36474 75236 -57970 -60186 29407 -25090 -39455 89702 12788 -81759
92 -81759 107949 69833 -109516 58974 62825 -127918 -8089 55804 -85342 -44682 49334
103 49334 -10551 -24098 76468 30463 -56732 74962 58425 -105036 21486 59200 -114312
114a14312Q2523Q2079j12126L2428Q5095n6562j4145R4857k9215j02075R7550
125D6097K1404j61971Q2998P5394j70982M9857J24866j19072q697J23829m1824
136B1899o0448R3787J3486j11026N9527N4878j42183M3190J01770j46218N510
147f5828J33743r0146l3157J09248l7137o0849Q0717J5985r6325L4336N8811r4646
159d5248J9059P8236j02340J5123J11873r3165k7027J14951m9645o9951Q2313
170C4179M069r4076M2909N5132r8800J0037R7329p8299j6806J04779n8743l3819
182c2109J03270m2072q2085Q0933K0733r9144K1810O3546p5319r424R0901n1898
194a0858l8731R8616j8388o0801P2320Q24p6229M3420L0298q0874L966O6015n6158
$$ plain form
114 -114312 -31789 50290 -61836 -29408 55687 -875 -15020 79837 50622 -51453 46097
125 46097 67501 -94470 -11472 63922 -107060 -57203 67663 -51409 -60106 63723 21899
136 21899 -38549 55238 68724 -42302 17225 72103 -70080 -26890 74880 -71338 -65828
147 -65828 67915 -22231 -55388 53860 16723 -44126 36591 52576 -43749 -9413 49398 -45248
159 -45248 -26189 52047 -50293 -35170 76703 -16462 -43489 71462 21817 -48134 34179
170 34179 38248 -55828 -12919 42213 -56587 -46550 50779 -27520 -44326 60453 1710 -32109
182 -32109 71161 29089 -52996 27937 48670 -50474 -28664 34882 -40437 -49861 41040 -10858
194 -10858 -49589 49027 30639 -30162 42158 42982 -33247 10173 40471 -40403 -36437 29578 -26580
207b6580l1999Q1036j6898n0125P0254O142n9432N3485K3859p6152J9583N0175
219D3348o2676j3008O1663l8246l2708O8340r451n2353N1491J5790n7235K8459
231C414K7722o2379J0205M8837n5913j1258O8500l1523l1928O7262m891m7172
243a9124M5033J2045n7672J9458L3059n9001o204N2816m2322j8758O6001k5303
255B8l2218O6410m023m8302L9484J3151n3434Q725L1720m7127j3869N3912l0307
268a5850k8832O8042j0373m1392N8554N834m8611L1888J7082m9581q48L6413l1966
281i640l0673M9757o790m2870N4885O938n3308M5685J8687n4749J8520K6359l8200
294a5399r184L6295j1990l3096M5208J4000n1212M1961K6081n9283K6545K4198
$$ plain form
207 -26580 -58579 22457 5559 -44566 25688 31830 -27602 25883 49742 -26410 -6827 43348
219 43348 -19328 -32336 29327 -8919 -41627 26713 17262 -35091 16400 32190 -25045 3414
231 3414 31136 -31243 -21038 27799 -28114 -39372 29128 -2395 -34323 32939 28048 -19124
243 -19124 25909 37954 -19718 -260 32799 -26202 -32406 20410 -21912 -40670 25331 28
255 28 -32190 34220 30197 -18105 21379 34530 -18904 -10179 21541 -25586 -39455 14457 -15850
268 -15850 -44682 23360 12987 -28405 30149 35983 -12628 19260 36342 -13239 -14087 22326 -9640
281 -9640 -40313 9444 2654 -40216 14669 21607 -31701 13984 32671 -22078 -3558 22801 -15399
294 -15399 -24583 11712 -278 -33374 11834 25834 -25378 16583 42664 -16619 9926 34124
306C4124n6072J1153K6964l8881j0107L6395l047l2198L6986K4867m9755L1132
318A1561L6183o5505J6802L8675o0455J188L6796l6428j1061L8247m73l1397L3150
331G283L3332n3113J5554M9636o2602k416M9764n6490j0638M5809l0950j8821
343c3652L6143M696k6996J8522L3460m2516J03N3776n3459j5994N9876m3834k1271
356c1146N3100k2961k1652L6347N040k8183J0160L1576l7662j5677N0759m0752
368a1051k9138O2668l3238l1718O1472j2915l0103L9352R958k9043O628K9668
380C2540l1076k4705M9487k7532m2872O0846j6310m3410N9274l025l7694M0238
392A5761J1811l2884O224K7683k6782k6421M3101j6772m6269N6885m952n2909
$$ plain form
306 34124 -21948 -10795 16169 -22712 -32819 3576 529 -31669 5317 30184 -19571 11561
318 11561 47744 -17761 -959 37716 -22739 -21551 15245 -21183 -32244 6003 5530 -25867 7283
331 7283 40615 -12498 3056 52692 -9910 -12326 37438 -19052 -29690 16119 -14831 -33652
343 -33652 2491 7187 -19809 -1287 32173 -10343 -10240 43536 -9923 -25917 33959 -9875 -31146
356 -31146 21954 -1007 -22659 13688 18728 -9455 705 32281 -5381 -21058 29701 -11051
368 -11051 -40189 22479 -10759 -42477 18995 6080 -24023 15329 25287 -3756 2872 32540
380 32540 1464 -23241 26246 -1286 -44158 16688 378 -43032 16242 13217 -24477 15761
392 15761 27572 -5312 912 28595 1813 -24608 18493 1721 -44548 12337 7385 -45524
404d5524N7612Q290m7411L8123J7774l7525P436K8584k4718k6170M0875o795m9780
417c9229M9825R441n9037M7092K0361n6127K9409K6501m2449J469L0684j9448
429a508k6375L5514M585m5799L9580K3019n6832L4858L1685n5913J8420L1230
441C2464m3429m603L0524j9889k5660L1120Q860m2333L0386L1789n1987K3549
453G91M0615n4424R102L9582m3351j1540L5228j8343k8275K9910J2146m0029K2998
466e590L6940m8028J1118M7995m8794n400M6444l7900k0452L7820j3773l0626
478c0246K7719J5099l6761J5678L7485m0422P44M6855m0366j4127M7543l0024
490h23k5898M0653p625l2094K8940J6239l4052J1256L4910l7070p970M3932l5081
$$ plain form
404 -45524 12088 20378 -27033 11090 28864 -8661 -1225 27359 2641 -23529 17346 10551 -39229
417 -39229 10596 20037 -39000 8092 28453 -27674 1735 28236 -14213 -12744 17940 -1508
429 -1508 -27883 7631 12216 -33583 5997 29016 -27816 7042 38727 -17186 1234 32464
441 32464 -10965 -15568 14956 -4933 -30593 527 9387 -32946 -2560 29229 -22758 791
453 791 41406 -13018 -3916 35666 -7685 -19225 16003 -2340 -30615 -705 11441 -28588 -5590
466 -5590 31350 -16678 -5560 42435 -6359 -11759 34685 -3215 -23667 14153 380 -30246
478 -30246 -2527 12572 -24189 -8511 28974 -11448 -10704 36151 -4215 -18342 29201 -823
490 -823 -26721 13932 6307 -25787 3153 19392 -14660 -3404 31506 -5564 -13534 30398 -4683
503d683k4092M6401k1082l2847M1840J226l3449K8352K3867l3516O974L6166l1445
516C712j5774M0432k6339l1101M1040j1068l7407L6225J1068l5487K2818K8092
528B6211l1671K091L5261k8663j8959L7693j9337l3913L7304j234l8442L1754
540a905J8679l7214J7967L2533l3148l499L6937k6103k3354L6803j2617l4964
552b9885L3997O473l8123K5151K5437l7119P123L5104l1023j1788L6472k3221
564a402k6181L6837n898l2308L1168J2970l2717K0288K7670l3536K97L4543k9562
577B169j9251L4991j9208l0148L4242j561l1482K8047J6202k9308J4143K9486
589B8322k7691o855L3484k2925k3782L5346j3148l3598L4172L835l3014K5089
$$ plain form
503 -4683 -28775 17626 -3456 -36303 5537 6763 -26686 1666 25533 -7983 -1009 35157 3712
516 3712 -12062 28370 2031 -29070 11970 902 -36505 -280 10788 -24699 -1881 26211
528 26211 -5460 -3369 31892 3229 -15730 21963 2626 -31287 6017 4783 -33659 -1905
540 -1905 16774 -20440 -2473 30060 -3088 -6587 30350 4247 -19107 17696 5079 -29885
552 -29885 4112 10585 -27538 -2387 23050 -14069 -6946 28158 -2865 -14653 21819 -1402
564 -1402 -27583 9254 3356 -28952 2216 15186 -17531 2757 30427 -3109 -2812 31731 2169
577 2169 -17082 17909 -1299 -31447 2795 1234 -30248 -2201 14001 -15307 -1164 28322
589 28322 631 -6224 27260 4335 -19447 15899 2751 -30847 3325 7160 -25854 -765
601g65J8741k7667P372K8296k2696j3788L1978j5493l0288L4642l068l8376L1448
614C36J2264l5362K0246K2818k8018P94K6938j6051j9124K7434n903l0624L0224
627E972O530l7798K7900J7881l5792J7442K2448k8448j725K2583j6119j9021K2750
640D603k200l0423K6098J3067l7009K5105K3858l6974J5018K7508k9611m199K3924
653A8765j3821k0028J8253L285k9651J6812K0038l3988J4151K8474l3069O634
665d145K8570k5416o305K0687j0579j5848J3004O403k3482Q179K3533k7008M191
678h216L0570k8615j636L1168k2075j1662K1476p040j6226J0604J1184k1100M35
691a1133K8750k1990r088L5114k1620j5841L2735j3943j9815K0464j548j6318
$$ plain form
601 -765 17976 -9691 -2319 25977 3281 -10507 21471 5978 -24310 10332 7264 -31112 336
614 336 12600 -22762 -2516 20302 -7716 -6922 20016 3965 -15159 12275 6372 -24252 5972
627 5972 12502 -25296 2604 20485 -15307 2135 24583 -3865 -5590 16993 874 -18147 4603
640 4603 2403 -28020 -1922 11145 -25864 -759 23099 -13875 1143 28651 -960 -5159 18765
653 18765 4944 -15084 3169 6454 -23197 -6385 13653 -20335 -6184 22290 -10779 -4145
665 -4145 24425 -991 -7296 13391 2812 -13036 -32 6371 -17111 -8932 14601 -12407 -8216
678 -8216 22354 -6261 -7897 23271 1196 -10466 11010 3970 -12256 -1652 9532 -11568 -11133
691 -11133 17617 -4373 -13461 21653 33 -15808 16927 2984 -16831 3633 2085 -14233
703a4233Q861J4297j5486l671K9082j4238j5053L4677j6414k3355L3181j1926
715E722k6048K3594k116k0489J2348J3839j6194k281K9162j2812j7517L6415j1878
728A1745l0715L5272n215l3681K5440M419k6446J2725J6616j5905m517K5946p718
741G966k1201K9992l290l2368K7640J564l2210K2361O699k4309J2976J4185j3660
754c655k001J8417o400j7437K2165N67l1403K1681Q081k9603J8985J1677k3696
767a2622J1633J6341j3943n018J6282l836k1099J5197O713l1421J3232J7808k8534
780a9267J0700K1184k0234M796J9731j0417p569J4139j067k1394J0018J1015k9212
793a7577O079K2217k6402L845K6586j9416k660K3410j0221j1222J5243q61k1457
$$ plain form
703 -14233 -5372 8925 -6561 -10232 18850 4612 -10441 24236 7822 -15533 17648 5722
715 5722 -20326 3268 1152 -19337 -6989 6850 -9344 -11625 17537 4725 -12792 23623 11745
728 11745 -18970 16302 11087 -22594 2846 7265 -19181 -6456 10160 -5745 -10262 15684 7966
741 7966 -13235 16757 13467 -18901 8739 10303 -21907 454 7153 -17156 -4180 10005 -3655
754 -3655 -5656 12761 6361 -11076 11089 11656 -19747 1934 10015 -19588 -603 11074 -12622
767 -12622 -989 15352 1409 -3609 12673 8837 -12262 2935 9648 -21773 -8541 9267 -19267
780 -19267 -8567 12617 -7617 -2821 16910 6493 -1076 13063 11996 -9398 620 11635 -17577
793 -17577 -11498 10719 -15683 -11838 14748 -4668 -7328 16082 5861 -5361 9882 9021 -12436
806a2436R428J3287k5749L707K4970k3691n93K9754j8294r054K4967r492j5667
819h863J5996j06k0956R014J4853k1636J393K4267j8357m314K6688j4865j2700
832i586K2360q562j7501J4748J556j8393Q249J4241j5656J148K2394j3056p091
845e149K3627r716j5078J6719m415j8280J0930L660j7379M609J5587j2015k938
858i838K0994p219j1128K0594k672j9386J4271L509j9970O730J1053j6798J41
871i719J8539j0040q317K0735l809j6589J7386K484k1619J0448J0036k0935K781
884h619J8044j5873m505K2059q961j2133K1368k831j9833J6425M755k2265Q461
897c908J3878k1149J950K1932j5928o733K5008r207j4752K2070l923k1702J6132
$$ plain form
806 -12436 -3008 10279 -15470 -11763 13207 -10484 -11077 18677 383 -8671 16296 6804 -8863
819 -8863 7133 7027 -13929 -4915 9938 -11698 -10305 13962 -4395 -8709 17979 3114 -9586
832 -9586 12774 4212 -13289 1459 3015 -15378 -7129 7112 -8544 -7396 14998 1942 -5149
845 -5149 18478 8762 -6316 10403 5988 -12292 -1362 2298 -15081 -10472 5115 -6900 -9838
858 -9838 11156 3937 -7191 13403 10731 -8655 5616 9125 -10845 -4115 6938 -9860 -9719
871 -9719 8820 -1220 -9537 11198 7389 -9200 8186 10670 -10949 -501 9535 -11400 -8619
884 -8619 9425 -6448 -10953 11106 2145 -9988 11380 8549 -11284 5141 9896 -12369 -3908
897 -3908 9970 -11179 -9229 12703 -3225 -9958 15050 5843 -8909 13161 9238 -12464 3668
910C668M538k3241P986J3873j9418K72K2870j3003q617K5384o548j6037K1646
923A3373k118k0630J4148M488k0284N266J2701j5201l150J9387q122j1436K1754
936A0176l298j6787J8108J039j9971J2187N862j6912M000J2113j0818m762J6988
949G925l086j4564J7468K347j9947J4441N766k1505Q495J0217j6098J485J3512
962F456p313p352J4985J890j6642J2227Q201k2998R376J1000k2445N294J4318
975F997j5723M53J5372m963q052J4131M661j7473R362J0672k4533N510J4993k4396
989a2989K336J7259j6780q39J7855o004p954J3980M619j6809P672J2896k2701
1002g459J767J8739k2580j836K1290j5281l619J7907n870q247J0794M069j4152
$$ plain form
910 3668 8206 -15035 -7049 6824 -12594 -12322 10548 -2455 -11072 14312 7764 -8273 13373
923 13373 11255 -9375 4773 9261 -11023 -5757 6944 -8257 -11407 7980 -142 -11578 10176
936 10176 6878 -9909 8199 9238 -10733 1454 7316 -9596 -5596 6517 -4301 -9063 7925
949 7925 4839 -9725 7743 10090 -9857 4584 10350 -11155 -2660 7557 -8541 -7056 6456
962 6456 -857 -8209 6776 8666 -7976 4251 12452 -10546 -1170 9830 -12615 -7321 6997
975 6997 -8726 -8273 7099 2136 -5916 8215 12876 -4597 4765 15437 -9096 -3586 11407 -12989
989 -12989 -10653 6606 -10174 -11013 6842 838 -7116 6864 11483 -5326 2346 15242 -7459
1002 -7459 -5692 13047 -9533 -11369 9921 -5360 -8979 8928 3058 -5189 5605 9674 -4478
1015d478K359J2616j8021k573J9800j7336m673K2562j2417n668J8388n667q552
1028c660Q842K497j2070n14J1623j2729o455K0234j1102q789K3364p800r909J8175
1042A1707l603j1837P464K947j1751l589J1798q767j0370K0638m691j3438K2838
1055I346j882j4343J7964m9j4851O863M278j1181l967J1194n856j1724J8495p93
1069C494j6476K0475J813j8802J5882L224j7254P202N833j0993k123J1542l823
1082fj0726J6351K535j7556J6823M709k1089J2812O016j9328N804Q423j1578j533
1096h343J1669j536r866J3288M760j6837J1674P653k1265Q107R123j8624L727
1109f470J0177j0533j077J1368n83q005J0264O583j5463P366R531j9295L585J1512
$$ plain form
1015 -4478 -2119 10497 -7524 -10097 9703 -7633 -12306 10256 -2161 -7829 10559 4892 -3660
1028 -3660 5182 7679 -4391 -4905 6718 -6011 -12466 7768 -3334 -12123 11241 3441 -6468 11707
1042 11707 8104 -3733 3731 6678 -5073 -8662 3136 -5631 -16001 4637 -54 -13492 9346
1055 9346 7464 -6879 11085 11036 -3815 3048 7326 -3855 -7822 3372 -2484 -14208 4287 3494
1069 3494 -12982 7493 9306 -9496 6386 9610 -7644 -442 5391 -5602 -7725 3817 -6
1082 -6 -10732 5619 8154 -9402 7421 12130 -8959 3853 9869 -9459 -3655 4768 -6810 -8343
1096 -8343 3326 1790 -8076 5212 9972 -6865 4809 12462 -8803 -696 8427 -10197 -6470
1109 -6470 3707 -6826 -7903 3465 2882 -5123 5141 11724 -3739 3627 13158 -6137 -2552 8960
1123H960j7859O19J2449j0281l020J1955n32q193Q541P379j4040L709J2800j7462
1137d975q72J5580j4547l864J5548p563o806J2153M74r669N862P835j3153l7J2790
1152H756j4156l733J6191j0445n973J5849m645q560J2221J376j0612N163P311
1165H743j2363j204J2337j1808n643J5700p340q790J6794k509j0076J1612L723
1178I176j2362M430P436j2026l069J1822r447p750J5118m237j0065J4855J541
1191E422j1346R860O075j1957K521R079j1190l990J1224o943q911J2792j486j0593
1205i443J1652M407j2562O618P967j2201N44J0146r491n355J2544m698r565J3127
1219C690R41j1612R746O733j3176L428R536j1873l227J1613q314p602J3681l543
$$ plain form
1123 8960 -8899 -8280 4169 -6112 -9132 2823 2291 -5902 2639 10018 -4022 -313 12487 -4975
1137 -4975 -5847 9733 -4814 -8678 6870 -693 -7499 4654 5128 -4541 1321 9156 -3997 -4034 8756
1152 8756 -5400 -9133 7058 -3387 -9360 6489 1844 -6716 5505 6881 -3731 1432 8743
1165 8743 -3620 -4824 7513 -4295 -9938 5762 -1578 -10368 6426 3917 -6159 5453 9176
1178 9176 -3186 1244 8680 -3346 -6415 5407 -4040 -11790 3328 -909 -10974 3881 5422
1191 5422 -5924 3936 10011 -1946 575 9654 -1536 -5526 5698 -1245 -10156 2636 1150 -9443
1205 -9443 2209 6616 -5946 672 8639 -3562 -3018 7128 -2363 -7718 4826 128 -9437 3690
1219 3690 4631 -6981 2765 9498 -3678 -250 9286 -2587 -5814 5799 -2515 -10117 3564 21
1233B1r644J2320L263j0710P380P275j2193M50J0225j0579n945J2014o323q937
1247a1383J3578n66j0320J2050M307j0439N864P723j0823k101R665q627q062J1990
1261B856m497j0727J3547J132j1569J1352N451j1232N021Q144j0061k915R375
1274E877n171r549J1680m58j2554J2660L927j3147R501O126j2411K737P650q853
1288a985m710Q763k647r141J0214L233j2289J0361P298j3716P792P079j3194J621
1302a321O869q108m331P500j213q751R083N993j2017P767R673j4505M970R507
1316A1116j4440k29Q367p928n437P800L89q125P074P993j0921L753J2192j2726
1330a122O49J0975j2373k365R084o594m673O364J099n917L352P977r314M78J1744
$$ plain form
1233 21 -9623 2697 5960 -4750 2630 9905 -2288 -1838 8387 -2192 -8137 3877 -2446 -11383
1247 -11383 2195 1629 -8691 3359 7666 -2773 3091 10814 -9 -2110 7555 -1072 -9134 2856
1261 2856 -1641 -12368 1179 2311 -9258 2094 7545 -3687 1334 9478 -583 -3498 5877
1274 5877 706 -8843 2837 2379 -10175 2485 6412 -6735 2766 8892 -3519 -782 6868 -1985
1288 -1985 -6695 2068 -579 -9720 494 3727 -8562 1799 9097 -4619 3173 10252 -2942 -1321
1302 -1321 5548 -2560 -6891 609 -604 -9355 -272 5721 -6296 1471 11144 -3361 1609 11116
1316 11116 -3324 -3553 4814 -3114 -8551 -751 -362 -8487 -1413 6580 -4341 -588 11604 -1122
1330 -1122 -473 10502 -1871 -4236 4848 -1746 -6419 -55 1044 -4873 -1521 6456 -2858 -2380 9364
1345I364j1496k385J2398j1351l783J1265n734m116P567J323n470K763Q247q059
1359E33l291J1904r327p515J3662q098p806J2004k719n953P068L345n133Q92Q189
1374G755n376o386J1052o166r821J3460m888j0181J2278r12p434Q297L355o483
1388a450J969O979m918o559J0209l953j1957J3380k087j2736J2418J457j0560
1401g808Q879M249p575J196P055m256o733R275j181j1638J1069K068j2971J0435
1415B064L694j1162P312M443q384O86N151l335o042O605P91j1088R062M761j2133
1430g575Q024O721j1534O112O129q621k47N255l555n807N353J816j0167O075P413
1445E392j1775N199R601j1449K468Q882q250k757O051k656o613M412L619r668
$$ plain form
1345 9364 -2132 -4517 7881 -3470 -7253 4012 -1722 -5838 1729 3052 -2418 345 8592 533
1359 533 -2758 9146 -181 -7696 5966 -2132 -9938 2066 -653 -6606 462 3807 -1326 -434 7755
1374 7755 2379 -4007 7045 879 -8942 4518 -370 -10551 1727 815 -6619 1678 5033 -1450
1388 -1450 519 7498 2580 -3979 6230 2277 -9680 3700 1613 -11123 1295 2752 -7808
1401 -7808 1071 5320 -2255 -1059 5996 1740 -4993 4282 3101 -8537 2532 4600 -8371 2064
1415 2064 5758 -5404 1908 6351 -2033 -1347 3804 469 -5573 1032 1823 -9265 -203 4558 -7575
1430 -7575 449 7170 -4364 1748 7877 -744 -991 4264 709 -5098 255 2071 -8096 -2021 5392
1445 5392 -6383 -1184 8417 -3032 -564 8318 68 -2689 3362 706 -5907 -1495 2124 -7544
1459g544L191J0086j0259J464J1533r667o38J1037p934m906P684k359p216M722
1473h06M154r346K407R892r446m31J1745r151l673J1644o840o237Q718j728p684
1488f782N982M856q265K693R399p931k292J1424p894n585J0090n767p572Q464
1502H20r27p257N733N296o764J941Q411o423k504R440n664o768Q462l067q246
1517g517O879Q64o618M580O028n905M85Q251m660m049P879l500q130P160m71q022
1533f746M640M173p192K392P457n392j691Q580l595o263P560p15q855N115L310
1548B778q027K917P379p233j6R038n104m444Q137l053q106P282j22r379N181N130
1564B358p935K853Q103n566j695J0108n300o008R128k989r514P948p2r433O081
$$ plain form
1459 -7544 -4353 5733 -4526 -3062 8471 -1196 -1834 9203 1269 -3637 4047 1688 -5528 -806
1473 -806 3348 -5998 -3591 6301 -3145 -3576 8169 -982 -4655 6989 149 -6088 2630 902 -6782
1488 -6782 -800 4056 -4209 -1516 7883 -48 -2340 9084 1190 -4395 5695 -72 -7644 820
1502 820 -107 -7364 -1631 3665 -3099 -1158 7253 830 -1674 7766 2102 -4666 3796 729 -7517
1517 -7517 -638 226 -6392 -1812 4216 -1689 -1204 7047 2387 -1662 6217 2717 -5413 1747 1276 -6746
1533 -6746 -2106 2067 -5125 -2733 4724 -668 -2359 6221 2626 -3637 3923 3208 -5647 -532 2778
1548 2778 -5249 -2332 5047 -2186 -2202 6836 1732 -2712 5425 2372 -5734 1548 1426 -7953 -2772 2358
1564 2358 -5577 -2724 5379 -187 -1882 8226 2926 -3082 6046 3057 -6457 1491 1419 -8014 -1933
1579a933M546p465K377Q691n841k958J0095m222p438R072k087r732P070J445q925
1594g305N565M766o420J239P627l927l645P268j843p685P610l95r286O681K246
1609B496p520L562M972m983J05N559k528m984N966L87r252O038K976r374N155
1624a425N142p763L182O380m570j724N572j167o584M628J910r950L725N836r826
1639f634K798P808p836J604P815m759k283N980q82o421K931L809q962J707P511
1654D186r390J373R479q437K90Q697n341k968O523j784n834L359L840q672J143
1669c536Q124q868k42J0730q282j637R718n599l401O514j541n311K955L165o120
1684c331N0Q092o455j818J0041o318l407R181n106m464N343j216m484J395L410
$$ plain form
1579 -1933 2613 -4852 -2475 6216 375 -2583 7512 3290 -4148 4924 2837 -6895 175 1620 -7305
1594 -7305 -1740 3026 -3394 -2155 5472 1545 -2100 5168 3325 -4360 3250 2855 -6431 250 2496
1609 2496 -5024 -1462 3510 -1473 -1368 4191 1663 -3321 2645 3032 -6220 -182 2794 -6580 -1425
1624 -1425 3717 -4046 -864 5516 946 -778 4794 3627 -2957 1671 3581 -6369 -2644 3192 -6634
1639 -6634 -3836 3972 -3864 -2260 5555 796 -1487 4493 3611 -2810 121 3930 -5032 -3325 4186
1654 4186 -5204 -3831 5648 -2789 -2499 6198 857 -2111 4412 2628 -3206 153 3993 -4679 -3536
1669 -3536 4588 -4280 -4522 6208 -2074 -3711 6007 408 -2993 3521 1980 -3331 -376 2789 -3331
1684 -3331 -3281 4811 -1644 -3462 6579 261 -3146 6035 929 -3535 1808 592 -3892 -2497 913
1699I13m082j134P709l512l759R818l320n474Q516l112n687M966n84m897J089
1714b550L234k769k329O800j049n706R019o12p828P830k08p851M529J138n574
1729c926J052M081k491k949O612K66o655P831J423r297P136J616r519M554K755
1744B489o405J313M598k481k565N955K53p102O235K278r918N634L548j0096M159
1759b105M899o742J518N942k695k221N696Q61p326M287K864r597L121M324q934
1774f108K504N975o232J140N960k367j693M392Q03n814K416L372q037J099N423
1789B833p508Q03O684m884j61N851j984k435L824R54n780J195M266p233k07O533
$$ plain form
1699 913 -3169 -4303 3406 -106 -3865 5953 2633 -2841 5675 2563 -3124 1842 1258 -3639 -2550
1714 -2550 684 -2085 -4414 2386 1337 -4369 4650 4038 -3790 4040 3832 -4019 510 1648 -3926
1729 -3926 -2874 1207 -1284 -4233 2379 2645 -4010 3821 5244 -4053 3083 4699 -4820 -266 2489
1744 2489 -3916 -2603 1995 -486 -3051 2904 3157 -3945 2290 4568 -5350 284 3832 -6264 -2105
1759 -2105 2794 -3948 -2430 3512 817 -1404 4292 5153 -2173 2114 4978 -4619 -1498 2826 -6108
1774 -6108 -3604 2371 -3861 -2721 3239 872 -821 3571 4374 -1440 976 4348 -3689 -2590 2833
1789 2833 -4675 -3872 2812 -2072 -2233 3618 1634 -801 3023 3977 -1803 -608 3658 -3575 -3782 2751
$$ [...]
8191b17
##END NTUPLES=NMR FID
##END=
