##TITLE=1H_Ser Am-2-i-2
 CDCl3
 8 sc, 
 9.10.2024
##JCAMPDX= 6.0         $$ Bruker NMR JCAMP-DX V2.0
##DATA TYPE= NMR FID
##DATA CLASS= NTUPLES
##ORIGIN= UXNMR, Bruker Analytische Messtechnik GmbH
##OWNER= root
$$ XWIN-NMR		Version 3.5
$$ Wed Oct  9 15:38:05 2024 Russian Standard Time (UT+4h)  she@DPX200
##.OBSERVE FREQUENCY= 200.1318
##.OBSERVE NUCLEUS= ^1H
##.DELAY= (6, 6)
##.ACQUISITION MODE= SIMULTANEOUS
##.ACQUISITION SCHEME= undefined
##.AVERAGES= 8
##.DIGITISER RES= 18
##SPECTROMETER/DATA SYSTEM= spect
##.PULSE SEQUENCE= zg30
##.SOLVENT NAME= CDCl3
##.SHIFT REFERENCE= (INTERNAL, CDCl3, 0, 15.7039)
##AUDIT TRAIL= $$ (NUMBER, WHEN, WHO, WHERE, WHAT)
$$ ##TITLE= Audit trail, XWIN-NMR		Version 3.5
$$ ##JCAMPDX= 5.01
$$ ##ORIGIN= Bruker BioSpin GmbH
$$ ##OWNER= she
$$ F:/spectra/data/she/nmr/H-F/1/audita.txt
$$ ##AUDIT TRAIL=  $$ (NUMBER, WHEN, WHO, WHERE, WHAT)
(   1,<2024-10-09 15:35:44.04 +0400>,<she>,<DPX200>,
      <created by zg, POWCHK disabled, PULCHK disabled
       configuration hash MD5:
       00 E9 B6 7A A2 85 ED C7 34 08 36 98 17 FE 4E 26
       data hash MD5: 16K
       EB 50 30 66 7B 79 52 84 2D B8 BC E8 42 D7 F0 31>)
$$ ##END=
$$ 
$$ hash MD5
$$ B1 26 58 D1 31 11 89 D0 60 EF 5D 02 F7 D3 D0 29
##$RELAX= 
##$RELAX= 
##$RELAX= 
##$RELAX= 
##$RELAX= 
##$RELAX= 
$$ Bruker specific parameters
$$ --------------------------
##$DU= <F:/spectra>
##$EXPNO= 1
##$NAME= <H-F>
##$PROCNO= 1
##$TYPE= <nmr>
##$USER= <she>
##$AMP= (0..31)
100 100 100 100 100 100 100 100 100 100 100 100 100 100 100 100 100 100 
100 100 100 100 100 100 100 100 100 100 100 100 100 100 
##$AQSEQ= 0
##$AQ_mod= 1
##$AUNM= <au_zg>
##$AUTOPOS= <>
##$BF1= 200.13
##$BF2= 200.13
##$BF3= 200.13
##$BF4= 200.13
##$BF5= 200.13
##$BF6= 200.13
##$BF7= 200.13
##$BF8= 200.13
##$BYTORDA= 1
##$CFDGTYP= 0
##$CFRGTYP= 5
##$CHEMSTR= <none>
##$CNST= (0..31)
1 1 145 1 1 1 1 1 1 1 1 1 1 1 1 1 1 1 1 1 1 1 1 1 1 1 1 1 1 1 1 1 
##$CPDPRG= <>
##$CPDPRG1= <>
##$CPDPRG2= <>
##$CPDPRG3= <>
##$CPDPRG4= <mlev>
##$CPDPRG5= <mlev>
##$CPDPRG6= <mlev>
##$CPDPRG7= <mlev>
##$CPDPRG8= <mlev>
##$CPDPRGB= <>
##$CPDPRGT= <>
##$D= (0..31)
0 1.2 0 0 0 0 0 0 0 0.06 0 0.03 0 0 0 0 0.0002 0 0 0 0 0 0 0 0 0 0 0 0 
0 0 0 
##$DATE= 1728473743
##$DBL= (0..7)
120 120 120 120 120 120 120 120 
##$DBP= (0..7)
150 150 150 150 150 150 150 150 
##$DBP07= 0
##$DBPNAM0= <>
##$DBPNAM1= <>
##$DBPNAM2= <>
##$DBPNAM3= <>
##$DBPNAM4= <>
##$DBPNAM5= <>
##$DBPNAM6= <>
##$DBPNAM7= <>
##$DBPOAL= (0..7)
0.5 0.5 0.5 0.5 0.5 0.5 0.5 0.5 
##$DBPOFFS= (0..7)
0 0 0 0 0 0 0 0 
##$DE= 6
##$DECBNUC= <off>
##$DECIM= 24
##$DECNUC= <off>
##$DECSTAT= 4
##$DIGMOD= 1
##$DIGTYP= 9
##$DL= (0..7)
0 120 120 120 120 120 120 120 
##$DP= (0..7)
150 150 150 150 150 150 150 150 
##$DP07= 0
##$DPNAME0= <>
##$DPNAME1= <>
##$DPNAME2= <>
##$DPNAME3= <>
##$DPNAME4= <>
##$DPNAME5= <>
##$DPNAME6= <>
##$DPNAME7= <>
##$DPOAL= (0..7)
0.5 0.5 0.5 0.5 0.5 0.5 0.5 0.5 
##$DPOFFS= (0..7)
0 0 0 0 0 0 0 0 
##$DQDMODE= 0
##$DR= 18
##$DS= 0
##$DSLIST= <SSSSSSSSSSSSSSS>
$$ [...]
##$SUBNAM2= <"">
##$SUBNAM3= <"">
##$SUBNAM4= <"">
##$SUBNAM5= <"">
##$SUBNAM6= <"">
##$SUBNAM7= <"">
##$SUBNAM8= <"">
##$SUBNAM9= <"">
##$SW= 24.0689170037331
##$SWIBOX= (0..15)
0 0 2 0 0 0 0 0 0 0 0 0 0 0 0 0 
##$SW_h= 4816.95568400771
##$TD= 16384
##$TD0= 1
##$TE= 0
##$TE2= 300
##$TE3= 300
##$TEG= 300
##$TL= (0..7)
0 120 120 120 120 120 120 120 
##$TP= (0..7)
150 150 150 150 150 150 150 150 
##$TP07= 0
##$TPNAME0= <>
##$TPNAME1= <>
##$TPNAME2= <>
##$TPNAME3= <>
##$TPNAME4= <>
##$TPNAME5= <>
##$TPNAME6= <>
##$TPNAME7= <>
##$TPOAL= (0..7)
0.5 0.5 0.5 0.5 0.5 0.5 0.5 0.5 
##$TPOFFS= (0..7)
0 0 0 0 0 0 0 0 
##$TUNHIN= 0
##$TUNHOUT= 0
##$TUNXOUT= 0
##$USERA1= <user>
##$USERA2= <user>
##$USERA3= <user>
##$USERA4= <user>
##$USERA5= <user>
##$V9= 5
##$VALIST= <valist>
##$VCLIST= <CCCCCCCCCCCCCCC>
##$VD= 0
##$VDLIST= <DDDDDDDDDDDDDDD>
##$VPLIST= <PPPPPPPPPPPPPPP>
##$VTLIST= <TTTTTTTTTTTTTTT>
##$WBST= 1024
##$WBSW= 4
##$XGAIN= (0..3)
0 0 0 0 
##$XL= 0
##$YL= 0
##$YMAX_a= 276812
##$YMIN_a= -247388
##$ZGOPTNS= <>
##$ZL1= 120
##$ZL2= 120
##$ZL3= 120
##$ZL4= 120
##$ABSF1= 10
##$ABSF2= 0
##$ABSG= 5
##$ABSL= 3
##$ALPHA= 0
##$AQORDER= 0
##$ASSFAC= 0
##$ASSFACI= 0
##$ASSFACX= 0
##$ASSWID= 0
##$AUNMP= <proc_1d>
##$AZFE= 0.1
##$AZFW= 0.1
##$BCFW= 1
##$BC_mod= 2
##$BYTORDP= 1
##$COROFFS= 0
##$CY= 11.3945322036743
##$DATMOD= 1
##$DC= 2
##$DFILT= <>
##$DTYPP= 0
##$F1P= 15.6554695791079
##$F2P= 12.8336369535428
##$FCOR= 0.5
##$FTSIZE= 0
##$FT_mod= 4
##$GAMMA= 1
##$GB= 0.15
##$INTBC= 1
##$INTSCL= 1
##$ISEN= 128
##$LB= 0.24
##$LEV0= 0
##$LPBIN= 0
##$MAXI= 10000
##$MC2= 0
##$MEAN= 0
##$ME_mod= 0
##$MI= 1.114404
##$NCOEF= 0
##$NC_proc= 0
##$NLEV= 6
##$NOISF1= 3.799351
##$NOISF2= 2.8
##$NSP= 1
##$NTH_PI= 0
##$NZP= 0
##$OFFSET= 15.70392
##$PC= 1
##$PHC0= -26342.09
##$PHC1= 12.38743
##$PH_mod= 1
##$PKNL= yes
##$PPARMOD= 0
##$PSCAL= 0
##$PSIGN= 0
##$REVERSE= no
##$SF= 200.130013532006
##$SI= 16384
##$SIGF1= 3
##$SIGF2= 2
##$SINO= 400
##$SIOLD= 16384
##$SREGLST= <1H.CDCl3>
##$SSB= 0
##$STSI= 0
##$STSR= 0
##$SW_p= 3612.71676300578
##$SYMM= 0
##$S_DEV= 0
##$TDeff= 0
##$TDoff= 0
##$TI= <>
##$TILT= no
##$TM1= 0
##$TM2= 0
##$TOPLEV= 0
##$USERP1= <user>
##$USERP2= <user>
##$USERP3= <user>
##$USERP4= <user>
##$USERP5= <user>
##$WDW= 1
##$XDIM= 8192
##$YMAX_p= 0
##$YMIN_p= 0
$$ End of Bruker specific parameters
$$ ---------------------------------
##NTUPLES= NMR FID
##VAR_NAME=  TIME,          FID/REAL,        FID/IMAG
##SYMBOL=    X,             R,               I
##VAR_TYPE=  INDEPENDENT,   DEPENDENT,       DEPENDENT
##VAR_FORM=  AFFN,          ASDF,            ASDF
##VAR_DIM=   8192,          8192,            8192
##UNITS=     SECONDS,       ARBITRARY UNITS, ARBITRARY UNITS
##FACTOR=    0.0002076,     1,               1
##FIRST=     0,             0,               0
##LAST=      1.7004516,     0,               0
##MIN=       0,             -247388,         0
##MAX=       1.7004516,     276812,          0
$$ Real data points
##PAGE= N=1
##DATA TABLE= (X++(R..R)), XYDATA
$$ plain form
0 0 0 0 0 0 0 8 -8 8 -8 10 -16 19 -24 32 -37 47 -56 64 -76 88 -106 125 -144 166 -191 221 -253 289 -327
29 -327 370 -418 471 -529 591 -662 739 -821 916 -1017 1125 -1246 1382 -1530 1693 -1875
45 -1875 2075 -2304 2561 -2855 3190 -3586 4050 -4610 5301 -6177 7326 -8913 11257 -15106
59 -15106 22832 -70005 245105 96370 -243148 158719 152286 -88774 57788 150935 -77490
70 -77490 -39112 92734 -94648 -121382 121448 -73499 -160835 161029 44502 -151562 125712
81 125712 126448 -79451 14117 71451 -42657 -35976 11786 -68811 -61867 72695 -32782 -92386
93 -92386 112732 37460 -91790 98939 60089 -93189 32350 45767 -75641 -27830 25166
104 25166 -42191 -32968 66205 5390 -44597 103786 51952 -77708 66365 52937 -98183
$$ packed form
0@%%%%%Qj6J6j6J8k6L5m3N6o9Q4j03J20j40J64j94K31k69L10l57M12m74N42o16
29c27O97p88Q89j000J120j253J401j560J737j933K142k371K628k912L223l568
45a875L950m379M865n416O045o776P636q660R911j1478J3503j6239K0170k6363
59a5106L7938r2837L15110j48735l39518M01867o433k41060J46562R3147k28425
70g7490L8378J31846j87382k6734K42830j94947q7336L21864j16527j96064K77274
81A25712P36k05899R3568N7334j14108O681M7762q0597O944J34562j05477n9604
93i2386K05118p5272j29250J90729l8850j53278J25539J3417j21408M7811N2996
104B5166o7357R223R9173o0815m9987J48383n1834j29660J44073j3428j51120
$$ plain form
115 -98183 -3715 21052 -83229 -31176 16509 -46688 -32503 59779 19490 -42983 76091 65414
127 65414 -65695 46788 69149 -92939 -11825 57876 -67565 -40371 46543 -18458 -41738
138 -41738 47784 30470 -49074 37157 55599 -72294 8470 71894 -76103 -34233 59866 -44073
150 -44073 -36308 50720 -8950 -37149 38969 30771 -36030 11634 38856 -44281 2072 51683
162 51683 -55500 -14017 68667 -38786 -31027 65733 -5407 -39333 39969 16815 -45903 8590
174 8590 31654 -53168 -22913 42425 -40414 -28355 52557 -29986 -29873 71027 2691 -42239
186 -42239 49516 35332 -34741 12769 39284 -33951 -21391 40065 -28666 -46969 36449 -12308
198 -12308 -47813 37360 7355 -42671 32905 33230 -32002 6823 41952 -18309 -25392 30614 -7604
$$ packed form
115i8183R4468K4767j04281N2053M7685o3197J4185R2282m0289o2473J19074j0677
127F5414j31109J12483K2361j62088Q1114O9701j25441K7194Q6914o5001k3280
138d1738Q9522j7314p9544Q6231J8442j27893Q0764O3424j47997M1870R4099j03939
150d4073P765Q7028n9670k8199P6118q198o6801M7664K7222q3137M6353M9611
162E1683j07183M1483Q2684j07453P759R6760p1140l3926P9302k3154o2718N4493
174H590K3064q4822L0255O5338q2839J2059Q0912q2543J13J00900o8336m4930
186d2239R1755j4184p0073M7510K6515p3235J2560O1456o8731j8303Q3418m8757
198a2308l5505Q5173l0005n0026P5576L25o5232L8825L5129o0261p083N6006l8218
$$ plain form
211 -7604 -41354 23056 1346 -44549 28272 25201 -36541 19486 38289 -21606 3443 34090
223 34090 -16937 -24488 21053 -3650 -38359 9203 8882 -34570 14715 25588 -30907 12011 33469
236 33469 -28064 -5434 28564 -19899 -22836 18905 -592 -22975 19698 24206 -19995 16994
248 16994 40172 -19903 490 30637 -32119 -22450 16955 -30507 -34446 10633 -4246 -21103
260 -21103 16899 28154 -6947 14850 42148 -10067 -5092 32717 -24865 -29598 18761 -22440
272 -22440 -32392 15850 1449 -16659 18272 29101 -5303 2608 34732 -8495 -23547 21960
284 21960 -17913 -38914 17128 -9695 -32105 20112 13564 -12350 15438 27206 -3655 -7640
296 -7640 23355 -6800 -33619 15980 -3000 -37420 19685 12405 -20026 25496 22333 -9566 12556
$$ packed form
211g604l3750O4410k1710m5895P2821l071o1742N6027J8803n9895K5049L0647
223C4090n1027p551M5541k4703l4709M7562l21m3452M9285J0873n6495M2918K1458
236C3469o1533K2630L3998m8463k937M1741j9497k2383M2673M508m4201L6989
248A6994K3178o0075K0393L0147o2756R669L9405m7462l939M5079j4879j6857
260b1103L8002J1255l5101K1797K7298n2215M975L7809n7582m733M8359m1201
272b2440r952M8242j4401j8108L4931J0829l4404P911L2124m3227j5052M5507
284B1960l9873k1001N6042k6823k2410N2217o548k5914K7788J1768l0861l985
296g640L0995l0155k6819M9599j8980l4420N7105p280l2431M5522l163l1899K2122
$$ plain form
309 12556 18358 -12226 -20569 3878 -11766 -39644 3594 1914 -33793 21058 26419 -15276 28904
322 28904 33294 -8132 12993 18591 -15088 -19295 2567 -11053 -38035 3451 13720 -31759 13482
335 13482 34573 -18448 15953 33077 -18325 -2267 15456 -16942 -21876 1526 -2017 -25389
347 -25389 5478 24486 -20842 9502 40219 -18406 845 31222 -21362 -13449 13687 -16470
359 -16470 -19028 6720 5711 -15234 6670 29469 -12422 242 34338 -20933 -14377 24783 -28048
372 -28048 -25305 15701 -14638 -18983 14313 12209 -6269 12534 33325 -5941 -3085 35396 -15868
385 -15868 -24243 24386 -22217 -31821 16837 -11499 -22636 14945 9968 -9883 7218 25971 -5432
398 -5432 -9731 28015 -10482 -24293 26925 -10149 -29020 24493 -28 -20739 18764 10146 -13315
$$ packed form
309A2556N802l0584q343K4447j5644k7878M3238j680l5707N4851N361m1695M4180
322B8904M390m1426K1125N598l3679m207K1862j3620k6982M1486J0269m5479M5241
335A3482K1091n3021L4401J7124n1402J6058J7723l2398m934K3402l543k3372
347b5389L0867J9008m5328L0344L0717n8625J9251L0377n2584P913K7136l0157
359a6470k558K5748j009k0945K1904K2799m1891J2664L4096n5271O556L9160n2831
372b8048K743M1006l0339m345L3296k104j8478J8803K0791l9266K856L8481n1264
385a5868q375M8629m6603r604M8658k8336j1137L7581m977j9851J7101J8753l1403
398e432m299L7746l8497j3811N1218l7074j8871N3513k4521k0711L9503q618k3461
$$ plain form
411 -13315 5264 18317 -10286 -13791 21895 -7530 -27534 25046 -638 -29055 25303 7303
423 7303 -24194 18249 13263 -18895 834 14764 -11678 -16160 17106 -2767 -26181 22251 9526
436 9526 -28151 22610 17730 -23650 14864 18532 -18284 -333 14484 -11628 -17025 11843 -1998
449 -1998 -27626 11361 9429 -28882 13318 18790 -24295 12044 25118 -15467 2717 22413 -6905
462 -6905 -11497 14626 487 -25197 7788 9978 -30878 4210 20232 -25786 2898 26534 -15715
475 -15715 -2492 24599 -6433 -12768 14698 1972 -23099 4881 12714 -24656 1195 23306
487 23306 -19539 -613 29632 -12497 -7845 23464 -6631 -16291 12583 749 -21158 4532
499 4532 13116 -18246 1176 24427 -13925 -5224 26601 -12257 -15524 19041 -10201 -23504 11128
$$ packed form
411a3315J8579J3053k8603l505L5686k9425k0004N2580k5684k8417N4358j8000
423G303l1497M2443m986l2158J9729J3930k6442m482L3266j9873k3414M8432j2725
436I526l7677N0761m880m1380L8514L668l6816J7951J4817k6112n397K8868j3841
449a998k5628L8987j932l8311M2200N472m3085L6339J3074m0585J8184J9696k9318
462f905m592K6123j4139k5684L2985K190m0856L5088J6022m6018K8684K3636m2249
475a5715J3223K7091l1032o335K7466j2726k5071K7980P833l7370K5851K2111
487B3306m2845J8926L0245m2129M652L1309l0095r660K8874j1834k1907K5690
499D532Q584l1362J9422K3251l8352Q701L1825l8858l267L4565k9242j3303L4632
$$ plain form
512 11128 1690 -20212 7954 18576 -9506 5934 29709 -5479 -5982 26075 -9177 -23439 13412
525 13412 -10197 -30756 5309 1601 -21009 6988 18855 -7014 5223 27605 -1763 -8687
537 -8687 20892 -5296 -24371 11370 -3347 -28189 8434 9184 -17199 8819 21095 -6566 1717
550 1717 20994 -5439 -14034 12635 -6220 -26412 8143 2881 -23996 10037 17036 -13345 9867
563 9867 22978 -9291 -2669 16267 -8982 -18344 7112 -4140 -23233 8293 12684 -16505 11941
576 11941 26190 -8888 5862 23024 -11320 -10320 8748 -13844 -22028 855 -4686 -20355 5654
589 5654 15629 -9925 9786 27439 -6093 3306 23469 -11161 -12218 10816 -11518 -19233 4090
602 4090 -671 -14991 6244 16614 -8665 3318 23598 -10067 -8279 19098 -12769 -18604 11426
$$ packed form
512A1128r438k1902K8166J0622k8082J5440K3775l5188n03L2057l5252j4262L6851
525A3412k3609k0559L6065l708k2610K7997J1867k5869J2237K2382k9368o924
537h687K9579k6188j9075L5741j4717k4842L6623P50k6383K6018J2276k7661Q283
550A717J9277k6433q595K6669j8855k0192L4555n262k6877L4033O999l0381K3212
563I867J3111l2269O622J8936k5249r362K5456j1252j9093L1526M391k9189K8446
576A1941J4249l5078J4750J7162l4344J000J9068k2592q184K2883n541j5669K6009
589E654R975k5554J9711J7653l3532R399K0163l4630j057K3034k2334p715K3323
602D090m761j4320K1235J0370k5279J1983K0280l3665J788K7377l1867n835L0030
$$ plain form
615 11426 -7260 -17033 10062 7011 -9192 6628 18671 -3941 -2592 18292 -8588 -14689 14612
628 14612 -9834 -20029 11868 -1753 -12462 13214 8791 -4649 7752 13232 -4233 -5652 9959
641 9959 -10304 -18470 9916 -8440 -20428 14090 1681 -12678 17212 12973 -5071 8002 14222
654 14222 -2742 -6582 9271 -4602 -18978 7762 -803 -21013 9443 6022 -15107 9478 10130
667 10130 -8344 2315 8493 -3080 -6845 6264 1851 -13741 6381 7634 -14073 8496 10388
680 10388 -14063 6443 11094 -10518 -1440 6509 -4945 -7585 4720 3279 -12777 3675 11735
693 11735 -13529 3684 14523 -14681 464 13600 -10963 -4846 8051 -4491 -7958 5043
705 5043 5500 -11032 1317 14312 -9809 651 17814 -10991 -1803 17132 -8634 -5548 9593
$$ packed form
615A1426j8686r773K7095l051j6203J5820J2043k2612J349K0884k6880o101K9301
628A4612k4446j0195L1897j3621j0709K5676m423j3440J2401N480j7465j419J5611
641I959k0263q166K8386j8356j1988L4518j2409j4359K9890m239j8044J3073O220
654A4222j6964l840J5853j3873j4376K6740q565k0210L0456l421k1129K4585O52
667A0130j8474J0659O178j1573l765J3109m413j5592K0122J253k1707K2569J892
680A0388k4451K0506M651k1612R078P949j1454k640J2305j441j6056J6452Q060
693A1735k5264J7213J0839k9204J5145J3136k4563O117J2897j2542l467J3001
705E043M57j6532J2349J2995k4121J0460J7163k8805R188J8935k5766L086J5141
$$ plain form
718 9593 -6204 -9888 3334 667 -12849 -2292 9924 -10725 -2380 18397 -8062 -3043 21282
731 21282 -4292 -5201 15296 -3302 -9812 5657 1410 -12076 -3306 8526 -9171 -6082 15968
744 15968 -5239 -7354 17958 -3106 -9133 12789 -3062 -11866 4594 1440 -9321 -1429 8530
757 8530 -4045 -4455 15756 -46 -9330 13757 -537 -12335 8984 -2406 -13441 4329 3593
770 3593 -7312 711 9811 361 -3436 12964 1838 -12928 7992 -797 -17970 3122 -698
783 -698 -15186 3521 7447 -4113 4709 14480 3577 -1392 13780 4288 -13298 4315 745 -20204
797 -20204 -248 2745 -16078 1058 9883 -5152 2947 13853 1259 -3840 9459 2822 -13775
810 -13775 2032 3333 -17008 788 9459 -10741 2188 14195 -2663 1805 12076 -1767 -7492
$$ packed form
718I593j5797l684J3222k667j3516J0557J2216k0649Q345K0777k6459N019K4325
731B1282k5574r09K0497j8598o510J5469m247j3486Q770J1832j7697L089K2050
744A5968k1207k115K5312k1064o027K1922j5851q804J6460l154j0761P892R959
757H530j2575m10K0211j5802r284K3087j4294j1798K1319j1390j1035J7770p36
770C593j0905Q023R100r450l797J6400j1126j4766K0920q789j7173K1092l820
783f98j4488J8707L926j1560Q822R771j0903m969J5172r492j7586J7613l570k0949
797b0204J9956K993j8823J7136Q825j5035Q099J0906j2594n099J3299o637j6597
810a3775J5807J301k0341J7796Q671k0200J2929J2007j6858M468J0271j3843n725
$$ plain form
823 -7492 4412 -795 -14335 -1276 3328 -12581 1684 12722 -6443 2769 15587 -2869 -2407
836 -2407 9589 -4767 -11165 1062 -2539 -12864 -1117 6395 -6683 2462 16434 309 1189
849 1189 15352 -534 -5885 6430 -5056 -14610 -1825 -2149 -12147 -2423 6696 -4044 809 15055
863 15055 1599 -2554 13089 721 -9155 6101 -1042 -13003 1517 2891 -8857 1382 10080
876 10080 -2761 -1178 12679 -64 -8195 8283 -1034 -14854 4043 1675 -14138 2990 8250
889 8250 -6768 3194 12839 -1618 -2459 11112 -577 -10846 5467 85 -15656 2703 5586
902 5586 -12142 3681 11244 -5511 3554 12577 -3134 -2937 7832 -2964 -11089 2043 -1111 -14401
916 -14401 1322 6134 -11220 2725 12249 -5722 2409 12714 -2958 -2537 7982 -1406 -8047
$$ packed form
823g492J1904n207j3540J3059M604j5909J4265J1038j9165R212J2818j8456M62
836b407J1996j4356o398J2227l601j0325J1747P512j3078R145J3972j6125Q80
849A189J4163j5886n351J2315j1486r554J2785l24r998R724R119j0740M853J4246
863A5055j3456m153J5643j2368r876J5256p143j1961J4520J374j1748J0239Q698
876A0080j2841J583J3857j2743q131J6478r317j3820J8897k368j5813J7128N260
889H250j5018R962R645j4457q41J3571j1689j0269J6313n382j5741J8359K883
902E586j7728J5823P563j6755R065R023j5711J97J0769j0796q125J3132l154j3290
916a4401J5723M812j7354J3945R524j7971Q131J0305j5672M21J0519r388o641
$$ plain form
929 -8047 3298 2296 -10746 307 7900 -9306 -1016 10742 -7357 -3056 10306 -4844 -5838
942 -5838 6569 -908 -6529 3306 4550 -6302 369 9817 -5209 -2894 11653 -4951 -5674 9943
956 9943 -3689 -7298 6103 -894 -6521 2822 3913 -5500 -1000 8934 -3563 -4767 10943 -3192
970 -3192 -8018 10093 -2049 -9465 6889 -149 -8234 2601 3861 -5147 -1540 8769 -1190 -4676
984 -4676 11576 1099 -8107 10128 1013 -10393 5751 -228 -10544 655 1560 -6890 -2773 6122
998 6122 -499 -4627 9818 3710 -7318 9856 3933 -10250 5833 2433 -10267 1691 2843
1011 2843 -5927 -1081 5582 -105 -4342 7422 3573 -9162 5438 3988 -12041 2532 3674 -10541
1025 -10541 1108 5848 -3904 451 7071 2301 -3194 5053 4165 -9349 1237 4391 -11851 -535
$$ packed form
929h047J1345j002j3042J1053P593j7206Q290J1758j8099M301J3362j5150r94
942e838J2407p477n621R835J244j0852O671R448j5026K315J4547j6604p23J5617
956I943j3632l609J3401o997n627R343J091r413M500R934j2497j204J5710j4135
970c192m826J8111j2142p416J6354p038q085J0835J260r008L607J0309r959l486
984d676J6252j0477r206J8235r115j1406J6144n979j0316J1199R05q450M117Q895
998F122o621m128J4445o108j1028J7174n923j4183J6083l400j2700J1958J152
1011B843q770M846O663n687m237J1764l849j2735J4600j450j6029J4573J142j4215
1025a0541J1649M740r752M355O620m770n495Q247q88j3514J0586L154j6242J1316
$$ plain form
1039 -535 6043 -8489 1474 8543 -1752 1577 7741 1751 -3635 2562 2264 -10669 -3295 3232 -12091
1054 -12091 -2502 7673 -6986 1338 12034 -619 1376 9507 1944 -3342 1857 1592 -9410 -4091
1068 -4091 4090 -9559 -3547 9236 -4965 -1204 11308 -1463 -2207 7128 -1012 -5836 363 1073
1082 1073 -7514 -3354 5968 -4365 -2196 11423 -870 -1816 11146 -1122 -4850 4721 -2606 -8070
1096 -8070 -991 -96 -6075 -1652 6699 -1077 -1037 11629 843 -3701 8865 -1729 -8694 2714
1110 2714 -2946 -9657 -523 1526 -4129 109 8203 2214 -412 10665 2740 -4882 6641 -308
1124 -308 -9975 1248 -1050 -9300 -510 2671 -3794 1 7076 1197 -2285 7249 1817 -7214 3953
1139 3953 972 -9264 1611 2742 -6741 2031 6164 -1912 722 6891 275 -3925 3966 -180
$$ packed form
1039e35O578j4532R963P069j0295L329O164n990n386O197k98j2933P374O527j5323
1054a2091R589J0175j4659Q324J0696j2653J995Q131p563n286N199k65j1002N319
1068d091Q181j3649O012J2783j4201L761J2512j2771p44R335q140m824O199P10
1082A073q587M160R322j0333K169J3619j2293r46J2962j2268l728R571p327n464
1096h070P079Q95n979M423Q351p776M0J2666j0786m544J2566j0594o965J1408
1110B714n660o711R134K049n655M238Q094n989k626J1077p925p622J1523o949
1124c08r667J1223k298q250Q790L181o465L795P075n879l482R534n432r031J1167
1139C953k981j0236J0875J131r483Q772M133q076K634O169o616m200P891m146
$$ plain form
1153 -180 -8717 1223 1150 -9284 1187 5059 -5407 1819 8051 -1498 -64 6543 -545 -4942 2435
1168 2435 -68 -8208 -130 2726 -7146 617 7055 -3399 1027 8655 -894 -1259 5649 -847 -5141
1183 -5141 1807 -296 -7268 -525 3008 -5902 -998 6777 -3105 -1324 7559 -866 -2606 6096 -123
1198 -123 -4795 3198 1697 -4877 506 4132 -4115 -1756 5959 -2869 -4239 6186 -1410 -6074 4505
1213 4505 596 -5910 2600 2588 -4444 826 4777 -2316 -1692 5820 -359 -4355 5204 717 -6140 4008
1229 4008 1366 -6587 2128 2770 -5202 184 3981 -2392 -1891 5185 -7 -4452 4927 2069 -6459
1244 -6459 3060 2499 -7414 836 3121 -6065 -496 4408 -2313 -1361 5444 2181 -2468 4800 4069 -5252
1260 -5252 1802 3893 -7698 -979 3077 -7082 -2149 3848 -3056 -1855 4822 1669 -2418 3320
$$ packed form
1153a80q537R940p3j0434J0471L872j0466P226O232r549J434O607p088m397P377
1168B435k503q140Q078K856r872P763O438j0454M426P628r549l65O908o496m294
1183e141O948k103o972O743L533q910M904P775r882J781Q883q425j740Q702o219
1198a23m672P993j501o574N383L626q247K359P715q828j370J0425p596m664J0579
1213D505l909o506Q510j2p032N270L951p093O24P512o179l996R559m487o857J0148
1229D008k642p953Q715O42p972N386L797o373N01P076n192m445R379k858q528
1244f459R519n61r913Q250K285r186N569M904o721R52O805l263m649P268p31r321
1260e252P054K091j1591O719M056j0159M933N997o904J201O677l153m087N738
$$ plain form
1274 3320 4042 -4619 656 4543 -6153 -1519 5002 -5160 -1267 5766 -1954 -1458 5093 1158 -3242
1289 -3242 1472 2491 -5499 -2400 3742 -5800 -3027 6244 -2921 -1488 7524 -211 -1204 5407 1058
1304 1058 -3561 -229 1316 -5288 -3635 3414 -3785 -3329 7337 -402 -1434 8428 805 -2251 4705
1319 4705 -158 -4996 -1511 -544 -5446 -4566 2644 -2424 -3574 7093 1564 -2287 8063 1910 -3220
1334 -3220 4449 522 -4782 -923 177 -3491 -2882 3448 294 -3048 6391 2509 -4711 5321 1189
1349 1189 -6679 1524 -46 -6184 -826 1312 -1829 -749 4980 2924 -2193 5578 3721 -5130 2829
1364 2829 1542 -8197 49 803 -6357 -381 2906 -826 292 5211 3445 -1898 3697 3028 -5998
1379 -5998 832 1474 -8790 -1430 2076 -5666 130 4130 -489 715 5385 2758 -1666 2610 2688
$$ packed form
1274C320P22q661N275L887j0696M634O521j0162L893P033p720M96O551l935m400
1289c242M714J019p990L099O142r542K773R271r165J433R012p735r93O611m349
1304A058m619L332J545o604J653P049p199M56J0666p739j032R862p623l056O956
1319D705m863m838L485R67m902Q80P210n068j150J0667n529l851J0350o153n130
1334c220P669l927n304L859J100l668O09O330l154l342R439l882p220J0032m132
1349A189p868Q203j570o138N358K138l141J080N729k056n117P771j857q851P959
1364B829j287r739Q246P54p160N976L287l732J118M919j766n343N595o69r026
1379e998O830O42j0264P360L506p742N796M000m619J204M670k627m424M276P8
$$ plain form
1394 2688 -5816 -348 2514 -7405 -1376 4015 -4757 -201 5178 -1006 -477 3706 972 -3130 350
1409 350 1716 -4884 -1493 3882 -4267 -617 6132 -1916 201 5901 -588 -1270 3089 -352 -3851
1424 -3851 -740 799 -4703 -2104 3399 -3216 -1416 6257 -1051 -1013 6142 -362 -2629 2855 -221
1439 -221 -4004 -471 1224 -3715 -2063 4224 -1527 -2041 5763 187 -2235 5374 517 -3624 2234
1454 2234 532 -3772 -150 1447 -3164 -2088 3202 -1132 -2802 4233 36 -3548 4332 1143 -3991
1469 -3991 2731 1741 -3459 1121 2886 -2296 -1244 3689 -838 -3004 3317 302 -4447 2759 1125
1484 1125 -4884 1579 1955 -3676 298 3105 -2234 -845 3335 -49 -2189 3212 1259 -3263 2110
1499 2110 1880 -4196 595 2121 -3900 -564 2525 -2223 -1335 3060 61 -1589 2867 2026 -2382 1334
$$ packed form
1394B688q504N468K862r919O029N391q772M556N379o184N29M183k734m102L480
1409C50J366o600L391N375q149L650O749q048K117N700o489o82M359l441l499
1424c851L111J539n502K599N503o615J800P673p308L8P155o504k267N484l076
1439b21l783L533J695m939J652O287n751n14P804n576k422P609m857m141N858
1454B234j702m304L622J597m611J076N290m334j670P035m197l584P880l189n134
1469c991O722r90n200M580J765n182J052M933m527k166O321l015m749P206j634
1484A125o009O463L76n631L974K807n339J389M180l384k140N401j953m522N373
1499B110k30o076M791J526o021L336L089m748Q88M395k999j650M456q41m408L716
$$ plain form
1515 1334 2286 -3594 -731 2293 -3671 -1810 2509 -1971 -1790 3196 982 -1060 2864 2743 -1703 1079
1531 1079 2717 -3287 -1880 2153 -3081 -3343 2627 -1355 -2760 3070 948 -1848 2175 2118 -2366 -405
1547 -405 2222 -2278 -2218 2849 -1601 -2617 3874 509 -2057 4173 1730 -2437 1966 1465 -3855 -1416
1563 -1416 1280 -3175 -2913 2286 -489 -2274 4422 2231 -2191 4019 2294 -3280 1121 916 -4008
1578 -4008 -1522 707 -2651 -2115 2405 918 -1516 4437 3269 -1909 3185 2435 -3775 -77 561 -4472
1594 -4472 -1947 630 -2243 -1617 2038 1620 -1112 2990 3329 -2084 1453 2423 -3982 -580 1726 -3669
1610 -3669 -875 2105 -532 -288 2410 1977 -1491 1426 2251 -3397 -1225 1583 -4831 -1953 2035 -2673
1626 -2673 -822 3579 717 248 3295 2499 -877 592 2130 -3454 -2694 1848 -4062 -2910 3171 -1749
$$ packed form
1515A334R52n880K863L024n964J861M319m480J81M986k214k042L924j21m446K782
1531A079J638o004J407M033n234k62N970l982j405N830k122k796M023n7m484J961
1547d05K627m500O0N067m450j016O491l365k566O230k443m167M403n01n320K439
1563a416K696m455K62N199k775j785O696k191m422O210j725n574M401k05m924
1578d008K486K229l358N36M520j487k434N953j168n178N094p50o210L698O38n033
1594d472K525K577k873O26L655m18k732M102L39n413L537R70o405L402K306n395
1610c669K794K980k637K44K698m33l468K917Q25n648K172K808o414K878L988m708
1626b673J851M401k862m69L047p96l376J469J538n584P60M542n910J152O081m920
$$ plain form
1642 -1749 -986 4243 834 -436 3230 1450 -1430 -648 1191 -3547 -3041 1894 -2916 -2828 3783 -898
1658 -898 -1311 4734 898 -1005 2816 658 -2114 -186 1226 -2184 -2354 2480 -1078 -2173 3852 28
1674 28 -1961 3596 105 -2493 1332 -213 -2728 -956 646 -1061 -1475 2499 856 -1292 4184 1706
1690 1706 -2280 3328 653 -3135 722 22 -2925 -881 498 -1110 -1475 2293 1137 -1974 3014
1705 3014 2074 -2902 2123 1372 -3552 777 937 -2729 -613 1183 -552 -1307 1964 1311 -2118 2168
1721 2168 2317 -3025 1105 2611 -3135 294 1930 -2399 -570 1672 -901 -1595 1123 804 -2307 982
1737 982 1982 -3017 415 2718 -2736 128 2950 -1869 -251 2341 -851 -957 1416 799 -2310 466
1753 466 2197 -2671 -397 2351 -2698 -1236 2416 -2026 -1187 2321 -569 -1267 2056 1394 -1003 785
$$ packed form
1642a749P63N229l409j270L666j780k880P82J839m738N06M935m810Q8O611m681
1658h98m13O045l836j903L821k158k772J928J412l410j70M834l558j095O025l824
1674B8j989N557l491k598L825j545k515J772J602j707m14L974j643k148N476k478
1690A706l986N608k675l788L857p00k947K044J379j608l65L768j156l111M988
1705C014r40m976N025p51m924M329J60l666K116J796j735p55L271o53l429M286
1721B168J49n342M130J506n746L429J636m329J829K242k573o94K718l19l111L289
1737I82J000m999L432K303n454K864K822m819J618K592l192j06K373o17l109K776
1753D66J731m868K274K748n049J462L652m442Q39L508k890o98L323o62k397J788
$$ plain form
1769 785 2165 -1449 -785 2188 -2221 -1733 1947 -1786 -1952 2014 -278 -1269 1846 1686 -1028 482
1785 482 2085 -1355 -1167 1903 -2064 -2645 1724 -1196 -2580 1969 439 -1272 2111 1974 -728 733
1801 733 2203 -1250 -1469 1485 -1241 -2764 1816 -55 -2737 1902 1289 -1717 1639 1985 -1817 -377
1817 -377 1214 -1789 -1937 1455 -829 -2231 2241 1253 -1327 2625 2438 -1503 1351 1513 -2666 -1114
1833 -1114 488 -2277 -2264 937 -620 -1948 1976 1967 -976 2267 2866 -1560 587 1550 -2699 -1682 696
1850 696 -2125 -1663 1240 41 -1208 2154 2543 -201 1514 2479 -1721 -675 1423 -2602 -2233 851
1866 851 -1557 -1999 1429 656 -741 1824 1812 -588 272 1731 -1920 -1479 1463 -1684 -2018 1975 -6
1883 -6 -1038 3035 1583 -510 1458 1317 -1728 -861 733 -2318 -2649 1130 -1230 -2422 2394 1052
$$ packed form
1769G85J380l614O64K973m409M88L680l733j66L966k292r91L115j60k714J510
1785D82J603l440J88L070l967n81M369k920j384M549j530j711L383j37k702J461
1801G33J470l453k19K954k726j523M580j871k682M639o13l006L356L46l802J440
1817c77J591l003j48L392k284j402M472r88k580L952j87l941K854J62m179J552
1833a114J602k765J3L201j557j328L924rk943L243N99m426K147R63m249J017K378
1850F96k821M62K903j199j249L362L89k744J715R65m200J046K098m025L69L084
1866H51k408m42L428p73j397K565j2k400Q60J459l651M41K942l147l34L993j981
1883fj032M073j452k093J968j41l045Q67J594l051l31L779k360j192M816j342
$$ plain form
1899 1052 -803 3053 1767 -669 1330 1443 -1637 -1142 578 -1948 -2723 1253 -276 -2130 2914 1356
1915 1356 -1493 2609 1713 -1602 722 938 -2324 -1367 416 -1466 -1933 1363 656 -1863 2159 1997
1931 1997 -1819 1738 1676 -2544 143 855 -2001 -779 1091 -433 -1197 1780 1399 -1346 1598 1758
1947 1758 -2474 388 1126 -2999 -781 882 -2049 -794 1334 -30 -427 1615 1942 -856 1243 2236
1963 2236 -2146 -556 1731 -2502 -1079 1216 -1788 -1006 1588 -301 -618 1056 1232 -755 287 1869
1979 1869 -1783 -572 2289 -1842 -1122 1846 -1372 -943 1637 -32 -730 740 880 -1037 -163 2124
1995 2124 -1103 -999 2221 -946 -1238 2164 -964 -1699 1383 80 -1388 405 502 -909 -529 1575
2011 1575 -549 -1312 2196 -604 -1364 2448 53 -1582 1966 203 -912 827 829 -888 -601 886
$$ packed form
1899A052j855L856j286k436J999J13l080M95J720k526p75L976j529j854N044j558
1915A356k849M102q96l315K324K16l262R57J783j882m67L296p07k519M022j62
1931A997l816L557o2m220K687P12k856J222J870j524p64K977l81k745K944J60
1947A758m232K862P38m125K218J663k931J255K128j364l97K042L27k798K099R93
1963B236m382J590K287m233J423K295l004P82K594j889l17J674J76j987J042J582
1979A869l652J211K861m131P20K968l218M29K580j669o98J470J40j917Q74K287
1995B124l227J04L220l167k92L402l128p35L082j303j468J793R7j411L80K104
2011A575k124p63L508k800p60L812k395j635L548j763j115J739Kj717K87J487
$$ plain form
2027 886 -693 -1765 1036 -564 -2453 1425 74 -2199 1584 1239 -850 1679 1292 -540 -165 1429
2043 1429 -275 -1723 592 -116 -2821 1001 619 -2258 1293 1623 -1011 1259 1545 -489 -271 891
2059 891 -482 -2055 331 -27 -2473 771 1347 -1832 1283 2059 -1007 995 1959 -892 -605 659
2075 659 -416 -1687 545 559 -1867 800 2159 -1316 860 1919 -1559 -73 1137 -1617 -1400 215
2091 215 -716 -1427 546 1020 -714 1022 2789 -433 664 2433 -1331 -932 874 -2006 -2101 265 -717
2108 -717 -1294 908 1126 -617 1109 2750 -229 133 1669 -1632 -1823 751 -1523 -2156 762 188 -899
2125 -899 1295 1704 -320 882 2113 -752 -708 1478 -1191 -1811 1098 -817 -1899 1297 714 -627
2141 -627 1297 1347 -812 188 1031 -1041 -1330 767 -1065 -2181 1190 114 -968 1834 1773 -491 1324
$$ packed form
2027H86j579j072K801j600j889L878j351k273L783l45k089K529l87j832L75J594
2043A429j704j448K315p08k705L822l82k877L551L30k634K270K86k034K18J162
2059H91j373j573K386l58k446L244N76l179L115P76l066K002R64k851K87J264
2075F59j075j271K232J4k426K667J359l475K176J059l478J486J210k754K17J615
2091B15r31p11J973M74j734J736J767l222J097J769l764L99J806k880r5K366r82
2108g17n77K202K18j743J726J641k979L62J536l301j91K574k274o33K918n74j087
2125h99K194M09k024J202J231k865M4K186k669o20K909j915j082L196n83j341
2141f27J924N0k159J000Q43k072k89K097j832j116L371j076j082K802o1k264J815
$$ plain form
2158 1324 1530 -991 -276 573 -1431 -1890 -98 -1001 -1700 825 568 -881 1451 1798 -627 717 1408
2175 1408 -1253 -473 524 -1356 -1494 385 -69 -1200 1042 1341 -723 902 1580 -1174 -113 1300
2191 1300 -1225 -896 677 -1062 -1306 991 135 -1001 810 1591 -737 98 1518 -1294 -785 1440
2207 1440 -1334 -1180 1366 -432 -947 1621 878 -542 807 1584 -1039 -404 1112 -1388 -1291 1054 -1629
2224 -1629 -1883 1217 -26 -1065 1565 805 -589 797 1462 -695 -257 1300 -982 -1480 1200 -596
2240 -596 -1876 1402 -315 -1350 1243 474 -849 567 971 -499 -666 1182 -302 -1142 1010 -151
2256 -151 -1587 1287 198 -1618 905 722 -937 477 749 -302 -260 1049 -38 -1347 948 373
2272 373 -1517 860 819 -1978 604 634 -1290 326 906 -738 -462 889 107 -1131 733 678 -1647
$$ packed form
2158A324K06k521P15Q49k004m59J792r03o99K525k57j449K332L47k425J344O91
2175A408k661P80R97j880j38J879m54j131K242K99k064J625O78k754J061J413
2191A300k525L29J573j739k44K297q56j136J811P81k328Q35J420k812N09K225
2207A440k774J54K546j798n15K568p43j420J349P77k623O35J516k500R7K345k683
2224a629k54L100j243j039K630p60j394J386O65k157M38J557k282m98K680j796
2240e96j280L278j717j035K593p69j323J416M04j470j67J848j484q40K152j161
2256a51j436K874j089j816K523j83j659J414K72j051M2J309j087j309K295n75
2272C73j890K377m1k797K582L0j924J616N80j644K76J351p82j238J864n5k325
$$ plain form
2289 -1647 941 1336 -1470 752 1475 -815 208 1161 -766 -685 463 -217 -1472 -6 421 -1676 121
2306 121 1698 -1293 656 2306 -791 137 1696 -709 -833 404 -418 -1375 108 713 -1411 68
2322 68 1877 -893 325 2152 -668 -125 1305 -715 -996 297 -733 -1044 -29 787 -1024 149
2338 149 1691 -318 -165 1789 -760 -922 1050 -911 -1320 675 -133 -851 574 1056 -39 402 1798
2355 1798 -244 -785 1087 -893 -1860 655 -988 -1596 796 231 -510 1067 1469 118 349 1799 -89
2372 -89 -1300 609 -497 -2117 462 -571 -1683 492 668 -269 760 1541 253 -60 1044 -194
2388 -194 -1630 449 -451 -1925 663 217 -1318 969 1351 -434 649 1342 -221 -561 476 -478 -1701
2405 -1701 415 170 -1617 507 843 -1094 1334 1608 -426 283 647 -929 -980 -172 -774 -1578 150
$$ packed form
2289a647K588L95k806K222P23k290J023R53j927Q1J148o80j255J466M27k097J797
2306A21J577k991J949J650l097R28J559k405j24J237q22r57J483O05k124J479
2322F8J809k770J218J827k820N43J430k020k81J293j030l11J015Q16j811J173
2338A49J542k009J53J954k549j62J972j961m09J995q08p18J425M82j095M41J396
2355A798k042n41J872j980r67K515j643o08K392n65p41J577M02j351K31J450j888
2372h9j211J909j106j620K579j033j112K175J76r37J029P81j288l13J104j238
2388a94j436K079r00j474K588m46j535K287L82j785J083O93j563l40J037r54j223
2405a701K116k45j787K124L36j937K428K74k034P09L64j576n1Q08o02q04J728
$$ plain form
2422 150 411 -1240 815 1592 -655 1061 1690 -530 -34 591 -1021 -1087 -2 -678 -1276 268 565 -978
2440 -978 739 1559 -539 385 1310 -640 -335 722 -829 -1007 333 -133 -817 437 841 -572 296
2457 296 1455 -463 -222 1120 -742 -933 632 -271 -1254 580 211 -659 420 793 -578 88 1074
2474 1074 -583 -702 1039 -629 -1023 703 -103 -1154 948 651 -289 676 1253 -401 -8 871 -343
2491 -343 -973 434 -453 -1481 790 -51 -1200 734 613 -741 768 933 -308 140 702 -447 -658
2508 -658 774 -28 -1010 630 89 -1242 558 876 -1064 67 1020 -633 -200 655 -286 -512 387 140
2526 140 -691 308 431 -1013 40 826 -1153 -226 1087 -467 -366 900 -265 -633 633 86 -614
2543 -614 191 509 -755 27 934 -837 -46 1206 -479 -497 820 -216 -926 324 85 -952 62
$$ packed form
2422A50K61j651K055P77k247J716O29k220M96O25j612o6J085o76n98J544K97j543
2440i78J717Q20k098R24R25j950L05J057j551j78J340m66o84J254M04j413Q68
2457B96J159j918K41J342j862j91J565r03r83J834l69q70J079L73j371O66R86
2474A074j657j19J741j668l94J726q06j051K102k97r40R65N77j654L93Q79j214
2491c43o30J407q87j028K271q41j149J934j21j354J509J65j241M48N62j149k11
2508f58J432q02r82J640n41j331J800L18j940J131R53j653M33Q55r41k26Q99k47
2526A40q31R99J23j444J053P86j979R27J313j554J01J266j165l68J266n47p00
2543f14Q05L18j264P82R07j771P91J252j685j8J317j036p10J250k39j037J014
$$ plain form
2560 62 629 -675 -13 1356 -82 -80 1149 -17 -774 857 -400 -987 131 -278 -1027 -171 592 -512
2578 -512 -388 1239 130 -221 1441 -153 -1110 873 -352 -1215 291 167 -1116 4 970 124 52
2595 52 1298 224 -402 1112 3 -1342 353 -193 -1183 112 214 -825 316 1119 3 -133 765
2612 765 148 -837 487 -274 -1542 137 200 -1152 589 625 -276 528 1159 25 -107 531 -41 -1329
2630 -1329 143 -88 -1591 -97 400 -1069 721 1308 -180 618 1154 385 -145 371 41 -1268 -348
2647 -348 172 -1411 -179 957 -565 463 1106 -453 207 829 -377 -491 81 -170 -1060 2 202
2664 202 -776 369 1317 -459 528 1226 -707 -160 618 -746 -631 162 -295 -582 54 845 -294 1
2682 1 1127 -256 127 1151 -690 -606 344 -897 -797 197 -22 -643 -64 1070 76 81 1185 -25 -406
$$ packed form
2560F2N67j304O62J369j438KJ229j166p57J631j257n87J118m09p49Q56P63j104
2578e12J24J627j109l51J662j594r57J983j225q63J506j24j283J120R66q46p2
2595E2J246j074o26J514j109j345J695n46r90J295J02j039J141Q03j116j36Q98
2612G65o17r85J324p61j268J679O3j352J741L6r01Q04O31j134j32O38n72j288
2630a329J472k31j503J494M97j469J790N87j488P98N36p69n30N16l30j309R20
2647c48N20j583J232J136j522J028O43j559O60O22j206j14N72k51q90J062K00
2664B02r78J145R48j776R87O98j933N47P78j364J15P93m57k87O36P91j139K95
2682AJ126j383L83J024j841Q4R50j241J00R94k19o21N79J134r94NJ104j210l81
$$ plain form
2701 -406 1071 -285 -1094 481 -524 -867 126 8 -278 6 561 287 -98 995 -133 -572 821 -493
2719 -493 -1053 566 -32 -684 346 590 -510 198 811 117 -377 616 -76 -1140 430 -15 -1088 148
2737 148 221 -870 522 674 -47 214 736 -71 -575 504 -90 -1138 219 47 -945 475 777 -665
2755 -665 605 734 -455 77 679 -374 -607 594 -230 -1047 371 4 -784 127 344 -904 106 831
2773 831 -308 -55 626 -373 -211 602 111 -592 294 436 -990 -66 395 -551 -161 851 -352 -210 624
2792 624 -149 -384 443 356 -601 328 340 -674 -82 639 -404 -453 915 -206 -249 720 26 -539 509 -16
2812 -16 -683 58 348 -683 -52 643 -316 -257 1084 -261 -564 566 -195 -667 195 209 -710 -106 257 -216
2832 -216 156 690 109 -75 1044 255 -336 576 -128 -869 -189 -11 -953 -199 298 -391 3 694 48 -149
$$ packed form
2701d06J477j356q09J575j005l43R93j18k86K84N55k74l85J093j128m39J393j314
2719d93n60J619n98o52J030K44j100P08O13o94m94R93o92j064J570m45j073J236
2737A48P3j091J392J52p21K61N22q07n04J079n94j048J357j72r92J420L02j442
2755f65J270J29j189N32O02j053k33J201q24q17J418l67p88R11K17j248J010P25
2773H31j139K53O81r99J62Q13m91p03Q86J42j426R24M61r46L90J012j203J42Q34
2792F24p73k35Q27q7r57R29J2j014N92P21j043m9J368j121m3R69o94n65J048n25
2812a6o67P41K90j031O31O95r59N9J341j345l03J130p61m72Q62J4r19O04L63m73
2832b16L72N34n81j84J119p89n91R12p04p41O80J78r42P54M97o89L94O91o46j97
$$ plain form
2852 -149 516 188 -537 160 160 -1109 -82 136 -889 212 656 -291 104 776 190 186 661 123 -885 21
2872 21 46 -1131 -52 524 -639 168 766 -32 -13 805 -42 -297 165 -135 -746 -75 381 -665 147 827
2892 827 -197 245 958 135 97 620 -117 -585 -311 -419 -694 -667 174 -731 -124 972 -85 85 967 85
2912 85 -333 571 -380 -769 -9 98 -584 -160 599 -172 -156 913 138 -96 827 -223 -736 411 -390 -739
2932 -739 -32 -140 -646 170 883 107 168 878 141 -459 579 -108 -1121 120 5 -729 -8 185 -42
2951 -42 83 793 523 62 628 390 -814 248 37 -961 -33 94 -695 183 452 3 109 860 351 -171
2971 -171 580 246 -640 416 122 -797 133 180 -732 120 398 -25 -9 732 83 -536 305 59 -726 184
2991 184 380 -571 30 676 -479 172 602 -88 198 485 -54 -393 193 -34 -759 41 441 -873 -146
$$ packed form
2852a49O65l28p25O97%j269J027K18j025J101M44r47L95O72n86mM75n38j008R06
2872B1K5j177J079N76j163Q07N98p98J9Q18q47k55M62l00o11O71M56j046Q12O80
2892H27j024M42P13q23l8N23p37m68K74j08k75K7Q41r05O07J096j057J70Q82q82
2912H5m18R04r51l89P60J07o82M24P59p71J6J069p75k34R23j050n13J147q01l49
2932g39P07j08n06Q16P13p76O1P10p37o00J038o87j013J241j15p34P21J93k27
2951d2J25P10k70m61N66k38j204J062k11r98R28J27p89Q78K69m49J06P51n09n22
2971a71P51l34q86J056k94r19R30M7r12Q52K78m23J6P41o49o19Q41k46p85R10
2991A84J96r51O01O46j155O51M30o90K86K87n39l39N86k27p25Q00M00j314P27
$$ plain form
3010 -146 555 -519 92 613 -353 -3 296 42 -469 -41 4 -600 -149 349 -368 -171 819 -174 -84 727
3030 727 -67 -185 840 -4 -491 -31 1 -467 -275 245 -537 -503 631 -74 -488 594 -179 -203 449 250
3050 250 -262 207 188 -329 -234 352 -108 -490 728 -53 -500 700 80 -256 348 172 -421 159 199 -472
3070 -472 143 181 -369 -483 552 259 -553 439 204 -608 576 203 -621 -90 318 -256 -305 484 106 -177
3090 -177 595 170 -187 610 242 -484 190 -13 -894 -63 59 -253 -194 375 196 43 605 474 -282 200
3110 200 536 -745 8 45 -480 -399 -26 -310 -15 447 -4 -105 608 458 -333 104 280 -623 -333 334
3130 334 -505 -407 356 108 -72 889 343 -149 319 251 -405 -85 65 -624 -400 195 -206 -165 700 394 -131
3151 -131 622 466 -266 403 25 -817 -155 -159 -533 -284 460 99 46 891 271 118 652 252 -341 1 20
$$ packed form
3010a46P01j074O11N21r66L50K99k54n11M28M5o04M51M98p17J97R90r93R0Q11
3030G27p94j18J025q44m87M60L2m68J92N20p82L4J134p05m14J082p73k4O52j99
3050B50n12M69j9n17R5N86m60l82J218p81m47J200o20l36O04j76n93N80M0o71
3070d72O15L8n50j14J035k93q12R92k35q12J184l73q24N31M08n74m9P89l78k83
3090a77P72m25l57P97l68p26O74k03q81Q31J22l12N9N69j79j53N62j31p56M82
3110B00L36j281P53L7n25Q1L73k84K95M62m51j01P13j50p91M37J76r03K90O67
3130C34q39R8P63k48j80R61n46m92M68o8o56L20J50o89K24N95m01M1Q65l06n25
3151a31P53j56p32O69l78q42O62ml74K49P44l61n3Q45o20j53N34m00n93L42J9
$$ plain form
3172 20 -704 -407 -94 -468 -219 316 235 -82 639 562 -164 535 1 -530 -114 -9 -777 -389 -22 -390 128
3193 128 301 383 61 169 363 -465 -257 189 -903 -111 124 -493 -129 444 -97 81 457 206 -33 316
3213 316 401 -494 -138 27 -665 -417 445 -540 -72 579 186 144 473 297 -276 97 167 -747 -341 215 -615
3234 -615 -375 550 -322 -253 476 -232 -38 378 245 -141 -101 172 -528 -430 175 -594 -221 708 -156 -273 715
3255 715 6 -101 234 46 -392 16 -60 -321 -148 277 -126 -80 617 -112 -330 640 50 -320 307 -79 -376
3276 -376 -91 -81 -133 -102 502 371 -438 378 243 -466 380 -100 -583 238 326 -412 -174 272 -46 -446 172
3297 172 85 -465 451 301 -221 561 336 -548 221 228 -450 -4 76 11 -406 217 -47 -548 255 522 -404 251
3319 251 375 -397 143 424 -263 -52 224 -127 11 294 331 -298 445 335 -449 229 554 -499 -11 325
$$ packed form
3172B0p24K97L13l74K49N35q1l17P21p7p26O99n34n31M16J05p68L88L67l68N18
3193A28J73Q2l22J08J94q28K08M46j092P92K35o17L64N73n41J78L76k51k39L49
3213C16Q5q95L56J65o92K48Q62r85M68O51l93m2L29j76n73L73P0r14M06N56q30
3234f15K40R25q72O9P29p08J94M16j33l86M0K73p00R8O05p69L73R29q64j17R88
3255G15p09j07L35j88m38M08p6k61J73M25m03M6O97p29k18R70n90l70O27l86k97
3276c76K85J0n2L1O04j31q09Q16j35p09Q46m80m83Q21Q8p38K38M46l18m00O18
3297A72q7n50R16j50n22P82k25q84P69Po78M46Q0o5m17O23k64n01Q03K67r26O55
3319B51J24p72N40K81o87K11K76l51J38K83L7o29P43j10p84O78L25j053M88L36
$$ plain form
3339 325 -501 -251 333 -230 -206 535 114 -205 314 128 -168 -39 513 -248 -288 405 -573 -337 -126 -129 -41 145
3361 145 132 194 225 349 -137 -137 237 -340 -659 113 -539 -340 165 39 -72 315 493 26 239 303 35 -69
3383 -69 291 -403 -492 210 -393 -488 190 69 -157 321 367 -63 -10 230 -344 -523 284 -554 -348 363 30 -94
3405 -94 585 389 -50 266 626 -191 -183 166 -411 -572 -26 -257 -524 207 252 -221 500 534 -140 267 299 -461
3427 -461 -142 -16 -363 -330 8 -33 -468 520 311 -470 566 390 -235 -5 221 -446 -104 -90 -343 -324 134
3448 134 -99 -265 402 272 -8 281 131 -266 11 212 -287 -304 9 9 -146 206 423 -140 359 234 -44
3469 -44 -5 201 -397 -379 157 -249 -312 -44 195 -137 410 294 119 330 372 -220 -79 184 -394 -438 75 -162
3491 -162 -463 342 276 -319 367 369 -282 290 258 -436 -311 22 -286 -313 406 -37 -231 249 432 -412 132 204
$$ packed form
3339C25q26K50N84n63K4P41m21l19N19j86k96J29N52p61m0O93r78K36K11lQ8J86
3361A45j3O2L1J24m86%L74n77l19P72o52J99N05j26j11L87J78m67K13O4k68j04
3383f9L60o94q9P02o03r5O78j21k26M78M6m30N3K40n74j79Q07q38K06P11l33j24
3405i4O79j96m39L16L60q17QL49n77j61N46k31k67P31M5m73P21L4o74M07L2p60
3427d61L19J26l47L3L38m1m35R88k09p81J036j76o25K30K26o67L42J4k53J9M58
3448A34k33j66O67j30k80K89j50l97K77K01m99j7L13%j55L52K17n63M99j25k78
3469d4L9K06n98J8N36m06o3K68K39l32N47j16j75K11M2n92J41K63n78m4N13k37
3491a62l01Q05o6n95O86Ko51N72l2o94J25L33l08k7P19m43j94M80J83q44N44P2
$$ plain form
3513 204 -201 -36 264 -233 -142 32 -176 -17 136 113 -346 20 248 -541 -62 275 -421 -237 31 -353 -214
3534 -214 262 -131 -116 242 133 -211 -39 407 -255 77 393 -331 -366 360 -212 -143 66 198 -161 88 79 -272
3556 -272 -49 266 -89 18 482 -197 74 449 -8 -69 333 -1 -337 38 121 -117 -217 571 -147 17 694
3577 694 -100 -315 329 -168 -139 -5 -319 -305 -198 101 -172 -32 280 17 63 293 -169 -345 239 141 -470
3598 -470 86 -277 -437 -19 504 -213 -65 400 -232 -287 289 -170 -566 132 81 -638 97 129 -337 366 323
3619 323 70 47 320 231 -281 73 -32 -585 27 233 -507 129 382 -248 395 351 107 122 54 98 -473 141
3641 141 25 -639 59 58 -326 11 476 -112 42 435 64 -41 411 -117 -275 27 20 -590 160 207 -189 173
3663 173 463 -198 237 395 -152 -230 180 -109 -278 -244 87 -273 -124 764 179 126 588 -90 -141 286 -291
$$ packed form
3513B04m05J65L00m97R1J74k08J59J53k3m59L66K28p89M79L37o96J84K68l84J39
3534b14M76l93J5L58j09l44J72M46o62L32L16p24l5P26n72O9K09J32l59K49rl51
3556b72K23L15l55J07M64o79K71L75m57o1M02l34l36L75Q3k38j00P88p18J64O77
3577F94p94k15O44m97K9J34l14J4J07K99k73J40L12k63M6K30m62j76N84r8o11
3598d70N56l63j60M18N23p17J48M65o32n5N76m59l96O98n1p19P35L2m66P03m3
3619C23k53k3K73q9n12L54j05n53O12K06p40O36K53o30O43m4k44J5o8M4n71O14
3641A41j16o64O98jl84L37M65n88J54L93l71j05M52n28j58L02po10P50M7l96L62
3663A73K90o61M35J58n47p8M10k89j69L4L31l60J49Q88n85n3M62o78n1M27n77
$$ plain form
3684 -291 -478 -39 -167 -518 131 74 -48 -200 623 220 -284 308 -19 -291 252 -82 -508 -40 -157 -109 99
3705 99 372 30 83 602 210 -158 450 -55 -529 37 55 -303 -23 207 -435 161 341 111 -66 269 14
3726 14 -322 155 -201 -441 -44 -195 -442 238 472 -47 407 200 -121 30 310 -103 -181 21 -156 -575 196
3747 196 53 -261 46 173 -176 101 389 10 9 183 -184 -317 -100 -1 -353 75 290 -365 306 382 -81
3768 -81 -7 361 48 -66 -28 -129 -319 56 301 -337 -194 192 -290 -61 317 -263 -14 183 -28 -270 65
3789 65 58 -483 -21 105 -266 -349 236 30 147 390 -128 -368 225 -57 -362 102 135 -465 5 232 78 76
3811 76 282 -245 -34 93 -50 -83 312 307 -398 53 43 -486 -12 22 -378 -192 85 -235 -130 150 -263 -69
3833 -69 118 -54 -242 186 33 -421 -254 200 -306 -325 161 -162 293 312 94 -137 217 164 -420 0 -2 -214
$$ packed form
3684b91j87M39j28l51O49n7j22j52Q23m03n04N92l27k72N43l34m26M68j17M8K08
3705I9K73l42N3N19l92l68O08n05m74N66J8l58K80K30o42N96J80k30j77L35k55
3726A4l36M77l56k40L97j51k47O80K34n19M54k07l21J51K80m13p8K02j77m19P71
3747A96j43l14L07J27l49K77K88l79jJ74l67j33K17R9l52M28K15o55O71P6m63
3768h1P4L68l13j14L8j01j90L75K45o38J43L86m82K29L78n80K49J97k11k42L35
3789F5pn41M62J26l71q3N85k06J17K43n18k40N93k82l05M64L3o00M70K27j54k
3811G6K06n27K11J27j43l3L95np05M51j0n29M74L4m00J86K77l20J05K80m13J94
3833f9J87j72j88M28j53m54J67M54n06j9M86l23M55J9k18k31L54n3n84M20kk12
$$ plain form
3855 -214 -32 358 48 -73 175 -7 123 504 -70 -127 157 123 -305 -240 87 -197 -111 199 -96 174 310
3876 310 23 -228 233 98 -228 -295 45 -378 -215 211 -295 -189 448 95 185 357 269 -313 -19 193 -70
3897 -70 -182 47 -245 -370 317 -193 55 464 -80 -79 122 174 -22 234 -242 -116 -155 -134 -233 -122 294 -83
3919 -83 -382 118 208 -56 411 -35 -265 -13 -126 -242 60 -186 24 14 277 336 -55 471 213 -224 204
3940 204 122 -404 -278 -240 -282 89 334 64 51 -53 550 71 122 265 -268 -46 -231 -539 -55 247 -356 -205
3962 -205 246 264 121 321 114 -165 197 83 -457 -70 -117 -417 -161 184 -80 204 257 107 133 -89 54
3983 54 -358 -90 177 -526 -98 84 -593 -140 356 103 290 284 201 -175 -190 -42 -366 -175 253 -459 -270 358
4005 358 -320 -83 650 91 -107 242 170 -284 -70 151 -298 -411 25 -151 -230 243 -153 -62 433 149 219
$$ packed form
3855b14J82L90l10j21K48j82J30L81n74n7K84l4m28O5L27k84Q6L10k95K70J36
3876C10k87k51M61j35l26o7L40m23J63M26n06J06O37l53R0J72q8n82K94K12k63
3897g0j12K29k92j25O87n10K48M09n44JK01N2j96K56m76J26l9K1r9J11M16l77
3919h3k99N00R0k64M67m46k30K52j13j16L02k46K10j0K63N9l91N26k58m37M28
3940B04q2n26J26L8m2L71K45k70j3j04O03m79N1J43n33K22j85l08M84L02o03J51
3962b05M51J8j43K00k07k79L62j14n40L87m7l00K56L45k64K84N3j50K6k22J43
3983E4m12K68K67p03M28J82o77M53M96k53J87oq3l76j5J48l24J91M28p12J89O28
4005C58o78K37P33n59j98L49p2m54K14K21m49j13M36j76p9M73l96R1M95k84P0
$$ plain form
4026 219 415 166 -77 -95 61 -138 -317 283 -109 -193 476 -186 -226 360 -281 -23 28 -11 -113 -59 -91 -308
4048 -308 -57 242 54 -238 370 -26 -289 261 22 -274 144 -45 -184 13 131 -208 -194 69 2 -201 278
4069 278 272 -106 -14 146 -439 39 44 -310 -125 75 -178 -134 35 -176 -445 402 168 -98 321 361 -409 128
4091 128 189 -428 -292 -28 -162 -276 185 -24 -263 464 19 -145 189 296 -44 150 351 -289 1 227
4111 227 -175 -70 98 27 -22 95 131 -434 -8 293 5 -95 32 -29 -308 206 -158 -120 168 170 -188 273
4133 273 248 22 90 166 -57 -390 36 -243 -338 75 3 -46 304 121 28 156 367 -327 -22 3 -397 -170 -103
4156 -103 -309 -107 110 12 -73 330 328 -106 341 83 -336 -330 251 -252 -492 111 10 -69 67 311 170 280
4178 280 349 -207 264 97 -597 -149 281 -333 -279 315 49 -156 105 441 -18 380 151 -198 -84 96 -329
$$ packed form
4026B19J96k49k43j8J56j99j79O00l92q4O69o62m0N86o41K58N1l9j02N4l2k17
4048c08K51K99j88k92O08l96k63N50k39k96M18j89j39J97J18l39J4K63o7k03M79
4069B78ol78R2J60n85M78Nl54J85K00k53M4J69k11k69Q47k34k66M19M0p70N37
4091A28O1o17J36K64j34j14M61k09k39P27m45j64L34J07l40J94K01o40K90K26
4111B27m02J05J68p1m9J17L6n65M26L01k88j00J27o1k79N14l64L8K88Kl58M61
4133B73k5k26O8P6k23l33M26k79r5M13p2m9L50j83r3J28K11o94L05K5m00K27O7
4156a03k06K02K17r8q5M03km34M47k58m19ON81n03k40O03j01p9J36K44j41J10
4178B80O9n56M71j67o94M48M30o14N4N94k66k05K61L36m59L98k29l49J14J80m25
$$ plain form
4199 -329 -354 70 -159 -13 262 270 165 222 313 -21 -156 248 -275 -215 79 -466 -220 328 -200 -221 39 337
4221 337 125 90 155 -16 -17 -13 -135 -348 -20 -375 -215 207 273 180 370 261 -84 81 113 -371 -43 31 -130
4244 -130 -245 202 -218 -368 293 247 -195 296 146 167 55 124 -33 -141 160 -188 -297 28 -30 -250 402
4265 402 268 -339 52 196 -197 -69 86 -276 -377 -234 80 128 41 172 -337 284 358 -115 80 166 -212
4286 -212 39 6 -115 -243 -17 -35 -324 185 437 -142 431 318 -271 75 147 -240 45 188 -134 -68 -99 112
4308 112 -341 204 274 -334 122 254 -620 -238 331 -413 69 131 -183 -19 36 72 -12 -24 171 -350 -103 444
4330 444 -123 -172 412 -41 -149 -192 -116 -101 -73 210 74 -73 119 -113 -106 331 36 -95 169 -33 -387 -134
4352 -134 -106 50 17 73 -332 119 115 -237 106 343 -44 -391 266 -137 -395 138 -230 -167 -93 155 -13 -109 223
$$ packed form
4199c29k5M24k29J46K75Qj05N7R1l34j35M04n23O0K94n45K46N48n28k1K60K98
4221C37k12l5O5j71jMj22k13L28l55J60M22O6r3J90j09l45J65L2m84L28P4j61
4244a30j15M47m20j50O61m6m42M91j50K1j12O9j57j08L01l48j09L25n8k20O52
4265D02j34o07L91J44l93J28J55l62j01J43L14M8q7J31n09O21P4m73J95Q6l78
4286b12K51l3j21j28K26j8k89N09K52n79N73j13n89L46P2l87K85J43l22O6l1K11
4308A12m53N45P0o08M56J32q74L82N69p44M82O2l14J64N5L6q4j2J95n21K47N47
4330D44n67m9N84m53j08m3P6J5K8K83j36j47J92k32PM37k95j31K64k02l54K53
4352a34K8J56l3N6m05M51ml52L43K37l87l47O57m03k58N33l68O3P4K48j68r6L32
$$ plain form
4375 223 55 -123 317 -32 -353 226 39 -221 17 174 -92 53 131 49 309 -63 21 3 -21 -24 -87 25 59
4398 59 -293 -5 70 -2 239 16 -38 -57 109 -16 -189 242 -36 -299 14 -18 -299 94 235 -88 177 409
4420 409 31 -11 104 -256 -385 42 -108 -269 -39 3 -279 -59 134 155 35 449 -96 -231 128 -325 -16
4441 -16 -65 -200 -415 31 234 28 99 484 -178 -167 281 -23 -576 -11 -106 -467 23 -230 -102 78 143 100
4463 100 134 301 5 -127 44 -177 -64 28 2 -338 -122 91 -98 281 378 66 44 371 -52 -361 -31 -153
4485 -153 -752 -94 -84 -375 -26 247 -58 361 163 232 57 146 7 -291 53 -19 -183 183 80 -210 72
4506 72 124 -90 -74 222 -256 -41 -217 -134 -361 -172 125 -107 -70 299 -340 18 134 7 222 177 -122 -398
4528 -398 88 -177 -253 103 106 -329 -243 155 -85 123 252 -193 -136 171 -336 -77 159 -348 -148 129 368 -136
$$ packed form
4375B23j68j78M40l49l21N79j87k60K38J57k66J45P8q2K60l72Q4j8k4lo3J12L4
4398E9l52K88P5p2K41k23n4j9J66j25j73M31k78k63L13l2k81L93J41l23K65K32
4420D09l78m2J15l60j29M27j50j61K30M2k82K20J93K1j20M14n45j35L59m53L09
4441a6m9j35k15M46K03k06P1L85o62J1M48l04n53N65r5l61M90k53J28J80O5m3
4463A00L4J67k96j32J71k21J13R2k6l40K16K13j89L79R7l12k2L27m23l09L30j22
4485a53n99O58J0k91L49K73l05M19j98O9j75Q9j39k98L44p2j64L66j03k90K82
4506G2N2k14J6K96m78K15j76Q3k27J89K97k32L7L69o39L58J16j27K15m5k99k76
4528c98M86k65p6L56Lm35Q6L98k40K08J29m45N7L07n07K59K36n07K00K77K39n04
$$ plain form
4550 -136 56 305 -26 -89 181 -135 -257 50 -232 -371 46 -208 -82 142 286 -134 -1 113 -353 -242
4570 -242 15 53 -142 170 -22 -176 186 27 -149 163 169 -221 -175 41 118 -74 204 -259 -375 365 -108 -378
4592 -378 218 72 -165 211 119 -176 -13 192 145 -189 38 106 -425 113 41 -401 356 17 1 131 190 85
4614 85 -113 -17 -136 -69 -88 80 -569 237 91 -394 124 68 -255 50 317 -176 129 334 -95 -190 160 170
4636 170 -572 103 243 -450 3 116 -80 38 395 -74 -91 25 -58 -237 18 -96 -319 -120 316 -314 -81
4657 -81 327 20 136 266 26 -97 165 -73 -30 -137 -8 -302 -274 303 68 -48 503 -34 91 185 -126
4678 -126 9 -47 -266 -294 -206 -11 -110 136 388 -77 65 583 -95 -53 365 -173 -190 9 -144 -542 49 -108
4700 -108 61 -67 383 -47 -228 504 -74 -240 140 4 -523 25 -13 -56 70 216 75 62 270 104 -140
$$ packed form
4550a36J92K49l31o3K70l16j22L07k82j39M17k54J26K24J44m20J33J14m66J11
4570b42K57L8j95L12j92j54L62j59j76L12Ol90M6K16P7j92K78m63j16P40m73k70
4592c78N96j46k37L76r2k95J63K05m7l34K27O8n31N38p2m42P57l39j6J30N9j05
4614H5j98R6j19O7j9J68o49Q06j46m85N18n6l23L05K67m93L05K05m29r5L50J0
4636A70p42O75J40o93M53J13j96J18L57m69j7J16q3j79K55j14k23J99M36o30K33
4657h1M08l07J16J30k40j23K62k38M3j07J29k94K8N77k35j16N51n37J25R4l11
4678a26J35n6k19k8Q8J95r9K46K52m65J42N18o78M2M18n38j7J99j53l98N91j57
4700a08J69j28M50m30j81P32n78j66L80j36n27N48l8m3J26J46j41j3K08j66k44
$$ plain form
4721 -140 25 -111 -258 198 -43 -378 2 -55 -533 -97 380 381 171 410 210 8 84 -38 -403 -41 -119 -608
4743 -608 -92 -8 -26 231 393 -120 -37 352 -50 -138 96 -217 -351 40 26 -492 53 153 -289 -17 563 54
4765 54 130 281 -157 -265 -83 75 -273 -47 11 110 151 425 -282 -73 516 31 -360 181 -165 -431 -168 -41
4787 -41 -366 210 157 -86 31 77 84 -24 48 169 -343 -93 -9 -440 -92 -94 -263 345 191 25 61 313 148
4810 148 -224 179 107 -8 98 -9 -396 74 116 -260 126 315 -51 -43 201 -41 -591 155 72 -446 -62 336
4832 336 -192 -164 110 -224 -14 11 83 -38 78 -122 -305 166 52 -236 216 123 -119 45 275 -8 26 191
4854 191 -71 -212 180 149 -221 -275 309 -358 196 439 -9 231 269 -245 -199 159 185 -230 226 99 10 -141
4876 -141 19 -227 -266 259 -238 -5 578 -123 -276 239 -56 68 60 -51 -345 -309 -67 -156 -18 264 -161 -85
$$ packed form
4721a40J65j36j47M56k41l35L80n7m78M36M77Jk10K39k00k02P6j22l65L62p8m89
4743f08N16Q4j8K57J62n13Q3L89m02q8K34l13j34L91j4n18N45J00m42K72N80n09
4765E4P6J51m38j08J82J58l48K26N8R9M1K74p07K09N89m85l91N41l46k66K63J27
4787d1l25N76n3k43J17M6Pj08P2J21n12K50Q4m31L48kj69O08j54j66L6K52j65
4810A48l72M03p2j15J06j07l87M70M2l76L86J89l66QK44k42n50P46q3n18L84L98
4832C36n28K8K74l34K10K5P2j21J16k00j83M71j14k88M52r3k42J64K30k83L4J65
4854A91k62j41L92l1l70n4N84o67N54K43m48K40L8n14M6L58K6m15M56j27q9j51
4876a41J60k46l9N25m97K33N83p01j53N15k95J24qj11k94L6K42q9J38K82m25P6
$$ plain form
4898 -85 265 -12 -250 408 -128 -46 152 74 83 56 -128 -30 -160 286 -36 14 338 16 -270 231 124 -349 105
4921 105 70 -267 -211 120 139 292 189 -10 -146 455 338 -220 -4 11 -201 -192 188 -420 -58 60 -90 -416
4943 -416 -61 310 -35 598 283 -154 292 -224 -536 -167 -240 -176 97 213 318 68 190 314 -293 197 73
4964 73 -388 94 -127 -428 118 33 -326 -83 311 -5 144 420 60 0 -38 37 -744 -289 102 -530 -51 193
4986 193 133 214 246 173 181 164 251 -164 -139 -209 -351 -306 87 -375 -267 270 224 203 391 139 -48 62 -100 -230
5010 -230 -78 -118 -503 -233 95 -156 -82 306 345 149 165 -13 -133 -38 -254 -339 -97 -332 -227 -63 165 3
5032 3 -36 592 30 -21 269 8 -491 -235 285 67 -6 -99 -161 -9 383 151 51 433 95 -298 151 -7
5054 -7 -414 6 -26 -244 -177 206 -62 22 327 315 -153 159 22 -192 -121 -183 -334 70 -32 -161 32 130 -74
$$ packed form
4898h5L50k77k38O58n36Q2J98p8Rk7j84R8j30M46l22N0L24l22k86N01j07m73M54
4921A05l5l37N6L31J9J53j03j99j36O01j17n58K16J5k12RL80o08L62J18j50l26
4943d16L55L71l45O33l15m37M46n16l12L69p3O4K73J16J05k50J22J24o07M90j24
4964G3m61M82k21l01N46q5l59K43L94l16J49K76l60o0l8P5p81M55L91o32M79K44
4986A93o0Q1L2p3Qj7Q7m15K5p0j42M5L93m62J08N37m6k1J88k52j87J10j62j30
5010b30J52m0l85K70L28k51P4L88L9j96J6j78j20R5k16q5K42k35J05J64K28j62
5032Cl9O28n62n1K90k61m99K56N20k18p3r3o2J52L92k32j00L82l38l93M49j58
5054gm07M20l2k18O7L83k68Q4L05j2m68L12j37k14P1o2j51M04j02j29J93R8k04
$$ plain form
5077 -74 83 220 213 15 -31 92 -462 -224 -109 -371 -57 -43 -93 -8 495 -13 -47 325 -75 1 152 76 -58
5100 -58 56 322 -332 -98 107 -163 -12 97 -29 -202 45 32 -85 -135 -108 -306 11 278 -69 132 145 -162
5122 -162 120 123 69 -134 271 60 48 147 86 -57 -141 138 -25 -275 176 -137 -79 406 116 -93 108 53 -380
5145 -380 161 195 -54 1 70 -75 37 118 20 -99 244 123 -176 138 -92 -282 -31 76 -330 -152 205 -65
5167 -65 -87 172 166 36 319 320 -186 -45 258 -232 73 38 -101 -219 -52 -166 -119 103 219 -192 -93 361 -251
5190 -251 72 158 -632 -279 -55 -243 -86 150 111 149 238 251 -28 358 214 -37 -146 92 -568 -247 100 -325
5212 -325 15 363 72 7 348 35 -73 221 199 -292 -166 -28 -442 -254 274 -44 -39 222 441 263 332 108
5234 108 -117 6 -19 -449 -421 138 -235 -321 116 25 -14 432 29 84 -119 -8 -252 -16 32 -362 -246 71
$$ packed form
5077g4J57J37pj98m6J23n54K38J15k62L14J4n0Q5N03n08l4L72m00P6J51p6j34
5100e8J14K66o54K34K05k70J51J09j26j73K47j3j17n0K7j98L17K67l47K01J3l07
5122a62K82Ln4k03M05k11j2R9o1j43q4K79j63k50M51l13N8M85k90k09K01n5m33
5145c80N41L4k49N5O9j45J12Q1r8j19L43j21k99L14k30j90K51J07m06J78L57k70
5167f5k2K59oj30K83Jn06J41L03m90L05l5j39j18J67j14M7K22J16m11R9M54o12
5190b51L23Q6p90L53K24j88J57K36l9L8Q9J3k79L86j44k51j09K38o60L21L47m25
5212c25L40L48k91o5L41l13j08K94k2m91J26J38m14J88N28l18NK61K19j78O9k24
5234A08k25J23k5m30K8N59l73q6M37r1l9M46m03N5k03J11k44K36M8l94J16L17
$$ plain form
5256 71 186 91 356 340 63 463 96 7 224 -182 -240 -87 -91 -104 -113 59 160 -195 341 83 27 387 -9 -63
5280 -63 7 -291 -257 -55 -69 21 105 250 283 174 358 289 -47 265 -28 -305 27 -174 -161 25 -42 14 -115 329
5304 329 -42 171 161 213 -665 22 434 -453 -112 271 -112 -31 173 289 -293 153 235 -219 145 42 -85
5325 -85 -24 17 -319 -10 310 -302 20 195 342 85 -32 201 -86 -104 103 -326 63 107 -271 -14 249 -174
5347 -174 59 -59 81 127 -39 206 -229 46 91 -284 -28 253 -226 -150 -7 74 -268 342 118 -179 37
5368 37 43 -36 52 55 -269 -15 25 257 -44 271 -17 -393 20 217 -40 -82 101 40 65 -7 -245 -3 347 -292
5392 -292 -101 110 242 149 130 26 42 -145 216 -192 -46 -53 -204 -249 60 -17 -149 -74 -1 -377 182 325 13
5415 13 3 235 -143 -73 223 -212 -12 -25 146 28 244 -63 -436 243 -2 -122 -17 -6 -201 -378 1 -160
$$ packed form
5256G1J15r5K65j6k77M00l67q9K17m06n8J53mj3rJ72J01l55N36k58n6L60l96n4
5280f3P0k98L4K02j4R0Q4J45L3j09J84o9l36L12k93k77L32k01J3J86o7N6j29M44
5304C29l71K13j0N2q78O87M12q87L41L83l83Q1K04J16n82M46Q2m54L64j03j27
5325h5O1M1l36L09L20o12L22J75J47k57j17K33k87j8K07m29L89M4l78K57K63m23
5347a74K33j18J40M6j66K45m35K75M5l75K56K81m79P6J43Q1l42O10k24k97K16
5368C7Op9Q8Ll24K54M0K32l01L15k88l76M13J97k57m2J83o1K5p2k38K42L50o39
5392b92J91K11J32r3j9j04J6j87L61m08J46pj51m5L09p7j32P5P3l76N59J43l12
5415A3j0K32l78P0K96m35K00j3J71j18K16l07l73O79k45j20J05J1j95j77L79j61
$$ plain form
5437 -160 -180 263 -110 -75 214 300 4 -216 107 -192 19 -98 -14 -304 -101 65 -135 220 330 243 352 170
5459 170 -37 -82 -40 -146 25 117 -72 -150 93 -98 -7 312 319 75 286 268 117 -263 89 -154 -231 -14 -77
5482 -77 -396 288 -131 82 288 162 117 269 80 -252 -237 -119 -275 -229 -55 -275 -173 168 136 17 365 262
5504 262 -176 245 222 -235 -362 -50 -103 -136 177 244 -31 200 320 -181 166 263 -416 0 -234 -200 42 -74
5526 -74 -2 71 44 285 115 207 336 -127 -94 290 -508 -82 -189 -227 -54 131 416 82 65 300 -61 104 325
5549 325 -68 -138 223 -375 -99 -13 47 -197 -45 45 146 4 375 -66 -159 286 -392 -308 13 -237 35 149
5571 149 131 -235 111 175 -90 12 242 -161 -125 151 -245 -238 49 80 -122 158 -43 82 440 14 0 88 -91
5594 -91 70 -155 11 -62 -19 101 -45 -42 -50 -51 -14 29 125 -133 108 12 -35 -114 143 -31 -170 306 17 -53 132
$$ packed form
5437a60k0M43l73L5K89Q6k96k20L23k99K11j17Q4k90K03J66k00L55J10q7J09j82
5459A70k07m5M2j06J71R2j89p8K43j91R1L19Pk44K11j8j51l80L52k43p7K17o3
5482g7l19O84m19K13K06j26m5J52j89l32J5J18j56M6J74k20J02L41l2j19L48j03
5504B62m38M21k3m57j27L12n3l3L13O7k75K31J20n01L47R7o79M16k34L4K42j16
5526g4P2P3k7K41j70R2J29m63L3L84p98M26j07l8J73J85K85l34j7K35l61J65K21
5549C25l93p0L61n98K76Q6O0k44J52R0J01j42L71m41r3M45o78Q4L21k50K72J14
5571A49j8l66L46O4k65J02K30m03L6K76l96PK87L1k02K80k01J25L58m26j4Q8j79
5594i1J61k25J66p3M3J20j46LqjL7M3R6k58K41r6m7p9K57j74j39M76k89p0J85
$$ plain form
5619 132 120 -98 190 132 -243 -44 240 -59 -216 -23 6 -237 329 -3 27 168 -285 -100 92 47 34 53
5641 53 145 5 -159 -37 182 -206 303 137 -99 57 135 43 -65 122 -320 179 7 120 -370 -139 46
5662 46 -225 287 246 -227 282 89 -35 82 149 -77 77 25 -317 -63 99 -114 -262 -83 -17 -240 255 342
5684 342 55 -74 52 -342 -194 130 -97 -311 104 228 -105 159 302 -24 -160 439 191 -97 128 -158
5704 -158 -169 73 -46 -316 -88 230 -172 153 275 -129 98 180 -106 -235 -132 -80 -280 -256 -99 -298 63
5725 63 194 -17 -31 81 -96 -57 39 -54 -213 -267 -244 -202 -39 89 -17 58 -55 -83 66 108 -67 13 91 -215
5749 -215 -267 84 62 -305 255 233 -480 252 288 103 13 355 -265 -124 163 -152 -227 -79 -154 -150 223 53 -170
5772 -170 -20 508 116 74 -8 -66 -300 4 -142 -188 -8 23 135 229 387 21 -148 185 -145 -424 -10 -157
$$ packed form
5619A32j2k18K88n8l75J99K84k99j57J93K9k43N66l32L0J41m53J85J92m5j3J9
5641E3R2j40j64J22K19l88N09j66k36J56P8r2j08J87m42M99j72J13m90K31J85
5662D6k71N12m1m73N09j93j24J17O7k26J54n2l42K54J62k13j48J79O6k23M95Q7
5684C42k87j29J26l94J48L24k27k14M15J24l33K64J43l26j36N99k48k88K25k86
5704a58j1K42j19k70K28L18m02L25J22m04K27Q2k86j29J03N2k00K4J57j99L61
5725F3J31k11j4J12j77L9R6r3j59n4K3M2J63J28j06P5j13k8J49M2j75Q0P8l06
5749b15n2L51k2l67N60k2p13P32L6j85r0L42o20J41K87l15p5J48p5ML73j70k23
5772a70J50N28l92m2q2n8k34L04j46m6J80L1J12R4J58l66j69L33l30k79M14j47
$$ plain form
5794 -157 -296 -303 63 15 59 93 68 150 166 176 6 202 -282 -255 -112 29 -277 78 -20 16 203 124 -223 459
5818 459 12 14 -114 43 49 -416 187 -15 -199 90 226 7 178 335 64 36 69 -19 -112 -300 -25 -231 161
5841 161 26 26 76 197 4 151 263 -111 224 -98 154 -317 -202 -303 -219 -91 42 -155 207 257 129 120
5863 120 128 -112 -5 152 -47 -51 -15 -253 -137 97 26 -193 -90 286 -178 -75 -97 -137 23 -57 -81 -52 -47 244
5887 244 49 -212 380 -39 -47 524 56 -32 16 -147 -17 150 -69 13 228 350 -56 -230 125 -31 -226 231
5909 231 -304 12 84 -132 -269 56 6 -331 10 283 38 -30 34 -35 -394 113 -176 6 246 -117 -76 126
5931 126 16 -294 -7 -15 171 -176 291 125 103 275 53 -250 -145 -35 -241 186 -6 -61 49 72 -74 116
5953 116 8 105 -226 138 174 -199 -24 -82 -276 -65 55 -346 -197 275 15 27 224 -61 -232 180 -29
$$ packed form
5794a57j39pL66m8M4L4k5Q2J6J0j70J96m84K7J43J41l06L55r8L6J87p9l47O82
5818D59m47Kj28J57Om65O03k02j84K89J36k19J71J57k71k8L3q8r3j88K75k06L92
5841A61j35%N0J21j93J47J12l74L35l22K52m71J15j01Q4J28J33j97L62N0j28r
5863A20Qk40J07J57j99mL6k38J16K34p1k19J03L76m64J03k2m0J60q0k4K9NK91
5887B44j95k61N92m19qN71m68q8M8j63J30J67k19Q2K15J22m06j74L55j56j95M57
5909B31n35L16P2k16j37L25n0l37L41K73k45o8O4o9l59N07k89J82K40l63M1K02
5931A26j10l10K87qJ86l47M67j66k2J72k22l03J05J10k06M27j92n5J10K3j46J90
5953A16j08R7l31L64L6l73J75n8j94K11J20m01J49M72k60J2J97k85j71M12k09
$$ plain form
5974 -29 -207 -219 -308 -221 23 95 -115 285 126 223 319 58 145 230 -102 39 -388 -162 -30 -245 -5 -80 64
5997 64 356 207 -93 109 112 235 50 8 -165 -191 -20 -40 -314 158 149 73 -51 117 -40 109 -63 -144 -123 -103
6021 -103 -184 -329 130 254 13 96 476 151 77 55 82 -160 -42 -16 -431 -51 123 -40 107 201 51 193
6043 193 370 -94 24 -52 306 -4 -119 28 -564 -109 128 -55 283 364 256 131 183 -206 -174 -98 -195 -283
6065 -283 -245 -321 -239 -93 144 -11 161 345 -30 -36 -22 369 -406 -154 -53 -286 4 96 -164 52 64 -263 48
6088 48 208 -33 -9 -29 -236 -149 -97 102 -133 41 380 -19 -113 184 -142 -61 141 -23 51 115 -225 -162 6
6111 6 59 -231 -39 512 145 138 234 100 -202 234 56 1 94 155 -362 -41 153 -38 -72 119 38 28 92 -13
6135 -13 -165 75 -244 -418 343 -19 -115 59 263 -16 -24 152 -177 -182 327 -92 -93 450 -165 -191 203 23 65
$$ packed form
5974b9j78j2q9Q7K44P2k10M00j59R7R6k61Q7Q5l32J41m27K26J32k15K40p5J44
5997F4K92j49l00K02LJ23j85m2j73k6J71k0k74M72rp6j24J68j57J49j72q1K1K0
6021a03q1j45M59J24k41Q3L80l25p4k2K7k42J18K6m15L80J74j63J47R4j50J42
6043A93J77m64J18p6L58l10j15J47n92M55K37j83L38Q1j08j25N2l89L2P6r7q8
6065b83L8p6Q2J46K37j55J72J84l75oJ4L91p75K52J01k33K90R2k60K16J2l27L11
6088D8J60k41K4k0k07Q7N2J99k35J74L39l99r4K97l26Q1K02j64P4O4l40O3J68
6111FN3k90J92N51l67pR6j34l02M36j78n5R3O1n17L21J94j91l4J91q1j0O4j05
6135a3j52K40l19j74P61l62r6J74K04k79qJ76l29nN09m19jN43o15k6L94j80M2
$$ plain form
6158 65 59 21 33 137 250 -207 -171 202 97 -227 -249 -20 -288 185 3 -116 8 9 -142 144 351 -164 -20
6181 -20 47 89 -33 -50 152 -107 83 61 -209 28 -11 -40 37 64 41 22 112 143 -345 84 -25 -302 -307 4 -155
6206 -155 14 -121 -40 -67 241 -33 -69 179 -64 -76 -307 239 -323 -45 46 -100 154 222 28 54 150 74 35
6229 35 -13 0 -242 101 105 -77 -115 307 132 79 383 -22 49 135 104 -169 -34 -123 -285 -377 84 -77 68 290
6253 290 40 46 439 -45 135 319 -142 -270 -464 110 -358 -41 0 23 199 13 206 57 444 91 -179
6274 -179 -206 -258 -269 -77 49 119 126 181 154 -53 297 8 -260 162 -244 -202 32 88 -216 -299 66 103 -182 249
6298 249 283 -61 164 85 -331 -69 48 -269 -92 -158 -139 7 103 258 276 322 -26 4 248 -56 -225 150 -134
6321 -134 -152 -59 34 -128 9 -72 78 -19 193 200 3 58 -309 -374 -82 166 -395 -31 199 -67 0 234 9
$$ packed form
6158F5ol8J2J04J13m57L6L73j05l24k2K29k68M73j82j19J24Jj51K86K07n15J44
6181b0O7M2j22j7K02k59J90k2k70K37l9k9P7K7k3j9R0L1m88M29j09k77nL11j59
6206a55J69j35Q1k7L08k74l6K48k43j2k31N46n62K78R1j46K54O8j94K6R6p6l9
6229C5m8J3k42L43Mj82l8M22j75n3L04m05P1Q6l1k73J35q9j62r2M61j61J45K22
6253B90k50OL93m84J80J84m61j28j94N74m68L17M1K3J76j86J93j49L87l53k70
6274a79k7n2j1J92J26P0PN5k7k07L50k89k68M22m06M2K34N6l04q3L65L7k85M31
6298B49L4l44K25p9m16K62J17l17J77o6J9J46R6J55J8M6l48L0K44l04j69L75k84
6321a34j8R3R3j62J37q1J50r7K12Pj97N5l67o5K92K48n61L64K30k66O7K34k25
$$ plain form
6344 9 9 91 218 -249 -159 27 -223 -93 38 -83 309 348 126 213 305 -59 -20 96 -34 -89 71 152 -177 212
6368 212 -21 -192 -16 315 -66 -34 168 -360 -179 162 -197 -182 5 59 -117 137 144 81 68 223 122 3
6390 3 59 -17 116 175 -82 10 3 -171 -88 -76 24 82 173 123 17 -219 -108 151 -313 142 15 -91 17 -101
6414 -101 -413 16 54 -197 -15 113 -348 -102 148 -202 54 157 150 -105 -74 137 -301 -132 -92 -338 170 -107
6436 -107 67 -81 -17 -119 -144 89 -2 -368 -122 216 -40 -23 -11 54 176 58 135 -100 232 -6 -230 -92
6458 -92 117 -251 -179 141 -111 69 35 75 201 103 -58 -99 -25 -190 76 -247 176 -198 -196 18 -76 -73 339 -41
6482 -41 -3 96 -35 60 -146 58 -23 -136 172 -36 133 245 96 226 31 -88 -183 90 -127 -49 -182 61
6504 61 96 -150 104 -103 -64 468 300 83 187 118 -138 -91 -5 -305 -177 -10 -99 -19 195 324 118 394 161
$$ packed form
6344I%Q2J27m67R0J86k50J30J31j21L92L9k22Q7R2l64L9J16j30n5J60Q1l29L89
6368B12k33j71J76L31l81L2K02n28J81L41l59J5J87N4j76K54Po3j3J55j01j19
6390CN6p6J33N9k57R2pj74Q3J2J00N8R1n0j06k36J11K59m64M55j27j06J08j18
6414a01l12M29L8k51J82J28m61K46K50l50K56J03pk55L1K11m38J69M0k46N08k77
6436a07J74j48O4j02k5K33r1l66K46L38k56J7J2O5J22j18P7k35L32k38k24J38
6458i2K09l68P2L20k52J80l4M0J26r8j61m1P4j65K66l23M23l74KK14r4LM12l80
6482d1L8R9j31R5k06K04q1j13L08k08J69J12j49J30j95j19r5K73k17P8j33K43
6504F1L5k46K54k07L9N32j68k17J04o9k56M7Q6l00J28J67q9Q0K14J29k06K76k33
$$ plain form
6527 161 -91 34 47 -14 -47 3 -235 -36 -356 -138 -56 105 221 133 293 -61 -349 178 26 -286 -99 -67
6549 -67 -276 51 -175 130 -60 88 245 -22 199 77 -203 -62 45 -417 -29 14 -24 -112 66 75 266 317
6571 317 90 -60 147 52 -323 -283 -127 -247 32 6 15 239 176 66 24 13 77 -492 -148 -54 -572 -204 207
6594 207 -232 -78 317 98 -8 -3 98 50 92 34 -63 42 204 -133 -145 231 -131 147 164 227 51 241 -148
6617 -148 -21 122 -35 -27 109 186 -73 -126 -3 -90 354 48 -80 -147 203 -15 -373 -4 -229 -274 -15 24 -43
6640 -43 -83 230 248 -80 125 -10 -238 290 -201 -141 161 -83 -132 -142 -52 -30 36 -69 61 -6 -53 -99 -128 277
6664 277 -81 -152 304 185 -271 250 85 26 23 255 151 123 307 -230 81 93 148 12 -54 -33 -281 51 -43
6687 -43 70 -57 280 -14 -163 35 77 -206 214 118 13 198 -192 -187 -116 -28 76 -1 128 -52 259 10 15
$$ packed form
6527A61k52J25J3o1l3N0k38J99l20K18Q2J61J16q8J60l54k88N27j52l12J87L2
6549f7k09L27k26L05j90J48J57k67K21j22k80J41J07m62L88M3l8q8J78RJ91N1
6571C17k27j50K07r5l75M0J56j20K79k6RK24o3j10m2j1O4n69L44R4n18L68M11
6594B07m39J54L95k19j06NJ01m8M2n8r7J05J62l37j2L76l62K78J7O3j76J90l89
6617a48J27J43j57QJ36P7k59n3J23q7M44l06j28o7L50k18l58L69k25m5K59L9o7
6640d3m0L13J8l28K05j35k28N28m91O0L02k44m9j0R0K2O6j05J30o7m7m6k9M05
6664B77l58p1M56j19m56N21j65n9lK32j04k8J84n37L11J2N5j36o6K1k48L32r4
6687d3J13j27L37k94j49J98M2k83M20r6j05J85l90NP1Q8J04p7J29j80L11k49N
$$ plain form
6710 15 -218 -16 -69 -29 10 52 -60 41 115 92 -43 118 215 27 191 108 -110 -50 -242 -124 -1 103 42 -338
6734 -338 238 236 87 101 26 117 146 2 -234 -292 -194 -255 143 115 46 100 217 187 -197 289 -53 -195 -113 -11 -201
6759 -201 -70 -149 67 18 21 323 -2 159 239 -63 -239 103 -171 106 -83 -122 -133 31 1 -102 -63 263 -3
6782 -3 27 20 -105 155 -34 -408 -47 237 -91 219 181 318 1 284 292 -174 -24 72 -202 -197 -56 -171 19 169
6806 169 -86 155 85 6 111 12 93 -49 107 222 -290 -258 -176 -388 150 31 87 321 292 -1 96 28 -156
6829 -156 -71 51 -70 -110 -293 142 -88 76 307 223 210 319 69 83 -44 120 -207 -14 3 -29 -245 210
6851 210 -140 123 123 -58 406 78 -30 -172 -138 142 -45 -218 21 161 -63 17 77 -140 299 179 -20 257
6873 257 -23 -187 53 -99 -44 -250 223 113 -80 279 -8 51 106 90 -283 -86 -13 -136 -181 15 -35 19 108
$$ packed form
6710A5k33K02n3M0L9M2j12J01P4k3j35J61R7j88J64q3k18O0j92J18J23J04o1l80
6734c38N76kj49J4p5R1K9j44k36n8R8o1L98k8o9N4J17l0l84M86l42j42Q2J02j90
6759b01J31p9K16m9LL02l25J61Q0l02j76L42k74K77j89l9j1J64l0j03L9L26k66
6782cL0pj25K60j89l74L61K84l28L10l8J37l17K83Qm66J50R6k74NJ41j15J90J50
6806A69k55K41p0p9J05r9Q1j42J56J15n12L2Q2k12N38j19N6K34k9k93R7o8j84
6829a56Q5J22j21m0j83M35k30J64K31q4j3J09k50J4j27J64l27J93J7l2k16M55
6851B10l50K63%j81M64l28j08j42L4K80j87j73K39J40k24Q0O0k17M39j20j99K77
6873B57k80j64K40j52N5k06M73j10j93L59k87N9N5j6l73J97P3j23m5J96n0N4Q9
$$ plain form
6896 108 8 16 49 52 -160 -123 154 -297 -99 104 -165 107 19 9 -48 90 -50 184 144 307 -42 -186 -49
6919 -49 -276 37 8 -259 24 266 13 -303 13 -342 98 71 21 -270 53 209 -71 -103 -92 -202 -92 110
6941 110 -239 27 86 -9 -181 41 61 -5 -64 385 -162 -83 -53 35 -7 263 50 -127 -21 -232 -2 120 200
6964 200 -40 -83 -173 -208 -177 362 -151 -181 -91 182 157 179 95 -18 207 73 98 202 -121 -158 -136 -38 -69 -195 -155
6989 -155 116 -106 180 250 -23 300 82 27 -315 -152 -267 -220 -6 -14 -22 98 -207 144 191 4 -221 114 76
7012 76 -96 -119 -42 41 -35 86 117 23 297 340 228 227 193 38 51 -202 -2 -90 -76 -74 61 216 298 203 200 -27 -48
7039 -48 47 -125 -217 -161 -204 -363 -190 -88 -8 101 158 174 -7 145 276 38 86 152 -330 -202 -91 -27 -151 117
7063 117 201 -98 226 283 31 132 -28 -134 -74 -198 -63 -262 -37 -116 -279 -134 76 -76 96 22 -98 123
$$ packed form
6896A08j00QL3Lk12L7K77m51J98K03k69K72q8j0n7J38j40K34m0J63l49j44J37
6919d9k27L13k9k67K83K42k53l16L16l55M40k7n0k91L23J56k80l2J1j10J10K02
6941A10l49K66N9r5j72K22K0o6n9M49n47P9L0Q8m2K70k13j77J06k11K30J22Q0
6964B00k40m3r0l5L1N39n13l0R0K73k5K2q4j13K25j34K5J04l23l7K2R8l1j26M0
6989a55K71k22K86P0k73L23k18n5l42J63j15M7K14qqJ20l05L51M7j87k25L35l8
7012G6j72k3P7Q3p6J21L1r4K74M3j12jl4j55J3k53K00q8J4KJ35J55Q2r5lk27k1
7039d8R5j72r2N6m3j59J73J02Q0J09N7J6j81J52J31k38M8O6m82J28J11O4j24K68
7063A17Q4k99L24N7k52J01j60j06O0j24J35j99K25p9j63J45K10j52J72p4j20K21
$$ plain form
7085 123 41 -133 129 267 -290 -411 102 0 -70 185 -29 50 256 190 -19 -74 106 -109 116 -178 -231 -125
7107 -125 133 54 180 29 173 -54 3 -130 -110 -40 -177 44 -98 32 125 185 410 285 82 135 38 -195 -31
7130 -31 192 -112 -152 -71 23 193 53 -154 -54 -27 42 -164 34 313 -350 -342 -94 -142 37 89 -9 39 158 5
7154 5 209 -137 -212 -123 -94 254 -80 -149 178 -112 -82 -22 1 147 211 -106 13 194 2 -204 101 -85 -42 -89
7178 -89 -35 -113 -88 133 -172 -8 -90 158 104 -36 66 70 43 -75 -163 169 49 -143 -252 101 -84 -258 63
7201 63 160 -34 248 -52 4 0 -13 -52 -375 140 -12 20 289 -283 79 44 77 287 87 18 73 -45 -141 84
7225 84 30 103 -248 -171 123 2 -66 268 4 37 285 269 -133 -141 -280 -213 54 -61 -194 -194 142 -234 -12 350
7249 350 -132 -31 78 -145 -126 -131 120 12 72 18 324 -129 374 290 184 327 172 -258 63 24 -171 -283
$$ packed form
7085A23q2j74K62J38n57j21N13j02p0K55k14P9K06o6k09n5J80k15K25k94n3J06
7107a25K58p9J26j51J44k27N7j33K0P0j37K21j42J30R3O0K25j25k03N3r7k33J64
7130c1K23l04m0Q1R4J70j40k07J00K7O9k06J98K79o63QK48m8J79N2r8M8J19j53
7154EK04l46p5Q9K9L48l34o9L27k90L0O0K3J46O4l17J19J81j92k06L05j86M3m7
7178h9N4p8K5K21l05J64q2K48n4j40J02Mk7j18q8L32j20j92j09L53j85j74L21
7201F3R7j94K82l00N6mj3l9l23N15j52L2K69n72L62l5L3K10k00o9N5j18r6K25
7225H4n4P3l51P7K94j21o8L34k64L3K48j6m02qj39O7K67j15j33%L36l76K22L62
7249C50m82J01J09k23J9nK51j08O0n4L06m53N03q4j06J43j55m30L21l9j95j12
$$ plain form
7271 -283 19 2 37 4 20 -46 -84 248 -236 -16 -119 -289 -215 -252 -80 -78 80 94 267 142 222 5 123 -22
7295 -22 -244 -86 198 -308 -27 -90 19 -113 13 45 203 378 469 2 -143 -77 -79 54 -138 -215 -86 20 -16
7318 -16 21 -75 -127 79 187 259 -149 -251 160 -179 -180 -40 -237 -90 409 92 151 -68 348 -240 162 150 -157
7341 -157 -66 203 -31 -56 -31 -504 -204 228 -33 -185 268 69 61 114 -42 -81 -120 -78 -221 -292 -76 88 36 0
7365 0 121 -131 236 -77 -87 -208 155 -130 -262 58 35 15 -17 -182 21 157 10 -52 38 122 -55 18 44 -209
7389 -209 -202 159 -64 68 238 238 -26 -40 45 -130 35 -10 34 -21 332 1 -149 -90 97 -145 362 224 -118
7412 -118 -16 47 52 -42 42 222 -288 334 92 152 45 113 -256 389 -91 -324 -45 -47 120 -121 147 -154 -230
7435 -230 -49 151 -261 25 -20 63 97 28 -147 223 -160 141 -128 -128 0 -58 -81 -47 -243 90 116 -15 291
$$ packed form
7271b83L02j7L5l3J6o6l8L32m84K20j03j70P4l7J72KJ58J4J73j25Q0k17J18j45
7295b2k22J58K84n06K81o3J09j32J26L2J58J75R1m67j45O6kJ33j92p7J29J06l6
7318a6L7r6n2K06J08P2m08j02M11l39jJ40j97J47M99l17N9k19M16n88M02j2l07
7341a57R1K69k34k5K5m73L00M32k61j52M53j99qN3j56l9l9M2j43p1K16J64n2l6
7365@J21k52L67l13j0j21L63k85j32L20k3k0l2j65K03J36j47o2R0Q4j77P3K6k53
7389b09PL61k23J32J70%k64j4Q5j75J65m5M4n5L53l31j50N9J87k42N07j38l42
7412a18J02O3Nr4Q4J80n10O22k42O0j07O8l69O45m80k33K79kJ67k41K68l01p6
7435b30J81K00m12K86m5Q3L4o9j75L70l83L01k69%J28n8k3L4j96L33K6j31L06
$$ plain form
7458 291 -154 72 249 0 -304 75 -148 -228 12 23 -181 -82 105 46 -46 187 41 -221 257 223 -157 -64
7480 -64 -109 37 -89 217 -310 -226 -62 -78 -140 11 -92 11 74 7 -32 -66 135 73 -107 288 186 -85 151
7503 151 200 -169 -41 -75 -236 -31 -198 -189 -137 145 -159 131 16 220 126 114 194 21 -227 86 -4 -278 -215
7526 -215 -115 47 -151 -51 -31 41 118 85 72 285 -69 -153 17 -367 126 103 -39 -74 -117 72 286 59 -62
7549 -62 232 -60 14 -232 23 74 -152 -307 18 -124 -101 103 276 82 96 117 -113 115 39 -41 -375 4 59
7572 59 -189 -93 80 74 190 263 -16 57 23 -171 14 99 -117 6 -190 12 -27 71 91 -94 209 142 -23 -2
7596 -2 -49 -280 -257 4 -181 -238 37 -171 -80 -91 180 -87 242 53 25 111 -352 36 -95 -46 54 -57 389
7619 389 199 -222 -62 -15 107 251 -9 -191 -11 60 -199 41 151 8 213 183 199 7 -3 200 -422 -87
$$ packed form
7458B91m45K26J77k49l04L79k23q0K40J1k04R9J87n9r2K33j46k62M78l4l80R3
7480f4m5J46j26L06n27Q4J64j6o2J51j03J03O3o7l9l4K01o2j80L95j02k71K36
7503A51M9l69J28l4j61K05j67RN2K82l04K90j15K04r4j2Q0j73k48L13r0k74O3
7526b15J00J62j98J00K0P2P7l3j3K13l54q4J70l84M93k3j42l5m3J89K14k27j21
7549f2K94k92P4k46K55N1k26j55L25j42K3K04J73j94J4K1k30K28p6q0l34L79N5
7572E9k48R6J73oJ16P3k79P3l4j94J85Q5k16J23j96K02l9R8K0j85L03o7j65K1
7596bm7k31K3K61j85n7K75k08R1j1K71k67L29j89k8Q6m63L88j31M9J00j11M46
7619C89j90m21J60M7J22J44k60j82J80P1k59K40J10j43K05l0J6j92j0K03o22L35
$$ plain form
7641 -87 22 -133 -258 -58 -260 -222 -16 -42 128 29 -181 -58 -239 -28 -43 10 -17 35 -251 -24 -46 -56 108
7664 108 170 -271 -84 103 -76 163 191 -19 -261 128 70 -113 177 -7 75 -7 -133 -94 -293 107 -3 5 81
7687 81 -54 -81 -55 -222 2 184 34 40 70 28 -135 15 99 100 -42 -34 -9 85 37 -228 -117 98 18 -69 39 -268
7713 -268 118 -44 -32 -64 -239 46 33 -158 37 -37 75 22 23 -312 66 252 145 157 81 109 121 122 -132 -73 -232
7738 -232 -131 -225 -34 -45 -86 141 69 87 -249 195 9 -35 4 -89 -189 10 -185 216 147 77 66 -13 81 -64
7762 -64 -114 2 8 -285 119 -312 -144 -38 127 272 -32 280 53 -31 133 280 -105 68 174 -138 -78 -202
7784 -202 -30 -4 -44 69 29 -205 109 196 285 -201 118 -3 -132 -186 -41 129 -233 64 -62 -98 155 -2
7806 -2 90 -65 -39 -117 -108 -24 131 -199 35 -3 -27 21 -24 155 4 -121 -23 -55 10 -239 -186 -81 96 -214 165
$$ packed form
7641h7J09j55j25K00k02L8K06k6J70r9k10J23j81K11j5N3k7N2k86K27k2j0J64
7664A08O2m41J87J87j79K39K8k10k42L89n8j83K90j84Q2q2j26L9j99M00j10QP6
7687H1j35k7K6j67K24J82j50OL0m2j63J50Q4Jj42QK5R4m8k65J11K15q0q7J08l07
7713b68L86j62J2l2j75K85j3j91J95p4J12n3Jl35L78J86j07J2p6K8J2Jk54N9j59
7738b32J01r4J91j1m1K27p2J8l36M44j86m4L9r3j00J99j95M01o9p0j1p9R4j45
7762f4n0J16Ok93M04m31J68J06J65J45l04L12k27q4J64J47l85J73J06l12O0j24
7784b02J72K6m0J13m0k34L14Q7Q9m86L19j21j29n4J45J70l62K97j26l6K53j57
7806bR2j55K6p8RQ4J55l30K34l8k4M8m5J79j51j25R8l2O5k49N3J05J77l10L79
$$ plain form
7831 165 66 228 136 32 -94 103 106 -153 -238 156 59 -302 78 29 -50 116 180 -55 212 85 82 47 34 -174
7855 -174 -119 -212 -116 -52 -123 179 102 101 38 -74 -29 82 -98 -96 -15 273 -209 165 -23 6 -16 15 133 43 190 -53
7881 -53 -36 39 -209 43 80 142 57 95 -101 -20 6 20 -65 64 158 -51 154 -8 -148 118 -11 -290 -125 -2
7905 -2 -26 207 -5 281 285 -89 -117 33 83 258 70 -120 23 106 -39 344 171 -105 85 37 155 -190 69
7928 69 -33 -40 -130 40 -103 90 172 -353 -36 227 -34 -221 -38 18 -143 -37 -101 -5 -59 155 -27 94 138
7951 138 33 15 -104 79 -136 -2 -73 -1 119 58 -48 -87 160 -111 -90 -82 -185 55 253 -140 360 -56 61
7974 61 -111 -144 89 -148 82 -8 45 -334 -112 -37 81 55 -107 23 6 113 -175 -45 85 -275 -140 109
7996 109 -81 -20 109 110 -27 171 20 90 -48 14 34 -16 35 24 -87 10 -62 65 148 267 64 205 -38 91
$$ packed form
7831A65r9J62r2j04j26J97Lk59q5L94r7l61L80m9p9J66O4k35K67j27ll5j3k08
7855a74N5r3R6O4p1L02p7jo3j12M5J11j80KQ1K88m82L74j88K9k2L1J18r0J47k43
7881e3J7P5k48K52L7O2q5L8j96Q1K6J4q5J29R4k09K05j62j40K66j29k79J65J23
7905bk4K33k12K86Ml74k8J50N0J75j88j90J43Q3j45L83j73k76J90m8J18l45K59
7928F9j02pr0J70j43J93Q2n25L17K63k61j87J83N6j61J06o4R6n4K14j82J21M4
7951A38j05j8j19J83k15J34p1P2J20o1j06l9K47k71K1Qj03K40J98l93N00m16J17
7974F1j72l3K33k37K30r0N3l79K22P5J18k6j62J30j7J07k88J30J30l60J35K49
7996A09j90O1J29Jj37J98j51P0j38O2K0n0N1j1j11R7p2J27Q3J19k03J41k43J29
$$ plain form
8020 91 31 -63 -305 147 135 -55 -29 71 -135 -75 222 -41 -104 281 38 -68 75 12 -222 -116 -49 -276 9
8043 9 202 195 -78 -21 -37 15 -20 -165 -128 -27 -45 -64 -15 -33 -253 -173 44 44 48 139 -196 6 6 15 104 28 22 92 233
8072 233 -68 186 -68 205 -75 17 151 319 -172 -78 -75 -26 -11 105 -45 -3 348 -27 -161 156 -62 -75 -42
8095 -42 39 107 39 14 -230 6 26 196 -77 257 42 -44 284 -150 -134 -42 -95 -300 64 -165 -44 -72 224 14
8119 14 -3 2 211 1 16 -175 -113 179 -269 75 58 -64 -50 41 11 -94 106 120 -238 -190 35 -181 273 35
8143 35 39 -24 137 192 53 -62 22 -99 72 -244 111 -154 -90 -118 -215 58 -225 -34 196 -51 92 -6 -135
8166 -135 142 -140 130 -65 -326 -193 -114 -159 43 -48 37 304 198 64 -174 46 125 -240 -7 50 -183 331
8188 331 118 -138 211
$$ packed form
8020I1o0r4k42M52j2j90K6J00k06O0K97k63o3L85k43j06J43o3k34J06O7k27K85
8043IJ93pk73N7j6N2l5j45L7J01j8j9M9j8k20Q0K17%MR1l35K02%RQ9p6oP0J41
8072B33l01K54k54K73k80R2J34J68m91R4LM9J5J16j50M2L51l75j34L17k18j3L3
8095d2Q1O8o8k5k44K36K0J70k73L34k15q6L28m34J6R2n3k05L64k29J21k8K96k10
8119A4j7NK09k10J5j91O2K92m48L44j7j22J4R1l0j05K00J4l58M8K25k16M54k38
8143C5Mo3J61N5j39j15Q4j21J71l16L55k65O4k8r7K73k83J91K30k47J43r8j29
8166a35K77k82K70j95k61J33P9m5K02r1Q5K67j06j34k38K20P9l65K33N7k33N14
8188C31k13k56L49
8191B11
$$ Imaginary data points
##PAGE= N=2
##DATA TABLE= (X++(I..I)), XYDATA
$$ plain form
0 0 0 0 0 0 8 -8 8 -8 16 -16 24 -24 32 -40 53 -64 72 -88 104 -123 144 -168 193 -222 256 -293 333 -377
28 -377 428 -482 544 -610 683 -762 852 -948 1055 -1169 1297 -1437 1592 -1763 1951 -2161
44 -2161 2392 -2656 2953 -3291 3682 -4138 4677 -5329 6134 -7154 8498 -10354 13093 -17530
58 -17530 25889 -46962 202265 276812 -247388 102785 214897 -115943 -52287 115617 -108018
69 -108018 -127793 50803 -51839 -144841 106322 28196 -144931 140942 134904 -153091 68871
80 68871 155508 -110621 -56617 69753 -48421 -64798 18303 -18102 -39313 81705 33371
91 33371 -77645 88412 83712 -110366 33425 74134 -121030 -25980 57336 -76090 -44066
102 -44066 48417 -4589 -19844 68891 39485 -45972 59923 60888 -101344 58 60911 -105985
$$ packed form
0@%%%%Qj6J6j6K4l2M0m8N6p2R3j17J36j60J92k27K67l12L61m15M78n49O26p10
28c77Q05r10J026j154J293j445J614j800K003k224K466k734L029l355L714m112
44b161M553n048N609o244O973p820Q815j0006J1463j3288J5652j8852K3447l0623
58a7530M3419p2851K49227P4547n24200L50173J12112l30840O3656J67904k23635
69a08018j9775J78596j02642r3002K51163p8126j73127K85873o038k87995K21962
80F8871Q6637k66129N4004J26370j18174j6377Q3101l6405k1211J21018m8334
91C3371j11016J66057m700j94078J43791M0709j95164R5050Q3316j33426L2024
102d4066R2483n3006j5255Q8735k9406q5457J05895R65j62232J01402O0853j66896
$$ plain form
114 -105985 -40578 54400 -52400 -24223 58433 1424 -9478 69207 43615 -43879 31139 59735
126 59735 -84567 -25089 59496 -93983 -57516 72128 -38850 -50054 66785 18144 -32989
137 -32989 46458 49958 -40977 6721 60515 -58347 -31216 75306 -52044 -62827 72305
148 72305 -10719 -51278 53642 12327 -44771 25684 33710 -40642 -14996 37395 -31836 -24163
160 -24163 53789 -29025 -34687 73469 -8491 -48278 63177 15710 -52994 26110 26759 -47959
172 -47959 -8751 35851 -36943 -35034 49057 -10102 -40125 53245 1962 -42794 58950 19269
184 19269 -59162 27259 38676 -46995 -14669 33937 -28386 -36418 36485 -4154 -47141 38324
196 38324 24242 -41114 34384 36292 -38547 18928 41853 -35804 -16530 32539 -20895 -43458
$$ packed form
114a05985O5407R4978j06800K8177Q2656n7009j0902P8685k5592q7494P5018K8596
126E9735j44302N9478Q4585j53479L6467J29644j10978j1204J16839m8641n1133
137c2989P9447L500r0935M7698N3794j18862K7131J06522j27350j0783J35132
148G2305q3024m0559J04920m1315n7098P0455Q026p4352K5646N2391o9231P673
160b4163P7952q2814n662J08156q1960l9787J11455m7467o8704P9104O49p4718
172d7959L9208M4602p2794J909Q4091n9159l0023R3370n1283m4756J01744l9681
184A9269p8431Q6421J1417q5671L2326M8606o2323q032P2903m0639m2987Q5465
196C8324j4082o5356P5498J908p4839N7475K2925p7657J9274M9069n3434k2563
$$ plain form
208 -43458 17502 3123 -44269 13409 24336 -34740 19563 44869 -29067 4151 45744 -19888
220 -19888 -15703 29593 -12979 -32592 17380 9154 -32643 6183 27139 -22645 3838 34686
232 34686 -25660 -9265 32457 -26661 -24899 26517 -12400 -27937 21256 14205 -16529 16489
244 16489 32080 -14598 -481 35489 -20308 -25405 23454 -24334 -34797 22661 -8257 -27252
256 -27252 25994 20242 -9449 18277 31397 -8207 -7759 23406 -19215 -35692 14119 -20100 -42734
269 -42734 20199 2412 -24923 28673 26159 -6370 19752 31468 -5986 -12618 18984 -9202
281 -9202 -39203 9202 -2843 -39676 16867 14885 -26014 20703 26994 -14931 4067 19083 -12047
294 -12047 -22280 8092 -2564 -34252 10173 20044 -25730 19437 36109 -14953 15423 27481
$$ packed form
208d3458O0960j4379m7392N7678J0927n9076N4303K5306p3936L3218M1593o5632
220a9888M185M5296m2572j9613M9972q226m1797L8826K0956m9784K6483L0848
232C4686o0346J6395M1722n9118J762N1416l8917j5537M9193p051l0734L3018
244A6489J5591m6678J4117L5970n5797n097M8859m7788j0463N7458l0918j8995
256b7252N3246n752k9691K7726J3120l9604M48L1165m2621j6477M9811l4219k2634
269d2734O2933j7787k7335N3596k514l2529K6122J1716l7454o632L1602k8186
281i202l0001M8405j2045l6833N6543j982m0899M6717O291m1925J8998J5016l1130
294a2047j0233L0372j0656l1688M4425R871m5774M5167J6672n1062L0376J2058
$$ plain form
306 27481 -18626 -5786 8802 -20757 -28111 -1244 -590 -26710 6326 27234 -15807 16760 41541
319 41541 -14977 5983 27464 -24692 -14837 6365 -24015 -25916 2798 3108 -18746 11016 37217
332 37217 -9393 8565 46042 -12817 -7741 27422 -25171 -25038 10356 -17565 -25508 3931 7778
345 7778 -12581 4477 31187 -9555 -6412 36364 -15372 -23214 26264 -16251 -25902 19206 -2743
358 -2743 -13759 16664 17412 -4146 4132 27265 -7437 -19425 22154 -17372 -35464 18913 -15050
371 -15050 -32177 23229 4772 -14655 21798 21192 -3379 4621 23298 -6998 -22698 19439 -9659
384 -9659 -38545 19261 -1211 -32037 24582 13036 -16573 21119 20683 -8502 1028 17766 -7350
397 -7350 -23779 12435 -4465 -35455 16119 5134 -33407 20274 16877 -22695 14947 18340 -14249
$$ packed form
306B7481m6107J2840J4588k9559p354K6867O54k6120L3036K0908m3041L2567K4781
319D1541n6518K0960K1481n2156R855K1202l0380j901K8714L10k1854K9762K6201
332C7217m6610J7958L7477n8859N076L5163n2593J33L5394k7921p943K9439L847
345G778k0359J7058K6710m0742L143M2776n1736p842M9478m2515r651M5108k1949
358b743j1016L0423P48k1558Q278K3133l4702j1988M1579l9526j8092N4377l3963
371a5050j7127N5406j8457j9427L6453o06k4571Q000J8677l0296j5700M2137k9098
384i659k8886N7806k0472l0826N6619j1546k9609L7692m36k9185R530J6738k5116
397g350j6429L6214j6900l0990N1574j0985l8541N3681l397l9572L7642L393l2589
$$ plain form
410 -14249 640 17310 -6070 -16642 16628 5557 -26725 18645 16602 -30158 15311 20014
422 20014 -28864 5509 16675 -24183 -9108 13095 -9241 -18663 12798 8077 -22311 15274
434 15274 23874 -24812 10658 28711 -23590 1138 23489 -18932 -9948 15009 -7829 -17668 9385
447 9385 7559 -21460 5889 21695 -21557 2624 28058 -20526 -2899 27041 -16876 -12357 18367
460 18367 -8073 -19121 8713 5098 -21577 3360 21521 -17767 -501 32720 -12715 -5819
472 -5819 32259 -9385 -14637 20885 -5690 -22846 6969 3360 -23276 -2059 17307 -15773 -6727
485 -6727 27491 -9725 -11918 28848 -5594 -19193 20499 -169 -21016 11032 9430 -16099 3717
498 3717 20471 -9305 -5194 24255 -7858 -18116 20118 -7856 -27715 13160 -1455 -25710
$$ packed form
410a4249J4889J6670k3380j0572L3270j1071l2282M5370k043m6760M5469M703
422B0014m8878L4373J1166m0858J5075K2203k2336r422L1461m721l0388L7585
434A5274Q600m8686L5470J8053n2301K4728K2351m2421Q984K4957k2838r839K7053
447I385j826k9019K7349J5806m3252K4181K5434m8584J7627K9940m3917M519L0724
460A8367k6440j1048K7834l615k6675K4937J8161l9288J7266L3221m5435O896
472e819L8078m1644n252L5522k6575j7156K9815l609k6636K1217J9366l3080R046
485f727L4218l7216k193M0766l4442j3599L9692k0668k0847L2048j602k5529J9816
498C717J6754k9776M111K9449l2113j0258L8234k7974j9859M0875j4615k4255
$$ plain form
510 -25710 11281 13515 -14122 7192 24351 -5064 -3734 23010 -5604 -21276 14059 -5027
522 -5027 -30852 9259 4897 -23821 10656 20464 -9612 8733 25711 -3791 -5836 17742 -6266
535 -6266 -24336 6011 -4020 -30606 4711 9024 -21673 8813 24249 -9054 5189 25253
547 25253 -5223 -7933 14722 -5000 -20810 6823 2153 -22400 7298 17559 -15753 6141
559 6141 24998 -11621 -3408 18242 -13670 -17812 8459 -8831 -22079 5823 7627 -13983 10232
572 10232 25019 -7216 5027 28118 -8932 -10540 15771 -13651 -22406 5738 -6947 -19186
584 -19186 6630 10004 -8084 9195 24057 -3972 -651 21831 -9421 -16522 12179 -13564 -24683
597 -24683 8013 -2864 -16553 10066 12665 -4760 8772 21666 -3086 -5023 18834 -7719
$$ packed form
510b5710L6991K234k7637K1314J7159k9415J330K6744k8614j5672L5335j9086
522e027k5825M0111m362k8718L4477R808l0076J8345J6978k9502k045K3578k4008
535f266j8070L0347j0031k6586L5317M313l0697L0486J5436l3303J4243K0064
547B5253l0476k710K2655j9722j5810K7633m670k4553K9698J0261l3312K1894
559F141J8857l6619Q213K1650l1912m142K6271j7290j3248K7902J804k1610K4215
572A0232J4787l2235J2243K3091l7050j608K6311k9422q755K8144j2685j2239
584a9186K5816L374j8088J7279J4862k8029L321K2482l1252p101K8701k5743j1119
597b4683L2696j0877j3689K6619K599j7425J3532J2894k4752j937K3857k6553
$$ plain form
609 -7719 -19998 13343 -6036 -23609 11736 4386 -15291 11007 13697 -8312 994 14465 -5781
622 -5781 -13545 8784 -5388 -20870 11270 2781 -18298 15205 13440 -8759 13683 14654 -6790
635 -6790 908 8460 -8245 -14104 2790 -6007 -20097 8023 5015 -16886 14366 14750 -12153 12083
649 12083 15342 -10999 -1443 8068 -7625 -13282 3105 -315 -16602 5951 11511 -14205 8367
662 8367 17606 -11441 4805 14989 -9952 -4080 7112 -5105 -9725 1892 3373 -12396 773
675 773 12013 -11686 133 14539 -12603 -1541 14336 -9783 -5430 9498 -1742 -5143 5752
688 5752 7348 -7218 486 14972 -8864 -4894 15626 -11654 -9570 13834 -9238 -11687 8336
701 8336 -1919 -8625 4738 7649 -6463 -1553 15954 -3445 -6436 17417 -4989 -10540 16257
$$ packed form
609g719j2279L3341j9379j7573L5345p350j9677K6298K690k2009R306J3471k0246
622e781p764K2329j4172j5482L2140q489k1079L3503j765k2199K2442R71k1444
635f790P698P552j6705n859J6894q797j4090K8120l008k1901L1252L84k6903K4236
649A2083L259k6341R556R511j5693n657J6387l420j6287K2553N560k5716K2572
662H367R239k9047J6246J0184k4941N872J1192j2217m620J1617J481j5769J3169
675G73J1240k3699J1819J4406k7142J1062J5877k4119M353J4928j1240l401J0895
688E752J596j4566P704J4486k3836L970K0520k7280K084K3404k3072k449K0023
701H336j0255o706J3363K911j4112M910J7507j9399k991K3853k2406n551K6797
$$ plain form
714 16257 -4880 -13091 9637 -2299 -10989 4048 4489 -7839 -2155 12823 -2825 -6367 17300
727 17300 -2168 -12466 16572 -2138 -16397 9477 -1502 -14970 3540 4427 -8625 -1552 12344
740 12344 236 -5659 16511 3328 -11923 13834 2144 -16491 7853 823 -15600 3165
752 3165 5146 -8004 -1575 8770 -23 -6702 10264 3005 -14616 6704 4365 -15728 5318
765 5318 5340 -11493 5898 11172 -3427 1350 10596 1659 -6807 5450 1359 -17417 -236 4002
779 4002 -17285 547 8839 -9650 4830 14761 -1496 1819 11838 622 -8246 3404 1382
792 1382 -17830 -3293 6174 -15050 -352 14221 -6625 2768 17733 -428 -1010 10746 -1188
805 -1188 -10686 784 406 -15856 -4249 7026 -11423 -1495 16027 -4447 -1423 16172 -1520
$$ packed form
714A6257k1137q211K2728j1936q690J5037M41j2328N684J4978j5648l542K3667
727A7300j9468j0298K9038j8710j4259K5874j0979j3468J8510Q87j3052P073J3896
740A2344j2108n895K2170j3183j5251K5757j1690j8635K4344p030j6423J8765
752C165J981j3150O429J0345q793o679J6966p259j7621K1320k339k0093K1046
765E318K2j6833J7391N274j4599M777R246q937q466J2257m091j8776J7181M238
779D002k1287J7832Q292j8489J4480R931j6257L315J0019j1216q868J1650k022
792A382j9212J4537R467k1224J4698J4573k0846R393J4965j8161n82J1756j1934
805a188r498J1470l78j6262J1607J1275j8449R928J7522k0474L024J7595j7692
$$ plain form
818 -1520 -5545 8126 -2911 -11350 1743 2175 -10314 -146 10941 -3836 1427 16515 -2308
831 -2308 -4683 11821 -5058 -12415 3195 -5908 -14487 252 2943 -7099 2229 13289 807
844 807 1556 16362 1868 -7008 8164 -2476 -14131 1048 -2525 -13950 632 6324 -4265
857 -4265 1919 12450 2493 -881 11782 1040 -10786 4234 -753 -15710 -236 1992 -11906
870 -11906 1688 9430 -3512 2042 12705 361 -4175 9011 824 -11920 3132 2906 -14173
883 -14173 1969 9015 -9330 1696 13228 -4312 -1618 10478 -3810 -9547 4364 -1715 -14258
896 -14258 779 4953 -11412 2339 13649 -5516 1924 16038 -2601 -2350 10603 -4147 -9482
909 -9482 3532 -2589 -12557 175 3958 -9580 1256 12023 -5580 -745 14444 -4139 -4998
$$ packed form
818a520m025J3671j1037q439J3093M32j2489J0168J1087j4777N263J5088j8823
831b308k375J6504j6879p357J5610r103q579J4739K691j0042R328J1060j2482
844H07P49J4806j4494q876J5172j0640j1655J5179l573j1425J4582N692j0589
857d265O184J0531r957l374J2663j0742j1826J5020m987j4957J5474K228j3898
870a1906J3594P742j2942N554J0663j2344m536J3186q187j2744J5052k26j7079
883a4173J6142P046j8345J1026J1532j7540K694J2096j4288n737J3911o079j2543
896a4258J5037M174j6365J3751J1310j9165P440J4114j8639K51J2953j4750n335
909i482J3014o121r968J2732L783j3538J0836J0767j7603M835J5189j8583q59
$$ plain form
922 -4998 10035 -4111 -9140 5103 -944 -9188 1790 5609 -6410 -482 11292 -3530 -3857 12287
936 12287 -2593 -7660 9804 -1845 -9176 5552 1478 -7101 1786 5121 -4974 -2920 8267
949 8267 -2832 -7686 8720 -1065 -9809 8146 953 -9009 6579 4201 -5803 3593 6641 -2637
963 -2637 -1665 7835 -743 -8234 7362 287 -12383 6138 1665 -12635 3999 3739 -8448 1782
977 1782 6307 -3058 -1609 8203 2030 -6083 7864 4404 -11107 5159 4446 -12681 1982 4629
991 4629 -9618 652 6058 -3773 -1100 7514 2230 -5054 5812 4874 -10477 2160 5118 -12876
1005 -12876 -356 5623 -9473 150 7318 -3240 -143 7468 2276 -3629 4295 5242 -8886 106
1019 106 6892 -10922 -1448 8180 -8009 -559 9173 -2834 -2161 5692 387 -5946 -206 3132 -9068
$$ packed form
922d998J5033j4146n029J4243o047q244J0978L819j2019N928J1774j4822l27J6144
936A2287j4880n067J7464j1649p331J4728m074q579Q887L335j0095K054J1187
949H267j1099m854J6406r785q744J7955p193r962J5588k378j0004R396L048r278
963b637R72R500q578p491J5596p075j2670J8521m473j4300J6634k60j2187J0230
977A782M525r365J449R812o173q113J3947l460j5511J6266p13j7127J4663K647
991D629j4247J0270N406r831K673Q614n284p284J0866r38j5351J2637K958j7994
1005a2876J2520N979j5096R623P168j0558L097P611n192n905P924R47j4128Q992
1019A06O786j7814R474R628j6189P450R732j2007O73P853n305o333N740L338j2200
$$ plain form
1034 -9068 -3436 7307 -7081 -1667 11971 -2888 84 12157 -331 -2156 5363 -853 -6973
1047 -6973 -2307 629 -8966 -5140 6419 -5153 -2990 12343 -726 -1831 12223 -443 -5139
1060 -5139 5063 -1754 -8240 -2221 864 -6984 -3663 7727 -1648 -2973 12847 1431 -4051 10840
1074 10840 -161 -7907 3947 -1502 -8834 -1517 1545 -4567 -2599 7595 730 -3492 9893 1407
1088 1407 -7035 6408 -727 -9925 2457 -352 -7095 1509 4829 -771 1297 9033 2754 -2870
1102 -2870 7359 939 -9879 2505 -1519 -12609 135 865 -7630 1790 6512 220 1695 8491
1116 8491 3438 -3471 5016 1953 -9834 710 1247 -10807 161 4488 -5829 1802 7800 159
1130 159 329 6523 1537 -4919 1915 1172 -9588 -738 2873 -8299 107 6552 -4298 917 8067
$$ packed form
1034i068N632J0743j4388N414J3638j4859K972J2073j2488j825P519o216o120
1047f973M666K936r595L826J1559j1572K163J5333j3069j105J4054j2666m696
1060e139J0202o817o486O019L085p848L321J1390r375j325J5820j1416n482J4891
1074A0840j1001p746J1854n449p332P317L062o112J968J0194o865m222J3385q486
1088A407q442J3443p135r198J2382k809o743Q604L320n600K068P736o279n624
1102b870J0229o420j0818J2384m024j1090J2744P30q495R420M722o292J475O796
1116H491n053o909Q487l063j1787J0544N37j2054J0968M327j0317P631N998p641
1130A59J70O194m986o456O834p43j0760Q850L611j1172Q406O445j0850N215P150
$$ plain form
1145 8067 -1071 -1805 4916 -529 -5961 1267 1318 -7360 348 5748 -4990 886 9415 -2467 -776
1160 -776 7911 -2334 -5085 2873 -2242 -7738 -502 1336 -6546 -700 6433 -2387 371 9668 -580
1175 -580 -1618 7798 -585 -5143 3139 -922 -6797 293 1622 -5311 -597 5644 -2268 -1618 7259
1190 7259 -510 -4213 5974 -96 -5956 3512 889 -6230 1442 3287 -4206 -539 5105 -1709 -2985
1205 -2985 5600 62 -5399 5127 1526 -6625 3234 3396 -5831 1223 4304 -3986 -1251 4583 -1993
1220 -1993 -3989 3843 381 -6022 2667 2646 -6244 2044 4026 -5631 1153 5946 -3041 -47 5863
1235 5863 -987 -2056 4301 1177 -5053 1765 2658 -7185 -713 3886 -6948 -1480 5165 -4273 -1422
1250 -1422 6132 -88 -1857 5078 2711 -3518 1536 3696 -5959 -2280 4524 -6093 -3028 5938 -3302
$$ packed form
1145H067r138p34O721n445n432P228N1q678P708N400j0738N876Q529j1882J691
1160g76Q687j0245k751P958n115n496P236J838p882N846P133q820K758R297j0248
1175e80j038R416q383m558Q282m061n875P090J329o933M714O241p912O50Q877
1190G259p769l703J0187o070n860R468k623p119P672J845p493L667N644o814j276
1205b985Q585n538n461J0526l601q151R859J62r227P054L081q290K735N834o576
1220a993j996P832l462o403Q689k1q890Q288J982r657O784M793q987K994N910
1235E863o850j069O357l124o230O818Q93r843O472M599j0834N468O645r438K851
1250a422P554o220j769O935k367o229N054K160r655L679O804j0617L065Q966r240
$$ plain form
1265 -3302 -2276 6749 -29 -1915 4622 1967 -3736 224 2755 -5029 -3365 4002 -4459 -4075 6386
1280 6386 -1909 -2805 7196 441 -2845 4469 1156 -4014 -426 2416 -3529 -3216 5047 -1444 -3638
1295 -3638 7490 741 -3784 6283 74 -5528 2249 -522 -6096 -2031 933 -2929 -2998 4975 1472
1310 1472 -2033 7633 3420 -3369 6143 1594 -6439 1283 -339 -6591 -2081 680 -2457 -2203 4578
1325 4578 2304 -2308 6124 4041 -5020 3640 1646 -7413 242 655 -6104 -1228 2708 -750 -478
1340 -478 4785 3533 -2392 4345 3840 -5960 1094 2285 -7869 -560 2649 -4929 68 4109 228
1355 228 -87 4093 2754 -3640 881 2496 -7136 -1848 2621 -7362 -988 5054 -2883 1079 6770
1370 6770 1243 934 4376 2231 -3722 -762 1506 -7247 -3394 2981 -6508 -2335 6035 -2184 -108
$$ packed form
1265c302J026R025o778j886O537k655n703L960K531p784J664P367q461L84J0461
1280F386q295q96J0001o755l286P314l313n170L588K842n945L13Q263o491k194
1295c638J1128o749m525J0067o209n602P777k771n574M065K964l862o9P973l503
1310A472l505R666m213o789R512m549q033P722j622o252M510K761l137K54O781
1325D578k274m612Q432k083r061Q660j994r059P655M13o759M876L936l458K72
1340d78N263j252n925O737n05r800P054J191j0154P309L209p578M997M041l881
1355B28l15M180j339o394M521J615r632N288M469r983O374O042p937L962N691
1370F770n527l09L442k145n953K960K268q753L853O375r489M173Q370q219K076
$$ plain form
1385 -108 6804 228 -398 3893 1288 -3790 -1094 1696 -5328 -2757 4571 -3699 -1768 7550 -1140
1400 -1140 -1416 6362 96 -2676 2139 -22 -4124 -1526 1335 -3170 -2283 4936 -1392 -2120 6674 -205
1416 -205 -2807 4771 -798 -4176 1658 -452 -3776 -454 2163 -1774 -1060 5664 735 -2041 6114
1431 6114 742 -4156 3552 -402 -6054 292 19 -4325 -759 2023 -1413 -1131 4881 1308 -2606
1446 -2606 4871 2079 -4016 3174 1562 -5071 805 1552 -3734 -518 2477 -1582 -1507 3522 703 -3446
1462 -3446 2893 1646 -4516 2204 2132 -5032 755 2910 -3494 -231 3102 -1508 -1464 3429 438 -3335
1478 -3335 2271 1999 -4059 1357 3219 -4354 358 3814 -2874 -600 3404 -1270 -1925 2936 370
1493 370 -3117 1165 1624 -3936 214 2689 -3693 -854 3690 -2292 -867 4135 -408 -1213 3481 1179
$$ packed form
1385a08O912o576o26M291k605n078K696K790p024K571P328q270J931R318q690
1400a140k76P778o266k772M815k161m102K598K861m505Q87P219o328p28Q794o879
1416b05k602P578n569l378N834k110l324L322K617l937P14O724m929k776Q155
1431F114n372m898P708l954n652O346k73m344L566K782l436K82O012l573l914
1446b606P477k792o095P190j612o633N876P47n286L216K995m059P5N029k819m149
1462c446O339j247o162O720p2p164N787K155o404L263L333m610M4M893k991l773
1478c335N606k72o058N416J862p573M712L456o688K274M004m674o55M861k566
1493C70l487M282M59n560M150K475o382K839M544n982J425N002m543q05M694k302
$$ plain form
1509 1179 -1694 1797 1942 -3135 -853 1706 -3714 -2618 2530 -2206 -2465 3580 97 -1827 3619
1524 3619 2138 -1730 1614 2018 -2517 -1491 1855 -2420 -3170 2145 -521 -3017 3551 1550 -2315
1539 -2315 3100 2322 -2423 695 1890 -2917 -2088 1428 -1658 -2912 2796 611 -2696 3498 2296
1554 2296 -2960 1959 2304 -3551 77 1644 -3440 -1752 2433 -923 -1590 3642 2311 -1757 3193
1569 3193 2750 -3684 770 1651 -5312 -1726 1203 -4086 -2006 2440 -174 -707 3712 3144 -927 2732
1585 2732 3148 -3146 -276 1912 -4746 -2126 1710 -3401 -1312 2828 167 23 2827 2314 -1079 839
1601 839 2131 -3219 -1786 1827 -3884 -2081 2891 -1920 -764 3948 966 77 2316 1782 -1755 -673
1617 -673 1544 -3241 -3067 2349 -2205 -2254 4223 362 -719 4355 1079 -1310 1232 346 -2625 -2455
$$ packed form
1509A179k873L491J45n077K282K559n420J096N148m736k59O045l483j924N446
1524C619j481l868L344M04m535J026L346m275p50N315k666k496O568k001l865
1539b315N415p78m745L118J195m807Q29L516l086j254N708k185l307O194j202
1554B296n256M919L45n855L628J567n084J688M185l356o67N232j331m068M950
1569C193m43o434M454Q81o963L586K929n289K080M446k614n33M419n68m071L659
1585B732M16o294K870K188o658K620L836n111K089M140k661j44K804n13l393J918
1601H39J292n350J433L613n711J803M972m811J156M712k982q89K239n34l537J082
1617f73K217m785J74N416m554m9O477l861j081N074l276k389K542q86k971J70
$$ plain form
1633 -2455 314 -3111 -3490 2623 -846 -1895 5196 1546 -713 4673 1605 -1640 1421 297 -3256
1648 -3256 -2068 313 -2414 -3266 2402 18 -2204 4377 1667 -2273 3682 1135 -3374 975 283
1663 283 -2877 -1033 1295 -865 -1609 2902 1293 -2119 3415 1977 -3276 2074 1114 -3887 387 432
1679 432 -2761 -388 1450 -56 -858 2299 1860 -2102 1750 1913 -3812 577 1000 -3992 -246 1246
1695 1246 -1971 57 2171 814 88 2408 2096 -1657 902 2164 -3535 -345 1613 -3956 -1051
1710 -1051 1749 -2210 -829 1915 360 -704 1584 1882 -1751 434 2820 -2472 -708 2928 -2447
1725 -2447 -1000 2852 -1575 -1126 2513 -192 -1524 1091 922 -1889 -212 2330 -2062 -954 3127
1740 3127 -2017 -1441 3154 -1319 -1562 2460 -109 -1702 1374 1305 -1751 -168 2308 -1984 -1287 2798
$$ packed form
1633b455K769l425l79O113l469j049P091l650k259N386l068l245L061j124l553
1648c256J188K381k727q52N668k384k222O581k710l940N955k547m509M349o92
1663B83l160J844K328k160p44M511j609l412N534j438n253N350r60n001M274M5
1679D32l193K373J838j506q02L157m39l962L852J63n725M389M23m992L746J492
1695A246l217K028K114j357p26K320l12l753K559J262n699L190J958n569K905
1710a051K800l959J381K744j555j064K288K98l633K185K386n292J764L636n375
1725b447J447L852m427M49L639k705j332K615j69k811J677K542m392J108M081
1740C127n144N76M595m473k43M022k569j593L076o9l056J583K476m292O97M085
$$ plain form
1756 2798 -1303 -1986 3211 -524 -2032 2404 223 -1574 1105 1154 -1855 -489 1443 -1470 -1877 1728
1772 1728 -1121 -2425 2590 184 -1644 2879 1403 -1103 1793 1706 -1083 -665 1198 -1448 -2397 1167
1788 1167 -1097 -3016 1713 586 -2197 2300 1893 -1314 1314 1959 -1442 -774 1328 -1279 -2409 1313
1804 1313 138 -2546 1873 1781 -1812 1660 2495 -1871 307 1835 -2382 -1710 1134 -1274 -2075 1483
1820 1483 817 -1346 2182 2415 -1641 939 2199 -2274 -713 1247 -2569 -1924 1374 -724 -1325 2431
1836 2431 1624 -484 2246 2760 -1244 78 1860 -2872 -1850 933 -2894 -2636 1254 -741 -1247 2517
1852 2517 1671 -390 2125 2514 -1053 -491 1484 -2069 -2220 1065 -1501 -2153 1996 441 -979 2234
1868 2234 1794 -861 851 1221 -1727 -1505 570 -1632 -2381 1357 -131 -1458 2450 1630 -860 2181
$$ packed form
1756B798m101o83N197l735j508M436k181j797K679M9l009J366J932k913m07L605
1772A728k849j304N015k406j828M523j476k506K896q7k789M18J863k646r49L564
1788A167k264j919M729j127k783M497m07l207K628O45l401O68K102k607j130L722
1804A313j175k684M419r2l593L472Q35m366K178J528m217O72K844k408q01L558
1820A483o66k163L528K33m056K580J260m473J561J960l816O45L298k098o01L756
1836B431q07k108K730N14m004J322J782m732J022K783l827K58L890j995n06L764
1852B517q46k061K515L89l567N62J975l553j51L285k566o52M149j555j420L213
1868B234m40k655J712L70k948K22K075k202p49L738j488j327L908q20k490L041
$$ plain form
1884 2181 1796 -1665 -66 858 -2166 -1674 655 -1017 -2297 1739 1183 -1199 2568 2511 -1362 1454
1900 1454 1646 -2537 -939 -46 -2394 -2346 622 -311 -1749 1939 2106 -989 2551 2769 -1423 956 1484
1917 1484 -2722 -1003 700 -2195 -1670 917 -240 -1217 1392 1584 -1540 1050 2271 -2335 -316 1581
1933 1581 -2830 -963 1473 -1605 -622 1728 605 -614 1342 1640 -1029 -23 1846 -2314 -1169
1948 -1169 1708 -2325 -1272 1918 -935 -620 2219 761 -427 952 1212 -1153 -850 1489 -1958 -1926
1964 -1926 1783 -1453 -1564 2074 -306 -901 2359 601 -716 1110 1395 -813 -764 1246 -1307 -1919
1980 -1919 1842 -1056 -2225 1943 -458 -1280 1760 441 -1044 687 991 -697 -569 1527 -278 -1740
1996 -1740 1692 236 -1945 1788 51 -2029 1265 384 -1442 333 593 -617 -650 1077 133 -1867
$$ packed form
1884B181l85l461J599R24l024M92K329j672j280M036n56k382L767n7l873K816
1900A454J92m183J598Q93k348M8K968r33j438L688J67l095L540K18m192K379N28
1917A484m206J719J703k895N25K587j157r77K609J92l124K590J221m606K019J897
1933A581m411J867K436l078R83K350j123j219J956K98k669J006J869m160J145
1948a169K877m033J053L190k853L15K839j458j188J379K60k365L03K339l447L2
1964a926L709l236j11L638k380n95L260j758j317J826K85k208M9K010k553o12
1980a919L761k898j169M168k401q22L040j319j485J731L04j688J28K096j805j462
1996a740L432j456k181L733j737k080L294q81j826J775K60j210l3J727r44k000
$$ plain form
2012 -1867 1370 481 -2127 1484 882 -2178 1188 1006 -1425 461 788 -811 -711 839 72 -1713
2028 -1713 826 588 -2121 1184 1525 -2095 1336 1808 -1156 526 982 -1254 -1244 335 -189 -2011 27
2045 27 1059 -1879 820 2306 -1101 1046 2459 -919 241 1644 -1212 -1265 184 -495 -1814 -68
2061 -68 702 -1645 374 2414 -1165 170 2388 -1759 -850 1284 -1524 -1501 802 -54 -1283 662 1416
2078 1416 -847 638 2407 -1099 -807 1735 -1510 -1718 1101 -1166 -1805 715 474 -659 971 1931
2094 1931 -228 351 2246 -990 -1577 1034 -1750 -2441 873 -682 -1869 1298 1021 -399 1525 2175
$$ packed form
2012a867L237q89k608L611o02l060L366j82k431J886L27j599J00J550p67j785
2028a713K539k38k709L305L41l620L431M72k964J682M56k236J0J579n24j822K038
2045B7J032k938K699J486l407K147J413l378J160J403k856n3J449o79j319J746
2061f8P70k347K019K040l579J335K218m147R09K134k808K3K303q56j229J945P54
2078A416k263J485J769l506K92K542l245k08K819k267o39K520k41j133J630R60
2094A931k159N79J895l236n87K611k784o91L314j555j187L167k77j420J924O50
$$ [...]
8191i7
##END NTUPLES=NMR FID
##END=
