##TITLE=1H_Ser Am-2-1-2
 CDcl3
 8 sc, 
 8.10.2024
##JCAMPDX= 6.0         $$ Bruker NMR JCAMP-DX V2.0
##DATA TYPE= NMR FID
##DATA CLASS= NTUPLES
##ORIGIN= UXNMR, Bruker Analytische Messtechnik GmbH
##OWNER= root
$$ XWIN-NMR		Version 3.5
$$ Tue Oct  8 15:10:55 2024 Russian Standard Time (UT+4h)  she@DPX200
##.OBSERVE FREQUENCY= 200.1318
##.OBSERVE NUCLEUS= ^1H
##.DELAY= (6, 6)
##.ACQUISITION MODE= SIMULTANEOUS
##.ACQUISITION SCHEME= undefined
##.AVERAGES= 8
##.DIGITISER RES= 18
##SPECTROMETER/DATA SYSTEM= spect
##.PULSE SEQUENCE= zg30
##.SOLVENT NAME= CDCl3
##.SHIFT REFERENCE= (INTERNAL, CDCl3, 0, 15.7039)
##AUDIT TRAIL= $$ (NUMBER, WHEN, WHO, WHERE, WHAT)
$$ ##TITLE= Audit trail, XWIN-NMR		Version 3.5
$$ ##JCAMPDX= 5.01
$$ ##ORIGIN= Bruker BioSpin GmbH
$$ ##OWNER= she
$$ F:/spectra/data/she/nmr/H-F/1/audita.txt
$$ ##AUDIT TRAIL=  $$ (NUMBER, WHEN, WHO, WHERE, WHAT)
(   1,<2024-10-08 15:09:47.37 +0400>,<she>,<DPX200>,
      <created by zg, POWCHK disabled, PULCHK disabled
       configuration hash MD5:
       00 E9 B6 7A A2 85 ED C7 34 08 36 98 17 FE 4E 26
       data hash MD5: 16K
       28 01 04 32 61 FD 4F 41 D3 9A E5 66 BF 5E E4 27>)
$$ ##END=
$$ 
$$ hash MD5
$$ AC DB E3 F6 04 69 FA 78 58 59 AD 3C 69 01 0E 15
##$RELAX= 
##$RELAX= 
##$RELAX= 
##$RELAX= 
##$RELAX= 
##$RELAX= 
$$ Bruker specific parameters
$$ --------------------------
##$DU= <F:/spectra>
##$EXPNO= 1
##$NAME= <H-F>
##$PROCNO= 1
##$TYPE= <nmr>
##$USER= <she>
##$AMP= (0..31)
100 100 100 100 100 100 100 100 100 100 100 100 100 100 100 100 100 100 
100 100 100 100 100 100 100 100 100 100 100 100 100 100 
##$AQSEQ= 0
##$AQ_mod= 1
##$AUNM= <au_zg>
##$AUTOPOS= <>
##$BF1= 200.13
##$BF2= 200.13
##$BF3= 200.13
##$BF4= 200.13
##$BF5= 200.13
##$BF6= 200.13
##$BF7= 200.13
##$BF8= 200.13
##$BYTORDA= 1
##$CFDGTYP= 0
##$CFRGTYP= 5
##$CHEMSTR= <none>
##$CNST= (0..31)
1 1 145 1 1 1 1 1 1 1 1 1 1 1 1 1 1 1 1 1 1 1 1 1 1 1 1 1 1 1 1 1 
##$CPDPRG= <>
##$CPDPRG1= <>
##$CPDPRG2= <>
##$CPDPRG3= <>
##$CPDPRG4= <mlev>
##$CPDPRG5= <mlev>
##$CPDPRG6= <mlev>
##$CPDPRG7= <mlev>
##$CPDPRG8= <mlev>
##$CPDPRGB= <>
##$CPDPRGT= <>
##$D= (0..31)
0 1.2 0 0 0 0 0 0 0 0.06 0 0.03 0 0 0 0 0.0002 0 0 0 0 0 0 0 0 0 0 0 0 
0 0 0 
##$DATE= 1728385786
##$DBL= (0..7)
120 120 120 120 120 120 120 120 
##$DBP= (0..7)
150 150 150 150 150 150 150 150 
##$DBP07= 0
##$DBPNAM0= <>
##$DBPNAM1= <>
##$DBPNAM2= <>
##$DBPNAM3= <>
##$DBPNAM4= <>
##$DBPNAM5= <>
##$DBPNAM6= <>
##$DBPNAM7= <>
##$DBPOAL= (0..7)
0.5 0.5 0.5 0.5 0.5 0.5 0.5 0.5 
##$DBPOFFS= (0..7)
0 0 0 0 0 0 0 0 
##$DE= 6
##$DECBNUC= <off>
##$DECIM= 24
##$DECNUC= <off>
##$DECSTAT= 4
##$DIGMOD= 1
##$DIGTYP= 9
##$DL= (0..7)
0 120 120 120 120 120 120 120 
##$DP= (0..7)
150 150 150 150 150 150 150 150 
##$DP07= 0
##$DPNAME0= <>
##$DPNAME1= <>
##$DPNAME2= <>
##$DPNAME3= <>
##$DPNAME4= <>
##$DPNAME5= <>
##$DPNAME6= <>
##$DPNAME7= <>
##$DPOAL= (0..7)
0.5 0.5 0.5 0.5 0.5 0.5 0.5 0.5 
##$DPOFFS= (0..7)
0 0 0 0 0 0 0 0 
##$DQDMODE= 0
##$DR= 18
##$DS= 0
##$DSLIST= <SSSSSSSSSSSSSSS>
$$ [...]
##$SUBNAM2= <"">
##$SUBNAM3= <"">
##$SUBNAM4= <"">
##$SUBNAM5= <"">
##$SUBNAM6= <"">
##$SUBNAM7= <"">
##$SUBNAM8= <"">
##$SUBNAM9= <"">
##$SW= 24.0689170037331
##$SWIBOX= (0..15)
0 0 2 0 0 0 0 0 0 0 0 0 0 0 0 0 
##$SW_h= 4816.95568400771
##$TD= 16384
##$TD0= 1
##$TE= 0
##$TE2= 300
##$TE3= 300
##$TEG= 300
##$TL= (0..7)
0 120 120 120 120 120 120 120 
##$TP= (0..7)
150 150 150 150 150 150 150 150 
##$TP07= 0
##$TPNAME0= <>
##$TPNAME1= <>
##$TPNAME2= <>
##$TPNAME3= <>
##$TPNAME4= <>
##$TPNAME5= <>
##$TPNAME6= <>
##$TPNAME7= <>
##$TPOAL= (0..7)
0.5 0.5 0.5 0.5 0.5 0.5 0.5 0.5 
##$TPOFFS= (0..7)
0 0 0 0 0 0 0 0 
##$TUNHIN= 0
##$TUNHOUT= 0
##$TUNXOUT= 0
##$USERA1= <user>
##$USERA2= <user>
##$USERA3= <user>
##$USERA4= <user>
##$USERA5= <user>
##$V9= 5
##$VALIST= <valist>
##$VCLIST= <CCCCCCCCCCCCCCC>
##$VD= 0
##$VDLIST= <DDDDDDDDDDDDDDD>
##$VPLIST= <PPPPPPPPPPPPPPP>
##$VTLIST= <TTTTTTTTTTTTTTT>
##$WBST= 1024
##$WBSW= 4
##$XGAIN= (0..3)
0 0 0 0 
##$XL= 0
##$YL= 0
##$YMAX_a= 279907
##$YMIN_a= -247175
##$ZGOPTNS= <>
##$ZL1= 120
##$ZL2= 120
##$ZL3= 120
##$ZL4= 120
##$ABSF1= 10
##$ABSF2= 0
##$ABSG= 5
##$ABSL= 3
##$ALPHA= 0
##$AQORDER= 0
##$ASSFAC= 0
##$ASSFACI= 0
##$ASSFACX= 0
##$ASSWID= 0
##$AUNMP= <proc_1d>
##$AZFE= 0.1
##$AZFW= 0.1
##$BCFW= 1
##$BC_mod= 2
##$BYTORDP= 1
##$COROFFS= 0
##$CY= 11.3945322036743
##$DATMOD= 1
##$DC= 2
##$DFILT= <>
##$DTYPP= 0
##$F1P= 15.6554695791079
##$F2P= 12.8336369535428
##$FCOR= 0.5
##$FTSIZE= 0
##$FT_mod= 4
##$GAMMA= 1
##$GB= 0.15
##$INTBC= 1
##$INTSCL= 1
##$ISEN= 128
##$LB= 0.24
##$LEV0= 0
##$LPBIN= 0
##$MAXI= 10000
##$MC2= 0
##$MEAN= 0
##$ME_mod= 0
##$MI= 1.114404
##$NCOEF= 0
##$NC_proc= 0
##$NLEV= 6
##$NOISF1= 3.799351
##$NOISF2= 2.8
##$NSP= 1
##$NTH_PI= 0
##$NZP= 0
##$OFFSET= 15.70392
##$PC= 1
##$PHC0= -26343.76
##$PHC1= 10.18747
##$PH_mod= 1
##$PKNL= yes
##$PPARMOD= 0
##$PSCAL= 0
##$PSIGN= 0
##$REVERSE= no
##$SF= 200.130013532006
##$SI= 16384
##$SIGF1= 3
##$SIGF2= 2
##$SINO= 400
##$SIOLD= 16384
##$SREGLST= <1H.CDCl3>
##$SSB= 0
##$STSI= 0
##$STSR= 0
##$SW_p= 3612.71676300578
##$SYMM= 0
##$S_DEV= 0
##$TDeff= 0
##$TDoff= 0
##$TI= <>
##$TILT= no
##$TM1= 0
##$TM2= 0
##$TOPLEV= 0
##$USERP1= <user>
##$USERP2= <user>
##$USERP3= <user>
##$USERP4= <user>
##$USERP5= <user>
##$WDW= 1
##$XDIM= 8192
##$YMAX_p= 0
##$YMIN_p= 0
$$ End of Bruker specific parameters
$$ ---------------------------------
##NTUPLES= NMR FID
##VAR_NAME=  TIME,          FID/REAL,        FID/IMAG
##SYMBOL=    X,             R,               I
##VAR_TYPE=  INDEPENDENT,   DEPENDENT,       DEPENDENT
##VAR_FORM=  AFFN,          ASDF,            ASDF
##VAR_DIM=   8192,          8192,            8192
##UNITS=     SECONDS,       ARBITRARY UNITS, ARBITRARY UNITS
##FACTOR=    0.0002076,     1,               1
##FIRST=     0,             0,               0
##LAST=      1.7004516,     0,               0
##MIN=       0,             -247175,         0
##MAX=       1.7004516,     279907,          0
$$ Real data points
##PAGE= N=1
##DATA TABLE= (X++(R..R)), XYDATA
0@%%%%%%%Qj6J6k4L2m0N0n8P4r6J18j44J77k13K52k96L47m05M72n48O33p27Q31
30D43r46J075j217J373j545J733j943K171k419K693k993L321l679M074m510M988
46B619n515O103o758P491q322R265j0343J1592j3054J4796j6891J9416k2390K5233
60A3242l2517K99182m69615K93852m9500k06632L05956l18418K93403j31741m8092
71e0880J79780l01321K77657j66214K0105K01402l70560L90829k94778Q7735J42853
82A16608k35962K27965j51165M3253L2624r5216J52064j66862J03065J7181j55047
93a11492K33675k38422J68574l9568r0671J90411k02115J36606m0038m8028R8212
104E7144r8628Q4652k8072q0811J43085j82318J59207m2564o2068J39312j92297
$$ plain form
0 0 0 0 0 0 0 0 0 8 -8 8 -16 16 -24 26 -32 42 -54 64 -80 97 -116 136 -160 187 -218 254 -294 339 -388 443
30 443 -503 572 -645 728 -817 916 -1027 1144 -1275 1418 -1575 1746 -1933 2141 -2369 2619
46 2619 -2896 3207 -3551 3940 -4382 4883 -5460 6132 -6922 7874 -9017 10399 -11991 13242
60 13242 -19275 279907 -189708 104144 54644 -151988 153968 -164450 128953 -2788 -50880
71 -50880 128900 -172421 105236 -60978 -40873 160529 -210031 180798 -113980 -26245 116608
82 116608 -119354 108611 -42554 699 33323 -61893 90171 -76691 26374 43555 -111492
93 -111492 122183 -116239 52335 12767 -77904 112507 -89608 46998 6960 -41068 57144
104 57144 -41484 43168 15096 -65715 77370 -104948 54259 11695 -50373 88939 -103358
115a03358J44699n6224j0301R8035j10259P7065m6478m9885J34764j60579J61222
126G8701q0477n7663J41731k12656K15293j14415P959J03572j77305J59237r0814
137b6837n037J21932j72827J69068j25693J3625R8214j93515K42580j91650P0647
148E07M8339j44896J80572j51364R2491J8230j16931J58872j45808P2611J9475
159C2098q8512J52663j83903J41332p1476m0904J42104j70347J53218q0354k1364
170c5445R1488j31282J30559n8797j7284R4538j49838J26817q0285J6453O2824
181D9748j16400J39308j24610M0550M7154j01329J21491p1000J1493M4441r9614
192e8768J06337p1698J9999N5075j02785J01341q8730L0587L3761p4199J04033
$$ plain form
115 -103358 41341 -14883 -25184 72851 -37408 39657 -6821 -56706 78058 -82521 78701
126 78701 -1776 -59439 82292 -130364 84929 -29486 -21527 82045 -95260 63977 -26837
137 -26837 -31874 90058 -82769 86299 -39394 -25769 72445 -121070 121510 -70140 507
148 507 48846 -96050 84522 -66842 25649 43879 -73052 85820 -59988 12623 32098
159 32098 -56414 96249 -87654 53678 -17798 -58702 83402 -86945 66273 -14081 -35445
170 -35445 56043 -75239 55320 -3477 -20761 73777 -76061 50756 -29529 -13076 49748
181 49748 -66652 72656 -51954 -11404 35750 -65579 55912 -15088 -3595 40846 -58768
192 -58768 47569 -24129 -4130 50945 -51840 49501 -39229 -8642 25119 -49080 54953
203E4953q1823J7682L7981q6777J07314o2272J3791M3421j00904J02629q4462
214c8467M6340K9262q7309J07966j09817M8949K2020o5745J10458j01299N0395
225A2753M443p2229J15604r9785P0518j3562o1045R7818j20290J00698l7816k5792
237b8685Q4795j19505R9305n0932j1571P6767r7743R6363o0166o643O3686j06192
249f0521J11011p1698J9153L7689r2985J02591q8217M6533K2508o2514Q2568p8696
261c2578L3311J9114n5746Q9794p8775L7355j02n9537R1663q3402O3728j7273
273G552l8022N7901o8308N4811j59l4753O2947p1223L4235P646m3992Q1963q2656
286c2058N5577k5555l0277O2616o6196N6771j4737k8798N3366o4678M4024K826
$$ plain form
203 54953 -26870 -9188 28793 -57984 49330 -12942 849 44270 -56634 45995 -38467
214 -38467 7873 37135 -50174 57792 -52025 -3076 18944 -46801 63657 -37642 12753
225 12753 17196 -55033 60571 -39214 31304 17742 -43303 54515 -65775 34923 -2893 -28685
237 -28685 56110 -63395 35910 -15022 -26593 50174 -47569 48794 -11372 -18015 45671 -60521
249 -60521 50490 -21208 -2055 35634 -57351 45240 -42977 3556 26064 -36450 46118 -32578
261 -32578 733 19847 -35899 53895 -24880 12475 12373 -47164 44499 -38903 24825 7552
273 7552 -30470 27431 -40877 13934 13775 -20978 41969 -29254 4981 12627 -31365 50598 -32058
286 -32058 23519 -2036 -32313 30303 -35893 20878 6141 -22657 30709 -33969 10055 12881
298A2881m2049Q2709r1241O5674l1805k2735O3243p7632P6105m6148l188L8045
310B3859o7402O6053k3844j4719O2382r3487Q4245n8130J1322N2829q6157R4626
322E1577q5751L4096J1660m9132P8307o2128K1094K1308p0945R2682p0358L8375
334A0785K0976p4916R3718r7756O9834j6355k8726O1782p4245M5176j0962k8703
346b9392O4672o5693M8914p325m5604P9678r1690Q0222l7163n966M4137p1651
358c6861N9251l6538N04M0498n3135M5765k2433k5831O2277p7211Q5794n0665
370h585M761L2659p2500P6430n0290K2111J9370n2064M6413l5263j099N1516p1901
383c8442P9549o3045J5063K8543o1107Q7963p3169M0765n957l9441N5515m7250
$$ plain form
298 12881 -29168 53541 -37700 27974 -3831 -26566 36677 -40955 35150 -10998 -14186 23859
310 23859 -43543 22510 -1334 -16053 46329 -47158 37087 -21043 -9721 43108 -43049 51577
322 51577 -34174 -78 11582 -37550 40757 -21371 -277 21031 -49914 42768 -27590 10785
334 10785 31761 -43155 50563 -47193 22641 6286 -22440 39342 -34903 10273 -689 -29392
346 -29392 35280 -30413 18501 11176 -34428 45250 -46440 33782 -3381 -9347 34790 -36861
358 -36861 22390 -14148 -13644 26854 -26281 19484 -2949 -28780 33497 -43714 42080 -8585
370 -8585 -3824 28835 -43665 32765 -17525 4586 23956 -28108 18305 -16958 -18057 33459 -38442
383 -38442 41107 -21938 -6875 21668 -39439 48524 -24645 16120 10163 -29278 26237 -21013
395b1013K4887J7119n5725O9859p0325M0686P956m8160Q5711r0763O7304l0607
407c071j6324N1774o1928N3349j9768k6492N4246p1755N5883j4516k5536O9934
419D5796r3178Q0793n2646Q012M3671o2835O7785m8507M94L1510n4529O0873l2369
432e130o021M2095q0666Q2706n8186K7781K3213n7527O7870o4803L3919J0449
444A5700l7065N4860m9288J3458J8178n4950P6229o5581M0384q1m6045P0189p4126
457c8138N8110j3885k1827M9185n9618L7582n789l1678O4969o9531M9971j8891
469D60l0447O2510p4167P2052l5889m589L6676o0605N5167k5639l100M0606o1607
482b8572N1890l5863l149M3889o4147P1588n5770J5349J9687m8118O4222m6008
$$ plain form
395 -21013 3874 20993 -34732 35127 -35198 5488 13444 -34716 50995 -39768 27536 -3071
407 -3071 -19395 32379 -29549 23800 4032 -22460 31786 -39969 15914 1398 -24138 45796
419 45796 -47382 33411 -19235 -11223 32448 -30387 37398 -11109 -10615 20895 -33634 27239 -5130
432 -5130 -11151 30944 -49722 32984 -25202 2579 25792 -31735 36135 -28668 5251 15700
444 15700 -21365 33495 -15793 -2335 15843 -39107 37122 -28459 11925 11844 -34201 35988 -38138
457 -38138 19972 6087 -15740 33445 -26173 11409 5620 -26058 38911 -30620 19351 460
469 460 -29987 32523 -41644 30408 -5481 -10070 26606 -33999 21168 -4471 -7571 33035 -28572
482 -28572 23318 -12545 -15694 28195 -35952 35636 -20134 -4785 14902 -33216 31006 -15002
494a5002K0514J2856m6433N4720m4501J9429K0301n0760O2719o2356L2018N063
506H568l7826O3130n8771L6382m668l1788N2870m9623L4781J309l6345N3457o2705
519c1229M2374o589k5014N4907o5419M5616k1807j3696M9406n2647M7425k3108
531B19j7659M2423n5943N6234k5412r928L7932o6058O0820l7449P709L4358n9114
544c1868N8617m5234J2210K7666m8806O1499m8463J3809J8980n0495O3936n2288
556b0437K5613J0371m7038O1388n8503L5915J665l1766N4963n5691L4760o082
568E158k5511M9745n0793L8631j2389k7077M7301n6347M8190j6552j2609L6497
580B4244n4741M5382k1449n04L2811m3659L5734k4399o698L4761m3906M6849l0867
$$ plain form
494 -15002 5512 18368 -28065 26655 -17846 1583 21884 -28876 33843 -28513 3505 8568
506 8568 -29258 33872 -24899 11483 6815 -24973 27897 -21726 13055 14364 -21981 31476 -31229
519 -31229 11145 4556 -20458 34449 -30970 14646 -7161 -20857 28549 -24098 23327 219
531 219 -17440 24983 -30960 25274 -138 -10066 27866 -38192 22628 -14821 -7112 27246 -31868
544 -31868 26749 -18485 -6275 21391 -27415 34084 -14379 -570 18410 -32085 31851 -20437
556 -20437 5176 15547 -31491 29897 -28606 7309 8974 -22792 32171 -23520 11240 5158
568 5158 -20353 29392 -21401 17230 4841 -22236 25065 -31282 16908 356 -12253 24244
580 24244 -30497 14885 -6564 -7068 25743 -17916 17818 -6581 -13279 21482 -22424 24425 -6442
593f442m525K6373m7193N3940l1095Q132J7614m0171L9708k6131O958K5003m2776
606b0605M3536l4488M703K4128m5846N7065m6045J8690J0242l7398M7848l7979
618a6149J9555J2035l5555M4869m0691J7856J1310l7084N7927n9489L7047j0784
630H47k4405M8288m9961M3816j7862j6501L6238m5482L9276q998j6664M1511o1967
643c1864N2678l2060K067L5668n5001N4383m4150J1476J9723l4086M3165k8164
655f165K471K0313m2853M9749l4856J4750J3167m0370M7830m7624L0293k688j7559
668a3542L0098k9100J4513K868k0502L4028k8143J5662M627k7953L7649m1392
680b1187L3014r526j1330K3874l0491J6771p31j2685K9915k6745J2039O388l1329
$$ plain form
593 -6442 -10967 15406 -31787 22153 -8942 -810 16804 -23367 16341 -9790 -2832 22171 -20605
606 -20605 22931 -11557 -6854 17274 -28572 28493 -17552 1138 11380 -26018 21830 -16149
618 -16149 3406 15441 -20114 24755 -15936 1920 13230 -23854 34073 -25416 11631 847
630 847 -23558 24730 -25231 18585 723 -15778 20460 -25022 14254 5256 -11408 30103 -31864
643 -31864 20814 -11246 -9179 26489 -28512 25871 -18279 -6803 12920 -21166 21999 -6165
655 -6165 -3694 16619 -26234 23515 -11341 3409 16576 -23794 24036 -23588 6705 4017 -13542
668 -13542 16556 -12544 1969 4837 -15665 18363 -9780 5882 10509 -17444 20205 -21187
680 -21187 11827 2301 -9029 14845 -15646 1125 394 -12291 17624 -9121 2918 9306 -22023
693b2023M4799m0067L2392j0448j6819K8555l7361K9056o478j0716K6268l4236
705a7078K0766q84k0793M5043m8609M2179k5538n975L1647m5867M7430l0991P614
718a056J3024l4815L8410k5964L484K8266m6796N1142m3439J8494J4276m0289
730b5263N9162n4751L1666p583k2328L8812l7290K6555j533k7233M0124m4065
742b3727L2475k858j9599M1165n2451M2090k5503L416K3245l3269K9271k0439
754f184k438J7944k5252K9056j5232o040K3651l7065L6930k3570J1750P887k4241
767a2804K7406k3815O893J0117j7701J9175j2575m004J8597l2408L6019k0500
779e600M486J3543k7108K8417k4228J1773R482k1323K4576k0393j399J8662l1450
$$ plain form
693 -22023 22776 -17291 15101 4653 -12166 16389 -20972 8084 1606 -9110 17158 -17078
705 -17078 3688 2804 -17989 27054 -21555 20624 -4914 -10889 20758 -25109 22321 -8670 -1056
718 -1056 11968 -22847 15563 -10401 -6917 21349 -25447 25695 -17744 750 15026 -25263
730 -25263 33899 -20852 10814 3231 -19097 19715 -17575 8980 7447 -19786 20338 -23727
742 -23727 8748 5890 -13709 27456 -24995 17095 -8408 -4992 18253 -15016 14255 -6184
754 -6184 -8622 9322 -15930 13126 -2106 -8146 15505 -21560 15370 -8200 3550 11437 -12804
767 -12804 14602 -9213 -2320 7797 -9904 9271 -3304 -7308 11289 -21119 14900 -5600
779 -5600 -1114 12429 -14679 13738 -10490 1283 10765 -10558 14018 -6375 -7774 10888 -20562
792b0562L9773k8993J0770Q170l1815M2882l5500K3927L70k0998K8367l2757K2110
805E744Q93k1697L9047m4187K6539o651j6201L9906m6705M2558k3914n447K7593
818A7478l7236L7208k1750J287J9698l8660L7951k5215L856K1111l6579M1412
830B0561l5798J5734P269k4463L7340l1241J6832r80j9039K7290k4412J7608J76
843F877j9407K5799k9890J9628o60r506K1822k7297J8871q088n727K1210j9131
856e499J2124m442j1892J8694k0110J7974k428j4849K1363k4798J7112k192p403
869f346K0514k5174J7556m724j2456K5514k5479J8424n260j3534K5202l2441K6993
882H789r687q822K6754l4368K8516j6486r01K2187l1649L3789k3148j223J8705
$$ plain form
792 -20562 19211 -9782 988 9158 -22657 20225 -15275 8652 9022 -11976 16391 -16366 5744
805 5744 6637 -15060 23987 -20200 6339 -312 -16513 23393 -23312 19246 -4668 -10115 17478
818 17478 -19758 17450 -4300 -3013 16685 -21975 15976 -9239 -5383 15728 -20851 20561
830 20561 -15237 497 7766 -16697 20643 -10598 6234 5254 -13785 13505 -10907 6701 6877
843 6877 -12530 13269 -16621 3007 2347 -7159 14663 -12634 6237 -1851 -7578 13632 -5499
856 -5499 6625 2183 -9709 8985 -11125 6849 4421 -10428 10935 -13863 3249 1057 -6346
869 -6346 14168 -11006 6550 1826 -10630 14884 -10595 7829 2569 -10965 14237 -18204 8789
882 8789 -898 -9720 17034 -17334 11182 -5304 -6205 15982 -15667 18122 -5026 -6249 12456
895A2456l2305L7647k5833P983J1742l5398M1784l3539J9890O301k5454L4112
907A9386l8006K5604j528j7333L3662l6916K1908p001j5120L4439l7352L1838
919A3581j5499r500K5778l3289L3782j8313J379J4622k7418K6037j5312R0J6600
932A2538k6037K5285j9409L298J2528k3406K9251k1400R430L099j5246J9073j4322
945e318O955Q006j8985J8640j5693J348J3040j9686K5495k2823R450K780j5325
958a2116K3244j5005O209N145j8046J9788j5887O082J3116k6628K9601k9184J4504
971H23K798j5378K7584k7438J7231l893j2823K4682k3014J5626R59j9799K9926
984A7284l5649K8222j0513q460K5995l5463L0829k0593L893J5834k4114K6314
$$ plain form
895 12456 -19849 17798 -8035 -52 11690 -23708 18076 -15463 4427 10728 -14726 19386
907 19386 -18620 6984 5456 -11877 21785 -15131 6777 -224 -15344 19095 -18257 13581
919 13581 -1918 -11418 14360 -18929 14853 -3460 -2081 12541 -14877 11160 -4152 -4062 12538
932 12538 -13499 11786 -7623 -4325 8203 -15203 14048 -7352 2078 5177 -10069 9004 -5318
945 -5318 1637 9643 -9342 9298 -6395 -5047 7993 -11693 13802 -9021 429 3209 -12116
958 -12116 11128 -3877 2332 7477 -10569 9219 -6668 -586 12530 -14098 15503 -13681 823
971 823 3621 -11757 15827 -11611 5620 1727 -11096 13586 -9428 6198 7157 -12642 17284
984 17284 -18365 9857 -656 -9116 16879 -18584 12245 -8348 -4455 11379 -12735 13579
996A3579j6732k929J9020l0416L4090k2468N301J2602l1973L5704l0539J9353
1008D592P73j5242K1970k3225J1995M539j4817K4789k2922J0426J538j8405K9618
1021A5629k8843K2718j0362o535J4815j9013J6943n158m439J3564j6880J0494
1033B933Pj1775K3083k5044K0606j2087l486J3602j9508J9346r188j539R903j6036
1047i183J1798j306q173K2600k7393K1891j3998k737J7470k3067K5265j8066K246
1060b653P422j7227J9574q276k291J5398k7075K6138j7983O471J2591k4951K9441
1073A6579k8997J4950J06j2122K1481k0143R816K162j6825K5638k3171J5536Q12
1086E822j7062K7648l2137K5554j1406l118J6838k3583J8904j0765m165J6682
$$ plain form
996 13579 -3153 -6082 12938 -17478 16612 -5856 -555 12047 -19926 15778 -14761 4592
1008 4592 5365 -9877 12093 -11132 863 5402 -9415 15374 -7548 2878 4416 -13989 15629
1021 15629 -13214 9504 -858 -7393 7422 -11591 5352 194 -4245 9319 -7561 2933
1033 2933 2940 -8835 14248 -10796 9810 -2277 -5763 7839 -11669 7677 -1511 -3050 6853 -9183
1047 -9183 2615 1309 -6864 15736 -11657 10234 -3764 -6501 10969 -12098 13167 -4899 -2653
1060 -2653 4769 -12458 7116 -1160 -3451 11947 -15128 11010 -6973 -502 12089 -12862 16579
1073 16579 -12418 2532 2638 -9484 11997 -8146 1670 3832 -12993 12645 -10526 5010 5822
1086 5822 -11240 16408 -15729 9825 -1581 -4699 12139 -11444 7460 -3305 -7470 9212
1098I212j9838J8776q264p336J8703k6861K7984j6104M420Q872k0846J9918j6245
1111g609P085P444j4088J4287j2174k63J1996j7854K4034j8101O522L221j5325
1124a0825K1966j7976J1591m47j1824J3975j3471N939O605j5076K0687j9968R820
1137I96K787j3697K2986k1575J4556l921q880J5585j7001J1648J60j1268J8063
1150A0439k1271J3649k430q793K1496k3879J9737j1207l393J4989j9072J9528
1162I793r870l957J1373j9957J9508r436k11J3101k3631K2014j6505O558R886
1175H666j7614K1343j9159O453N288j4357K0988j6822O050L929j7151K1955j8448
1188h879J1753K044j4149K0202k0749J3408p44q768J7070j8755J1771l398q736
$$ plain form
1098 9212 -10626 8150 -114 -7450 11253 -15608 12376 -3728 692 9564 -11282 8636 -7609
1111 -7609 -524 6920 -7168 7119 -5055 -5318 6678 -11176 12858 -5243 1279 4500 -10825
1124 -10825 11141 -6835 4756 4309 -7515 6460 -7011 -1072 5533 -9543 11144 -8824 996
1137 996 3783 -9914 13072 -8503 6053 2132 -6748 8837 -8164 3484 3644 -7624 10439
1150 10439 -10832 2817 387 -8406 13090 -10789 8948 -2259 -5652 9337 -9735 9793
1162 9793 -77 -4034 7339 -12618 6890 -2546 -2757 10344 -13287 8727 -7778 -1220 8666
1175 8666 -8948 12395 -6764 -311 4977 -9380 11608 -5214 836 4765 -12386 9569 -8879
1188 -8879 2874 4918 -9231 10971 -9778 3630 2886 -5882 11188 -7567 4204 806 -7930
1201g930J7128j8135J4320m235q595J6089k0176J7464n563l836J4053k0046J6183
1214F721r451j148J3343j7340J5680j0819k880J2528j7593K0023j1030p95J0212
1227G451j9651K0893j3090N707P081j7310J7602j4881N025P278j4691J8026j5439
1240e999M158O330j5677K2164j7843J0152J085j2607J7997j7793J2199r44q397
1253e175J4166j6881R209M17j0309J8958j9089J3955n466p364J6705j8756J8224
1266H594q441k825R928j6445J4234n072m027J3640j9512J5024q564k227J5337
1279I644j9601K0440j5257K860P271j3661J7210j0515N49P953j6391J6083j0735
1292d150J942J0234j9083K1371j9390J0405J898j0580J7839j6491R197j28j0378
$$ plain form
1201 -7930 9198 -8937 5383 1148 -7447 8642 -11534 5930 367 -3469 10584 -9462 6721
1214 6721 -2730 -3878 9465 -7875 7805 -3014 -5894 6634 -10959 9064 -1966 -2761 7451
1227 7451 -12200 8693 -4397 1310 8391 -8919 8683 -6198 -1173 6105 -8586 9440 -5999
1240 -5999 -1841 4489 -11188 10976 -6867 3285 4370 -8237 9760 -8033 4166 3222 -5175
1253 -5175 8991 -7890 1319 1736 -8573 10385 -8704 5251 -215 -7579 9126 -9630 8594
1266 8594 153 -2672 7256 -9189 5045 -27 -4054 9586 -9926 5098 -3466 -5693 9644
1279 9644 -9957 10483 -4774 -1914 5357 -8304 8906 -1609 -1060 6893 -9498 6585 -4150
1292 -4150 -2208 8026 -11057 10314 -9076 1329 3227 -7353 10486 -6005 3192 3064 -7314
1305g314J5287j3629Q114K560j4698K0024k2507J6504m127n456J5853k0632J6333
1318F312q733j798J2674j3320J0419m521q378J5571j8991J8389q448k878J0780
1331G078j8783J9072j2323N955M843j0887R864p127l68R433j3483J4868j1066
1344b924K52P708j5072J9032j5987R513m9q164J0751r013L996N101j0550J3260
1358G854j1471K461O138j4966K0665j8354J1530k531q905J3233j2138R404Q47
1371C767q676J2491j3756O504M590j2065J9911k2096J4562p102n075J5372j6790
1384h363J5538r419k005R586j3273J3652l978n715J4044k1510K0236j3268K940
1397a535J0131j9130K0062j7442Q244K560j0231J5067j1398L113O224j4650J8203
$$ plain form
1305 -7314 7973 -5656 2458 5018 -9680 10344 -12163 4341 214 -5242 10611 -10021 6312
1318 6312 -2421 -4219 8455 -4865 5554 1033 -7345 8226 -10765 7624 -824 -3702 7078
1331 7078 -11705 7367 -4956 999 5842 -5045 4819 -2308 -2676 6757 -6726 8142 -2924
1344 -2924 -2672 5036 -10036 8996 -6991 2522 2473 -5691 5060 -3953 43 5144 -5406 7854
1358 7854 -3617 -1156 4982 -9984 10681 -7673 3857 1326 -7579 5654 -6484 2920 3767
1371 3767 -4909 7582 -6174 330 4920 -7145 12766 -9330 5232 -1870 -6945 8427 -8363
1384 -8363 7175 -2244 -4249 5337 -7936 5716 1738 -3977 10067 -11443 8793 -4475 -1535
1397 -1535 8596 -10534 9528 -7914 330 2890 -7341 7726 -3672 -559 5665 -8985 9218
1410I218j5128Q292L221j3838J8179j9739J3658m542l375J0898j2643P673j736
1423A38n920J2627j1632R630k481q688J3905j6214J5041p360k35N897j2207R917
1437B418m151o53Q244j0228P275l313n182J3433j4665J4324q621j279P681j2968
1451g685J2884o693k94O738j1774J0290n223k616J2929j7155J6952j1475J593
1464a529P577j4998J8654j4463N753L362j2473J4189j1838N889N463j4039J8118
1477I665j7749R583J674j0237J9223k0049J3721o473n669J4577j5478J3265o117
1490f4n546J2518j7071J6002o427k204J1699j8441J6952j1545L730P092j3632
1503f937J4892j2611L254M783j0140J3120j0216L774L079j0401J3694j0555N874
$$ plain form
1410 9218 -5910 2382 5603 -8235 9944 -9795 3863 -679 -4054 6844 -5799 1874 138
1423 138 -5782 6845 -4787 4843 2362 -6326 7579 -8635 6406 -954 -1189 4708 -7499 2418
1437 2418 -1733 -2386 5858 -4370 2905 -408 -5590 7843 -6822 7502 -1119 -2398 5283 -7685
1451 -7685 5199 -1494 -1788 4950 -6824 3466 -1757 -4373 8556 -8599 8353 -3122 -1529
1464 -1529 6048 -8950 9704 -4759 994 4356 -8117 6072 -5766 123 5586 -8453 9665
1477 9665 -8084 1499 3173 -7064 12159 -7890 5831 -642 -6311 8266 -7212 6053 -64
1490 -64 -5610 6908 -10163 5839 -588 -2792 8907 -9534 7418 -4127 -397 6695 -6937
1503 -6937 7955 -4656 -1402 3381 -6759 6361 -3855 -81 2998 -7403 6291 -4264 1610
1516A610K228q052J0241j0874N970P20n867R754q893L154R52o427R879p692M917
1531A620J526q537J0789j0004O229K142p281R605j1087N348J377p408J2703j1045
1545d023M687J445r326J4036j2800R885q47q957J4029j5970J2040l601m270J1318
1559G646j5723J2441o084l594J2710j5238J4306q573r92J0118j7049J9187j2897
1572c742M363N376j4275J5950j4256P707L148j1246J5027j4828O765K598r593
1585g006J7289j7019J1082l731o813J4344j4962J3038o127l099P251j1623J0562
1598C186l039l537R690j2923J0012n196j48Q177j1571J1532q635J468L727o348
1612c605O504l414j307N432r293P929k951k182Q428j0497R991p661J831L930p256
$$ plain form
1516 1610 3838 -4214 6027 -4847 1123 1843 -4024 5730 -3163 -9 943 -5484 4395 -3297 1620
1531 1620 3146 -5391 5398 -4606 1623 3765 -3516 6089 -4998 350 1727 -5681 7022 -4023
1545 -4023 664 2109 -7217 6819 -5981 3904 3057 -5900 8129 -7841 4199 598 -3672 7646
1559 7646 -8077 4364 -1720 -5314 7396 -7842 6464 -2109 -3101 7017 -10032 9155 -3742
1572 -3742 621 5997 -8278 7672 -6584 1123 4271 -6975 8052 -6776 -11 2587 -7006
1585 -7006 10283 -6736 4346 615 -6198 8146 -6816 6222 95 -3004 4247 -7376 3186
1598 3186 147 -3390 6300 -6623 3389 -1807 -1955 6222 -5349 6183 -2452 -984 2743 -3605
1612 -3605 2899 -515 -1822 3610 -5683 2246 -705 -2887 5541 -4956 5035 -2626 -795 3135 -4121
1627d121Q939m849k286O133r998Q975l864j232R176j5435J4813j1279M498N645
1641E115r934J2221j1602L948L386r379J3323r619K199M119j2938J7198j5663
1654g626J1798j804q516J4031j6125J3303n339j771Q996j3420J0479m327n004
1667e325J2923j6035J4910r225j60Q897j5592J7771j2753O194K104q432R918q993
1681c798L609M659r788J1303r965K923L348q640J3754j2574Q746l942l441P246
1695C440o070N239j56m588N079o671L626L023p323J0532j1111O332k647j563O847
1710C989o626M978j260m493O483m933K432L154q523J1388j2929Q517j932m374
1724d129R874j0900Q455m013k859Q186r141P718p75o779J1298j4586J2614o770
$$ plain form
1627 -4121 4818 -31 -2317 3816 -6182 2793 -1071 -2303 6873 -8562 6251 -5028 -530 5115
1641 5115 -4819 7402 -4200 -252 3134 -6245 7078 -2541 -342 3777 -9161 8037 -7626
1654 -7626 4172 2368 -6148 7883 -8242 5061 -278 -2049 6947 -6473 4006 -321 -5325
1667 -5325 7598 -8437 6473 -2752 -2912 5985 -9607 8164 -4589 1605 3709 -4723 5195 -3798
1681 -3798 -189 4470 -5318 5985 -3980 -1057 2291 -6349 7405 -5169 3577 -365 -3806 3440
1695 3440 -2630 2609 2453 -2135 2944 -3727 -101 2922 -4401 6131 -4980 1352 -1295 -2858 3989
1710 3989 -2637 2341 1081 -3412 3071 -1862 570 3724 -4799 6589 -6340 2177 245 -4129
1724 -4129 5745 -5155 3300 -713 -3572 4614 -4527 3191 2416 -4363 6935 -7651 4963 -1807
1738a807o27R119j4738J4015j0759L913M814r031J1499r149J480N571j1140J4706
1752G866j1016M531J992j0957J4754j4419J1196k748n295R373j1165Q112j775
1765D49l696R985j1664Q137k906m664J0893j2697J1481p166J66M575q531R081
1779C443m844N80M195p147O617l924q14O540q798R431p446R99L158o294Q047n584
1795a841K025J731o312O211k768O2N781q683Q108o911J506M751p787R814q333
1810b646K079K332o914R369o321J776L579r019J0642q544M591K937q586J1258
1824F533j1445O923r55n398J0185j0572O971j759n425J0027j0753R397k628m377
1838c276R389j2569J0831n559q2O968j1324J0329p850J061N942q639J0263q162
$$ plain form
1738 -1807 -2434 6685 -8053 5962 -4797 -884 3930 -5101 6398 -2751 -1271 4300 -6840 7866
1752 7866 -3150 1381 3373 -7584 7170 -7249 3947 1199 -4096 5277 -5888 2224 449
1765 449 -3247 6738 -4926 3211 305 -4359 6534 -6163 5318 -1848 -1682 2893 -5638 3443
1779 3443 -1401 -821 3374 -3773 2844 -1080 -1894 4646 -4152 5279 -2167 -1168 1990 -4304 3743 -1841
1795 -1841 184 1915 -4397 1814 -954 -892 4889 -3794 4314 -2597 -1091 3660 -4127 5687 -2646
1810 -2646 -567 1765 -5149 4220 -2101 -325 3254 -5765 4877 -3667 924 3861 -4725 6533
1824 6533 -4912 2011 1056 -4342 5843 -4729 2242 483 -4942 5085 -5668 3729 1101 -3276
1838 -3276 6113 -6456 4375 -1184 -1266 5702 -5622 4707 -3143 -2082 3860 -4779 5484 -2678
1852b678J366M026q651J1703p805L317J833q429R974q469N249J051o401Q333q995
1867d576N012O45m336P799p491M126q5m679Q215p584N442j072m223O692p935N635
1883A585j401k948O610p217M486j119l019P136p219O052k140l853P070q855Q175
1898C343k765k126N419r029P072l077r99O725q602P118m324j636P814r729J0696
1913E900p362O07M261q937R895o715K256K799p608Q207o370K681L961q369J0435
1928E641r487M965P56o000J0166j0017O508k364l447P013q033N877j07m856Q004
1943D619r681P403k251k886Q768j0666Q870n789l45N169o649O830l629k401N335
1958B697p448P436k940q88N836r984R175o694L183K823n814O017n946J376L222
$$ plain form
1852 -2678 -1312 2714 -5937 5766 -2039 1278 3111 -5318 4656 -3813 1436 2487 -3914 4419 -4576
1867 -4576 436 1081 -3255 4544 -2947 1179 1094 -3585 4630 -2954 2488 1416 -2807 3885 -4050 1585
1883 1585 184 -2764 3846 -3371 1115 -4 -3023 4113 -3106 2946 806 -3047 4023 -4832 3343
1898 3343 578 -1548 3871 -5158 1914 -1163 -2162 4563 -4039 3079 -1245 -2881 4933 -4796 5900
1913 5900 -1462 -855 3406 -5531 4364 -2351 -95 2704 -4904 3303 -3067 -386 3575 -4794 5641
1928 5641 -3846 1119 1875 -4125 6041 -3976 2532 168 -3279 3734 -4299 1578 1471 -3385 4619
1943 4619 -5062 2341 90 -2796 5972 -4694 4176 -1613 -1958 3211 -3438 3392 -237 -2638 2697
1958 2697 -4751 2685 -255 -1143 4693 -5291 3884 -2810 373 3196 -2618 3399 -2547 -1171 2051
1973B051n396O625m416K24L471p776J0048p858M572O80n170P262p938M828q0l715
1989b588O090o196K480J961o898R997q883O359j488l936P300q695P429k650j504
2004a222M652o494L792q16l035P906q881O877l544k110O735q319R301o149J250
2019e7K001n323O045l032k73M328p840O593m392L24N066p979R492q360L864R22
2035A379m477O906n416K198J579n699O804n608J791L485p294R091r312O016r70
2050D73l233O761o674M698j545l110O251n889L950L9n376P541r513Q211k810j277
2066a503N597q442P056m581J080M298n999N620l402k095N967p943Q413n245n3
2081a232L992p784Q611o476L378J696m996N803m495R57L324n824O984o008K181
$$ plain form
1973 2051 -3345 3280 -1136 -912 2559 -5217 4831 -3027 1545 2225 -2945 4317 -3621 1207 1127 -2588
1989 -2588 3502 -2694 -214 1747 -5151 4846 -4037 2322 834 -3102 4198 -4497 2932 282 -1222
2004 -1222 3430 -3064 728 -88 -3123 4783 -4098 2779 -765 -2875 3860 -4459 4842 -1307 -57
2019 -57 1944 -3379 2666 -366 -639 3689 -4151 2442 -1950 -1626 3440 -4539 4953 -3407 457 1379
2035 1379 -3098 3808 -1608 590 2169 -3530 3274 -2334 -543 2942 -4352 4739 -4573 1443 473
2050 473 -2760 4001 -2673 2025 480 -2630 3621 -2268 1682 1721 -3655 3886 -5627 2584 -226 -1503
2066 -1503 4094 -4348 2708 -1873 -793 3505 -2494 3126 -276 -2371 3596 -4347 4066 -1179 -1232
2081 -1232 2760 -5024 3587 -2889 489 2185 -2811 2992 -1503 -546 2778 -3046 3938 -2070 111
2096A11J901o402Q045o988M950r84l295N211n629L797J086l540N577o262K767
2111C45P41m501Q236p930N243k572k517N603o158N681j543k398M646o324N196
2126A748j051k525O718r045O649l791o10N526p568P182m869q4M305o364P116m302
2142i65J85M400p679P901o184K059L177o896Q531p548L385O57m445P105o533L813
2158I63L33n157P280o476N227n07m291O582q437O160j839j516N324p211N260k952
2174a257r37N350n772N421l185j199M367n955O188k948q57L245n914N516l204
2189a141L87L092n096M708l209L68L008m573N274l244J9K682n168N420l865J265
2205g3K388n307N163m322J492K592m579N708m291Q03K255n421P338n357K204J535
$$ plain form
2096 111 2012 -4390 3655 -3333 1617 633 -2662 2549 -3080 717 1803 -1737 3840 -2422 345
2111 345 1086 -3415 4821 -3109 2134 -438 -2955 2648 -3510 2171 628 -1770 2876 -3448 1748
2126 1748 697 -1828 4890 -4155 2494 -1297 -1907 3619 -3949 3233 -1636 -1720 2585 -3779 3337 -965
2142 -965 -780 3620 -4059 3842 -2342 -283 2894 -4002 4529 -3019 366 1023 -3422 3683 -2850 963
2158 963 1296 -3861 3419 -3057 2170 1663 -2628 3954 -4483 1677 -162 -1678 3646 -3565 1695 -1257
2174 -1257 -2194 3156 -2616 2805 -380 -1579 2788 -3167 3021 73 -784 2461 -3453 2063 -1141
2189 -1141 -754 2338 -2758 1950 -1259 -891 2117 -2456 2818 -426 -407 2275 -2893 2527 -1338 -73
2205 -73 2315 -2992 2171 -2151 -659 1933 -2646 3062 -1229 -426 1829 -3592 3746 -1611 593 2128
2221B128o225P737p041M646K67m404O217p007M700m1l538P248p795N205j766l148
2237b817P020p931P036m148j191M796p074P258m053L72L473o695O884m381Q91
2252e60L902o685P536o763K881J175m855P078o193L359n46k840M730m435K895
2267F79J014m029N382n880L671k19j961M777n898L745k046j062L538k918J891
2282F84K90l128M111m031L135K13k576M525n930L779j220r25K976l760K693n64
2298B72k511M625m573L770o89l090N817p594O671l484j35L797n650M950l720O8
2314a476M101n818N634l019j150M648p580Q960o379L068J364n879P179o804M506
2329A355Ml387M854o022L625M96l989P648q116N919k736j771N876p367P339m646
$$ plain form
2221 2128 -4097 3640 -3401 1245 1512 -2892 3325 -3682 1018 977 -2561 4687 -3108 2097 331 -2817
2237 -2817 4203 -3728 3308 -840 -2031 2765 -4309 2949 -1104 -732 2741 -3954 2930 -1451 -560
2252 -560 3342 -3343 4193 -2570 311 1486 -3369 3709 -2484 875 329 -2511 2219 -2216 679
2267 679 1693 -2336 3046 -2834 837 618 -1343 3434 -2464 1281 -765 -1827 1711 -1207 684
2282 684 974 -2154 1957 -2074 1061 1274 -1302 3223 -2707 1072 -148 -1073 1903 -1857 836 272
2298 272 -2239 2386 -2187 1583 894 -2196 3621 -3973 2698 -786 -921 2876 -2774 2176 -1544 -1476
2314 -1476 2625 -3193 2441 -578 -1728 2920 -4660 4300 -2079 989 2353 -3526 3653 -3151 1355
2329 1355 1359 -2028 2826 -3196 429 925 -3064 4584 -3532 2387 -349 -2120 3756 -3611 3728 -918
2345i18J87K476m485M418k110p03L719o033N582l696N47L512n193O007n254K721
2361G77r5k353L563k493J46J700l319L050j843L74K630m337M664m436K107P74
2377I09k016L386k729J24J275l318L897j831o01L071n535N700m936L271J031l758
2393b060N070m888K012J047l117N128m729J625J291n199P549p136M967j476k126
2408b042N527p398O373l025n59M157n575N049k978j621N325p115P231m484P1L557
2424B493o750P774n919L822J33m363N346m629K543J245l620M996o045L403J80
2439F09l542O311n918M097k330p56L579l817L602j388j441K598l356K628l90j630
2455a144L325m782L689j549q07K756k939K639j166p77K070k671K160L8j963L588
$$ plain form
2345 -918 -731 1745 -2740 1678 -432 -1135 2584 -3449 2133 -1563 -1016 2496 -2697 3310 -1944 777
2361 777 682 -1671 1892 -601 -455 1245 -2074 976 -867 -493 2137 -2200 2464 -1972 135 909
2377 909 -1107 2279 -450 -326 949 -2369 1528 -303 -904 2167 -3368 2332 -2604 667 1698 -2060
2393 -2060 3010 -1878 134 1181 -1936 3192 -1537 88 1379 -3820 3729 -3407 1560 84 -2042
2408 -2042 3485 -3913 2460 -565 -1124 3033 -2542 2507 -471 -2092 3233 -3882 3349 -1135 -1064 2493
2424 2493 -4257 3517 -2402 1420 1553 -2810 2536 -2093 450 1695 -1925 3071 -2974 429 609
2439 609 -2933 3378 -2540 1557 -773 -1529 2050 -1767 1835 447 -994 1604 -1752 876 486 -1144
2455 -1144 2181 -2601 1088 -461 -1268 1488 -1451 1188 22 -755 1315 -1356 804 842 -1121 2467
2471B467m518K945j179j130L690m506L756k198j079L375l752M379k086j321L546
2486B389n447N288k971J30L187n834N818m703J748K251m370N485m885J601J695
2501A382m045O094n479L070J17m249O209n798M471j648k187M972o259N089k123
2516c84q56M030n456N231l482Q3L145n032N296l220O4K408m918N079l543J950
2532C95J090l516L907l480J870J003k376L304l186P09J379k681L662k873J078
2547B85jk436L439k502J614P23k454K498k076O80J403k462L685l432Q06R98k999
2564b231M247l547K168j76k368L758l446K106O40k517L892m353K554k53k779N491
2580C186n869M376k114j462L698m549M809j996j088L088m792M313j760n99L537
$$ plain form
2471 2467 -2051 894 -285 -1415 2275 -2231 1525 -673 -1752 1623 -2129 2250 164 -1157 2389
2486 2389 -3058 2230 -741 -611 2576 -3258 2560 -2143 -395 1856 -2514 2971 -1914 -313 1382
2501 1382 -2663 3431 -2048 1022 1139 -3110 3099 -2699 1772 124 -2063 2909 -3350 1739 -384
2516 -384 -1240 2790 -2666 2565 -917 -834 2311 -2721 2575 -645 -581 1827 -3091 1988 -1555 395
2532 395 1485 -2031 1876 -1604 266 1269 -1107 2197 -989 -280 1099 -1582 2080 -793 285
2547 285 284 -2152 1287 -1215 399 1122 -1332 1166 -910 -230 1173 -1289 2396 -1036 -230 768 -2231
2564 -2231 2016 -1531 637 461 -1907 1851 -1595 511 1151 -1366 2526 -1827 727 474 -2305 3186
2580 3186 -2683 1693 -421 -1883 1815 -2734 2075 79 -1009 2079 -2713 1600 -160 -759 2778
2595B778n593N544m622J535K120m243N247n014K380L05k397M323l707K072O24
2610A352l608M808m473L080l29k564M318n239L918j996l46K622l152K532p72j680
2626a529L495l638L232q27k081L178m555M354k233N43J452k770J776r95m45K423
2642A380k381K480j340j396L100m188M429k596O76J218l615L463k127P79J776
2657A658l512K709j467j61L123m711N152l987J519P75l561M667l890K375o3k695
2673b069L675k727J053J377l834N558m885L059r63j957M539m916M166k994j45
2688a063K411l166K914p86j563L138m618L797j545k11L193n000M715l866J845
2703A95J171k699L100k725N77J028k823L867k470O78J335l680M625l823K534r
$$ plain form
2595 2778 -2815 2729 -1893 -358 1762 -2481 2766 -2248 132 437 -1960 2363 -1344 728 1352
2610 1352 -2256 2552 -1921 1159 830 -1734 2584 -2655 1263 -733 -1079 1543 -1609 923 151 -1529
2626 -1529 1966 -1672 1560 733 -1348 1830 -2725 1629 -604 -61 1391 -1379 397 -598 -1043 1380
2642 1380 -1001 1479 139 -1257 1843 -2345 2084 -512 164 1382 -2233 1230 -897 -118 1658
2657 1658 -1854 855 -612 -773 2350 -2361 2791 -1196 323 1098 -2463 2204 -1686 689 626 -2069
2673 -2069 1606 -1121 -68 1309 -2525 3033 -1852 1207 244 -1713 2826 -2090 2076 -918 -1063
2688 -1063 1348 -1818 1096 310 -1253 1885 -2733 1064 -481 -692 2501 -2499 2216 -1650 195
2703 195 1366 -1333 1767 -958 -381 647 -2176 1691 -779 -101 1234 -2446 2179 -1644 890 881
2719H81j876K442k609J374R9j630K685k268O29J214l003M007l816K721l29j484
2735i63K709l403K202l04j037K539k736J370j39k260L998l954L343j292j687L252
2751A638l667M041k379O7J883l363K612j025m62K692m171L598k554M9K677l908
2767b272M437l207J148Q99k393L115k275M94J295k952L043k739J262J162k943
2782a926L963l721K269m50j681L446k914J891m71j727K707l019K341k36k059L342
2798A755l848K909j141o06L007l556K765j673m09K315k936K843j468p11K008l432
2814b178L271j952N20J582l341L259j955M33J557k601L115k423M43J392k725L723
2830B120l291J301N25k434L256k959K022L64k306L066l252J790M09j652L113l165
$$ plain form
2719 881 -995 1447 -1162 212 311 -1319 1366 -902 -273 941 -2062 1945 -1871 850 521 -963
2735 -963 1746 -1657 545 241 -796 1743 -993 377 238 -2022 1976 -1978 1365 73 -1614 1638
2751 1638 -2029 2012 -367 -300 1583 -1780 832 -193 -655 2037 -2134 1464 -1090 -1041 1636 -2272
2767 -2272 2165 -1042 106 1005 -1388 1727 -548 -54 1241 -1711 1332 -1407 -145 1017 -1926
2782 -1926 2037 -1684 585 135 -1546 1900 -1014 877 406 -1321 1386 -1633 708 472 -1587 1755
2798 1755 -2093 816 -325 -931 2076 -1480 1285 -388 -797 1518 -1418 1425 -43 -754 1254 -2178
2814 -2178 1093 -859 -339 1243 -2098 1161 -794 -361 1196 -1405 1710 -713 -270 1122 -1603 2120
2830 2120 -1171 130 655 -1779 1477 -1482 540 904 -1402 1664 -1588 202 611 -1041 2072 -1093
2846a093J902p71j348K884l041K454j025j118K195k934L101j110p40K189l080
2861a535K287q27m19J844k699K306j199o29K103k908L060j833p8J633k688K959
2877A377j886N10J183k789K543j770K33J594k504K939k473Q99R73l090M070k751
2893i42J513M56k409K839k626J341J104k508K995l274J549K74k009L792l958K733
2909H70r67j101K715k698K475j155p78J742k916K850q80p59K092l558L390k523
2925a201Q43J539k669K982k314J019O86k140K444j407l48J954k960K895k491J271
2941A03M56j875K700k625J534l03o65J893j353L40N96k286K744k163J583M54k502
2958a369K560l073K067N2j013J791k024J017L94j435K886k863J617k52k125L603
$$ plain form
2846 -1093 809 38 -1310 1574 -1467 987 -38 -1156 1039 -1895 1206 96 -644 1545 -1535
2861 -1535 752 -75 -494 1350 -1349 957 -242 -871 1232 -1676 1384 -449 -527 1106 -1582 1377
2877 1377 -509 1 1184 -1605 938 -832 -599 995 -1509 1430 -1043 -144 829 -2261 1809 -942
2893 -942 571 1027 -1382 1457 -1169 172 1276 -1232 1763 -1511 38 312 -1697 2095 -1863 870
2909 870 -97 -1198 1517 -1181 1294 139 -639 1103 -1813 1037 157 -602 1490 -2068 1322 -1201
2925 -1201 -358 1181 -1488 1494 -820 199 885 -1255 1189 -218 -566 1388 -1572 1323 -1168 103
2941 103 559 -1316 1384 -1241 293 -10 -675 1218 -135 205 801 -1485 1259 -904 679 1133 -1369
2958 -1369 1191 -1882 185 237 -776 1015 -1009 8 402 -1033 1853 -1010 607 355 -1770 1833
2974A833l835L407j556q86J901k284K207p51p60K427l336K702j164r02K948l898
2990a947M075l196J157Q23k634L189k406R10R18k410K773j889N58J322l082M093
3006B254l646J972l64j546L056l169K283j288n19J727j827J883q1j665K549l335
3022a716K977j147n74J784k675K369j957P00M81n84J036r92l97J735j898J795
3038I37q93o31J692k398K362j717O67N39j411J096l20n70J155j830K114p21q15
3055g44J958k849L077k465J342N45j943K413j750n7J314j830K434k118K84J557
3071A168k806L533k830J894p90j493K724k984K501n67j274K225k796J919k31j306
3087a113K997l625L081k115K51K158l092L075k606J197M95k087K615j816L84J124
$$ plain form
2974 1833 -2002 1405 -151 -1037 864 -1420 787 36 -724 1703 -1633 1069 -95 -997 1951 -1947
2990 -1947 2128 -1068 89 912 -1722 1467 -939 -29 889 -1521 1252 -637 -79 1243 -1839 2254
3006 2254 -1392 580 216 -1330 1726 -1443 840 -448 -967 760 -1067 816 735 -930 1619 -1716
3022 -1716 1261 114 -460 1324 -1351 1018 -939 -239 242 -342 694 -298 -695 1040 -858 937
3038 937 44 -587 1105 -1293 1069 -648 19 558 -853 243 -77 -647 508 -1322 792 71 -744
3055 -744 1214 -1635 1442 -1023 319 864 -1079 1334 -416 -473 841 -989 1445 -673 -389 1168
3071 1168 -1638 1895 -935 959 169 -1324 1400 -1584 917 350 -924 1301 -1495 424 193 -1113
3087 -1113 1884 -1741 1340 -775 -524 1634 -1458 1617 -989 208 703 -1384 1231 -585 -201 923
3103I23k534K798k124J095O43k095L078k739J265l23n77J803j844J088l87j075
3119a005J494j080R77k0j145J807k051J240P5m45J004q69r2K45r41J734j600J013
3137C41J79j748K281j933J019N9p77J759k291J454lj277K409k402J690o15j208
3154a063K328k550K090p95o43J813k639K531j464L2J969l189K816j935N08J078
3170H87k080L021k931J047N29k395L435k460J707k27j818K570k543K124m63j201
3186g98K231k907K296j089l89J851k222J996j183n13J636k044K436j882P29P82
3202I30k002J921j170K16N81j191J388j100J05R03j496J596p71L4K91j068J742
3219I09j046L42L65j405J030m88L7R98j542J151r00J74J297j836J978j536O37
$$ plain form
3103 923 -1611 1187 -937 158 801 -1294 1784 -955 310 -13 -590 1213 -631 457 70 -1005
3119 -1005 489 -591 386 366 -779 1028 -1023 217 292 -153 851 -18 -110 135 -806 928 -672 341
3137 341 520 -1228 1053 -880 139 198 -579 1180 -1111 343 340 -937 1472 -930 760 145 -1063
3154 -1063 1265 -1285 805 10 -633 1180 -1459 1072 -392 -360 1609 -1580 1236 -699 -191 887
3170 887 -1193 1828 -1103 -56 473 -1922 1513 -947 760 533 -1285 1285 -1258 866 403 -798
3186 -798 1433 -1474 822 -267 -656 1195 -1027 969 -214 -727 909 -1135 1301 -581 148 930
3202 930 -1072 849 -321 -105 476 -715 673 -427 -322 581 -915 681 -90 -56 235 -833 909
3219 909 -137 205 570 -835 195 -293 -256 742 -800 351 -549 -375 922 -914 1064 -472 165
3236A65K95j118J686j425N35P55k279K400j795P40O79j748K729k983J963m48r75
3253h24K241k805K083m54j106J950k634K285n83p10J799l018L079k061R25J003
3269A170k545K740k100Q64L25j256K154j784L79O60k014K580k079J613l96j285
3285i74J821k181K117n15n27J012j402R33M2r93J779j697R56o67n21J655j866
3302a028J857j035p7P63o68M13l6n76J137j326O53J7j158J983j889J571q45k28
3320d72P26j002R07P2p44J340j936J471j54q87K160k733K250j726J73J086j617
3337a086K053j265J89P32j835K179j257J34J354k504K958k764J447J47j495K388
3353A375k465J448l47q89K086j999J431k47j382K292k459K184j266m9J251k297
$$ plain form
3236 165 460 -658 1028 -397 138 893 -1386 1014 -781 -41 638 -1110 1619 -1364 599 151 -824
3253 -824 1417 -1388 695 241 -865 1085 -1549 736 153 -557 1242 -1776 1303 -758 167 1170
3269 1170 -1375 1365 -735 129 454 -802 1352 -432 -53 607 -1407 1173 -906 707 311 -974
3285 -974 847 -1334 783 268 -259 753 -649 284 326 -667 1112 -585 371 -296 -817 838 -1028
3302 -1028 829 -206 -283 480 -188 225 189 -387 750 -576 77 94 -1064 919 -970 601 -244 -472
3320 -472 254 -748 159 231 -513 827 -1109 362 208 -679 1481 -1252 998 -728 -555 531 -1086
3337 -1086 967 -298 -109 623 -1212 967 -290 -156 1198 -1306 1652 -1112 335 482 -1013 1375
3353 1375 -1090 358 11 -878 1208 -791 640 393 -989 1303 -1156 1028 -238 -287 964 -1333
3369a333K241j590R00K76j124J382r74k15J194j597J814j361L58O92j715J858
3385H06j446R30J9r74Q70o22N18N21q87J107j297J27R95j232J627j455N36L24
3403D67j039R88q65M33N68j183J074j175O15O77j209J836j852R00k36q37J616
3420G78j790J266k22o60J360j635R21N03j284J867k394K041r42j37J608k175J947
3437A052j752K14J047j261J534j073o4J171k087K161j600P71Q29k072K216j982
3453h96J237p8o98J242j511Q32Q3j039J598j581J116p7r70J695j785J351m24k20
3471a25R30j565J301m51o29J294j478J249p13m54J163j176J220l86m34J144j573
3488f83J249p32K19Q38j435J015q75j24J196j438J679j180j90J188j601J710q27
$$ plain form
3369 -1333 908 -682 218 494 -630 752 -222 -437 757 -840 974 -387 -29 663 -1052 806
3385 806 -640 290 309 -665 205 -417 101 622 -265 842 -455 -328 667 -565 1062 -393 143 467
3403 467 -572 416 -449 -16 552 -631 443 -732 -117 560 -649 1187 -665 235 -1 -838 778
3420 778 -1012 254 32 -628 732 -903 18 521 -763 1104 -1290 751 -191 -328 1280 -895 1052
3437 1052 -700 -486 561 -700 834 -239 -303 868 -1219 942 -658 113 942 -1130 1086 -896
3453 -896 341 263 -435 807 -704 128 211 -828 770 -811 305 228 -742 953 -832 519 95 -125
3471 -125 805 -760 541 90 -539 755 -723 526 -187 -641 522 -654 566 180 -254 890 -683
3488 -683 566 -166 53 891 -544 471 -404 -528 668 -770 909 -271 -461 727 -874 836 9
3505IR6M01j641J865j020L03L47j227J429j193Q57J85j355J772j384R16J59j423
3523i04J784j576J276l88o19J120j502J241n07n97J703j779J023l51m58J608j802
3540g28J489q16j86R15j445J694j139J40N47j583J432m41j24J051j786J682j267
3557e65K93Q41j305J546j457Q70j58n73J139r51K34L41j010J387j315O09N77j191
3575f88J729j686R50k69n02J145j131Q35j83r52J075j052P87K92q98J463j683
3592g68J311o52J17Q57j656J095l88k25J028j355J091o63m55J246j531J733j139
3609c54M60N04j315J368j099N72K90j008J040q69P3Q37j264J698j532P54J18j239
3627i66J804j539Q47J45q97Q16o26M17L80j160J746j528L58K91q40J640j780J585
$$ plain form
3505 9 105 506 -1135 730 -290 13 360 -867 562 -631 226 411 -944 828 -556 360 519 -904
3523 -904 880 -696 580 192 -427 693 -809 432 -75 -672 1031 -748 275 -76 -534 1074 -728
3540 -728 761 -55 -241 674 -771 923 -216 -76 471 -1112 320 -121 -245 806 -980 702 -565
3557 -565 -272 569 -736 810 -647 223 65 -508 631 -320 -86 255 -755 632 -683 -74 503 -688
3575 -688 1041 -645 305 36 -466 679 -452 383 200 -752 323 -729 58 350 -548 915 -768
3592 -768 543 -109 8 865 -791 304 -84 -309 719 -636 455 -208 -663 583 -948 785 -354
3609 -354 106 610 -705 663 -436 136 426 -582 458 -411 -338 499 -765 933 -599 155 273 -966
3627 -966 838 -701 146 291 -606 210 -416 1 381 -779 967 -561 -203 88 -752 888 -892 693
3645F93q84o7Q40j228J142j48o37J051j555R93k66m31J609j922J268j195N36N64
3663C63r51J186r17L40L67j046J310p86k33J070k104K293j808J037K79r85J392
3680H07j386Q13K1o33J166j194N60M18j179J313j585J285q4o98J052j487J026
3697B15l89J83N71j009L20K72p54J328j322J160o89l90J021j272J139n26J45M38
3715D41r27O41Po15J480j654R65k88k91Q39j500J572q57RK86q51J392j022M3R62
3735F32j423J320r75J58J016j471J781j589O70P1r10J430j291P79j51q04J296
3752E39j314J146K37j129J460j917J090l24L6J055j604J438j331J92O25r48J306
3769E57p81j12R38j150J495j288M49K90j092J339j208N96r4l77Q76q26j70P81
$$ plain form
3645 693 -191 -258 582 -646 496 348 -289 762 -793 200 -66 -497 1112 -810 458 -737 -201 363
3663 363 -588 598 -319 21 388 -658 652 -134 -367 703 -1401 892 -916 121 400 -585 807
3680 807 -579 234 255 -378 788 -406 154 572 -607 706 -879 406 322 -376 676 -811 215
3697 215 -174 9 580 -429 -109 163 -591 737 -585 575 -114 -504 517 -755 384 -142 3 441
3715 441 -486 155 162 -453 1027 -627 338 50 -241 598 -902 670 -187 -178 108 -743 649 -373 -330 632
3735 632 -791 529 -446 -288 728 -743 1038 -551 119 190 -720 710 -581 198 47 -757 539
3752 539 -775 371 608 -521 939 -978 112 -212 -176 879 -725 713 -618 -426 199 -749 557
3769 557 -224 -336 602 -548 947 -341 108 398 -694 645 -563 33 -61 -438 438 -388 -558 223
3787B23p11R02p15M92L49r84R28r12P09Np87P55p04j57Q44p30J065p96J20M98
3807C94j011J073m96J37M12j131J330j187O10R3o30J205j591Q86n8p67J618j617
3825g30J083l78l72R72j092J171n42n51J086j595J235m68j72J113j436J386r57
3842b47j07Q77j271J784j204M45K33j146J350j309J028m59o18J212j233J192k56
3859B71n61Q27j249R75ln41J297j321O90n10j58N30p28J106q22K29Q2o97P00n0
3879F7j18O32j015P81n70J44L46o07M89k97k74N91m51M42p5n19R43j054R40k78
3899A17l43Q82j173J103r61l6O48o10Q01n94n8P03j350J412n92K7P03j447J367
3918E99j565J166J65q46J252j413Q00j26p60J272j053Q99p7r74J508j839J441
$$ plain form
3787 223 -488 414 -301 191 540 -444 484 -428 281 286 -501 254 -450 -607 237 -493 572 -224 -104 394
3807 394 -617 456 -40 97 509 -622 708 -479 131 224 -406 799 -792 94 36 -731 887 -730
3825 -730 353 -25 -397 575 -517 654 112 -439 647 -948 287 -181 -353 760 -676 710 -247
3842 -247 -354 523 -748 1036 -168 277 510 -636 714 -595 433 -26 -644 568 -665 527 271
3859 271 -290 537 -712 263 260 -281 1016 -305 385 -125 -283 247 -481 625 -197 32 114 -583 117 67
3879 67 -51 581 -434 347 -223 -79 267 -340 149 -148 -422 169 -282 160 85 -434 509 -545 395 117
3899 117 -226 656 -517 586 -375 -411 237 -373 428 -166 -224 479 -871 541 -51 -24 679 -768 599
3918 599 -966 200 365 -481 771 -642 158 32 -728 544 -509 390 313 -661 847 -992 449
3935D49m34OQ95j597J431j133J93M68r83J172j150M45P00j350J682j196N47l0
3953A15n73J003p61P24m54j84K14l01J18M35o25R31j107M74n2k03O03n99O83m92
3973e1q1K29j49J33K69q38O51n79N17J68q62J177q57P21l56l77O50n60L60kp71
3994f08J253j226O38Q7o61J499j829J340o30k07P23j002J064k61l38N35p35Q82
4012E24p32J8R32j941J955j364P26K54r71J372j346O78J32l15Q44j271N08J82
4030A85n59J102j537J587j018j11P98r84J200q95L27L18o69L85n1l0N73j029Q44
4049D36p40K43M35j039J130p11M41k21j65K06j68J3N30p90M45o3m26P89n95M80
4069B30l63L5M77n25L82j49j65M72j026Q54j36j52Q64j394J168j048M19L04o82
$$ plain form
3935 449 15 21 916 -681 750 -383 -190 278 -705 467 -683 -238 462 -888 794 -402 145 115
3953 115 -458 545 -216 508 54 -130 84 -217 -99 336 -289 642 -465 9 -43 -246 357 -242 441 -51
3973 -51 -132 97 -52 81 350 -488 163 -416 101 269 -593 584 -273 448 92 -285 365 -195 165 163 -608
3994 -608 645 -581 57 144 -517 982 -847 493 -137 -344 379 -623 441 180 -158 377 -358 524
4012 524 -208 -190 742 -1199 756 -608 118 372 -599 773 -573 105 237 -78 766 -505 3 185
4030 185 -374 728 -809 778 -240 -351 447 -537 663 -232 95 413 -256 129 78 48 621 -408 436
4049 436 -304 -61 374 -665 465 -246 195 -26 -191 15 -153 -140 390 -400 45 -18 -444 345 -250 230
4069 230 -133 -98 379 -146 236 87 -78 394 -632 222 86 -66 798 -596 572 -476 -57 247 -435
4088d35R59o62N7L76q05J156r11M77J68q23J322j407R51k36p65J266j255J057
4106D90o61k38Q79j096J085o46N5P02j140J287j045K34M55o53P58j018O96J58
4124C02p22P69p49L41L73o42R74j051Q97n34k91O19n76K74N4l38N19n33N57j04
4144A39j75L67o44N17l59n5N79l64L93m38j66N20o93O33m46o3L61n62L69J51k14
4165a50O55p77K93n6p5O81j103P89j40n22P30o75P44k34l59O55r94R14m95j02
4185b21O32j139J343r27J32N73j081J210p92M58k0o46J051r28M33nn38R25r08
4204d48P29O7o59R27j369J197o37j00M21m80O85m36j47L79m98M77o1l6L59p97
4224d27P04n15P8L61q22O79n67L46L23n23N42l62L17j70l21P37l70M9K69n78J09
$$ plain form
4088 -435 524 -138 -81 295 -510 646 -265 212 380 -443 879 -528 423 187 -578 688 -567 490
4106 490 -171 -409 470 -626 459 -187 -132 570 -570 717 -328 -94 361 -292 466 -552 144 302
4124 302 -420 349 -400 -59 314 -328 646 -405 492 -42 -333 286 -290 -16 38 -300 219 -314 243 139
4144 139 -36 331 -313 204 -155 -210 369 5 398 -40 -206 314 -379 254 -192 -255 106 -456 -87 64 -150
4165 -150 505 -272 21 -35 -110 571 -532 257 117 -405 325 -350 394 160 -199 456 -538 376 -119 -221
4185 -221 411 -728 615 -312 -180 393 -688 522 -270 188 168 -478 573 -355 78 73 -465 460 -448
4204 -448 281 348 -311 616 -753 444 -193 -293 128 -352 333 -103 -250 129 -369 108 47 11 370 -427
4224 -427 277 -238 -160 201 -621 58 -509 -163 160 -363 179 -183 134 -36 -357 380 10 59 328 -250 -141
4245a41n0J79J55k60K94j94j28L86p90R41m73J9J20l26P54r09P77m70j49O67o17
4266b15L18J84n95Q46p86M75j1p10Q79r37R87k52m14M43o83N39o8j11O80j044
4286d75N72k11j8P14j134R65p17J01M14m83O73m20J46j08l60N45k58n9J50m91
4306d54P54l71Q5K88o66R77q34N36j66r7J66j05n8Kn47N99p09N95K54o92Q07q09
4328d45P32k67QM8k10L87j81m75N89p10Q18k21k83N94q79P62k89J54j61k38P38
4349D71m51j18K44l71O23n03p1M49n75Q83r13K78J25l78O16m73K87O9l48M91m09
4370g4J22K32p23R46j076P85k51r2L84n80N89j46j04L53n09K19j60j05M61p06
4390d35P32l24j69K16m13P09o21N20j96p3L41k04k65L69p53O54j82LL96j000R85
$$ plain form
4245 -141 -191 -12 143 -117 177 -17 -145 241 -549 392 -81 -62 58 -268 486 -423 354 -116 -265 402 -215
4266 -215 103 287 -308 538 -248 227 216 -494 385 -552 435 183 -231 212 -471 68 0 -111 569 -475
4286 -475 97 -114 -132 582 -552 413 -304 -203 211 -272 401 -19 127 19 -341 204 -54 -113 37 -454
4306 -454 300 -71 14 302 -364 613 -221 315 149 52 218 113 55 57 -490 109 -600 -5 249 -443 364 -445
4328 -445 287 20 28 76 -134 253 72 -403 186 -524 294 73 -210 384 -495 267 -22 132 -29 -267 471
4349 471 20 -98 146 -225 398 -105 -176 273 -302 581 -332 -54 71 -307 309 -164 123 192 -156 335 -74
4370 -74 48 280 -443 503 -573 212 -39 -131 253 -327 262 116 12 365 -144 75 -85 -190 271 -435
4390 -435 297 -27 -196 20 -393 316 -305 215 19 -54 287 83 -182 187 -566 88 -94 -91 305 -695 290
4411B90o68L30K62l63L82n17M21p1m77N77n58L89J44m39O99q67P20m06l60Q29
4431C17n18K55O5k94O47o06K92O0o28N71n68N66Q2m82N50n65M37j60l05M95m22
4452b11N01l84j73N36n54N31m40j05M68n66N33k23J22J79o15M51j73J09K45l75
4472a44N84m86Q6J30l19K21j75L28N2n54M54l54J00K44m25P58q23L35J69m46N79
4493C14l72Ojj56K46k34J79K19m84L57m06R24o29j48M37n30N54k04j96L07l57
4514a74N02l62Q8L4l24P36p68K11K91n38R32q46M88jl81K53l41Q7L4l18O59n34
4536b72R5N3j63N03k55J87Jl34L60l43M59l55P8K6l55L14l7j58K42j07N3Q5j15
4559c8J29k55K69j84j46O04n16M19l8m42L51m94P43n30m4M03l25K39k75J17J47
$$ plain form
4411 290 -378 -48 214 -149 233 -284 137 66 -411 166 -392 -3 141 -298 401 -466 254 -152 -512 317
4431 317 -201 54 119 -175 472 -134 158 218 -410 161 -407 159 241 -241 309 -256 181 21 -284 211 -211
4452 -211 290 -94 -267 269 -285 246 -194 -299 169 -397 136 -87 35 214 -401 50 -123 -14 231 -144
4472 -144 440 -46 40 170 -149 72 -103 225 277 -277 177 -177 -77 167 -258 500 -323 12 181 -265 314
4493 314 -58 -52 -53 -209 37 -197 -18 201 -283 74 -332 592 -37 -185 252 -278 276 72 -124 183 -174
4514 -174 328 -34 54 88 -236 500 -268 -57 234 -304 628 -218 270 269 -112 141 -200 -113 -79 -397 262 -272
4536 -272 -177 -124 -287 216 -39 148 149 -185 175 -168 291 -64 14 40 -315 -1 -38 -196 46 -61 -8 77 -38
4559 -38 91 -164 105 -79 -225 379 -137 282 244 -198 153 -341 402 -128 -172 231 -94 145 -130 -13 134
4580A34m41L53l24K80L59n12O72p93J57K48j79L32n07O7J64k49M82o18M10J65
4600B00m26N27m18L44k03k80M81n40N52l94j71P94q25K82q1L23J12n81N26p12
4620d90L92K92p8K63n16K2Lj03L62o7k59J38k65O10n29J91l5n8RO7l1M2J7K07
4644A84r0l90O29n57L36j59J19J90n43N19l87K33J5l6j7Q6j67K22m65M59l43J22
4666d0J90l04O05q80O68k10j60L43n88N02j55k91L89k84M17j62j96N13o24P12
4686D45n03Q5L27n02J46q1J56K28l45K90n32Q2L71m63O84o27L57j2n54L48j20
4707b20J49Nk46M26k70J01M7k40N88n41M58k63j97L78n27M12j51K56ON2l20L79
4729B82m41L67l49J13J04m29O65m78O7J3M1K45j18q1r1J67R5k17J88l4m01N45
$$ plain form
4580 134 -307 46 -278 2 361 -151 521 -272 -115 133 -46 286 -221 -154 10 -239 243 -375 35 200
4600 200 -226 301 -117 227 24 -256 225 -315 237 -157 -328 466 -359 -77 -158 165 277 -304 222 -490
4620 -490 -98 194 116 379 -137 -115 -112 -215 147 80 -179 -41 -306 304 -225 -34 -69 -127 -118 -51 -82 -40 -23 184
4644 184 94 -296 333 -224 112 -47 72 262 -281 238 -149 84 99 63 46 132 -35 187 -278 181 -162 -40
4666 -40 150 -154 451 -429 239 29 -131 212 -376 126 -29 -320 69 -215 202 40 -156 357 -267 445
4686 445 -58 27 354 -148 -2 -83 73 301 -44 246 -286 -204 167 -296 388 -239 118 106 -448 -100 -220
4707 -220 -71 -66 -312 114 -156 -55 -8 -248 340 -201 257 -6 -203 175 -352 60 -91 165 171 223 -97 282
4729 282 -159 208 -141 -28 76 -353 312 -166 -99 -86 -45 200 82 1 -90 77 172 -45 143 109 -292 253
4751B53m78L73l23O3K42l75M11l81K58J76m67M40o9j37L09o99P47o17J54J18k20
4772b22K05j12L07j5l59L95m06j94P00m20K12l68M22k25j15M24m19K59jOJ74l78
4794a30K96k17m5L89n44N24m05J83q7o3J08k75J50K75j09K06m92N44m8l66O7q2
4816a21K12j2k29J25k91N21j43r2K67j62k16M52p65O95k69K5J44l29K66k07K59
4837A30K6k84K24j58K5N0j23K12m55O51m34m3K92m07L93l11J62J85m81O06n10
4858b50M0M92m59N78m58j09M40l68Q4j00m7L54l24J40k46K77J60m93P02p44M88
4879A57k7j71L42n70L50o6k7J11j98L27m29J86J28k30K40j70p8m3P8J5k86N39
4901A78o5N6j22K4k42K13j01J41M8k16L00o88N71k28J90j26O4J21j61o1K54k06
$$ plain form
4751 253 -225 148 -175 -112 130 -245 166 -215 43 219 -248 192 123 -14 295 -404 343 -274 -120 -2 -222
4772 -222 -17 -129 178 163 -196 199 -207 -401 299 -121 91 -277 145 -80 -195 229 -190 69 68 74 248 -130
4794 -130 166 -51 -96 293 -251 273 -132 51 -36 -99 9 -266 -116 159 50 256 -236 308 260 -106 -39 -121
4816 -121 91 79 -150 -25 -316 205 62 -30 237 75 -141 311 -454 241 -28 -3 141 -188 78 -129 130
4837 130 156 -128 96 -62 -37 13 -110 102 -353 298 -136 -179 113 -294 99 -212 -50 135 -346 260 -250
4858 -250 -210 282 -177 401 -57 -166 274 -94 -10 -110 -157 197 -127 13 -233 44 204 -289 413 -331 157
4879 157 130 -41 301 -269 81 15 -12 99 -99 228 -201 -15 113 -117 123 -47 -125 -168 -90 -75 -361 178
4901 178 113 169 47 71 -171 42 -59 82 130 -86 214 -474 97 -131 59 -67 -3 118 -43 -104 150 -56
4923e6L71J0m62J62j99K53k37J5M06l43J08J01j37J31j85K23l80L39J88p50O70
4944B28m84L49J53l08P9j26R9M4R0L0k07J02P1m11M63k85M00m69J61K38l94M26
4966B49j94p7P5k32N16l46m0J61m00N38n01L56J36n04K3J36J67j83r3L30k23J83
4988G7J35k58L74n23K48Q9k83L17m51K53j0m5J28Rj18J63l17J90K60l23J62l71
5010b94N93n00M42k15l60L62m0j65K20p9l1m9p3K9J59L02o30N13k25k67M72p0
5032I4K55o42J35J89l52L75Pq0J31k34N24o78L07J64l88M64j81J62k46p8j21K15
5054B2p7K61l56J47j30K56%l27K51k21L17p8n7R9J2q0J85l19m8L2K43k6l55O01
5078C52m09J95l58L24n3l1K34l76j65M84m07J83J12k01J84l30N99k79p6k7J86
$$ plain form
4923 -56 315 325 -137 25 -174 79 -158 -143 263 -80 28 129 -8 123 -62 161 -219 120 308 -442 228
4944 228 -256 93 246 -62 17 -109 -10 34 124 154 -53 49 120 -291 172 -113 287 -182 -21 217 -177 249
4966 249 55 -22 53 -179 337 -9 -49 112 -288 250 -251 105 241 -263 -240 -104 63 -120 -213 117 -106 77
4988 77 212 -46 328 -195 53 142 -141 176 -275 -22 -32 -77 51 60 -58 105 -212 -22 238 -85 77 -294
5010 -294 299 -201 241 26 -334 28 -12 -177 43 -36 -67 -116 -189 -160 -1 301 -329 184 -41 -308 164 94
5032 94 349 -293 -158 31 -321 54 61 -19 112 -122 402 -276 31 195 -193 271 90 252 6 -72 -193 22
5054 22 -55 206 -150 -3 -133 123 123 -204 47 -174 143 65 8 107 119 39 224 -95 -143 -111 132 106 -249 352
5078 352 -57 138 -220 104 51 20 254 -122 -287 197 -210 -27 85 -116 68 -262 337 58 -18 -45 141
5099A41j74k82M04R4l72K0O9OJ17j06N9j84K07r1j56M16k90K55j37k78L46l40
5121b76M86q5j53K99m45L37k06k89M26k39J28K6l01L71l89L00j79K21K18l29K5
5142e4J62QR5m06L34k65j90L89l01L73j51j35J54j05L08l13J10l6r2L54k58P3
5164E4l7J0l7r1K90j59k68L11k18J48K30M9o2n15M53k09j58Q1J74p1J30j99J83
5187H9m04M97o0j09O3q0j08Q9j74K09j23j12L02j39K14k96L62j16k67J03m0Q4
5209a6j35K48J44j86J26n8k18K81k07K05m61K22L64n47L75m49L51l9j0J24k41
5230a27J83n8l9j99K02J62r9J89Mk69K3Q6J22j24k37M61k53k27L92k15M6nk7L25
5254C16l88R6j81o9M22l75J62K36l47L98l99L28k21n9M2j36N33n64J44p0j94K91
$$ plain form
5099 141 -33 -315 89 183 -189 -169 -100 -94 23 -83 -24 -208 -1 -92 -248 168 -122 133 -4 -282 64 -276
5121 -276 210 125 -28 271 -174 163 -43 -332 94 -145 -17 9 -292 79 -310 -10 -189 32 250 -79 -54
5142 -54 108 116 211 -195 139 -126 -316 73 -228 145 -6 -141 13 -92 216 -97 13 -23 -115 239 -19 54
5164 54 17 27 -10 -101 189 30 -238 73 -145 3 233 282 220 -295 158 -51 -209 -128 46 -25 105 -94 89
5187 89 -315 182 122 13 76 -4 -112 -23 -197 12 -111 -223 79 -60 154 -142 220 104 -163 -60 -100 -16
5209 -16 -151 97 241 55 181 123 -95 186 -21 184 -277 -55 309 -238 137 -312 39 0 -10 114 -127
5230 -127 56 -2 -41 -240 -38 124 25 214 218 -51 -28 58 180 56 -181 280 27 -200 192 -23 23 18 -9 316
5254 316 -72 24 -157 -226 196 -179 -17 219 -128 270 -129 199 -22 -81 -39 -175 358 -206 -62 -132 -326 -35
5276c5j6J64O3k82J37j21J44j11L2nj68J02j8j80L69L6M7r9k77N09q4k61K21J0
5300A77R8k34j2q6o0K00l68K25P0m1O4K08j99J91m44K74k58M3J64K46l33j76M61
5323B10k78l2N1l8J9J0l5K69j41N7j93qL37k16J09Pr7J41l27Q9o4K5J41j70J77
5348D3r6m0L46o21O21l88J92l04K37J3m29N21j11r8K03j51J78Mk07O9r4J86j60
5371h6L6L46m51N8L4Q8K47k62m7j24m5M15l34J31o8j54M5R6J82Kj53k20K49k49
5395b64L76k19J97j00k03L5K33k3J45m05K4n8L59k15J53O3l28L63k17J85j35J63
5417A29Kj18K3j12K67j58k55M66l09R4R6k16L00l42J24J42k95K97j16P5j64n2
5439a22L43j73j24k8L86l33J8j73J35O2j03P2O4J44lk09jJ10k11L76l33P6J43
$$ plain form
5276 -35 -51 113 176 -106 31 -90 54 -57 -25 -30 -198 -96 -114 -294 75 111 158 59 -218 291 207 -54 167 177
5300 177 275 41 29 -57 -117 83 -285 -60 10 -31 33 241 42 233 -211 63 -195 -152 12 258 -75 -251 210
5323 210 -68 -100 -49 -87 -68 -58 -93 176 35 92 -101 -109 228 12 121 128 31 172 -155 -66 -130 -105 36 -134 43
5348 43 -53 -93 253 -368 253 -135 57 -247 -10 3 -426 95 -16 -114 89 -62 116 120 -87 -18 -112 74 -86
5371 -86 -50 296 -155 -97 -63 25 272 10 -37 -161 -206 209 -125 6 -62 -216 -171 -75 107 109 -44 -264 -15 -264
5395 -264 112 -107 90 -10 -213 -178 55 32 177 -228 -204 -262 97 -118 35 98 -230 133 -84 101 -34 129
5417 129 131 13 36 -76 191 33 -222 244 -65 29 125 -91 209 -133 -9 133 -162 135 19 94 -70 -122
5439 -122 221 48 -76 -104 282 -51 -33 -206 -71 -9 -112 -40 24 168 165 -44 -45 65 -146 230 -103 -27 116
5462A16p9r5kj23J12K2R3P3l24L05j04k24L3O2K98j23R3l15J73M6k00L46j86J09
5486A06k0P6j55K41m27J03J64R3k25j06L43k45K09k54J58m3m5K4K6j71R2O1l13
5509c08K91l1K12j55MK08k02J75l18K55j25j67M03k04J97m74J97J46p7J67m01
5530b07K56J7q8r3QJ18j75O5N03o99K17q7J6K23m45L75lP4R3j25p7p0J99j66J70
5555I9j99Q6j78J75k43M39k97j47K08r2K82l85K65Q4J44j74k67J55K65m22j7L10
5577I1k64L6L20q6j66J92k28J55J27q8n5K22j46J33j94L2K3l07L06j05N0n0O4
5600F2J57l28J40l9J5R5p9m8Q6k81J37M8J75k81L16J03k96k7K44j55o5j06J3K00
5624H6k63J93m8J37O2k48K48q8J1o0k02RJ84N1j39J53J15l58M16m75l5K19j4J90
$$ plain form
5462 116 37 -58 -60 -183 -71 -49 44 117 -207 98 -6 -230 -197 -135 163 40 133 -182 -9 37 -163 183 -3 106
5486 106 86 162 7 248 -179 -76 88 181 -44 -150 193 -52 157 -97 61 18 -27 -3 23 -148 -56 5 -308
5509 -308 -17 -48 164 9 13 221 19 194 -124 131 6 -161 242 38 235 -239 -42 104 27 194 -207
5530 -207 49 66 -22 -115 -107 11 -164 -99 404 -295 -78 -165 -149 74 -371 4 1 75 168 43 -34 -104 95 -71 99
5555 99 -100 -14 -192 -17 -260 179 -118 -265 -57 -149 133 -252 13 97 241 67 -200 -45 220 -202 -219 91
5577 91 -173 -137 183 97 -69 123 -105 50 177 89 34 256 110 243 49 81 104 -203 103 -2 48 -2 62
5600 62 219 -109 31 -8 7 102 23 -25 61 -220 -83 -35 140 -141 175 278 -18 -45 199 44 -21 -127 -114 86
5624 86 -177 16 -32 105 167 -81 167 79 90 30 -172 -163 21 72 -67 86 201 -157 259 -216 -251 -32 -46 144
5648A44k18Q3J20p0j12l5k08M85k39k9K07j40Q8k64K18j35J40J1j15j01LM0K29
5671A02k60K72r7k2m8Q9K1r2J15j25m5L5Q0j0o7p6qr0J58K78l46K30j19q4M0K49
5697A80K2k55J15k7MJ3L7j28L4k10L24j56J78j12n3m3J87L9m5k36L19k31kK74
5721B28Rj24j89Jk31M47K5k50L21k29n8J44k09K28k88K08l93J96K44%j54J51m6
5744C1J78o1l40K64l30O09l19J1J72k55k1r3K80m13K82J24j83R3K7k04L43m7j17
5767C1K0j32Q4R2j46j02J10Q8j01j38P8K13q2j89K54r9J64M9k51p2J78j5L3j60
5791i3M3NJ54M9o9l4jj31J26L6QO8m8k07M7K07k19j84L47j78j05k8J94Q0R8j15
5817E0qR0j67p5K25p12N58Q5k13K89j85p5j06K77j15k26J51K46j69J32k28L2J15
$$ plain form
5648 144 -74 9 129 59 -53 -88 -296 189 -50 -79 128 -12 76 -188 30 -105 35 46 -69 -170 -167 -127 102
5671 102 -158 114 17 -5 -53 36 57 -35 80 -45 -90 -55 25 15 -52 -128 -136 -226 -68 210 -136 94 -25 -109 -69 180
5697 180 202 -53 62 35 39 52 89 -39 -5 -215 109 -47 131 19 -34 -77 110 149 104 -132 187 -44 -46 228
5721 228 237 113 -76 -75 -306 141 166 -84 237 8 -50 94 -115 113 -175 33 -360 -164 80 80 -74 77 31
5744 31 209 148 -192 72 -258 351 32 43 215 -40 -61 -154 126 -287 -5 119 -64 29 56 -148 195 148 31
5767 31 51 -81 3 95 -51 -153 -43 45 -56 -194 -116 97 15 -174 80 -19 145 194 -57 -129 49 34 67 -93
5791 -93 -50 -45 109 158 89 55 54 -77 49 85 93 161 113 -94 -47 160 -59 -243 104 -74 -179 -207 -13 67 165 50
5817 50 42 132 -35 -110 115 -597 -39 46 -167 122 -63 -138 -244 33 -82 -308 -157 89 -80 52 -176 -144 -29
5840b9l9j23K52R9k70j09K39j29L7J4K16k06J4P7JnR3j50J4Q3j26K0k32N52k78
5865A5J9J55m49L67k38K33k35J21n3l6O3J90r9L0l15J73J75j24km2J87k29j05
5888a99J99J27r3Nr1J84l04K57j36L4Q0j16K24M4j30r9q8J55o5o2N86n92N0P0
5912D0R3L8k99L12k95j31L69j38J09j82j83N02m60K75n7K42j70j84J68k24K25
5933E0j62L3J56q7J19l27K62J33j48j29J1o4K51K8P3l53M4K82k43N4j75J47N5
5956A0j25N8q2M0J91j12m9K10j07l0J11q6j4j12J08j66O3K30K7j00Jl4O5j51K74
5981B20j90K1J62k63j15r7L08j09J32p6M9N4m5j6j50kQ2j95K44j30l3J79m2K09
6005A97m78L6J79o9J53J01M0j78o1J89j80j83L09l77N72j85j88J03mJ17O8j36
$$ plain form
5840 -29 -68 -191 61 160 -110 -219 20 -109 -72 -58 158 -48 -34 43 44 39 132 -18 -4 79 -47 -27 -259 293 15
5865 15 34 189 -260 107 -131 102 -133 -12 -65 -101 -38 152 53 83 -232 -59 116 -8 -10 -52 135 -94 -199
5888 -199 0 127 34 39 -52 132 -172 85 -51 -17 63 -53 171 215 85 -14 -102 53 -12 -74 512 -80 -30 40
5912 40 133 171 -128 184 -111 -242 127 -11 98 -84 -267 235 -225 50 -7 235 65 -119 49 -175 50
5933 50 -112 -79 77 -10 109 -218 44 177 29 -100 -89 -153 98 126 199 -154 -110 172 -71 -17 -192 -45 10
5956 10 -115 -57 -139 -99 92 -20 -69 141 34 4 115 29 15 -97 11 -155 -92 138 165 65 66 32 97 -54 220
5981 220 30 51 213 -50 -165 -262 46 -63 69 -7 42 96 51 35 -115 -117 -35 -230 14 -116 -149 30 -12 197
6005 197 -281 -245 -66 -135 18 119 159 -19 -80 109 -71 -254 55 -322 250 65 -123 -20 -24 93 161 25
6027B5j54R3q2R4J2P4m73M79j95J72J01k51K58j42j5K3j54K85k70%J50l9J8k16
6051b07Q2K58j49M8j51J11J00j82K26j71J41j34J43Q2j74Q6j87L3m6j00L43j17
6073C5r6Q8o3opLQ0k00J78N2j88L23m46M43j52j2J69k45N7K0J07j99r7M02m61
6098b15K94o2l3j23K77j27R0l21M47o4o5j44k26M04k66J20j76p9L01l1Q9k43N9
6121i4L8j23M27o20L36K02j48j09r5Q5J31k25K76k82L89r9k02L9j28O9m0O4L1
6144g8J30k5L3j4%o2R3j59j50J12k6J68o0m2Pq4J49k4j29K79k99J69L77l22n4
6169a1J65L3k6k34J50o3j23K32l12K40k23j16N05l16J49p5J59k56M3L08k54L19
6191B94j99O1Mj58K1j32N5K16k14J32j24J29p7o9K80j73L6N0l10O2J08M0k32J47
$$ plain form
6027 25 -129 -36 -118 -24 -12 62 -411 68 -127 45 146 -105 153 11 -4 19 -135 150 -120 -120 30 -9 9 -207
6051 -207 -125 133 -16 32 -119 -8 92 -90 136 -35 106 -28 115 197 23 109 -78 -45 -91 -191 152 35
6073 35 -61 27 -36 -42 -49 -46 34 -166 12 64 -124 199 -247 196 44 32 201 -44 13 33 140 -59 -156 246 -215
6098 -215 79 17 -16 -139 138 11 101 -220 227 163 98 -46 -272 132 -134 -14 -190 -269 32 1 90 -153 -94
6121 -94 -56 -179 248 -372 -36 166 18 -91 -186 -101 30 -195 81 -201 188 89 -113 -74 -202 -133 -173 -109 -78
6144 -78 52 27 60 46 46 -16 77 -82 -232 -120 -146 22 -38 -80 -73 -157 -8 -32 -161 118 -181 -12 365 43 -11
6169 -11 154 187 161 -73 77 14 -109 123 -189 51 -172 -288 217 -99 50 -25 134 -122 -79 229 -25 294
6191 294 95 156 160 2 23 -109 -54 162 -52 80 -44 85 8 -61 219 46 82 132 -178 -116 -8 32 -200 -53
6215e3J1j52K74j13J88q6J7j47M0m7J56k23J49m1j87K80o0L3p1J38j65j59K41
6238B3j26J78k96J55M1j82J21k0K13Q1r6j84J03j05R7L2J81r9p2m5m2p2K44k37
6262a07J25P0j74k36J68L59j15m9kj72J36L9j9J69m27J77n1J44j0k44L63l17J53
6285b0K7L6J73m87J63K45l38M47m16L64o5l08L37l84K84k43L95k03j51L36j08
6306H4l06L89k05p0p0L14k19k38L78k2m6j06L40k21M6LL77n70O1O8J51j88j9K78
6330B09l86Q0J79m3l1J6N7k2j83L20k87J68K31l90L7j97M15j25J30J2k11n4K36
6353A61k08J59J5l71K16j20K30j89K43j3k08M9r7K38j34m4K70l85J54K3J50J85
6375C24n54N53m00J47P5k81L34m13K85j31J2M36m38k7J46q7n0k74L90J72k79J25
$$ plain form
6215 -53 -42 -194 80 -33 155 69 86 -61 -21 -68 88 -135 14 -27 -214 66 6 39 -32 106 -59 -218 23
6238 23 -103 75 -221 -66 -25 -207 -86 -106 107 188 92 -92 11 -94 3 35 216 117 45 0 -42 -114 130 -107
6262 -107 18 88 -86 -322 -154 205 90 41 39 -133 3 42 23 192 -235 -58 -109 35 25 -219 144 -173 -20
6285 -20 7 43 216 -271 -108 137 -201 246 -170 194 129 -179 158 -226 58 -185 210 7 -144 192 84
6306 84 -222 167 -38 -108 -178 136 -83 -321 57 35 -11 -117 223 2 48 51 428 -142 -81 -13 138 -50 -69 209
6330 209 -177 -97 82 39 8 24 81 59 -124 196 -91 77 308 -82 -45 -242 173 48 178 190 -21 -75 161
6353 161 -47 112 127 -244 -28 -148 82 -107 136 123 -85 -36 -133 105 -29 -73 197 -188 -34 -11 139 324
6375 324 -230 323 -77 70 145 -136 198 -215 70 -61 -49 387 -51 -78 68 -19 -69 -343 47 219 -60 65
6397F5k26M04j19M8k75J09j26J48k70M39n29M33j14J25j36L0Q6k17J63l55N25
6418B08j24j77L9L3j70K65p7j79r4K31j42K08k46L69j95O1O4L5L23m60P3K3Q1
6441A49o9j22l5n4j3K91l76L38k7j19Q0k21J22J7k03L96k14L86l07J94J39o56
6463c04O21m66L55l9k67L47l37J97m01K99J50k48L83l36o4L18m24M07l9j68J38
6484A22m10K47n7L05j19j50N53o35k75L06J36J45l23N1J00L2R6M0j06j29N5rL4
6507IkMk80M44o6j78K34r8L7j26J71q9k30K15q6J53K2k14q8l7L23k5k25J30M1
6532C9J16k64m7K26k91K72J21k33J24k43K30J47n03O66o70M27k48j74M56k53K99
6553A97k75J65K67l18m5j00K22n5l83M87l21K03n7k04J67M0mJ85l52L62j75j5
$$ plain form
6397 65 -161 243 124 172 -103 6 -120 28 -242 197 -332 101 -13 112 -24 6 92 -125 38 -317 208
6418 208 84 -93 -54 -21 -191 74 -3 -182 -276 -45 -187 21 -225 144 -51 10 74 109 432 -28 45 68 149
6441 149 80 -42 -77 -131 -144 147 -229 109 82 -37 43 -178 -56 -39 -242 154 -60 326 19 213 352 -304
6463 -304 317 -149 206 167 -100 247 -90 107 -294 5 155 -93 290 -46 -110 208 -216 191 152 -16 122
6484 122 -288 -41 -98 207 88 -62 491 -144 -419 -113 23 168 -155 -104 -4 28 124 164 58 -71 -16 -25 9
6507 9 7 11 -269 175 109 -69 165 67 104 -22 149 60 -170 45 -41 112 134 -80 -168 -205 118 93 -132 -2 39
6532 39 155 -109 -156 70 -221 51 172 -61 63 -180 50 197 -306 360 -310 117 -131 -305 151 -102 197
6553 197 -78 87 354 36 -9 -109 113 58 -325 162 -159 44 -13 -217 -50 -10 -14 171 -181 181 6 -9
6575ij13j3L95l05k3K91l97J51o5J70R3k34O5j39K67J4l57P5R2l8R7R6j9j18L62
6600C38k98q0K50k25J18k48J45m0k7P7jL2K25k34J00j34j79J08k39P64n55J66
6622F3p8k23M16l83J33K13m18L70j01p5J08k42L15j29q7K98j80J95l38J92j39
6643i0J67J63l51K12pm12N78j98J69j77j30L22l70M64n45J63K03k73K8J38L4J99
6665B87l91K67k45l09M39j20L46l63L4Nj78L13k93Q8K05j96M0j46J67M1j3R5k84
6688b11K84p2j57J59o2KQ3j29J10r9o1L06k21J49k05M4L2q4J80l9k7J37k26K64
6712A57j69n5J32j34K39j92J13L7j92K61j75J81m57K17R0l9M8j21J15J33k91M6
6734e6J61l98K49k8O2P7l6j5m6J17J77J3l46r7K62PKj19KK35L6j58k20j73N15
$$ plain form
6575 -9 -122 -135 260 -45 -68 223 -174 -23 -88 82 175 -59 6 -133 134 148 -209 -134 -42 -80 17 113 94 -24 338
6600 338 40 -40 210 -15 103 -145 0 -40 -67 10 9 41 266 32 132 -2 -181 -73 -312 452 -103 63
6622 63 -15 -238 178 -205 -72 141 -277 93 -8 -83 25 -217 98 -31 -118 180 0 195 -143 49 -90
6643 -90 77 240 -111 101 94 -318 260 62 231 54 -76 246 -124 340 -205 -42 161 -112 -84 54 88 287
6665 287 -104 163 -82 -391 48 -72 274 -89 -55 -50 -228 85 -208 -120 85 -111 -71 -217 -50 -9 -22 73 -211
6688 -211 73 1 -156 3 -59 -57 26 -103 7 -92 -153 153 -68 81 -124 -80 -48 -132 48 9 -18 119 -107 157
6712 157 -12 -67 65 -69 170 -22 91 128 -64 197 22 203 -254 -37 53 14 62 -59 56 189 -102 -56
6734 -56 105 -293 -44 -72 -10 67 31 16 -30 87 264 277 -69 -166 96 103 105 -14 -12 223 259 101 -119 -292 223
6759B23l09J44k76K71J16k22J59o0j35L70k19LJ42k1O3k24L88m40j32J51o5K26
6781A53k51R3j99K67m8j33j1M7J13j0R9k46J30j10P2j11L03l6Pk09j40L60j06
6804C4Kj52lQ4J87m11L77k33J95J3N9l87J55M7q2J68r1K30k36l8j63K53k37K56
6828B7q4j17L84l61K17J48j19r6N6j53L33m10J20k47L45q3m4K41m48N97k17j73
6850h4R4J15k31l2J95J39k31L46m49J33L26m18L03n14L45K5j03R6j26P8J16j81
6872e8n2J73k74J06J19L28l11J47j49K11j04m58M69l68K86m1n5P1Lo4J15j60N2
6895a4j56K64j59K9J49j20j8J17p6J3r2j39J87m5K98k45m8J91l7k18m1J83j19
6918i6j93M92k58n3K18K5M7k78P1L8kK27n73M84j18k03L77l93L02k10k11J85P9
$$ plain form
6759 223 -86 58 -218 53 169 -53 106 46 -89 281 62 65 207 186 249 25 413 -27 -159 -8 -73 153
6781 153 -98 -5 -204 63 15 -118 -129 -82 31 21 120 -126 4 -106 -34 -145 158 122 129 -80 -220 140 34
6804 34 36 -116 -119 -35 152 -259 118 -115 80 93 152 -235 -80 -33 -115 53 -38 192 -44 -82 -245 8 -229 27
6828 27 -57 -174 210 -151 66 214 95 -1 55 -98 235 -175 -55 -302 43 -40 -84 157 -291 306 89 -84
6850 -84 10 125 -106 -138 57 196 -35 311 -138 -5 321 -97 206 -308 37 62 -41 55 -71 7 123 -58
6872 -58 -110 63 -211 -105 14 342 31 178 29 240 136 -322 147 -221 65 24 -31 40 43 -21 94 -66 -14
6895 -14 -170 94 -65 -36 113 -7 -25 92 16 29 -63 -202 -15 -60 238 -7 -55 136 99 -119 -160 23 -96
6918 -96 -289 203 -55 -108 110 135 182 -96 -25 13 11 238 -335 149 31 -172 205 -188 114 -96 -307 -122 -43
6941d3Km9R6K98n05M31ql05m4O1L16n7l13O2M1J10k57P9J73j80K77m16K99j4l63
6966c09N18n34M55j43Qr8J96l2j44J53K77l93N4l5j68L49j91J97l95M03J4j96
6988a4r8K30J0N9l04r5K79pK2k79L06k42K91j12j89K54j57R5J39k43J22Q3k85
7011a35M55l68J99j97k18M59l98M10K8k29K20l30L2J60q6J69j87J78k91N00k37
7032A34j41K18n28M12J54l30M22l12J31Nl76L11l59N30j90q4M9k10Qj14L16j26
7054h0k4L34m96jN68m12K58j93J69j55o2M55n79K68j24J34j04j66m2K36J10J1
7076A05j88J28kk09K18j04L0J5r6O0p7J78j6l22M03L17m53q4p8J12J0m2L01j32
7100G4R0l85K64L6o3J85l45L3J55k24L52j52L02k97k6l7j59K93r4l10K61p0K08
$$ plain form
6941 -43 -41 -90 6 304 -201 230 222 -83 -127 -66 250 193 -120 -58 -17 93 -164 -85 88 -92 185 -231 68 54 -309
6966 -309 209 -325 130 -13 -5 -103 93 61 -83 70 347 -46 8 -27 -195 154 -37 160 -235 168 182 -14
6988 -14 -112 118 128 187 -117 -212 67 60 82 -197 109 -133 158 46 -143 111 -46 49 188 -55 67 150 -135
7011 -135 320 -48 151 -46 -264 195 -203 207 235 6 226 -104 -72 88 2 171 -16 162 -129 371 134
7032 134 -7 211 -317 95 249 -81 341 29 160 165 -211 100 -259 271 81 -3 46 -164 -156 -270 46 -80
7054 -80 -104 230 -266 -267 301 -111 147 -46 123 -32 -94 361 -218 50 -74 60 -44 -210 -252 -16 94 105
7076 105 -83 45 43 -166 52 -52 -22 -7 -103 -43 -120 58 42 -280 123 440 -13 -97 -175 -63 -53 -95 206 74
7100 74 164 -221 43 79 16 201 -144 -111 44 -180 172 20 322 25 -1 -38 -197 96 2 -308 -47 -117 91
7123I1p8O2Q0m85O97l52L5j71k4O7j60K02K34m62L66l14K76j8j64K36l1O4k87
7146a36j49K77j17L83j59o2N6j81J09j06J89P0k40J64Jj45K13j24j78MK10k69
7168a90J92N3j40K28l53l8L63j72L07l50L1j23K38j81K3J29J65n0r5L1k83Q5O6
7191f4k47N40l62P7j8p1M32l02J45k91L30K1l59J67j56J94Q0j33J94l79L35k66
7213a33K36P4k79J65m4j51J80qR2j98j0J82j82M11m42J10L4m10L86p4J77q3k73
7236b40L02j6J1k8q4J4j50L32m0j56J02n0k1K17k72J1n1J37pJ45ol30K78L8n2
7261H4k07L48m39J54j79O33m98K09o9r5J47l08L57j75qJ16Q5k63J86l42M41m26
7283b49J42J32k91M08m91M72O6j68Q1j89K45q2j24J95l57K45J88l31L26m77N64
$$ plain form
7123 91 13 75 155 -330 367 15 50 -121 -145 -78 -238 -36 198 -264 102 -212 64 46 -118 118 87 151 -136
7146 -136 -285 -8 -125 258 99 37 93 -88 21 -85 104 174 -66 98 99 -46 167 43 -135 -131 79 -190
7168 -190 2 55 -85 143 -210 -248 115 -57 250 -100 -69 -192 46 -135 -112 17 182 132 37 68 -215 -130 -64
7191 -64 -311 229 -133 -56 -74 -145 287 -15 130 -161 169 190 -169 -2 -158 36 116 -17 177 -202 133 -133
7213 -133 103 177 -102 63 19 -132 48 40 132 -66 -76 106 -76 335 -107 3 37 -373 13 -61 116 33 -240
7236 -240 62 46 57 29 -55 -41 -191 141 101 -55 47 -3 -24 193 -79 -68 -119 18 11 156 150 -180 98 136 84
7261 84 -123 225 -214 -60 -239 394 -104 105 36 -59 88 -220 137 -38 -46 70 155 -108 78 -264 177 -249
7283 -249 -107 25 -266 142 -349 123 189 21 102 -87 158 76 -48 147 -210 35 223 -108 218 -259 305
7304C05m81L27o3j7J83l43M40m39J57L8k68K88k69J56N59q17K07J49k07J77j07
7325b5K01l03l7j30J03L09j80j48K23O6n2O6l48K77j46K78l47K81rl7k23k33J56
7348b58N12o35L77K05m87J80o9M3L9J53j29k20L87p5j76L90l87L11p6k43K94j89
7370e3M44m45J48l11M2L66k63J57m6j30L58l59O4P4m05M85j91M1J21k40J65n6
7392c4J40j36j25m7K66nJ25k24L1k56K79k3Q3ok3J59l54oo1L02J22k63J09M5k20
7417a22J90r2R9J10j80K71k80q7l4J12K69k11j37J42j63J31K3j67L32K0j93O7
7439A00n7j35j10K27o1K63l00n9L10j40oj53O7Lj22L32J07m66N46n80J52O2l7
7462e7J69l33K03j12j5K70k11Q7k9M9J66j45Q3j09k4J25r6Q3j46L00k62r4K73
$$ plain form
7304 305 -176 151 88 71 254 -89 351 -88 69 107 -161 127 -142 14 573 -244 -37 112 -95 82 -25
7325 -25 176 -127 -164 -294 -191 118 -62 -210 13 79 27 93 -255 22 -124 154 -193 88 79 42 -181 -414 -258
7348 -258 254 -381 -4 201 -286 -106 -175 -132 -93 60 -69 -289 98 23 -153 237 -150 161 85 -158 136 -53
7370 -53 391 -54 94 -217 -175 191 -72 85 39 -91 267 -92 -28 46 -359 126 -65 -24 97 -143 22 -34
7392 -34 106 -30 -155 -202 64 59 184 -40 -9 -265 14 -9 74 68 45 204 -150 -156 -217 85 207 -56 53 98 -122
7417 -122 68 -24 75 185 5 276 -4 -91 -125 -13 256 45 -92 50 -113 18 41 -126 206 226 33 100
7439 100 43 -92 -202 25 -36 227 -73 -132 178 38 32 -121 -54 -51 -173 159 266 -200 346 -234 -82 -20 -57
7462 -57 112 -221 -18 -130 -145 125 -86 1 -28 21 187 42 125 16 -8 117 21 104 -42 258 -4 -98 175
7485A75l30J65r3j33J97M6r5O4j97j8J48j32J72K09J9l87L80n82K92K00j60J27
7507F7k52K63J54m25L57l45J98M6k19L18j04m1n1j2O8K14j83J45k96K51k89K3
7529a13J14q8L54k66J63k35N9Q3p8J38p6l03L17K14m60P5J54M6J13p7j4k3j2k19
7553a34J96j80J56j4k05L2m4K41o2k36J27o2J72J68k80R2J89j26j6m3J7j72j42
7576c26K68J70j27J3n4J24k07K07r2l3l8R9PJ82k41J14J04j46R7J32l26j01k6
7599b00J87K08k24q2K37j91M5N2N1M3k19P3O3m11Q29m47j1O2k6J42l06J89Ml6
7623C2O8o4J14j73M3K24k09M5r0N1k41J38J79l01K11O3o8J09k67J86k56K84J31
7646B09k14J71l07J13K59l30J99l00J16K8J26P0q8k0k2l94K70K52k70N35n59J95
$$ plain form
7485 175 -155 10 -83 -216 -19 27 -68 -4 -201 -219 -71 -203 -31 178 197 -190 190 -392 -100 100 -60 67
7507 67 -185 78 232 -193 164 -181 17 63 -156 162 58 17 -34 -46 22 236 53 198 -98 153 -136 -113
7529 -113 1 -87 267 1 164 -71 -12 71 -7 131 55 -248 69 283 -177 -102 52 98 211 134 120 97 85 -134
7553 -134 62 -118 38 24 -181 -149 -193 48 -14 -250 -123 -185 -13 155 -125 -33 156 30 14 -29 -12 -184 -326
7576 -326 -58 112 -15 -2 -56 68 -139 68 -24 -57 -95 4 11 193 -48 66 170 24 121 253 -73 -174 -200
7599 -200 -13 195 -29 -111 126 -65 -20 32 83 126 -93 -20 43 -368 461 14 3 65 39 181 -125 64 68 32
7623 32 100 36 150 -23 20 244 35 80 -10 41 -200 -62 117 -184 27 90 22 131 -136 50 -206 78 209
7646 209 -5 166 -141 -28 231 -99 100 -200 -84 -56 70 140 52 32 10 -384 -114 138 -132 403 -156 39
7668C9P8j25J02N3j78N7L1rk19J13J82j26O2k30J19j85J80K51l48P2J72k81J12
7691g8j03M39j83k10J72l76L94j63J58L4j19L85l62J53L8l46K38j80K13J06l12
7712a02M07m79L43k49l10N47m80K58mj79N01m10K79k3K3j39m21P83l93k1P7j85
7734a77K89k62L3k7J63j0R2o6%k52L55k99L74l61q7J72R7r6L3r3K88j93K12J44
7758C29m29K49j59L2o4K09j76Qj34L96l79K55M7j01M1m2j51O8K28q3l11J02K1
7781d4J32J94m86J75J20k60K52j98L43j77J91Pn37N58l07L89k95l7J29m30M58
7802A77j41j73L03l49L69m85M78r8j45K74j65J95l75Q8L04j15j44J42k12P7j38
7823a33K31j09j17J73j56J89k3k8j22J61p8k9K0j37K40l1J50k17m9K88j57j6j13
$$ plain form
7668 39 117 -8 94 147 -31 26 57 48 -171 -58 124 -2 60 -170 -51 -236 -56 195 -153 -81 91 -190 -78
7691 -78 -181 258 75 -135 37 -339 55 -108 50 84 -35 350 -12 141 179 -167 71 -109 104 210 -102
7712 -102 305 -174 169 -80 -390 157 -323 -65 -69 -248 253 -157 122 99 122 -17 -438 345 -48 -69 8 -177
7734 -177 112 -150 -117 -144 19 9 101 35 35 -217 138 -161 213 -148 -235 -63 34 -62 -29 -122 166 -27 185 329
7758 329 -100 149 -10 22 -42 167 -9 -1 -135 261 -118 137 184 83 124 82 -69 -1 227 144 -167 -65 -44
7781 -44 88 282 -204 -29 91 -169 83 -115 228 51 242 249 -288 270 -37 352 57 20 149 -281 177
7802 177 36 -137 166 -183 186 -299 179 81 -64 210 45 240 -135 -47 257 142 -2 140 -72 5 -133
7823 -133 98 -11 -128 45 -111 78 55 27 -95 66 -12 -41 -21 -158 82 51 201 -16 -65 223 66 50 -63
7846f3K21j73j20L39k87R4m9j33J3j36M72r5J37l89J17M7k27K94q8K2K33o40N16
7869A05l20K11J19l38L02l97K59O6l3J22j09J86k3l62N62l79P6J25m77O18n74
7890b61K58j80J26J00o3j02k02J46N73k07p5j20J46J0l28L07l50L39k56j24K99
7911C6j65O9m7K80j19J69l22J34o4L19k24R1j45J44Pm67L16j27R1J35j90Q1J30
7934A32k43K83j48j94K84k66L56k54M03l54k12Q6J40k6K60k90K63j16j31J51k10
7955h6J74j34K22n66J99K11k33K00J01q1K45k19j41M4K67L5l58L33m34K40j13
7976i4K25j13m8M2M4m44N36k51L75j46m38N28l31K44n8n3K01k76L18m01J62j19
7998i7P4P7l1m5J66l03J89l9K7l7j71L51l35N3j6K03J4k71k4K88k39K85q1L13
$$ plain form
7846 -63 158 -15 -135 204 -83 11 -38 -171 -158 -294 178 83 220 -169 -52 -5 -232 62 -26 -4 229 -411 105
7869 105 -215 -4 115 -223 79 -318 -59 7 -26 96 -13 173 150 -212 350 -29 47 172 -305 313 -261
7890 -261 -3 -183 -57 43 -20 -122 -324 -178 395 188 113 -7 139 149 -179 128 -222 117 -139 -263 36
7911 36 -129 -60 -107 173 54 223 -99 35 -29 290 66 157 12 156 163 -304 12 -115 -24 111 -79 2 132
7934 132 -111 172 24 -170 114 -152 204 -50 353 -1 -213 -127 13 -13 247 -43 220 104 -27 124 -86
7955 -86 88 -46 176 -390 -191 20 -213 -13 88 7 252 33 -108 -64 203 238 -120 213 -221 19 -94
7976 -94 131 18 -30 12 56 -388 148 -103 272 126 -312 216 -115 129 71 18 219 -57 261 -140 22 -97
7998 -97 -23 54 23 -22 144 -159 30 -9 18 -19 -190 161 -174 -121 -137 66 80 -191 -215 73 -166 119 38 351
8022C51l00k30K44K9J73k28j73N1J49j84R8j04kJ02o3J03l15J53K03k87M59k62
8044c3J29K78n09K97j67J43k90J85n9j01L61l20J42k30K99L8l0j53O7m24M01k50
8066b26J87J36j45L99n20M49k86j64K18j74J87J41l28n2K22L10k14j48N3j9l9
8087a3j29L46l45L9M10o8k56j15N2K64l42J31K13k25R2j0j65P8l49M90q1j56J15
8110b4p0K20j92K65k44J1J10j06J47N5j0N0k52k6kJ54K31p2l07K59j85J53j64
8133AL14j48k49K12j42J79q7o1J05j19R2p7J30L9l16K80l49L64j65J78k29n0l
8156a01K99n18L37l12K76j7j05K29j48k6M32m49R9mR0j34J76n0Qj25L3J00O6p2
8180H4J25j68j12J53j96N58l44J22k97J22m
$$ plain form
8022 351 51 -179 65 94 267 39 -134 -83 66 -118 -20 -124 -126 -24 -87 16 -299 -146 57 -230 229 -33
8044 -33 96 374 -135 162 -5 138 -152 33 -26 -127 234 -86 56 -174 125 163 133 -20 47 -377 24 -226
8066 -226 -39 97 -48 351 -169 280 -6 -170 48 -126 61 202 -126 -178 44 354 140 -8 45 26 -13
8087 -13 -142 204 -141 -102 308 240 -16 -131 -79 185 -157 -26 187 -38 54 44 -121 -43 -392 98 17 -139 -24
8110 -24 -94 126 -66 199 -45 -34 76 -30 117 172 162 212 -40 -66 -68 86 317 245 -62 197 12 165 1
8133 1 315 167 -82 130 -12 167 80 19 124 5 97 20 150 189 -127 153 -196 168 3 181 -48 -98 -101
8156 -101 198 -320 17 -295 -19 -36 -141 88 -60 -86 346 -103 -4 -8 82 -52 124 74 82 -43 -10 90 156 84
8180 84 209 41 -71 82 -114 444 100 222 -75 47 43
8191D3
$$ Imaginary data points
##PAGE= N=2
##DATA TABLE= (X++(I..I)), XYDATA
0@%%%%Qj6K4l2M0n6O7q3J04j28J60j92K30k76L27l85M50n24O06o99Q07r24J055
27E63j201J360j538J733j945K179k436K719l029L367l737M143m590N080n619O212
43C261o869P602q420R338j0379J1570j2943J4549j6458J8768k1627K5270l0093
56a6431L6801m6809O3500r7930K65075j92216j63877L83378m78666L87443j93514
67e3246M4628J28564k67104K55238j96977N1557J52027k72766L58511l46283J72529
78B6678N4535k49470L65195k98553J29342J5998j26286J54971j36084J03810m0702
89e66o6499J70567k20359J80766o3917o7474J89417k43162K21025j25150r635
100c4987J06717j42010J17361n2123j5522P0146j37857J34664o8875j1743J35679
$$ plain form
0 0 0 0 0 0 8 -8 16 -16 24 -32 35 -48 56 -72 88 -104 126 -150 177 -208 242 -282 324 -375 432 -492 563
27 563 -638 722 -816 917 -1028 1151 -1285 1434 -1595 1772 -1965 2178 -2412 2668 -2951 3261
43 3261 -3608 3994 -4426 4912 -5467 6103 -6840 7709 -8749 10019 -11608 13662 -16431
56 -16431 20370 -26439 37061 -60869 204206 11990 -151887 231491 -247175 140268 -53246
67 -53246 -8618 119946 -147158 108080 -88897 -37340 114687 -158079 200432 -145851 26678
78 26678 81213 -168257 196938 -101615 27727 43725 -82561 72410 -63674 40136 -566
89 -566 -67065 103502 -116857 63909 -8 -67482 121935 -121227 99798 -25352 -34987
100 -34987 71730 -70280 47081 -5042 -20564 49582 -88275 46389 -22486 -34229 101450
111A01450k01318J78490j27610K3783R3498j24224J29711q8312q934N5641j08770
122g6595J37194p5891m957R8737k02764K07397j46703O4282Q0854j73712J92933
133A00775j63887N8207O0303j33678J71609j34543L1468N9413j57864K11838j91100
144h7459J23332O732j45739K12670k02248J36878k5621o6862J40466j70461J14977
155C6665k4099p5490J47658j57268J28430p9032k1400J13687j72474J93775j24212
166c3760K5949O7059j41515J48090r9837L4490N9012j25135J31261j10930K7189
177a8127O0082j08135J39889j27628P3337n276q0984J39417j19113O8309J4664
188C6435q2841R6118r1545M6109K6551p9312J10956j06821M6034R581o2497J06002
$$ plain form
111 101450 -99868 78622 -48988 -25205 68293 -55931 73780 -14532 -23466 32175 -76595
122 -76595 60599 -15292 -20249 78488 -124276 83121 -63582 700 81554 -92158 100775
133 100775 -63112 -4905 55398 -78280 93329 -41214 -9746 49667 -108197 103641 -87459
144 -87459 35873 42605 -103134 109536 -92712 44166 18545 -48317 92149 -78312 36665
155 36665 12566 -62924 84734 -72534 55896 -23136 -44536 69151 -103323 90452 -33760
166 -33760 -7811 59248 -82267 65823 -34014 476 59488 -65647 65614 -45316 -18127
177 -18127 41955 -66180 73709 -53919 19418 14142 -66842 72575 -46538 21771 36435
188 36435 -46406 49712 -41833 4276 30827 -48485 62471 -44350 1684 11265 -51232 54770
200E4770r2801O1730n978o5662R5962q4526N2348K0968p9884R4716r9188N0980
212C435J4073n8761J04916j16841P1908j8862m9362J09796j01539P8588k8044
223I307m9892R2102j07257R2026k4860m0867Q2516j19919J01436n4498q75P4509
235E3728j13230J12662q3898J7320N4876r4492J10453p6936J8611L5128r1730
246e7508J08076q7588L9612L0423q4473J04319j04085O3686j278m7356R4059r4904
258c7017N8101j6422l8985P9598p7042N7280j5124m8081P5003r0515Q1361k6025
270B132k1880N9583q7792P1157l3167J107N0075o7620M8249k3493k8667O8187
282C7871p2413O4836l2491k2823N4541p9859Q0552l9186K770L7923o4054N2418
$$ plain form
200 54770 -38031 23699 17721 -47941 48021 -36505 15843 36811 -43073 51643 -47545 3435
212 3435 17508 -41253 63663 -53178 18730 -132 -49494 60302 -41237 37351 9307
223 9307 -40585 51517 -55740 36286 11426 -29441 53075 -66844 34592 -19906 -20781 53728
235 53728 -59502 53160 -30738 -13418 41458 -53034 57419 -19517 -906 34222 -57508
246 -57508 50568 -37020 2592 33015 -51458 52861 -51224 12462 11184 -36172 57887 -37017
258 -37017 21084 4662 -34323 45275 -31767 25513 10389 -37692 37311 -53204 28157 2132
270 2132 -19748 39835 -47957 23200 -9967 -8860 41215 -26405 21844 -1649 -30316 37871
282 37871 -34542 30294 -2197 -25020 29521 -50338 30214 -8972 -6202 31721 -32333 20085
294B0085k4657j3963O0179p5544O6780l7956j9615N9357q7035R1367n8660J9424
306b38K3170o3094O9846n1536J9855L7004o7787P2710o1355J1345M0200p7320
318d7200J05587r4498M7287n075m9332Q3178p5467N9105j2983m1931O7123p1528
330c5734N0544Q639n7039Q9747j05964P2030k6746k1305P1244q9486P5772m7173
342a5471l730M4495n5966N6480k2083k1975N8923q6815P8913m2670j582N0400
354C8919q1783Q0361o6585K4576J8618m1933N6698l7959o0L2709o3227P2401m3882
367a1147J3306L1975p7708Q3624p7851M6599O511l8687N4405n7191K1676J5521
379A1033m2190O9723n4101J8235J9097o6099R0309q0389O0385j7683l3757N5674
$$ plain form
294 20085 -4572 -18535 41644 -33900 32880 -5076 -24691 34666 -52369 38998 -19662 -238
306 -238 22932 -40162 29684 -21852 -1997 35007 -32780 39930 -21425 -10080 30120 -47200
318 -47200 58387 -36111 11176 6101 -43231 39947 -35520 23585 10602 -31329 35794 -35734
330 -35734 14810 23449 -33590 56157 -49807 22223 -4523 -25828 45416 -44070 31702 -15471
342 -15471 -19201 25294 -30672 25808 3725 -18250 40673 -46142 32771 -9899 -11481 38919
354 38919 -42864 37497 -29088 -4512 14106 -27827 28871 -9088 -9148 23561 -39666 32735 -11147
367 -11147 2159 34134 -43574 40050 -37801 8798 15309 -23378 31027 -26164 -4488 11033
379 11033 -31157 38566 -15535 2700 21797 -44302 46007 -34382 26003 8320 -25437 30237
391C0237o8431N2687j0949k2821N0992o1331L8151k230l7211P8549q7311P5607
403C5939m1554j2408N1846p6014P5437m6629P914K9307n9799N5789l0350p710
415a8232N6627p7614P9583o0115J1019L7134o8829Q8429p0259L0238M639m8143
427c5523O0845m3848J9117K4088o0689O8355o2971L1974K1720n4220P9365q1822
439c3609M9389j4466k3970N7251n7731L6500q271l5429N7714n8338M5275l497
451A0818l7634O6743q2659O9089l1819n943M7577o6580N5213l3681p942M2912
463B6094n7270N5099k6434j8438N1575p5933P6841m4284J0943L2496o5482O5802
475C1009n1974J9977K3667m6883N3761m5655N841K7513n3707P1950n6274K6064
$$ plain form
391 30237 -38194 14493 3544 -19277 31715 -29616 8535 6305 -30906 47643 -39668 35939
403 35939 -5615 -18023 33823 -42191 33246 -13383 -5469 23838 -35961 19828 -10522 -18232
415 -18232 38395 -39219 40364 -19751 -8732 28402 -40427 48002 -22257 7981 12620 -35523
427 -35523 25322 -18526 591 24679 -36010 32345 -30626 1348 23068 -31152 48213 -33609
439 -33609 15780 1314 -22656 34595 -23136 13364 5093 -30336 27378 -30960 14315 10818
451 10818 -26816 39927 -42732 26357 -5462 -11405 36172 -30408 24805 -8876 -16818 26094
463 26094 -31176 23923 -2511 -20949 30626 -45307 31534 -12750 -1807 30689 -34793 31009
475 31009 -20965 -988 22679 -24204 29557 -16098 -10257 17256 -36451 35499 -20775 5289
487E289R619m9679O8527n9909M2102k938l2950M8477n4229L2356L214l3943N7138
500C3074o0924L7591p497k9994O1332o4541N3960k1180j8838M4978n7191M7957
512A8727j5859j6437M3730n9995M4522k0733j3457N0696o2152N6619l5702n166
524a5207L7661n2629O0853l5151M47K6517n5388N5520l3877Q399K9047n8627N7977
537B5542m9209J9093K4548m8645O4881n8374K4548J0520m0669O2551n3636K9391
549A0541J524m1562N8637n6689L7930p30l4945N7113o4297M5979j1304k2040N3039
562C3196o0101M8665k2693j5195M1820n2612M7392k2450j0472L5130n6305N1541
574A7916k6222k39L5331n4417N0933l8774J0549K4872l8999M6211l7040M626J6474
$$ plain form
487 5289 14908 -34771 33756 -26153 15949 13011 -19939 28538 -25691 6665 9879 -24064 33074
500 33074 -27850 9741 2244 -27750 33582 -30959 23001 1821 -17017 27961 -29230 18727
512 18727 2868 -13569 30161 -29834 14688 -6045 -19502 31194 -30958 25661 -10041 -15207
524 -15207 22454 -30175 30678 -4473 -4026 22491 -32897 22623 -11254 -2855 26192 -32435 25542
537 25542 -23667 -4574 19974 -28671 36210 -22164 2384 12904 -27765 34786 -18850 10541
549 10541 12065 -29497 29140 -27549 10381 9651 -25294 31819 -32478 13501 2197 -19843 33196
562 33196 -26905 21760 -933 -16128 25692 -26920 20472 -1978 -12450 22680 -33625 17916
574 17916 -8306 -8545 26786 -27631 23302 -15472 -4923 19949 -19050 27161 -9879 -5253 11221
587A1221l6910M8115l1683Q596J5467m5736N2572m0403K4487J1327l6931M3615
599B3737m1985K0361R205k7640M1493l8438J2354J1030l7913N3538m6590K9055
611H207J021l3173N0566n0709L5636m631k1271M0124m4000K5538j590k6968M8018
624B6768n1232M1003j7339k0295M6391n8141N5906k7773K51K5639m7790M4434
636A7822k3994j26L2178m9386M5370l6871N063L0108n0777O4091n3945K2934N792
649H259l4278N2577m0571K2527L602l1935M0047l7199K0897J0089l5213M7647
661B6449n2493L4927j0548j3255L7642m1696L1892j4165q315K3376k5899K1102
673I017j723k0250L2707m1247L1153j2803n744K8143l9138L2507k0257n40J9630
$$ plain form
587 11221 -25689 22426 -9257 -661 14806 -30930 21642 -18761 5726 17053 -19878 23737
599 23737 -18248 2113 11318 -16322 25171 -13267 -913 10117 -27796 25742 -20848 8207
611 8207 9228 -23945 26621 -24088 11548 6917 -14354 25770 -18230 7308 5718 -21250 26768
624 26768 -24464 16539 -800 -21095 25296 -32845 23061 -4712 -4461 21178 -26612 17822
636 17822 -6172 -6298 25880 -23506 21864 -15007 -9944 20164 -30613 33478 -20467 2467 8259
649 8259 -26019 26558 -14013 8514 12116 -19819 20228 -16971 3926 14015 -21198 26449
661 26449 -26044 8883 -1665 -14920 22722 -18974 12918 -1247 -9562 13814 -12085 9017
673 9017 7294 -12956 19751 -21496 9657 -3146 -8890 19253 -19885 12622 -7635 -8175 11455
686A1455k0306J9767n156j9025L1327l8462L2616q718j3036K9933m6073L8728
698A3050k3130M604K0839k9149K5126j4964q213L0646l7875L9285k1896o166K6780
711A8937m8681N5040m1654J9799Q155l1714L7744l5372J9809Q813k9866M4568
723B5578m0134J7482Q490l6298N7104n7958M3703j6424k0076L9735m8037M1933
735A5098j7007o990K8579m2179L2944j1085j1427L9970n0506M3947l1558L108
747g106K2461l6613M4498l5606J2171N397k2582K8891j7141O161J2704l1584L5023
760A6674k7606J1681J1099k4445L1537l4474K0519m314j2017K2853j7823N910
772d06P052k1111K6690k2023J1154J2381k8650L3805l2090J7015n51j2931K5181
$$ plain form
686 11455 -8851 10916 5760 -13265 18062 -20400 12216 3498 -9538 20395 -25678 13050
698 13050 -10080 -5476 15363 -13786 11340 -3624 -11837 18809 -19066 20219 -1677 -7843 18937
711 18937 -29744 25296 -16358 3441 11596 -20118 17626 -17746 2063 10876 -18990 25578
723 25578 -14556 2926 11416 -24882 32222 -25736 17967 1543 -18533 21202 -26835 15098
735 15098 -1909 -8899 19680 -22499 10445 -640 -12067 27903 -22603 21344 -10214 -7106
747 -7106 15355 -21258 23240 -12366 -195 5202 -17380 11511 -5630 531 13235 -18349 16674
760 16674 -10932 749 11848 -12597 18940 -15534 4985 671 -11346 11507 -6316 -406
772 -406 6646 -14465 12225 -9798 1356 13737 -14913 18892 -13198 3817 3266 -9665 15516
785A5516k5293J1048K894k2103L2207k4932J5045O249k8513L7893m0870L2337
797A1478o057j4942L0069l8473K5837j1019o541K8013l6308L0325j5131j3053
809a5802L5595m2521M4324k8220L079K0796m2281M6180l1558J1501J1420l0493
821a7980L5305l2424J3624J2631l1370M2344l6952J9744R16k3293L9369l8089
833a6175K8857q998j4479K4892l0821K4036n891q750K2064l1507K2885r239n710
846h836K5222k7587K3115j6414r46J5308k1002K3633j2198n647J2101j9823J8097
859E023o399k672J6700k6967K1030r581l466J9435k1977K0095j3741l338J6920
872A1062k5001K4093j0681o469J8828k8488K6473j5395m93K1599l2222L2664k2584
$$ plain form
785 15516 -9777 1271 4165 -17938 14269 -10663 4382 10631 -17882 20011 -20859 11478
797 11478 5421 -9521 20548 -17925 7912 -3107 -9648 18365 -17943 12382 -2749 -15802
809 -15802 19793 -22728 21596 -6624 -3545 17251 -25030 21150 -10408 1093 12513 -17980
821 -17980 17325 -15099 -1475 11156 -20214 22130 -14822 4922 5838 -17455 21914 -16175
833 -16175 12682 3684 -10795 14097 -16724 7312 1421 -7329 14735 -16772 6113 -3126 -8836
846 -8836 16386 -11201 11914 -4500 -5446 9862 -11140 12493 295 -5352 6749 -13074 5023
859 5023 -1376 -4048 12652 -14315 6715 -2866 -6332 13103 -8874 11221 -2520 -5858 11062
872 11062 -13939 10154 -527 -6996 11832 -16656 9817 -5578 -6071 15528 -16694 15970 -6614
885f614K434J6178k7707L4222k6944R512Q356k9650L6359k8559J5252P087k7329
898a7403L5858l8467K6229R09k0156L6427m1035K7730j2583q297L0619l6675L0399
911A3555j6715r563K6583l3923L5729j9215k192K1255l7111L7899k4084R193J1059
924A2470k6721K8652k5626J0508Q412k0837K6596k1529O664P330k0984K9616k4767
937a0216J6112K61j5765K1678k2189J4756j704q192J5799j8768P235M574j6454
950a2873K5228k0252J2224j358j4458K3347k2635J8588k528j1292J5199j8142
962h952R180M848j5575K6203k7890J4382k88j5751L0136k9648K5048j2440o146
975f893J8497k4427K1994p000r515K1775l0646K4693j1916n387K5318l5819L6269
$$ plain form
885 -6614 -4180 11998 -15709 18513 -8431 1081 9437 -20213 16146 -12413 2839 9926 -17403
898 -17403 18455 -20012 6217 7126 -13030 23397 -17638 10092 -2491 -10788 19831 -16844 13555
911 13555 -3160 -12723 13860 -20063 15666 -3549 -5741 15514 -21597 16302 -7782 1411 12470
924 12470 -14251 14401 -11225 -717 7695 -13142 13454 -8075 -1411 5919 -15065 14551 -10216
937 -10216 5896 6157 -9608 12070 -10119 4637 2933 -5259 10540 -8228 -993 3581 -12873
950 -12873 12355 -7897 4327 2969 -11489 11858 -10777 7811 5283 -6009 9190 -8952
962 -8952 228 5076 -10499 15704 -12186 2196 1908 -13843 16293 -13355 11693 -747 -6893
975 -6893 11604 -12823 9171 2171 -7344 14431 -16215 8478 -3438 -8825 16493 -19326 16943
988A6943k7273Q281J0872k3039L1323k4455R769N854k3702K8704k2120R791R885
1001A0833k8148L4744l5585K2691j271j3512K7625l0948K1268r113o294K0710
1013A3000k0698J4531l677j4894K4286k8115K5309j0466n267J7097k6802K4999
1025I303j5341N622Q404j4339J3080p677n064J6055k0600J9988j1289l265J3774
1038H651k3579K5240j7600Q752N110j4302J3993r685m01J3623j7976J9395j3797
1051b576l204J4650k4931K9836k1522J0147K114j6663K0384j6010R162P489j7655
1064h779J9772j8487O010J0611k1868L0730l0547J7660n049j1765K4585k4764
1076a1891J9870p861p878J7564k0882J7391k504j2121K4645l1730K6032j4483
$$ plain form
988 16943 -10330 -2049 8823 -14216 17107 -7348 2421 8275 -15427 13277 -8843 948 10833
1001 10833 -17315 17429 -18156 4535 3264 -10248 17377 -13571 7697 -1416 -7710 13000
1013 13000 -7698 6833 3156 -11738 12548 -15567 9742 -724 -5991 11106 -15696 9303
1025 9303 -6038 -416 7988 -6351 6729 -948 -6012 10043 -10557 9431 -1858 -5123 8651
1038 8651 -14928 10312 -7288 1464 6574 -7728 6265 -3420 -3821 9802 -8174 11221 -2576
1051 -2576 -5780 8870 -16061 13775 -7747 2400 4514 -12149 8235 -7775 1387 8876 -8779
1064 -8779 10993 -7494 -1484 9127 -12741 17989 -12558 5102 53 -11712 12873 -11891
1076 -11891 7979 118 -7760 9804 -11078 6313 3809 -8312 16333 -15397 10635 -3848
1088c848j942J8487k7156K7034k0101M749Q637j7191K0663j1534oJ2764k4354
1101a3798K4686j7632P373R946k2360K4865k4817J2857P89q795J6958j6094N754
1114b68K908j2837K0613j5249R009J805j6253K1008k2133J7899m546o901J3554
1127H609j8797J1999j411o993J6747j7090J0457j365j1470K1830k3120J9498q424
1140D70n701J4728k0769J7465p865l026J3647j8460J4397o610n520J8240k1883
1153a0887K2209j3367j025J1615k1156K3345j5184M756O929j8785J8384j3787
1165f953N597R747j8177K1248k0068Q193O129j5022K3870k2250J1752k323j2041
1178a0298K0331j8235J2750j575j2499J8183j9681J5020j116r567J9242k3148
$$ plain form
1088 -3848 -5790 12697 -14459 12575 -7526 -2777 5860 -11331 9332 -2202 -2208 10556 -13798
1101 -13798 10888 -6744 629 10575 -11785 13080 -11737 1120 1909 -6886 10072 -6022 -268
1114 -268 2640 -10197 10416 -4833 4176 5981 -10272 10736 -11397 6502 1956 -4945 8609
1127 8609 -10188 1811 400 -6593 10154 -6936 3521 2156 -9314 12516 -10604 8894 470
1140 470 -5231 9497 -11272 6193 -1672 -4698 8949 -9511 4886 -1724 -7244 10996 -10887
1153 -10887 11322 -2045 -3070 8545 -12611 10734 -4450 306 7235 -11550 6834 -6953
1165 -6953 -1356 8391 -9786 11462 -8606 -413 5716 -9306 14564 -7686 4066 1743 -10298
1178 -10298 10033 -8202 4548 2973 -9526 8657 -11024 3996 2880 -6687 12555 -10593
1190a0593J6842o555n525J6865j9799J6187q877m505J3179j7885J7160p315l377
1203d198J3097j9802J8126j0232O92J2442j8841J8316j4635K260Q902j5269J8670
1216I528j3726K329O283j5754J9474j2680N615O629j7766J9455j7119R294M918
1229F480j3954J8803j9946R440J065j0316J8107j6372R043K83j2507J9342j7457
1242g989J3029j214j0536J7494k1199J6129n703m562J3542j7548J3024o589m627
1255f749J4861j6720J5499o830n163J3687k0009K0711j2001K600Q252j7564J5993
1268F567j2032L400R125j4875J5042j1461r6J1259j7415K2431j6548N938L634
1281D969j5075K0050j6187R494J531j2538J4082j2820N199O611j4333J9898j9075
$$ plain form
1190 -10593 6249 -306 -5831 11034 -8765 7422 -1455 -5960 7219 -10666 6494 -821 -4198
1203 -4198 8899 -10903 7223 -3009 -2317 10125 -8716 9600 -5035 -2775 6127 -9142 9528
1216 9528 -4198 -1869 4414 -11340 8134 -4546 1069 7698 -10068 9387 -7732 1562 6480
1229 6480 -7474 11329 -8617 823 1888 -8428 9679 -6693 2350 2633 -9874 9468 -7989
1242 -7989 5040 3826 -6710 10784 -10415 5714 11 -4551 8991 -8557 4467 -2122 -6749
1255 -6749 8112 -8608 6891 61 -5102 8585 -11424 9287 -2714 -114 8138 -9426 6567
1268 6567 -5465 -2065 7060 -7815 7227 -4234 -4330 6929 -10486 11945 -4603 1335 4969
1281 4969 -10106 9944 -6243 3251 4782 -7756 6326 -6494 -1295 5316 -9017 10881 -8194
1294h194J0653lj0690J9811j9997J5686o795n516J1821j4643J1259j727p478J4953
1308I140j9691J5019n774m886J7823k1649K0408j5086K278Q511j3881J6126r548
1321a210j437Q050j5656J5807q219M96J1182k0297K0127j6764R577L346j0234
1334e232J4341j4122N425J595p740J2268r405K130N326j4940J8732j6217J1510
1347C671j365p877J3975j5638J0795k684l715R125r837M485K044j1927J7340j6625
1361h233J2570k334q495J4873j8416J5628o107j125Q971j2539P702j601p515J6494
1375I873j7196J3340p227n874J5033k0066K1977j2976K763N207j3333J4619q578
1388b438K301Q338j6790J6010j2999L281R582j7962K3074k1872J1711n74q981
$$ plain form
1294 -8194 2459 2456 -8234 11577 -8420 7266 471 -5045 6776 -7867 3392 1665 -5813 9140
1308 9140 -10551 4468 -1306 -6192 11631 -10018 10390 -4696 -2418 6093 -7788 8338 -1210
1321 -1210 -2647 5403 -10253 5554 -2665 -2169 9013 -11284 8843 -7921 1656 5002 -5232
1334 -5232 9109 -5013 412 2007 -5733 6535 -2870 -740 4586 -10354 8378 -7839 3671
1347 3671 2306 -5571 8404 -7234 3561 877 -2838 6287 -3550 935 2979 -8948 8392 -8233
1361 -8233 4337 2003 -6492 8381 -10035 5593 -514 -1639 7332 -5207 2495 894 -6621 9873
1375 9873 -7323 6017 -1210 -7084 7949 -12117 9860 -3116 -353 4854 -8479 6140 -2438
1388 -2438 -137 8201 -8589 7421 -5578 -2297 7285 -10677 12397 -9475 2236 1662 -7319
1401g319J6403j5782J0872j349r239J4338j4184Q640J273j1065J8532k1798J5910
1414E232p601k947J3121j5598J4654q952q77P493r854J0096k982m588J0074j6642
1428i371J4836q253J495Q042j4318J2960j1210M718M552o783Q470n698k397P816
1442D859j2064J4192q053J80O641j5107J5596j1789O025L652r984J0707q448J906
1456a687O515j1628J5282j1678K568O388j4935J8272j6392J0545k36j0106J4349
1469G257j5005R298L61p541J5041j6409J0439j861r031J8387j9446J6359r044
1482a195l694J1924j7319J7709r776J62Q316j5872J5580r107K139R455j6568J7254
1496I008j4882N391N432j2242J6628j5395P381L09r155J4301j1775P191M11q380
$$ plain form
1401 -7319 9084 -6698 4174 2825 -6414 7924 -6260 2380 3653 -7412 11120 -10678 5232
1414 5232 -2369 -5316 7805 -7793 6861 -2091 -2968 4525 -5329 4767 1785 -2803 7271 -9371
1428 -9371 5465 -2788 -1293 6749 -7569 5391 -5819 -1101 3451 -3332 5138 -560 -2957 4859
1442 4859 -7205 6987 -1066 -886 5755 -9352 6244 -5545 480 4132 -5852 4855 -3593 -1687
1456 -1687 4828 -6800 8482 -3196 -628 5760 -9175 9097 -7295 3250 3014 -7092 7257
1469 7257 -7748 1550 1911 -5630 9411 -6998 3441 1580 -7451 10936 -8510 7849 -1195
1482 -1195 -4889 7035 -10284 7425 -2351 -2189 6127 -9745 5835 -3272 -1133 8322 -8246 9008
1496 9008 -5874 -483 4949 -7293 9335 -6060 1321 1630 -7525 6776 -4999 2192 2603 -5777
1510e777J2387j2688Q890j78o547J1300j2876Q016l301l132R149r798P177k544
1524G8m233P622q081P341n81m717Q276j1381P750j081m188R988j1608P188l460
1539a087m114J0553j0372Q933k942o207J1179j2589J1044k982m366J1105j6272
1552h117J3074o484j764J0395j4735J3613r971J118Q254j3627J5980j0353J724
1565h93O812j4710J7646j4728P877L541j3514J7196j7737J0592q42p030J4586
1578H796j6141J0501k749p336J5573j5480J3401n959n725J2521j7111J6819q553
1591a443m3O573j2887J2006p986K963O194j0703J0448p363k42P618j0551J2809
$$ plain form
1510 -5777 6610 -6078 2812 2634 -3913 7387 -5489 2527 -774 -3906 5243 -4555 2622 78
1524 78 -4155 3467 -4614 2727 2146 -2571 5705 -5676 2074 993 -3195 6793 -4815 2373 -1087
1539 -1087 -5201 5352 -5020 3913 971 -5236 5943 -6646 4398 1416 -2950 8155 -8117
1552 -8117 4957 -1527 -3291 7104 -7631 5982 -3989 -2871 5383 -8244 7736 -2617 -893
1565 -893 5919 -8791 8855 -5873 2004 5545 -7969 9227 -8510 2082 1240 -5790 8796
1578 8796 -7345 3156 407 -6929 8644 -6836 6565 606 -5119 7402 -9709 7110 -1443
1591 -1443 -1486 5087 -7800 4206 -3780 -817 5377 -5326 5122 -2241 -2483 5135 -5416 7393
$$ [...]
8191h5
##END NTUPLES=NMR FID
##END=
