##TITLE=1H_Ser Am-157
 CDCl3
 8 sc, 
 30.10.2023
##JCAMPDX= 6.0         $$ Bruker NMR JCAMP-DX V2.0
##DATA TYPE= NMR FID
##DATA CLASS= NTUPLES
##ORIGIN= UXNMR, Bruker Analytische Messtechnik GmbH
##OWNER= root
$$ XWIN-NMR		Version 3.5
$$ Mon Oct 30 14:18:47 2023 Russian Standard Time (UT+4h)  she@DPX200
##.OBSERVE FREQUENCY= 200.13135
##.OBSERVE NUCLEUS= ^1H
##.DELAY= (6, 6)
##.ACQUISITION MODE= SIMULTANEOUS
##.ACQUISITION SCHEME= undefined
##.AVERAGES= 8
##.DIGITISER RES= 18
##SPECTROMETER/DATA SYSTEM= spect
##.PULSE SEQUENCE= zg30
##.SOLVENT NAME= CDCl3
##.SHIFT REFERENCE= (INTERNAL, CDCl3, 0, 15.7039)
##AUDIT TRAIL= $$ (NUMBER, WHEN, WHO, WHERE, WHAT)
$$ ##TITLE= Audit trail, XWIN-NMR		Version 3.5
$$ ##JCAMPDX= 5.01
$$ ##ORIGIN= Bruker BioSpin GmbH
$$ ##OWNER= she
$$ F:/spectra/data/she/nmr/H-F/1/audita.txt
$$ ##AUDIT TRAIL=  $$ (NUMBER, WHEN, WHO, WHERE, WHAT)
(   1,<2023-10-30 14:17:41.76 +0400>,<she>,<DPX200>,
      <created by zg, POWCHK disabled, PULCHK disabled
       configuration hash MD5:
       00 E9 B6 7A A2 85 ED C7 34 08 36 98 17 FE 4E 26
       data hash MD5: 16K
       D2 87 5B 11 1A 3D 80 73 59 F7 6F 63 85 3B BE 4B>)
$$ ##END=
$$ 
$$ hash MD5
$$ D9 CB BB 7A 22 E9 55 2F FE B4 28 93 00 D8 21 62
##$RELAX= 
##$RELAX= 
##$RELAX= 
##$RELAX= 
##$RELAX= 
##$RELAX= 
$$ Bruker specific parameters
$$ --------------------------
##$DU= <F:/spectra>
##$EXPNO= 1
##$NAME= <H-F>
##$PROCNO= 1
##$TYPE= <nmr>
##$USER= <she>
##$AMP= (0..31)
100 100 100 100 100 100 100 100 100 100 100 100 100 100 100 100 100 100 
100 100 100 100 100 100 100 100 100 100 100 100 100 100 
##$AQSEQ= 0
##$AQ_mod= 1
##$AUNM= <au_zg>
##$AUTOPOS= <>
##$BF1= 200.13
##$BF2= 200.13
##$BF3= 200.13
##$BF4= 200.13
##$BF5= 200.13
##$BF6= 200.13
##$BF7= 200.13
##$BF8= 200.13
##$BYTORDA= 1
##$CFDGTYP= 0
##$CFRGTYP= 5
##$CHEMSTR= <none>
##$CNST= (0..31)
1 1 145 1 1 1 1 1 1 1 1 1 1 1 1 1 1 1 1 1 1 1 1 1 1 1 1 1 1 1 1 1 
##$CPDPRG= <>
##$CPDPRG1= <>
##$CPDPRG2= <>
##$CPDPRG3= <>
##$CPDPRG4= <mlev>
##$CPDPRG5= <mlev>
##$CPDPRG6= <mlev>
##$CPDPRG7= <mlev>
##$CPDPRG8= <mlev>
##$CPDPRGB= <>
##$CPDPRGT= <>
##$D= (0..31)
0 1.2 0 0 0 0 0 0 0 0.06 0 0.03 0 0 0 0 0.0002 0 0 0 0 0 0 0 0 0 0 0 0 
0 0 0 
##$DATE= 1698661061
##$DBL= (0..7)
120 120 120 120 120 120 120 120 
##$DBP= (0..7)
150 150 150 150 150 150 150 150 
##$DBP07= 0
##$DBPNAM0= <>
##$DBPNAM1= <>
##$DBPNAM2= <>
##$DBPNAM3= <>
##$DBPNAM4= <>
##$DBPNAM5= <>
##$DBPNAM6= <>
##$DBPNAM7= <>
##$DBPOAL= (0..7)
0.5 0.5 0.5 0.5 0.5 0.5 0.5 0.5 
##$DBPOFFS= (0..7)
0 0 0 0 0 0 0 0 
##$DE= 6
##$DECBNUC= <off>
##$DECIM= 32
##$DECNUC= <off>
##$DECSTAT= 4
##$DIGMOD= 1
##$DIGTYP= 9
##$DL= (0..7)
0 120 120 120 120 120 120 120 
##$DP= (0..7)
150 150 150 150 150 150 150 150 
##$DP07= 0
##$DPNAME0= <>
##$DPNAME1= <>
##$DPNAME2= <>
##$DPNAME3= <>
##$DPNAME4= <>
##$DPNAME5= <>
##$DPNAME6= <>
##$DPNAME7= <>
##$DPOAL= (0..7)
0.5 0.5 0.5 0.5 0.5 0.5 0.5 0.5 
##$DPOFFS= (0..7)
0 0 0 0 0 0 0 0 
##$DQDMODE= 0
##$DR= 18
##$DS= 0
##$DSLIST= <SSSSSSSSSSSSSSS>
$$ [...]
##$SUBNAM2= <"">
##$SUBNAM3= <"">
##$SUBNAM4= <"">
##$SUBNAM5= <"">
##$SUBNAM6= <"">
##$SUBNAM7= <"">
##$SUBNAM8= <"">
##$SUBNAM9= <"">
##$SW= 18.05172834244
##$SWIBOX= (0..15)
0 0 2 0 0 0 0 0 0 0 0 0 0 0 0 0 
##$SW_h= 3612.71676300578
##$TD= 16384
##$TD0= 1
##$TE= 0
##$TE2= 300
##$TE3= 300
##$TEG= 300
##$TL= (0..7)
0 120 120 120 120 120 120 120 
##$TP= (0..7)
150 150 150 150 150 150 150 150 
##$TP07= 0
##$TPNAME0= <>
##$TPNAME1= <>
##$TPNAME2= <>
##$TPNAME3= <>
##$TPNAME4= <>
##$TPNAME5= <>
##$TPNAME6= <>
##$TPNAME7= <>
##$TPOAL= (0..7)
0.5 0.5 0.5 0.5 0.5 0.5 0.5 0.5 
##$TPOFFS= (0..7)
0 0 0 0 0 0 0 0 
##$TUNHIN= 0
##$TUNHOUT= 0
##$TUNXOUT= 0
##$USERA1= <user>
##$USERA2= <user>
##$USERA3= <user>
##$USERA4= <user>
##$USERA5= <user>
##$V9= 5
##$VALIST= <valist>
##$VCLIST= <CCCCCCCCCCCCCCC>
##$VD= 0
##$VDLIST= <DDDDDDDDDDDDDDD>
##$VPLIST= <PPPPPPPPPPPPPPP>
##$VTLIST= <TTTTTTTTTTTTTTT>
##$WBST= 1024
##$WBSW= 4
##$XGAIN= (0..3)
0 0 0 0 
##$XL= 0
##$YL= 0
##$YMAX_a= 52256
##$YMIN_a= -78306
##$ZGOPTNS= <>
##$ZL1= 120
##$ZL2= 120
##$ZL3= 120
##$ZL4= 120
##$ABSF1= 10
##$ABSF2= 0
##$ABSG= 5
##$ABSL= 3
##$ALPHA= 0
##$AQORDER= 0
##$ASSFAC= 0
##$ASSFACI= 0
##$ASSFACX= 0
##$ASSWID= 0
##$AUNMP= <proc_1d>
##$AZFE= 0.1
##$AZFW= 0.1
##$BCFW= 1
##$BC_mod= 2
##$BYTORDP= 1
##$COROFFS= 0
##$CY= 11.3945322036743
##$DATMOD= 1
##$DC= 2
##$DFILT= <>
##$DTYPP= 0
##$F1P= 15.7292609196834
##$F2P= 12.9074282941183
##$FCOR= 0.5
##$FTSIZE= 0
##$FT_mod= 4
##$GAMMA= 1
##$GB= 0.15
##$INTBC= 1
##$INTSCL= 1
##$ISEN= 128
##$LB= 0.24
##$LEV0= 0
##$LPBIN= 0
##$MAXI= 10000
##$MC2= 0
##$MEAN= 0
##$ME_mod= 0
##$MI= 1.114404
##$NCOEF= 0
##$NC_proc= 0
##$NLEV= 6
##$NOISF1= 3.799351
##$NOISF2= 2.8
##$NSP= 1
##$NTH_PI= 0
##$NZP= 0
##$OFFSET= 15.70392
##$PC= 1
##$PHC0= -23858.88
##$PHC1= 0.4527082
##$PH_mod= 1
##$PKNL= yes
##$PPARMOD= 0
##$PSCAL= 0
##$PSIGN= 0
##$REVERSE= no
##$SF= 200.130013532006
##$SI= 16384
##$SIGF1= 3
##$SIGF2= 2
##$SINO= 400
##$SIOLD= 16384
##$SREGLST= <1H.CDCl3>
##$SSB= 0
##$STSI= 0
##$STSR= 0
##$SW_p= 3612.71676300578
##$SYMM= 0
##$S_DEV= 0
##$TDeff= 0
##$TDoff= 0
##$TI= <>
##$TILT= no
##$TM1= 0
##$TM2= 0
##$TOPLEV= 0
##$USERP1= <user>
##$USERP2= <user>
##$USERP3= <user>
##$USERP4= <user>
##$USERP5= <user>
##$WDW= 1
##$XDIM= 8192
##$YMAX_p= 0
##$YMIN_p= 0
$$ End of Bruker specific parameters
$$ ---------------------------------
##NTUPLES= NMR FID
##VAR_NAME=  TIME,          FID/REAL,        FID/IMAG
##SYMBOL=    X,             R,               I
##VAR_TYPE=  INDEPENDENT,   DEPENDENT,       DEPENDENT
##VAR_FORM=  AFFN,          ASDF,            ASDF
##VAR_DIM=   8192,          8192,            8192
##UNITS=     SECONDS,       ARBITRARY UNITS, ARBITRARY UNITS
##FACTOR=    0.0002768,     1,               1
##FIRST=     0,             0,               0
##LAST=      2.2672688,     0,               0
##MIN=       0,             -78306,          0
##MAX=       2.2672688,     52256,           0
$$ Real data points
##PAGE= N=1
##DATA TABLE= (X++(R..R)), XYDATA
$$ [...]
1688A09j8o5M19k05K8K05l96K2k5J25J05r6N5j9m25M6K09l35M89J7n62L09p2J06
$$ 109 91 26 445 240 268 473 77 99 74 199 304 208 263 244 -181 -135 74 -261 228 245 -317 -8 -80 26
1712B6m31K56L98k89l91O21m14J18N56m04n4L46l58j85p4L83r6m53K46K70n12
$$ 26 -405 -149 249 -40 -431 190 -224 -106 450 46 -8 338 -20 -205 -279 104 8 -445 -199 71 -441
1733d41J81J02j23p7J93k28M1r4J84M58l62J61k30P3M45k88R5%J85L37l14J11
$$ -441 -260 -158 -281 -358 -165 -393 -352 -446 -262 196 -166 -5 -235 -162 283 -5 90 90 275 612 298 409
1755D09K10l0j65J86j86OK8j4k73m9l22N66k45m69N9k7j98L34K6j95Ok08K27j26
$$ 409 619 589 424 610 424 430 458 444 171 122 -200 366 121 -348 -289 -316 -514 -180 -154 -349 -343 -551 -324 -450
1779d50N4K31j50r7M57k84L11O8k28J75k02M2L35m56L90j45rJ17l21J54O8O9o9
$$ -450 -396 -165 -315 -412 45 -239 72 140 -88 87 -115 -73 262 -194 196 51 42 159 -162 -8 60 129 60
1802F0j57M1K88k04k11K06O0J2M9j39L89j37j17K86k95l14O82n90O73l92m19L34
$$ 60 -97 -56 232 28 -183 23 83 95 144 5 394 257 140 426 131 -183 499 -91 582 190 -229 105
1824A05Jk53K30n0R2K8j73j00m4k0K57m22j38M05k82J44J68k66J72O6k02L3K94
$$ 105 106 -147 83 33 125 153 -20 -120 -164 -184 73 -349 -487 -82 -364 -220 -52 -318 -146 -80 -282 -249 45
1847D5n5K38k19m7Rj6K02J50n8J21j36j25J60l41L5J53k08K1j4P6q3M9P5j63m31
$$ 45 -10 228 9 -38 -29 -45 157 307 249 370 234 109 269 -72 -37 116 -92 -71 -85 -9 -92 -43 32 -131 -562
1872e62M51l9P7L1j78M27q1p5M0J57k98K60l97O7L99k94R7J27k28L50k46k28P0
$$ -562 -111 -150 -73 -42 -220 207 126 51 91 248 -50 210 -187 -120 279 -15 82 209 -19 331 85 -143 -73
1895g3k3K05p3k59M01k17l66N69l63J59P7m59L37J24k72L05k5J7K36l55L13k44
$$ -73 -96 109 36 -223 178 -39 -405 164 -199 -40 37 -422 -85 39 -233 72 47 64 300 -55 258 14
1917A4j18J00N0J36j00m8p6M0M13k75P1k89N0Qk79L51l00R0R3k27K19j05R7J21
$$ 14 -104 -4 46 182 82 34 -42 -2 411 136 207 -82 -32 -24 -303 48 -252 -162 -69 -296 -77 -182 -85 36
1941C6M6M5n6m3l7J51m72O53k29j30L17k21L2L25k79k39k5j1j82J42O1J11Jk10
$$ 36 82 127 71 28 -9 142 -330 323 94 -36 281 60 92 417 138 -101 -126 -137 -319 -177 -116 -5 -4 -214
1965b14M2j7k9P1j1J62j55j73K05p6K39K8j95L27k23J20K19l71K07Q4k37J66m8
$$ -214 -172 -189 -218 -147 -158 4 -151 -324 -119 -195 44 72 -123 204 -19 101 320 -51 156 240 3 169 121
1988A21j23J51k32L5J39l26P9J19k46J99P2j63K42j52J97l82L38L8j33r3j87J61
$$ 121 -2 149 -83 -48 91 -235 -156 -37 -283 -84 -12 -175 67 -85 112 -270 68 106 -27 -120 -307 -146
2010a46k9K97l0P1O0K25m81m4L00J3j28j39L72p21K98P4k90K78J4l29K13k23L72
$$ -146 -175 122 92 163 223 448 -33 -77 223 236 108 -31 341 -380 -82 -8 -298 -20 -6 -335 -122 -345 27
2033B7k03L9K90j54k44K64q2m1K20j12K08j99l6L68n24J78M9K7JK84N7l04L5r7
$$ 27 -176 -137 153 -1 -245 19 -63 -104 116 4 212 13 -23 345 -179 -1 48 75 76 360 417 113 148 51
2057E1K4l6k01r4j38J10L21k50K13j87j85M02r8k06L63J54k36k2rL18m17L22k9
$$ 51 75 39 -162 -256 -394 -284 37 -213 0 -187 -372 30 -68 -274 89 243 7 -15 -24 294 -123 199 170
2080A70k05R7K57k42P7M56n87J56j47J36N2k74K0o6k78L13j04k85M15R3L3q0j30
$$ 170 -35 62 319 77 154 610 23 179 32 168 220 -54 -34 -100 -378 -65 -169 -454 -39 54 87 7 -123
2103a23j63J37L99r4n16L38J27j89L0K72n09K26O3mP1k79J36k24M06M1r8k13L4
$$ -123 -286 -149 250 156 -360 -22 105 -84 -54 218 -291 -65 -2 -6 65 -214 -78 -302 104 145 47 -166 -132
2126a32J09j30J19k6k66j56L62j07R2J58j56J32J84J81m84J11K69k93K2K77n14
$$ -132 -23 -153 -34 -60 -326 -482 -120 -227 -135 23 -133 -1 183 364 -120 -9 260 -33 -11 266 -248
2147b48M18l14M44l06Q3O7j46r2K05k09j0L35k82n9o1M2q5J1K39mj19M2J09K7
$$ -248 170 -144 300 -6 77 144 -2 -94 111 -98 -108 227 -55 -114 -175 -133 -218 -207 32 28 -91 -49 60 87
2171H7l4P7Q8J40Lk27Qk82K44p5l12J35k13J85K43mj88L5r8J07j13J33j83R3k65
$$ 87 53 130 218 358 361 134 142 -140 104 29 -283 -148 -361 -176 67 63 -125 -90 -188 -81 -194 -61 -244 -151 -416
2196d16M48k5k55J43J28Q3j18J82l23J48J69R9o7O1l18M1J78N5j19J50k73j37
$$ -416 32 7 -248 -105 23 106 -12 170 -153 -5 164 263 196 257 -61 -20 158 213 94 244 -29 -166
2218a66J81j45J20j17P6J03J31j81J85n14J08L16k81R5J9j41K47qk2J4J18M5k67
$$ -166 15 -130 -10 -127 -51 52 183 2 187 -327 -219 97 -184 -89 -70 -211 36 28 6 20 138 183 -84
2241h4Q9K7L9j99M42j44j57j1J4J05j46q5j15K91k85K39j92p6J12k09L17P9k04
$$ -84 5 32 71 -128 314 170 13 2 16 121 -25 -110 -225 66 -219 20 -172 -248 -136 -345 -28 51 -153
2264a53K49j19kL9J12j57J42k18J73j26J1J83j50M7O7q7J67m29J05J55k0j96P5
$$ -153 96 -23 -25 14 126 -31 111 -107 66 -60 -49 134 -16 31 98 11 178 -251 -146 9 -11 -207 -132
2287a32k0K61k45J5K8K9N1j17J55n2M57l99j7J76k45J10l9j00J65k74N70j80j91
$$ -132 -152 109 -136 -121 -93 -64 -13 -130 25 -27 430 31 14 190 -55 55 16 -84 81 -193 377 197 6
2310FKp6P5L26l17m6J33k90Q7N7j79o3L68j36J09j79J08r2r2J34J54j55K08M2
$$ 6 8 -68 7 333 16 -30 103 -187 -100 -43 -222 -285 83 -53 56 -123 -15 -107 -199 -65 89 -66 142 184
2334A84j51j33M4O8M7N2k60L66j87K93k97L5k9J90l29mJ8Q6l5Q1m8j57K2MK26
$$ 184 33 -100 -56 12 59 111 -149 217 30 323 26 61 32 222 -107 -111 -93 -7 -42 39 -9 -166 -144 -140 86
2359H6M6k83l8R2J74l1N0r1P7q6k9K00n7j7K33j70j71L35o2k61K9m3J1m2j64L73
$$ 86 132 -151 -189 -97 77 46 96 5 82 -4 -33 167 110 93 326 156 -15 320 258 -3 26 -17 -6 -48 -212 161
2385A61j66k16K35k0j55M5J4Q9p1J16m7k47K76P8k24L00k01o2K22k19J56J64j68
$$ 161 -5 -221 14 -6 -161 -116 -102 -13 -84 32 -15 -262 14 92 -132 168 -33 -95 127 -92 64 228 60
2408F0P2j96K40k07p7K81j16K6k52R3j83l6N4L4R3O2j50OK00J25qk2Ll1j19J81
$$ 60 132 -64 176 -31 -108 173 57 83 -169 -76 -259 -295 -241 -207 -114 -52 -202 -196 4 129 121 99 102 71 -48 133
2434A33k41J66j9m1K6K3q7J75K9o0m37n6L16l4Q1J03k89J27N1K1k33L64p9l25
$$ 133 -108 58 39 -2 24 47 -40 135 164 104 -333 -389 -73 -107 -26 77 -212 -85 -34 -13 -246 118 39 -286
2458b86J98K12j11j6L1j54L0OK38k09n6J63l8kQ2j37J73j27n5J48k89J71M9J17
$$ -286 -88 124 13 -3 28 -126 -96 -90 148 -61 -117 46 8 6 88 -49 124 -3 -58 90 -199 -28 21 138
2482A38m83R5L96l9k06K8J56r6M9r8K66n6j83K85J21l88K3j0ON9J30k79l9O3J32
$$ 138 -345 -250 146 107 -99 -71 85 -11 38 -60 206 150 -33 252 373 -15 8 -2 4 63 193 -86 -125 -62 70
2507G0k37K17r4J14l5j24q1J60L2k62J71j76J47j54m5L25j13K1J34J38j56P4j42
$$ 70 -167 50 -44 70 35 -89 -170 -10 22 -240 -69 -245 -98 -252 -297 28 -85 -64 70 208 52 126 -16
2530a6L56k97l8L11k79J18K5j50k22K19k55K74k73K96o3j94O8L26l61N1j8n2k6
$$ -16 340 43 5 316 37 155 180 30 -192 27 -228 46 -227 69 6 -188 -120 206 -155 -104 -122 -174 -200
2553b00J93k74L75l33PJ64K48p2k80L58q0Q8j81O8r2Qj8p4J80k1l23M32lk76K67
$$ -200 -7 -281 94 -239 -232 -68 180 108 -172 186 106 194 13 81 -11 -3 -21 -95 85 64 -259 173 170 -106 161
2578A61j76k27K97O8k13J48j81j6L3K30J17l43P8K18j36j66K60p8j33j5L56j15
$$ 161 -15 -242 55 123 -90 58 -123 -139 -106 124 241 -102 -24 194 58 -108 152 74 -59 -74 282 167
2600A67j93J03M8p8l6j2l6R3l20M12L0n10J87Q8o7l7J4m5K45j30K00k0N1M0l72
$$ 167 -26 77 125 47 11 -1 -37 56 -264 148 178 -332 -145 -57 -124 -161 -147 -192 53 -77 123 103 154 194 -178
2625a78L28j54J42m9K5O1k76L14l0J04R4l64j3J70j9j33l8j93k44M74j08O2nk
$$ -178 150 -4 138 89 114 175 -101 213 183 287 381 17 4 174 155 22 -16 -209 -453 21 -87 -25 -30 -32
2649c2O0J04j52J25j64l0K80l7r1j66m3K67q2k7n2M9Q4n8K27l62Q1p8o8Q7q2P2
$$ -32 28 132 -20 105 -59 -89 191 154 63 -103 -146 121 39 12 -40 9 93 35 262 -100 -19 -97 -165 -78 -160 -88
2675h8O8Q4j24J60j98K70k38J88k88R2L2K1m2L8K3Q4Mj12o2K35j28k4LJ46Q3o9
$$ -88 -20 64 -60 100 -98 172 -66 122 -166 -74 -42 -21 -63 -25 -2 82 86 -26 -88 147 19 -5 -2 144 227 158
2701A58J16n08O1J46j45J70Q6L6j34J05k14o7J86J10J60l38P8j61N4j12J32k21
$$ 158 274 -234 -173 -27 -172 -2 84 120 -14 91 -123 -190 -4 106 266 -72 6 -155 -101 -213 -81 -302
2723c02K29L14k39J94j77K0JJ85j37M0k92J12J14j70P7l6K93l69L9M4n0m0J80
$$ -302 -73 241 2 196 19 39 40 225 88 128 -164 -52 62 -108 -31 -67 226 -143 -104 -60 -110 -150 30
2746C0m3q7Q7k39o6M06P8n28N90n22L15J34j42J11j30j7K36q1j72K29j05o2l7
$$ 30 -13 -100 -13 -252 -318 88 166 -362 228 -294 21 155 13 124 -6 -23 213 132 -40 189 84 22 -15
2769a5p7j79L82j35k30J77O4k8O0k6l44M64k15K86l76K64rr1J08j82J44J13k26
$$ -15 -92 -271 111 -24 -254 -77 -13 -41 19 -7 -351 113 -102 184 -192 72 63 -28 80 -102 42 155 -71
2792g1L00j75K3Jq2J10j27p3J45j36QJ24k7J0M8j85K23l88O04n59L29j8j93J16
$$ -71 229 54 77 78 -4 106 -21 -94 51 -85 -77 47 20 30 78 -107 116 -272 332 -227 102 84 -109 7
2816GK14q9M8k6j27j82L03m14N48k03r4J21m8N9J72l36J75k8r1j25nJ27m8J00
$$ 7 221 132 180 154 27 -155 148 -266 282 79 -15 106 58 117 289 -47 128 100 9 -116 -121 6 -42 58
2840E8k24J63j68Q3n7%J09J89j74K12j04j10j86L52J9j57O9j30K65Mj33j67r6
$$ 58 -166 -3 -171 -88 -145 -145 -36 153 -21 191 87 -23 -209 143 162 5 74 -56 209 213 80 -87 -183
2863a83R6n0p0J57R5q1k9j73J01j0p7L20k74J69l29M40j4k2J68l27P4L03l31K09
$$ -183 -87 -137 -207 -50 45 -36 -65 -238 -137 -147 -224 96 -178 -9 -338 102 88 66 234 -93 -19 284 -47 162
2887A62Q5k08J5l16L59N1n3r8o0Q4K19j01k54J09J2p3J12K3M0O6p1k42L1K01j26
$$ 162 247 39 54 -262 97 148 95 -3 -63 21 240 139 -115 -6 6 -67 45 68 108 174 103 -139 -108 93 -33
2912c3j4j42J73L8j21J67j33q4O8J84l0n5K92k78O6l88J95L5J4J15K0j39L0L19
$$ -33 -47 -189 -16 22 -99 68 -65 -149 -81 103 73 18 310 32 98 -290 -95 -60 -46 69 89 -50 -20 299
2936B99l53j04n4K71o4J77l31J24K83k36k18J06K97l30Q2R5P8k50j60K13J87J26
$$ 299 -54 -158 -212 59 -5 172 -159 -35 248 12 -206 -100 197 -133 -51 44 122 -128 -288 -75 112 238
2958B38k82K5n3pJ63J1Jj91R6n3J50l19J98L1l7j13J42J08j02j10OrR8k9J1R3
$$ 238 -44 -19 -72 -79 84 95 96 -95 1 -52 98 -221 -23 8 -29 -142 0 108 6 -104 -98 -107 -9 -38 -27 66
2984F6p8J5r7P7O3J07j55j53J19m0P8O4r5r0J24qO6k51J17j38K41l19N7J55P6
$$ 66 -12 3 -94 -17 46 153 -2 -155 -36 -76 2 66 -29 -119 5 -3 63 -188 -71 -209 32 -287 -230 -75 1
3009AP5K4J9j86N9rL08k79O4K6J57k91J75k27M1L9j19J57l16l7J25K01nl1M5o0
$$ 1 76 100 119 -67 -8 -17 291 12 76 102 259 -32 143 -84 -43 -4 -123 34 -282 -319 -194 7 2 -29 16 -44
3035d4J66l57K4J49k9Q0j13L5N3M1N7j68Q3j5P6l1q3ol4n7K49q3r5K88k6l57K30
$$ -44 122 -235 -211 -62 -91 -11 -124 -89 -36 5 62 -106 -23 -38 38 7 -76 -82 -116 -173 76 -7 -102 186 160 -197 33
3062C3J21m04L43J14l12oJ56L1q0K8K3j03k51M30j66J71J1M3P1k67J91l60K8O8
$$ 33 154 -250 93 207 -105 -111 45 76 -4 24 47 -56 -307 123 -43 128 139 182 253 -14 177 -183 -155 -87
3086h7k10K26J38j18J23k32N6J46m7P6l2r4M7j70J22P2L07k32k33P0J11lM3j63
$$ -87 -297 -71 67 -51 72 -160 -104 42 -5 71 39 -55 -8 -178 -56 16 323 91 -142 -72 39 36 79 -84
3110h4K12j96K13n5l9Q8%m0Nk7m6j83K37k5L3k41KJ17k12J12K93m04K71q3q5j09
$$ -84 128 -68 145 90 51 139 139 99 104 77 31 -152 85 60 93 -148 -146 -29 -241 -129 164 -240 31 -52 -137 -246
3136b46qL81j47r4QK95m2p0r1j79L51j13o4q0J24j2O2j51J2o5q1L78k35P4m2J7
$$ -246 -254 127 -20 -114 -106 189 147 77 -14 -193 158 45 -19 -99 25 13 75 -76 -64 -129 -210 168 -67 7 -35 -18
3162a8m8J00L5k08K54k14J69J44j15j14J27j8r4R3N5k20J60m1lP2J08m14J93J6
$$ -18 -66 34 69 -139 115 -99 70 214 99 -15 112 94 0 93 148 -72 88 47 44 116 224 -190 3 19
3186A9j88L21k87K71j67K30k42K19j50J06l9j05P6j18J92l9K2k43J21r4K3K77
$$ 19 -169 152 -135 136 -31 199 -43 176 26 132 93 -12 64 -54 138 99 121 -122 -1 -95 -72 205
3208B05r2j05Q1J32j57L5k79J21J28o8k90L99n8k96P6K67l00J53r5K98l04K51
$$ 205 113 8 89 221 64 99 -180 -59 69 1 -289 110 52 -244 -168 99 -201 -48 -143 155 -149 102
3230A02j08k60K61k00K78j41qK62j45J53l51O4M7j6p3J95m5N5j61N5J57k92J22
$$ 102 -6 -266 -5 -205 73 -68 -76 186 41 194 -157 -93 -46 -62 -135 60 15 70 -91 -36 121 -171 -49
3253d9j35Q4K06j86Q8m4mP8K29k97J85l99K25Q9j41J58j09N1J0K2J44j99J6l30
$$ -49 -184 -100 106 -80 8 -36 -40 38 267 -30 155 -244 -19 70 -71 87 -22 29 39 61 205 6 22 -308
3277c08L87l8j94K48j74J24k2R8j50K21p6jL4j04n0K88k63q2n0m8J86k00J50R5
$$ -308 79 41 -153 95 -79 45 23 121 -29 192 116 115 149 45 -5 283 20 -62 -112 -160 26 -174 -24 71
3301G1j97Kj53J09r0J75K10j69J57l68K65K6pr8k0M1J3P4n4P4k07O1j59K38j5
$$ 71 -126 -124 -277 -168 -258 -83 127 -42 115 -253 12 38 31 -67 -87 -46 -33 41 -13 61 -146 -85 -244 -6 -21
3326b1jJ39K38m56K20k57J72j09J63J33k09K3L4q0n9k8L91l99L18m46J86Kq6K6
$$ -21 -22 117 355 -101 119 -138 34 -75 88 221 12 35 69 -11 -70 -98 293 -106 212 -234 -48 -46 -132 -106
3350a06Q3k24K66J47j55l2M2q3J86J37k56k03K79j61J32k70k4L89o6j18j50P0
$$ -106 -23 -247 19 166 11 -21 21 -62 124 261 5 -198 81 -80 52 -218 -242 147 81 -37 -187 -117
3372a17L53m8j07m8o7P0j70K4O5k6O2J31J04l00j3K9N7J38j07m6j61L28k46L40
$$ -117 236 188 81 33 -34 36 -134 -110 -45 -71 -9 122 226 -74 -87 -58 -1 137 30 -16 -177 151 -95 245
3396B45k78Q2M6NK0j26k0o7R8j58K35j44q6J72l4L8j74J80P0k0j56K3J77k26m8
$$ 245 -33 49 95 100 120 -6 -26 -93 5 -153 82 -62 -148 24 -10 28 -146 34 104 84 -72 -49 128 -98 -146
3421a46k2M81l14LJ26k50J59j14J65j60K56kk88K42j71J52J1o5J47l9j64k31K55
$$ -146 -168 313 -1 2 128 -122 37 -77 88 -72 184 182 -106 136 -35 117 128 63 210 171 7 -224 31
3444C1N0j02l1k9J9kJ49k0m9N3j51k1J84M4k76P1J76k53k5K79R9j62J1j7J07L
$$ 31 81 -21 -52 -81 -62 -64 85 65 16 69 -82 -103 81 125 -151 -80 96 -157 -182 97 196 34 45 28 135 138
3470A38j67J4q6K50k39J01Pl15J78P6J71k48m3P0o5J73R2l22M3L15k69O3o5J31
$$ 138 -29 -15 -101 149 -90 11 18 -297 -119 -43 128 -120 -163 -93 -158 15 107 -215 -172 143 -126 -63 -128 3
3494CpJ74K29n54J55%q9J05j23J32lk8J01K90m91o6K52P0j8r2j00K12Q9q0k20
$$ 3 -4 170 399 -155 0 0 -89 16 -107 25 22 -6 95 385 -106 -172 80 150 132 40 -60 152 241 161 -59
3519e9J10n5o4j86J53kK7K16j91J18M3j09j43K3j2K6L6p8M7l3J81j15j2K8J47
$$ -59 51 -4 -68 -254 -101 -103 -76 140 -51 67 110 1 -142 -119 -131 -105 -69 -147 -100 -133 48 -67 -79 -51 96
3544I6j13L2lj34O7M0L7j75k84j3L84L68m64J36j47m5K12j81J61N3rr4Q6p4K19
$$ 96 -17 15 12 -122 -55 -15 22 -153 -437 -450 -66 302 -162 -26 -173 -218 -6 -187 -26 27 18 -76 10 -64 155
3569A55j77N5j88J30N3j27L1L89l03j69K43nl0p6L28l52R4p9J48l24L27j80j00
$$ 155 -22 33 -155 -25 28 -99 -68 321 18 -151 92 87 57 -19 309 -43 51 -28 120 -204 123 -57 -157
3592a57J39K5J64p6j91N3J19o5J97k96jj04O2J23k29N4J39Q2J50k25R8n8k20J87
$$ -157 -18 7 171 95 -96 -43 76 11 208 -88 -89 -193 -131 -8 -237 -183 -44 38 188 -37 61 3 -217 -30
3616c0J23q1j45P0n0N02m11j22J68j82J31j00J35r1n4R0qJ67k68N6K74Nj69l6
$$ -30 93 12 -133 -63 -113 389 -22 -144 24 -158 -27 -127 8 -83 -137 -47 -55 112 -156 -100 174 179 10 -26
3640b6q7P8m3j17J67nr5P5j05N7Q1P7o8J03j32o9j68K91j70K06j31J23r3j11R8
$$ -26 -113 -35 -78 -195 -28 -33 -128 -53 -158 -101 -20 57 -11 92 -40 -109 -277 14 -156 50 -81 42 -51 -162 -64
3665f4nk93N23m4j47n4J14K29k12l8j9k54k43K83L30J5k03p7O3J25j89J45j14
$$ -64 -69 -362 161 117 -30 -84 30 259 47 9 -10 -264 -507 -224 106 121 -82 -159 -96 29 -160 -15 -129
3688a29Q0q3J19K62l43K07L1P1j79q4kJ55j2j62p3L25l87L34q4j92J28K62k90
$$ -129 -49 -132 -13 249 -94 113 144 215 36 -48 -50 105 93 -69 -142 183 -204 130 46 -146 -18 244 -46
3711d6J21O7k80K26j40l2K60O7o7Q5k91k39N10k44J35N9j17q2j40J00l8J78l93
$$ -46 75 142 -138 88 -52 -84 176 243 176 261 -30 -269 241 -3 132 191 74 -8 -148 -48 -86 92 -301
3734c01L37j93J45P0P3k35qj38L00j27J93q4O5k68L26j94l8K67n27L60q2J67k56
$$ -301 36 -157 -12 58 131 -104 -112 -250 50 -77 116 32 97 -171 155 -39 -77 190 -337 23 -59 108 -148
3757a48J73J68k60K04l07L82j89j05K61o9J49k55J25j0j09J17j24j81m4K09J08
$$ -148 25 193 -67 137 -170 212 23 -82 179 110 259 4 129 119 10 127 3 -178 -222 -13 95
3778I5n8J24j80R1o5j5r7J35m4q2J13j91J44P2j40O2K39j44k0Q8K3k61K38j47
$$ 95 37 161 -19 72 7 -8 -105 30 -14 -96 17 -174 -30 42 -98 -36 203 59 39 127 150 -111 127 -20
3802b0k0j05j11M11k48K33p2j19L25j42j05j2o5M2N1P7l4K6o7j07L5J1j44O8K74
$$ -20 -40 -145 -256 155 -93 140 68 -51 274 132 27 15 -50 -8 43 120 86 112 45 -62 -27 -16 -160 -92 182
3827A82k19R5k00Q9R4O8k00j21J51j6M6L3M5j95m3N80l19j12j42O7J45QK0m9J82
$$ 182 -37 58 -142 -53 41 109 -91 -212 -61 -77 -31 2 47 -148 -191 389 70 -42 -184 -117 28 36 56 7 189
3852A89lk74K92l37L3J46k98M06n3k47K37J44j55l8r3L7ll0P9j59K44Q3j50k73
$$ 189 186 -88 204 -133 -100 46 -252 154 101 -146 91 235 80 42 -51 -14 -17 -47 32 -127 117 200 50 -223
3876b23R8J68o2J26j64P3k8M7k7K12j40m7q1J02j96J28k62L14J23l06M5l8J77
$$ -223 -125 43 -19 107 -57 16 -12 35 8 220 80 33 -48 54 -142 -14 -276 38 161 -145 -100 -138 39
3899C9qJ9Q9k79L7J89m09L78K26j26j04j28j66L3L60k14J40J29j93P3j62M8L2
$$ 39 31 50 139 -140 -103 86 -323 55 281 155 51 -77 -243 -210 150 -64 76 205 12 85 -77 -29 3
3922CM6K54l93J7R8k54r4N35N6l90j51K48K68l98K36pj75J11K4l5J24l59J7L2
$$ 3 49 303 -90 -73 25 -229 -323 212 268 -122 -273 -25 243 -155 81 74 -101 10 34 -1 123 -236 -219 -187
3946a87K01n8J0K1J66m4q0l4j17L2OK63l06J75N0j14J22p6q1Q2k70O2J07J27j49
$$ -187 14 -44 -34 -13 153 109 29 -5 -122 -90 -84 179 -127 48 98 -16 106 30 -51 31 -239 -177 -70 57 -92
3971i2R3j48J18j27R2K73l61L91m63K90R0n9J28k43J11J4n7J6P0j05oO2lk26J64
$$ -92 1 -147 -29 -156 -64 209 -152 239 -224 66 156 97 225 -18 93 107 50 66 136 31 25 87 84 -142 22
3996B2K9k25M41l40N9K8J41j47k45K18J27j03j98J34NprlP0l0J55K7k38k01K96
$$ 22 51 -174 267 -73 -14 14 155 8 -237 -19 108 5 -193 -59 -54 -61 -70 -73 -3 -33 122 149 -89 -290 6
4021FL11n14L33r2q3j66Q1O8q7J53o7l0K35k89K31j49n0JJ53j33K38NK9k15M3
$$ 6 317 -197 136 44 -39 -205 -124 -56 -143 10 -57 -87 148 -141 90 -59 -109 -108 45 -88 150 155 184 -31 12
4046A2M7k89L10Jm85L48l7L6k9nJ15LO8j97K20k04K11j89K33j51J08p6K6j78J41
$$ 12 59 -230 80 81 -404 -56 -93 -57 -86 -91 24 27 95 -102 118 -86 125 -64 169 18 126 50 76 -102 39
4071C9MJ14j83L4j21K03K8j43l8j01J00OP1k0p6Q9o0n7K79j41K63l10r7j00K96
$$ 39 43 157 -26 8 -113 90 118 -25 -63 -164 -64 -58 13 -7 -83 6 -54 -111 168 27 290 -20 -117 -217 79
4096G9j72R5L60k98J10q2J00k46lmJ98k76J48m4%J96k64J29J22m3k54L0O5j30
$$ 79 -93 2 362 64 174 92 192 -54 -57 -61 137 -139 9 -35 -35 161 -103 26 148 105 -149 -119 -54 -184
4120a84J89Q5l30J76K6K16j31j18J27j92J72k1K15J13n33K19k5k6N2k65K61j22
$$ -184 5 90 -240 -64 -38 178 47 -71 56 -136 36 15 230 343 -190 29 4 -22 30 -235 26 -96
4142i6j80K96N6l7k25k15M34k6j70J78j92R0L48k35k6j9n9J19j23j7m5J91j76
$$ -96 -276 20 76 39 -186 -401 33 7 -163 15 -177 -87 261 26 0 -19 -78 41 -82 -99 -144 47 -129
4165a29L81j40j95J35q2J39R6k28NJ56Lj10j15n1K6N4J25J2J15l76M24k78J25
$$ -129 252 112 -83 52 -30 109 205 -23 -18 138 141 31 -84 -135 -109 -55 70 82 197 -179 245 -33 92
4188I2j67k8J17j01k74K75J63J21M3m40L88l51K84j90Q4n1k59L03r7J7N8l4J08
$$ 92 -75 -103 14 -87 -361 -86 77 198 241 -199 189 -162 122 -68 16 -35 -294 9 -88 -71 -13 -47 61
4211F1j03j41Q3p1J93k95M63l4l76K36O8k20L98r9j2l18O5l4M0K15j84j85L20
$$ 61 -42 -183 -100 -171 22 -273 190 156 -220 16 84 -136 262 163 151 -167 -102 -136 -96 119 -65 -250 70
4234G0J77m17Q7J45j38J11%J73l52m1o8M02o9J78m41L37k45J4J30j34m5N0J62
$$ 70 247 -170 -83 62 -76 35 35 208 -144 -185 -253 149 80 258 -183 154 -91 -77 53 -81 -126 -76 86
4257H6j03O0j46K38l39K79Q7k31J22K9k20K33j40J15mm7k12K13j64O0nK3Q7L5
$$ 86 -17 43 -103 135 -204 75 162 -69 53 82 -138 95 -45 70 66 19 -193 20 -144 -84 -89 -66 21 56
4281E6r1j07K26j23J06J9J8k76K23O5K8O7p8J01l53pJ85j4k11K67R8l04J06J07
$$ 56 -35 -142 84 -39 67 86 104 -172 51 116 144 211 133 234 -119 -126 59 45 -166 101 199 -105 1 108
4305A08q0LJ62j78o9k39L28j74K68j68J8j54NK07r6L2J00j0O2j7r3k52L72j95
$$ 108 28 31 193 15 -54 -293 35 -139 129 -39 -21 -175 -170 37 -59 -27 73 63 125 108 15 -237 135 -60
4329f0JJ73k93L39N5k13N5l02K42j43j85K65K49j22k74Q4J81l03R8J29Ko5K59
$$ -60 -59 114 -179 160 215 2 57 -245 -3 -146 -331 -66 183 61 -213 -129 52 -251 -153 -24 -22 -87 172
4352A72k60N8j20n5J87%o8K55j75r2l17L57J48k49J04LJ93l97Q4J79m1M2J2K5
$$ 172 -88 -30 -150 -205 -18 -18 -86 169 -6 -98 -415 -58 90 -159 -55 -52 141 -256 -172 7 -34 8 20 45
4376D5J27k59OO7j9k6j71L16J37p6kj86r8J07p7m3O3K80k74p2K29j63L87j40k01
$$ 45 172 -87 -81 -14 -33 -59 -230 86 223 147 145 -41 -139 -32 -109 -152 -89 191 -83 -155 74 -89 298 158 -43
4401d3j06J86m8J6K03l28j8J69O3J2j53k4P6r8J6K41J2k72K26k06Q6k4k9Q9P8
$$ -43 -149 37 -11 5 208 -120 -138 31 94 106 -47 -71 5 -93 -77 164 176 -96 130 -76 10 -14 -43 46 124
4426A24j35q7K06J55k56J0j79K78J00k32l3K1L8m3K02j51JJ8r3j5N4q9M0l48M44
$$ 124 -11 -98 108 263 7 17 -162 116 216 -16 -49 -28 10 -33 169 18 19 37 -56 -71 -17 -106 -66 -414 30
4451C0m1j30L36n0p9L2L18q5m48J44p4j00l2K53K04m12L21l43QK14j5kK0o7j61
$$ 30 -11 -141 195 145 66 98 416 331 -117 27 -47 -147 -179 74 278 -134 187 -156 -148 66 51 49 69 2 -159
4476a59L8N2k12N73l32m03L57K32j67j2J64k05K5J95J9j66m2R5L2p8j40J64J4
$$ -159 -121 -69 -281 292 -40 -443 -86 146 -21 -33 131 -74 -49 146 165 -1 -43 52 84 6 -134 30 44
4499D4r6J00j51j44J30K53l59J7j6M17k50Q7J40k57j51J53K79j13k5R6j55K63
$$ 44 -52 48 -103 -247 -117 136 -223 -206 -222 195 -55 32 172 -85 -236 -83 196 83 58 154 -1 262
4521B62k53j31K29k84J85K35l59P2N3R9k3k04p6P6J2Q4k49K98j64P0J9l13K68
$$ 262 9 -122 107 -177 8 243 -116 -44 9 108 85 -119 -195 -119 -107 -23 -272 26 -138 -68 -49 -362 -94
4544i4j23J65J92J8Q7k76j25J76K04j08K0k57R5K5O0J8j52J71Q1j56m5J05Jl55
$$ -94 -217 -52 140 158 245 -31 -156 20 224 116 136 -121 -26 -1 59 77 -75 96 177 21 -24 81 82 -273
4568b73K62j61K97r6k82L08r3K88n39J21j77L58n5J47R4l52R6QM4kj7K9R8k74
$$ -273 -11 -172 125 29 -253 55 -38 250 -289 -168 -345 13 -42 105 199 -153 -57 -49 -5 -7 -24 5 103 -171
4592a71j8L23M8J02l5m14N6K90l14P0P6j43J81p5p3J17Q0k74N6O3Q9N9L2l8r5
$$ -171 -189 134 182 284 249 -165 -109 181 -133 -63 13 -130 51 -24 -97 20 100 -174 -118 -55 34 93 125 87 -8
4617hO5j60K57l77O0L10m3l35Q6L42m75K66K1l0J12j48N4OO6Rj6j16N4rl8j56
$$ -8 57 -103 154 -223 -163 147 104 -231 -145 197 -278 -12 9 -21 91 -57 -3 3 69 78 62 -54 0 -9 -47 -203
4643b03N8L0k56J35K07l9K49k54R9K31m59L16M5k66K0J64j83J0k7J50K18k76R4
$$ -203 -145 -115 -371 -236 -29 -68 181 -73 26 257 -202 114 159 -107 -87 77 -106 -96 -123 27 245 -31 63
4666F3j70K55j41j46P2K6K19p5q2J53Q8k70q5L56j99j6J40k10k40J99J22j72J53
$$ 63 -107 148 7 -139 -67 -41 178 103 21 174 262 -8 -93 263 64 48 188 -22 -262 -63 59 -113 40
4689D0l8J46P9l92K65j25m1M5P6M6k74K22j21K20l60M10l01N9R6k8m9k3J46k92
$$ 40 2 148 227 -165 100 -25 -66 -21 55 101 -173 49 -72 148 -212 198 -103 -44 52 24 -25 -48 98 -194
4713a94L29p6N0l16K62r4r3J82J05j03l47J22J86j99Q0J54k24K95k8k02P6J06
$$ -194 135 59 109 -207 55 -39 -132 50 155 52 -295 -173 13 -186 -106 48 -176 119 91 -111 -35 71
4735G1K4k19J96k10J48j79M2J24j8P9j56K57j50n4M8J17j07j0p3j92L94M7P7m05
$$ 71 95 -124 72 -138 10 -169 -127 -3 -21 58 -98 159 9 -45 3 120 13 3 -70 -262 132 179 256 -149
4759a49O3%K0k6mL9J10k8j6j90K64M8j7j72K18k84K57j10J45j61J43k13r2R0j43
$$ -149 -86 -86 -66 -92 -96 -57 53 25 9 -181 83 131 114 -58 160 -124 133 23 168 7 150 -63 -155 -65 -208
4784b08J12QJ41n4J61k03K96l8k68L47m11N6j4L81m96R2R6l52K08J70J50j00K7
$$ -208 -96 -88 53 -1 160 -43 253 215 -53 294 -117 -61 -75 306 -190 -98 -2 -354 -146 24 174 74 101
4807A01k21K29k57J72L0j9R7J43l11k7J34k55K34J8l4jM9k80R7R3J02k26j99J86
$$ 101 -120 109 -148 24 54 35 132 275 -36 -63 71 -184 50 68 34 33 82 -198 -101 -8 94 -132 -331 -145
4831a45R5K16k00k14K93R0j62J75j36l3P4n7P6j7n3J29l01L10J9j51P9j21J04
$$ -145 -50 166 -34 -248 45 135 -27 148 12 -21 53 -4 72 55 2 131 -170 140 159 8 87 -34 70
4854G0k43J51N2j42j3K47R1k87O7N0L33m82q4J06n4N6J37k52J86R9k9K56k98K37
$$ 70 -173 -22 30 -112 -125 122 213 -74 -7 43 376 -106 -190 -84 -138 -82 55 -197 -11 88 59 315 17 254
4878B54k23j09L52n01O15m85J51J8j54L16k18n3j26J46k10j3K48J0k9r5J36m3
$$ 254 31 -78 274 -227 388 -97 54 72 -82 234 16 -37 -163 -17 -227 -240 8 18 -11 -106 30 -13
4900a3J45j50J15j62K5O5m1P4k11K05J84j92k71J31m0R4K96k56N9n7K64l84O6
$$ -13 132 -18 97 -65 -40 25 -16 58 -153 52 236 44 -227 -96 -136 -42 254 -2 57 0 264 -120 -54
4923e4J79j05kj12J40J14m51K21R5R5LQj49m9K18l6K8l89K96M2j20J5J89n3k04
$$ -54 125 20 18 -94 46 160 -291 -70 25 120 123 131 -18 -67 151 115 143 -246 50 92 -28 -13 176 123 -81
4948h1J8J97j25J8qj46J75j03J94k56J4L5J07m3M1j03j13J65J15j5J36k14r7K03
$$ -81 -63 134 9 27 19 -127 48 -55 139 -117 -103 -68 39 -4 37 -66 -179 -14 101 86 222 8 -89 114
4972A14q7j38K25J01o36J77K66p5J8J86j64K34l23k32N65l43J96j22K70p9k28
$$ 114 27 -111 114 215 -421 -244 22 -53 -35 151 -13 221 -102 -334 231 -112 84 -38 232 153 -75
4993g5L09l24q1M0j16K07j22L58j47m6j8m5j68K21J0j5L97m58J52m10K05K60q1
$$ -75 234 -90 -171 -131 -247 -40 -162 196 49 3 -15 -60 -228 -7 3 -12 385 -73 79 -331 -126 134 53
5016E3Qq6l3M4Jo5N5K34l03J42N5%j11p1l6J56j24j07J19j35L04J7k33%Q4l3K07
$$ 53 61 -25 -58 -14 -13 -78 -23 211 -92 50 105 105 -6 -77 -113 43 -81 -188 -69 -204 100 117 -116 -116 -32 -65 142
5043A42j42N5o8k9q8J88k96R2P2m5M76l91J4K18m21K03K48j67j48kk1l5J55N3
$$ 142 0 55 -13 -42 -130 58 -238 -146 -74 -119 357 -34 -20 198 -223 -20 228 61 -87 -89 -110 -145 10 63
5067F3j40J33O5j75m9L84l68O9L16l32J31k18J96j10K3JJ95j58j78J42N5Q4j6
$$ 63 -77 56 121 -54 -103 281 -87 -18 298 -34 97 -121 75 -35 -12 -11 184 26 -152 -10 45 129 113
5090A13r1m13P69m85J07O3J73k97J95j15J5j81J66O8q6J42o9k83J97J7J68j64
$$ 113 22 -391 378 -107 0 63 236 -61 134 19 34 -147 19 87 1 143 74 -209 -12 5 173 9
5112Ik65R8O4k60K18P1k19K91n8J26J35k02K5K50J08m74L0J28j60J1K5K88k63
$$ 9 -256 -158 -94 -354 -136 -65 -284 7 -51 75 210 8 33 283 391 -83 -53 75 -85 -74 -49 239 -24
5135b4jJ35k24M2R0p4J21j26o2K91j73Lj05Q4j8J21l4j44J55Nj11OmJ90j13k1
$$ -24 -25 110 -114 -72 18 -56 65 -61 -123 168 -5 -2 -107 -23 -41 80 46 -98 57 62 -49 -43 -47 143 30 9
5161Il4J71k88K38O7k06K69j42J08q5j35J29l57L37j12K82k26n0Q1k14j0K9K46
$$ 9 -25 146 -142 96 163 -43 226 84 192 107 -28 101 -256 81 -31 251 25 -25 56 -158 -168 -139 107
5184A07r3nJ38l78J40m5Q8q7N0l2l1K86m58K17R9K88k48K42m28K10k3J72k94J71
$$ 107 14 9 147 -231 -91 -136 -48 -135 -85 -117 -148 138 -320 -103 -4 284 36 278 -150 60 37 209 -85 86
5208H6k9k1l53L76p2j9L8j8k5r1K03r1j15PJ59J58LO4j32j86K85l63K5j6J96n7
$$ 86 57 36 -317 59 -13 -32 6 -12 -37 -128 75 -16 -131 -124 35 193 196 260 128 -58 227 -136 -111 -127 69 12
5234A2r5J50r8j39J41J08j5j73O3k3K57k25Q1q7J21N9L5k35nJ57j92OK45k15n
$$ 12 -83 67 -31 -170 -29 79 64 -109 -46 -69 188 -37 44 -43 78 137 172 -63 -68 89 -103 -97 148 -67 -72
5259g2N6n7L33k57j17Q5Oj0O4j19J35m3K52o3j53j40L0J80k17K5R1J5K45l52q7
$$ -72 -16 -73 260 3 -114 -29 -23 -33 31 -88 47 4 256 193 40 -100 -70 110 -107 -82 9 24 269 -83 -170
5284a70K25k47K79J50j54J70l76JJ52j58L3q8J73O5m9j12K83j17oj1J16j43j98
$$ -170 55 -192 87 237 83 253 -123 -122 30 -128 -95 -183 -10 55 6 -106 177 60 54 43 159 16 -182
5307a82K4J5K31o3o5M6r4j7j34L93k63K97l20KJ33J31n5P5j03Rk8n3Ok0P9j17
$$ -182 -158 -143 88 25 -40 6 -88 -105 -239 154 -109 188 -132 -130 3 134 79 154 51 60 32 -21 -15 -35 44 -73
5333g3L5NK8j94L61k33J40j24J09J49l32%M19m91K19l65J89Oj96M72j18M17m14
$$ -73 -38 -33 -5 -199 162 -71 69 -55 54 203 -129 -129 290 -201 18 -347 -158 -152 -348 124 6 423 9
5356IR6j32K87j57p3Q2Q0k40N2o1j11K48K9j71J22K52k59qJ2n1r6P5k5M8q3O7
$$ 9 105 -27 260 103 30 112 192 -48 4 -57 -168 80 109 -62 60 312 53 45 57 6 -90 -15 -40 8 -75 -8
5382hr5N7q6J35N5j09K04l68J86NK24m1j82J52l7M0j78J0k9J92k11L76k55J17
$$ -8 -103 -46 -132 3 58 -51 153 -215 -29 -24 200 159 -23 129 92 132 -46 -36 -65 127 -84 292 37 154
5406A54k30j63J10K23r3M2Ln6j91m8J86n4L4r9K78j86K36j07Q5K2L7P1j33k8k28
$$ 154 -76 -239 -129 94 1 43 46 -10 -201 -249 -63 -117 -83 -182 96 -90 146 39 124 146 183 254 121 93 -135
5431a35%rJ44l8m8qK92k92O6P8r0p5Q5k4O2L7J77m17K95O6k5P0j25q2J8N2q8R7
$$ -135 -135 -144 0 -38 -86 -94 198 -94 -28 50 -40 -115 -30 -54 8 45 222 -195 100 166 141 211 86 4 22 74 -14 83
5459H3M5O1k26m1J7J45j24j40J20L4K28l74JK10l07J17K1O6J96k37OK6J99k41
$$ 83 128 189 -37 -78 -61 84 -40 -180 -60 -26 202 -172 -171 39 -268 -151 -130 -64 132 -105 -99 -73 126 -115
5483a15J73j93p2K81l57O21k79k0rk1K2j12Q1O5pl4j04k20K21J30q9j51J19M3
$$ -115 58 -135 -207 74 -283 338 59 39 30 9 31 -81 0 65 58 24 -80 -300 -79 51 -38 -189 -70 -27
5507b7l0R1j19J90pj32J27j04N4R4m88M28l6n8O9j63k0K69P5k73j21L33l54K98
$$ -27 -57 34 -85 105 98 -34 93 -11 43 137 -351 77 41 -17 52 -111 -131 138 213 -60 -181 152 -202 96
5531I6o5Q1k1o0n5O6K7j59J22k70RJ14J28Q6j01l11N0K64O6k74J92K1K03m9l36
$$ 96 31 112 91 31 -24 42 69 -90 32 -238 -229 -115 13 99 -2 -313 -263 1 67 -207 -15 6 209 160 -176
5556a76j5L94k05L8j1j64J80k65K87k84J66j32P6L49k29K2J60j15m10K89q5oJ68
$$ -176 -191 203 -2 36 25 -139 41 -224 63 -221 -55 -187 -111 238 9 31 191 76 -334 -45 -130 -136 32
5579C2Qp6k03K00l6m0L04j89N1r7K24j54j32Q3J34k22J76Rk27K19l52nL23j06
$$ 32 40 -36 -239 -39 -75 -115 189 0 51 -46 178 24 -108 -25 109 -113 63 72 -155 64 -288 -293 30 -76
5603g6J85k40J17O9r1J64k2l8J27J0M0j85J3p4J28J9k5L9N0J41n98m1M9P1K48
$$ -76 109 -131 -14 55 -36 128 106 68 195 205 245 60 73 -1 127 146 121 160 210 351 -247 -288 -239 -168 80
5628H0J26j69j31J65O0j58O8Q9j68l6N7j8K69k70j02nK77J1j68k2M8J54J77l41
$$ 80 206 37 -94 71 131 -27 41 130 -38 -74 -17 -35 234 -36 -138 -143 134 145 -23 -45 3 157 334 -7
5652gJ16k14J4O5J79k92P4j13K53k03K91j71j50J4q0K54R6j61k5q4K5l0r7L12
$$ -7 109 -105 -91 -26 153 -139 -65 -178 75 -128 163 -8 -158 -144 -224 30 126 -35 -60 -144 -119 -149 -246 66
5676F6j20RJ00q6J12J3J3P0K0k32K22J6j30j38J08J3q5J91j17o0k14J66r5J50
$$ 66 -54 -45 55 -31 81 94 107 177 197 -35 187 203 73 -65 43 56 -29 162 45 -15 -229 -63 -158 -8
5700hk7k80L12J59k59J18K62m53J47M9j19k8j00K44j73L18j67K07j97K00l46J38
$$ -8 -35 -315 -3 156 -103 15 277 -176 -29 20 -99 -127 -227 17 -156 162 -5 202 5 205 -141 -3
5722cJ3qo2K1K1j30M34n38L08K5p1k85N46j27M0m40L90j21J25m09K64L6j59P2
$$ -3 10 2 -60 -39 -18 -148 286 -252 56 81 10 -275 271 144 184 -256 134 13 138 -271 -7 29 -130 -58
5746e8M72l42k29K31r5Q1j8j97K29j69J14K7nJ4r3P1k09K92j39J6J47k0l09K12
$$ -58 414 72 -157 74 -21 60 42 -155 74 -95 19 46 41 55 -38 33 -176 116 -23 -7 140 120 -189 23
5770B3Q5%j87Q2r5J6L38l45M9J22k27J60J43q5j88L32l34n0J61p4J46O1JL2l19
$$ 23 108 108 -79 3 -92 -76 262 -83 -34 88 -139 21 164 79 -109 223 -111 -161 0 -74 72 133 134 166 -153
5795a53K06P6l5o6k08J42o9J72k81J87j1J21L16m25j87K93Q6o6j55K29m4R6k5
$$ -153 53 129 94 28 -180 -38 -107 65 -216 -29 -40 81 397 -28 -215 78 164 98 -57 172 128 224 199
5818A99k16j01J78l3P1k56J80j3m5m1J60L0j44J15n8n7J45j76L17k88J10j80M
$$ 199 -17 -118 60 27 98 -158 22 9 -36 -77 83 113 -31 84 26 -31 114 -62 255 -33 77 -103 -99
5841i9K2J69l6L1n3K7Kk09J60R6j4o6Q0j01J2p9P8j10J62n4K42k90J85j38j51
$$ -99 -77 92 56 87 34 61 63 -146 14 110 96 30 110 9 21 -58 20 -90 72 18 260 -30 155 17 -134
5866a34J05L5Q8j12L0kk40K92r1j62Q6k6J35J7j96M12l14Q1L0j39J46k57q6K36
$$ -134 -29 6 94 -18 12 10 -230 62 -29 -191 -105 -131 4 21 -175 237 -77 4 34 -105 41 -216 -302 -66
5890f6K40l49J89j32l9K20J51k59m3Q7j7L9O6J40l62m6K82r0L8o6Np1J72p4J69
$$ -66 174 -175 14 -118 -157 63 214 -45 -88 -1 -18 21 87 227 -135 -181 101 11 49 -17 -12 -83 89 15 184
5915A84k8k37K06Oj23j87L10k62K89n47N37k54K72j72k96J52K30L9j61J9j55M89
$$ 184 156 -81 125 131 8 -179 131 -131 158 -389 148 -106 166 -6 -302 -150 80 119 -42 -23 -178 311
5937C11k90l02J66R8J06k1q1K78l08j75R4K94k68j0NR0k6o6K95k06J66j81r7K11
$$ 311 21 -281 -115 -17 89 68 -13 265 -43 -218 -124 170 -98 -108 -103 -13 -39 -105 190 -16 150 -31 -128 83
5961H3j32J31Q2j00k10np0J46j13O1L50n81M76J06j27j49R5P2p6j75J70O2j8j92
$$ 83 -49 82 164 64 -146 -151 -221 -75 -188 -127 223 -358 118 224 97 -52 43 115 39 -136 34 96 78 -114
5985a14n3K60N6k5j15N5j41K6l8J77Kn3MMj62K33r7o3r2L55k6l55K00J13k00O6
$$ -114 -167 93 149 124 9 64 -77 -51 -89 88 90 37 41 45 -117 116 19 -44 -136 219 193 -162 38 151 -49 17
6011A7O0P8j21j10k3J52l8Q1k54n1K52k22K70k95K74j26K80p5l90O7J66Ln1R2
$$ 17 77 155 34 -76 -99 53 15 96 -158 -209 43 -179 91 -204 70 -56 224 149 -241 -174 -8 -5 -56 36
6035C6N3k29K21r6K37j34l5q9P9j61K59j80K0J76k21j07K84j80J55N4m29L77m7
$$ 36 89 -140 81 -15 222 88 53 -36 43 -118 141 -39 -19 157 -64 -171 113 -67 88 142 -287 90 43
6058D3j36J32J67k92M0M4J31q8M3l18L44k03K91k79J20L3j22J02j01M5J13j37
$$ 43 -93 39 206 -86 -46 -2 129 41 84 -234 110 -93 198 -81 39 72 -50 52 -49 -4 109 -28
6080b8m9R3j74N6L63k73m0O7K51j33j48j07J69j67j15K13l13L70r6M3M5j29p0
$$ -28 -77 16 -158 -102 261 -12 -52 15 266 133 -15 -122 47 -120 -235 -22 -335 35 -61 -18 27 -102 -172
6103a72J88P5q1OJ7L4o7k55J77j61L59m33M59l61J50j5J42l4o7O0k59L26K1k22
$$ -172 16 91 10 16 33 67 0 -255 -78 -239 120 -313 146 -215 -65 -80 62 28 -39 21 -238 88 109 -113
6127a13J6RO7J10j08J62k5n2k64M72k25N7j92J7K60p9l43P8K62K8L7m82rK67J43
$$ -113 -97 -88 -21 89 -19 143 118 66 -198 274 49 106 -86 -69 191 112 -231 -153 109 137 174 -308 -317 -50 93
6152I3K3m2j83J99j72K1K4j46K72m3J23l10J60J51k64J91j35K1J43Q6k18Om9N9
$$ 93 116 74 -109 90 -82 -61 -37 -183 89 46 169 -141 19 170 -94 97 -38 -17 126 212 -6 0 -49 10
6176A0l3k89M04l04L79m11L29j80J36r4j0l8q5L12J18j70k57L61l00J53k38J85
$$ 10 -23 -312 92 -212 167 -244 85 -95 41 -53 -63 -101 -186 126 244 74 -183 178 -122 31 -207 -22
6198b2J07K6p3rk91J27J03J25R0l1N1l43J9L0J40Kj68J03K00k81L7J66m3m5J11
$$ -22 85 111 38 29 -262 -135 -32 93 183 152 203 -140 -121 -91 49 51 -117 -14 186 -95 -58 108 65 20 131
6223A31m05M15j32j03k02J91nL19k39Q8q6O0o1Q9K88l38L8RJ28l14K28j57J08
$$ 131 -274 141 9 -94 -296 -105 -110 209 -30 58 -28 32 -29 60 348 10 48 57 185 -129 99 -58 50
6246E0k1r9MJ86p5n6p8j1QL37j10l80K13R3j11N9j6k5K1K60l38L90j03k16M1k78
$$ 50 29 -70 -66 120 45 -11 -89 -100 -92 245 135 -245 -32 61 -50 9 -7 -32 -11 249 -89 301 198 -18 23 -255
6272b55K87K22l27J12q3P1j61K78J97k15l7j42R0k05K16o3J14j52j10n3L57j86
$$ -255 32 254 -73 39 -44 27 -134 144 341 126 89 -53 37 -168 48 -15 99 -53 -163 -216 141 -45
6294d5P6j03J72k65J87Pj36j22j9K74j46K23j2K17m88J42J83k36J28J39k98J73
$$ -45 31 -72 100 -165 22 29 -107 -229 -248 26 -120 103 91 308 -180 -38 145 -91 37 176 -122 51
6316E1j39K72k16l1JJ7q3K00o7l01J39K16M4k05L4J18j49K97k98K89j31R5j99
$$ 51 -88 184 -32 -63 -62 -45 -128 72 5 -296 -157 59 103 -102 -68 50 -99 198 -100 189 58 153 -46
6339d6J6M9J10J37q4l52J05o5K34N7k33M9p4jn3M75l44j78j03O7R7K73j81j56
$$ -46 -30 19 129 266 182 -170 -65 -130 104 161 -72 -23 -97 -98 -151 324 -20 -198 -301 -234 -137 136 -45 -201
6363b01R0K48k86qK34j56n2P3J54j21J15k90K54k27J54Q1Rn9j76K52p4J2q7J13
$$ -201 -111 137 -149 -157 77 -79 -131 -58 96 -25 90 -200 54 -173 -19 62 71 12 -164 88 14 26 -61 52
6387E2o4r9L31j79k24K80J3k4J78l48J64rk10J03j38K01k1J44k20Q5k48L80p4
$$ 52 -12 -111 220 41 -183 97 110 86 264 -84 80 71 -139 -36 -174 27 6 150 -70 15 -233 147 73
6410G3j16Lj34K23j9l63K60r1k23L21Q1J12N4j82J9Rj17J31o4k10K87j00j01N5
$$ 73 -43 -40 -174 49 30 -333 -73 -164 -387 -66 15 127 181 -1 18 27 -90 41 -23 -233 54 -46 -147 -92
6434i2K50l87J81J73j53r5L90l21N5J32j86J26J27j97k14K57N1J14k7l0m52M71
$$ -92 158 -229 -48 125 -28 -123 267 -54 1 133 -53 73 200 3 -211 46 97 211 184 154 -298 173
6456A73k10L2k9p6K36j37k35L24N9k23l9M06k42j12J53k56K19P2k3l9j44J58J96
$$ 173 -37 -5 -34 -110 126 -11 -246 78 137 -86 -125 281 39 -73 80 -176 43 115 92 53 -91 67 263
6479B63l94j09K06J90j83J35O4j63M0P1K0K24l58J60k1k35o4J95J2K04j72k07
$$ 263 -131 -240 -34 156 -27 108 172 9 49 120 140 364 6 166 145 -90 -154 41 53 257 85 -122
6501a22l5K63j57M4j54J18l5K6J24K48m30L0M7o6J43J10j88P7p7K03J28j39o8
$$ -122 -157 106 -51 -7 -161 -43 -78 -52 72 320 -110 -80 -33 -99 44 154 -34 43 -34 169 297 158 90
6524I0l20L26m3J65o1K0j99J85MO7k77j5KK36R1k92j99L19p9j59J87J10l61K82
$$ 90 -230 96 53 218 157 177 -22 163 167 234 -43 -58 -56 180 271 -21 -220 99 20 -139 48 158 -203 79
6548G9j38K21j43N3k33O8j4M6K17j64k44L03K53l58R3o5o7j24J86J03K12k27M2
$$ 79 -59 162 19 72 -161 -93 -107 -61 156 -8 -252 51 304 -54 39 -26 -93 -217 -31 72 284 57 99
6571I9k51J84j45K80k39J70j36m9q5J79j11J93o3j11n6J58m1j83K09J44k06L0
$$ 99 -152 32 -113 167 -72 98 -38 -87 -172 7 -104 89 26 -85 -141 17 -24 -207 2 146 -60 -30
6593c0J45J9j13R6k03m5Q6J09N7m81K56J29l2J01r1j7Q3l4k11nP4j7K14p0p6Q
$$ -30 115 134 21 117 -86 -131 -45 64 121 -360 -104 25 -7 94 3 -14 69 35 -176 -181 -107 -124 90 20 -56 -48
6619d8n6L42k05K4J19l10O9J8rJ50j37M9n0k07K44L7o9L04m48K74j72Q1r6o0R
$$ -48 -104 238 33 57 176 -134 -65 -47 -56 94 -43 6 -44 -251 -7 30 -39 265 -183 91 -81 0 -96 -156 -147
6644a47J91J2K31k49N2j21L1j53L9J81j01J58pL1j85J86l37J85L1P3r7K1K6r9
$$ -147 44 56 287 38 90 -31 0 -153 -114 67 -34 124 117 148 -37 149 -188 -3 28 101 4 25 51 -48
6668d8P1j57K34l83L51N0Rk64J01k5L68l69k0J69m23M95l67M64j36l5k60J6J0
$$ -48 23 -134 100 -283 68 118 127 -137 -36 -61 307 -62 -82 87 -336 159 -208 256 120 85 -175 -159 -149
6691a49J08%p4Q1j38L45k26J46J37k00P6K1o3L2k20Q1L75l13K22K5j97k64J49
$$ -149 -41 -41 -115 -34 -172 173 -53 93 230 30 106 127 64 96 -124 -43 332 19 241 266 69 -195 -46
6714d6J71r8l3k80J53J39n0j58K15r5K88l01J38O7j81m7N7J9r8J44p1j0m2J91
$$ -46 125 27 -6 -286 -133 6 -44 -202 13 -82 206 -95 43 110 -71 -118 -61 -42 -140 4 -67 -77 -119 72
6738G2N1o3O1r6m1j88P1R0L12j38nj01l00K59J56n7j42q7K24K05m01K10L9k55
$$ 72 123 60 121 25 -16 -204 -133 -43 269 131 126 25 -275 -16 140 83 -59 -146 78 283 -118 92 131 -124
6762a24K64k17K82k57M1J36l07J95p6J0j77K63J67m3j84J97j77J5k05K36k35L9
$$ -124 140 -77 205 -52 -11 125 -182 13 -63 -53 -230 33 200 157 -27 170 -7 8 -197 39 -196 -157
6784a57J36o6J33l1l64N68j16N8k46J08Nk09m7K82M5n1J15n1j55K4L5L4n9r6K9
$$ -157 -21 -87 46 15 -349 219 103 161 -85 23 28 -181 -228 54 99 48 163 112 -43 -19 16 50 -9 -105 -76
6809g6l2Q0J13j43J58mj0J3k04J95j4j26L9r8K11p4o5J10j20J30pj91J15N7J96
$$ -76 -108 -28 85 -58 100 96 86 99 -105 90 76 -50 -11 -109 102 28 -37 73 -47 83 76 -115 0 57 253
6834B53k55J25J28k06k02L58k46k6J60m5j7nQO0p3k6O0j9M8k95L14L7j59J8j75
$$ 253 -2 123 251 45 -157 201 -45 -71 89 44 27 22 30 90 17 -9 51 32 80 -215 99 136 -23 -5 -180
6859a80m7K88k8J42O3j95k52L98j83l1J55k07J43L4j00m2m2K00j54p9J22M1r0
$$ -180 -227 61 33 175 238 43 -209 189 6 -25 130 -77 66 100 0 -42 -84 116 -38 -117 5 46 -44
6882d4J23j6k04P6M5n2P2J10j80L6q5L5L73k74j00M2q7J98P3j31l8J02j55K07
$$ -44 79 63 -141 -65 -20 -72 0 110 -70 -34 -119 -84 289 15 -85 -43 -130 68 141 10 -28 74 -81 126
6906A26o8k48Q3J57r4o7j9Q1Q8L6k31N9L69m39J60J99K5k7j88n5l3L27k14J5k28
$$ 126 58 -190 -107 50 -44 -111 -130 -49 39 75 -156 -97 272 -167 -7 192 217 190 2 -53 -86 241 27 42 -186
6931a86K69m1R7q3J4l77L94m8j49J06n0k00k5K42m4O0%Lk3J59o1p3K09nk77J24
$$ -186 83 42 139 56 70 -307 87 39 -110 -4 -54 -254 -279 -37 -81 -21 -21 -18 -41 118 57 -16 193 188 -89 35
6957C5j2RJ84j00j76K9J57J35n56M63j72j82K34k5k05J95l4Q4N6j83o3j57J96
$$ 35 23 32 216 116 -60 -31 126 261 -295 168 -4 -186 48 23 -182 13 -21 63 119 -64 -127 -284 -88
6980h8o1K65o5k44o2L70k42K42l53J61J60j67l37N42k11p8N8K55L4j68j23K0J80
$$ -88 -149 116 51 -193 -255 115 -127 115 -238 -77 83 -84 -421 121 -90 -168 -110 145 179 11 -112 -92 88
7003H8q3l7n0L70m7k41J29j40J88j57J7j82K35M9j78j12J79M2k5O9l34L44k89
$$ 88 5 -32 -82 288 241 0 129 -11 177 20 37 -145 90 139 -39 -151 28 70 45 114 -220 124 -165
7026a65R1J25o4K19n3j31r4r2p4K24J2J17m8o4Q3k26J05kJ14l2j07Q2%L8k37J00
$$ -165 -74 51 -13 206 153 22 -72 -164 -238 -14 -2 115 67 3 86 -140 -35 -37 77 45 -62 20 20 58 -179 -79
7052g9K0P6p5N5k09K24p2J68j19L5J5j81J17K00j53Lk67JL67j86J78j03j99L45
$$ -79 -59 17 -58 -3 -212 12 -60 108 -11 24 39 -142 -25 175 22 25 -242 -241 126 -60 118 15 -184 161
7076A61j11j51M4K35k16P7j47O8j1p0J25J93k50J59j71L66k72L0N8l81M41k27
$$ 161 50 -101 -57 178 -38 39 -108 -40 -51 -121 4 197 -53 106 -65 301 29 59 117 -264 177 -50
7098e0P8k60J18R2L02k65J99j51K21m94K47j24l5K7j6J66P0l7N9k37J70Q1l91
$$ -50 28 -232 -114 -22 280 15 214 63 284 -210 37 -87 -122 -95 -111 55 125 88 147 -90 80 161 -230
7121b30K70k83K65j36K56j37J08j13K12k12RkR3Q1m6k63K18L1n7j00K01N5j13
$$ -230 40 -243 22 -114 142 5 113 0 212 0 9 7 100 181 135 -128 90 121 64 -36 165 220 107
7144A07l3q5k0j00J12P7O4J08k01L8l5mj25j1K34k04o7L8J03J03j36P8K17l11
$$ 107 74 -11 -31 -131 -19 58 122 230 29 67 32 28 -97 -108 126 -78 -145 -107 -4 99 -37 41 258 -53
7168e3k3r1m9L27oo9O2r1J01J1j60J19K64m64J13J88pj25p0K80l99J68N7R6j19
$$ -53 -76 -167 -216 111 105 36 98 7 108 119 -41 78 342 -122 -9 179 172 47 -23 257 -142 26 83 179 60
7193F0P7k41M8L2J93j38J3o3M5m7R0j53J46l95J60N4k97L96J60j19M2m6k45O7
$$ 60 137 -104 -56 -24 169 31 44 -19 26 -21 69 -84 62 -333 -173 -119 -416 -20 140 21 63 17 -228 -161
7217a61rRK47M2j1q2o6o3O0j62J39P4j36j68J20O0L9L9k7n9L25m24K87M4j54J74
$$ -161 -170 -161 86 128 117 35 -31 -94 -34 -196 -57 17 -119 -287 -167 -107 -68 -29 -56 -115 210 -214 73 117 -37 137
7243A37L5n33M09mk60J65L1N1L4j43J30q3k5L30k37K0k9J54l28M15m54K25j0j10
$$ 137 172 -361 48 44 -216 -51 -20 31 65 -78 52 -31 -56 274 37 57 28 182 -146 269 -185 40 30 -80
7267h0K09p9l2O8k62Q1Q8J68O3j26N7l03M03m25M96q7k82L22m56J63nJ87k4O2
$$ -80 129 50 18 86 -176 -95 -7 161 224 98 155 -148 255 -170 326 239 -43 279 -177 -14 -19 168 144 206
7291B06l84K84J57k48o8K64k51m3K16k51J50N6p6j26K71k2j44L30k15m9j12J06
$$ 206 -178 106 263 15 -53 211 -40 -83 133 -118 32 88 12 -114 157 135 -9 321 106 57 -55 51
7313E1j8R9p1J8l9q9K03l48K88M6k28k25K36M38k52m4P2j75J54j87r9K61k03K46
$$ 51 33 132 61 79 40 -49 154 -194 94 140 -88 -313 -77 361 109 65 137 -38 116 -71 -170 91 -112 134
7337A34j88L20k55j66L94j42l74K85K4m7k8R4o6J14k04J81o9q1J07J39j69j18
$$ 134 -54 266 11 -155 239 97 -277 8 32 -15 -43 51 -15 99 -105 76 7 -74 33 172 3 -115
7359a15J07K58O7k05N8l61K68j20R4J57m42J90J4M5J98Lj86j9q9K04n1j59L1K
$$ -115 -8 250 317 112 170 -191 77 -43 51 208 -234 -44 -30 15 213 216 30 11 -78 126 75 -84 -53 -51
7383e1K61l03P8lL04l24K8q0P0p5j06L23oj6l45M43j52J56q4oj89q3K05j55j51
$$ -51 210 -93 -15 -18 286 -38 -10 -90 -20 -95 -201 122 116 100 -245 198 46 202 118 112 -77 -160 45 -110 -261
7408b61K18J0o1N7J69O5j21j33j13J18k18M57m28L72q1j41K10l28K63o9j43K68
$$ -261 -43 -33 -94 -37 132 197 76 -57 -170 -52 -270 187 -241 131 50 -91 119 -209 54 -15 -158 110
7430A10r9j61J51l5Q1r9L9J58l6j5j96J54pp6J05K0q6O2j90N2O1Q3J59k85j99
$$ 110 11 -150 1 -34 47 -52 -13 145 109 94 -102 52 45 -31 74 94 8 70 -120 -68 -7 76 235 -50 -249
7455b49L14K75l52j17K31k43mJ62J9P2l76J76j20J94n3J40J4n4Qj58K94n3n6o
$$ -249 65 340 -12 -129 102 -141 -145 17 36 108 -268 -92 -212 -18 -71 69 83 29 37 -121 173 120 64 58
7479E8q5Q7N9r5OM1k21Q4M3M3jj86PK9L0O9J54j70P8j87J58k07L84l61J68j55
$$ 58 -27 60 119 24 30 71 -150 -66 -23 20 19 -167 -160 -131 -101 -32 122 -48 30 -157 1 -206 178 -183 -15 -170
7505a70Q2L44j98j83J18K47k02j94J10j35J75R7k48k18L24L5N6J15r8q6j2j2J14
$$ -170 -88 256 58 -125 -7 240 38 -156 -46 -181 -6 91 -157 -375 -51 -16 40 155 57 -29 -41 -53 61
7528F1K5k30K78q7q4k23J45o6J79j13J54k83L8N9J60k05K36M1LJ7J23k59RK26
$$ 61 86 -144 134 47 -37 -260 -115 -181 -2 -115 39 -244 -206 -147 13 -192 44 85 88 105 228 -31 -22 204
7552B04l20J93J8j39J02j17R0k72K45J16k17J5K13r1j9J03r4j31J10L3m3j73J09
$$ 204 -116 77 95 -44 58 -59 31 -241 4 120 -97 -82 131 40 21 124 30 -101 9 42 -1 -174 -65
7575f5J92k52N5L9K44r7l03K41j46N6m23L64L50m46L51J7k65J32P2j34p4K6j39
$$ -65 127 -125 -70 -31 213 116 -187 54 -92 -36 -459 -95 255 -191 160 177 -88 44 116 -18 -92 -66 -205
7598b05M37k99L15j23p2r6k85M51l71L30k94K87q2P5M1n7j27J46K6j15L60l44
$$ -205 232 -67 248 125 53 -43 -328 123 -248 82 -212 75 -7 68 109 52 -75 71 97 -18 342 -2
7620bM1j41J45k15rL23j13K1k07L86m66K85k9k56K87J96j97j26J0K06m9j72L32
$$ -2 39 -102 43 -172 -181 142 29 50 -157 229 -237 48 19 -237 50 246 49 -77 -67 139 90 -82 250
7643B50m99L42Q2l06K90J03l64K37k35R5j6L6j74K72q3k12L98k35N3Q4J1k65J37
$$ 250 -249 93 175 -131 159 262 -102 135 -100 -5 -21 15 -159 113 30 -182 216 -19 34 118 129 -136 1
7666AK75m48L5J01k09J32O8q0K94lq7O6r5J51k85L65j55j55K0J99l55J12K64k06
$$ 1 276 -172 -137 -36 -245 -113 -45 -125 169 166 79 145 50 201 -84 281 126 -29 -9 190 -165 -53 211 5
7690Eq0K9K00Lk10L07k34J74k16J21k33j4K60k39p6L32n3j18j04K80k02m3J3m2
$$ 5 -75 -46 154 157 -53 254 20 194 -22 99 -134 -148 112 -127 -203 129 76 -42 -146 134 -68 -111 -98 -140
7714a40J34O6J82q6k71J12j71J35J52Qp0JK0L4Q8k74k12L42K3j6L0rk56J25J76
$$ -140 -6 60 242 156 -115 -3 -174 -39 113 121 51 52 72 106 194 -80 -292 50 73 57 87 78 -178 -53 123
7739A23n0j60j2M6O6J97j96j7m7q2k01M90k12Q4Q3P9k55j0j10J56J16p3J62k12
$$ 123 73 -87 -99 -53 13 210 14 -3 -50 -132 -333 157 -55 29 112 191 -64 -74 -184 -28 88 15 177 -35
7763c5j26J30mj58J85r9k9L21l92J17J9k9J74J26l1j48j40L91jk39m8%K01l47
$$ -35 -161 -31 -35 -193 -8 -107 -136 185 -207 -90 -71 -100 74 200 169 21 -119 272 271 32 -16 -16 185 -162
7787a62K61N7l58K2J51k19K09k5m6rL08k38r2K05j91O3m6P3k29K66Q3J16r9j15
$$ -162 99 156 -202 -180 -29 -248 -39 -64 -110 -119 189 -49 -141 64 -127 -64 -110 -37 -266 0 83 199 100 -15
7811a5P4J31M2l26J57l9m4J40R9j61j76R3K2k9J36q1K23k09m3K71k70j47k2L59
$$ -15 59 190 232 -94 63 24 -20 120 219 58 -118 -25 -3 -32 104 23 246 37 -6 265 -5 -152 -174 185
7835A85j94J53l7j47R1k01K57k59Q9J44J48k79L9K24j16k22K24j10j19J68o3j7
$$ 185 -9 144 107 -40 51 -150 107 -152 -63 81 229 -50 -11 213 97 -125 99 -11 -130 38 -25 -42
7857d2N3ko7Q1NL4j9j30J29J01k19q7J15r5L44l59J1L12j25K4j01J51j6R1j23
$$ -42 11 9 -58 23 28 62 43 -87 42 143 -76 -163 -48 -143 201 -158 -147 165 40 64 -37 114 98 189 66
7882F6N7k19j11L12j85j8k9J45J12j58K1J80j95L2K38k84L6O2J32K0k57n0K64
$$ 66 123 -96 -207 105 -80 -98 -127 18 130 -28 -7 173 -22 10 248 -36 0 62 194 214 -43 -93 171
7905A71k57O5P4J58j13p9j22K36n2j93%J25J26k88J81m2%j06L1O7M4J77m3m15
$$ 171 -86 -21 53 211 98 19 -103 133 81 -112 -112 13 139 -149 32 -10 -10 -116 -85 -18 26 203 160 -255
7929b55L34j0O7n0q6J13qOk48J43l9p9q6Q0K09p2m6L1J73M1r1j16j64J48J0r3
$$ -255 79 69 136 86 0 113 105 111 -137 6 -33 -112 -198 -118 91 19 -27 4 177 218 127 11 -153 -5 5 -88
7955h8J91l11M77l53O0L0l5l7K41k81L62k18j14j33J29j63J52k5j24J92NJ26j28
$$ -88 103 -208 269 -84 -24 6 -29 -66 175 -106 256 38 -76 -209 -80 -243 -91 -116 -240 -48 -43 83 -45
7978d5J50k68N8P3K6l21N17l60J17J75o7J62j00m6l16K16K21m3l95J81N5k0mj9
$$ -45 105 -163 -105 -32 -6 -327 190 -170 -53 122 55 217 117 71 -245 -29 192 149 -246 -65 -10 -30 -34 -53
8002e3J9l0O4J37j05q3K02j99Kk61L24j62J66J14j35J49j38n5M7Ko2Q0m8J74p9
$$ -53 -34 -64 0 137 32 -51 151 -48 -46 -307 17 -145 21 135 0 149 11 -44 3 5 -57 23 -25 149 70
8027G0j25K00l38M19n8j16k1n5K4PL9J4m3K2j98J9J28R3j18KJ34j45N5J28j09
$$ 70 -55 145 -193 226 168 52 31 -24 0 7 46 60 17 39 -159 -140 -12 81 -37 -35 99 -46 9 137 28
8052B8J40j36k3m8J97k56J44P8j10M4r5J45p1Q6j24j30K52k3k59J83j06r0J79
$$ 28 168 32 9 -39 158 -98 46 124 14 58 -37 108 37 123 -1 -131 121 98 -161 22 -84 -174 5
8075Ej39K44k90J11J06J76p5l20O5J7O2j52M05j15r6P7j56j23K80J14j18q6j00
$$ 5 -134 110 -180 -69 37 213 138 -182 -117 -100 -38 -190 215 100 4 81 -75 -198 82 196 78 -8 -108
8098a08L65k50j93J64M9o6l13M52o5O8J37m37L75j51p5L9J72q7J44k57j15J23
$$ -108 257 7 -186 -22 27 -39 -352 100 35 103 240 -197 178 27 -48 -9 163 76 220 -37 -152 -29
8120b9K0j62K45M6M6k37l2J40m8J11mK08l20j70M48m09J57J24j60q9r9K44J6M4
$$ -29 -9 -171 74 120 166 -71 -103 37 -11 100 96 304 -16 -186 262 -147 10 134 -26 -115 -214 30 46 90
8144I0J60n0k48J28k55J71p7l6P4J38j22J2p4R1l1J86O0K8k2k34o9O7R3J33j9
$$ 90 250 200 -48 80 -175 -4 -81 -117 -43 95 -27 -15 -89 2 -29 157 217 245 223 -11 -80 -13 80 213 194
8169A94l10J59k35L29JONl8K9J23k67R8R4q7J40k16j80J14p2j7J57j66
$$ 194 -116 43 -192 137 138 144 149 111 140 263 -4 94 188 101 241 25 -155 -41 -113 -130 27 -139
8191a39
$$ Imaginary data points
##PAGE= N=2
##DATA TABLE= (X++(I..I)), XYDATA
0@%%%%%%%%%%%%%%Qj6J6j6J6k4L2l2M0m8N6o4P2q8J04j20J36j52J74j98K23k53
$$ 0 0 0 0 0 0 0 0 0 0 0 0 0 0 0 8 -8 8 -8 8 -16 16 -16 24 -24 32 -32 40 -48 56 -64 72 -80 94 -104 119 -134
36a34K84l17L53l94M40m89N43o04O70p41Q18r00R90j094J206j326J461j613J782
$$ -134 150 -167 186 -208 232 -257 286 -318 352 -389 429 -471 519 -575 631 -695 766 -847 935
55I35j972K187k430K712l043L437l916M513n279O305p758R994j3915K2805q2503
$$ 935 -1037 1150 -1280 1432 -1611 1826 -2090 2423 -2856 3449 -4309 5685 -8230 14575 -67928
70f7928r02R3741o4463r908L4200J9094l0299j680J2910M290J0849L2535j7722
$$ -67928 -68830 24911 -39552 -49460 -15260 3834 -26465 -28145 -15235 -10945 -96 32439 14717
83A4717k5963R997K7741O499k3038j3422L4874M593l2306l993K1626Q083q126
$$ 14717 -11246 -1249 26492 32991 9953 -3469 31405 35998 3692 -301 21325 29408 21282
96B1282p334K50k1699m585K9109r979k8064J9730J5810k0119j6136J0785J3806
$$ 21282 13948 14198 -7501 -12086 17023 7044 -21020 -1290 14520 -5599 -21735 -10950 2856
109B856m92J0031M433k6838M873K6509j7870j8915J6851J7486m323k3339n584
$$ 2856 2364 12395 16828 -10010 -5137 21372 3502 -15413 1438 18924 14601 -8738 -14322
122a4322J7818m8q734J50L640L846o331j844L124j3063L970J7675j6940j6296
$$ -14322 3496 3448 -5286 -5136 -1496 2350 -3981 -5825 -2701 -15764 -11794 5881 -11059 -27355
136b7355J4869J3739p383j0519J6183J3501j9257k894J5540n793j813J1667L906
$$ -27355 -12486 1253 -6130 -16649 -466 13035 -6222 -9116 6424 631 -1182 10485 14391
149A4391n313p833K613L327j0069J496Q312P79J034o989k885O568o375j98R353
$$ 14391 9078 1245 3858 7185 -2884 -1388 6924 7703 8737 1748 -1137 5431 -944 -1142 8211
164H211m782k540K809l912m491k622O039K967r026N463P502o895K917L989k735
$$ 8211 3429 889 3698 -214 -4705 -7327 -1288 1679 -7347 -1884 5618 -1277 1640 5629 2894
179B894P83l390j669J112j919O877J627n501K763m866o254K141j683M481P366
$$ 2894 3677 287 -1382 -270 -2189 4688 6315 814 3577 -1289 -7543 -5402 -7085 -2604 4762
194D762l613P40K56n496p68q00L351J788l669O002O32q853M817M478l646J457
$$ 4762 1149 1889 2145 -3351 -4119 -4919 -1568 220 -3449 2553 3185 -5668 -851 3627 -19 1438
210A438j411O17K329m036K637K374j274K078m932l419K418k388L480J216n560
$$ 1438 27 644 2973 -1063 1574 3948 2674 4752 -180 -3599 -1181 -3569 -89 1127 -4433
225d433M843J638o448M77K362L895K36n357L460R9n853M177M18p53N618r53r26
$$ -4433 410 2048 -4400 -3923 -1561 2334 2570 -2787 673 772 -5081 -904 -486 -1239 4379 3426 2500
242B500J94l514K390n24k129L182q35Q28K097l801K226p48o780L038k14m045L885
$$ 2500 2694 -820 1570 1046 -1083 2099 1264 2092 4189 388 2614 1866 -4914 -1876 -2090 -6135 -2250
259b250K893O21r84k859K634k853l715N394m77K13N261k820j140J471k583K169
$$ -2250 643 1264 280 -2579 55 -2798 -6513 -1119 -1596 -1383 3878 1058 -82 1389 -1194 975
275I75m15q84M829j200j033N11k736L155j215m954N001q7l599K762p25j702m32
$$ 975 560 -324 4505 3305 2272 2783 47 3202 1987 -2967 2034 1947 -1652 1110 385 -1317 -1749
292a749j725K264k129j26N234k893j729L855l735p42J811K6L383L64k41K414l044
$$ -1749 -3474 -1210 -3339 -3465 1769 -1124 -2853 1002 -2733 -3475 -1664 -1638 1745 2109 1868 4282 1238
309A238j062M73k249L639J18j451M463j805l233K271k891j738Q97k58J603j305
$$ 1238 176 649 -1600 2039 2157 706 5169 3364 131 2402 -489 -2227 -1330 -1588 15 -1290
325a290O33L530m923q76K636m092N74K703o56K733K08q87J339l032Q12J194j451
$$ -1290 -657 2873 -2050 -2926 -290 -4382 -3808 -1105 -1761 972 1180 293 1632 -1400 -588 606 -845
342h45L124K11j772K254k853j450L202k467l9J973j090N14k234k80J524l898K096
$$ -845 2279 2490 718 2972 119 -1331 1871 -596 -635 1338 248 762 -1472 -1752 -228 -4126 -2030
359b030K553l295K326J595k951J309q78p29J479j018K888J645r89K839j571k843
$$ -2030 523 -2772 -446 1149 -1802 -493 -1371 -2100 -621 -1639 1249 2894 1905 4744 3173 330
375C30K225k913j3L538j688J301J289k299m04k630l49P46k607K734J908l313K041
$$ 330 2555 -358 -371 3167 1479 2780 4069 1770 1366 -1264 -1613 -867 -3474 -740 1168 -2145 -104
392a04K77l378J372k41l61P87j90K299k70j158K177j839j062L492j983J1L198
$$ -104 173 -3205 -1833 -2074 -2435 -1648 -1838 461 191 -967 1210 -629 -1691 1801 -182 -171 3027
409C027k144L05K28j526P12q64J319P22k348K071q5m584K484m23k753K910O49
$$ 3027 883 1188 1416 -110 602 -262 1057 1779 -569 1502 1417 -3167 -683 -1106 -3859 -949 -300
426c00m51L75l42J073j774j427K702j036M56M092k099P53J841l315o19M26l40
$$ -300 -751 -376 -718 355 -1419 -2846 -144 -1180 -724 3368 1269 2022 3863 548 -71 355 15
443A5J755K1R60K20k819K413j198l859L402L57k156J471p29k92Q42j027K61r89
$$ 15 1770 1791 2751 2971 152 2565 1367 -2492 910 1267 -889 582 -147 -439 403 -624 -363 -1352
461a352l79K418k755O79L050k314Q46Q23k803N51J441KM62r15J144Q1l768J744
$$ -1352 -1731 687 -2068 -1389 1661 -653 193 1016 -1787 -1236 205 207 669 -246 898 979 -2789 -1045
479a045O25q78L339j077j945J458k125l71O05R3J220q86M95J815k546M09K930
$$ -1045 -420 -1298 2041 964 -981 477 -1648 -2019 -1414 -1321 -101 -987 -492 1323 -1223 -814 2116
496B116k445L10P74p13J517M45J135J055k780p9M4l132J085K53L21K852j966j761
$$ 2116 -329 -19 755 42 1559 2004 3139 4194 1414 1335 1379 -1753 -668 -415 -94 2758 792 -969
514i69O93j871J52l44m03K490j106q89J531k920J6L350j341m91P82P09J976j728
$$ -969 -276 -2147 -1995 -2339 -2742 -252 -1358 -2247 -716 -3636 -3620 -270 -1611 -2102 -1320 -611 1365 -363
532c63k6K395n93J700j72k449K731Q41k382O20j110k27Q67q72J47r50m8K442k715
$$ -363 -389 2006 1413 3113 2941 492 3223 4064 1682 2302 1192 965 1832 960 1107 157 109 2551 -164
551a64k487K035j001j2L16j501J767J308j358k47k223J022K064j600J870J093
$$ -164 -2651 -616 -1617 -1629 -1313 -2814 -1047 261 -1097 -1344 -3567 -2545 -481 -2081 -211 882
567H82o74K630j482l013J054J230O51j307j432K649k18j986J160j361L07J822
$$ 882 208 2838 1356 -1657 -603 627 1278 -29 -1461 1188 970 -1016 144 -1217 -910 912
583I12k209q26J251Q1J634n96r53O87j409O79Q76j281K499K042j642N2j418J00
$$ 912 -1297 -2123 -872 -791 843 247 -706 -19 -1428 -749 127 -1154 1345 3387 1745 1797 379 479
601D79K004J18J191L9k093J045j941k783J963M07l1J022k798m85L46p3M05j967
$$ 479 2483 2601 3792 3831 1738 2783 842 -1941 22 429 398 1420 -1378 -1863 -1517 -1590 -1185 -3152
619c152J136K047k887K69K201j630K270J52k708J15O70J311R27J38K294j85k479
$$ -3152 -2016 31 -2856 -2587 -386 -2016 254 406 -2302 -2187 -1517 -206 721 859 3153 2968 489
636D89P82j379m86L442m63r08L24j415p00p64R3J063q59N56Q85l671J052K216
$$ 489 1271 -108 -594 2848 2385 1477 1801 386 -314 -1078 -985 78 -781 -225 660 -3011 -1959 257
654B57k156J548Q72j531L92J60k26Q7J47K309j156j922K904q40o99K500j258o44
$$ 257 -1899 -351 521 -1010 -618 -458 -684 -597 -450 1859 703 -1219 1685 845 146 2646 1388 744
672G44P56j678m90J6P24J438j981P49M22l136O94R18j575J522J081q88O42k31
$$ 744 1500 -178 -668 -652 72 1510 -471 278 700 -2436 -1742 -824 -2399 -877 204 -684 -42 -273
690b73L70l41n88J535q68p77K508j229m55K301j146r42O16n90O7l29N04R10j434
$$ -273 97 -244 -832 703 -165 -942 1566 337 -118 2183 1037 95 711 121 188 -141 363 1273 -161
709a61J55L27k403P17J228j425J216j52j89O01r32O2K50q3K147q60q55J962j143
$$ -161 -6 321 -2082 -1365 -137 -1562 -346 -498 -687 -86 -1018 -956 -706 -789 1358 498 -357 1605 462
728D62o28P95k68N17O50p92L96j068K14O89j761M42Q70j700J207Q1j328J190n21
$$ 462 -166 629 361 878 1528 736 1132 64 278 967 -794 -352 518 -1182 25 106 -1222 -32 -553
747e53q37O77p65M55Q7k46J484m09m56J313j190j44J262k84O96P36p80L45p15
$$ -553 -1390 -713 -1478 -1023 -936 -1182 302 -107 -563 750 -440 -584 678 394 1090 1826 1046 1391 676
766F76r3R75j777P13L52j257R84m40r41J020j060J10K03n94N37N4o05J202q41
$$ 676 583 1558 -219 494 846 -411 573 133 -808 212 -848 -738 -535 -1129 -592 -538 -1143 59 -782
785g82p29J224q72M98J138j112R73N94j102P40n57L78Q33r49J297J20j829J059
$$ -782 -1511 -287 -1159 -661 477 -635 338 932 -170 570 13 391 1224 275 1572 1692 -137 922
803I22q48q03P56l28k6Q51q77L85l30p30R93j153L23J130q63O97N82j154P10k12
$$ 922 74 -729 27 -301 -327 524 -353 32 -298 -1028 -35 -1188 -865 265 -598 99 681 -473 237 25
823B5p03R13m45N80J069q68Q64k92p51P67q07k21R00j196n38N98r90M23l06m88
$$ 25 -678 235 -210 370 1439 571 1435 1143 392 1159 352 131 1031 -165 -703 -105 -1095 -672 -978 -1466
843a466N20n74K06P54j273R24K93p28J060n3n34P17j48M19K67o46J157l64k95
$$ -1466 -946 -1520 -1314 -560 -1833 -909 -616 -1344 -284 -337 -871 -154 -302 117 384 -262 895 531 236
862B36J346n90L72Q74q01O9j1j254Q72n03n39J041j028L07j04j143R83k60p41
$$ 236 1582 992 1364 2238 1437 1506 1495 241 1113 610 71 1112 84 391 287 -856 127 -133 -874
881h74J111j36m76R69j173M70J51q46O13k80j60R35n33P9O33p30L97K1j058J237
$$ -874 237 101 -375 594 -579 -109 42 -804 -191 -471 -631 304 -229 -150 483 -247 150 171 -887 350
901C50m46l18K98q39K41j35r88J000j8l20J198p19m02J153p68O90L27l20J160
$$ 350 -96 -414 -116 -955 -714 -849 -1837 -837 -855 -1175 23 -696 -1098 55 -713 -23 304 -16 1144
920A144j99p93O91q10Q43K45j198R90J62o59R51l29p40N87q45L21n30o82J065
$$ 1144 945 152 843 33 876 1121 -77 913 1075 416 1367 1038 298 885 40 361 -169 -851 214
939B14k05m35N24j080J64N60r23Q35R44p07O13q6o55Q43o27O51O8q53J068k28
$$ 214 9 -426 98 -982 -818 -258 -1181 -346 598 -109 504 418 -237 606 -21 630 698 -155 913 685
959F85r34O11n33j94Q08j054p2M91q37P55q85j62J134j239j19J076j205O05P16
$$ 685 -249 362 -171 -365 443 -611 -683 -192 -1029 -274 -1159 -1321 -187 -1426 -1545 -469 -1674 -1069 -353
978c53m44L96n79Q44M18o93J221K02p10R42m11p58J208l10k82N54m49pm75L17
$$ -353 -797 -401 -980 -136 282 -411 810 1012 302 1244 833 75 1283 973 691 1245 796 789 314 631
998F31M76j433K95Q59j512J04J080j099K82Q1o01M22m55N44M7k1P02m40o03J201
$$ 631 1107 -326 -31 828 -684 -580 500 -599 -317 -236 -837 -415 -870 -326 -279 -300 402 -38 -641 560
1018E60n72n18J472j93p48M44k28j05n5L40L09j468L06Q64j512R19O18j236Q60
$$ 560 -12 -530 942 749 1 445 217 112 57 397 706 -762 -456 408 -1104 -185 433 -803 57
1037E7k47q99N00J99O34m25o49J401o49q27J563k32m80J185n91m33N46m08N55
$$ 57 -190 -1089 -589 -390 244 -181 -830 571 -78 -905 658 426 -54 1131 540 107 653 245 800
1056H00k38J0K21j085M61M99j238P95N68j647L21O6J2r1J91M42k34q68R13l86
$$ 800 562 572 793 -292 169 668 -570 225 793 -854 -533 -467 -455 -546 -355 87 -147 -1015 -102 -488
1076d88p59J884j78m72Q03o64k93M56L08pk69K87J33j021M09Q78j136O68k5r78
$$ -488 -1247 637 459 -13 790 126 -167 289 597 590 321 608 741 -280 129 1007 -129 539 514 -464
1096d64L66n8r5J73l74M87o71j99Q03l81n06J697r08m06M15k32O64j62j44R26
$$ -464 -98 -156 -251 -78 -452 35 -636 -835 -32 -413 -919 778 -130 -536 -121 -353 311 149 5 931
1116I31j242N57O25q07N17L57q51L71l03p20Q42J0l00kl28N61o57m20J178o68
$$ 931 -311 246 871 64 581 938 87 458 155 -565 277 287 -13 -15 -343 218 -439 -859 319 -349
1136c49l36N26l49l44O75l1K38k32K17N92p47J27P50p88P91K68q66N39m8l00J84
$$ -349 -685 -159 -508 -852 -177 -208 30 -202 15 607 -140 -13 737 -51 740 1008 142 681 633 333 517
1157E17o4k45j25o92M98j98m52J130p44j55M80l72o7M64j12K67k35k11M40n76
$$ 517 453 208 83 -609 -111 -309 -761 369 -375 -530 -50 -422 -489 -25 -137 130 -105 -316 124 -452
1177d52L25N45n37M17J75n71L95j06j56N03n76M18k27n32L32j11m15M63l87q8
$$ -452 -127 418 -119 298 473 -98 297 191 35 538 -38 380 153 -379 -47 -158 -573 -110 -497 -585
1197e85L88n81K38J47O2O55p55K59O22p84M52O24p54L67K44o71O99m13J44N45
$$ -585 -197 -778 -540 -393 -331 324 -431 -172 450 -334 118 742 -12 355 599 -72 627 214 358 903
1217I03m64Q1Pl94N46j4p79M27m77k42L36n08L83k51k68O67n63K3M32k80J97l4
$$ 903 439 520 527 133 679 665 -114 313 -164 -406 -70 -578 -195 -446 -714 -47 -610 -587 -155 -435 -238 -272
1239b72K2J70k46Q5J71m99K40M80m18N22n48j77M83k39r0N79n04N4L75n78K34
$$ -272 -250 -80 -326 -241 -70 -569 -329 151 -267 255 -293 -470 13 -226 -316 263 -241 -187 188 -390 -156
1260a56j54k79O45q07N00N84n93L51J55Q4M49j38l3M13o91N35j76l58L46j30j57
$$ -156 -310 -589 56 -751 -251 333 -260 91 246 330 779 641 608 1021 330 865 689 331 677 547 390
1281C90L86n19R4K92n76K9l00j98M43m27j26L70p85J6J56m38K23L10m53M88j25
$$ 390 776 257 351 643 67 96 -204 -402 41 -386 -512 -142 -927 -911 -755 -1193 -970 -660 -1113 -625 -750
1302g50J99K87k17L18K50l24M04K3l67N25j13J14K59m26M07K10m54M83n09J66
$$ -750 -551 -264 -481 -163 87 -237 167 190 -177 348 235 349 608 182 589 799 345 828 319 485
1322D85K45l76k5J86o26K83k20m64O00o26L18J62k92L75J61m77K69ok00M43j35
$$ 485 730 354 329 515 -111 172 -48 -512 88 -538 -220 -58 -350 25 186 -291 -22 -28 -228 215 80
1343H0j13J07l67K41r7k5K71j92q6O10p59L62K06l15K88J67o14M83m13J08M9n32
$$ 80 -33 74 -293 -52 -149 -174 97 -95 -181 429 -330 32 238 -77 211 378 -236 247 -166 -58 -9 -541
1365e41M42Ok32N45j88k7J93L8J36J76l81J41J48o31O28m23j87J75k29K20L10
$$ -541 -99 -93 -325 220 32 5 198 236 372 548 167 308 456 -175 453 30 -157 18 -211 9 319
1386C19n78M79j32l5J75m21J27j12l20L70n7j65l2J8j38N46k69J42M24n22L33
$$ 319 -259 220 88 53 228 -193 -66 -178 -498 -128 -185 -350 -382 -364 -502 44 -225 -83 341 -181 152
1407A52k39K63M29m07q5J7j50L66o3o08L98J2l36M35k55K3j7l05O38j13n04L34
$$ 152 -87 176 605 198 113 130 -20 346 283 -325 73 85 -251 184 -71 -48 -65 -370 268 155 -349 -15
1429a5j96l23N13k36Q7L51l13M23j44r4M86l71J58m1j08R5K5k48J83m01K51J32
$$ -15 -211 -534 -21 -257 -170 181 -132 291 147 53 539 168 326 285 177 272 297 49 232 -169 82 214
1451B14o12L02J36l67K06k11m8L48l56p5J37q0L63J3o7J98k13K06rj60J25M04
$$ 214 -398 -96 40 -327 -121 -332 -380 -32 -388 -463 -326 -406 -43 -30 -97 101 -112 94 85 -75 50 454
1473D54l23L01r6L4J57m06J93j12j90p9M6l26M26j82j09P1k84o8J52o7K70j18
$$ 454 131 432 336 370 527 121 314 202 12 -67 -21 -347 79 -103 -212 -141 -425 -493 -341 -408 -138 -256
1495b56j8O27n76R9P23m91p1L05r1r4q1J04K19k03J84j12j60J55k67P7M97n34
$$ -256 -274 353 -223 -124 599 108 37 342 251 157 76 180 399 196 380 268 108 263 -4 73 570 36
1517C6r1J37m79K8Q1j75L40m0j51K17l28L01P8k39N14R5k24k7J27P6k3l12M05
$$ 36 -55 82 -397 -369 -288 -463 -123 -163 -314 -97 -425 -124 -46 -285 229 324 100 73 200 276 253 -59 346
1540C46j25m59P71n90j35M54n5k15J59k07M0k0m0K95n43j49N86m38o7N44o04K49
$$ 346 221 -238 533 -57 -192 262 207 -8 151 -56 -16 -36 -76 219 -324 -473 113 -325 -392 152 -452 -203
1562b03P9N0K4K05J05J05m63L48P5k49L00l6m52J31J33n11L58k83K38k70O5M48
$$ -203 -124 -74 -50 155 260 365 -98 250 325 76 376 340 -112 19 152 -359 -1 -284 -46 -316 -251 197
1584A97n82j03N93j96j63L42m48n9N01j01j78J55K58J78p47N20jk21O02j34l14
$$ 197 -385 -488 105 -91 -254 88 -360 -419 82 -19 -197 -42 216 394 -353 167 166 -55 547 413 99
1605I9K98j93l0r1K12j16m96L29K37n78Q0L76m76J64kk07k3J17P5r5K27K37m72
$$ 99 397 204 174 83 295 179 -317 12 249 -329 -249 127 -349 -185 -187 -394 -417 -300 -225 -320 -93 144 -328
1628c28J10J69N5P8O8J42l93M15j10J23j10j16K75j96n6K88m65R4L39p33J34K95
$$ -328 -218 -49 6 84 152 294 -99 316 206 329 219 103 378 182 126 414 -51 43 382 -351 -217 78
1650G8m67K19J76n5j36k37L81j56m83O63j84j56O31j37l24L94j53K29j84n5L18
$$ 78 -389 -170 6 -49 -185 -422 -41 -197 -680 -17 -201 -357 274 137 -187 207 54 283 99 44 362
1671C62n46O2M34k32J31l3m61l9J93n18L37n8K44N4l70J75K1p5K20J72k99K77
$$ 362 -184 -122 312 80 211 178 -283 -322 -129 -647 -310 -368 -124 -70 -440 -265 -244 -319 -99 73 -226 51
1693E1k19O8K56p6K63l19L7K38r0k84K19m6N6M41n36k2k45O6K18j77M9J41k53
$$ 51 -168 -100 156 80 343 24 61 299 209 -75 144 98 154 595 59 37 -208 -142 76 -101 -52 89 -164
1716a64J56j93o8N00j94k57L44o2j78L40p0J61j48j58K07k62K84P7l34n8J0r5
$$ -164 -8 -201 -269 231 37 -220 124 62 -116 224 154 315 167 9 216 -46 238 315 -19 -77 -67 -162
1738a62J04j79P7J98n31J50k6k78K13J00k83K33J98m02M23M5q2j4J71K57j59j30
$$ -162 -58 -237 -160 38 -493 -343 -369 -647 -434 -334 -617 -384 -186 -588 -165 -120 -202 -216 -45 212 53 -77
1760g7M52j62K01K72l73M0O5P1N2k46o3L26l19J44j43k18K36j05j95L53n24j7
$$ -77 375 213 414 686 313 353 418 489 541 295 232 558 239 383 240 22 258 153 -42 311 -213 -230
1782b30J07j6K3j00j34J04N0l54M15Q1k33K12n5J22j90K4J49j12J95om42L05M3
$$ -230 -123 -139 -116 -216 -350 -246 -196 -550 -135 -54 -287 -75 -130 -8 -198 -174 -25 -137 58 52 -390 -85 -42
1805d2j69L86l16nr8q5L06o7j0J58j9l07L97O5k87M64m69K92K4k76L52j02j6J96
$$ -42 -211 175 -141 -146 -244 -329 -23 -90 -100 58 39 -268 129 194 -93 371 -98 194 218 -58 294 192 176 372
1829C72j21j16J80m84L25J36j97n2m3j46k0M2ON7m31K06k0O4J72k77J76M9n2J2
$$ 372 251 135 315 -169 156 292 95 43 0 -146 -166 -124 -118 -61 -492 -286 -306 -242 -70 -347 -171 -122 -174 -162
1853a62J58l97N30k37l4N64m24K05q9K3m8N8j98K25j50N1r9q2R6mk62J76J93l62
$$ -162 -4 -401 129 -108 -142 422 -2 203 114 137 89 147 -51 174 24 75 -24 -106 -10 -14 -276 -100 93 -269
1877b69J17j7p7NL4m8J09J46J92l51K85L2r7j5J54P0j49Q5mJ59m48rM34l79o8
$$ -269 -152 -169 -246 -241 -207 -255 -146 0 192 -159 126 158 61 46 200 270 121 206 202 361 -87 -96 338 -41 -109
1902a09k2j38M29l67o4j1J72O5P0m40L00l1j77N03p6Nj68L5J38K8j59L42j96j24
$$ -109 -131 -269 160 -207 -271 -282 -110 -45 25 -415 -115 -146 -323 180 104 109 -59 -24 114 142 -17 325 129 5
1926EL7L0k37M48k30r7J88j69J21p8k66K78l13J9K26j82M44m11KJ32j56J87J82
$$ 5 42 72 -165 283 53 -44 144 -25 96 18 -248 30 -283 -264 -38 -220 224 -187 -185 -53 -209 -22 160
1949A60k38N3J30k25O9K5K42O6j55n7J89j10J48k93K2K55l40j87L90j91N7K0j80
$$ 160 -78 -25 105 -120 -51 -26 216 282 127 70 259 149 297 4 26 281 -59 -246 144 -47 10 30 -150
1972a50J79j02P6Pq4M8K7l11N14n6l04K91l6p3J86j64Q3p0l53P42l44j93M38k48
$$ -150 29 -73 3 10 -74 -26 1 -310 204 148 -156 135 99 26 212 48 131 61 -292 450 106 -87 351 103
1996A03n9j55R7o5J11l1J1O7q1Q8l44R1N1k76O5K27j91K42m2p7K48rJ59n2j89
$$ 103 44 -111 -14 -79 32 1 12 79 -2 86 -258 -167 -116 -392 -327 -100 -291 -49 -91 -168 80 71 230 178 -11
2021a1L18k61L9L23l21M8K13l67J22K9j40l2j37l22N59k73MK57J35l53K47m30
$$ -11 307 46 85 408 87 135 348 -19 103 132 -8 -40 -177 -499 60 -213 -209 48 183 -170 77 -353
2043c53L34k40J06J98l95N33k16n6L30p8j38K51j96j8L29l84n7J45K69l2m07K9
$$ -353 -19 -259 -153 45 -350 183 -33 -89 241 163 25 276 80 62 391 7 -50 95 364 332 -75 -46
2065d6k07j97K55J58k39J81j2l61K01J5L43j8q3K65k20k37L04j04q2L17m2k46
$$ -46 -253 -450 -195 -37 -276 -95 -107 -468 -267 -252 91 73 -10 255 35 -202 102 -2 -84 233 191 -55
2087e5L44k84K93l9m5R8j91o2J39j67N5L06l89j67L1N7O4l92K21J66K9K42j01
$$ -55 289 5 298 259 214 312 121 59 198 31 86 392 3 -164 -133 -76 -12 -404 -183 -17 12 254 153
2110A53l82L24R8km1k73K54j6j33lQ9P2j27l4nJ22j68J55J50k65o0k00J88pqL7
$$ 153 -229 95 193 191 150 -123 131 115 -18 -21 68 140 13 -21 -26 96 -72 83 233 -32 -92 -292 -104 -111 -119 -82
2136h2k56J67K34l98K06J46l8Q1K79j76J1r9j7m0J9j08M3K4K21R4m76K21K06j98
$$ -82 -338 -171 63 -335 -129 17 -21 60 339 163 174 75 58 18 37 -71 -28 -4 217 311 -165 56 262 64
2160F4j23l7Q6J13j84K09l68J13RN9JR0j56K62j50q3K04m6K8J19j97L56k87J56
$$ 64 -59 -96 -10 103 -81 128 -240 -127 -118 -59 -58 32 -124 138 -12 -95 109 63 91 210 13 369 82 238
2184B38k7j62M0j66L60l69J80Q2j80K9n4m0L6p1J03l23K02J41m8n9k42J11m8k8
$$ 238 211 49 89 -77 283 -86 94 176 -4 25 -29 -69 -33 -104 -1 -324 -122 19 -29 -88 -330 -219 -267 -295
2208b95L32K18k93M4J83l05L23K0k64L01l5k05p1j41K71mm0J08q8l15M31j62k23
$$ -295 37 255 -38 6 189 -116 207 227 -37 264 229 24 -47 -188 83 79 39 147 59 -256 175 13 -210
2231b10P7lk58J71L50l15KK17l26L0L12Q4k44J33k4k9N8J76j42r4J97M6l74M8
$$ -210 -133 -136 -394 -223 127 -188 -186 31 -295 -265 47 131 -113 20 -4 -33 25 201 59 -35 162 208 -166 -118
2255a18J19M0L6m1l88K47P8l6N5r2P4P0j01kP0k03K49m1j14J92r3J77J8k10l3
$$ -118 1 41 77 36 -352 -105 -27 -63 -8 -100 -26 44 -57 -59 11 -192 57 16 -98 94 1 178 196 -14 -47
2280d7J91r1j15P7J01n0q3j31J44J37j80j4k36L35j70Q4j11l7K63k2l07J87j05
$$ -47 144 53 -62 15 116 66 -17 -148 -4 133 -47 -61 -297 38 -132 -48 -159 -196 67 45 -262 -75 -180
2303a80O0n7n6L35j81K12k57M84l23J71j17J66k9J0j52J67l69K20ok57L86k50
$$ -180 -120 -177 -233 102 -79 133 -124 360 37 208 91 257 228 238 86 253 -116 104 98 -159 227 -23
2325b3m0N3k81K82n9o1K61l16%M89l02j67L1%M47j16k09K28k82k3J87j23K55J6
$$ -23 -63 -10 -291 -9 -68 -129 132 -184 -184 305 3 -164 -133 -133 314 198 -11 217 -65 -88 99 -24 231 247
2349B47j48j71K40l7r2q1N6J03J5j32J99n28L02j18o8M45k78P1j58l6K30j20N7
$$ 247 99 -72 168 131 39 -42 14 117 132 0 199 -329 -27 -145 -213 232 -46 25 -133 -169 61 -59 -2
2372bO1k13J76L0k49J46J3J16n5J97J19m09K26l17L3P3mp0Q3p0Nk05L50k88R8
$$ -2 59 -154 22 52 -197 -51 -38 78 23 220 339 -70 156 -161 -128 -55 -59 -129 -46 -116 -111 -316 34 -254 -156
2397a56p8J94j07RK9K10k10JL13j89K4J03m5M0l4j27J95j91o5p7J77k64j63K89
$$ -156 -234 -40 -147 -138 -109 101 -109 -108 205 16 40 143 98 138 104 -23 172 -19 -84 -161 16 -248 -411 -122
2421a22ln5k32K62L17l82J8J19P5n7j11L09k93J05R8L0k19L85M6r8n0j4J1J85
$$ -122 -125 -180 -412 -150 167 -215 -197 -78 -3 -60 -171 138 -155 -50 48 78 -141 244 290 192 142 128 139 324
2445C24k18J7n0J25l3j81j14J75k87J12n1L35j71j20K15j96j01L26m5k06K81k39
$$ 324 106 123 73 198 165 -16 -130 45 -242 -130 -181 154 -17 -137 78 -118 -219 107 62 -144 137 -102
2467a02O9p3J06o6O5j5J88k32P6o7J23j19K37k05J61r5j96K52k99K06n8j25K94
$$ -102 -33 -106 0 -66 -1 -16 172 -60 16 -51 72 -47 190 -15 146 51 -145 107 -192 14 -44 -169 125
2490A25k19k37J56Q2M7j9O7l0%%J57k38k1L10j14J26j73O6N8n9o3L44k38k23J90
$$ 125 -94 -331 -175 -93 -46 -65 2 -28 -28 -28 129 -109 -130 180 66 192 19 85 143 84 21 365 127 -96 94
2515I4j97N5O5J0p6j03J21O1l57L12l70L34q0n1M15j54j81R8J69K8r5o6M1K9N
$$ 94 -103 -48 17 27 -49 -152 -31 30 -327 -15 -385 -51 -131 -182 233 79 -102 -4 165 193 98 32 73 102 107
2540A07j62J95k11J1J24j17Mm4J0K27J9j13j00m9o4m1L61j05j06j28J61m7j36
$$ 107 -55 140 -71 -60 64 -53 -49 -93 -83 144 163 50 -50 -99 -163 -204 157 52 -54 -182 -21 -68 -204
2563b04L78k56O5Jm4J52j15j07K56R9j64N3j65L2OJ03P0p8l85M07l25J30K92k37
$$ -204 174 -82 -17 -16 -60 92 -23 -130 126 225 61 114 -51 -19 -13 90 160 82 -303 104 -221 -91 201 -36
2587c6j21K6m4r7K47r1K27m91L59K61j82Pq2q3J3K8L21j47j5J00j49kR6O0j62
$$ -36 -157 -131 -175 -272 -25 -116 111 -380 -21 240 58 65 -17 -100 -87 -59 262 115 100 200 51 49 145 205 43
2612D3P7n1p6Q3l13k7L3K63m36K02L06l34q3J11J17K67k23j01K56l09L27j19O8
$$ 43 120 69 -7 76 -237 -264 -231 32 -404 -202 104 -230 -313 -202 -85 182 -41 -142 114 -195 132 13 81
2635H1k11K05J32l95K17n8Q4j03o2K74l01J92o6j63L62l82K12R6m23K37O8j03
$$ 81 -130 75 207 -188 29 -29 55 -48 -110 164 -137 55 -11 -174 188 -194 18 114 -309 -72 -4 -107
2657a07j5K14k7q8J37m2K30m14n2K48J37k31O6J71K7k09l5K56l85K12n4k58N5
$$ -107 -122 92 65 -23 114 72 302 -112 -164 84 221 -10 56 227 254 45 10 266 -119 93 39 -219 -164
2680a64J42J8Q6j01N4k7j68%L12k88L1r9J94L02m5k38j39N1J02n2P2j6l2J88j49
$$ -164 -22 -4 82 -19 35 8 -160 -160 152 -136 -105 -204 -10 292 247 9 -130 -79 23 -29 43 27 -5 183 34
2705C4N2m6K6R1m8K33l31J05j70j28nK80O4J7j29m65N80m34O9L68k46M9L0m6j24
$$ 34 86 40 66 157 109 342 11 116 -54 -182 -187 93 157 174 45 -420 160 -274 -205 163 -83 -34 -4 -50 -174
2730a74K66P9k15K43l52N64k40r6k87L62p3l83r2L15r6J47k60K02k9J91K0m41
$$ -174 92 171 -44 199 -153 411 171 75 -212 150 77 -306 -398 -83 -179 -32 -292 -90 -119 72 92 -349
2752c49K54k12L43o9r6MN1K41J30l10P4j12J13q3J33k03JJ45N5j14kj%Q9j58R3
$$ -349 -95 -307 36 -33 -129 -125 -74 167 297 -13 61 -51 62 -21 112 -91 -90 55 110 -4 -6 -7 -7 82 -76 17
2778A7k32J11J91k42N3K12k73L9J19J03j3J41j46O7R3k20O0M5m1O5K1l33J44n1
$$ 17 -215 -104 87 -155 -102 110 -163 -124 -5 98 85 226 80 147 240 20 80 125 84 149 170 -163 -19 -70
2802g0P1r6LK09l60Q3J47K12k81N7n1l9n0J64j14K48j84K4Q7k80L96m28K45j5
$$ -70 1 -95 -92 117 -243 -160 -13 199 -82 -25 -76 -115 -165 -1 -115 133 -51 -27 60 -220 176 -252 -7 -22
2826b2O2R5J2k27J12p3K90k64Q1q6J44o9J5k09N1J99o0r8J93l59L3J67j46Q3j84
$$ -22 40 135 147 -80 32 -41 249 -15 66 -20 124 55 70 -139 -88 111 51 -47 146 -213 -180 -13 -159 -76 -260
2851b60R9L10J12m65J11K19l37J31J98j64J90p3J61k67M88n49J39k9J49q4j06
$$ -260 -161 149 261 -204 -93 126 -211 -80 118 -46 144 71 232 -35 453 -96 43 14 163 79 -27
2872b7J31JJ10m35J85K6P3J5k01j90L76O2j86L77l70L1J07j11o5N7N5L9q6oj5
$$ -27 104 105 215 -220 -35 -9 64 79 -122 -312 64 126 -60 317 -53 -22 85 -26 -91 -34 21 60 -26 -32 -47
2897d7K39j22p9K12k43M1j22oJ46P2j76J34J07K8m8j64J18J16k37Q7k3q3j1K48
$$ -47 192 70 -9 203 -40 1 -121 -127 19 91 -85 49 156 184 136 -28 90 206 -31 56 33 -50 -61 187
2921A87Lj38k69J11J23j01K78j93K55o13M58J53l26K64l84J71r9J53j7j81L24
$$ 187 190 52 -217 -106 17 -84 194 1 256 -357 101 254 -72 192 -192 -21 -120 33 16 -165 159
2942A59j11Kj40j09J4m5K07m3J95K4r3o5r7O5K5J54o6k92L99Op5J49k71K83j95
$$ 159 48 50 -90 -199 -185 -230 -23 -66 129 153 60 -5 -102 -37 -12 142 76 -216 183 189 114 263 -8 275 80
2967H0q2l6L3qj26j52Q8J95j63J64j58P6J66R1j05O0k62r6K04j5J28J43k4k21
$$ 80 -2 -38 -5 -13 -139 -291 -203 -8 -171 -7 -165 -89 77 168 63 123 -139 -235 -31 -46 82 225 201 -20
2991b0R0j97J75J29j14k21P4K11j95M0R5k9n5n2k28K64R2m2J10j54J40k5l90L12
$$ -20 70 -127 48 177 63 -158 -84 127 -68 -28 67 38 -17 -69 -297 -33 59 17 127 -27 113 88 -302 10
3015A0nj51K40k9p6Km6n8Q2p6J79OM3k71K25q8J0K72r8m07L20k0j59L04k24K29
$$ 10 5 -146 94 65 -11 -9 -55 -113 -31 -107 72 78 121 -150 75 -13 -3 269 171 -236 84 64 -95 209 -15 214
3041B14r2j45j90L34k2k3p0j57L46m81P2K15j75p9L52l7j75M3qM14k71j75j56
$$ 214 122 -23 -213 121 99 76 6 -151 195 -286 -214 1 -174 -253 99 62 -113 -70 -78 336 65 -110 -266
3064b66K44J06Pj55l2k43P0R0K70J34l52n2J16J58j36R1k33K06J47P2j49J65j51
$$ -266 -22 84 91 -64 -96 -339 -269 -179 91 225 -127 -179 -63 95 -41 50 -183 23 170 242 93 258 107
3087A07j13j68L44J0q5j45J21K03l53N1J14Q4j61j71K93j07j60r3K83M2N5j51
$$ 107 -6 -174 170 180 95 -50 71 274 -79 -28 86 170 9 -162 131 24 -136 -229 54 96 151 0
3109@j44J23k44K84q8J5o6L15j55J9j15L12j56m6m9q9o0J19r9Q6J58k22L9M2n
$$ 0 -144 -21 -265 19 -69 -54 -120 195 40 59 -56 256 100 54 5 -84 -144 -25 -124 -38 120 -102 -63 -21 -26
3134b6J59m8k50K17k43K18j76L89k88l7J73M1j88K67P2k35J59J67m35J63j15j06
$$ -26 133 85 -165 52 -191 27 -149 240 -48 -85 88 129 -59 208 280 45 204 371 -64 99 -16 -122
3156a22K22k90L46n4k8j8k36o7K40J43l60J32N6J61j56J3q9J91j10L59m33K29
$$ -122 100 -190 156 102 74 56 -180 -247 -7 136 -224 -92 -36 125 -31 -18 -107 84 -26 333 -100 129
3178A29j26j76K43K08l05r1K71K4k26jk6K74r6j81N0j15N4L58m17P7J15j65j23
$$ 129 3 -173 70 278 -27 -118 153 177 -49 -50 -76 198 102 -79 -29 -144 -90 268 -149 -72 43 -122 -245
3201b45K38j1j29J63J67k2m55L90J13j36p2M7J63k58P9j64J85J13j54n6o5K47
$$ -245 -7 -18 -147 16 183 161 -294 96 209 73 1 48 211 -47 32 -132 53 166 12 -44 -109 138
3223A38m58L60J70l5p2Nl11J54J84j09r4k0P9o5J7O9K1J31j70k8nr6p3M53k86
$$ 138 -320 40 210 175 103 108 -203 -49 135 26 -68 -88 -9 -74 -57 12 33 164 -6 -34 -39 -135 -208 245 -41
3248d1J59j32O5j61N5O6J24k33J51j95J22K63n93J03R8J13J07j56l5m2M37k30
$$ -41 118 -14 51 -110 -55 11 135 -98 53 -142 -20 243 -350 -247 -149 -36 71 -85 -120 -162 275 45
3270D5q2J23j36L16l68K05M4j81Q4k60K13p1j19J20J21R2j28K21l83K01j0k14
$$ 45 -37 86 -50 266 -102 103 147 -34 50 -210 3 -68 -187 -67 54 146 18 239 -144 57 47 -167
3292a67K72m0j10k49M13J35k71j51NK94j42J47m4q0k48K3K46P0p9R2K9N1j47j33
$$ -167 105 65 -45 -294 119 254 -17 -168 -163 131 -11 136 92 12 -236 -213 33 103 24 116 145 196 49 -84
3316h4N6K7l24K82J88l39J93J13k86K59o3m9Mj18Q1P2j86Q4J14j52K63j52j03
$$ -84 -28 -1 -325 -43 145 -194 -1 112 -174 85 22 -27 -23 -141 -60 12 -174 -90 24 -128 135 -17 -120
3339a20J03J65j18P2k17K5j05L35l18M2P8J49n8p8O0L39m64M5L9j09J63q4J44
$$ -120 -17 148 30 102 -115 -90 -195 140 -178 -136 -58 91 33 -45 15 354 -110 -65 -26 -135 28 -56 88
3362H8q5J96l29n2R9j34L62m61L16J27l94J22R9J19k89K53K7l34L53j30J8n8L0
$$ 88 3 199 -130 -182 -83 -217 145 -316 0 127 -267 -145 -46 73 -216 37 64 -270 83 -47 -29 -87 -57
3385e7K14n4K4k06N3J52o3j8k80J30J59j72J85j58L7K29q9o3j40K0q5j63K85J52
$$ -57 157 103 127 -79 -26 126 63 45 -235 -105 54 -118 67 -91 -54 175 86 23 -117 -97 -182 -345 -60 92
3409I2q8Rj28J68K01k30J98l19O8N1n6j04j0J0K24j30j61K09n9J49l3o3j31j39
$$ 92 4 13 -115 53 254 24 222 -97 -29 22 -34 -138 -148 -138 86 -44 -205 4 -55 94 61 -2 -133 -272
3433b72L29q1K11l10J50K3K09j70j54Q8l11L32k3j30J61j7J11j91K6m4j61K00
$$ -272 57 -24 187 -123 27 50 259 89 -65 23 -288 44 21 -109 52 35 146 -45 -19 -63 -224 -24
3455b4K8K9j4o0R2O0k12J95j19m2K09K0j08M2K5j14N6k08J29K5J14k77J10K45
$$ -24 4 33 19 -41 51 111 -101 94 -25 -67 142 162 54 96 121 7 63 -145 -16 9 123 -154 -44 201
3479B01l34K15l65K83n6P8N7O8k99J69J10k34m9o3K82N9l87J77n5O5J59j79J22
$$ 201 -133 82 -283 0 -56 22 79 147 -152 17 127 -107 -156 -219 63 122 -265 -88 -143 -78 81 -98 24
3502B4j39J63k53K71J30j44j56J8O5l7J30N0j16K74l69n7L23k57O8j93J05J18
$$ 24 -115 48 -205 66 196 52 -104 -86 -21 -58 72 122 6 280 -89 -146 177 -80 -12 -205 -100 18
3524A8M9R0r5j7J51j64m6J82k79q1J31m6M5L93l41J03O8Q4j71j18K43k20K80j73
$$ 18 67 157 62 45 196 32 -14 168 -111 -192 -61 -107 -62 331 -10 93 161 245 74 -44 199 -21 259 86
3548H6J15k68j21K64k33K8P1K27l11k52L14R4j54J80j56J31R3J12j88J0j61Q7
$$ 86 201 -67 -188 76 -157 -129 -58 169 -142 -394 -80 14 -140 40 -116 15 108 220 32 42 -119 -32
3570c2j55K8J15R6N5k06K13l4j67M48k61p8o2j0M1j10m3j36L71p4j77J67j92K21
$$ -32 -187 -159 -44 52 107 -99 114 80 -87 361 100 22 -40 -50 -9 -119 -162 -298 73 -1 -178 -11 -203 18
3594A8j58L91p2k16K72k05p9K18l7k18K05k4l4j57L31k11n4p8J76j34K80j14l64
$$ 18 -140 251 179 -37 235 30 -49 169 132 -86 119 95 61 -96 235 24 -30 -108 68 -66 214 100 -264
3617b64L52j58k5O1j86K38K4J15o4p3j51O1n2j33K35J52j71K83k80P4j78K03N
$$ -264 88 -70 -95 -34 -220 18 42 157 93 20 -131 -70 -122 -255 -20 132 -39 244 -36 38 -140 63 68
3640F8j27N3q9r0K28rL3Oj23Q5J24j30j45O9m6k1RJ21j87J48k13L60k50K25j40
$$ 68 -59 -6 -95 -185 43 34 67 73 -50 35 159 29 -116 -47 -93 -114 -105 16 -171 -23 -236 124 -126 99 -41
3665d1J40N7k12r7P3J25j03j15j5K67K1k66J46O9p3o7J31j45K85k72N1O1J03k54
$$ -41 99 156 -56 -153 -80 45 -58 -173 -188 79 100 -166 -20 49 -24 -91 40 -105 180 -92 -41 20 123 -131
3689a31J58O6l90J73O3M5Jk85M83Q4k60p0P0J08o0o3K18l02J17P7l3j29o7n5J12
$$ -131 27 93 -297 -124 -61 -16 -15 -300 183 267 7 -63 7 115 55 -8 210 -92 25 102 69 -60 -127 -182 -70
3714g0J83k6k1j55K11q7n7l5J88J05k02l7J94j32l0p6J44n1J07k21j16K75o4p2
$$ -70 113 87 66 -89 122 35 -22 -57 131 236 34 -3 191 59 29 -47 97 46 153 -68 -184 91 27 -45
3738d5J62j03j11P4O0l7MP8j67J12j19J75Qk21M4K05K9j27J26k02l0j05o1L03
$$ -45 117 14 -97 -23 37 0 4 82 -85 27 -92 83 91 -130 -86 119 148 21 147 -55 -85 -190 -251 52
3762E2j74J60k84K42MJ14l02L62k14L4k12K76j08L1J92j76J40m6M6l16J87J2K05
$$ 52 -122 38 -246 -4 0 114 -188 174 -40 -6 -218 58 -50 -19 173 -3 137 91 137 -179 8 20 225
3785B25j10j19j44L54j63J2l4Oj34J63K30k06j25P2m1J0o9j31K64p7J58j62K32
$$ 225 115 -4 -148 206 43 55 21 27 -107 56 286 80 -45 27 -14 -4 -73 -204 60 -17 141 -21 211
3808B11k46j18J98J34j47M1j25N6J31K9m23J94J64J89n03J14K10K21j99k5P1k53
$$ 211 -35 -153 45 179 32 73 -52 4 135 164 -259 -65 99 288 -215 -101 109 330 131 106 177 -76
3830g6P0P0m2j36m7m4P0M01l18J12Q2j70J00j88K05j49j53K83lj46J15J32k61
$$ -76 -6 64 22 -114 -161 -205 -135 266 -52 60 142 -28 72 -116 89 -60 -213 70 67 -79 36 168 -93
3853i3m4J25ko7j25K18lm3O3l73J99j02L28Pq9J14m34K49Q4p5P1o7J95k00m8J84
$$ -93 -137 -12 -14 -81 -206 12 9 -34 29 -344 -145 -247 81 88 -1 113 -321 -72 12 -63 8 -59 136 -64 -112 72
3879G2j16pJ61r3j70P1K14M5q9q8j29J93j91M49l23k8J64Qj61j65J72k31M19k
$$ 72 -44 -51 110 17 -153 -82 132 177 88 0 -129 64 -127 322 -1 -29 135 143 -18 -183 -11 -242 177 175
3903A75k66K6Q4j33J4N1LK47j94rJ1r8K45l53J43L9N5j35K51l25O6J08K3j04J8
$$ 175 -91 -65 19 -114 -100 -49 -46 201 7 -2 9 -89 156 -197 -54 -15 40 -95 156 -169 -103 5 28 -76 -58
3928e8J6J78j52o8J26m6K9j32J45K28k25j34J05J8J47k02j26K40N5k72K80k33
$$ -58 -42 136 -16 -84 42 -4 25 -107 38 266 41 -93 12 30 177 -25 -151 89 144 -128 152 -81
3950h1j2K12m0p1j45K88l69L65j00j07J91k12K28p5o3K7k17J73Q1k07J65P4N3
$$ -81 -93 119 79 8 -137 151 -218 147 47 -60 131 -81 147 72 9 36 -181 -8 73 -134 31 105 158
3973A58k91J18P9R9o5L0l08R3Q3J41J06j23j21L6K38j51k72K80j79J01k07K52
$$ 158 -133 -15 64 163 98 128 -180 -87 -4 137 243 120 -1 35 273 122 -150 130 -49 52 -155 97
3995I7j98O4Q0j03o9K05j72p4K84r8Q3Q3k61L4L9JJ54j89k20J36K32j56p1J33
$$ 97 -101 -37 43 -60 -129 76 -96 -170 114 16 99 182 -79 -45 -6 -5 149 -40 -260 -124 108 -48 -119 14
4019A4j6J20k24K08k27L52m43K37r6m4L50j91M8J50k23M3m8K33l23N9J0K6jk88
$$ 14 -2 118 -106 102 -125 227 -216 21 -75 -119 231 40 88 238 15 58 10 243 -80 -21 -11 15 14 -274
4043b74L99j10Pkj08j7Q0J00j06J61m53L61k59K23j59J31j40K85j30LR4J1j56
$$ -274 125 15 22 20 -88 -105 -25 75 -31 130 -323 38 -221 2 -157 -26 -166 119 -11 -8 86 97 -59
4066e9J2j69kO0J80k1k70M77j40Q1L8k78P3J29l85N01k63k25r7M28J35m8l33K03
$$ -59 -47 -216 -218 -158 22 1 -269 208 68 149 187 -91 -18 111 -274 227 -36 -261 -358 70 205 157 -176 27
4090B7K42n32L80k74j16K07N9J33l62L53l00J53J20k68J71kJ2J04j18j32L36p5
$$ 27 269 -263 117 -157 -273 -66 -7 126 -236 117 -183 -30 90 -178 -7 -9 3 107 -11 -143 193 118
4112A18k67K43K26k45n8n1k3j90M48j93J31j52k25K36M9n0j04L1K08j35N1j22
$$ 118 -149 94 320 75 17 -34 -57 -247 201 8 139 -13 -238 -2 47 -3 -107 -76 132 -3 48 -74
4134g4J39l27M22j94J2K9l59L92j5J7k94L03j99o0L66j06j79K8qK53m32K16P8
$$ -74 65 -262 160 -34 -22 7 -352 40 25 42 -252 51 -148 -208 158 52 -127 -99 -107 146 -286 -70 8
4157HJ12j36J98j73j04J91k64J60j85L13N8k97J24kj52J85q1L30l59J72j62J8
$$ 8 120 -16 182 9 -95 96 -168 -8 -193 120 178 -119 5 3 -149 36 -45 285 -74 98 -64 -46
4179d6O0l5n1O6J04k18L23k5j85R4l6r3j75K67l7J38k66O9J33J20p4m46K92J04
$$ -46 14 -21 -72 -6 98 -120 203 178 -7 87 51 -42 -217 50 13 151 -115 -46 87 207 133 -313 -21 83
4203H3K2k56J4J73l16L10Q4j28j0j19J19k3NJ19j71j82K66Q6k2j7j60O0J55q8
$$ 83 105 -151 -137 36 -280 30 114 -14 -24 -143 -24 -47 -42 77 -94 -276 -10 76 54 37 -123 -63 92 4
4227DQ0k62K39j10K3l7J89j59N8K53j86lO3q6n4m5Q6J40j68m2op0J24L4j16N0
$$ 4 84 -178 61 -49 -26 -63 126 -33 25 278 92 89 152 66 12 -33 53 193 25 -17 -23 -93 31 65 -51 -1
4253aj7J39j87j3j1pJ73k28N2P0K34k06J57l32N0K76J01k19j09J96l11J50m6K03
$$ -1 -18 121 -66 -79 -90 -97 76 -152 -100 -30 204 -2 155 -177 -127 149 250 31 -78 118 -193 -43 -89 114
4277A14l2M4l88J84N1J46l42J42J3p9K24o7o0K18k93J03L9N7k17L41j62k02K14
$$ 114 82 126 -262 -78 -27 119 -223 -81 -68 -147 77 10 -50 168 -125 -22 17 74 -143 198 36 -166 48
4300D8j86J23p9K15j55J15Rr6m2q0k8J42o8J62P1p8o2j7P5p2K98k06j3j99J35
$$ 48 -138 -15 -94 121 -34 81 90 -6 -48 -128 -156 -14 -82 80 151 73 11 -6 69 -3 295 89 76 -123 12
4325A2R7R0k42q6J36r2J54n0M7n3j48J50r2K8J44j96j06K84n0Q7p3m1J23K22m53
$$ 12 109 199 -43 -129 7 -85 69 19 66 13 -135 15 -77 -49 95 -101 -207 77 27 114 41 0 123 345 -108
4350a08K53n4l92K33J19m61P10k70j52O2K06k1oJ85j72j01j49M59k78k6m0K0l16
$$ -108 145 91 -301 -68 51 -410 300 30 -122 -60 146 125 119 304 132 31 -118 341 63 37 -3 17 -299
4373b99L69J87r7k00R9M0K3q3p2J39j75O7oJ26mj12p6k9M2nK47k75P6J40j8k03
$$ -299 70 257 160 -40 59 99 122 39 -33 106 -69 -2 -8 118 114 2 -74 -103 -61 -66 181 -94 -18 122 104 -99
4399i9L48l14L1R8k90J22J77j52J47l8M6l6j0Q2k02K38j29K21O6l27L87m64J6
$$ -99 249 -65 -34 64 -226 -104 73 -79 68 30 76 40 30 112 -90 148 19 240 306 -21 366 -98 -82
4422h2N3Q2k12J40j6j8lj07K79j48R2l6o7O5o6k6R3oJ14M5r5k38KJ01K93j25L9
$$ -82 -29 53 -159 -19 -35 -53 -56 -163 116 -32 60 24 -43 22 -44 -70 23 17 131 176 81 -157 -155 -54 239 114 153
4449A53j98J72j33L16k31j4r8k05K21M8N2K3k54R7j05J52J9N3R4qj50l6m1q4L70
$$ 153 -45 127 -6 310 79 65 -33 -238 -17 31 83 106 -148 -51 -156 -4 15 68 162 154 4 -32 -73 -157 213
4474B13k34R5l42K70j27j27J98j49L78p0m6Pj23J99j43k22K79M0k75K86j66o9
$$ 213 -21 74 -268 2 -125 -252 -54 -203 175 105 59 66 -57 142 -1 -223 56 96 -179 107 -59 -128
4496a28L11k28R7j22L7J90o0n4j55J07nM9O1J15k46L2oo0K30j67p9K21k25K28
$$ -128 183 -45 52 -70 -33 157 97 43 -112 -5 -10 39 100 215 -31 1 -5 -65 165 -2 -81 140 -85 143
4520A43k84J69r0K18l19k4K22k3J9j63M79l60j09L56k87m2L62j99p0K87m52Q9
$$ 143 -141 28 -62 156 -163 -187 35 12 31 -132 347 -13 -122 234 -53 -95 267 68 -2 285 -167 -78
4542g8L04l05J48k65O8M6P0J59l50L6J8P4J72k9Kqk5k0o5j80J98J19J40k73k00
$$ -78 226 -79 69 -196 -128 -82 -12 147 -203 -167 -149 -75 97 68 70 62 37 17 -48 -228 -30 89 229 -44 -244
4567b44J94j14K98k32K2J44n7%J05Q0k03m7P2j99L61l81L8J84j72M1k7J76J50
$$ -244 -50 -164 134 -98 -76 68 11 11 116 196 -7 -54 18 -181 180 -201 -163 21 -151 -110 -137 39 189
4590A89o6k31K06O7k90K54k40L57j60r8j28j27K46Q9j44%J13j07K13k52K62k98
$$ 189 123 -108 98 165 -125 129 -111 246 86 -12 -140 -267 -21 68 -76 -76 37 -70 143 -109 153 -145
4612a45K32k01L17j32j47K1k5L2n0K47k05M9l5J34l38L88n3o0R0kj64J13J54j28
$$ -145 87 -114 203 71 -76 -55 -80 -48 -98 149 -56 -7 -42 92 -246 142 89 29 119 117 -47 66 220 92
4636I2q1P0Rj62L99m84K69n1J06j24l21pK20j85M49j00j39N4J90j11k56K07P8
$$ 92 11 81 90 -72 327 -157 112 61 167 43 -278 -285 -65 -250 199 99 -40 14 204 93 -163 44 122
4659A22k17K0J97Q9l31P1k0J4j8l4R9l9k3K64k23O2j30r0J64K14j50o2n0K21j69
$$ 122 -95 -75 122 211 -120 -49 -69 -55 -73 -107 -8 -47 -70 194 -29 33 -97 -187 -23 191 41 -21 -71 150 -19
4684a9o5J39m6J02j02K29l71L22q1j82P7N1j29J32Nj11l2P2j51J49N3M5k52K26
$$ -19 -84 55 9 111 9 238 -133 189 108 -74 3 54 -75 57 62 -49 -81 -9 -160 -11 42 87 -165 61
4708F1j36J16K5p6P4K6k05P5J02j99L7N7R7j09K9NK2j00K37N1M0l13J72R2k65
$$ 61 -75 41 66 -10 64 90 -115 -40 62 -137 -100 -43 54 -55 -26 -21 1 -99 138 189 229 -84 88 180 -85
4733h5j33K64j20K80k13Q1k51r1J99n0K76pj70j60N8K22j93J23q8O1J97k12l1
$$ -85 -218 46 -74 206 -7 74 -177 -268 -69 -119 157 150 -20 -180 -122 100 -93 30 -58 3 200 -12 -43
4756d3L4K5M6l14K22MK10j16j3nk29J2J28L00l16J37j45k4N4m0k3M5L7J17j51
$$ -43 -9 16 62 -252 -30 -26 184 68 55 50 -179 -167 -39 261 -55 82 -63 -87 -33 -73 -96 -51 -14 103 -48
4781d8j27J22K88k50j71M05l17L39n80L94J70k13K36k28j21n9Q1Q8J27j03J24
$$ -48 -175 -53 235 -15 -186 219 -98 241 -339 55 225 12 248 20 -101 -160 -79 9 136 33 157
4802A57j6l53O1J89k75%L12k73J02L03k02q5j37J50L8J88k56K43j31J04k17m7
$$ 157 141 -212 -151 38 -237 -237 75 -198 -96 207 5 -80 -217 -67 -29 159 -97 146 15 119 -98 -145
4824a45K36q1k17jK54r5O4jJ09l44Q4J35rj62J80M6j08m9K61K7k11K0L1j46k7
$$ -145 91 10 -207 -208 46 -49 15 14 123 -221 -137 -2 -11 -173 7 53 -55 -104 157 184 -27 -7 24 -122 -149
4849a49J19J56k73J10J6N5R2J49k83j78K34J61l46J06j56N6L29j97j16Q2r9L2
$$ -149 -30 126 -147 -37 -21 34 126 275 -8 -186 48 209 -137 -31 -187 -131 198 1 -115 -33 -132 -100
4871a00R9k54L12J5j16r1KJ44M4K10l71J5K95j98p5P2j66L26j61M6R8k64Q1LK6
$$ -100 -1 -255 57 72 -44 -135 -133 11 55 265 -106 -91 204 6 -69 3 -163 163 2 48 146 -118 -37 -34 -8
4896hm6j17K96j44O3rK8o1m2m7Q9j75K67pm4L8k90R0L74k95PJ62l23K75l60L66
$$ -8 -54 -171 125 -19 44 35 63 2 -40 -87 2 -173 94 87 43 81 -209 -119 255 -40 -33 129 -194 81 -279 87
4922H7r4j2k08K48J20j01j5O0j78M7J48K4Pl34Q8K89k69J91q3j93M41k87J39o9
$$ 87 -7 -19 -227 21 141 40 25 85 -93 -46 102 126 133 -201 -113 176 -93 98 15 -178 263 -24 115 46
4946D6J22k41p9%J51n9J98k78J06j31M73n08K52j12J12J25k4J04m04K75l4j15
$$ 46 168 -73 -152 -152 -1 -60 138 -140 -34 -165 308 -200 52 -60 52 177 153 257 -147 128 94 -21
4968b1p3K03jj45k06K56K0N1j43M7N7J12r8q9j23K30N8j49j37l9J73K25j95J89
$$ -21 -94 109 108 -37 -243 13 33 84 -59 -12 45 157 59 -30 -153 77 135 -14 -151 -190 -17 208 13 202
4992B02o7k26P4j08qJ38mo7J42mn3k9j05M0j02K79P3l31R4J13k46J41P2j0Pj29
$$ 202 135 -91 -17 -125 -133 5 1 -66 76 72 19 -10 -115 -75 -177 102 175 -156 -62 51 -195 -54 18 8 15 -114
5018a14L27k67J6jq8L02j21j82l8Q4L8J8r4R8M7k48K23M9k02K11k20r5K32j63
$$ -114 213 -54 -38 -39 -127 175 54 -128 -166 -82 -44 -26 -120 -22 25 -223 0 49 -153 58 -162 -257 -25 -188
5042a88K95j05J68k53K85k55J37p9K28j34j32L38m27K12K0p4q8J25k55L25j68
$$ -188 107 2 170 -83 202 -53 84 5 233 99 -33 305 -122 90 110 36 -52 73 -182 143 -25
5063b5K7k05K5L82j16p0J02k95K46k11L05m4p4j13J80J6K4j16k4J1J70l15L49
$$ -25 2 -203 -178 204 88 18 120 -175 71 -140 165 121 47 -66 114 130 154 38 14 25 195 -120 229
5086B29l61l3l5K01k14L21j51Q5J73k69n7M4O3M0Mj00N2Q0Q1r0j36J91k6l50M67
$$ 229 -132 -165 -200 1 -213 108 -43 42 215 -54 -111 -67 -4 36 40 -60 -8 72 153 63 -73 118 92 -258 209
5111B09o4l80J81oK39q2l5j94J81O3j16o9P3k3J89l2k6j84Q0k56J31K08J83l51
$$ 209 145 -235 -54 -60 179 97 62 -132 49 112 -4 -73 0 -23 166 134 108 -76 4 -252 -121 87 270 -81
5135h1L82k04j14N6J38l39L06k30J08J34k4J30l67%J84Lk68N0J96m3%j08l7K04
$$ -81 301 97 -17 39 177 -162 144 -86 22 156 132 262 -105 -105 79 82 -186 -136 60 17 17 -91 -128 76
5159G6j4j67%J01k43J03P8m5k1O2K9J7j75M2O0k26M69j59L1o3J13J15j52Q9l63
$$ 76 62 -105 -105 -4 -247 -144 -66 -111 -132 -70 -41 -24 -199 -157 -97 -323 146 -13 18 -45 68 183 31 120 -243
5184b43J49J20K15p1j40k13P9J92K14j95l06J81J74j64j65J78J11j95J73q9R6
$$ -243 -94 26 241 170 30 -183 -104 88 302 107 -199 -18 156 -8 -173 5 116 -79 94 5 101
5205A01k03R3o2J24q5k10J31M0krK7p5L3K65j13N0P0j88J26l0m1o5m7Q7j28K0
$$ 101 -102 -9 -71 53 -32 -242 -111 -71 -73 -82 -55 -130 -97 168 55 105 175 -13 113 83 42 -23 -70 17 -111 -91
5231i1J61k3J86k8j43r4j73K14o8J59Lj14o7N6p7P0J89j53j56J22J36k07K64j62
$$ -91 70 47 233 205 62 -32 -205 9 -59 100 103 -11 -78 -22 -99 -29 160 7 -149 -27 109 -98 166 4
5255DO2m1K7J20j16j38J89o6n6k3J7K63j70rq1L19j26l23o2M42l78Q4j68L52l51
$$ 4 66 25 52 172 56 -82 107 41 -15 -38 -21 242 72 63 -18 301 175 -148 -210 232 -146 -62 -230 122 -229
5280b29M32Q9l56q8J16Q6j89J32j97K34o7j10P0L9k25L04p7P0j49L34P0j78l09
$$ -229 203 292 -64 -152 -36 50 -139 -7 -204 30 -37 -147 -77 -38 -263 41 -36 34 -115 219 289 111 -198
5303a98M0N0K11k90J74K7J03j53J47j67J79k51J05k17K61K00k16k3Q1k2Q4J66
$$ -198 -158 -108 103 -187 -13 14 117 -36 111 -56 123 -128 -23 -240 21 221 5 -18 63 41 125 291
5325B91k6j01k50r0J30j65K67K9l31L44k10K92l0k5n1m7J07J25k01n8j71K21j52
$$ 291 265 164 -86 -176 -46 -211 56 85 -246 98 -112 180 150 125 74 27 134 259 58 0 -171 50 -102
5348a02J47J84k1l07L6jK35j23Qq6O5k11J54j11P5K61j27j30o6O0J9J72Jp1Q8
$$ -102 45 229 208 -99 -63 -64 171 48 56 -30 35 -176 -22 -133 -58 203 76 -54 -120 -60 -41 131 132 61 149
5373A49j88j06J87J68k24k64J12J72k43J97l8n6L04k95K26L3l38L97k08o6Q2j73
$$ 149 -39 -145 42 210 -14 -278 -166 6 -237 -40 -78 -134 170 -125 101 134 -204 193 -15 -81 1 -172
5395a72L24k12j9j49K31O2J95m44L0J85k63M18j89j70j45M44p5k86N7K77k76M49
$$ -172 152 -60 -79 -228 3 65 260 -184 -154 31 -232 186 -3 -173 -318 126 51 -235 -178 99 -177 272
5417B72j95J11k91J27j09Q7j9l58J8K16O4J75j1k73k9L65k88J01o5J02n9M0Ko
$$ 272 77 188 -103 24 -85 2 -17 -375 -357 -141 -77 98 87 -186 -215 150 -138 -37 -102 0 -59 -19 -17 -23
5441b3R9l1l0O5k50RQ7N2P0J78p8l8j14k05K31r0K61j65O0j43nJ91j76j00J67
$$ -23 76 45 15 80 -170 -161 -74 -22 48 226 148 110 -4 -209 22 -68 193 28 88 -55 -60 131 -45 -145 22
5466B2J3Q0K11m76J12K8J8j1m8K83j69k06K35n5j8L17q1l67K05j65j02O2j63O22
$$ 22 35 115 326 -150 -38 -10 8 -3 -51 232 63 -143 92 37 19 336 255 -112 93 -72 -174 -112 -275 347
5490C47n11L7Q6M5j54K3R4J41k67J42K90l13J0o5J95n9l3J43K10j28j26K1j21
$$ 347 -164 -127 -41 4 -150 -127 -33 108 -159 -17 273 -40 -30 -95 100 41 8 151 361 233 107 128 7
5513Gn9Q2q8M9Q8l43L99R8m27R0J62J26k89J34J20q6oj75M75l37Jl20L96ML14
$$ 7 -52 30 -58 -9 79 -264 135 233 -194 -104 58 184 -105 29 149 63 57 -118 357 20 21 -299 97 101 415
5538D15k90j18J94j30R8k60R3R3j02J34j59j56L5K3l0Op5J19o2n4J70Q6R8j19
$$ 415 125 7 201 71 169 -91 2 95 -7 127 -32 -188 -153 -130 -160 -154 -229 -110 -172 -226 -56 30 128 9
5562Ik4J24M8o5l46K73l9J9q5K11Kj65M0j32K33k46J07J25m3kJ00l5j06l11J33
$$ 9 -15 109 157 92 -254 19 -20 -1 -86 125 127 -38 2 -130 103 -143 -36 89 46 44 144 109 3 -308 -175
5587a75J42J55N7k69O8K05N2k99o4J00J38p5rr0J73Q7k21L46l03m5mm0M44m07
$$ -175 -33 122 179 -90 -22 183 235 -64 -128 -28 110 35 26 -64 109 196 -25 321 18 -27 -31 -71 373 -34
5611c4j13J86J99l81J23j94M48k83N7k04J67J64k95J63O5j84K21R4l40K39p5J39
$$ -34 -147 39 238 -143 -20 -214 234 -49 8 -196 -29 135 -160 3 68 -116 105 199 -141 98 23 162
5633A62j46J19m6J01j27Oj10r6R8Q9j51j5Q5L4j51K01j0J46j73j49j8Q5J69p6
$$ 162 16 135 89 190 63 69 -41 -137 -39 50 -101 -116 -31 3 -148 53 43 189 16 -133 -151 -66 103 27
5657B7q5K43k13k2J0L8Q9N2j67J71k09%m8l0K64j88M3J09N0o6k74L9K64m3n6j06
$$ 27 -58 185 -28 -50 -40 -2 87 139 -28 143 -66 -66 -114 -144 120 -68 -25 84 134 68 -206 -167 97 54 -2 -108
5683a08J87j11R7j95Q0r4L96j25k81J19K16k31nq7J91J59k64Q1K0k44Q3K0n0L16
$$ -108 79 -32 65 -130 -50 -144 252 127 -154 -35 181 -50 -55 -142 49 208 -56 25 45 -199 -116 -96 -146 170
5707A70m21M74m8m52M54p2j22p7QK8rK25j01N4Mk79M5J06j94R0l6K35j74J22L59
$$ 170 -251 223 175 -277 177 105 -17 -94 -86 -58 -67 158 57 111 115 -164 -119 -13 -207 -117 -153 82 -92 30 389
5732C89n47K31k47J86o4N2N4j3r2J28m22M33p5RK10n46L44J46j20J8J02j96L51
$$ 389 -158 73 -174 12 -52 0 54 41 -51 77 -345 88 13 22 232 -314 30 176 56 74 176 -20 331
5755C31l48O1K06l08J78O9k60k8L33k89j3K52l3k22m9J65P4j57K92j14j08l84
$$ 331 -17 44 250 -58 120 189 -71 -99 234 -55 -68 184 151 -71 -120 45 119 -38 254 140 32 -352
5777c52R0M68k24k39K50o1j53K65k49J36l18M45ml27K45J83J2j17rk0J42j2j58
$$ -352 -262 206 -18 -257 -7 -68 -221 44 -205 -69 -387 58 54 -273 -28 155 167 50 41 21 163 151 -7
5800gO6k22J4K88j18L0j95K7J52k08Q8L1P7k7j62L72l59m0J06Pk2L15r3J43m62
$$ -7 59 -163 -149 139 21 51 -144 -117 35 -173 -85 -54 23 -4 -166 206 -153 -193 -87 -80 -102 213 120 263 -199
5825a99L81k22mJ53m84L00J45Q3k9k42K99R4j20j91j71L67j31K61k24q7L6Q6k47
$$ -199 182 -40 -44 109 -375 -75 70 153 124 -118 181 275 155 -36 -207 160 29 290 66 -21 15 101 -146
5848a46K20j7O5j59o1R7J23q6j5k6K73l23K00k42l9R6J7j18L88j8k47N6k08M04
$$ -146 74 57 122 -37 -98 -1 122 36 21 -5 268 -55 145 -97 -136 -40 -23 -141 247 229 -18 38 -170 234
5872B34k47j24O2K41k23J37K3k39J03K28l12J40P9j45J73j10n0K41R1l50O2J78
$$ 234 -13 -137 -75 166 -57 80 103 -136 -33 195 -117 23 102 -43 130 20 -30 211 302 -48 14 192
5894A92k38K27m5j54j4j64P7J38J37j93P4j0p4Q1P2j43J28J87l23k32L02J34J40
$$ 192 -46 181 136 -18 -32 -196 -119 19 156 -37 37 27 -47 34 106 -37 91 278 -45 -277 25 159 299
5917B99k23R1M2j55q8m1J07r7k4R4K0k56J62J93p4j25L32j31O9J5m80K05n2J40
$$ 299 76 167 209 54 -34 -75 32 -65 -89 5 25 -231 -69 124 50 -75 257 126 195 210 -270 -65 -117 23
5941B3KJ59l9j77Q3j71K69l1j06j07P4j09K24mJm2J1O8l19K55J32O2k46J76l30
$$ 23 25 184 145 -32 51 -120 149 118 12 -95 -21 -130 94 90 91 49 60 128 -191 64 196 258 12 188 -142
5966a42J34K7jJ84k30o9J09J0k9nP5j73K75l00K76p4j28K23l99M57k41J01n7k32
$$ -142 -8 19 18 202 -28 -97 12 22 -7 -12 63 -110 165 -135 141 67 -61 162 -237 220 -21 80 23 -209
5990b09J08J37Q6O8l7M2k00P2J31l47Q7J93j68R1J63m9j03j47j46K98k67M41j82
$$ -209 -101 36 122 190 153 195 -5 67 198 -149 -62 131 -37 54 217 168 65 -82 -228 70 -197 244 62
6013F2j77P1r1J65l3J87k35j26K51J87j21k12r3L60Lk37l8j6J42j38J55l5k36
$$ 62 -115 -44 -135 30 -3 184 -51 -177 74 261 140 -72 -165 195 198 -39 -77 -93 49 -89 66 31 -205
6036b05N5J27J92m5k45K51k17K00m1q5L29k01j64K45j88o5K98k04r5J71l03J24
$$ -205 -150 -23 169 124 -121 130 -87 113 72 -13 316 115 -49 196 8 -57 241 37 -58 113 -190 -66
6058f6J92j35p9M5J15j1k55K15k6M2N7kn5k8J03N2p5r1O0m8J40k34J04o9R1j44
$$ -66 126 -9 -88 -43 72 61 -194 21 -5 37 94 92 37 9 112 164 89 -2 58 10 150 -84 20 -49 42 -102
6084a02K10j25M0R1L3j84P0Q8N5Mk89O1QP5q4j37J36j50K49Q2J39k32K7j26J23
$$ -102 108 -17 23 114 147 -37 33 121 176 180 -109 -48 -40 35 -49 -186 -50 -200 49 131 270 38 65 -61 62
6109F2p2R4j21J29m21K90J20j9k96K73J66j37m6nK0j33K07j74J85J04m55K45J57
$$ 62 -10 84 -37 92 -329 -39 81 62 -234 39 205 68 22 17 37 -96 111 -63 122 226 -229 16 173
6132A73l25K31K7m5j42J41J04l15Q3N3J5J56j72j04Q5K42j1k33k55K22J09L73
$$ 173 -152 79 106 61 -81 60 164 -151 -68 -15 0 156 -16 -120 -35 207 196 -37 -292 -70 39 412
6154D12k06k57l5j00K80j68K8q1K02O1O8k30Jk5q2J86J7l1j5k43K14j37K43O7
$$ 412 206 -51 -86 -186 94 -74 -46 -127 75 136 204 -26 -25 -50 -132 54 71 40 25 -218 -4 -141 102 169
6178A69l49K19n0p6Q4J75L0J2j76Q2p0J69k79l7J80j37K72l76L01j88q5K6J29
$$ 169 -180 39 -11 -87 -3 172 202 214 38 120 50 219 -60 -97 83 -54 218 -158 143 -45 -130 -104 25
6201B5Mj02K26r7j02J27k72K53k63K20L37k79o2N8p8J11m0M7r0j90L5K07j02%
$$ 25 29 -73 153 56 -46 81 -191 62 -201 19 356 77 15 73 -5 106 66 113 23 -167 -132 75 -27 -27
6225b7p2K87j99j48J30K5J62j13O3p0M6p8k9J10j7LP4o6j8j84p8K6J9Q8Q7l11
$$ -27 -99 188 -11 -159 -29 -4 158 45 108 38 84 6 -23 87 70 73 147 81 63 -121 -199 -173 -154 -66 21 -290
6251b90M82k80J20o8l2l3j40L60k84j4O2Q1L7O4N4o0j07N3J54j16J48k07O6J42
$$ -290 192 -88 32 -36 -68 -101 -241 119 -165 -179 -117 -36 1 65 119 59 -48 5 159 43 191 -16 50 192
$$ [...]
8191a1
##END NTUPLES=NMR FID
##END=
