##TITLE=1H_Ser Am-157-3
 CDCl3
 8 sc, 
 1.11.2023
##JCAMPDX= 6.0         $$ Bruker NMR JCAMP-DX V2.0
##DATA TYPE= NMR FID
##DATA CLASS= NTUPLES
##ORIGIN= UXNMR, Bruker Analytische Messtechnik GmbH
##OWNER= root
$$ XWIN-NMR		Version 3.5
$$ Wed Nov  1 15:50:16 2023 Russian Standard Time (UT+4h)  she@DPX200
##.OBSERVE FREQUENCY= 200.13135
##.OBSERVE NUCLEUS= ^1H
##.DELAY= (6, 6)
##.ACQUISITION MODE= SIMULTANEOUS
##.ACQUISITION SCHEME= undefined
##.AVERAGES= 8
##.DIGITISER RES= 18
##SPECTROMETER/DATA SYSTEM= spect
##.PULSE SEQUENCE= zg30
##.SOLVENT NAME= DMSO
##.SHIFT REFERENCE= (INTERNAL, DMSO, 0, 15.7039)
##AUDIT TRAIL= $$ (NUMBER, WHEN, WHO, WHERE, WHAT)
$$ ##TITLE= Audit trail, XWIN-NMR		Version 3.5
$$ ##JCAMPDX= 5.01
$$ ##ORIGIN= Bruker BioSpin GmbH
$$ ##OWNER= she
$$ F:/spectra/data/she/nmr/H-F/1/audita.txt
$$ ##AUDIT TRAIL=  $$ (NUMBER, WHEN, WHO, WHERE, WHAT)
(   1,<2023-11-01 15:48:46.75 +0400>,<she>,<DPX200>,
      <created by zg, POWCHK disabled, PULCHK disabled
       configuration hash MD5:
       00 E9 B6 7A A2 85 ED C7 34 08 36 98 17 FE 4E 26
       data hash MD5: 16K
       A7 80 04 F0 07 3B FD AC A7 29 43 BB B0 B4 2A 8A>)
$$ ##END=
$$ 
$$ hash MD5
$$ A7 FB 05 41 D9 01 6F EE E9 5A D8 E8 4D AE 04 57
##$RELAX= 
##$RELAX= 
##$RELAX= 
##$RELAX= 
##$RELAX= 
##$RELAX= 
$$ Bruker specific parameters
$$ --------------------------
##$DU= <F:/spectra>
##$EXPNO= 1
##$NAME= <H-F>
##$PROCNO= 1
##$TYPE= <nmr>
##$USER= <she>
##$AMP= (0..31)
100 100 100 100 100 100 100 100 100 100 100 100 100 100 100 100 100 100 
100 100 100 100 100 100 100 100 100 100 100 100 100 100 
##$AQSEQ= 0
##$AQ_mod= 1
##$AUNM= <au_zg>
##$AUTOPOS= <>
##$BF1= 200.13
##$BF2= 200.13
##$BF3= 200.13
##$BF4= 200.13
##$BF5= 200.13
##$BF6= 200.13
##$BF7= 200.13
##$BF8= 200.13
##$BYTORDA= 1
##$CFDGTYP= 0
##$CFRGTYP= 5
##$CHEMSTR= <none>
##$CNST= (0..31)
1 1 145 1 1 1 1 1 1 1 1 1 1 1 1 1 1 1 1 1 1 1 1 1 1 1 1 1 1 1 1 1 
##$CPDPRG= <>
##$CPDPRG1= <>
##$CPDPRG2= <>
##$CPDPRG3= <>
##$CPDPRG4= <mlev>
##$CPDPRG5= <mlev>
##$CPDPRG6= <mlev>
##$CPDPRG7= <mlev>
##$CPDPRG8= <mlev>
##$CPDPRGB= <>
##$CPDPRGT= <>
##$D= (0..31)
0 1.2 0 0 0 0 0 0 0 0.06 0 0.03 0 0 0 0 0.0002 0 0 0 0 0 0 0 0 0 0 0 0 
0 0 0 
##$DATE= 1698839326
##$DBL= (0..7)
120 120 120 120 120 120 120 120 
##$DBP= (0..7)
150 150 150 150 150 150 150 150 
##$DBP07= 0
##$DBPNAM0= <>
##$DBPNAM1= <>
##$DBPNAM2= <>
##$DBPNAM3= <>
##$DBPNAM4= <>
##$DBPNAM5= <>
##$DBPNAM6= <>
##$DBPNAM7= <>
##$DBPOAL= (0..7)
0.5 0.5 0.5 0.5 0.5 0.5 0.5 0.5 
##$DBPOFFS= (0..7)
0 0 0 0 0 0 0 0 
##$DE= 6
##$DECBNUC= <off>
##$DECIM= 32
##$DECNUC= <off>
##$DECSTAT= 4
##$DIGMOD= 1
##$DIGTYP= 9
##$DL= (0..7)
0 120 120 120 120 120 120 120 
##$DP= (0..7)
150 150 150 150 150 150 150 150 
##$DP07= 0
##$DPNAME0= <>
##$DPNAME1= <>
##$DPNAME2= <>
##$DPNAME3= <>
##$DPNAME4= <>
##$DPNAME5= <>
##$DPNAME6= <>
##$DPNAME7= <>
##$DPOAL= (0..7)
0.5 0.5 0.5 0.5 0.5 0.5 0.5 0.5 
##$DPOFFS= (0..7)
0 0 0 0 0 0 0 0 
##$DQDMODE= 0
##$DR= 18
##$DS= 0
##$DSLIST= <SSSSSSSSSSSSSSS>
$$ [...]
##$SUBNAM2= <"">
##$SUBNAM3= <"">
##$SUBNAM4= <"">
##$SUBNAM5= <"">
##$SUBNAM6= <"">
##$SUBNAM7= <"">
##$SUBNAM8= <"">
##$SUBNAM9= <"">
##$SW= 18.05172834244
##$SWIBOX= (0..15)
0 0 2 0 0 0 0 0 0 0 0 0 0 0 0 0 
##$SW_h= 3612.71676300578
##$TD= 16384
##$TD0= 1
##$TE= 0
##$TE2= 300
##$TE3= 300
##$TEG= 300
##$TL= (0..7)
0 120 120 120 120 120 120 120 
##$TP= (0..7)
150 150 150 150 150 150 150 150 
##$TP07= 0
##$TPNAME0= <>
##$TPNAME1= <>
##$TPNAME2= <>
##$TPNAME3= <>
##$TPNAME4= <>
##$TPNAME5= <>
##$TPNAME6= <>
##$TPNAME7= <>
##$TPOAL= (0..7)
0.5 0.5 0.5 0.5 0.5 0.5 0.5 0.5 
##$TPOFFS= (0..7)
0 0 0 0 0 0 0 0 
##$TUNHIN= 0
##$TUNHOUT= 0
##$TUNXOUT= 0
##$USERA1= <user>
##$USERA2= <user>
##$USERA3= <user>
##$USERA4= <user>
##$USERA5= <user>
##$V9= 5
##$VALIST= <valist>
##$VCLIST= <CCCCCCCCCCCCCCC>
##$VD= 0
##$VDLIST= <DDDDDDDDDDDDDDD>
##$VPLIST= <PPPPPPPPPPPPPPP>
##$VTLIST= <TTTTTTTTTTTTTTT>
##$WBST= 1024
##$WBSW= 4
##$XGAIN= (0..3)
0 0 0 0 
##$XL= 0
##$YL= 0
##$YMAX_a= 385801
##$YMIN_a= -574757
##$ZGOPTNS= <>
##$ZL1= 120
##$ZL2= 120
##$ZL3= 120
##$ZL4= 120
##$ABSF1= 10
##$ABSF2= 0
##$ABSG= 5
##$ABSL= 3
##$ALPHA= 0
##$AQORDER= 0
##$ASSFAC= 0
##$ASSFACI= 0
##$ASSFACX= 0
##$ASSWID= 0
##$AUNMP= <proc_1d>
##$AZFE= 0.1
##$AZFW= 0.1
##$BCFW= 1
##$BC_mod= 2
##$BYTORDP= 1
##$COROFFS= 0
##$CY= 11.3945322036743
##$DATMOD= 1
##$DC= 2
##$DFILT= <>
##$DTYPP= 0
##$F1P= 15.7292609196834
##$F2P= 12.9074282941183
##$FCOR= 0.5
##$FTSIZE= 0
##$FT_mod= 4
##$GAMMA= 1
##$GB= 0.15
##$INTBC= 1
##$INTSCL= 1
##$ISEN= 128
##$LB= 0.24
##$LEV0= 0
##$LPBIN= 0
##$MAXI= 10000
##$MC2= 0
##$MEAN= 0
##$ME_mod= 0
##$MI= 1.114404
##$NCOEF= 0
##$NC_proc= 0
##$NLEV= 6
##$NOISF1= 3.799351
##$NOISF2= 2.8
##$NSP= 1
##$NTH_PI= 0
##$NZP= 0
##$OFFSET= 15.70392
##$PC= 1
##$PHC0= -23878.03
##$PHC1= 17.0527
##$PH_mod= 1
##$PKNL= yes
##$PPARMOD= 0
##$PSCAL= 0
##$PSIGN= 0
##$REVERSE= no
##$SF= 200.130013532006
##$SI= 16384
##$SIGF1= 3
##$SIGF2= 2
##$SINO= 400
##$SIOLD= 16384
##$SREGLST= <1H.CDCl3>
##$SSB= 0
##$STSI= 0
##$STSR= 0
##$SW_p= 3612.71676300578
##$SYMM= 0
##$S_DEV= 0
##$TDeff= 0
##$TDoff= 0
##$TI= <>
##$TILT= no
##$TM1= 0
##$TM2= 0
##$TOPLEV= 0
##$USERP1= <user>
##$USERP2= <user>
##$USERP3= <user>
##$USERP4= <user>
##$USERP5= <user>
##$WDW= 1
##$XDIM= 8192
##$YMAX_p= 0
##$YMIN_p= 0
$$ End of Bruker specific parameters
$$ ---------------------------------
##NTUPLES= NMR FID
##VAR_NAME=  TIME,          FID/REAL,        FID/IMAG
##SYMBOL=    X,             R,               I
##VAR_TYPE=  INDEPENDENT,   DEPENDENT,       DEPENDENT
##VAR_FORM=  AFFN,          ASDF,            ASDF
##VAR_DIM=   8192,          8192,            8192
##UNITS=     SECONDS,       ARBITRARY UNITS, ARBITRARY UNITS
##FACTOR=    0.0002768,     1,               1
##FIRST=     0,             0,               0
##LAST=      2.2672688,     0,               0
##MIN=       0,             -574757,         0
##MAX=       2.2672688,     385801,          0
$$ Real data points
##PAGE= N=1
##DATA TABLE= (X++(R..R)), XYDATA
$$ [...]
1879g53j58k89q4r1L58M84J79L28J37M89R6l42o2j27M3J47l63L72Q5j42k02j6
1901H9n9j34k8J51p8J29j12L61j59m5L38m30l63l6K81k80J79R8J36K04L64j62
1923D44l41O0k6k14J95r9j06L81L4L51n27p5j92m30K21J68j98L8N29k47K49M1
1945B56l16j70K47k26n9L36M20k75J46M6l86k98J53J43j20m8J56M9j49K29L76
1966E10L9n59K67l82j96p4L9m3J14j00K31P6k75M50j00K86j49j68L28L90k42j44
1988B98L1m08n39j89L24j22J83N58J36l38N97k74Qj0Rk73n16K67q4l18O99m35
2010c96k51K48K94l67M00O38r8J60O49l62o17J95l56l99L3j43n01K79R09j53J31
2031B93N53j10k46l0J1n35j58N80l91n37N32j7q59O35J24l68L15M82o3J58O25
$$ y = [-753, -911, -1200, -1284, -1375, -1017, -533, -354, -26, 111, 600, 696, 354, 292, 165, 208, 355, -8, 364, 449, 307, 105, 89, 30, -104, -132, 19, -59, 70, -42, 319, 160, 115, 453, 23, -340, -376, -95, -375, -196, -98, 38, 242, 606, 444, 103, 163, 137, -77, 118, 19, -87, 294, 328, 679, 152, 77, -115, -545, -324, -156, -354, -316, 213, -34, 215, 256, -60, -230, 17, -209, -268, 68, 488, 213, 359, 405, 19, -279, -126, 17, -103, -151, 5, 54, -95, 134, 510, 549, -10, 257, -125, -321, -395, -356, -399, -285, -385, -154, -78, -353, 97, -3, 283, 134, -34, 294, 684, 442, 298, 329, -79, -618, -807, -483, -605, -422, 136, 272, -66, 531, 257, 265, 255, 264, -9, -525, -258, -342, -660, 39, -396, -647, -399, -105, -472, -72, 566, 468, 628, 1277, 915, 298, 493, 137, -262, -229, -372, -873, -594, 315, 162, 293, 846, 736, 490, 460, 471, -64, -222, 358, -33, -570, -38, -55, -914, -279, -155, -523, -208, 274, 211, 369, 994]
2052I94n24o0r8k80n59k45n8m13n2N10K25k92P75m9O1J39K64k54j33M2Pj44q9
2075b33J67Q0k13J18L52R9K74Q86L09M9L91k85o58j97J2o63l95J07m81l62J70
2096d73L03J34j44K29r32K59Q6n47J19J88m86m02j83L16n95J74K73p9K53J008
2116d99K42J20R44M86m80p7lm79j88R3J41l2l8L14l6O86L95m09P23n7l72q1L71
2139A764m61n3k76n42m77j47l58j45L41j8J34m2n7L33k28On99m24n00m01J27j12
2161b135K6Q1M44J29L05J04J47K19P75M46j37M72lO1j17J65j96j25K46j14K76
2182A069R54q2J23K6j98l30m26m5n70o21j42q7m53K92o8n06N18j89j18j76L34
2203f95M3J41n8L50l81k95nl00q3L97j33N35J19K19K76J82M92j93j10j46ok69
$$ y = [994, 470, 410, 312, 32, -527, -772, -830, -1243, -1295, -785, -560, -852, -77, -126, -65, 74, 338, 84, -49, -7, 0, -144, -233, -66, 14, -199, -81, 271, 370, 644, 1530, 1839, 1888, 2279, 1994, 1336, 1139, 1151, 488, 93, 200, -281, -643, -473, -170, -36, -180, 49, -883, -624, -538, -1085, -966, -778, -1264, -1666, -1849, -1533, -2128, -1954, -1681, -1760, -1507, -499, -257, -137, 807, 1293, 813, 736, 733, 254, 66, 159, 300, 268, 230, 544, 508, 1194, 1589, 1180, 1903, 1846, 1474, 1393, 1764, 1303, 1250, 974, 432, -45, -192, -550, -695, -354, -372, -238, -280, -337, -4, -232, -226, -825, -1249, -1749, -2150, -2023, -2135, -2109, -2028, -1584, -1455, -1150, -1046, -899, -680, 95, 541, 404, 876, 873, 934, 817, 982, 786, 661, 907, 793, 1069, 2023, 1941, 2064, 2090, 1892, 1562, 1136, 1091, 521, -100, -242, -329, -782, -490, -558, -1064, -546, -735, -853, -1029, -695, -652, -511, -569, -219, -600, -895, -900, -1200, -1283, -886, -1019, -484, -365, -146, 130, 312, 804, 611, 501, 355, 349, 80]
2225H0J15j8r2K11K0J9j40r2K37q4M26r4K43n8J8m8m28kl75k39p3n5J46k62K34
2250c11M74l13J71Jk42j86JJ84j72j0P5J90j25Q3o0p5K72j7J50pK96R9M18k93
2274F03k6j07k68q3l75R8L2J37K43l88L79M9p0J6l06j54q5m2Kj10L69K4q1J22
2298b1k52P5J17j20M14N3n5J28J4j42j92K9J15k11m09N14j28L24n7j21N4P5l94
2321a90K29m00Q7L2J74K08m3j3p7j54p4L7k0L5j49J15J46L73l28L26m5k09k63
2344b03J03N2j85J31J29J24P9j47O6k68l71J93L77k36n4K50J97n4j32Q5p5n60
2366d99N60k16r4M51J59k19K74j48J02j75J17l18j3k54K39J93K56l4j20k18l59
2387c16M62M9m67M8K80k77L78m6l0m9k80J44M8j75J72M8J84JK46j54J35k17k11
$$ y = [80, 195, 177, 85, 296, 316, 335, 195, 103, 340, 256, 682, 588, 831, 773, 791, 743, 315, 313, -62, -301, -374, -429, -283, -545, -311, 163, -150, 21, 22, -220, -406, -405, -221, -393, -403, -328, -138, -263, -180, -240, -315, -43, -60, 90, 83, 379, 478, 896, 603, 577, 470, 202, 119, -256, -158, -126, 11, 254, -134, 245, 294, 224, 240, -66, -220, -305, -347, -345, -455, -86, -62, -143, -21, -273, -198, -81, -201, 213, 266, 211, 339, 353, 211, 19, 48, 163, -48, -457, 57, -71, 253, 196, 75, 129, 204, -190, 39, -361, -274, -242, -68, 140, 97, 84, 7, -147, -221, -184, -204, -169, -318, -203, -57, 316, -12, 314, 269, 60, -203, -100, -48, -233, -102, 27, 151, 230, 83, 149, -119, -490, -297, 80, -156, -210, 40, 237, 183, 51, 136, 61, -499, 61, -155, -249, 202, 361, 142, 416, 268, 370, 195, 312, -6, -19, -273, -34, 159, 415, 381, 261, 43, -316, 146, 195, -272, -224, 56, -221, 157, 111, 81, 32, -248, -104, -56, -231, -59, -11, 173, 174, 420, 266, 401, 184, -27]
2410b7N3o0J08O4L1J0L9j17j84R4j30O2M0k65R3K63K74k22j91J81o44K03Q0m37
2434f82N55j26J43M0K84k6j32l36K50k52K79j95L90N0l07K42l47K02Rr3J5J73
2456A36j02K46J72l82J79j05J35Rj88k03L57l7q5O1mO7P7L8n70L33J2l42r0J42
2480a44r1j2J30N9l50k62M05k23n7K99Q5N2K95P0j40o5J96m54j56K92R2l02N44
2503B63kL7O3M10o20R3Q8j79k35M49J47j93p4k91J28m17L78j63J98K45o7k32J21
2526A47j5L39m88L4k37K4j87j32M07J26K2J1Rl23L24K25l21J65M8k12j50L15m8
2549H3J1l48J73l01k53L88L09j60L12Jj06J05j59l30J63J98m89K38m1r3K02K65
2571A68k36L76j30J47l60J90M47o43L66J26p33pM05q5l81K17J55l74L36L74l59
$$ y = [-27, 26, -34, 74, 138, 169, 179, 218, 101, -83, 11, -119, -57, -17, -282, -189, 74, 348, 126, -65, 116, -528, -325, -245, -682, -127, -253, -110, -70, 214, 188, 56, -280, -30, -282, -3, -198, 192, 242, -65, 177, -170, 32, 41, -52, -37, 136, 34, 280, 452, 70, 249, 144, 279, 288, 100, -103, 254, 217, 132, 193, 189, 256, 333, 371, -199, 134, 146, -196, -286, -144, -235, -247, -117, -58, -408, -670, -265, -488, -545, -246, -161, -109, 186, 256, 116, 51, 247, -207, -363, -71, 21, -281, 263, 261, 298, 361, 771, 151, 244, 332, 153, -82, 367, 514, 321, 247, -44, 84, -333, 45, -118, 80, 325, 258, 26, 147, 132, 471, -17, 17, -220, -196, -383, -515, -108, 18, 40, 51, 60, -263, 61, 286, -35, 130, 178, -34, -184, 131, 83, 94, -254, -81, -382, -635, -247, 62, -98, 214, 215, 109, 214, 55, -275, -112, 86, -403, -165, -206, -299, -97, 168, -68, 308, 178, 325, -35, 155, 602, -41, 325, 451, -282, -289, 116, 31, -350, -133, 22, -352, -16, 358, -1]
2592aL57j65l9j01j23j0m32P5L19j30m6K18Q0k02j65K97M6o0L7R5k16K01k40j05
2616c10o7J90l9j47K26K9PJ59L09J76j4j5p5o3m2j50j31o1K42O5L0j98J23j98
2640D6J6K4J4J18M6L4l71J36l38j48J20k76J19J12j26J67j20L63j35O2n2Q9j90
2663b90K62L20n73J20M54k8m30N50l11k99K20Q5P3l2j09J47PJ91j00p4j14o4Q4
2686H9m02L66k67J11J29K9K95l15K2l4k22J52n4k98M17K71l08J54R5k42kr3J20
2709A3j40K04k03J17N0l2oK07k42M8J17k92J90qK45j13j46j74L6J66j85J64o2
2732d6K15l16L04o3J79j44K18n19j31L28k96j03J77p2J89K55Qj22J53j6N8j66
2754I0l6K72l70K49N4l88k69M85l41K58JJ30k6J63j59j64Q5q9k57K53m8q5n8M3
$$ y = [-1, 356, 191, 152, 51, -72, -82, -514, -439, -120, -250, -296, -78, 2, -200, -365, -68, -22, -82, -45, 50, -166, 35, -205, -310, -377, -187, -226, -373, -147, -118, -111, 48, 357, 533, 519, 504, 429, 366, 324, 174, 43, -18, 224, 289, 319, 121, 244, 46, 62, 86, 100, 218, 264, 298, -73, 63, -275, -423, -303, -579, -460, -348, -474, -307, -427, -64, -199, -137, -189, -100, -290, -28, 292, -281, -161, 293, 265, -165, 385, 74, -225, -5, 80, 153, 121, 12, 159, 166, 357, 257, 183, 69, 5, 89, -313, 53, -214, -103, 26, 55, 350, 35, 57, 23, -199, -47, -101, -399, 18, 289, -19, 135, 230, -12, -14, -107, 13, -127, 77, -126, -9, 41, 9, 3, 210, -32, 16, 133, -159, 31, 23, 268, 155, 9, -165, -129, 37, -148, 16, -46, 169, -147, 157, 94, 273, 129, 347, -172, -303, 25, -271, -374, -197, -269, -80, 175, 183, 61, 214, 198, 256, 90, 54, 326, -44, 205, 259, -129, -398, 87, -254, 4, 5, 135, 109, 272, 113, -51, 34, -55, -312, -59, -107, -192, -250, -207]
2778b07J71k14K02J9k14J52k3L7M8j03L81l17M79k53j48lK9j64K40K26l84J93
2800A47J6J51r3P9j97R5k51l3J26j44m0j8j6oj39j6J81Lk0K19l8O8J29J48n57
2825b06q2J48J65l22o8n1O9J75J17K19q1J87j52m5o9m4K14k5o3k90J31J85j26
2848a4k47Q8K65Q2K67l08J94L4p9k20oK43l55k1J24k36L66j86L28k16Lj47K42
2871B01k86j70K0J79j59k06J43l2j95J67n5k7l2Q6J83J12L46n40J56K07q0q2j51
2894b15m1P1Q9j85M48N8P4m55L26Q5L1j95J32K61k13J48r1j46L6o4j27m5l2K31
2918A81j18j6j23J28J68kj48j74j05q3o1P0mk03L74j17p8j48J18M3q4l4J02K40
2942g4m58N21l10J14L81n43M02m1J01J44j99J54J29Q7j45O8J3N9k06K4n1J46N6
$$ y = [-207, -36, -250, -48, -29, -243, -91, -114, -77, -29, -132, 249, -68, 411, 158, 10, 7, 36, -128, 112, 338, -46, 147, 163, 314, 221, 300, 103, 198, -53, -86, 40, -104, -144, -162, -178, -184, -323, -339, -158, -155, -175, 44, 6, 74, 203, 351, -206, -288, -140, 25, -297, -365, -416, -347, -172, -55, 164, 83, 270, 118, 73, 4, -40, 174, 149, 86, -204, -73, 112, -14, -261, -173, 92, 174, 441, 133, 327, 361, 282, 62, 56, 299, -56, -77, 47, -189, 177, -9, 319, 103, 106, -41, 201, -85, -255, -235, -56, -215, -421, -278, -310, -505, -338, -393, -420, -452, -366, -183, -71, 275, -265, -109, 98, 18, -64, -215, -256, -185, -96, -281, 167, 225, 299, -156, 170, 255, 286, 91, 223, 484, 271, 419, 328, 182, 218, 154, 27, -18, -50, 181, 63, 47, -76, 52, 220, 218, 70, -104, -209, -292, -353, -283, -287, -490, -116, -233, -311, -459, -341, -298, -382, -416, -314, -74, -532, -11, -321, -207, 174, -369, 33, -8, 93, 237, 38, 192, 321, 408, 263, 331, 344, 403, 197, 221, 170, 316, 372]
2965C72j65L8j19k7j63Q9m2L5k59M09n75J61P0r3r3m8L31j66J6j43K03j46J69
2988a46K8k98N00k80J17m6J81j24k47J98K36O5k41l4K18J48k89L04j22j79K72
3009B61k8K28l31N6R1l31K99N0k24L40k65n8nK28l36J8J35J2k1k8l08M60l62J4
3033a05K20k27j79n0j6L92Q0j31j74K11l08J7L47j00m0J49q0j26L22L2l37M41
3055C38l84K25j29l2k49M84j44K9n5j53L09k40M5j52J53j47K4r8O4J33j9k01L62
3078A63j60o6j05P2l7P8Q8m0k1J16O3K13l66k8O3j60Q9k48K82j71N2J84L8J76
3102B75j16k64J8K92o5k84J06J54j61N6R2o7k56L28j86J11J25J15k81J27OP9k9
3125A75J73m0m14K20M6l98L31j50j64l1L09r7k58M11k5j69J37m3l9J72m0k43l0
$$ y = [372, 207, 245, 126, 99, -64, 25, -17, 18, -241, 168, -407, -246, -176, -269, -362, -410, -79, -245, -229, -372, -169, -315, -146, -118, -416, 84, -196, -79, -125, 56, -68, -315, -117, 119, 184, -57, -91, 127, 275, -14, 290, 168, -11, 261, 233, 461, 130, 186, 277, -54, 245, 295, 71, 411, 146, 88, 83, 311, -25, -7, 128, 140, 119, 91, -217, 243, -119, -105, 115, -112, -291, -341, -357, 35, 115, -16, -190, 21, -287, -270, 77, -23, -63, 86, 6, -120, 202, 234, -103, 338, -46, 179, 50, 18, -231, 253, 109, 138, 83, -70, 239, -1, 44, -108, 45, -102, -78, -176, -112, 21, 2, -199, 163, 3, -63, -168, -96, -133, -55, 33, -7, -28, 88, 151, 364, -2, -30, 33, -127, -38, -286, -4, -175, -123, 61, 99, 275, 159, -105, -87, 205, 140, -144, -38, 116, -45, 11, 103, 36, -220, 108, -78, 33, 158, 273, -8, 119, 125, 204, 175, 348, 308, -106, 114, 160, -238, 93, -57, -221, -252, 57, -40, -298, 113, 88, -81, 56, 13, -26, 146, 106, -137, -167]
3148a67K02j07n5K04jj77l1M60l97J15j16J68k47M01Q3p6j99k20MJ27q8p8K9L8
3172a28J87j44K3Q5k39K56R9j56J22m7n9j62J58j60J99j09Q7j01J21kJ54k94j76
3195b86M57j47J4k12J55l24J71K41O1l02O7K38q2Q8j3P8j09j48nK8j78Q1mQ4j28
3220a75R2J50j89L14k31N4m3J66P7j34j84J31k10n6J51j16J38P6k31M34R0j43
3242A61J88n9j67o0j44J42j47K07j98M3L08l67K62l12K00l98M23r2K7M4k36P1
3264a04K14k5r6j82j83J91O6j92q4N18m8R7j13K79n60J91j0J17j02J32O8k02j4
3287d2RQ6J01k67K19J94l50M76l39J83k64k8K27l33M2j84L69j01k5l09M95n0L2
3310A41k87K85J53k14j71M8j9Jj0j13J96j05L9q9KJ85r9j25J33K05j96j38K16
$$ y = [-167, 35, -72, -127, 77, 76, -101, -132, 328, -69, 46, -70, 98, -149, 252, 335, 259, 60, -160, -156, -29, -117, -195, -166, -128, 59, -85, -62, 23, -216, 40, 139, -17, 105, 58, -1, -163, -5, -165, 34, -75, 12, -89, 32, 30, 184, -110, -286, 171, 24, 38, -174, -19, -343, -172, 69, 130, -172, -105, 133, 51, 139, 126, 204, 95, -53, -58, -30, -208, -127, -131, -47, -175, -83, 67, -122, 192, -39, 15, -28, 138, 215, 81, -103, 28, -182, -238, -87, -203, -65, 11, -220, 214, 304, 161, 349, 290, 123, 63, -81, 61, -86, 121, -77, -34, 274, -93, 169, -143, 57, -341, 82, -10, 17, 61, -175, -104, 110, 85, -11, -193, -376, -185, -119, -311, -395, 123, 75, 172, 59, 338, -222, -31, -41, 76, -26, 106, 174, -28, -42, -33, 53, 154, -113, 106, 300, -50, 426, 87, 270, 6, -22, 205, -128, -86, -270, 99, -2, -27, -336, 159, 109, 141, -146, 139, 292, 78, -93, -45, -64, -63, -73, -186, 10, -95, -56, -145, -143, 42, -57, -182, -49, 156, -40, -178, 38]
3333C8j33p7M0L09o5j65R9p4j90L95j57J41o8J99l2j48ml83L23J44l17L21k18
3356b2j67K66n6K59j98K45l49K73K3q7m5K4m46L46r3J24j58k05O2M7J65j5P0l10
3380b47K23K28k4j26j72MK4r1k35K98k80R6J04K10K39m73M33m8L5JJ8l2n81M72
3404G6J04j77p0J43Q3K60j33r5j18J58J59l72N3J2O5k10k04L27r6J17m7k2rj35
3428a31K18j55K91n17P1j8o9J29nN6j62J37pk09J37J90R0p7Q7P0P0j84K69l12
3452c1o6M7m0J04r4N7J17j38K40k95K53n9nj9J43%k32K69l17J40N3k8k37K13j95
3477a20K31k53J73k0l26J09J17J13k76N5O1k33L75l0j78j9P9K08j83L34l31k44
3499c58L43P7j22J58PK07m65M51k20n5l4Q4l67L97q2NR9M2q4k26pL10J29m14j81
$$ y = [38, -95, -172, -132, 177, 112, -53, 46, -28, -218, 177, 20, 161, 93, 292, 260, 112, 108, -275, 48, 192, -125, 196, -22, -189, 77, 21, 280, 82, 327, -22, 251, 274, 187, 142, 166, -280, 66, -27, 97, -61, -266, -204, -157, 8, -7, 63, -247, -24, 204, 180, 54, -118, -114, -90, -181, -416, -118, -398, -302, -198, 12, 251, -222, 211, 163, 198, 199, 217, 185, -396, 76, 180, 3, -67, 76, 159, 419, 286, 191, 73, 231, 390, 18, 71, 83, 148, -62, -266, 61, -35, 82, 35, 13, 4, -131, 87, -68, 223, -294, -223, -241, -310, -181, -186, -130, -292, -155, -162, -371, -234, -44, 46, -31, 56, 126, 196, 12, 281, -31, -97, -50, -90, 14, -80, -23, 94, -44, 196, -99, 154, 95, 90, 71, 214, 214, -18, 251, -66, 74, 127, 99, -138, 75, -120, 111, -142, 31, 11, -315, -206, -89, 24, -252, -197, -136, -369, 6, -24, -202, -221, -142, 66, -117, 217, -114, -358, -15, 62, -60, 98, 105, 312, -153, 298, 78, 23, -11, 73, -294, 103, 21, 26, 125, 167, 83, -143, -150, 160, 289, -125, -306]
3524c06J10J97q2J63J64O3k13k32J14P5k40K90j63N4l2k04J66K89k92M9L84l52
3546Bk5p2J11j15p3J98J6k24mK42j42Q8K03n3o9M2L8k82J99k13R9n2J62K0k3o9
3572Dj99N6K60j12Oj9K45l66L10k25j65K03J37j71K21q0j25K5k31J95R2k31O2
3595a08j34J47J6J0J76j98K47k04l3K68j33K9J40j59q2J61J04j1j94K14l61L8
3617f7J84k48L6J18j8o6O1k4j3L6n0j30Q1K57J88m62K34r1k43J63M09l80Q9j98
3641a34P1l4K95j93j72J20k8K53k61K1J53j7M3k68K36j79j27J37j94K21J29k15
3663a43l9J21L3p4J18k26J50J84r5j39P9J13o7l38K33M7O2L44k96p3k4L68l74
3686c6qJ21l9j14J71j0j82J37k10J71j36M38mm53K99k87L62k22P0q7kj7m2J04
$$ y = [-306, -196, 1, -81, 82, 246, 309, 96, -136, -22, 53, -187, 103, -60, -6, -38, -242, -76, 213, -79, -30, 354, 2, -23, -95, 16, -99, -172, 26, 42, -182, -186, 56, -86, 2, 205, 152, 83, 125, 163, -119, 80, -133, -34, -86, 76, 96, 73, 4, -195, -139, 121, 9, 15, -4, 241, -125, 185, -40, -205, -2, 135, -36, 185, 105, -20, 5, -226, -31, 61, -170, -108, -242, -95, -79, -69, 107, -91, 156, -48, -81, 187, 54, 83, 223, 64, -18, 143, 247, 236, 42, 256, -105, -67, 117, -131, -95, 23, 5, -61, 0, -24, -37, -1, -51, -181, -100, 157, 345, -117, 117, 26, -217, -54, 355, -25, 64, -134, -63, -97, 198, 5, -167, -47, -75, 178, -83, -62, 91, 74, 117, -151, 85, -94, -221, -84, -278, -57, 72, -143, -182, -61, -28, -102, 16, -210, -60, 124, 29, -110, -31, 82, 15, -323, -90, -43, 19, 363, 67, -6, -30, 338, -36, -44, 77, 38, -76, 95, 85, -97, 40, -170, 1, -135, 303, 299, -154, 145, -142, 220, -2, 68, -19, -21, -38, -80, 24]
3710B4Q3j46j75K41k70L02j23n7M7rJ33l9J17r4r6J72j47K69l27K46N9j03oJ96
3734B97n01L33n9kL00j98K45j75N3o4o7j59j25J30L24l33K95j17o4j50o7q2MK88
3758A06j00k11K04j57lr4J55J22J70L1j04k63R1L8j03K36l19J68j3j7k2M1pL72
3782C21m6j15j67K70l04J69k12L01K5k08j14M61l02j22K17k27j13Q3J57J26k69
3803f9M7K44k11m6j41K50R5k09n9M8l0o2L87l63J36N9j61q2L5J75r6N8QJ22j15
3828B0m6L1K1M3m6o3O1M27n37J12J04J86m14K27k39J62k48K92j84k10M93j90J
3851Cj18K7J55L3r6p2J06m9j1R8j37K57j48L7Mj36K19k00J87J44m35K0J69o3j38
3876a44J98J2MK31m25K65k32P0pK27m13K36j17J98j91j16J42j27J81N9n4Q8j3
$$ y = [24, 107, -39, -214, 27, -243, 59, -64, -121, -74, -83, 50, 11, 128, 34, -62, 110, -37, 232, -95, 151, 210, 107, 101, 297, -204, 129, 70, 68, 368, 170, 415, 240, 293, 229, 162, 3, -122, 8, 332, -1, 294, 177, 113, -37, -104, -186, -182, 106, 6, -205, -1, -158, -161, -255, -100, 22, 192, 223, 119, -144, -53, -15, -118, 118, -201, -33, -46, -63, -85, -44, -51, 321, 275, 160, -7, 263, -41, 128, -84, 217, 242, 34, -80, 381, 79, -43, 174, -53, -166, -83, 74, 200, -69, -22, 222, 11, -35, -176, 74, 169, -40, -99, -51, -81, -143, 244, -119, 17, 76, -85, -167, -132, 43, -53, 5, 13, 135, 20, -26, 5, 26, 69, 23, -40, 21, 448, -89, 23, 127, 313, -101, 126, -113, 49, -199, 93, -91, -301, 192, 2, 3, -115, -88, 67, 100, 4, -68, 38, -11, -22, 76, -61, 196, 48, 85, 89, -47, 172, -28, 159, 303, -132, -112, 57, -6, -144, 54, 66, 70, 301, -124, 141, -91, -21, -28, 199, -214, 22, -95, 103, -88, -204, -62, -189, -8, 51, -3, 85, 72]
3899G2P6j56PJ22Q9K6r6R9l90J64J2J00j96L39k98J35j22K22l92N1M6j4J61n0
3923GJM2P7j31p5P1J94j77nJ38m47K58J29J13l81K2L33j79km7P6oj05K74l24L40
3949A96l86j0L58j32j9MK24j68j80O3%l48L95J40l50K52k8Nr9K04J42k98j69J01
3973a03J58j36J30K00j87M5k27L2l30K73j02M07j81JM1j79J86Q0L2k01l1j60K88
3996C6N6k34L05K6k80J12j93M72l49J11P2j90K21Q1k03j45qP6J00Q5j97Q1P2k96
4020a89L74j76J70l27K23J17j18j40K7O3Q2k10L20J32n52M90m29K34j69J54l87
4041c11J30L05j70k32M65k41K5Q2J66m12K24J1m1p7O2j0k43K22r1K27k53m1J65
4064c8o8O8j47j4K36j50K5L74O0k74M6Lj17K5l77N26k43N9J1J13j54L1J91k63
$$ y = [72, 148, -8, -1, 121, 210, 236, 140, 239, -151, 13, 25, 125, -71, 268, -30, 105, -17, 205, -187, -136, -90, -104, 57, 7, 8, 50, 127, -4, -79, -8, 186, 9, 4, 142, -305, -47, 82, 195, -186, -164, 169, -10, -12, -59, 17, 11, -94, 180, -144, 196, -190, -200, 158, 26, 7, 11, 235, 67, -113, -50, -50, -398, -3, 137, -213, 39, 11, 16, -83, 121, 263, -35, -204, -103, 55, -81, 49, 249, 62, 107, -120, -88, -418, -145, -247, 160, -21, -20, 21, -158, 28, 108, 140, -61, -92, -252, 36, 92, -142, 163, 189, -91, 21, -172, 300, -49, 62, 134, -56, 165, 246, 43, -102, -110, -34, 66, 151, -46, 35, 107, -189, 185, 9, 179, -148, 75, 192, 74, -66, -39, 24, 106, -104, 216, 348, -204, 286, -143, 91, -78, 76, -311, -181, 124, -46, -278, 187, -54, -29, 53, 219, -193, 31, 42, 1, -76, -14, -24, -267, -45, -136, 91, -162, -203, -38, -106, -38, -185, -199, 37, -113, -88, 286, 346, 72, 118, 121, 4, 29, -348, 178, -65, -6, 5, 118, -36, -5, 186, -77]
4088g7r7J94J42j27o0L68l15p1j48K68J85k57lj44K14r7J95j36k87L74j93J03
4110C1j22J88R2q4j21J06j34R5J47l24L40r1R2k24N9M1N1o5j04pJ25J14p8p1J59
4135B15J28k74k41M35k01k00J96M5j61j27K36L1J06m95L01R7q4L4K88k97J18l43
4157a93J49K90k79j34m2Q2J24L14o5m50K13n9J4l2j7L51k90J27j08q9pL25m9k11
4181c6K25j33k8P5K0k80L61O6k72K99m50Q9L16l19K66k33L42j69j23j49K44j95
4203h4K5Kj03j52N18l77K14o8K22k76K35l60J3J48P2k20J22N5j09K8P6j42Q1K24
4227A44k68K5K60j2k81K30Q7mk59J96l37l8J56J74K9j97R8m6o7J50Q8k6k14j64
4251b76K32J22J10l00L60l09N3J56j21k45R4N0O8R5j26j9P8j10K72j00q8j50K59
$$ y = [-77, -174, 20, 162, 35, -25, 343, 28, -43, -191, 77, 262, 5, 2, -142, 72, -25, 170, 34, -253, 121, -72, 31, -91, 97, 189, 105, -16, 90, -44, 51, 198, -126, 214, 123, 215, -9, 50, 91, 142, 77, -27, -34, 91, 205, 127, 56, 215, 343, 69, -172, 263, 62, -138, 58, 103, -58, -185, 51, 82, 188, -307, -6, 91, 7, 41, 329, 32, 150, -193, -44, 246, -33, -167, -209, -127, -3, 311, 246, -204, 9, -50, -36, -68, -85, 266, -24, 103, -5, -94, -101, 224, 175, -36, 189, 56, 28, 103, 123, -157, 204, 270, -2, 297, -153, -64, 252, -67, 199, -34, 308, 139, 16, -133, 111, -84, -59, -57, -160, -312, 206, -171, 43, -25, 197, -79, 156, -204, -191, -43, 29, -191, -69, -14, -123, -95, -19, -161, -80, 144, -124, -99, 161, 149, -132, 98, 185, 181, -78, 118, -219, -257, -101, 73, 102, -95, 3, -43, -110, 40, 128, 102, -112, -276, -44, 78, 188, -112, 248, -61, -8, 148, 27, -218, -124, -74, -6, 89, -37, -56, 22, -88, 184, 84, -4, -154, 105]
4274A05k55J48k55J93J76j00j04p3K57p0K70j94rm4j14N4j18Q9J98j98R8L2L6
4297A22j45J5j0j84L41P1j89M0J7L5k24N46n07J81j0n3k7J00j49j30L51j99N5
4320D7K14n11N3K62k65J22K3J30L6l1k62L47j82j40M9r8K01n6N0K36k80J73K28
4343C46l49j35k51M28K26n57J58L09j37q7r6j44J81q0K20o5K46m07J19KJ72J02
4365B01j29KK7n6Jj44P2J57M3j11j73L1K50k61L4P8j26j16K56j85P7L18l23J68
4389I1q7p3J21j88K30J84l19j55j3K78k43K57k44k17N27m9k98Q0J94J13n2m1r
4412H7L4R3l3J40m08J00O5k0k34L67j50K6j10n9J00J24j21Lj94M05k12n2j3N7
4436eK59j93j21J15J85m21J73K0K88m55Q4j9K05j47O1j6LJ08k94M66k42Lk8j02
$$ y = [105, -150, -2, -257, -64, 112, 12, -92, -165, 92, 22, 292, 98, 89, 45, -69, -15, -133, -44, 154, -44, 54, 86, 122, -23, -8, -18, -202, 139, 210, 21, 61, 78, 113, -111, 435, -72, 109, 99, 46, 19, 119, -30, -160, 191, -8, 47, 261, -250, -197, 65, -200, -78, -55, 75, 111, 80, -182, 165, -17, -157, -108, -206, -5, -61, -11, 225, -55, 118, 346, -3, -138, -389, 39, 265, -292, -134, 175, 38, -49, -145, -289, -108, -188, 32, -33, 213, -194, -75, -73, 99, 201, 72, 74, 101, 45, 46, -98, -26, 131, 174, 63, -110, -79, 171, -90, -56, 22, -104, -220, 36, -149, -72, 246, -77, 91, 4, -69, 52, -136, 94, 278, -41, -196, -209, 69, -174, 83, -161, -378, 149, 100, -198, -118, 76, 189, 137, 96, 87, 121, 214, 181, 321, -87, 13, 78, 58, -176, 191, 41, 67, -43, -102, -2, 122, 1, 4, -190, 215, 3, -49, -62, -5, 254, 61, -60, 55, 240, -181, -8, 12, 300, -155, -71, -90, 115, -32, 29, 13, 16, 124, -170, 296, 54, 57, 29, -73]
4460g3N1l0N4n7L0K87Q6m43K3l8K37l22J93M3m1M6p8L55l17P6j7J14k18M6K59
4485B66k94p4K20m1p6m9J20j54K35k42J8P9O3j25p1M86l75R6j63J2J57M4j64N2
4509B0p3K63j57j68J54j06O8l2J20k45K00n3O5N5k82J23p4K25j08K7p0K36o1j74
4533d7K6n1L72j63k73J14J22p1k04K88nr1j05R2L17n82J31oj18J23M80k06j06
4556C7l07K79j41oJ04l7R8j64K08R1j21J06p4L6L4k4j57J3K40j25j08J01J55k72
4580c4J10j67J03p8J78j01k11L87l02K02m96L28KL1K84O2j02j11n4k45K42j75
4602a47J67J24R2k15L3n0k27J14r1N8J18J13r0J63l33K35j0k74J97L40j63j45
4624Ip0M48m04k0jQ0J90j68k20L52m28J44J8J47o6N7k78N3J69Q4o7k88L54l88
$$ y = [-73, -22, -52, 2, -55, -25, 262, 348, -95, -72, -110, 127, -195, -2, 41, 0, 46, -32, 323, 6, 82, 65, 179, -39, 7, 266, -28, -102, 118, 77, 1, -48, 72, -82, 153, -89, -71, 8, 71, -54, -125, 361, -14, 82, -81, -69, 88, 132, -32, 20, -53, 210, 53, -115, 39, -67, 1, -31, 89, -156, 44, -9, 56, 111, -171, -48, -122, 103, -5, 22, -48, 188, 127, -47, -21, -72, 300, 137, -136, -22, 100, 29, -175, 113, 108, 17, -88, 4, 321, -261, -130, -136, -254, -131, 349, 143, 37, -270, 9, -132, -138, -34, -71, 27, -137, 71, 162, 41, 147, 73, 109, 143, 119, -38, -25, 215, 90, -18, 83, 238, -34, 76, -91, 12, -66, 112, 11, -200, 187, -115, 87, -409, -81, -79, -48, 236, 298, 196, 85, 31, -214, 28, -147, 20, 144, 236, 21, 54, 4, -223, -109, -200, -142, -24, 89, -1, 162, -171, 64, 54, -220, -23, 317, 154, 9, -61, 387, -17, -37, -38, 42, 232, 64, -156, 196, -232, -88, -70, 77, 11, 68, -210, -157, 12, 96, 29, -259, 95, -293]
4648b93L16q7j03K1J38m7k11K61rj05L67j41k60J38J49k65K10j91K2r2j14L58
4670F2r5K48m07O4O4J08J34k71jR4m1j06K85Q3n5J04l17P6k17O51m34j13J71m0
4694D7K9j8J77l14J55k69J35J76j04o1K11k50K99l57J7K15j26M6k28J37Rj10L07
4717A23j69o8K26j26O9m35M68k7j99J72j35J72l4L2p1J61l05K39P7j92J35k78
4739a65K14J9l36K14k0K19Q2m8l36K75Kl51K52j97K97K4j31j1J06r3K7P0j34O2
4763D1J07k20N6j76K22k4j93K51J45l04K15N2j77L19j76J19m77J14J78j56n6J1
4785a29m3R9K3l1q1K90j74p7R2O9r3R6O1r4K4o6q4p3J85k85K41J36m7M8r6L5l72
4812c46K74L48l52P5N7q6J65j1o0p1j53L29l92Q0L56m53N25m94K02k82J39J63
$$ y = [-293, 23, -64, -167, -146, -8, -55, -266, -5, -14, -119, 248, 107, -153, -15, 134, -131, 79, -112, -90, -182, -296, 62, -33, 215, -192, -128, -64, 44, 178, -93, -94, 0, -41, -147, 138, 221, 166, 270, -47, 29, -188, 463, 29, -84, 87, 47, 76, 58, 235, -79, 76, -193, -58, 118, 14, -47, 164, -86, 213, -144, -127, 88, -38, 8, -220, -83, -74, -184, 123, -46, -114, 112, -14, 55, -380, 88, 61, -138, 34, -101, 71, 37, 69, -2, 159, -146, 93, 170, -22, 113, -165, 49, 68, -268, -54, -74, 145, 227, 179, -157, 118, 120, -231, 21, -176, 121, 145, 14, 3, 109, 16, 43, 113, -21, 41, 148, -72, -16, -192, 30, 6, -187, 64, 209, -95, 120, 172, -5, 314, 138, 257, -220, -106, 72, -84, -140, -129, -172, -73, -50, -81, -162, 128, -46, -123, -31, 38, -55, 41, 102, 8, 32, -34, -118, -191, -6, -291, -50, 86, 39, 87, -9, 26, -346, -72, 276, -76, -1, 56, -30, 135, 124, 64, -7, -160, 169, -223, -143, 213, -240, 285, -209, -7, -289, -150, 13]
4834A3j56K63k47R3J48R1k30R1k69J37k0M03p26N85k57m8J84L3L3j70K75k93K52
4857A85j37J47q5O1l62J60j67O5N5K26k68q3J87J36j65N2J69q1l3l4J4m62M77
4880E7N5m4j64O8J88L2j04J1j42k6K12J33l71J44j49P8m5M4M4j44N4J38J32m18
4904b17K07J30pn4j32R4k54L01R9j31L28k58p5k15L12k14j17K41j38J5LK19l22
4927a85p3L5K36m9PJ52j6K9N9k81k24J14J99k9m9k3L9j34K29R0o5Ol6n3j27L8
4953a11K39j38O9j75j28L46j50K19k09R7J75k73N3J26No2k86K79r7p2O3J41K05
4976C16l04J21j51K15l06O3oJ16j30J08p7J39k11k05K18LM20l78M5j42O1J02R0
4999A07j07n9j6M5J29O7j16k47O8K89j92J27l20N21j2m21L24j77j55J69J86k39
$$ y = [13, -143, 120, -127, -34, 114, 205, -25, 66, -203, -66, -86, 317, -409, 176, -81, -129, 55, 88, 121, -49, 226, -67, 185, 48, 195, 110, 171, -191, -31, -198, -133, -78, 148, -120, -203, -16, 120, -45, 7, 176, 95, 62, 28, 42, -420, 57, 112, 68, -96, -28, 160, 192, 88, 99, -43, -69, 143, 276, -95, 49, -100, -22, -67, -23, 21, -123, -69, 69, 201, -217, -10, 120, 113, 59, -73, 21, -233, 68, 167, 36, 364, 106, 31, -184, 128, -86, -203, 38, -100, -85, -82, 137, -185, -258, -223, 13, -36, -29, 123, 107, 136, 195, -86, -310, -196, 3, -26, -75, -98, -59, -193, 36, 126, 61, 67, 31, -22, -149, -111, 128, -10, 59, -116, -244, 102, -48, 171, -38, 59, 234, -39, 14, 140, 145, 83, -203, 76, -21, -93, -30, 111, 316, 12, 133, -18, 197, -109, -46, -52, 64, -66, 42, -35, 104, -107, -312, -94, -91, 329, -49, -4, -146, -85, 17, 107, 0, -59, -75, -30, 99, 166, 50, -197, -129, 160, -32, 95, -225, 296, 284, -137, 187, 10, -145, 24, 210, -29]
5021b9J5lm8N6k07J80J8r9M77m38o4K16J80k80k2J66l4p4l22K63O6J12p3j36j75
5046b55J27O6o2P0k6M5j64j60K89M5n6Q9J38j12l6j7K97k63J37j10L7j48K95m9
5070A77r4j41p6n5J73K85n43N08l16K36m0j26Mj37K25l6j80K59j3m1P6Lk40j48
5094b40L37k33K55l3N2k67J84K5l2j30P6p1N0j37J59r5J25k24j72N42j89K67l35
5117h6NJ7OJ55M9j84ro0J51j44j18K05J40j40j74J16j73N9J13p0O4M5j19J45N5
5142D8k46J44J27j51p2J51j2P9k20J53m7O3J14j03J96k42L15m86K07M6j11J05
5164E8K9m84K45M87j75m5q2j23l30M52J75k07j07J61Q6k34N9n8k4L54k56K16l06
5187a09l2K1j60K59K0J21n0o4l3R5l00M17k86K29J55l92q2J35J10o2k53J79n2
$$ y = [-29, -14, -17, -65, -9, -216, -36, -18, -117, 360, -78, -142, 74, 254, -26, -48, 118, 84, 10, -312, -49, 17, 129, 56, -80, -255, -128, -62, -124, -54, -80, -35, -199, -359, -70, -25, -81, 8, 146, 34, -2, -19, 278, 15, 152, 42, 79, -69, 226, 177, 83, -58, -134, -189, -16, 269, -274, 234, -82, 154, 114, -12, -8, -145, 80, 44, -136, 123, 110, 69, 145, 148, -92, -240, 97, -136, 119, 86, 138, -129, 55, 80, 48, -82, -6, -77, -27, -164, -5, -100, 25, -199, -371, 171, -18, 249, -86, -81, -64, -58, 97, 146, -38, -47, -107, 44, -100, -218, -13, 127, -13, -187, -71, -244, -185, -72, -142, -78, -33, -152, -7, 48, -198, -54, 73, -78, -150, 1, -11, 68, -152, 1, -46, 17, 131, 28, 224, -18, 297, -189, 18, 64, -47, 58, 87, -397, -152, 335, 160, 115, 33, -90, -420, 32, 207, 0, -107, 54, 140, -94, -35, -93, -117, 237, -19, 197, -109, -141, -120, -280, -21, -1, 120, 70, 6, -27, 68, -232, 185, -101, 128, 283, -109, -191, -56, 54, -8, -261, -82, -134]
5210a34J3R9j04k6K85K1k96J60j37J84l2o8j7J42J76k02j86J60K4j74R7M8j81
5233a48N4M3J00Q6J5K3l11K52l20L45%j95J02JJ1l0m5l0j11P1L07k07j57J03j35
5258a76J39J19M7n7j64k7L07r4J4k8k70l5K36L3J21J87m08k30L32M4j66K37m24
5281b63L89k14m4K26m8J47l44J87J94j87J33m02K81k1L42l40j18J94k08P0kl09
5303c37L92j22J76k25L55l37M6j70J41M19j89j50J41J34k97J37o8L0k73Q5J31
5324A9l30J03r9J15P9J27j63O5M0L02k17J01M2j13K17n57M71p0R8k53J22mK9J50
5348B74p5j27j39p4J38k65K12o7K35k17m9L18j54L7j46P2L9P2L4n3r2M1q8o5Q5
5373e4J09l7K7l07J62Q5J47l0O8j29J10Q3k85%o2J07J16k21J85j30K48j92oK52
$$ y = [-134, -121, -22, -126, -152, 133, 154, -142, 18, -119, 65, 33, -35, -52, 90, 266, 64, -122, 38, 62, -112, -15, 33, -148, -94, -51, 49, 135, 150, 173, -138, 114, -206, 139, 139, -56, 46, 47, 58, 28, -17, -47, -158, -87, 220, 13, -144, -41, -176, -37, 82, 129, 72, -92, -119, 188, 94, 108, 80, -190, -225, 11, 44, 165, 352, -56, -286, 46, 90, -76, 161, -263, 126, -88, -132, 94, 46, 193, -151, 36, 230, 43, 176, -226, 55, 34, 376, 36, -82, 112, -96, -26, -28, -337, 55, -67, 109, -116, 239, -98, -52, -222, -81, 338, 149, -1, 140, 274, -23, 114, 46, 76, -197, -112, 19, -311, -208, -307, -192, -113, 14, -149, -84, -44, 258, 41, 142, 184, 71, 288, -269, 202, 132, 230, -23, 99, 95, 124, 274, 199, 72, -67, -141, -3, -268, -56, -123, 112, -105, -154, 164, 10, 47, -99, -27, 12, 84, 118, 65, -27, 14, -74, -139, -54, 55, 18, 45, -262, -100, -15, 132, 102, 170, 41, 151, 234, -51, -51, -113, -6, 110, -111, 74, -56, 192, 0, -6, 246]
5397B46m63J47J56l32J26p1J36J42k35L73n3k07K97p9j00J32j93j12J69j79P8
5418b2j14J0J14j81J37k46O2K63q8J52l21J84j4j52J84J75p2j59R9N0K65l25K32
5441B33k63k4J55L8L8j78N6n9j00J57j51O4M9K9k23n3J71J50j9K7kP3M8l21p4
5466a79L10Q5k57J9o7J99R8r9k08l5J77j68qK57j89M8K60j21rr8M0K0N3k23J32
5491C7L04l99n6K49k2P6l40J63k83K32p2k57K14l1J21J69j13L13n34K26J01j24
5513b6J59k30K54o3r5j94J41j4J7J64j0j7r1M7k1j26K59k74J21L6J23n7M6j9j89
5538e9K8O3J61k33nj79K43J55j33r9J39j20J93r9J78r9k10m2K6K20j20p4oL69
5562B97l77qK54k6j88p9P3P6j44K19P1p7r6K19j60j07J42K1j91n3Q6n8J39J7q2
$$ y = [246, -217, -70, 86, -246, -120, -191, -55, 87, -148, 225, 172, -35, 262, 183, 83, 215, 22, -90, 79, -100, -22, -136, -126, -12, -193, -56, -302, -240, 23, -65, 87, -234, -50, -64, -216, -32, 143, 71, -88, 11, 61, 326, 1, 233, -30, -54, 101, 139, 177, -1, 55, -4, -104, 53, -98, -34, 15, 44, -179, -232, -61, 89, 70, 97, 95, 168, 216, -105, -179, 131, 216, -41, -22, -89, 110, 208, 109, -99, -134, 43, -125, -133, 124, -65, -17, 243, 122, 113, 15, 55, 75, 128, -95, 37, 341, -58, -114, 135, 113, 189, -151, 12, -271, -39, -111, -368, -154, -185, -64, 105, -8, 305, -229, -3, 98, -26, 133, -97, 157, 94, -1, -195, -54, -68, -51, 113, 103, 86, -5, 42, 21, -105, 154, -120, 1, 37, 160, 103, 149, 130, -59, -31, 32, 193, -40, -45, -224, 19, 174, 41, -58, 81, -39, 154, 55, 233, 134, -76, -118, -92, 128, 8, -66, -72, 297, -80, -88, 166, 140, -48, -127, -54, 22, -122, 97, 168, 91, -5, 214, 54, -53, 89, 110, -81, -134, -48, -106, 33, 50, -32]
5587c2J47J49k28j54P4O7j84L54k20L6k8j2k2Q0r9q7J13R5J83j43L4j28OKM6j42
5613i3j38K62j8jj41j9J22m9Q9Mk01J22J4J44l8k69K77j12J05o4N8k33J82K87
5637B90j17l71M73k81j16k35J96j79M11o9j0p4K97m3P9q0k34J61j25N2J18j41
5659BK11j07p4j0K67j55m00J90K4L8j81J04k0m5j19K65l5q8L3m7L07l3j09k11
5683a93L86l13J57p1q7J87K17k32K55n53J42PL61j15j07j12K15J41k19L1M1j34
5705Dj19j90J47M2Q1R8Q6m49L29j99J1N41m19J55l92O9M78m79M60k23J48j60K95
5728C14m30j60M37j20K3o1o6J34j34J56j58J60j88r7L88J33l09k04K53k5j60J80
5750F6L00l74r5K27L9l83K58q6m9J5J82j2j54M8j4p4L0R0q5Q7J46r4l54J77K11
$$ y = [-32, 115, 264, 36, -118, -44, 23, -161, 193, -27, 9, -19, -31, -53, 27, -72, -159, -46, 49, 232, 89, 123, -5, 1, 3, 49, -93, -231, 31, 13, 12, -129, -148, -26, -75, 14, 18, -183, -61, -47, 97, 59, -210, 67, -45, 60, -4, 54, -179, 3, 290, 173, -198, 275, -6, -122, -357, -161, -340, 71, 2, -8, -82, 215, 172, 251, 171, -63, 98, -27, 25, 143, 2, 213, 106, 32, 22, 289, 134, -266, -76, -52, -14, -195, -91, -111, -156, -275, -10, -45, -133, -100, -147, 160, 127, 18, -193, 193, -120, 37, -34, -121, 66, 283, 51, 306, -247, -105, -98, 263, 148, 41, -71, 144, 285, 66, 97, 138, 4, -115, -305, -158, -116, -35, 63, 149, -300, 29, -170, -159, 382, -37, 118, -274, -205, 273, -206, 254, 31, 179, 19, 314, -116, -276, 161, 41, 64, 3, -63, 71, -63, 93, -65, 95, -93, -190, 198, 331, 22, -182, 71, 46, -114, 66, 366, -8, -103, 124, 163, -220, 38, -48, -97, -82, 100, 88, -66, -18, -32, -106, -76, 14, -71, 16, 162, 68, -286, -109, 102]
5775A02m9j69p3K44J32m3m9o5j05Q6J3j91PJ4L26k54k79L64J9m7Pj48K90J03l07
5800g2j62J56J45P2r5J4Q5j81Jr4K39j5j51Q6k1M1o5M6l5j2r8J32l7o5J7J98J9
5827A48R1m64K94J15k11J25j73o3K30j6j2j26Q7J63j82L1O4j50l5O4o9L1J87j25
5851Dm3m2n1K56j85Q4j34J45L6P3j13K63m12J69R1j65L9j40l5K02j53J98N5q2
5875F0l1K11l78M1K66j01k00J45J50mk86J77l27L09J34k12K07j02k94K19L38l49
5897b7J03k96L50Jl34J22O1j12J16j36K74J2k29j7J73o0J06k50L06k93nn6M3Q2
5921f6J00k2l18L33lj42J80J96m54K29K6j83J20j6N2n6l0J46k38K10j63K55p3
5944H3j05K1p5K63l78L05q1J0o8J17n5p7J22Kl0n4L0P6K7q0N0L5j84J58k85J84
$$ y = [102, 53, -116, -189, 55, 187, 144, 95, 30, -75, 11, 24, -167, -160, -146, 180, -74, -353, 11, 30, -17, -10, -158, 132, 235, -72, -234, -78, 67, 139, 44, 58, 143, -38, -37, -131, 108, 93, -58, 28, 7, 48, -17, 29, -6, -18, -116, 16, -21, -86, -69, 129, 148, 239, -225, 69, 184, -27, 98, -75, -138, 92, 76, 64, -62, 25, 188, 6, 37, 101, -49, -84, -20, -89, -58, 129, 4, -39, -81, -132, 124, -61, 23, -111, 34, 70, 143, 30, 293, -119, 50, 141, -24, 15, -125, -160, 42, -111, 87, 142, 60, 29, 240, -138, -97, 169, 68, -132, 13, 163, 159, -127, 50, -277, 32, 166, -46, 161, 59, -235, -16, 322, -27, 76, -220, 130, 131, -203, -81, -20, -132, -16, -152, 122, 134, -95, -112, 61, 1, 107, -143, 163, -130, -135, -191, -148, -66, 34, 12, -306, 27, 24, -118, 62, 258, -196, 33, 59, -124, -4, -20, 32, -24, -54, 92, -146, 64, -99, 156, 83, -22, -1, -76, 187, -191, 114, 33, 43, -25, 92, 37, -40, 82, 84, 54, 0, 30, 106, 133, 53, 103, 138, -46, 112, -173, 11]
5970A1L0p5o8K06k16l5M98l22k31N19m40J13K24j54r7j92L23j73K90j1k31K08
5992A77j73j58R9J57k0j6j03J6rJ05J23k66L15l93o1J74k24K92J4O0k78nrJ31
6016e2R0l08K69NJ18r8O9q8J13J02q0J5j45l4O5r5L31l62Q1j90r7K31J61L5j73
6041c7L5k05j65L51J65l21J23J54p4l8p3L34k11k2n1M8J53l96K12NJ80J0j57j39
6065a19J44j47O4J53O1l17K4K88l13p9L29j2P1j83l0oJ56k89L19j1pn6q7k4J37
6090F6K2j72J14K08j98j88J67l7R7q6O1r3J30j76J42q4K46l70K93m07K88j34J48
6113C7N0j02m1J20l4n9R0k7o2p8J74J74J0k73J26kp5j79J5K06o2n0m6J54k47J99
6139A8l84K74J65k19K50o6l34L70j76R0O6m3j8J3N4J64k18%j61J20k0J4Q1j73
$$ y = [11, 41, -34, -102, 104, -112, -147, 351, 29, -202, 317, -123, -10, 214, 60, -37, -229, 94, -79, 211, 200, -31, 177, 4, -154, -55, 102, 82, 66, -37, -21, -30, 75, 198, -68, 247, -146, -207, -33, -257, 35, 49, 109, -169, -174, -183, -52, 38, -270, -1, 4, 122, 24, 93, 5, 118, 220, 140, 155, 10, -24, 41, -54, 277, -85, -4, -194, -291, -60, 101, 136, -37, -2, -207, -372, -21, 144, -177, -54, 100, 26, -12, -85, 249, 38, 16, -35, 13, 166, -230, -18, -13, 167, 177, 20, -119, 25, -122, -58, 95, 156, -161, -137, 151, -162, -241, 88, 76, 147, -36, -66, -72, 84, -205, 114, 103, 96, 40, -47, -71, 66, 88, -84, 30, 238, 40, -148, 19, -18, 79, -7, 54, -39, 91, -85, 57, -27, 219, -151, 142, -265, 23, -111, 37, 87, -15, -56, 64, 30, -29, 61, 34, -28, -106, 68, 242, 252, -21, 105, 103, 28, -151, -136, 70, 8, -42, -88, 66, -181, 18, -366, -92, 73, -146, 104, 38, -296, 74, -102, -12, 54, 11, -7, 6, 60, 224, 6, 6, -155, -35, -55, -41, 40, -133]
6163a33L15r5J31l23J82j82o0K18l5l2J20j47J3L3Q9k68Q1K01j27r0k8l2J98R
6187C8J04k33j9j61K58R7j53k6J11J0q3o6j66L21o2J73k58N3J97j57L3Q9O5k30
6211f5M3K0Q6q0m5J36L5N8j3k03J76j0j73j17l2K57k19o3K70j65J56j09j6j24
6235a97K13rMK6J55mm4k8j26j5k1J01k68K07lk75K44J08O3K51n12o5j44M59j57
6260c7r8L4j96M42n2k4m5n9J27j99L75p3k9k21q3J89P7l9Q9q7q3p9N8P7q5j79
6286b00L11k30J70R6k54M0k4K04j34mJ19LJ24m3k71J88j66L30k04j10l7o2L67
6309B13k88P9N9Q9j27j1O2Q0k39M4L6k15J56r3J15K0J06p0o1J52n2N2j27j2J63
6334A31l14J8L69n6j12N6m37M39J24N6j92j3r9j48K84j42J82M8k97O0p8K42r9
$$ y = [-133, 182, 87, 218, -105, 77, -105, -165, 53, 18, -14, 106, -41, -28, 5, 94, -174, -93, 108, -19, -109, -137, -169, 29, 38, 142, -91, -110, -271, -13, 84, -69, -95, 16, 26, -57, -123, -289, 32, -30, 143, -115, -62, 135, -22, 11, 100, 165, -65, -22, -2, 84, 4, -41, 95, 130, 188, 175, -28, 148, 138, -35, -152, -184, 73, -146, -209, 61, -104, 52, -57, -73, -197, 16, 7, 11, 37, 192, 188, 144, 116, -10, -25, -46, 55, -213, -6, -9, -284, -40, 68, 131, 382, -130, -195, -339, 120, -37, -135, -101, -297, 145, 93, 69, 24, -35, 92, -107, 268, 195, 166, -55, -138, 51, 128, 89, 178, 91, 8, -71, -13, 64, -21, -200, 111, -119, 51, 147, -107, -67, -91, 113, -21, -25, 94, 97, 221, 178, -93, 95, -71, 259, 55, -55, -92, -154, 213, -75, 4, 63, 152, 25, 14, 76, 156, -83, -39, -3, -218, -62, -155, -40, -20, 86, 16, -45, 107, 55, 107, -20, -32, 131, -183, -165, 204, 148, 36, 92, -345, 94, 218, 274, 82, 69, -30, -178, 106, -36, 146, 194, -103, -43, -121, 121, 22]
6357B2J91j05p7J37o5K05m81J74N2k16L63j67j56K07p3m5K12l31L18k47J62P0
6379A50n3k66J39J23o2K63r7q2L0j54j90J13O7O9N6l4l06K34K19j13j9j60K81
6402B08k42k0M9P0q9L9k6o6J12q6k1J47j04K25j28M9K6k36L18l21L04K9m18M58
6426B77l15K2L28o9l56j21K85Kj6l0R1k54J64J39j17L5k48P7j0J2j00L50n0J86
6450B82j47n79N24j37L3J00k04K00N4j10O9M0L8n4k97J02m8J20O2k42j27J13n2
6473b60J50j24j2P4K14n2L6j7J50q5j36J70j26K2r7P7K10p9q5k25L2K37J45l46
6497a27L2J8M1J30k20R9J92l45j24M22l97Q4R6J12j73n7L7J77k66K65l8J37M3
6520A38j8J0k8j41j73J16L24l55K36J0p0K29l24Q7j36pP3J65k53J78Q6K3k30J8
$$ y = [22, 213, 108, 31, 168, 103, 308, -173, 1, 53, -163, 200, 33, -123, 84, 11, -34, 178, -153, 165, -82, 80, 150, 97, -169, -30, 93, 31, 294, 197, 115, 145, -9, -199, -86, -19, 50, 106, 72, -234, 0, 219, 106, 87, -73, 208, -34, -54, -5, 65, -24, 15, -11, -77, 35, -51, -72, 75, -29, 196, 68, 117, 143, -93, 225, -96, 208, 237, -181, 277, -38, -16, 312, 243, -113, -234, 51, 53, 37, 7, 98, -156, 8, 147, 30, 65, -183, -106, -116, -104, -204, 146, 96, 282, 135, -444, 80, -57, -24, 76, -128, 72, 126, 16, 85, 125, 163, 109, -188, -86, -134, -14, 48, -194, -321, -208, -260, -110, -234, -246, -172, 42, -10, 26, 9, 159, 74, -62, 108, -18, 4, -93, -16, 194, 115, 30, -195, -163, 74, 219, -127, -95, -77, -36, 94, -126, -27, 165, -180, -304, 118, -279, -195, -99, 13, -160, -217, -180, -3, -269, -4, -42, 95, 138, 120, 130, 102, -39, -212, -96, 228, -127, 109, 119, 49, 278, -46, 41, -95, -102, -29, 136, -117, 61, 147, 170, -60, -42]
6544d2j88L7J84J29j38J41j51K4J47O5k15j27O1J70J38j48k00K31k16J45k65j56
6566c74M38j19J70k75J93J39r7q8P5Pp2J15j50K8O4k1j12M0o8J55J7j45J3P3M3
6591D9m4J28j31k53L74j44K8p5K1L8N6l03K19K25J55l33K17n8l12K37O9k26J71
6614A08Q2k13K2J07K17l64l2L4J79k17o6L7L85k57k70K09l9L9K7r9N8J36j11J85
6638A57k64O9k88L87j87J58k3J4O9o5j76j18K17k50M59j55o0j04J24n9K39l57
6660b13Q8J32P1Qr3j36K02J40m21K80o7O1j14r1J97J6L9j01q6J51rk04K15j14
6684d9K7jR3O0k3N4p8l08J05J08J31r4k26P4Q5k86M19N7O8l90RJ15N4K16j78j84
6710a42K26O5N9j68J0q3o5J24n0qL05o05K3M05m0m2J00K0q8l6J13J2K3q1J82l81
$$ y = [-42, -230, -193, -9, 120, -18, 123, -28, -4, 143, 208, -7, -134, -73, 97, 235, 87, -113, 118, -98, 47, -218, -374, 64, -55, 115, -160, 33, 172, 75, -13, 62, 69, -3, 112, -38, -10, 54, 33, -79, -39, -107, 48, 65, -80, -67, 6, 49, 5, 133, 2, -251, 123, -21, 7, -68, -47, -9, 47, -256, -37, 188, 343, 10, 227, 169, -143, 94, 163, -63, 108, 190, -23, -1, 106, 323, -41, -73, -39, 140, -77, -143, -106, 279, 22, -248, -39, -78, -39, -12, -111, -53, 83, -28, 157, -107, -38, -326, 61, -126, 32, 9, 23, 92, 27, -149, -267, -50, -300, 159, 4, -56, -160, -36, -95, 144, -213, -125, 7, 78, 86, -7, -143, 59, 199, -222, 58, -9, 52, -62, -153, 44, 60, 99, -2, -88, 63, 54, -150, 65, -49, -22, -23, 70, 130, 107, 161, 83, -225, -120, -12, 119, 25, -201, -127, -42, -328, 91, 148, 216, -174, -165, -50, 4, 220, 42, -142, 84, 149, 208, 40, 50, -33, -98, 26, -24, -32, 273, -332, -309, 96, 56, 14, 114, 134, 46, 10, 123, 135, 158, 77, 259, -122]
6736a22J03j11qp0K55J02k50K78l34J98k39J93j60K05Pj41K83J99m24M8qJ73Q2
6759B59k38P4j5j33L8q3K48l21J3L09pj79J24j85K5O1J4M8q6p6J44J04J9k30O7
6784fq6J31k08J74k1n5J76K6k53K2J53k5J04l24J50j25M17j87J14j97mN4J19k10
6808f1p6P6J15J25j43k73J68O0P0jj44J88J4k06n7Q8p6Q5j07oJ54j47j13L10j35
6833i2j37J00K0j99L95o9r1J23J48k91J28q6L6k8J45j82k2J79k8J5N0J3j23k79
6857b75Q4L7M07n14L63k30R0J69k48r0J41J63j17k02J57N8l9j9K15j47p7J75J12
6880B13m16O7J25JJ40r8m5m9M7K04j70l14K28m2l0N2K9J5k30M13k40L57k14O4
6904A07K6j82J04o7J10J64m48J94q0%K5J97l50M49k61qQ7m3lk37qJ86o7K11j07
$$ y = [-122, -19, -130, -138, -208, 47, 149, -101, 177, -157, 41, -198, -5, -165, 40, 47, -94, 189, 388, -36, 12, 4, 177, 259, 21, 95, 80, -53, -15, -98, 150, -171, -158, 151, 144, -35, 89, -96, -71, -10, 4, 52, -34, -110, 34, 138, 157, -73, -6, -92, 39, -169, 5, -16, -71, 105, 131, -122, -100, 53, 28, 132, -192, -42, -167, 250, 63, 177, -20, -24, 30, 149, -61, -137, -61, 54, 179, 36, -237, -69, -9, 61, 60, -84, 104, 118, -88, -145, -57, -133, -48, -155, -161, -7, -154, -267, 43, -92, -229, -129, -109, -308, 87, 18, -73, 50, 198, -93, 35, -51, -15, -43, 102, -80, -102, 77, 49, 64, 114, 127, 4, -275, -191, -154, 253, -261, 102, -128, -38, 131, -117, -207, -66, 97, -20, -222, -65, -7, -46, -65, 150, 3, -74, 101, 213, -203, -136, -11, -10, 130, 32, -13, -62, -15, 189, 19, -295, -67, -109, -139, -87, -58, -43, -273, 140, -100, 257, 43, 107, 133, -49, 55, -12, 98, 262, -186, 8, -72, -72, -47, 150, -200, 249, -12, -20, 67, 24, 21, -216, -224, -38, -105, 106, -1]
6929aK80m47R7J68J63l03L46k31l12M43M3k04J48j61M3K45j47k6j69K65k59J68
6951A49j93O4o9J99k47M6r6O1Q2n2K6O3m39M34j4l0o8J45J63l84K08q6j82J73
6975d7n8J29MK7l8J19j16j08j47J10J35M4O1M6j69j9M6J01j5j41P8m79L11j01
6999b27M29l50K01lj28P2k4M1j70N0K46l0J7L8r8j87N2K0J16m8R1K61l82k64L00
7024B3%o6K00l49N6M4j9Q1n2j9J87j07j98J95r9J34p7K91l10M8j07K68J0k8Q2
7049A88k41l3L46j89l25K66r5K6Q0J23k69J11Q8P1l34J11P5j96L47j86J30p0j55
7072a31rK26jk84K65r4J90l76R3O3J32j43J61J19j31j7p0j32P1J67k27r2J39J79
7096I8k97J47K90l21P2p8m7J81J97k07J36j62J20k08L20m85L74J67m64K88J3k23
$$ y = [-1, 279, -168, -71, 97, 260, -43, 303, 72, -240, 203, 246, 42, 190, 29, 72, 317, 170, 144, -25, 240, -19, 149, -44, 20, -49, 150, -97, -51, -147, -86, -4, -56, -30, 33, -406, 28, 14, -16, -84, 61, 224, -160, 48, -38, -220, -47, -105, 24, 28, 55, 17, 136, 20, -88, -235, -125, 10, 54, 115, 161, -8, -27, 19, 120, 105, -36, 42, -437, -126, -227, 202, -148, 53, 50, -78, -6, -30, 11, -159, -109, 137, 107, 124, 162, 64, -123, -71, -51, 65, 17, 108, 369, -13, -277, 23, 23, -43, 157, -192, -136, -92, -111, -30, -82, -101, 86, -21, -219, -24, -123, 11, -66, 225, -85, -37, -144, 124, 134, 106, 188, -53, -86, 260, 71, -254, 12, -83, -57, 23, 146, -123, -12, 76, 147, -187, -76, -1, -197, 150, -36, 94, 24, -131, -140, 86, 85, -199, 66, -28, 162, -214, -121, -58, 74, -69, 92, 211, 80, 63, -7, -139, -68, 99, -128, -220, -81, 98, -199, -52, 238, -83, -11, -89, -136, 45, 242, 35, 171, 9, 129, -79, 241, -244, 130, 297, -167, 121, 134, -89]
7118h9q1L34k11J55k08L0K3q8Op7L38l10j31M40L5m34L11j27N9N4j48J14j54Q9
7142g0K37j52M7k10N1o0j3J84j47K8n8J59o0K7Q8k55P8K07j91JK08K2j07n2j04
7167a42k4J22L64q1l13J58j49q2K63j43j96L78j65j75J81j35J32l9o0K75j14k23
7189a68K58J06l69K83q3k14L9J07N2R4j9j71K63l94J82k14j4L20kJ37k47J49k60
7212a65J54j50J31O4M5j59J57J50k39n8j04P4J08o7J13J18j90m6J56j71K93l03
7234h9J33J55j55m2L6J56p7j12L10l96J67k76J36l9q8P7j44J18n3M1J37K10l19
7257a14J57R8j12Q9j75j72J52J87k8p4M7j3j59O7J55K2l43L34k25N4J10j72Q8
7280b7j67R6k09K01K80j66K3J0p0O1J8j8o0L1j84L72k15k5k6J84j60j07N1K65
$$ y = [-89, -170, 164, -47, 108, -100, -70, -47, -135, -129, -206, 132, -178, -309, 131, 166, -268, 43, -84, -25, 29, -119, -5, -159, -70, 167, 15, 62, -148, -97, -157, -170, 14, -133, -105, -163, -4, -64, -37, 51, -204, -126, 81, -110, -109, 99, 121, 14, -38, -142, -166, -44, 320, 239, -74, 84, -65, -147, 116, -27, -223, 155, -10, -185, -4, -139, -7, -46, -106, 169, 55, -168, 90, 196, -173, 110, 27, -187, -148, -41, 11, 105, 86, -85, 178, -216, -34, -248, -262, 58, 56, 193, -54, 95, -165, -11, -161, -30, 34, 79, -80, 77, 227, -12, -70, -174, -100, 8, -59, 54, 172, -18, -64, 92, -79, 214, -89, 44, 199, 44, 2, 38, 194, 117, 5, 315, -81, 86, -190, -54, -93, -181, -104, -248, -130, -183, -142, -5, 205, -114, 43, 141, 29, 118, -57, -229, -77, 110, 82, 8, 55, 42, -117, -50, 105, 127, -216, 118, -107, -53, 57, -115, -27, -194, -98, -307, -106, 174, 8, 31, 41, -29, 32, 50, 32, -28, 3, -181, 191, -24, -49, -75, 109, -51, -158, -107, 158]
7304A58M5k94j03L40l22J78R3q6k6k76J70J25M7K12m25L17k60J83l04L71r7M0
7326H6l25J04J66K3K19k78MPJ28j37J7k19J07J55j06M4m9J54l11J45k44K98J22
7349A10J01n2j39J85k93J03M9K71l09J35k77L14l00J32M7p2K1RJ43k84k1R2k1
7372e6L21n47L54Kj36L23l81K67kj36k2J24k95O0K20j9J2j65P5J32j56j23K76
7395A28j19j51L12L5j65N1j1J41m8k59K10Q6k93K01k32N4J93j78j14R8K47mj60
7418B2O6j03J31K1j25j42J51n9o8J25j30p6J58J46k51p4K43qr5K37l5l47K65M7
7442I9k82J99J10j15k04K91j00L3q7J05j6l3J57l39M74m58L54n8j56L5o8m41N06
7465FQk03J45K57l76J66k33L33M2l18q0K45k65K74K98k43M8k12j80J4L80j56J34
$$ y = [158, 203, -91, -194, 146, -176, 2, 95, 9, -17, -293, -123, 2, 49, 261, -164, 153, -107, 76, -228, 143, 46, 86, -239, -135, 31, 54, 273, -5, -1, 6, 134, -3, 14, -205, -98, 57, -49, -5, -54, 100, -211, -66, -310, -12, 110, 211, 159, 20, 205, -88, 15, 64, 335, 26, 161, -116, 198, -102, 30, 77, 5, 26, 35, 178, -106, -127, -35, -56, 265, -282, 72, 74, -62, 261, -120, 147, 145, 9, -13, 111, -184, -124, 96, 77, 89, -76, -1, 131, -25, -148, 128, 9, -142, 170, 205, 40, 91, 80, 221, 173, -86, 124, 210, -83, 118, -114, -60, 133, -45, -159, -61, 186, 182, 22, 88, -15, 116, 137, 12, -130, 21, -38, -106, 19, -111, -187, -29, 117, -134, -208, 35, 27, -68, 169, 134, -213, 52, 99, -183, 16, 126, 11, -193, 98, -2, 31, -56, 49, 33, 0, 157, -182, 292, -166, 188, 130, -26, 9, -59, -500, 6, 14, -189, -44, 213, -163, 3, -230, 103, 145, -173, -253, -8, -273, 1, 299, 56, 104, -108, -288, -274, 106, -50, 84]
7488H4l2k3lk41M77j79O5l87J41N3k0j30M37o2R4m28J33j7m1m0l4K55k21j2L42
7513B11k09j4j5Q5o6J6J47r8J0m6p9M9j31J95p6J53k08J62J34m16M5M3j4P6lo0
7539a09N0p0J14m0K4K72j44p2J7n6O9j50L53J01n09J91M2r9J1m5J93k31J9J8M1
7564a0K21l04k7Q2M3m3q5j10K29O6O8K1j08n8n1l6K14j13P8m8j98K17j24L17j31
7589A10j77L1o9kLJ08j9J83l14O5J83j70Jr4K10M9J83k75k50L03J12j67q2M9o9
7614i8J18r1q3rM81k22r7l8J59k86R7Q6O6J2k50J15K93m27k3J29j00K74j0j12
7638a6j91J07J68l84L31K6K1Mr8J7mK19k06L4j1jl9j9J65J3j85o8J86j19J84j59
7664b5K00j59K33l13j11J40J68j03J0l7Q3Q2j10J18l80J42K00j75J16P9l21J76
$$ y = [84, 52, 29, 26, -215, 262, 83, 148, -239, -98, -45, -65, -195, 242, 180, 274, -154, -21, -38, -79, -119, -153, 102, -119, -131, 211, 2, -12, -27, 58, -8, 8, 155, 57, 67, 21, -58, -9, -140, 55, -21, 132, -76, 86, 220, -196, -151, -108, -122, -46, -49, -109, -59, -129, -15, -55, -31, 241, 97, 25, 42, -14, 55, -95, 258, 359, -150, 41, 83, -16, -5, -50, 143, -88, -69, -51, -10, 211, -93, -120, -38, 5, -38, -123, -233, -4, 62, 130, 151, 43, -15, -66, -102, 112, -1, 77, 29, -169, 48, -76, 241, 110, -67, -36, -105, -107, -104, 4, -15, 168, -146, -81, 102, -68, -67, -161, 49, 98, 281, 6, -244, 59, 171, 4, -78, -29, -98, 20, -71, -154, -163, 318, 96, -1, -39, 120, -166, -69, 17, 83, 95, -155, -40, 253, -174, -197, -68, -168, 106, 96, -16, -207, -100, 68, -316, 15, 41, 62, 66, -32, -15, -19, 200, -6, 28, 17, 16, -23, -42, 123, 136, -49, -117, 69, -50, 134, -25, 175, 16, 249, -64, -175, -35, 133, 30, 40, 3, 86, 168, 58, 176, -204, -62, 138, -37, 79, 158, -163, 13]
7686A3k77M53k40K9P3J5j85J71q7K42k66p9p7J24K55k58r4K66j82J47J37j86r
7709a5m9P1k10K96j63J43J85k75J50m13M15Q1l01J18O6k19J05K68n28M4K85j12
7731e8K20J4%R4l16j19K71m0l65K86k80M65j51JQ0m4l9J34j63P8j29J25K4j10
7755b2M0qJ91k36M7K57l63K9J27J03k16j76L67J8k67J26j79K3L31j51q6J01j3
7778D3j54J14M1p5j19L65j31k9j66J19N0Rj07J3k75K53K13j87j49j8O9K85o3L7
7802A38q6l8q3R9Q9j52mj25J57N7n5j09J17O7k8p7K27m53K69j92J44l7nM8k96
7827c28M55j47j48J99r9M00k38l5Q8l73L34M2m9r2j68J74J41j37K32m14J62q7
7849h8K43n6O7q9n9J43k36q5K84k58R8M0J45J5O3j43j03Q3k05K92j80j2K1r1K27
$$ y = [13, -264, 189, -51, -22, 51, 66, -119, 52, -35, 207, -59, -138, -215, -91, 164, -94, -188, 78, -104, 43, 180, -6, -15, -64, 7, -203, 93, -70, 73, 258, -17, 133, -280, 135, 216, -85, 33, 99, -120, -15, 253, -275, -231, 54, -58, 162, 176, 176, 270, -46, -165, 106, 66, -299, -13, -293, 172, 21, 22, 102, 58, 19, 153, -10, 68, -61, 64, 88, -22, 18, 10, 201, -35, 12, 269, -94, -65, 62, 165, -51, -227, 140, 158, -109, 17, -162, -139, 192, 41, -45, 56, 43, -111, 3, 44, -31, -150, 215, 84, 55, -111, 8, 58, 67, -40, -27, -302, -49, 164, -23, -172, -190, -121, 164, 101, 138, 52, 14, -69, 30, 119, -33, -37, -162, -5, 52, -3, -112, 5, 72, 44, -33, 194, -259, 10, -182, -38, -75, -80, -32, -328, 127, -20, -168, 31, -68, 332, 94, 59, 147, -226, 108, 150, 101, 9, -159, 15, 156, 19, 251, -163, -1, -88, 155, 99, 166, 77, 18, 161, -75, -160, 124, -134, -36, 4, 149, 164, 227, 84, -19, 64, -141, 151, -29, -41, -20, -111, 116]
7874A16Mj5j70K0l8P3rK11j84J53r1l1j65K53l50O2L52j72K8j3K1l6mn2Q7p9M0
7901A1K10l78J16J57q8K6Q8nJ36k68l1K07j75j59M31l73O4J24k36K37o5k9n9J4
7925d5L3k38J38J56k25K86O3k80J38J40k37K25J6r5o4J33l1M9j55K0j7l35K70
7948e5J03K1j4o1K57l75k3J64J1O6j49l0L9J11o7J55j90M6J55n56K82J60r8P4
7972B6r9jL83l96K27j39j8K0k9K5k9j29K45k1j32L8ol9o2K75j56L2J1Q0k69Q3
7998h0J8J28r0p9J2K12k24JQK41J35k42N3J49l99J37J86k50L3j15K53l9p8K00
8022A70j78N3n4n0k75M14K37l98jK0J55q5n2J02l8pj55J61K1J97l05k9J24J87
8046B14q9j56J29jL13n03K52j21K5j21l4j28R6N2j29J22J15k2J90J80m54L43l34
$$ y = [116, 120, 105, -65, -45, -83, -10, -19, 192, 8, 161, 70, 39, -126, 127, -223, -161, 191, 19, 47, 34, 55, 19, 15, -37, 50, -29, 11, 221, -157, -41, 116, 28, 54, 142, 137, 273, 5, -26, 181, 6, -153, 278, -95, -31, 93, -143, 94, 29, 0, -59, -45, -12, -250, -112, 44, -181, 105, 168, -112, 26, 166, -71, 154, 170, 75, 11, 144, 113, 162, 7, 27, 10, -325, -55, 48, 69, 55, -6, 251, -124, -147, 17, 28, 94, -55, -85, -46, 65, -2, 153, -37, 9, 164, -392, -110, 50, -48, 26, -73, -74, 309, -87, 140, 1, -17, 3, -26, -1, -30, -159, 86, 65, -67, -29, -35, -74, -136, 139, -17, 15, 26, 106, -163, -80, -62, 66, -24, -103, -91, 121, -103, -102, -94, 147, 282, 40, 93, 242, -157, -20, 166, -84, -51, -166, 87, 48, -30, 170, -8, 45, -9, -59, -334, 80, 317, -81, -82, -62, 93, 8, -44, 58, 20, 13, -142, 19, 40, 237, -68, -97, 27, 214, 125, -31, 98, 97, 410, -93, 159, 38, 63, -58, -92, -220, -124, -72, -201, -79, 36, 14, 204, 384, -70, 273, -61]
8069f1k10M37l47K59p1k01N14k37J22o2M1k47Q7Q2j62J70m00K16K77l76Pn7K77
8092E8kO9k42QJ63n7M9K92l14J91l43M7J28J28J49m29K1K55j13j07J07J2j25L3
8116b2N2o3P0NK62j35q9L5k56K20k09P3p1L15j79J7J53l2l12L40k9j89Q7k70K91
8141F4j1k03j42N38k28pj66J86R7k91K44n6k38M77j33j60M4jM5J7J39L2l43K41
8165A45l54K13M2N2j89J91rk37R2K39m2k97Q9J12O9k72J36l15J89j6L1J36P2K
8189G9j12O4
$$ y = [-61, -271, 166, -181, 78, 7, -194, 320, 83, 205, 143, 184, -63, 24, 106, -56, 114, -286, -70, 207, -169, -162, -219, 58, 56, 125, -117, -109, 54, -3, 46, 338, 24, 215, -128, -81, 47, 175, 324, -105, -84, 171, 58, -49, 58, 70, -55, -22, 30, -33, 37, 42, 304, 169, 80, 115, -141, 79, -130, -57, -128, 187, 8, 25, 178, 146, -166, 174, 145, -44, 43, -227, 64, 53, -150, -292, 246, 18, 11, -155, 31, 128, -163, 81, 25, -213, 264, 131, -29, 15, 14, 59, 76, 215, 247, -96, 145, -209, 4, 46, 98, -91, 100, 91, -146, -54, 185, 143, -154, -65, 47, 116, -156, -20, -335, -146, -162, -131, 5, 77, 79, -33, 31]
8191C1
$$ Imaginary data points
##PAGE= N=2
##DATA TABLE= (X++(I..I)), XYDATA
0@%%%%%%%%Qj6J6j6K4l2L3m1N6p2Q8j04J20j44J74k06K41k81L27l76M34n01N73
31C05o55P45q43R53j075J210j358J519j695J887k098K330k584K862l162L490l851
48b020M245m677N152n676O257o903P622q430R349j0397J1611j3036J4730j6791
62h964J9363k2674K7125l3465M3290o0756J01344l78830k61190K85402o5687J21111
74b33931P8911O78m4644O4994k3096L9247J15587Q9025j8550K3110p058k6489
86E7784l218Q921k6468N8416Q0396R153o839N3089n913o4549k8891n148m9465
99G7268j1469K4150m2927p9059j9624k7173m9065K0874Q0909N7090N8788N8468
111A48230k4853p8784k9999k0283n4886j3369M4857L1016N463j7252n2147n2138
$$ y = [0, 0, 0, 0, 0, 0, 0, 0, 0, 8, -8, 8, -8, 16, -16, 17, -24, 32, -40, 48, -56, 64, -80, 94, -112, 129, -152, 175, -201, 233, -268, 305, -350, 395, -448, 505, -570, 640, -718, 801, -894, 993, -1105, 1225, -1359, 1503, -1659, 1831, -2020, 2225, -2452, 2700, -2976, 3281, -3622, 4000, -4430, 4919, -5478, 6133, -6903, 7827, -8964, 10399, -12275, 14850, -18615, 24675, -36081, 65263, -313567, -574757, -289355, -355042, -233931, -155020, -154342, -198986, -133992, -157088, -117841, -2254, 86771, 68221, 91331, 84273, 57784, 54566, 63487, 37019, 95435, 175831, 184984, 178145, 231234, 225321, 160772, 131881, 126733, 77268, 65799, 89949, 47022, -32037, -51661, -78834, -127899, -107025, -26116, 30974, 89762, 148230, 123377, 44593, 14594, -5689, -60575, -73944, -29087, 1929, 7392, -9860, -62007, -114145]
123a14145k5290j8046l146M0632O4898N4235L3633r041n5504m6436k0203l5574
135a33987k2886N0243Q0686M0854K4435M0901J0643l3447m284L3114J7979K1761
147A26012M0778K369l9799l4662m0635n6414k5786J3558J2272J0014P687k0276
159d882k6955l621p425k203L4153K6052n783q04j4442n5617l9884P592J0488J8014
173f5317N9455N5751J5346J0271l206m4365l5736J941M531J1271L5891K5312j1575
186E9570l0554m2250n3354l1619L454J9204M1141N8036K9001n797j0890k2966
198A2976l6460j7553K495P697K3150L2002O007j2924j624m777j6694R43J7275
211A2513J2772J2346R577r237j6242j2232j6063j4148Q48J0860O166J630m410
$$ y = [-114145, -139435, -157481, -160627, -119995, -55097, -862, 32771, 23730, -31774, -78210, -98413, -133987, -156873, -106630, -25944, 14910, 39345, 80246, 90889, 57442, 53158, 86272, 104251, 126012, 166790, 169159, 129360, 94698, 54063, -2351, -28137, -14579, -2307, 7707, 15394, -4882, -31837, -35458, -42883, -45086, -10933, 15119, 9336, 8532, -5910, -61527, -101411, -93819, -83331, -65317, -5862, 49889, 65235, 75506, 72300, 27935, -7801, -5860, -1329, 9942, 45833, 71145, 59570, 29016, -13234, -66588, -98207, -94753, -75549, -34408, 23628, 52629, 46832, 35942, 12976, -23484, -41037, -38542, -30845, -7695, 24307, 30314, 17390, 15766, 10989, -5705, -4762, 12513, 25285, 37631, 47208, 37971, 21729, 9497, -6566, -20714, -19866, -9006, -2840, -1210, -5620]
224e620j7080j6126l690N682K0603L2075K2761O980n624k2959l5331k6932k736
237d7997J4217K5066L5198K6803L46j8217k6599l1895k1478K570K1001K5811K5333
250C0159J9093m183k7998l3090k6945j3626N367J9467K8836K8947J0679r804j8459
263H443j9571j6482k298J5334J7797J1783J0816m08j8412j5018m348j265N582
276h047J6156J1876k49q716r902j1865o864N232J1151J3510J2387m02j2270j4343
290b346j8658j5472J893J6878J9806J8549J2483m270k0060k1693j9716j2763Q359
303c7010K6005K6032K0869J0820j0220k5028k5635j9406o602J2916K5619K1496
315A9856J4357O273j3478k5240j9301j0309o10J4572K1001J5022N092l961j4076
$$ y = [-5620, -22700, -38826, -42516, -36834, -16231, 15844, 38605, 45585, 39961, 17002, -18329, -45261, -47997, -33780, -8714, 26484, 53287, 53633, 35416, 8817, -23078, -44556, -41986, -20985, 4826, 30159, 49252, 45069, 17071, -16019, -42964, -56590, -51223, -31756, -2920, 26027, 36706, 26902, 8443, -11128, -27610, -29908, -14574, 3223, 15006, 25822, 25414, 7002, -8016, -12364, -13629, -8047, 8109, 19985, 19736, 11020, 1118, -10747, -17611, -12379, -1228, 12282, 24669, 24267, 11997, -2346, -21004, -36476, -34583, -17705, 2101, 20650, 33133, 28863, 8803, -12890, -32606, -45369, -37010, -11005, 15027, 35896, 46716, 36496, 11468, -14167, -33573, -40175, -27259, -1640, 19856, 34213, 40486, 27008, 1768, -17533, -27842, -28452, -13880, 7121, 22143, 27235, 23274, 9198]
328I198j7757j0388j865N162J4276J2606K201j554o360j2961p156M545P850P887
342E684R713K882j2315j7784j0904p668j12J5011J8889J2985M610p267j7921j9817
356b4014j3785k276J2188K4021K2793J3665K591j3753k4415j7558o970J921J6569
369i023K6550K1711R509k270j4141k3484j9250o139L995J2069J6894J1082J020
382B8523p610j6443j7012q687j846L681J0680J1694K750o716q530r915q278K256
396b5453Q531P086P253M072m898j0164p805j868N852J2929J2932P025L749k760
410A6481j4622j2981k195L271J0612K0145J4453K448m337j1406j9898j5520k128
423a5677M884J1443J8179J1213m52n181j5086k1598j0112J479M924J2104J6693
$$ y = [9198, -8559, -18947, -20812, -15650, -1374, 11232, 13433, 11879, 5519, -7442, -14598, -10053, -2203, 5684, 15397, 18279, 5964, -11820, -22724, -30392, -30504, -15493, 3396, 16381, 20991, 13724, -4197, -24014, -37799, -40075, -27887, -3866, 18927, 32592, 35183, 21430, -2985, -20543, -27513, -25592, -9023, 17527, 39238, 48747, 46477, 32336, 8852, -10398, -16537, -12542, -473, 16421, 27503, 28523, 20913, 4470, -12542, -21229, -23075, -19394, -8714, 2980, 5730, -986, -9516, -19431, -27709, -25453, -16922, -9836, -2583, 1489, -3409, -13573, -21378, -23246, -17394, -4465, 8467, 15492, 19241, 16481, 1859, -11122, -13317, -10046, 566, 20711, 35164, 37612, 33275, 21869, 1971, -13549, -15677, -10793, 650, 18829, 30042, 29590, 24409, 9323, -12275, -22387, -20908, -15984, -3880, 12813]
436A2813O752m140o161j3272j9389o005P398P204J1602J5291L516m415l819q228
450h53p474L906P398K467K840K166p923r930k628m143j411J0353R096j033R23
465C754j483j0306p342P91J239L541J1771Q967o96m584j0128j4644o654M376R838
480a1560J5906J8505R727m59q702j6566j7051o702M458Q188R954J1710O269n457
494A8220j0880j0900p386j479O594J2163J0754P094K868o225j2330j0453p148
507i108k719K247N247N030L668p70p684o815K449K811j370K509J592p596q481
522a8990n731r847o316O941J0244N234N980O163R07k32k45k537O176J6245R623
537B3615M608P048J35j1665j0242p067q634J754J5639J3016M677N422j118j3874
$$ y = [12813, 19565, 15425, 9264, -4008, -23397, -29402, -22004, -14800, -3198, 12093, 15609, 11194, 7375, -853, -8327, -4421, 2977, 5444, 8284, 10450, 2527, -7403, -10031, -14174, -15585, -5232, 3864, 2831, 3754, 2271, -8035, -15377, -14586, -13347, -9806, 1965, 10932, 10236, 5652, -4476, -19120, -25774, -21398, -11560, 4346, 22851, 32578, 32119, 23417, 6851, -10200, -16902, -12444, -4256, 5698, 17408, 23677, 18220, 7340, -3560, -10946, -12425, -5831, 6332, 17086, 24180, 27048, 20823, 8493, -1960, -9108, -11827, -9580, -4333, 697, 4365, 3595, -4089, -10904, -8455, -5644, -7014, -4505, -2913, -10509, -18990, -24721, -34568, -40884, -33943, -23699, -18465, -12485, -6322, -5415, -5647, -5892, -8429, -2253, 13992, 23615, 28223, 35271, 35406, 23741, 13499, 6432, -2202, -448, 15191, 28207, 32884, 38306, 37188, 23314]
551B3314j5258j1779o777L399N814O5J93o67j0037j3499o444j430J878J0849J2609
566g770O623M629L363k833p603o575j812L952K669l17J535J555m284m991L00M395
582g164Q037J0563N885k980n213o113o674k258Q45L274J0258Q688l414n255j138
597G341m052m373N545J0087N757P674O627o102j1646j0381j4785j2728K11N276
611a5549N820Q604L754o616n358l158q295l811R082P383J518N755J942p118l540
626i587o83m715L49Q714P033N422Q998L525m389j120m76n847P96N203j966m476
642F781k155p313r625p71L690L865O732O841k81m828m785n764l730K196M959N368
658A180N413K506k939n445n301o012k690M555J0320R644O595K704n565r954q771
$$ y = [23314, 8056, -3723, -10500, -7101, -1287, -1222, -1029, -1696, -11733, -25232, -31676, -33106, -31228, -20379, -7770, -1147, 3482, 6845, 4012, -3591, -10166, -11978, -8026, -5357, -5674, -4139, -2584, -6868, -11859, -11559, -7164, 873, 11436, 17321, 14341, 9128, 3015, -3659, -5917, -5072, -1798, 8460, 17148, 13734, 8479, 7341, 3289, -1084, 4461, 14548, 20305, 27979, 34606, 28504, 16858, 6477, -8308, -21036, -20825, -15549, -9729, -1125, 2629, -3987, -9345, -12503, -20798, -24609, -15527, -8144, -6626, -871, 1071, -6047, -9587, -10270, -14985, -14636, -5922, 1111, 6533, 15531, 19056, 14667, 13547, 13071, 7224, 8020, 13223, 11257, 6781, 4626, -2687, -12312, -13083, -9393, -5528, 1204, 8045, 7764, 2936, -1849, -7613, -11343, -9147, -4188, 1180, 6593, 9099, 6160, 715, -4586, -10598, -13288, -8733, 1587, 11231, 17826, 20530, 14965, 5011, -3760]
673c760o768l870K855Q276O838P81j474l425p296l850J066L375M946O291K892
688F877p30j694k664m252j767K176J649K003L866j154l234M12o86l008J781M760
704D335O40m13Q68m020o419j764j30n46L815N673J574O95r17o254n021n81L55
721h110K607P001O358J527j96k381p273n533o60Q23K939P012M805R39j553m965
737C340n950l525j80L31M199O049K598r29j863l967n797k155P11J573K604K026
753i35M09j506j912j306O28K042L115L742K669M09l144k125j659j578J048L883
769C780K529O42l35k651m270l560l87K263L922M006K164l34l158o589o139l223
785a1340j962J760M988M510J987R89n8l077k824Q9J723J665L526L299J187r85
$$ y = [-3760, -10528, -14398, -11543, -3267, 3571, 4352, 2878, -547, -7843, -11693, -10627, -7252, -2306, 3985, 6877, 6147, 4453, 1789, -2463, -4230, -2054, -405, 1598, 5464, 4310, 1076, 1488, 802, -2206, -425, 4335, 4975, 4562, 5430, 1410, -5009, -6773, -6903, -7449, -3634, 2039, 3613, 4308, 3391, -2863, -7884, -8465, -8110, -5503, 1498, 7856, 9383, 9187, 6806, -467, -6000, -6660, -5837, -2898, 4114, 8919, 9858, 8305, 3340, -2610, -6135, -6315, -5984, -1785, 4264, 6862, 5933, 4070, 103, -5694, -7849, -7138, -5565, -2961, -935, -526, -2032, -3944, -5250, -4622, -2580, 535, 4277, 6946, 7355, 4211, 2086, 427, -1151, -103, 3780, 6309, 6951, 6616, 3965, -305, -3865, -4252, -1989, 1933, 5939, 8103, 7769, 4611, -1978, -8117, -11340, -13302, -11542, -6554, -2044, -57, 932, 874, -2203, -5027, -4938, -3215, -1550, 1976, 5275, 6462, 5477]
801E477l542m093l038j244PK326L082L014J556O57l76k643j532R20O09P07J286
818C173j84j605j860l07Q81J842L024M046K351J488j080k733j986k380j610q4
834B976R80j722k404l238m141n025l036N81J551L026M656K264l38k132l544k955
850a2501j613P97L030M371M060K338N99L56q07K31L292M679L533L666K842o86
866A8187l624l148l135k897j532O69p4k98k94j217q12o6n80M30J175M00j000j407
884G77j594m045l014K68M07o5K217J801k41o46j9j532l70O31J914J468J403n67
902a207k579k388k814k632P62L211L241L651M644K614o00k41j36j372P93K352
918G299K259M41R11q00k643k361j714q78P81J715R70M49l14k160l354k708j844
$$ y = [5477, 1935, -2158, -5196, -6440, -6433, -4107, -1025, 1989, 3545, 4202, 3826, 1183, -349, 571, 1180, 1887, 3173, 2989, 1384, -476, -783, 98, 1940, 4964, 9010, 11361, 12849, 11769, 9036, 7050, 4670, 3060, 2976, 3956, 2234, -170, -3408, -7549, -12574, -15610, -15029, -13478, -10452, -5796, -3532, -3870, -6002, -9546, -12501, -14114, -13317, -10287, -5916, -1856, 482, 1081, 1437, 630, 861, 4153, 8832, 12365, 16031, 18873, 18187, 14563, 11415, 8280, 5383, 3851, 4520, 4446, 4148, 3854, 2637, 1825, 1759, 1179, 1609, 2784, 3184, 2184, 777, -817, -4862, -7876, -7608, -7201, -7266, -5049, -3248, -3489, -4135, -4154, -5686, -6056, -5425, -3511, -2043, -640, -1207, -3786, -6174, -8988, -11620, -10858, -7647, -4406, -755, 3889, 6503, 5903, 5662, 5526, 4154, 4947, 7299, 9558, 9999, 10910, 10110, 7467, 5106, 3392, 2514, 3295, 5010, 5980, 6429, 6115, 3955, 601, -2107, -3951]
935c951k434l26R82j318j179m37o71l84J356K519K520J725K150J111j094j103
951e34k43j189M30K159J516M14Q68q87k014p96K44n60R95L676R79n49k4k316m437
970b268j409M83p69N8L269Q45q34J696k30k608J227J473j368J949L011j161j230
987B134P86k579l457J609J558j968J270L461j851k006J641j206j524K677J454
1002A999k259N97N74k723q33K029j551o41L569K43k534K490J354l515q49J942
1018a08j465l86K933J424j642L12j15l583j039K122M04P83K814p99j151J077j295
1035B86k331O27K166n03k22J891J07q14K85M94j968n49J170N31p1R61O73j494
1053A239j233l91j023O69J901Kj049M97q74j532K9J398k14n61J849j01k105N51
$$ y = [-3951, -6385, -6711, -5729, -7047, -8226, -8663, -9334, -9718, -8362, -5843, -3323, -1598, 552, 1663, 569, -534, -777, -1966, -1536, 623, 2139, 2553, 3421, 2534, 520, -276, -32, -592, 403, 4079, 5058, 4509, 4485, 2169, -2268, -3677, -3194, -3963, -3905, -636, 209, -625, 1071, 841, -1767, -540, 933, -435, 1514, 4525, 3364, 2134, 2920, 341, -3116, -1507, 51, -1917, -647, 2814, 963, -1043, 598, -608, -2132, 545, 1999, -260, 337, 911, -1812, -2645, -616, -2167, -2808, 761, 1004, -1530, 960, 2314, -1201, -2050, -108, -1573, -1959, 974, 2398, 756, 1068, 953, -2630, -3669, -1547, -1143, -360, 2454, 1655, 504, 1581, 286, -2045, -1418, 748, 245, 23, 1914, 2021, 1207, 1492, 1986, 18, -531, 639, 1170, 1099, 2060, 2733, 1239, 6, -385, -1408, -739, 1162, 1164, 115, 612, -262, -1794, -1765, -367, -581, -1142, 707, 606, -1499, -948]
1071i48J091k172MJ866o9l49J756n0j364Q62m5l041O59L181j167N70K919j384
1089B319l487J222L77k787R67L504j323o99J757j008k255J395k25j933J480J700
1105A004j937N36J707k285o27K476p09j843J978R90j802N68K131k243j421J969
1121D92l49j177J793N8j250OP41j364k61J751k29K4J388p68j507Q52M0r44J50
1140e54O10o53K89O60n8M9J2k81k13O43O54L37R22l1j299m56q85j295J71R42N52
1161A16J47J18k87n6O2Q4n8L79j92q56J69n41j604j79K96j014M6O88M69N84Q71
1182g58P65M61o2L90j68M55P20m32j86m66j047k19J495M30L55J411R52j97m42
1201C457J18n40j096n78o94r93j022r00p64j90k91J95Q58N70J037J376J095o6
$$ y = [-948, 143, -2029, -2025, -159, -228, -577, 1179, 1129, -235, 627, 582, -2459, -1800, 1381, 214, 784, 3703, 2319, -1168, 54, 431, -2356, -1389, 2115, 792, 93, 1850, 842, -1413, -18, -243, -2176, -696, 1004, -933, -397, 1310, -975, -1602, 874, 165, -1678, 300, 1290, -512, 56, 2187, -56, -1477, 492, 143, -1034, 759, 817, -433, -427, 314, -1050, -1311, 440, 211, 235, 1623, 855, -652, 200, 240, -704, -554, 56, -597, -308, 352, 294, 343, 355, 74, -139, 504, 1158, 1495, 2417, 2386, 1087, 631, -254, -1549, -1378, -436, 116, 263, 381, 94, 38, 100, 184, 126, 505, 313, -543, -374, -915, -2519, -2698, -2402, -3416, -3370, -2682, -2213, -1629, -758, 7, 468, 406, 796, 628, 1083, 1803, 1371, 1185, 719, -328, -547, 948, 1378, 1733, 3144, 4096, 3899, 3457, 3575, 3035, 1939, 1361, 667, -326, -1348, -2248, -3012, -3202, -3493, -3298, -2440, -1870, -833, 543, 1638, 1572]
1219A572K46k77q68r44l87p23n55O7k84R7R90K76N48J281M27m26K61J6j142q78
1239g03q19j241j458m50j05k27J059R07P96J424J666R15J226J187p5J4n2p29j800
1258A535q56p2q60k42J249K90J48J271L04K46Q08n8o66l96p86j190j492r65r49
1277b681p81Q21O80K99J304J390R22L50M78K49o59j201r97j437j774j749r59j053
1295f798n46M31M98Q64R08Q67J313P92M75Q09J69j84m60j95M46j61R12R75J617
1314B732J361K164J886J439M68N61J94m62j199k073k138j928j937j824q07q74
1330b437o29k08L05k3o6O43o0l34m36k55j250j196n46n76J2L22R62J002J302J349
1350b119J480J028J323N90M29K20n58j113m01q02m17n31M50M98L63Q58J224Q51
$$ y = [1572, 1818, 1541, 673, -271, -658, -1381, -1936, -1869, -2153, -2056, -1066, -790, -242, 1039, 1466, 1040, 1301, 1317, 175, -703, -1522, -2763, -4221, -4671, -4776, -5003, -3944, -3037, -2241, -817, 849, 1764, 2990, 4177, 4102, 4116, 4064, 3335, 1535, 679, 607, -253, -495, 754, 1044, 1192, 2463, 2767, 3013, 3821, 3763, 3097, 2701, 1915, 725, -767, -1732, -2681, -3462, -2641, -1961, -1662, -358, 1032, 1954, 2304, 2782, 3031, 2372, 1171, 174, -1263, -3037, -4786, -5745, -6798, -7344, -6913, -6415, -5551, -4643, -3776, -2463, -1671, -1196, -387, -218, -402, -862, -1057, -611, -772, 140, 1115, 2732, 4093, 6257, 8143, 9582, 10050, 10611, 10805, 10343, 9144, 7071, 4933, 3005, 1068, -756, -1563, -2437, -3066, -3274, -2969, -2992, -3058, -2415, -2475, -2809, -3245, -3500, -4750, -5946, -6492, -7068, -7056, -6734, -5772, -4770, -3468, -2119, -639, 389, 1712, 2302, 2731, 2951, 2393, 1280, 879, 77, -340, -871, -421, 77, 440, 1298, 2522, 3373]
1368C373Q33J170M96L87j22j013o30p04j174j054l80o89o55K19N02n25m02L04
1386f4l68r23O2j170j026r95q34p48n51N3K19M67J112O07J103J374J063M99J539
1405A419J021J33L8L84j01p70n4M4l53K74M29K31K17kJ70n03j74k94p82m75p12
1426A40j008o43k56m48m50K50L91q9N20J263J47L64M61J59j04n25L75n6q90j69
1446e68L5l53M28l9k02L68K64m8o3M97j38p67M41M09q14K6L34n05M3N87j48l01
1468e14N15K76r4L81P99m76J35K17n35l83O17k85p90R21L9p27K3j37n20n98P73
1489c63m2j82l4O73l57j49L17k57K56J09j96L4K03n61m9M38j58K5K01N55k94J61
1511C30M61K78j93J03j85j17j74n10r6Q2r53j81J02k24R8Q76P40k15j81N55o60
$$ y = [3373, 4206, 5376, 5872, 6259, 6137, 5124, 4494, 3790, 2616, 1562, 1182, 493, -162, 57, 559, 34, -368, -64, -432, -1355, -1293, -2463, -3489, -4484, -5318, -6066, -6617, -6564, -6345, -5878, -4766, -4159, -3056, -1682, -619, -120, 1419, 2440, 2573, 2611, 2995, 2894, 2124, 2070, 2114, 1761, 2035, 2464, 2695, 2912, 2910, 3080, 2577, 2403, 2109, 1327, 852, 140, -868, -1511, -1767, -2215, -2665, -2415, -2024, -2113, -1593, -330, -183, 181, 642, 801, 697, 172, 547, 491, -399, -568, -533, -886, -458, -497, -699, -331, -67, -115, -178, 319, 181, -586, -145, 264, -550, -524, -190, -695, -652, -65, -213, -514, 1, 277, 183, 564, 1363, 887, 1022, 1239, 704, 321, 938, 653, -137, 784, 823, 96, 119, -18, -538, -1136, -363, -405, -587, -621, 52, -305, -454, -137, -394, -138, -29, -225, -191, 12, -549, -598, -160, -318, -293, -92, 463, 169, 330, 791, 1069, 876, 979, 794, 677, 503, -7, -103, -21, -974, -1155, -1053, -1277, -1179, -303, 437, 222, 41, 596, -64]
1532f4J28M61k87j32N29j019QN33K67n48M11M16n69L79J262k52l98J028p66j401
1552a4l18j39o20Ro8o60j73P59l05K43J320L13o63K86L06p63j73R62n44p37J9
1573i60N6l13Q81N37o3O27L7j12K05P23q7m31K41q13j221j6k4m7L24K92N72o9
1595C39P7J223J21L80k08Pr3o29K11k69m91l32m62r59R6K80J02J98N06n57m98
1616i58j0m37j114J64k5p78r55O36l06LJ355N43q8Q62J172k08O38J260Nk95J236
1637B700k91p58Q43K47r46M44J018r64J46R29J22p09O91l73j779j6M9j152o55
1656d54K02p23p78P61o09p07K94Q1o78K35K68j0k46M07n69m28K59k7o07J78P33
1677b418r1O05P95M16m2O43L70J34M01L85K11K73O57L7k06M42K40J15J89O4l79
$$ y = [-64, 64, 525, 238, 106, 635, -384, -376, 157, 424, -124, 287, 703, 134, 513, 1775, 1523, 1125, 2153, 1387, -14, -332, -471, -1091, -1082, -1150, -1810, -1983, -1224, -1529, -1286, 34, 347, -316, -30, 276, -487, -660, 302, -242, -979, -960, -904, -1217, -336, 201, 138, 765, 802, 690, 895, 1618, 1531, 1100, 1341, 528, -693, -709, -733, -780, -456, -164, 408, 339, 416, 1639, 1760, 2140, 1932, 1939, 1846, 1217, 1428, 1159, 668, 336, -126, -1085, -989, -709, -607, -409, 97, -460, -958, -968, -1405, -2519, -2355, -2380, -3158, -4113, -3477, -3783, -3780, -2425, -1882, -1970, -1108, 64, -144, 494, 1754, 1759, 1464, 2700, 2409, 1651, 2494, 2741, 1795, 2239, 3257, 2293, 2439, 3368, 3490, 2781, 3472, 3099, 1320, 1304, 1353, 201, -454, -252, -975, -1753, -992, -1601, -2308, -2014, -1933, -2611, -2376, -2108, -2118, -2364, -1957, -2526, -2954, -2695, -2722, -3329, -3151, -2418, -2509, -1904, -1109, -693, -735, -92, 278, 412, 813, 1198, 1409, 1682, 2339, 2376, 2170, 2612, 2852, 2967, 3156, 3220, 2841]
1698B841k65J01K6k65m06j93l74o89j49k84o60o98P7k70l67J01k97k17J42l54
1718b200q81L78K21j66L03N67M51j39L79K34j66M31J92K00K73M59J84o8K16N8
1738I26M5P3K25j95L73M62m85j03K22k79l80J07Rp82k22J35k31J12J16K82j28
1759B82L90l6l64j60j08k64n5n8K12m0P1K20k40J91j9J02q9K92lm1J84j24k60
1782H3p35m89l5K93q27M51L70j17L05P35k36K0l03r4j19M9n3j70M57K48j73M22
1804H2r5j23O58P6M51j58L36J63p8l2j00q7m55j34l37M2KP8K46K82J42p1J21K2
1828A031m80k37j90j39k71K3J33n15j90J82l71j36l0J34J00J55M00Q8l15l09o
1849i43k82J13rj87L88L2L08L62M99K29L18J02m5j91L47k1K28k54J01k20j07j49
$$ y = [2841, 2576, 2677, 2703, 2438, 2032, 1839, 1465, 776, 627, 343, -317, -1015, -938, -1208, -1575, -1474, -1771, -1988, -1846, -2200, -3081, -2703, -2482, -2648, -2345, -1778, -1327, -1466, -1087, -853, -1019, -588, -396, -196, 77, 536, 720, 652, 868, 926, 971, 1044, 1269, 1074, 1447, 1909, 1424, 1321, 1543, 1264, 884, 991, 1000, 218, -4, 131, -100, 12, 128, 410, 282, 672, 636, 272, 112, 4, -260, -315, -373, -161, -201, -130, 90, -150, 41, 22, 124, 35, 327, 324, 283, 467, 343, 83, -652, -1141, -1176, -883, -1710, -1259, -889, -1006, -701, 34, -202, -182, -485, -579, -698, -649, -702, -872, -415, -167, -340, 82, -13, -136, 522, 598, 1049, 891, 1227, 1390, 1312, 1280, 1180, 1093, 638, 504, 167, 209, 211, 289, 535, 817, 959, 888, 1009, 1031, 551, 314, 124, -15, -286, -263, -130, -645, -835, -653, -1024, -1160, -1190, -1056, -956, -801, -401, -313, -628, -937, -943, -1225, -1112, -1121, -1308, -920, -888, -580, -218, 281, 510, 828, 930, 885, 694, 1041, 1020, 1248, 994, 1095, 875, 768, 619]
1871F19j7k68L8P8l61L88J7r5l40L20n06j21l13l38k89j07N68O8L03j5K47R3l2
1894f3jP2j09J3K58O30m46J17k18k41j87K2k31K31n4O3N30k5%L8m09K19m16q5
1918b92P1j61J21K70n0J80O5k26J74j8M0k66L10N9n3L44q5k81J53J04k82m13j13
1941c49J21k10L96L29m52J63k04R4Mj28j15R2K70J8L70j38J61m44j92l4m16K33
1963d31J11K98J1J44M7J00n1J38m42J26j79k7J37j58j64K81l17N6J65l46J12L75
1985a4O0j07O58J65k64m7l31Q7k14l20k71k21L33O17k38K80O23m00j06J21l80
2006C1j47J11r5l27L87p6o52M6L47l75k6K95M46pM51M28n16K97O6n92m77L40k89
2029c34n57O15K98l37N93M08l05K95R1L2p05M03q1l16L17j05k71m37j30n8l82
$$ y = [619, 602, 334, 372, 450, 89, 477, 494, 399, 59, 379, -127, -248, -561, -899, -1188, -1295, -727, -659, -356, -371, -124, -31, -63, -64, 8, -101, -88, 170, 800, 354, 471, 253, 12, -175, -153, -384, -153, -207, -144, 386, 361, 361, 399, -10, 209, -207, -292, -221, -382, -261, 9, -41, 139, 204, -22, 152, 134, 174, -92, 218, 277, 224, 568, 483, 202, 355, 459, 177, -236, -349, -228, -438, -42, 287, -165, -2, -206, -112, -108, -236, -351, -259, 11, 29, 399, 261, 422, -22, -214, -248, -664, -431, -320, -22, -11, 133, 180, 280, 229, 367, -75, 51, -128, -155, -18, -176, -340, -59, -376, -320, -155, -501, -389, -14, 46, -61, 597, 762, 498, 451, 120, 207, -7, -327, -598, -819, -486, 131, -107, 173, 796, 396, 290, 411, 31, -116, -5, -100, -427, -40, -116, -768, -722, -375, -750, -776, -481, -35, -42, 409, 837, 321, 618, 684, 92, -385, -45, -334, -891, -276, 22, -315, 278, 686, 381, 676, 767, 799, 94, 497, 416, 100, 417, 312, 41, -396, -526, -584, -966]
2050i66O08M53LP34p4J66N2l6n96n86K87n31n95M29P1j82K72J42kk90J10P3O2
2073c96k2m6o4r4l78J84k20j69j86O94j45M31N67L11O49O89j38l05M34l52n02
2094I42o0L06m65oK57k60K72j11K49n15N79m68m92J41M6k76m94p0r72m80J26l27
2116b078k92N16O88k75L18Q73m1p8J53j74n26M16n20k69K85L06J63q6L62M1M52
2137B34M25K72J62L45L00k00J35j46k00l60po53M3l2L45L99K82K87k18j82j71
2158A060l76k82k09l87n43l31r1p3k86j53j85L5j46L16M15J11K32N81j17n43K77
2179f95k40%Q7K92k14M91P39J04P09N08k2j93J53j99k70J86J28m57l21J13r1n97
2201B11J44j77l11L33l5j28K17J84m47j99K67n15p23J64k04j24K24K86J41J95
$$ y = [-966, -358, 95, 98, 832, 758, 924, 976, 940, 344, -242, 45, -486, -1081, -652, -581, -763, -491, -349, -351, -641, -531, -458, -396, -418, -464, -528, -622, -1000, -816, -1036, -1205, -1391, -697, -842, -411, 156, 467, 1116, 1805, 1667, 1362, 1796, 1444, 942, 882, 1188, 723, 717, 974, 714, 986, 875, 1124, 609, 1188, 720, 228, 369, 415, 139, -355, -425, -1397, -1877, -1751, -2078, -2370, -1854, -1166, -1441, -1123, -250, -291, -369, -216, -390, -916, -500, -1020, -1289, -1004, -698, -535, -621, -259, -218, 234, 659, 931, 1093, 1438, 1738, 1538, 1673, 1527, 1327, 967, 960, 307, 350, 318, 663, 1062, 1344, 1631, 1413, 1231, 1060, 684, 402, 193, -194, -737, -1068, -1159, -1232, -1518, -1671, -1856, -1821, -1967, -1651, -1236, -1125, -893, -312, -429, -972, -695, -935, -935, -848, -556, -770, -279, 460, 564, 1273, 1781, 1759, 1566, 1719, 1520, 1250, 1436, 1564, 1107, 786, 899, 808, 211, 355, 178, -133, 200, 165, 37, 254, 438, -9, -208, 59, -456, -1179, -1015, -1219, -1343, -1119, -833, -692, -497]
2221d97L61k3r0M15j46m88L04o5J60p1J4J1L0J5q4QJ1L23R2L79M60k0k27j24j26
2246F22m91k65L16l62K06j31J57J34m6j1J06k38j98J80l8k54K47j10k4Rl11J0
2268d92j67O3o4N06J70j99M04M08k77M3j39P2l00K93l08l9J70l2J30P9k08Q5l76
2291a78J61k2q4K62k76L63l62k6ml25J80k07J99r8m3K90%K34J43k88L4o0k0k3
2315a50N7j15J68K94j6J29k4o2k35L4P7l47J65J56N9K7j00O6j7k06l52j49M20
2338a21P5J24k8P3J54k35j38Lj33M1K62k71K91L2K99k97J56n34L50m05J33N5q9
2361b03J37J5K75P2q4l06o4K0n9N9N5k18K70K31j2j14n6J49j51q2j52L58J64m9
2385B55N9P0k78j19P9N9l55j53K77r4K17K46l31J35j51j61j04K18L0o6J11o6M01
$$ y = [-497, -136, -159, -249, 166, 20, -468, -164, -229, -69, -140, -126, -115, -85, -70, -154, -146, -135, 188, 280, 659, 1119, 1099, 872, 748, 622, 131, -134, 182, -180, 26, -105, 52, 186, 140, 129, 235, -3, -201, -21, -59, -313, -66, -176, -200, -191, -502, -492, -659, -596, -660, -154, 16, -183, 221, 629, 352, 395, 256, 328, 28, 321, 13, -26, 144, 112, 242, 321, 113, 198, -178, -17, -39, -123, 139, -137, 226, -136, -162, -166, -491, -311, -518, -319, -417, -460, -170, -170, 64, 207, -81, -47, -107, -127, -150, -93, -208, -40, 254, 238, 367, 343, 281, 46, 80, 157, -190, -25, 131, 190, 217, 117, 183, 166, -40, -392, -541, -121, -46, 78, 50, 123, 277, 42, -96, -93, -226, -185, 77, -194, 97, 129, 428, 131, 287, -247, 103, -302, -169, -114, -203, -66, -51, 224, 296, 212, -94, -158, -138, -197, -138, -83, -301, -31, 200, 188, 74, 18, 167, 16, -66, -218, 140, 304, 255, 314, 384, 106, -13, 66, 125, -230, -383, -106, -200, 17, 263, -68, 67, -84, -245, -349, -131, -101, -167, -56, -122, 279]
2408B79MJk79k3N8O2k7K1J95j80J41j06PK53n36O3j68K14J1L0O4K24l76J09Nj48
2434a02J13k34J15P2L4j26L95l72j0K68l99M8j22L7J7K14j0o8L7J38k90P2L00
2457A27k82q9J40J62k9J57J47j77m0m6M4k22j39M67m6N6J24J73k9K06l15j55Q2
2480C16l9l53L59L9k49M4k15k07Q4k9k4p1J76N7j34K77j8m1k8j8l38o0k74R8M34
2505b14K01n9n9K70l9k67M59J77j20k94J82J17j99J06J6j31j97j6l41M63Q8L19
2527D62l38J24l2P3l5O3l59l82K5L0O7Q3J7M22j76J48j58M2n8j85M77j50lm1l9
2552G7k86j2J9j11n7J5O0K85K01j81K39J16k83j66Ok80o5L83k77j53J40J81j3
2575a62J05L09l70o6K04J79j3RN7l82L05l39p2J04J26J19k52K93J81oO0K9j87
$$ y = [279, 283, 284, 5, -18, 40, 102, 75, 96, 291, 111, 252, 146, 153, 406, -130, -67, -235, -21, -10, 20, 84, 308, -68, 41, 46, -102, 11, -223, -108, -36, -2, -128, 267, -105, -115, 153, -246, -198, -320, -283, -266, -52, -62, -130, -93, 45, -245, -173, 127, -155, -244, -104, 58, 29, 186, 333, 156, 116, 70, 114, -108, -247, 220, 174, 230, 354, 527, 498, 704, 389, 234, 316, 277, -76, 283, 322, 73, 117, -98, -305, -221, -250, -274, -345, -169, -112, -246, 31, 13, -28, -56, -74, -412, -472, -746, -648, -214, -13, -72, -131, 139, 100, -167, 292, 469, 349, 55, 237, 354, 155, 261, 277, 146, -51, -67, -408, 55, 143, 462, 124, 248, 216, 289, 254, 317, -42, -424, -399, -369, -302, -219, -202, 220, 44, 192, 34, 76, 18, -167, 310, 160, 157, 116, 77, -209, -221, -202, -313, -370, -355, -295, -10, 191, 10, 249, 365, 82, -84, -78, -358, -423, -40, -317, -470, -330, -149, -162, -57, 252, -118, -184, 20, 199, 186, 195, 252, -130, 175, -164, -236, -132, -6, 113, -139, 154, 335, 329, 389, 418, 231]
2598B31K57m8r5l00K87k75j52N9M8j99N9j60J40m8O7K5r1R9L3Ml03J00k57J2j91
2623f98K00L6L6m1M23P5J0j6J62j70J15k21J88M4K16L8m02P3q2J76j21J30O4L8
2647B73K8p5J93j95j1o8j70o3k61L18r3j15j27J99N9j23K32P3j33k7Qn1PK26n5
2672D9j20J76m48K87P2o9k17L56R2k96O1K99Q6l58J90rl58j30J29N2R6k4j03J33
2696e4j24L75r4J0m6k82N09l69N8J82j05K04l93K16k01P6J27o8L4K85k40J68m01
2719a33J61P3r4k7NJ05j37J70k32R9l17J88o9J17k09K17J0J98j16J5K37j95j63
2742i7J92q4J64k88K4P6J37l34K24j91k42J48K93j45kL23qM9m3k6Q7j37p2j52
2766a04R0P8O7J32l14K49N2Nj80p3oK8N6j21j03J42k27m1%J09l5kJ39K25m0k73
$$ y = [231, 488, 440, 345, 45, 332, 57, -95, -36, 12, -187, -128, -288, -148, -196, -129, -104, -195, -96, -63, -59, -362, -262, -519, -507, -698, -498, -462, -426, -467, -44, 31, 41, 25, 187, 17, 132, -89, 99, 143, 359, 397, -5, 68, -14, 162, 41, 171, 235, 273, 301, 226, 419, 224, 213, 145, -25, -88, -349, -31, -124, -239, -366, -167, -108, -231, 1, 74, -59, -86, -78, -129, -122, 104, 49, -71, 105, -343, -56, 16, -53, -270, 86, 178, -118, -57, 242, 328, -30, 160, 151, -207, -337, -208, -156, -60, -84, -187, -54, -178, 197, 103, 113, 67, -215, 294, -75, -17, 165, 60, 264, -129, 87, -114, -38, 89, 21, 55, 340, 100, 268, -133, 28, 101, 7, -20, -15, 90, -47, 123, -109, -10, -327, -139, -208, -91, -300, -83, -73, 125, 9, 24, 261, 66, -97, 95, 11, 175, -113, -89, -13, 124, -210, 14, -177, -419, -271, 22, -123, -125, 198, 190, 239, 196, 170, 257, 120, 48, -104, -14, 64, 131, 263, -51, 198, 250, 255, 75, 2, -4, 24, 80, -41, -144, -2, -229, -270, -270, -161, -196, -198, -59, 166, 126, -147]
2792a47K85j66K4P9l6m39K28r5J14J9Q5M24k63J37R8n5k4l0J3l04K07k63L74k70
2816ej38o0j26K65j48R9J25m4L54r5k12O6j2l67K22m9n0M2k29K19NP7l3K51p3
2841H4n6J27j10n9n7M1j84j59p3J23j25K86j51K62J69k99K72%J46Q0l20K74j24
2864A47P7p9M1J34j3k5r0J96R7l15L27k52m0j42O6l15L37k85mK65k86j04R1P3
2888i9l02L38o2M1K98k74J57j64J13l38r2j43J92p5J62r3L12K3O7k54M40k09R8
2911A36j18P1JL92k10K2k6q5Lj69K99l39L09L18m22L03j96j26n0K20r7m4k99N5
2935e2J0K17m67M11k17j87K30k03P5j37mM0J22j90J38K7j79m6m6M5L94j14K3j3
2959a23L48l16L03Q0l76L62K8J24j97M9m2q4L4R5n8k2n3q8J54L1J58k84Kk74k9
$$ y = [-147, 138, -28, -4, 75, 39, -400, -172, -267, -153, -134, -49, 375, 112, 249, 347, 292, 268, 238, 251, -53, 154, -109, 265, -5, -143, -203, -329, -64, -212, -113, 12, -32, 322, 227, 15, 81, 69, -298, -76, -125, -175, -133, -362, -143, -138, -61, -94, 157, 84, 28, 155, 45, -14, -71, -30, -214, -373, -446, -323, -448, -162, -313, -51, 118, -181, 91, 91, 237, 317, -3, 271, 147, 224, 145, 186, 320, 307, 282, 192, 388, 485, 170, 497, 245, 205, 63, 129, -186, 151, -134, -138, 127, -159, -263, -172, -99, -401, -63, -125, -84, 214, -60, 97, -67, 46, -292, -384, -527, -335, -410, -248, -341, -29, -6, 61, -193, 247, 38, 136, 18, 89, 90, 482, 272, 294, 268, 183, 186, 17, 316, -23, 286, 604, 182, 485, 289, 163, 113, 333, 236, 192, -107, -52, -42, 175, -292, 119, -98, -285, -55, -258, -183, -320, -324, -284, -162, -352, -214, -187, -366, -412, -458, -413, -19, -133, -110, -123, 225, -91, 212, 292, -84, 278, 306, 430, 233, 282, 240, 156, 190, 285, 227, 205, 152, 64, 218, 249, 407, 123, 125, -149, -178]
2984a78M73m93j25K88R5k47l8j51L21L5k38qj32L59k72K39j27R0j6J61j30R6J35
3007A37L1j84kj79N21k88Q3j50J07m7K28j68r8J29l24M07n2Nj77L04p7m68J69
3030i3J92j80L96m66J82o2K4M1j30J01J11k04J08l4J41l52J59R8K10m22R3j45
3052b32J28n8J43q2l65M03M5K10r1j58q9o7J70Q1l40L46J19K31n42K88r1J32l64
3075a83K75N6l06K62j08J63k30J93j97k4K54j75N2n4n9J76R6k53qJ42RP0j55K29
3099B25k55mJ37j23l7J1M7k18J34Q7q4j9K8j38J21ll03N50j55M4l35J97J88po5
3124B3O3%j60J06L55o49M82p5j34q9J73k15o6L86k86K01m10L01k0m7Q6j33J68
3147F0J31l02J42k74Q7kk7m6K65k14J8j36K79L3J30j06K5K01l33K51k06O3k23
$$ y = [-178, 295, -198, -323, -35, 60, -187, -225, -376, -55, -20, -258, -266, -398, -39, -311, -72, -199, -109, -125, 36, -94, 2, 137, 168, -16, -18, -197, 324, 36, 119, -31, 76, 29, 257, 89, -9, 120, -204, 203, 151, 156, -21, 283, 206, -262, -93, 99, -81, 315, -151, 31, -31, -7, 34, -96, 5, 116, -88, 20, -14, 127, -225, -66, 32, 242, -180, -87, -232, -104, -162, -19, -101, -466, -63, -18, 192, 101, -57, -146, -213, -43, 38, -302, 44, 163, 394, -148, 140, 49, 181, -183, 92, 148, -158, 104, -4, 159, -71, 122, -75, -99, 155, -20, 32, -22, -81, 95, 191, -62, -70, 72, 81, 151, -4, 225, -30, -34, 103, -20, -57, -46, 1, -217, -83, 4, -80, -99, -71, -209, -88, -91, -394, 156, 1, 45, -290, -93, 95, 88, 23, 86, 86, -74, 32, 387, -262, 220, 145, 11, -78, 95, -120, -186, 200, -86, 115, -295, 6, -14, -61, 25, -108, 60, 191, -111, 31, -243, -156, -158, -185, -231, 34, -180, -162, -298, -19, 14, 144, 38, 63, 264, -69, 182, -24, 39, -184]
3170a84J34K74k69K91k79J86j63P0J5k38J41J93m13L51l06L32n1m6J12J38j79
3191A09j39j45Q0J53R1j80J04K11k86n6j07P7K18j65P7j35j45M12j92M2J29n0
3213A03j02J65M0l73P9L63l68J30O2j57k16K58k9J97k18J23J77k04J45Pm19k4
3235b61L87j89j49j7j17L64l81K77N5K1l9K52%J93k06j53J43M0j13k7k46J13J31
3258G8r0l6j68J85p9J41Q6j02O8j40J83M7m15K69j58r5J95P7r3L1N2j10J91j32
3282a5J85l0r7l21J40K1rK17O0p2j38j87L01Q3K4j2k53L03j23J18o4r9j8K22k71
3307c5r3L5J98m30P35n42J57R4k1J44j96j13J25k19Q2J40k37K45j24J56j66j64
3329b29J02K16N0j44J7J44k49N0K82l25N0l17K68K2M6k07J87m31N24Q9M5j75K89
$$ y = [-184, -50, 224, -45, 246, -33, 153, -10, 60, 75, -163, -22, 171, -242, 109, -197, 135, 84, 38, 150, 288, 109, -30, -175, -95, 58, 149, -31, 73, 284, -2, -58, -165, -88, 130, -35, 42, -93, -238, 174, -18, 24, 153, 103, 1, 166, 206, -167, -88, 275, -93, 37, 99, -58, -274, -16, -45, 152, -66, 57, 234, 30, 175, 182, -237, -261, 126, -63, -212, -229, -346, 18, -363, -86, -31, -10, -49, 203, 203, 396, 190, 37, 180, 220, 107, 80, -166, -53, 78, -12, -48, -216, -31, -110, 31, 117, 15, 83, -57, 126, 173, -242, 27, -131, -226, -31, 46, -47, -16, 36, -74, 117, -15, 170, 140, 43, -278, -138, -117, -126, 91, 151, 79, -59, -246, 55, 138, 162, 150, -103, 200, 77, 195, 131, 32, 14, 236, -35, -128, -93, 105, -325, 410, -132, 25, 119, 98, 242, 46, -67, 58, -161, -79, 61, -176, 69, -55, 101, -65, -229, -127, 89, 139, -5, 12, 156, -93, -43, 239, -86, -36, -353, -85, -63, -17, -224, -37, -468, 56, 145, 190, 15, 304]
3352C04q6l14J67j39J96j08q6L2J07j11p2K17o4LJ52k8J30k73J33n5J12k9j91
3375cJ91j42j04pK69j67j39N2J71J06L6l71L21m68J15J09k54P1j15O0o9O7K82
3398A1j61J7j17K39m6J33k54J70l59K15J54k8n5K30j32j80J30J79Q9j77N1L44
3420D53k33l3P9k5j54jK59m43K05p0j90L53l35J15J9r4J72Nm0k99P6j0l9N2j17
3445b95J85J27k37P3K01q9n4q3J74j12J76k15K43j96J27L3M9J24j00j7k9q7M5
3468D3j9q5M2J45j73K8pp2K10Q6q2J38j83O3r3R5J47l47k1J35m5M0k35L13J0n
3494A28l4k63J53k2J36K1p7k12K40m9J0q6o4N2r5J32m8j41J65J50rp0J67K7j83
3519B8N9l5J6r2L16l15K09l68J80P2l7j05j87L49k02J20l78M00J19j42J44k13
$$ y = [304, 218, -96, 71, -68, 128, 20, -66, -34, 73, -38, -110, 107, 43, 46, 198, 170, 300, 27, 160, 105, 217, 188, -3, 188, 46, -58, -65, 204, 37, -102, -50, 121, 227, 263, -108, 213, -255, -140, -31, -285, -214, -329, -269, -338, -271, 11, -150, -133, -250, -11, -57, 76, -178, -8, -367, -152, 2, -26, -81, 149, 17, -163, -33, 146, 235, 58, 109, 453, 220, 187, 266, 241, 87, 86, 345, -98, 107, 37, -153, 200, -135, -20, -1, -95, 77, 82, 42, -257, -181, -191, -230, -178, -295, -110, 17, -220, -147, 54, -35, -89, -172, 2, -110, 66, -149, 94, -102, 25, 58, 107, 231, 131, 114, 85, -2, 43, 24, -61, -19, 126, -47, -19, -26, -98, 112, 198, 116, 254, 71, 134, 41, 136, 283, -64, -85, 50, 5, 45, -190, 123, 133, 128, 94, -169, -16, -38, 98, 119, 42, -170, 70, 21, 31, -55, -119, -67, -162, -30, -78, -219, -54, 96, 87, 17, 184, 211, 28, 87, 52, 68, -24, 292, -23, 186, -182, -2, 70, 33, -72, -259, 90, -112, 8, -370, 30, 149, 7, 151, -62]
3541f2R1j12k5J36o9J8J01q1o3N5q6q3J98k7q2Q2O8pj00K00n1L5m4j22j66K24
3567B8L6p9j46r3R6J93m5r9j6O9K15j53n5K57j05k03J93j55j48L82j09k76L58
3590A45K4l24J42J96j97m0J07Q6l8k81K51k87L2l8J62p0J01J70Q2k29J33l37M46
3613B36l12j14J26N7J64k63k4O2M1P5j35K32j70J52j83j63R9rN3J3Q5J97l67K54
3637A06j72Q2j4M8j59l2L60m10M6J40M8p7R1J00m8k19R6j75M49J79n86l8J69j26
3661a42Q2J3J77k84Q5J06j97K06M1p0k57K35J7j05NmK65j99Mj88k4L62J1j40j75
3686a76K97k34k8J86%l13L01k5j42J34L00n13K35L26l10J54k26J87m6J49j81j13
3708c8M8J50k51J04M9l23R9o9L4k4P6J03j3K5K0Rq5j50j6QJ40k93O9L79j88Q0
$$ y = [-62, 29, -83, -108, 28, -41, -23, 78, -3, -66, -11, -97, -180, 18, -9, -91, -9, 59, 52, -48, 152, 101, 136, 92, -30, -196, 28, 64, -15, -161, -254, -158, 35, -10, -109, -125, -56, 159, 6, -49, 208, 103, -100, 93, -62, -210, 172, 63, -213, 145, 169, -155, -13, 183, -14, -54, 53, 139, 101, -180, 71, -216, -184, -222, -60, -130, -29, 141, 223, -6, 127, -210, 236, -76, -190, -64, -7, 157, -106, -130, -68, -27, 48, -87, 145, -25, 127, -56, -219, -120, -129, -76, -63, 22, 219, -148, 106, -66, 16, 2, 50, -109, -141, 219, -191, -145, -5, 43, -34, 57, 157, 109, -110, -14, -189, 260, 439, -147, -185, -16, -142, -60, -47, 130, -154, -69, 37, -160, 46, 87, 17, -240, -5, 12, -93, -88, -92, 173, -26, -22, -210, -234, 128, 139, -1, -176, 121, -113, -141, 45, 45, -268, 33, 8, -134, 0, 300, -213, 22, 348, 38, 192, -34, 153, 107, 256, 75, -38, 10, 160, -91, 13, 62, -261, -162, -231, -197, -221, -145, -42, -55, -30, -10, -1, -86, -236, -252, -244, -104, -397, -328, 51, -137, -57]
3734e7j70K39L1P5j5k42K44q1%R9J87l94J49m6o6P2L9j22L30k67K2L66m09n0L17
3759B51j48j15j78L00q3j04K9M0l12L51j36l0J86j15J4N3o0k63L14k15j8L59k12
3782i2K00l47L75l25j49M48R6j20k37L50k08L76l35N3j97L9J49o3P3J1j10K66
3804B53j37J39k02N3j19N9J12K8n1J9q0j76L18j98k45J14L87m25L24j58J2N0n8
3827A9L04p54M34m0j29p4O4K47m1P4k02Q0K3M4P5J4l50K5L98m11R1J06o1K7k2
3852e9j17M83j43l54K72k29L19l24k6oJ30N3J31k57J67O3P8l01J16O3j13M6j70
3875a78K13l0j19L43k46J59j0N6j79k38J77N9K9J22j69j9k9J80o6M5j20O7o1j69
3899a83K63J50l28O4k51O8K89j58k2J26l4j54J34K19j74J9j25R5j59L95j61k04
$$ y = [-57, -227, 12, 43, 118, 103, -139, 105, 24, 24, 123, 310, -84, 65, 19, -47, 25, 64, -58, 272, 5, 27, 393, -16, -66, 251, 103, -12, -190, 110, 27, -77, -48, -8, -320, 31, -105, -135, 51, -64, -50, 3, -57, -320, -6, -221, -239, 120, -92, 108, -239, 136, -189, -338, 110, 206, 86, -151, 199, -9, 367, 32, 85, -112, -73, 76, 13, 86, 97, -13, 253, 116, 255, 53, 106, -13, 46, 158, 186, 135, 154, 74, -102, 216, 18, -227, -113, 274, -151, 173, 15, 27, 77, 19, 323, -431, 3, -37, -166, -240, -176, 71, 30, 104, -98, -18, 5, 49, 124, 138, -212, -187, 211, -200, -109, -3, -64, -37, -59, -176, 307, 164, -190, 82, -147, 172, -152, -178, -184, -54, -1, 130, -127, 40, 103, 181, -120, -4, 59, -54, -8, -178, 35, 5, -114, 229, -17, 142, 132, 188, 9, -229, -52, 7, 36, 158, -11, -30, -59, 121, 55, 100, -20, 47, -14, -183, 80, 230, -98, -34, -285, -217, 72, -86, -108, 18, -16, -170, -36, 183, 9, 28, -97, -2, -161, 234, 73, -131]
3921a31k65J76J48m9Q0j27L13k35P8o2J44j83n9J86k06M26k96J21l42J18J40K45
3943B20J9o8k42K61J31l65J0K8j2q5k9K9J15j23K33m0lk30K5Q0J97k01J09Q1k16
3968g6J06J70j77OJ12j44J80l53r5K60J89l74K19L03l70L8r6M3L11l37K44l4j62
3991c7J48m54M57l47R9JJ15Q3n8Q1j23P5k6j18l3j05L33j45J74k44J2O2J15j05
4015d0m0K98k97K63k90J73O0j35j8Q7j72l0p3J86j40J77j04J92j40p1J84m32M46
4038H4j19L3j94L94o3l8j66K11n2j73Q6Ol11O50l0j38j94l09N81j38J0j89Rr9
4062a49MK09j00n2mL3n1p5R8J56R5k1Lj46R9k49J06K20j19j42L74j71N4k77L36
4087B31j37r6K35m7m4j53M2J11k74K49j73J7N8J56M4k70j53n3L24j57P8k4q5K93
$$ y = [-131, -396, -220, -72, -121, -41, -168, 145, -90, -12, -74, 70, -113, -172, 14, -192, 234, -62, 59, -283, -165, -25, 220, 239, 171, -71, 190, 321, -44, -34, -6, -18, -103, -132, -103, 12, -111, 122, 82, 79, -151, -126, -46, 151, -50, 59, 140, -76, 30, 200, 23, 29, 141, -3, 177, -176, -271, -11, 178, -196, 23, 326, -44, -6, -102, -59, 252, -85, 159, 125, -37, 111, -343, 114, -233, -134, -133, -18, 65, 7, 88, -35, 40, 14, -104, -137, -242, 91, -54, 120, -124, -112, -50, 65, -40, -80, 218, -79, 184, -106, 67, 127, -8, -26, 61, -111, -141, -214, -28, -168, 9, -95, 97, -43, -114, 70, -362, 84, -35, -2, -196, 198, 135, 97, -69, 142, 90, -83, 3, 9, -302, 348, 318, 180, -14, -323, 258, 120, 130, -59, -50, -149, -145, 64, -36, -88, -92, -59, -110, -185, -87, 69, 164, 143, 146, 0, 99, -150, -44, 176, 57, -85, 289, 118, 172, -105, 231, 94, -2, 233, 186, 142, -11, 31, 142, -132, 117, -56, -39, 19, 175, 219, -51, -204, -257, 67, -90, -12, -36, -121, 172]
4111A72k26P9l4J59l12P6J97j40J77j74o4L36n08K98m8P8n1Ml00L90j13j35L27
4134A88l71mK8q6K83J12J3j15L9j11J0L01k40l7n5j26L08k03qQ6O3j81J55J93
4158B42m09J22j3P6k6n4J92j68J07k0J1RK3J13m60L01K43j71k29K23o3j74K08
4181H3o9j51J11M87n24o1LJ19j27J73l20O8J49j1J86n8L2p6J10j2q9K0J81k65
4205d1m0Q6L6L4j03J67k50K61k68k09K74j9j62J68J51j38j28K76q6q5K15k01k46
4228c08M65n8k32K91j97j4j95L70p4j5o6j89J73K25k82J04Q3p0R6k23K78k34K72
4251B00n0K8j40n5R6k17K04J24k76M6J87j64k5K06k79J46J2mJ62j62M2j18J08
4274G1j25L1o5n0J75J97l38o6j22L39j10L87k05k45k0J16J28j56P4J01K28k70
$$ y = [172, -54, 25, -9, 150, -162, -86, 111, -29, 148, -26, -90, 246, -262, 36, -12, 66, 15, 19, -281, 109, -4, -139, 188, -183, -187, -159, -245, 38, 150, 163, 48, 87, -24, -14, 287, 47, 10, -45, -171, 137, -66, -74, 12, 75, -106, 49, 242, -167, -45, -58, 18, -8, -62, 130, -38, 69, 49, 60, 69, 92, 205, -255, 46, 289, 118, -111, 112, 49, -125, 83, 14, -137, -26, 461, -63, -124, -121, -2, -129, 44, -276, -208, -59, -70, 116, 58, 90, 14, 124, 112, 23, 43, 224, -41, -81, 5, 41, 75, -28, 139, -111, 150, -118, -327, -53, -72, -234, -66, 85, -53, -181, 95, 9, -76, 139, -62, -308, 157, 99, -133, 158, -39, -53, -248, 122, 48, 33, -33, -222, -49, 176, -106, -2, 81, 11, 107, -116, 162, -72, 200, 150, 178, 38, -17, 79, -138, 66, 190, -86, -40, 147, -17, -42, 164, -115, 31, 43, 39, 201, 39, 81, -37, 71, -54, -23, -88, -138, 37, 234, -104, -170, -292, 47, -63, 324, 119, -126, -146, -30, 98, -58, 16, 117, 345, 75]
4296G5k81k6L16l16oM08j25j00J6O5p3j0J85j55J02M0k40q4J87k8J47L7j27L03
4320C10l51j01j46L20N3k86L07j48K26q1J45j20k70K66k10J49J8o5J48j82M12
4341C94l39p2j33K70k88K87k17K99k84K1L5J67kj70j07m1J28J77r6r1m9J30K5
4364D4J78k55l3J42j67J5K42o4K37m02q6L06k51m4L9J53p7N1q0N1K7O0P8k42r9
4389a77J52j7m1R5K4M7j46j18P9Q5L1J89l37K44j33k52j83M26L86l25j90K08k87
4412b40J04RK35j21J15j77O2J75K2p9p0P2j20L81k51O0l32K48j16J15k87K22n9
4435c2L5O2j23Q5J28k41M5j4J65l44J70j6k06Q6L17p0k91M38m07N29j68p8J42
4458B12j55k21K34j54J12M0K5k08M04l71J85j14n9Q4l03J00K19L41l49k4J17j68
$$ y = [75, -206, -232, 84, -232, -238, 170, 45, -55, -39, 26, -47, -57, 128, -27, 75, 115, -125, -209, -22, -50, 97, 134, 7, 310, -41, -142, -288, 32, 85, -201, 106, -42, 184, 103, 248, 128, -142, 124, -86, 63, 81, 16, 164, -18, 394, 55, -17, -150, 120, -168, 119, -98, 201, -83, -62, -27, 140, 138, -32, -139, -180, -52, 125, 29, -62, -111, 19, 44, 222, -33, -66, 76, -91, -76, 166, 102, 339, -63, -149, 157, -94, -138, -99, 54, -23, 28, -52, -1, 26, 86, 164, -78, -177, -25, -42, -83, 12, 36, 83, -63, -181, -102, -17, 14, 203, -134, 110, -23, -275, -458, -32, 354, 29, -161, 47, -240, -136, -127, 108, -13, 102, -75, -13, 162, 184, 105, 35, 107, -13, 368, 117, 177, -155, 93, -23, 92, -195, 27, -32, 3, 65, -58, 27, 155, -86, -41, -55, 110, -234, -64, -80, -286, -200, 117, 47, -244, 194, -213, 316, 148, 70, 212, 57, -164, 70, -84, 28, 68, 93, -115, 289, -82, 103, -11, -70, 14, -289, -189, 30, 371, 22, -2, 115, -53]
4480e3J75P6l0o9n1N0m5QN6l06N61n70K70j3J56k9l42P4J65j1l02J82Q2k7N6j79
4506a16J46J19j49j06L1O1L3r1N2M5j13J81l41K11j4J50j47M9k46K78N5r7Jq3
4530i1L08j00K38k11j82L1L2J04k69L76l21N6J41p6j11pJ22J1l1j03K29l05L91
4553B32q2Ll08J74L7k71Q9L6m6j8K51l7q8j2L36j91p6N7j41j9N4Q8K3j02K54l51
4579a08L4R3k36J45J05j3k75q6M54r2o3K31q9J1q9j65Q4Q9p1O1K21o3j49k40l
4604b14J27j08O09m87j65J10q6J91J45l01J83O9M8m5j52J71J29k60q3R5N2k70
4626b42M33l05M17m65J18J87j39P1j5k38N06l42j61J23M4j07JJ87l1j93K88l80
4648b43J93l1K9j7pL6K9J26N7p2n6R5o8o6m5M95o66L57k22K81k17j63N1J42j60
$$ y = [-53, 122, 198, 168, 99, 48, 98, 53, 61, 117, -189, 372, -198, 72, 59, 215, 186, -156, -82, 83, 72, -230, -48, 34, 7, 63, -116, 30, 149, 0, -106, -75, -14, 19, -72, -20, 25, -88, 93, -248, -37, -51, 99, -48, 1, -245, 33, 88, -9, -8, -91, 217, 117, 355, 144, -38, -7, 25, 129, -140, 236, -85, -29, 112, 36, -75, -82, 40, 51, 20, -83, 146, -159, 232, 150, 153, -155, 19, 56, -215, -126, -90, -136, -154, 97, 60, -28, -40, 296, 105, 29, 86, -55, -74, -20, 68, 91, -11, 243, -108, -74, 19, -217, -72, 33, 20, -255, -341, 113, 21, -42, 189, 100, 111, 22, -143, -59, 30, -41, 20, 241, 178, 29, -211, -214, -87, -195, 414, -73, -238, -128, -214, -23, 122, -179, 4, 73, 121, 76, -76, 95, 224, -36, -119, -24, 28, -242, 191, -114, 303, -162, -44, 143, 4, 75, 60, -178, 328, -14, -175, -52, -8, -115, -114, 73, 42, -151, 137, -243, -50, -81, -52, -69, -76, -40, -11, 115, 172, 100, 44, 139, 71, 5, -40, 455, -211, 146, -76, 205, -12, -175, -124, 18, -142]
4673a42M4O8n9m5Q0J56k41n8Q8j19L27o1R8k09K67k08rK33q5j90Q3L0O0j11q6
4698h9j03K03M9R3j41k9L5J19J3j98o3M2K78l05L2r7K06L8j75M33m40L3Q4J12
4722A30k42K64p8k91M06k24J72k66J83j62N2K41k10J9J74j31K5pj87L63mk53j4
4745d0L0K40l79J01J24O7j43M2l02L20P4m6j98J42M5k91L11Q0l86J87J21j93l6
4768a30J65R4j87P5J8l7mK21j60o0m0n8K70j12j15j00OK01j3k32K24j44K50k57
4792a25K62k0l8j2l23L13k5K45r5j87j44J66O8O9p3o8qMo4K9k58L52j00K6R1k12
4818a27%K40k30J56j67OJ90l27N86j89n1p6J25k51K05r3J42K17m12j75K5J45P6
4841A5J06l18J29j69j11K66q7lJ9jkP8o2m0L77j21l56M93k27J75k60J83k7Q8N4
$$ y = [-142, -98, -30, -89, -134, -54, 102, -139, -197, -109, -228, 99, 38, 136, -73, 194, -14, -23, 210, 125, -65, 18, 48, 108, -3, -89, -192, 11, 60, 153, 12, -17, 18, 137, 150, -48, -111, -69, 209, -96, -64, -161, 45, 83, -92, 341, -99, -66, 18, 130, -112, 152, 74, -217, 189, -35, 137, -129, 54, -108, -56, 185, -25, -6, 168, 37, 62, 55, -132, 231, 227, -26, -40, -10, 230, -149, -48, 76, 143, 0, 42, -260, 60, 134, 88, -110, 32, 77, -214, 97, 177, -209, -22, 99, -94, -130, 35, 129, -58, 17, 35, -2, -6, 215, 55, -5, -45, -103, 167, 55, -60, -160, -154, 47, 34, -198, 26, -118, 132, -125, 137, 117, 79, 67, -256, 57, 32, 277, 182, -5, -149, 17, 85, 154, 81, 13, 5, 9, -55, -26, -284, 68, -32, -6, 85, -127, -127, 113, -117, 39, -128, -122, 68, -259, 327, 138, 87, 11, 136, -115, 90, -3, 139, 356, -56, -231, -206, -61, 15, 121, -197, -68, -237, -348, -82, -169, -172, -153, -154, -156, -78, -140, -180, 197, 76, -280, 213, -14, 161, -99, 84, 57, 145, 199]
4866A99k40m9J30r6J99J26n3m73J00J9K9J49j22K11m5J45k70K56k23K34m64M19
4888A81j03J15j83j30o3M4JJ70r6k22K70l6P6P9l52J36j23J35o3L27j52j25J95
4911H1k1l6j13K11j2r9K5J47k79N4J63o2%j26K01k4o1J47j07R5J7k08j21J29p8
4936g7j70K78j73J31N5j43j27K5L24K7k29J58rO6k35O7Q4p1pLrNJ17J9O2j11j32
4963g2Q4L45j15l24J70q0N7L4q5mJ01j13k24M28k17J40o5R1j33j79J11O0j38o8
4987a96J93p6J5k19K86l1j37K28j68o5K38l28M38j49o7k0P7L3k5j7j52R3k5J67
5011I3l2j79L09J09o3k72j75J39J44o5k24Q8K99k39k36L08l8j52K39j21L61q6
5033B07l34J66l89N25k60K23k18K37l8o0p0l7k7k60N07o7k89M2J64j23P0O5j3
$$ y = [199, -41, -90, 40, -56, 143, 269, 216, -257, -157, -138, -109, 40, -82, 129, 84, 229, -41, 215, -8, 226, -238, 181, 78, 193, 10, -120, -183, -139, -138, 32, -64, -286, -16, -52, 24, 103, -249, -113, -236, -101, -164, 163, 11, -114, 81, 60, 24, -89, 122, 110, 11, 36, 183, -96, -42, 121, 59, 59, -67, 134, 110, 49, 196, 89, 184, 201, -7, -128, 1, -77, -247, 31, -142, -11, 44, -99, -226, -201, 123, 150, -79, 79, 70, 136, -99, -32, 52, -19, -26, -23, -32, -27, 90, 109, 171, 60, -72, 12, 357, 242, -82, 88, 8, 65, 99, 14, 10, 111, -2, -226, 202, -15, 125, 60, 151, 18, -161, -50, 10, -128, -196, -3, -79, -64, -283, 3, -28, -165, 63, -105, -170, 68, -260, 178, 29, -38, -58, 19, 52, 27, 10, -142, -49, -74, 93, 61, -118, 191, 300, 237, -35, -210, -71, 73, 8, -216, -128, 171, -68, -304, 4, -34, -186, 53, -68, 293, 207, -127, 39, -350, 175, -85, 138, -80, 157, 119, 59, -11, -48, -75, -335, 172, 105, -184, -142, 22, -101, -31, 34, 21]
5056B1p2J90k07J7L0j34NK00N5k11J0rK44j91R6j94M11l32j2K98k31J99j98P8
5080F3Qj31K14m9n3j43K4J24lo2K36k16J11J10l52j10M64q3k90J20R0p9K20k54
5104d1K4n8J33L2K97l80J54j26J56k47m0j26K18j94L26j87p1J71k58L83l40L01
5126A27k32J42l3j15J08O5Q7j71P7L0Q4m69L78j26J00K23k19j65J61L70n11J31
5148D2j90J86j62l8O11m45j89oQ7j06K45m8j40L04j58J33jj86K14k57K71l78J44
5171f7J59j96K50l5M1k17J02j98J62M7p0J99q9j44L7J95l04J90j75j10J34J68
5193G9J58q4j59j11MLK32q5n6k46K66k4J44R0k01J08O1k83K56k81J58j57K11N3
5217A36l15K18m5j06j7L51k90J6P0K44l15j61K93k21P2n3L52n9j63Rok7L5K6p1
$$ y = [21, -51, 139, -68, -51, -21, -155, -150, 50, 105, -106, -96, -105, 139, -52, 44, -150, 261, -71, -83, 215, -16, 183, -15, 63, 71, -60, 154, 105, 52, -91, -67, 57, 54, -8, 228, 12, 123, 233, -119, -229, 235, 152, -138, -18, 72, -7, 213, -41, -17, -75, 58, 90, 387, 7, 161, 35, 191, -56, -96, -222, -4, -198, 128, -59, -130, 41, -217, 166, -174, 127, -105, 37, 4, -111, -3, 62, 149, -22, 55, 85, 169, -300, 78, -48, 52, 275, 56, -109, 52, 422, -89, 42, -148, 38, -124, -162, 449, 4, -185, -191, -104, -210, 35, -13, -153, 151, -7, 126, 125, -61, 153, -104, 167, -211, -67, 92, -104, 146, 111, 152, -65, 37, -161, 1, 48, -22, 177, 88, -56, -19, 176, -128, 62, -113, -223, -89, 79, 237, 153, -6, -117, -113, -110, 122, 37, -19, -265, 1, -23, 121, 211, 10, 118, 179, -104, 152, -129, 29, -128, 83, 136, -179, 39, -6, -112, -129, 222, -68, -52, 18, 262, -53, -214, 79, -142, -70, -123, 229, 170, 7, 16, 10, -17, 18, 44, -27]
5242b7l4J11k88J31L08l34M2k0K91k76k6J25J18k14J51M20o32L65j95J32k01J70
5264A17j07Q8R7j25O7j38l1j29R4J35O6j42j1p8K31j0k89K78K8jJ9k47J70j22
5288d0J03k5m2K8J05k27m7K20j71K5JN0J59j80p6l24L47J56j59J02M3N2m8k78
5312b26R6J11l6M7n8J40q3n8J63k31L33k13J5o6J05j12J8L9m7o2J84J87l37l7
5336a28L1j5J42j34K6nj4Q9K0L8n3K0K9N6N1q9q4q7j71K93p5L96m73K74k55L1
5362h7J55j17j57rK30k30J63Q9J30j41l1j61K87k68K74p7l13N37k18q9NM7J60
5385A79j19R8j17l13K39j06L16j19k40J29l0J12r1K74m08K46K20m21K94p9N1j43
5407b8j55L31k87R8r4K30j18J06J70k03Q2n1Qj29R3n7Nk47J10l0L39j67L2k54
$$ y = [-27, -61, 50, -238, -107, 201, -133, -91, -111, 180, -96, -122, 3, 121, -93, 58, 478, -154, 211, 16, 148, -53, 117, 10, 98, 195, 70, 137, -1, -32, -161, -67, 68, 134, -8, -19, -97, 134, 124, -165, 113, 141, 140, 159, -88, 82, -40, 63, 38, -4, 24, 129, -98, -145, 75, -96, -71, -70, -20, 139, -41, -117, -441, -94, 62, -97, 5, 48, 100, 52, -226, -130, -19, -55, -8, -66, 74, -9, -67, 96, -135, 198, -15, 0, -66, 39, -73, -55, -16, -63, -125, 59, 246, -91, -128, -97, -112, 30, -104, -78, -83, -97, -8, 12, 50, -3, 17, 46, 102, 153, 64, -20, -107, -278, 15, -60, 336, -137, 137, -118, -87, 68, -49, -206, -215, 15, -215, -52, 37, 167, 26, -5, -166, 121, -147, 127, 50, -263, 274, 56, -33, -28, 19, 179, 60, 158, 41, -272, -33, -139, 177, 58, -182, -53, -83, 29, -62, 212, -196, 50, 270, -151, 143, 64, 115, -28, -183, 148, -139, -41, -135, 95, -23, 83, 253, 50, 132, 81, 89, -40, 53, -4, 1, -246, -136, -166, 173, 6, 38, -216]
5431b16P4L46k66MK27J26k51n0j84J43m3J49J31m22J33MKK13n8j77j2j68L56R
5455G0Qk91K51j13J83l41K59J96j02n5O2l40K60j68O7O5p5K8q2J26n8J37k97P1
5479a39J56o4l9rK24j46j64K5r4K16J34j78j09K67j41K31l97K05j5j00J74j58
5501a21M5J81q8j53n2K87j70J65k10p8J02J02L22l97j51L89j94M6k25j55M40n
5523H0Kj70r9L38j06k51J68nO8J77M5m22L12j88J10j02J93q5l88K30j02M75n26
5546b46J69Q2J50J18j57j10K25k40rj36J98q0q6J38nK00k39J98k18j08J94q9K08
5569A57j58j24M0K63j32N0k05J60j27N8l01J82K30k51K44k6j48J34n4j33J95J6
5591G0Q3m29K76k9K8J04k37J69J21j40r5P1OM8j75K02k1%p6k5J08Kl1j85J69j01
$$ y = [-216, -142, 204, -62, -58, 169, 295, 44, -6, -190, -47, -90, 59, 190, -232, -99, -95, -93, 120, 62, -115, -127, -295, 61, 70, 78, -213, 38, -75, 108, -233, 26, 222, 120, 65, 127, -213, 47, -121, -54, 11, -64, -36, -118, 8, -50, 87, -210, -139, 17, -47, -86, -95, 129, -17, -181, -156, -250, -34, 100, -78, -187, 80, -61, 170, -227, -22, -37, -137, 37, -121, -76, 105, 17, -136, -188, 99, -71, 94, -116, -194, -92, 10, 332, -65, -216, 173, -21, 25, -200, -355, 85, 80, 82, -88, -187, 151, 45, -206, -38, -43, 25, 202, 247, -175, 137, -51, 59, -43, 150, 65, -323, -93, -195, 280, -246, -77, 5, 155, 273, 116, 6, 231, -9, -18, -154, 44, -36, -122, 16, 11, 211, -28, 170, -48, -156, 38, -51, 157, -1, -125, -85, 178, 46, 96, -109, 51, -76, -18, -319, -137, 93, -158, 86, 60, -88, 46, -8, -141, 54, 70, 153, -276, 0, -29, -1, 103, -134, 35, 156, 16, -79, -8, -2, 46, -129, 73, 52, 52, -24, -49, 59, 61, 30, -155, 14, -87]
5617h7K80p1k68Q8M7p3m2K29o3J08j32J69j82o5K1J11QK3l8j01N4K8m8K47k98
5642e5J15J41k56p9q3L31m33L46K75m55J47J92k73n1m0J37J48j35R5l3o0q8L5
5665g9M3J49j57j29L3L1j57M16j54k8L2k1k1K04j46m8J19l8j5%o0K57j59J9ok45
5691a60J73k59K52K6Qn6N8r4L36k42p8K8J23m23J60J53J4k31K90Pj4j36j56J43
5715g8Q4L3m9j48K76k15p4O1P8n9L09k40l3N6K33q1l30l6M02k97K18k04j6R8j08
5740a20j03Q2J29P5L6o6Jj52O8Q9k4kp3L97j56k26Mj17K84j73J20j2O3K72m26
5765c0q3P7O7q5q2qn1K21k19J09j7q8R7K45j31M7J12j64J9k4J41k78L03k73%K01
5791A06k79L20o7j51n6K15j37r2K51k4l07L30l5Q4J6l00p4M21k86m8K04N8l15
$$ y = [-87, 193, 122, -146, -58, -11, -84, -126, 103, 40, 148, 16, 185, 3, -62, -41, 70, 78, 101, 63, -38, 16, 44, -4, 243, -55, 60, 201, -55, -134, -217, 114, -319, 27, 302, -153, -6, 186, -87, -138, -178, -41, 107, -28, 67, 34, -26, -114, -79, -36, 113, -44, -173, -140, -109, -266, 150, -4, -32, 0, -21, -42, 162, 16, -32, 87, 49, 34, 34, -26, 231, 72, 91, 85, -160, 13, -246, 6, 32, 40, -16, 42, -52, 284, 42, -36, -8, 115, -308, -148, 5, 19, -212, 78, 85, 71, -65, -221, -78, 6, 39, -10, -158, 118, -97, -171, -110, -32, -91, 218, -22, -55, 1, 234, 153, -177, -213, 189, -108, 110, -94, -110, -12, -120, -223, -141, -12, 63, 99, 33, 34, -118, -50, 39, 15, 13, -60, 337, 181, -45, -41, -158, 126, -47, 73, 61, 124, 396, -30, -113, -36, 31, -54, -136, -144, -195, 26, -193, -84, -101, -189, -92, 153, 22, 69, 181, 17, 36, 12, 153, -125, 178, -95, -95, 106, -173, 147, 80, -71, -127, 88, -49, -141, 110, 86, -221, 109, 74, 158, 174, -126, -200, 221, -65, -113, 91, 149, -166]
5814a66K50J33j24n8j12P9p7J08j4k54M11m08J68J94l08Q3K26j30j04K66l00J29
5836hk39L84j55kn0o0o0M18m1m17K20p3K1P6J72j48j1K1%P4k5N6q4p5L2l6n1p1
5864a32K57n0r3p2J76k28K77m3J98k54K15j51r5J29l12MR2k2r0L48o5q0k18J59
$$ y = [-166, 84, 217, 93, 35, -77, 2, -75, 33, 19, -235, 176, -232, -64, 130, -178, -95, 131, 1, -103, 163, -137, -8, -247, 137, -18, -20, -70, -130, -190, 228, 187, -230, -10, -83, -62, 14, 186, 38, 27, 48, 48, 122, 97, 153, 69, -6, 26, -10, -61, -132, 125, 75, -18, -90, 86, -142, 135, 92, 290, 36, 251, 100, 5, 134, -178, -174, -82, -104, -194, 154, 89, 9, -209, -50]
$$ [...]
8191D7
##END NTUPLES=NMR FID
##END=
