##TITLE=1H_Ser Ad-Van
 CDCl3, 8 sc, 
 27.1.2020
##JCAMPDX= 6.0         $$ Bruker NMR JCAMP-DX V2.0
##DATA TYPE= NMR FID
##DATA CLASS= NTUPLES
##ORIGIN= UXNMR, Bruker Analytische Messtechnik GmbH
##OWNER= root
$$ XWIN-NMR		Version 3.5
$$ Mon Jan 27 14:25:10 2020 Russian Standard Time (UT+4h)  she@DPX200
##.OBSERVE FREQUENCY= 200.1315
##.OBSERVE NUCLEUS= ^1H
##.DELAY= (6, 6)
##.ACQUISITION MODE= SIMULTANEOUS
##.ACQUISITION SCHEME= undefined
##.AVERAGES= 8
##.DIGITISER RES= 18
##SPECTROMETER/DATA SYSTEM= spect
##.PULSE SEQUENCE= zg30
##.SOLVENT NAME= CDCl3
##.SHIFT REFERENCE= (INTERNAL, CDCl3, 0, 15.7039)
##AUDIT TRAIL= $$ (NUMBER, WHEN, WHO, WHERE, WHAT)
$$ ##TITLE= Audit trail, XWIN-NMR		Version 3.5
$$ ##JCAMPDX= 5.01
$$ ##ORIGIN= Bruker BioSpin GmbH
$$ ##OWNER= she
$$ F:/spectra/data/she/nmr/H-F/1/audita.txt
$$ ##AUDIT TRAIL=  $$ (NUMBER, WHEN, WHO, WHERE, WHAT)
(   1,<2020-01-27 14:24:00.25 +0400>,<she>,<DPX200>,
      <created by zg, POWCHK disabled, PULCHK disabled
       configuration hash MD5:
       00 E9 B6 7A A2 85 ED C7 34 08 36 98 17 FE 4E 26
       data hash MD5: 16K
       C5 E0 7F 96 47 9E 65 D7 CB A2 60 F5 7F BB 29 6B>)
$$ ##END=
$$ 
$$ hash MD5
$$ 59 2B DE 51 48 FB 74 6A 55 11 28 03 BE 37 7C 63
##$RELAX= 
##$RELAX= 
##$RELAX= 
##$RELAX= 
##$RELAX= 
##$RELAX= 
$$ Bruker specific parameters
$$ --------------------------
##$DU= <F:/spectra>
##$EXPNO= 1
##$NAME= <H-F>
##$PROCNO= 1
##$TYPE= <nmr>
##$USER= <she>
##$AMP= (0..31)
100 100 100 100 100 100 100 100 100 100 100 100 100 100 100 100 100 100 
100 100 100 100 100 100 100 100 100 100 100 100 100 100 
##$AQSEQ= 0
##$AQ_mod= 1
##$AUNM= <au_zg>
##$AUTOPOS= <>
##$BF1= 200.13
##$BF2= 200.13
##$BF3= 200.13
##$BF4= 200.13
##$BF5= 200.13
##$BF6= 200.13
##$BF7= 200.13
##$BF8= 200.13
##$BYTORDA= 1
##$CFDGTYP= 0
##$CFRGTYP= 5
##$CHEMSTR= <none>
##$CNST= (0..31)
1 1 145 1 1 1 1 1 1 1 1 1 1 1 1 1 1 1 1 1 1 1 1 1 1 1 1 1 1 1 1 1 
##$CPDPRG= <>
##$CPDPRG1= <>
##$CPDPRG2= <>
##$CPDPRG3= <>
##$CPDPRG4= <mlev>
##$CPDPRG5= <mlev>
##$CPDPRG6= <mlev>
##$CPDPRG7= <mlev>
##$CPDPRG8= <mlev>
##$CPDPRGB= <>
##$CPDPRGT= <>
##$D= (0..31)
0 1.2 0 0 0 0 0 0 0 0.06 0 0.03 0 0 0 0 0.0002 0 0 0 0 0 0 0 0 0 0 0 0 
0 0 0 
##$DATE= 1580120639
##$DBL= (0..7)
120 120 120 120 120 120 120 120 
##$DBP= (0..7)
150 150 150 150 150 150 150 150 
##$DBP07= 0
##$DBPNAM0= <>
##$DBPNAM1= <>
##$DBPNAM2= <>
##$DBPNAM3= <>
##$DBPNAM4= <>
##$DBPNAM5= <>
##$DBPNAM6= <>
##$DBPNAM7= <>
##$DBPOAL= (0..7)
0.5 0.5 0.5 0.5 0.5 0.5 0.5 0.5 
##$DBPOFFS= (0..7)
0 0 0 0 0 0 0 0 
##$DE= 6
##$DECBNUC= <off>
##$DECIM= 24
##$DECNUC= <off>
##$DECSTAT= 4
##$DIGMOD= 1
##$DIGTYP= 9
##$DL= (0..7)
0 120 120 120 120 120 120 120 
##$DP= (0..7)
150 150 150 150 150 150 150 150 
##$DP07= 0
##$DPNAME0= <>
##$DPNAME1= <>
##$DPNAME2= <>
##$DPNAME3= <>
##$DPNAME4= <>
##$DPNAME5= <>
##$DPNAME6= <>
##$DPNAME7= <>
##$DPOAL= (0..7)
0.5 0.5 0.5 0.5 0.5 0.5 0.5 0.5 
##$DPOFFS= (0..7)
0 0 0 0 0 0 0 0 
##$DQDMODE= 0
##$DR= 18
##$DS= 0
##$DSLIST= <SSSSSSSSSSSSSSS>
$$ [...]
##$SUBNAM2= <"">
##$SUBNAM3= <"">
##$SUBNAM4= <"">
##$SUBNAM5= <"">
##$SUBNAM6= <"">
##$SUBNAM7= <"">
##$SUBNAM8= <"">
##$SUBNAM9= <"">
##$SW= 24.9337058887773
##$SWIBOX= (0..15)
0 0 2 0 0 0 0 0 0 0 0 0 0 0 0 0 
##$SW_h= 4990.01996007984
##$TD= 16384
##$TD0= 1
##$TE= 0
##$TE2= 300
##$TE3= 300
##$TEG= 300
##$TL= (0..7)
0 120 120 120 120 120 120 120 
##$TP= (0..7)
150 150 150 150 150 150 150 150 
##$TP07= 0
##$TPNAME0= <>
##$TPNAME1= <>
##$TPNAME2= <>
##$TPNAME3= <>
##$TPNAME4= <>
##$TPNAME5= <>
##$TPNAME6= <>
##$TPNAME7= <>
##$TPOAL= (0..7)
0.5 0.5 0.5 0.5 0.5 0.5 0.5 0.5 
##$TPOFFS= (0..7)
0 0 0 0 0 0 0 0 
##$TUNHIN= 0
##$TUNHOUT= 0
##$TUNXOUT= 0
##$USERA1= <user>
##$USERA2= <user>
##$USERA3= <user>
##$USERA4= <user>
##$USERA5= <user>
##$V9= 5
##$VALIST= <valist>
##$VCLIST= <CCCCCCCCCCCCCCC>
##$VD= 0
##$VDLIST= <DDDDDDDDDDDDDDD>
##$VPLIST= <PPPPPPPPPPPPPPP>
##$VTLIST= <TTTTTTTTTTTTTTT>
##$WBST= 1024
##$WBSW= 4
##$XGAIN= (0..3)
0 0 0 0 
##$XL= 0
##$YL= 0
##$YMAX_a= 505871
##$YMIN_a= -340582
##$ZGOPTNS= <>
##$ZL1= 120
##$ZL2= 120
##$ZL3= 120
##$ZL4= 120
##$ABSF1= 10
##$ABSF2= 0
##$ABSG= 5
##$ABSL= 3
##$ALPHA= 0
##$AQORDER= 0
##$ASSFAC= 0
##$ASSFACI= 0
##$ASSFACX= 0
##$ASSWID= 0
##$AUNMP= <proc_1d>
##$AZFE= 0.1
##$AZFW= 0.1
##$BCFW= 1
##$BC_mod= 2
##$BYTORDP= 1
##$COROFFS= 0
##$CY= 11.3945322036743
##$DATMOD= 1
##$DC= 2
##$DFILT= <>
##$DTYPP= 0
##$F1P= 16.9975609425685
##$F2P= -3.02152046262296
##$FCOR= 0.5
##$FTSIZE= 0
##$FT_mod= 4
##$GAMMA= 1
##$GB= 0.15
##$INTBC= 1
##$INTSCL= 1
##$ISEN= 128
##$LB= 0.24
##$LEV0= 0
##$LPBIN= 0
##$MAXI= 10000
##$MC2= 0
##$MEAN= 0
##$ME_mod= 0
##$MI= 1.114404
##$NCOEF= 0
##$NC_proc= 0
##$NLEV= 6
##$NOISF1= 3.799351
##$NOISF2= 2.8
##$NSP= 1
##$NTH_PI= 0
##$NZP= 0
##$OFFSET= 15.70392
##$PC= 1
##$PHC0= -9789.488
##$PHC1= 18.6008
##$PH_mod= 1
##$PKNL= yes
##$PPARMOD= 0
##$PSCAL= 0
##$PSIGN= 0
##$REVERSE= no
##$SF= 200.130013532006
##$SI= 16384
##$SIGF1= 3
##$SIGF2= 2
##$SINO= 400
##$SIOLD= 16384
##$SREGLST= <1H.CDCl3>
##$SSB= 0
##$STSI= 0
##$STSR= 0
##$SW_p= 3612.71676300578
##$SYMM= 0
##$S_DEV= 0
##$TDeff= 0
##$TDoff= 0
##$TI= <>
##$TILT= no
##$TM1= 0
##$TM2= 0
##$TOPLEV= 0
##$USERP1= <user>
##$USERP2= <user>
##$USERP3= <user>
##$USERP4= <user>
##$USERP5= <user>
##$WDW= 1
##$XDIM= 8192
##$YMAX_p= 0
##$YMIN_p= 0
$$ End of Bruker specific parameters
$$ ---------------------------------
##NTUPLES= NMR FID
##VAR_NAME=  TIME,          FID/REAL,        FID/IMAG
##SYMBOL=    X,             R,               I
##VAR_TYPE=  INDEPENDENT,   DEPENDENT,       DEPENDENT
##VAR_FORM=  AFFN,          ASDF,            ASDF
##VAR_DIM=   8192,          8192,            8192
##UNITS=     SECONDS,       ARBITRARY UNITS, ARBITRARY UNITS
##FACTOR=    0.0002004,     1,               1
##FIRST=     0,             0,               0
##LAST=      1.6414764,     0,               0
##MIN=       0,             -340582,         0
##MAX=       1.6414764,     505871,          0
$$ Real data points
##PAGE= N=1
##DATA TABLE= (X++(R..R)), XYDATA
0 0 0 0 0 0 0 8 0 8 -8 14 -16 19 -24 32 -34 48 -56 64 -77 91 -105 122 -144 168 -192 218 -250 286 -323 365
30 365 -413 464 -519 582 -651 725 -807 896 -995 1103 -1221 1353 -1499 1658 -1837 2039
46 2039 -2264 2516 -2808 3147 -3545 4017 -4591 5311 -6234 7479 -9250 11990 -16826 27875
60 27875 -106792 134871 320346 -141551 -340582 -28629 282402 46471 -251195 -94892
70 -94892 265733 173137 -224154 -291965 80827 276730 47508 -174106 -22970 183374 100928
81 100928 -74883 15803 216121 163215 -76446 -106743 96722 178052 18253 -78116 35222
92 35222 112024 -14995 -107947 33345 192812 95603 -103368 -80939 111540 143317 -23046
103 -23046 -92803 33624 97094 -39946 -139373 -13591 135826 60202 -114654 -106002 52198
114 52198 90999 -29428 -83895 7305 52243 -45985 -111616 -17695 79787 10858 -117905 -107061
126 -107061 7105 40625 -29633 -59819 -7023 16036 -36806 -61689 -626 51355 10277 -60761
138 -60761 -68001 -24031 8813 19369 18199 -10208 -53870 -51725 10449 46177 873 -48808 -20607
151 -20607 19393 -26099 -88686 -32875 79461 53053 -108506 -169038 -27657 102606 26496
162 26496 -118454 -93821 41682 41332 -96202 -118959 38459 121989 -20370 -171628 -93395
173 -93395 91556 106243 -34862 -83144 17859 67843 -20091 -66343 38080 127180 44745
184 44745 -79491 -49175 73104 89332 3192 -17865 47018 44417 -48919 -61345 62979 131091
196 131091 17938 -107816 -53572 77955 66900 -52873 -65116 47957 73047 -55036 -123375
207 -123375 3563 136215 57987 -111841 -109020 49214 107277 -7607 -83261 5348 94657
218 94657 25864 -81535 -35868 95287 96526 -35107 -88811 11986 95761 39865 -41976
229 -41976 -12497 56841 30735 -49037 -38876 51106 65954 -27700 -82405 -15167 58331 24449
241 24449 -48887 -39478 20239 13721 -52338 -56371 23760 64863 -3651 -78031 -45142 42622 57036
254 57036 -5045 -36116 823 30124 5328 -14213 25243 70895 46555 -19110 -30914 24887
266 24887 68272 51222 16186 9803 16574 10699 12272 42148 63173 31736 -22954 -29696 15561
279 15561 45126 25734 2317 9431 12703 -16545 -37275 -722 54074 42287 -33793 -73809
291 -73809 -22576 46022 40341 -16672 -33171 2405 17505 -19456 -42163 3823 60637 38758
303 38758 -41808 -67142 2297 70597 46852 -24440 -40603 7951 36100 4574 -21455 12253
315 12253 54362 27485 -39190 -47828 17522 64614 29546 -32916 -37127 8736 30276 5523
327 5523 -11880 6436 17799 -10934 -37003 -13340 30313 30170 -12357 -32880 -8789 14577 4740
340 4740 -8108 5617 14797 -11155 -33583 -3092 45463 37091 -19186 -37611 6754 41111 14073
353 14073 -19284 3383 40391 19497 -30362 -18303 47623 64009 -475 -50187 -13781 45767
365 45767 39114 -8759 -13003 23633 23253 -21288 -29603 21671 50046 4351 -46772 -28120 21802
378 21802 23777 -10292 -11250 18252 8032 -42577 -47054 19274 59739 7479 -58404 -38407 27645
391 27645 32443 -19653 -28620 22724 36687 -28808 -70589 -7363 75337 52409 -41755 -68163
403 -68163 -1099 46614 10174 -33632 -10799 28883 5558 -49033 -39557 27675 52110 -3591
415 -3591 -58612 -43035 5072 15964 -7114 -15037 -3425 -7957 -29698 -29212 2766 19666 -3797
428 -3797 -32273 -27389 -5509 -593 -7563 241 12117 -2047 -31633 -31534 7760 33245 7504 -30374
442 -30374 -24910 10582 19442 -5871 -17455 3844 19099 -5445 -34495 -18573 25103 32271 -8127
455 -8127 -38563 -18141 17852 18306 -10304 -21871 -4608 5726 -8231 -18420 -976 19139 6827
468 6827 -23604 -29085 -4076 16159 8118 -8948 -11960 -6746 -6780 -5304 8413 16970 -613 -25685
482 -25685 -22397 7196 22176 7074 -8233 -2704 5575 -5852 -15682 3084 31302 22034 -19757
495 -19757 -35739 -560 37906 28990 -7295 -19046 651 11170 -3372 -10789 10433 28147
507 28147 7465 -28925 -29999 5465 29016 11441 -20251 -27668 -12368 -2757 -5369 -4854 2185
520 2185 -2852 -21785 -32307 -19326 919 5162 -6326 -16925 -20620 -19288 -11872 3845 13846
533 13846 1982 -23249 -28858 -6469 17473 15472 -1221 -5543 3871 5294 -5763 -4706 17214
546 17214 30394 7626 -23910 -18462 20227 38921 13533 -18592 -14714 10270 13499 -6573 -11378
559 -11378 9155 17699 -6269 -27160 -11094 19445 18454 -11281 -26502 -9780 9303 6887 -2954
572 -2954 615 7184 -794 -9760 46 17292 15551 -679 -5600 7159 14831 7849 5370 17350
586 17350 20829 -420 -18075 -1235 29718 28616 -4995 -22662 -2314 19632 8740 -13261
598 -13261 -8170 11966 5006 -25566 -30518 4272 29649 8129 -29008 -31200 -2898 13287 2651
611 2651 -7284 -390 4007 -6623 -11607 5714 25623 21779 1429 -7875 638 12612 18991 23962
625 23962 24648 12610 -3959 -2743 19628 34911 22099 17 -3509 8606 13019 5843 5902 16723
639 16723 16785 -4982 -22914 -11066 17259 23939 557 -19976 -14144 4276 8122 -1000 -4252 3097
653 3097 4459 -6615 -13622 -790 18124 19875 3967 -10416 -6873 8585 17914 13849 5188 1599
667 1599 4372 7298 9309 11265 12215 9519 3203 -3044 -1904 6373 13077 10448 678 -7482 -7331 1717
683 1717 9908 6709 -7289 -16068 -9542 2901 5265 -3443 -9079 -4628 -1964 -9935 -15855 -5625
697 -5625 8424 3131 -17901 -26027 -7733 12442 7576 -14394 -23754 -11539 -1400 -6196 -12301
710 -12301 -5898 1309 -6072 -19710 -19430 -2941 7536 -250 -15348 -18847 -10576 -1801 2598 4385
724 4385 1947 -7239 -12326 -6467 5371 9733 5448 2570 3637 1780 -2589 2366 18768 25353 7972
739 7972 -13364 -8960 14706 26956 15645 1392 2459 9616 6374 -917 5087 19689 19007 -1144
753 -1144 -14927 -3831 17738 23055 8933 -5781 -6938 1235 5780 6620 8267 8504 3243 -3072
767 -3072 -3184 2653 8898 9759 4330 -3861 -8318 -4431 5325 12251 6011 -7603 -13393 -5545 2570
782 2570 -180 -7764 -8717 -4186 -5157 -12695 -14617 -5581 1728 -5694 -20386 -22479 -10023 979 -2143
797 -2143 -12882 -17261 -10881 -4206 -5163 -9415 -7881 -3266 -3556 -9268 -9986 -1476 7099 5573 -6379
812 -6379 -13986 -7505 4177 8410 1767 -6263 -7589 -3650 917 1399 351 -2103 -4684 -8851 -10572
827 -10572 -6952 1631 5969 230 -11472 -17224 -8957 4176 7502 -1234 -11390 -10782 -2646 3968
841 3968 4408 3016 4321 4120 -2345 -6887 491 14861 20107 9294 -4672 -4236 9585 18658 14344
856 14344 4716 2512 4964 5036 3578 6391 12600 13067 4715 -6286 -7961 1821 10512 9301 -354
871 -354 -8986 -8558 -1426 4725 3070 -1998 -4977 -6004 -6285 -7026 -2998 3731 5748 -1027 -10691 -11119
887 -11119 -564 9213 6442 -4743 -10445 -4415 4148 6009 1540 -648 1027 575 -3886 -5473 549
902 549 7220 5035 -4486 -9980 -4418 5798 7006 -2271 -9880 -8645 -1915 1661 -814 -4307 -3448
917 -3448 -1660 -3666 -6901 -5575 760 3360 -1932 -9472 -8551 958 8291 5371 -3233 -6985 -3400
932 -3400 2938 4586 3111 2025 3072 2880 145 -878 3876 10012 9661 1094 -6263 -4138 7279
947 7279 14157 9777 -63 -4531 -926 3574 4196 3523 4063 3684 -741 -5998 -4924 4458 12068 6715
963 6715 -6971 -13699 -6084 5627 9395 2570 -3862 -4457 -1555 -1616 -1200 2668 6100 2348 -5275 -7860
979 -7860 -1378 8688 11917 4436 -4831 -6507 -670 5802 6613 3596 695 416 1710 753 1106 3676
995 3676 5956 3458 -3195 -7122 -2757 5935 9079 1953 -6613 -6946 -77 3608 317 -3937 -2570
1010 -2570 1015 -145 -4782 -3992 3720 7299 527 -8730 -7207 2336 8865 4626 -2903 -3584 1922
1025 1922 5567 3614 1579 1928 2739 1541 -281 1272 6045 8447 5239 -1237 -4299 -122 6058
1040 6058 7930 2835 -4407 -5699 -254 5632 5454 523 -3297 -2529 -1873 -3022 -2650 1705 5708 1540
1056 1540 -7582 -10509 -1584 7950 6052 -4222 -9544 -5559 1658 2669 375 212 2192 -162 -6445
1071 -6445 -7238 -679 7490 6755 -2078 -8955 -5700 2465 6268 3517 -1380 -3838 -3775 -2821 -513 2345
1087 2345 4620 3144 -1904 -6190 -5333 494 6088 5922 -748 -7979 -6899 976 6916 4401 -2522
1102 -2522 -5057 -2713 -1040 -2433 -1855 2619 5019 -1086 -8464 -7509 2542 7781 1832 -7551 -8173
1117 -8173 -582 4824 2223 -1890 -592 2566 1295 -3034 -2339 3237 6413 2931 -2498 -1741 3843
1132 3843 6753 4859 918 -820 -144 1612 3557 4505 2238 -381 -230 1581 939 -1375 -1280 1272
1148 1272 823 -4286 -6898 -1504 6051 4364 -5311 -10295 -5076 3072 2709 -2833 -4488 -290 1475
1163 1475 -2575 -3989 1870 8062 4252 -5151 -8751 -746 8729 9211 2582 -2484 -1628 1138 1958 2888
1179 2888 3448 2209 -1518 -4425 -4136 302 3709 3291 -1145 -6969 -10157 -6742 480 3612 -1475 -8240
1195 -8240 -9438 -4592 -760 -1543 -3231 -2286 -1539 -4388 -7767 -4193 4702 8235 2483 -6088 -6277 1630
1211 1630 7454 5199 225 87 3363 3163 -27 320 5425 7980 2538 -4597 -4901 1544 7145 4409
1227 4409 -1874 -3957 -2569 -659 -413 -781 -1311 -2142 -3613 -3937 -2630 -351 863 -286 -1658 -3526
1243 -3526 -4069 -1015 3683 4401 -566 -4445 -974 5636 6984 1275 -3231 -89 4688 3660 -882
1258 -882 428 5874 5578 -1958 -6418 -483 7139 4936 -4462 -8189 -2460 3893 1996 -2610 -2450 -742
1274 -742 -2008 -5350 -4386 90 3104 421 -3710 -4053 -1191 1269 3019 3616 1066 -3170 -3739 1723
1290 1723 7054 6974 2434 382 1944 2190 273 975 6197 8606 2054 -6011 -4225 5631 10754 4733
1306 4733 -3981 -4983 -177 1866 -282 121 3735 3424 -2384 -6961 -3403 3815 6242 1219 -5012
1321 -5012 -5761 -896 3254 3985 1993 -521 -1810 -1883 -997 379 1545 2365 1655 -1670 -3365 -1643 1863
1338 1863 3837 957 -3588 -5340 -2719 1210 1848 -1194 -3148 -2141 -524 -1462 -3531 -3225 525 1608
1354 1608 -2586 -5784 -3263 2861 3741 -1600 -6230 -3667 1946 2476 -2229 -4044 -469 2179 -883
1369 -883 -3841 -1884 2026 1809 -3992 -6497 -2212 3103 2444 -1796 -4294 -2895 -1072 -382 319 1218
1385 1218 -517 -2879 -2440 1094 4107 2824 1139 1649 1067 -1370 -667 5370 9886 5631 -2044 -2757
1401 -2757 4899 10001 6329 177 806 4983 4071 -289 678 7100 9042 1652 -6163 -4293 3761 6817
1417 6817 1741 -2809 -1957 -510 -846 -1560 848 2407 367 -3976 -5137 -2308 1250 2672 1683 486
1433 486 -2339 -4429 -2133 3655 5446 887 -3891 -2510 1734 2666 712 423 2506 1651 -3616 -5903
1449 -5903 -1164 5265 3706 -3517 -7202 -3600 1579 556 -3611 -5597 -3310 -2436 -4023 -5163 -2625
1464 -2625 83 -998 -4984 -6727 -3994 -663 -30 -2523 -4594 -2843 -456 995 266 -701 -1166 -158
1480 -158 569 440 801 1420 2280 2434 930 294 848 3130 3413 601 -1964 -1121 3022 4767 2869 -879
1498 -879 -1598 800 2101 112 -807 1296 3458 996 -3349 -2481 3169 7135 3085 -3737 -4267 1031
1514 1031 4841 2823 851 1915 2728 729 -1581 686 5466 6079 1462 -2879 -1382 2568 4811
1529 4811 4574 2937 229 -2500 -1817 1365 4176 3745 54 -1530 -592 84 -668 12 2427 2344 -2906
1546 -2906 -6299 -3517 3193 4809 -533 -5389 -3237 741 -171 -3074 -2194 2126 1890 -3021 -5299 -1199
1562 -1199 4223 3521 -1935 -4205 -1996 1063 717 137 1110 1186 -385 -1817 -740 788 1514 600 -528
1579 -528 -626 -865 -599 1354 3046 636 -3123 -3649 -60 2395 341 -2822 -2981 341 1766 -865 -2798
1596 -2798 -512 1350 -718 -4229 -2975 2483 3965 -198 -3886 -2824 2240 3586 647 -2328 -900
1611 -900 957 1285 616 1509 2863 2419 96 -2148 -908 1973 3634 2437 -375 -1850 -626 1756
1627 1756 2746 2021 -202 -1633 -1500 -832 -124 551 1282 1091 -972 -3350 -3278 -383 3073 2124 -1818 -4759
1645 -4759 -2883 980 2394 1194 -849 -522 -655 -2302 -2419 617 4123 3310 -1605 -4526 -2199 2822
1661 2822 4329 738 -2393 -1885 -92 620 334 1132 2245 811 -2329 -3695 -1122 2142 1898 -113
1677 -113 -1568 -1793 -1252 121 1438 1019 -1250 -2357 -1673 404 670 -572 -581 1195 890 -2363 -3070 -382
1695 -382 2763 964 -2859 -3312 590 3268 713 -3018 -1891 889 594 -2033 -2625 350 2233 611
1711 611 -2537 -1923 966 2392 -22 -2488 -1959 347 1198 1140 1043 111 -502 -1105 -251 903 1143 130
1729 130 -770 -501 -621 -505 1004 2662 1029 -3092 -4933 -1766 2487 2385 -1179 -3330 -1709 189
1745 189 -724 -1595 -197 786 -438 -3422 -4156 -245 3840 2943 -1178 -3819 -1872 995 1168 350 47
1762 47 891 350 -891 -1077 883 3024 1925 -854 -2965 -2166 202 1574 1892 192 -1677 -2352 -1214
1779 -1214 -12 386 -62 -697 -997 -1721 -1930 -493 1810 2776 212 -2797 -3061 671 3406 2966 524
1796 524 -679 1547 2530 1551 682 2023 2834 1996 -368 -804 2532 4385 2387 -1188 -1379 320 1676
1813 1676 563 -1268 -1039 -149 -175 -748 -1153 -841 -1053 -1643 -2077 -2122 -1369 -636 -671 -1088 -1480 -2020 -478 1294
1833 1294 1031 -1019 -1738 13 2136 2517 1397 865 2223 2782 1018 -116 1672 4271 3731 107
1849 107 -1708 909 3735 3531 735 -477 -100 10 -444 -336 895 2085 320 -2461 -3196 -1162 1134
1866 1134 1486 -282 -2108 -3111 -1597 926 2152 1207 -237 -999 -1279 -606 662 1792 2409 1921 -311
1883 -311 -1516 50 2823 3664 1602 -1213 -1735 157 2031 1503 676 556 1014 1 -1406 -1178 1092
1900 1092 2163 516 -2119 -2421 -69 2136 913 -96 -869 -399 271 -334 -53 1081 1867 1467 -169
1917 -169 -529 711 1941 2181 429 -384 -161 1035 1928 1947 670 -273 -160 406 355 -119 -213 351 713
1936 713 -263 -888 -123 1205 834 -1478 -2448 -814 1531 1631 -731 -1935 -748 1654 835 -304 -466
1953 -466 29 418 -817 -890 1106 2608 1733 -781 -1967 -1239 740 1614 545 -828 -904 -594 -41 458
1971 458 538 212 -768 -1324 -1632 -1149 101 1247 1247 -776 -2255 -1861 201 1826 1085 -821 -1031 -520 -120
1990 -120 -163 233 1802 1297 -807 -3092 -2672 311 1595 934 -1886 -2639 -1580 -639 -363 -828 -1215 -1806
2008 -1806 -2087 -2462 -2034 -381 545 -584 -2505 -3632 -2272 -489 588 -552 -1811 -1633 -849 123 280
2025 280 150 -206 189 51 -555 -418 1046 2007 1313 -184 -535 219 1643 1330 -198 -580 -37 1106
2043 1106 628 -64 -307 411 352 -218 -1454 -1053 599 1145 -298 -1406 -313 927 1425 286 -993
2060 -993 -560 551 757 599 867 1580 1204 545 -113 535 1355 1832 782 -247 -763 103 1729 1912 950
2079 950 -965 -1700 -835 437 294 -21 -120 -505 -1445 -1882 -1125 546 596 -821 -3182 -3423 -1002 1128
2097 1128 497 -1212 -1530 -1328 -789 -892 -716 30 727 -272 -1388 -1307 195 1344 1227 -253 -1426 -1588
2115 -1588 -31 414 506 297 -367 -584 -1307 -1196 -1001 -186 355 -294 -2224 -2456 -807 974 523 -1022
2133 -1022 -2164 -1782 -789 -775 -789 -402 -8 -600 -832 -987 -352 868 644 -297 -1465 -100 1463 1595 1746
2152 1746 1641 99 573 708 902 -175 497 1122 1140 561 1352 1918 1721 1916 -333 1078 1375 1185 684
2171 684 841 61 191 1233 2224 238 144 -400 602 797 630 368 1381 1084 542 -662 -761 739 1653
2190 1653 811 -412 -605 77 1101 1100 880 990 668 -57 -850 -338 1248 2228 1485 -116 -904 -38 1318
2209 1318 1858 917 -329 -548 -240 69 632 1007 1281 542 -1048 -1795 -811 712 1145 397 -1183 -1286
2227 -1286 -762 444 820 75 -571 -1025 -749 -546 -112 720 870 499 -773 -1344 -614 537 1198 425 -514
2246 -514 -368 245 795 668 386 287 408 -26 -461 -676 664 1111 461 -655 -715 18 634 601 -40 -944
2266 -944 -162 217 112 98 284 474 196 -369 -650 -136 630 635 215 -314 -134 938 1376 751 -461 -892
2286 -892 179 591 591 500 125 189 427 109 15 659 643 -122 -971 -749 703 1401 1380 -22 -1027 -957 401
2307 401 1127 81 270 40 231 -105 -184 493 1275 1075 -212 -1117 -285 792 1243 1325 469 -125 -313 216
2327 216 133 289 646 719 -241 -858 -561 592 1384 943 -337 -1324 -1048 50 675 691 338 -352 -202 11
2347 11 -140 42 412 35 -459 -1322 -1280 388 1110 514 -1047 -1521 -1202 -361 -559 -815 -935 -1129 -897 -797
2367 -797 -1210 -1027 -644 -849 -1783 -2122 -1349 -555 -437 -842 -1230 -729 -412 -229 -276 -694 -520 -262 -141 35
2387 35 134 339 670 221 -251 255 323 887 757 123 -235 142 812 544 -423 -458 -240 -409 -809 -551 -651
2408 -651 54 -13 -1205 -1574 -1490 -473 -48 -970 -1608 -1717 -851 -307 268 -257 -489 -625 -716 -922 -281 732
2428 732 1241 686 -631 -809 136 1321 1415 774 -505 -406 -49 900 1048 956 716 247 -531 -820 -186 739
2448 739 574 11 -915 -1112 -97 845 622 -312 -713 -250 -166 -246 312 501 973 471 -157 -602 340 832
2468 832 1024 286 -326 -23 206 443 623 540 168 -238 -573 -608 -150 202 -214 -315 -882 -1355 -666 -329 -360
2489 -360 -1473 -1507 -1294 -497 -421 -684 -472 -397 -516 -769 -535 -474 -398 -259 -214 -655 408 1259 1275 162 -396
2510 -396 207 721 977 491 -13 443 665 492 909 683 906 428 -485 -523 89 429 821 232 -440 -703
2530 -703 -592 -267 94 -87 -345 -330 -390 -41 -180 194 776 329 -371 -865 -374 426 1256 1031 266 -127 60
2551 60 680 575 686 821 661 172 -568 -84 1225 1773 1108 -154 -1001 -317 849 1333 1051 630 8
2570 8 92 353 744 1067 1254 569 371 35 649 1437 1667 989 458 280 575 1033 1109 651 338 419 401 480
2592 480 347 621 281 292 154 -354 -353 374 330 384 -781 104 276 -21 -480 -519 -70 307 -189 -532 -124 456
2614 456 465 98 -221 -136 351 180 262 -119 -253 172 564 429 -118 -14 -254 -800 -407 -211 -4 -79 -660 -763
2636 -763 -482 -371 18 -271 -569 -1141 -1395 -706 345 542 -149 -458 -791 -568 -257 19 510 497 301 -643
2656 -643 -219 723 1024 588 2 -584 -533 -42 671 597 431 69 -296 -615 -613 -32 326 -157 -580 -849 -721
2677 -721 -367 1 599 -87 -561 -1042 -631 -62 7 280 209 172 -629 -575 309 646 906 128 -530 -18 560
2698 560 1043 880 438 336 467 243 282 487 488 844 498 -174 443 270 905 137 -376 -381 -285 207 -2 -366
2720 -366 -14 -173 -234 -487 -338 -613 -542 -486 -511 92 26 55 -81 -288 -646 -248 -320 194 -93 -319 -261 -27 223
2743 223 -193 -84 -116 -311 -454 -569 -734 -152 87 133 -640 -817 -653 -179 133 -531 -727 -498 -811 -561 -532
2764 -532 77 189 -875 -967 -1091 -739 179 35 -171 -595 -830 -548 -307 285 194 -19 -791 -765 -456 -446 502
2785 502 483 120 -567 -696 -276 -8 487 -8 -306 -347 -197 296 101 366 246 -176 -277 -448 -489 473 749
2806 749 266 -27 -164 69 -139 19 181 169 234 61 -380 301 480 320 156 167 -138 -74 294 461 625
2827 625 325 31 198 483 435 284 421 422 109 203 364 674 466 171 199 5 264 503 -68 -242 -195 355
2849 355 366 574 -333 -530 -492 -169 -35 105 36 -348 130 -581 153 246 278 101 -307 -656 -149 310 312 411 200
2872 200 -365 -460 64 -161 305 -31 169 -243 -449 -41 121 755 313 -189 -566 -755 -443 118 153 -372 -386
2893 -386 -387 -526 -563 24 35 97 -746 -1038 -531 307 322 60 27 -616 -526 -174 277 441 255 -8 -108 -265 40
2916 40 355 406 137 -313 -332 5 349 460 539 451 107 44 -131 75 112 549 383 705 363 162 325 534
2938 534 653 325 263 270 181 227 508 264 682 578 576 38 453 275 387 154 22 418 235 330 408 520 31
2961 31 363 114 -252 -56 -4 225 324 374 363 490 177 -51 150 262 261 634 455 265 176 284 413 1263 281
2984 281 -117 -259 123 449 580 559 264 -136 -336 -577 10 405 232 -338 -622 -376 -270 121 461 -137
3004 -137 -647 -825 -692 -439 -87 222 -183 -269 -526 -406 -268 33 177 -245 -331 -330 -359 13 550 446 -121 -498
3026 -498 -279 -486 -301 -212 -1 44 -229 -717 -616 74 -70 -206 -809 -731 -800 -204 -1 -44 -69 -259 -636 -313
3048 -313 -227 226 245 236 140 134 430 416 547 581 208 791 642 428 404 542 418 542 415 440 349 404 157 156 365
3073 365 298 358 -90 157 -440 -2 69 1 -228 -682 -554 -306 -171 -13 -149 39 -11 -172 -386 -182 202 248
3095 248 459 308 341 196 185 265 19 296 6 -63 179 156 473 733 526 -479 -198 -365 112 319 38
3116 38 -112 -719 -667 -205 -13 144 -53 -227 -721 -888 -441 147 -20 180 -286 -764 -547 -254 -41 -79 -61
3137 -61 -448 -102 -541 43 -188 -128 -273 -635 -436 -448 -407 -249 -162 -228 -386 -475 -490 -583 -556 -449 -481 -216 -374 -538
3161 -538 -126 -89 -149 -168 -495 -407 -284 98 170 183 391 202 -11 8 105 76 262 70 45 192 373 574 213
3184 213 158 6 94 36 -104 -188 -204 225 193 27 29 168 -105 26 -66 45 402 -103 -196 -127 263 394 808 255
3208 255 -312 -339 -123 183 130 477 212 217 312 106 87 640 353 139 -25 -122 -57 339 579 303 108 -98 -103
3231 -103 -284 -155 154 204 378 126 174 -1 110 318 208 324 -20 48 146 283 533 297 14 -9 -235 -138
3253 -138 403 98 356 86 -317 -281 257 311 113 47 -203 -299 -160 -91 265 32 -249 -489 -44 -172 -114 120
3275 120 -291 52 -95 -180 -13 48 -156 -106 -162 92 -40 -20 -384 97 183 141 -85 104 210 -62 89 150 103
3298 103 114 -114 -277 2 97 178 169 -307 153 -12 179 -144 231 202 49 16 -154 -250 -327 -24 -23 329 110 12
3322 12 1 105 285 478 636 237 -164 2 134 188 537 574 137 -159 -202 -85 115 647 241 20 97 122
3344 122 327 312 138 142 -117 -48 -226 279 300 505 88 -14 -107 88 132 306 73 -155 -288 -96 -108 -69 315
3367 315 187 -96 166 -64 30 165 258 144 -5 -222 33 14 1 410 -100 -237 -256 -182 -217 12 116 355
3389 355 -397 -477 -113 -260 -103 -200 -384 -488 -568 -166 -310 67 -259 -388 -192 87 -206 -17 206 26 -178
3410 -178 205 -172 -469 -195 -124 -276 -98 245 -163 -184 -90 -136 -51 107 -84 -99 -271 -116 -19 112 101 -24 -222
3433 -222 -119 -155 -446 -100 180 -172 -327 -132 -177 -216 -104 -45 40 -42 -285 -249 -33 278 238 439 274 25 -222
3456 -222 -110 171 181 157 136 278 -100 -29 323 260 4 150 -12 -207 305 472 446 215 -211 -361 94 147
3478 147 146 335 32 45 -143 1 -45 25 152 81 -99 -49 31 -275 385 67 116 20 -56 52 -29 135 297 135
3502 135 -270 -66 174 161 46 92 -46 -136 -184 -263 57 307 -116 -58 4 4 6 -119 -236 -95 -393 -356 25 86
3526 86 145 -91 -156 12 17 -70 -155 -86 -247 -90 318 118 131 -81 -450 -159 -81 -131 -43 -326 -266 -121 -87 -65 332
3551 332 39 -258 -458 -312 -23 40 -191 -46 -286 76 34 -144 95 58 -195 -44 -84 -328 107 185 173 -60
3573 -60 -3 27 -115 169 -30 175 287 207 -66 -38 162 113 312 -133 -287 -106 -144 279 279 99 186 -113 79
3596 79 -17 554 -14 201 -151 -185 147 78 611 593 40 88 144 305 322 251 443 115 257 67 -14 372 101
3619 101 -1 78 301 252 228 35 173 122 209 99 161 46 22 54 -183 -118 -24 97 -97 -233 -28 -88 148 148
3643 148 -34 -145 68 -2 281 64 -287 -257 -54 -23 -4 119 -45 5 -52 -219 -469 -135 -239 -97 -103 -264 -388
3666 -388 -395 -324 -187 -283 -330 -299 -125 -279 -239 -322 -235 -86 -433 -331 -128 -298 -49 183 214 -32 -337 -162 48
3689 48 -117 -52 106 56 -124 98 25 4 400 -56 -112 27 176 -6 -7 -33 -62 50 13 236 -36 -139 102 200
3713 200 -267 93 121 250 21 203 414 181 441 459 98 295 630 205 -106 448 299 373 603 278 78
3734 78 47 425 43 228 245 193 305 17 433 141 144 -124 -72 -70 -220 -124 -187 -4 28 236 15 -87 219 -80
3758 -80 -141 -14 243 98 130 140 38 -224 -65 81 -124 292 -142 3 62 329 9 -47 -168 -260 -318 -32 2
3781 2 -287 -260 96 -224 -347 -195 -303 -195 -251 -596 -211 -52 75 -380 -297 -396 44 -139 -380 -268 -201 -164 45
3804 45 -349 -214 -253 -112 112 -79 9 -3 -423 -571 -151 183 222 -346 -168 -121 -226 -95 -154 -9 141 -90
3826 -90 -2 228 166 134 -49 -79 101 -81 79 -193 -44 361 -48 157 -108 158 -4 -34 -19 63 234 536 207
3849 207 74 -98 415 166 5 8 -4 75 -19 146 270 83 -291 -87 44 308 -195 189 277 193 261 214 167
3872 167 157 58 204 169 -235 -18 352 -135 487 24 396 201 -19 136 8 99 161 37 85 -53 -1 308
3894 308 -10 -151 -62 -268 -273 -144 87 50 170 -213 -72 -207 -198 37 -158 -128 -161 28 18 -54 -27 -324 -91 -481
3918 -481 -174 20 -469 177 161 -26 -185 -30 -88 67 -161 -98 -244 -83 -167 42 -302 -8 68 -145 -362 -36
3940 -36 -101 -58 109 -4 178 -147 41 -178 255 -45 -97 78 6 82 2 218 38 169 117 48 17 -53 192 226
3964 226 22 -8 236 187 197 220 -76 75 -152 108 -34 -73 240 149 165 142 63 97 285 -77 169 -221 14
3987 14 -7 -59 83 435 262 -51 172 65 373 -236 30 69 -98 187 138 183 -75 -7 152 477 -61 -49 300
4010 300 54 114 303 -2 163 -26 5 -256 86 -82 4 50 -123 26 -124 -295 77 230 77 -270 -220 105
4032 105 -283 204 -44 -46 -128 -50 -27 219 -130 6 -182 -387 -131 -108 -19 23 -244 155 -157 65 -52 148 -53
4055 -53 -361 12 -182 -507 -48 130 17 36 -131 -281 25 -427 -45 -134 -23 157 -266 60 -32 -147 -22
4076 -22 -194 -130 -64 -122 -45 139 -67 105 -72 -115 143 174 -48 170 401 -6 65 172 132 6 -29 11 -160 83
4100 83 108 -182 32 187 60 159 -86 -190 -308 174 276 80 48 -16 176 50 330 193 86 213 67 135
4122 135 -204 350 -58 138 186 80 82 235 157 -236 -96 338 40 -133 -53 12 106 -251 243 -31 167 -69
4144 -69 133 166 6 72 38 -357 -37 207 29 15 35 -276 -234 458 -61 66 -135 218 -441 105 71 45 -2
4167 -2 74 -285 -43 52 47 -47 -84 -45 -110 -257 -309 90 -202 72 -133 -321 71 87 -57 -172 166 -105 -340 -124
4191 -124 -254 -189 148 -74 -81 89 152 -40 151 136 17 -41 -13 -59 19 198 -4 136 -136 -57 -34 135 -177 -5
4215 -5 -95 -77 46 -75 61 109 245 141 69 12 91 17 -60 -62 93 23 2 11 -27 169 -3 193 227 250 98 180 126
4242 126 116 168 49 157 282 -5 -201 12 -77 -107 70 73 9 -57 -112 68 113 -391 64 91 65 71 0 -69 224
4267 224 24 -231 315 118 139 118 134 40 -263 290 141 53 145 35 177 -28 24 -60 20 167 156 -234 -82
4290 -82 -344 -11 143 83 -77 -153 -440 -72 -151 -142 -67 -65 22 -143 -319 -159 -75 13 -60 62 -65 -106 -80 -201 44
4315 44 -160 -489 -203 83 120 -173 283 227 -102 -271 -522 -123 -157 -83 -278 -43 -78 -259 -180 -124 -183 -115 -165 159
4339 159 -263 5 158 162 -38 -94 64 -354 269 169 -215 85 35 -193 -61 4 -78 104 83 372 -121 23
4361 23 -10 109 186 121 -194 -17 133 -71 156 -12 19 -266 17 -178 -7 130 346 -77 44 -136 -11 350
4383 350 210 278 308 14 77 323 62 116 153 -81 -227 195 -199 -131 36 20 -260 71 -60 -142 276 44 92
4406 92 -76 -163 -384 197 -152 235 -89 -194 -188 106 -101 -110 -148 -157 -346 -111 -415 -273 78 -19 -182 42 -144
4429 -144 -265 233 -136 30 146 170 -41 -191 20 82 -99 -227 -143 47 -69 -167 -245 -356 85 168 6 -224
4451 -224 -391 -309 305 -335 11 -173 -233 -110 48 -102 -94 375 97 18 -52 -114 117 115 32 -135 -89 -64 279 4
4475 4 -117 54 -78 -70 -58 -27 88 5 122 -7 -242 -26 15 -6 -113 -102 -6 21 -19 75 233 395 320 457 75
4500 75 -56 56 80 149 -104 8 13 -19 -1 173 215 128 121 176 -4 -21 284 -23 175 -29 23 84 -150 8 -98
4525 -98 58 -103 -32 -15 15 78 111 22 44 17 71 -23 -219 97 68 127 126 104 132 -46 -18 -1 -76 87 -25 -123 -103
4552 -103 -96 -307 3 46 -117 -165 -408 -246 -223 -59 25 -230 -315 -205 -85 33 -400 145 59 -333 -216 15 -25
4575 -25 3 -33 -141 -193 75 51 -71 -188 89 127 106 153 -209 27 245 67 -271 154 310 221 -23 -44 -194
4598 -194 -177 96 110 -175 -156 105 -167 -200 198 69 -90 145 -52 -32 323 85 -159 32 -84 -398 48 -16
4620 -16 -158 380 -109 236 -35 -245 -286 -43 -76 178 265 -83 82 163 -32 -145 176 -247 180 -13 303 63
4642 63 207 167 113 137 -191 -141 254 277 207 -258 -93 47 -254 -92 8 -25 -177 -63 -148 40 -183 189 81
4665 81 8 -126 66 -174 -39 102 38 215 389 -158 -262 376 32 -33 6 77 39 -142 -194 104 25 -72 69
4688 69 -320 -125 182 -44 -47 -1 89 -125 175 -52 -13 142 -136 197 -45 -92 175 -274 -93 -140 153 -38 -274
4711 -274 4 -366 -13 -37 229 -93 -140 74 -43 291 -120 41 -187 -252 -26 44 31 51 -100 -31 -108 365 222
4734 222 117 115 -185 -76 -272 73 52 119 226 -93 75 -19 -174 55 2 119 174 51 39 -52 -82 -58 286 90
4758 90 320 -175 -99 39 24 196 -58 2 99 -161 -81 94 134 174 -61 113 -93 -75 127 -46 -115 19 -92
4781 -92 309 14 -70 -46 202 -148 -70 63 -92 44 -101 -55 -133 -184 -373 100 130 -138 -182 -9 331 1 -60
4804 -60 160 17 -6 -149 161 193 -112 -38 44 -98 29 -261 116 -30 50 78 61 -36 -58 15 268 75 -143 146
4828 146 267 -118 69 -234 -162 -141 -405 152 -47 157 -243 98 -136 17 -66 -260 -289 95 208 -81 26
4849 26 -332 -30 23 231 -7 -146 -37 -242 -39 113 -38 53 -69 71 -193 137 -43 -4 -12 -188 453 26
4871 26 -116 66 -157 -42 -66 -62 -94 -92 230 -107 -68 -82 32 220 -90 42 123 -297 18 -122 -145 -341 -48 130
4895 130 -31 45 -99 414 37 -29 199 -70 246 158 113 -178 -75 193 160 189 -103 10 14 22 144 182 -197 397
4919 397 -218 -100 -33 87 203 -38 157 -84 -63 150 -101 115 -181 -26 -63 116 100 393 323 8 245 -213
4941 -213 46 68 114 -60 158 -75 -3 -57 56 -38 -333 218 -115 -12 -155 -21 -66 11 -95 193 -1 12 81
4964 81 55 13 -104 -34 137 -277 -303 59 -162 63 -112 -70 -29 153 -74 -229 -18 -66 85 -128 -267 -76 -69
4987 -69 76 120 -121 35 -55 -139 115 -94 -201 114 -286 -46 -89 -137 -143 71 -194 -44 204 -16 -108 -11 -88 136
5011 136 171 -54 50 -289 2 -143 26 -48 -74 -84 119 20 7 -125 -50 161 330 -128 -416 184 109 -84 113
5034 113 265 10 81 -180 -63 162 215 -21 -12 128 -132 -50 -99 130 -190 -22 -263 43 19 196 -273 -20
5056 -20 114 -6 -47 -71 -47 -233 -275 -16 110 136 285 -234 123 -49 45 -191 -379 99 103 -178 79 119 -219
5079 -219 -17 -153 -149 141 -106 -218 -274 -153 38 -265 148 -129 69 7 95 -93 -208 3 158 38 -27 -88
5101 -88 191 -129 256 62 -147 -268 148 -144 -121 -140 47 -75 -293 -178 -265 -73 25 -226 182 103 -289 154
5123 154 -165 -50 35 -91 -149 365 58 4 465 96 -221 202 352 101 19 287 162 -27 95 49 119 -71
5145 -71 -216 23 58 17 84 -79 314 108 -257 63 141 75 -229 272 120 29 56 172 121 -8 179 67 43
5168 43 44 145 258 297 -274 181 125 28 -53 272 6 214 -29 -182 150 -88 186 -46 -68 -83 135 267 -130
5191 -130 -389 60 55 -76 66 193 -426 -96 -126 105 -128 -14 35 -68 -235 -57 -312 -5 -143 3 -193
5212 -193 50 -9 21 -317 -146 -84 -112 -180 -218 32 -219 72 168 -117 -174 12 -138 -143 -35 250 118 90 143 -4
5236 -4 -277 147 2 118 -21 125 31 338 60 127 58 16 139 -399 73 6 162 -197 280 40 47 63 25 163
5260 163 75 196 213 276 13 -179 106 135 -92 -66 7 -175 27 47 84 -23 10 300 -168 110 -17 228 166
5283 166 -304 -203 151 105 131 42 -44 -140 -113 -15 -214 196 -53 53 12 277 -435 -154 22 -87 -35 241 66
5306 66 244 127 -175 -280 -8 70 -158 -11 90 138 213 76 253 -48 53 235 -181 208 -6 169 -172
5327 -172 -33 -389 -338 -34 -86 64 -145 -51 69 -276 -65 -119 2 -26 -187 72 -188 -113 81 -119 -189 -66
5349 -66 -100 4 -2 20 77 -224 -52 24 -218 -221 -184 -250 -115 157 45 45 0 321 175 -72 225 173 40 -250 -111
5374 -111 121 -188 -289 254 -50 -188 -10 269 151 161 -145 -35 199 140 154 146 -134 -40 -90 -40 188 -52 -17
5397 -17 -25 299 59 -95 71 32 -210 208 151 135 -168 -232 22 19 -36 -235 35 57 535 -89 4 -11 -175 240
5421 240 -65 169 -47 -311 72 33 -115 97 58 -63 -119 -180 -324 69 132 -153 38 186 79 -7 25 104 63
5444 63 -190 197 174 1 -50 216 103 209 -83 -63 -71 -271 92 195 -344 -76 134 -31 -19 82 255 -105
5466 -105 -26 73 -44 302 -433 28 -93 -69 -33 177 -15 97 -32 49 193 -41 -212 -28 -174 -160 -339 -95
5488 -95 20 -143 99 8 -216 437 17 90 -137 -54 210 89 -70 -196 -118 -341 263 -205 84 -23 -241 69
5510 69 -53 -275 -9 61 38 -266 45 -154 -167 -121 -10 -31 -173 -12 126 314 202 -44 305 32 -147 324
5532 324 318 47 144 -49 276 -311 -18 177 -166 -90 292 -288 -204 240 54 208 -165 86 -147 147 128 30
5554 30 135 -22 135 -158 122 113 -215 -196 -85 -26 -49 -5 165 -144 72 -89 -4 -149 -35 54 37 -102 5
5577 5 -12 -130 -274 103 196 -135 -56 31 13 157 17 -338 202 15 -230 -13 -194 -471 -93 -224 200 110 152
5600 152 -174 117 239 100 360 -195 -182 -105 -72 -74 -3 -102 -79 -36 -131 -151 129 -39 -136 160 48 14 -91 -236
5624 -236 -54 -228 187 202 62 -51 -30 -151 188 208 77 -23 238 45 173 24 -116 112 213 60 252
5645 252 105 -140 -109 -128 -63 -211 -105 92 -53 54 159 107 10 -29 126 171 -32 -71 -134 32 82 113 144 84
5669 84 111 39 -68 -501 88 104 19 -66 -27 -32 -193 11 -217 198 160 291 -4 117 -234 84 61 213 -45 69
5693 69 -22 82 -84 -83 11 -133 99 -238 -286 -26 62 -9 -76 120 -7 -124 -57 234 158 -31 -218 -218 102 -197
5717 -197 -76 -104 -199 -17 -71 60 -64 169 -105 -22 -57 -12 -177 17 -69 150 92 -13 -45 3 -109 52 175
5740 175 -28 -54 -38 -246 57 138 46 -147 -40 -97 253 116 -148 183 -55 -264 53 110 -97 158 -173 103
5762 103 -212 -42 103 -91 154 355 229 -259 80 -155 206 -7 71 136 1 103 -49 -117 189 -22 252
5783 252 -247 -227 54 61 -68 -53 100 73 101 214 -196 182 -312 172 -71 240 -37 56 299 34 70 -197 66
5806 66 130 -176 104 217 -73 -124 288 -125 -184 379 77 36 161 -33 -185 -14 21 -53 39 -32 -99 -191 -96 -53
5830 -53 -271 42 171 136 167 -85 230 -186 -123 18 5 109 323 -135 -47 48 9 138 111 153 -59 184 -102
5853 -102 301 -31 -52 185 14 77 63 -53 -107 173 86 166 70 -112 -56 -156 12 166 -306 58 208 -60 -50
5876 -50 331 -202 75 -252 414 -8 167 33 -73 196 -214 -125 -4 -84 87 92 34 238 109 146 -66 -236
5898 -236 332 33 -104 315 -82 -349 -65 -124 -139 59 -1 -4 -10 252 -117 -57 -83 -286 -54 -134 88 128 -138 250
5922 250 32 -31 -146 -51 100 36 -53 -48 64 193 -233 113 111 298 68 -109 -94 -2 -245 49 173 -88 -33 21
5946 21 -164 92 -97 -132 -255 27 -8 -185 29 175 -140 44 65 -68 -130 -139 -139 -100 16 -78 -25 -163 -255 293
5970 293 28 -118 -72 94 181 -66 55 -137 -38 160 -450 -42 -11 -213 -89 61 -396 -275 -108 -333 -150
5991 -150 107 -91 -99 -47 162 128 -195 -12 -123 -80 -79 11 277 -85 -12 172 -135 -103 -442 61 -133 -90 207 94
6015 94 81 -129 -103 -124 -148 76 211 -142 41 150 148 -207 10 236 291 290 50 -117 -297 -92 -97 -38 -202 -48
6039 -48 333 106 -220 -42 160 -6 1 42 168 -19 246 -225 62 191 -85 -173 -250 8 -199 -383 -116 22
6061 22 394 193 43 -101 32 299 128 -81 21 -19 18 131 27 -5 -218 71 150 -159 -251 84 -23 178
6083 178 69 85 -73 204 71 -16 -106 73 -244 23 76 -78 -17 141 -106 46 -124 -21 -281 142 147 -75
6105 -75 109 98 134 -191 -164 -336 96 -199 233 -18 -66 19 -139 27 166 -15 -181 -79 -127 -172 -24 37 60
6128 60 272 -102 226 -34 190 -15 160 -88 232 123 195 227 121 161 217 -175 251 -180 -29 234 70 -160
6150 -160 -172 -124 -80 -130 -91 -277 -112 -108 -209 -162 22 -67 28 -39 264 -193 -336 298 -45 176 -129 146 -255 -27
6174 -27 -48 -245 -2 -110 -313 -36 -33 35 281 -133 -36 -28 -58 177 12 -137 68 75 -87 333 212 -78 248 133
6198 133 -118 78 -117 1 23 -187 -65 -120 -97 73 -38 -11 -52 -2 130 152 126 -15 73 16 8 -33 69 148 -203
6223 -203 121 -34 -122 87 -181 136 -78 99 245 46 306 85 226 -81 41 85 -79 -134 -44 -175 56
6244 56 -191 72 -15 -38 62 -82 -29 152 -357 113 -86 11 209 34 -74 98 -68 -213 -19 -223 -99 18
6266 18 -5 -392 62 76 -199 82 144 480 -30 -60 -3 292 142 -88 80 -12 -140 -197 -139 10 -103 38 -32
6289 -32 -121 -120 -42 48 -338 103 -116 4 -355 33 319 19 260 -146 17 -284 -294 63 41 -30 -69 -217 -95
6312 -95 -40 66 -25 137 -51 -166 -53 -18 -17 -44 123 -101 -137 -148 32 -4 -97 -34 36 -77 -6 198 19 -183 -5
6337 -5 36 347 -189 -94 66 478 -13 180 79 61 219 9 -66 -166 83 -31 23 -106 61 -111 136 -21
6359 -21 56 124 38 -106 248 -193 84 281 -64 -182 22 102 -174 70 -133 -156 37 75 145 -89 34 -173 82
6382 82 35 111 -57 111 -34 -95 153 -76 -143 -319 30 208 218 -49 -263 -125 -251 14 277 -68 35 -54
6404 -54 -52 49 215 -6 128 101 -205 -5 -248 -144 28 236 -111 -132 -219 46 -81 -119 105 43 -278 89 -110
6427 -110 -61 69 58 -41 -77 -50 13 50 102 -62 42 -174 160 126 -183 0 149 83 113 250 -219 233 -75 -4
6451 -4 33 21 190 -102 158 140 -64 -43 44 -61 34 44 -119 -112 -179 -111 -107 32 -31 -70 169 -89 142 -8 123 66
6477 66 -84 -144 -192 33 -84 -265 184 62 -101 34 -100 130 127 -75 -11 0 -19 -65 119 -190 -241 -121 -155 -32
6501 -32 102 109 -84 44 -66 181 -6 45 137 161 275 205 -47 -156 -260 137 298 -131 -42 14 -65 233 133
6524 133 40 -179 66 109 156 208 139 -29 -85 -27 91 -288 -83 215 102 -171 20 -118 -164 176 54 -22 -146
6547 -146 -140 32 47 52 -83 -163 104 -168 65 -88 -32 8 -135 -133 136 -29 -107 -165 -9 -54 294 96 97 -7 163
6572 163 -104 -77 129 28 73 260 -25 116 375 -49 -140 58 -73 -12 8 67 -17 -9 -89 132 160 33 146 -148
6596 -148 67 223 79 149 187 30 -142 -159 32 100 -219 -172 -181 172 -22 290 -133 -8 -94 -110 152 162 -52
6619 -52 -38 -235 -97 73 -81 -65 157 96 -6 -109 66 -136 -105 60 -65 162 -120 -37 -20 134 144 99 -233
6642 -233 -18 143 -330 171 -149 187 464 -12 -83 -150 -52 -111 8 162 100 -176 404 101 38 289 8 140
6664 140 66 -99 11 68 -299 39 41 -176 -73 4 -198 173 -196 -122 -17 145 108 -68 148 31 112 -195 145
6687 145 8 173 153 41 117 -59 -47 26 -176 10 16 44 -241 8 87 73 232 -86 -191 64 344 31 -50
6710 -50 -179 122 160 148 -105 335 141 76 45 93 311 -39 -18 144 -69 155 -209 -216 125 -6 39 -100 318
6733 318 -8 -106 60 67 116 -12 -151 310 -199 -50 -90 -65 96 9 153 -8 11 -28 -227 141 300 -30 47
6756 47 -285 -58 -152 -85 -101 118 -260 69 -39 140 46 119 120 63 -55 -284 67 -44 -55 -51 -289 -127 38 -193
6780 -193 -43 51 -147 -4 53 171 6 340 -51 -256 -213 -290 280 -296 36 195 -125 154 -165 102 140 -156
6802 -156 117 127 117 -144 31 109 107 28 -164 -75 18 56 -221 142 -42 504 238 -124 87 -73 -17 -95 42 7
6826 7 302 -130 -16 36 277 180 -26 16 163 140 243 -346 -208 -42 -362 91 -82 38 5 173 -336 124
6848 124 13 -137 -21 -61 -33 -98 -110 -47 6 -224 -85 -63 -226 -4 -243 -75 166 241 87 40 -312 146 -157
6871 -157 31 -208 -250 -49 -321 -115 -62 -133 -149 -12 98 210 -29 27 153 -187 -42 142 192 90 203 157
6893 157 202 55 -83 -22 -21 88 -204 -67 199 -152 -84 86 11 -83 23 -51 67 25 -25 172 337 -57 -45 93
6917 93 180 -53 48 -6 41 71 196 -1 -159 -8 167 -227 122 -179 -24 -86 27 -17 150 -51 158 -158
6939 -158 291 -169 33 -56 -215 6 -120 -15 -122 393 153 3 0 -109 -35 -58 -166 -9 256 -104 210 205
6961 205 -357 -321 146 317 -30 188 -172 -186 -15 -149 84 151 67 67 -108 191 -37 9 -267 39 2 189 -288
6984 -288 33 162 3 7 108 -104 -73 -44 -201 5 29 -41 -350 -163 -136 -74 -152 -120 97 -30 104 -224 39
7007 39 -150 18 -39 237 19 0 -162 -74 70 147 33 87 49 67 -1 -243 58 -125 189 -73 124 99 125 -125
7031 -125 24 92 -132 -207 -22 -36 -179 -96 90 42 -104 -78 245 -7 -14 85 -382 -66 49 -201 -132 -48 -9 -140
7055 -140 152 -142 -149 -39 -180 54 118 146 -219 -8 329 121 -51 -50 -108 -64 -322 199 245 379 144 -64 -13
7078 -13 94 -22 61 228 -35 96 -196 277 179 145 70 -47 365 -71 -9 -49 92 20 119 178 103 158 221 -73
7102 -73 -75 -46 220 -160 297 -142 -184 -103 -155 -135 -7 104 16 36 171 144 112 -75 -9 69 -29 -39 134 474 37
7127 37 -418 -78 10 113 234 -192 -176 -126 -88 -1 234 30 -128 -107 -141 19 -49 -78 246 23 74 202 142 144 -72
7152 -72 141 102 -207 -91 296 38 -53 -54 -194 -164 17 140 99 95 -288 57 152 3 -80 205 179 71 -72 -31
7176 -31 -3 -129 74 -141 -133 455 -41 -83 -291 208 -368 -101 -69 1 -140 72 -218 197 -66 -216 -5 215
7198 215 79 76 196 63 -138 78 170 -214 92 14 127 9 -25 315 126 423 96 176 275 -312 23 -214
7220 -214 227 45 93 163 282 -52 80 311 201 -121 117 120 -125 -83 -7 -312 -298 40 -105 -123 130 -131 17
7243 17 202 217 -265 -118 108 187 281 110 53 200 -81 -121 198 -14 -10 -117 -197 90 256 162 -36 179 -65
7266 -65 229 -64 -73 10 18 -83 -194 119 -415 -28 18 -160 35 -173 -186 17 -339 104 -103 164 -45 -84 150
7289 150 76 151 70 80 59 135 261 -336 -82 -4 188 249 -7 -53 -131 -269 69 29 -53 -190 -194 79 -58 192 -34
7314 -34 241 74 139 -17 40 -160 -14 78 155 -66 -100 130 216 91 222 -212 -118 7 -13 142 16 170 198
7337 198 144 -59 94 6 74 -149 -52 364 -41 38 159 -128 -36 -102 71 -43 -124 -151 111 121 258 -103 -28 -91
7361 -91 194 57 -51 244 -205 -233 65 176 -84 39 65 -35 -10 322 -13 79 279 -189 26 63 95 121 -267
7384 -267 176 -206 161 111 195 186 -126 252 308 -74 -111 163 -46 -153 220 -217 -19 9 -21 61 -236 52 31
7407 31 -262 146 -100 164 1 -365 -94 153 -215 295 72 -191 203 -81 189 243 -67 -115 231 165 -22
7428 -22 -140 -135 -35 133 104 9 -7 -6 207 42 235 37 -4 128 -65 -179 -169 31 95 -176 124 177 40 18
7452 18 44 -93 114 121 16 137 -9 209 17 -56 250 45 226 56 -77 201 -172 -111 -190 308 -178 96
7474 96 -242 130 -155 143 -7 -92 208 114 89 47 -236 -78 -12 156 126 -188 316 -115 -285 355 -34 -484
7496 -484 -112 93 310 -30 -167 199 83 -99 270 17 -343 71 43 59 -169 50 26 -118 176 -191 -133
7517 -133 200 -128 27 -125 41 149 50 31 27 141 -267 53 -76 256 62 115 131 -191 13 -313 153 35
7539 35 -166 84 -84 -317 105 92 -105 169 15 -45 -61 -51 134 -175 135 -320 0 -62 -167 147 70 142 -65
7562 -65 -24 -92 94 286 54 54 -253 -77 -57 83 -4 -83 -19 -241 -73 345 108 273 191 -317 72 -46 131
7585 131 244 48 -279 22 77 340 216 -260 -144 -123 -65 213 -88 42 -7 17 101 -157 -194 -104 192 89 -63
7608 -63 -151 205 -46 78 -262 69 58 -174 -64 -168 -5 20 237 -56 -61 314 153 -223 -58 -301 -125 198
7630 198 15 17 73 9 33 -244 -74 -42 -139 -179 82 -74 60 184 -331 222 162 152 8 -31 9 286 71 160
7654 160 -159 236 90 -100 -25 69 92 -211 -116 -59 -142 -106 -66 -376 -92 -37 91 28 249 69 -195 215 -72
7677 -72 89 -114 -36 -202 -8 266 -197 -30 -140 15 -87 -46 -30 -74 110 89 -148 99 117 89 -109 -78 41
7700 41 -39 143 -27 -327 -80 18 67 187 -114 187 -305 110 303 35 87 -76 -83 -12 -148 205 239 48 196
7723 196 69 77 -195 -101 129 -44 -50 241 83 -18 -170 -7 -294 192 156 -83 -142 -163 -80 3 -207 -8 180
7746 180 85 107 235 58 1 21 -289 107 90 -9 186 154 -105 -16 121 -1 5 327 -224 -192 249 253 -138 68
7770 68 -5 46 -65 -45 11 17 137 -41 37 64 -26 -134 56 -163 -140 103 -143 -256 -57 -16 -15 174 -2 -143 56
7795 56 222 -257 -260 -204 61 -29 37 -86 -184 -204 -105 -193 -13 -68 123 215 61 346 258 217 -78 212 94 77 155
7820 155 229 100 198 122 114 -274 54 46 230 -60 -41 -84 -140 124 3 37 -80 -189 -40 102 -273 31 113 -191
7844 -191 -19 376 -169 -24 180 -142 6 94 80 92 -315 -73 205 -146 -585 -44 30 -86 27 141 168 -76
7866 -76 88 49 -11 -327 77 -273 101 -135 -52 485 -48 -52 30 120 133 -48 -171 9 -31 -170 102 -66 -131 168
7890 168 59 -415 -33 -55 -89 -3 -31 64 109 48 150 184 146 171 -91 -207 141 -166 15 194 82 202 32
7913 32 -115 397 -19 -117 -171 -142 -226 24 76 241 44 -93 -58 65 270 37 111 140 42 417 -96 98 -110
7936 -110 -64 -220 -37 -76 106 -70 -26 24 156 -93 266 -15 -109 -363 36 -301 1 51 -31 134 -269 393
7958 393 159 -155 -11 15 278 -422 -320 -208 -221 65 106 261 154 -97 -193 171 -25 -62 125 46 198 209
7980 209 -38 -206 392 -63 -23 73 -105 183 158 4 -52 -207 -90 -51 -13 233 42 48 81 128 -59 -120 -92 331
8004 331 -109 6 -331 42 229 -315 -54 -151 52 -268 171 -118 64 -167 -31 256 -113 -120 51 162 41
8025 41 27 23 -88 35 74 97 233 -124 538 197 -119 79 88 -85 170 -234 -184 288 -114 -73 -19 -79 88 106
8049 106 -26 -49 60 85 62 158 259 -199 289 68 168 84 94 135 102 -193 -103 -368 105 -69 -56 11 83 68
8073 68 87 -1 143 242 226 38 16 64 71 -29 180 -75 35 -227 -95 53 -84 5 -222 0 184 0 138
8096 138 44 -244 97 -37 344 50 -51 -147 -133 23 -22 -220 119 101 310 102 -37 208 1 157 -75 183
8118 183 174 129 -19 -179 -117 -122 45 10 -256 -168 -436 -265 -103 86 152 -25 -78 -91 -81 143 17 -57 -113 -21 58
8143 58 -86 -165 -333 -45 40 99 32 -44 172 102 56 -59 -147 149 -60 155 -372 -52 76 174 -152 -256 -28
8166 -28 38 -5 -59 -141 45 24 41 -48 -341 -3 -1 -362 124 -57 299 -90 68 -158 102 215 -249 223 -48
8189 -48 183 123
8191A23
$$ Imaginary data points
##PAGE= N=2
##DATA TABLE= (X++(I..I)), XYDATA
0 0 0 0 0 -8 8 0 8 -12 16 -16 24 -32 32 -40 56 -64 74 -88 110 -128 146 -172 200 -229 263 -301 345 -391 443
29 443 -501 564 -632 709 -795 883 -985 1095 -1217 1349 -1495 1657 -1835 2029 -2246 2491
45 2491 -2764 3072 -3425 3830 -4300 4859 -5533 6364 -7415 8798 -10711 13538 -18148 26970
59 26970 -49977 232496 505871 -53748 -207286 134604 416805 119823 -172215 2276
69 2276 334240 185617 -194651 -190879 210748 342275 40553 -186324 2033 214253 107138
80 107138 -86677 -4734 165632 80018 -155608 -146011 77353 141494 -38667 -126555 9138
91 9138 101445 -11543 -87487 49445 172264 43038 -143245 -84273 117601 125919 -55578
102 -55578 -112846 27665 89781 -43394 -123894 9432 133308 27292 -139932 -98248 71517
113 71517 87483 -58010 -115908 -20888 21970 -74054 -126898 -27204 56686 -26167 -139214 -95502
125 -95502 33026 49812 -43134 -78301 -18343 10685 -34894 -50352 13482 54641 936 -63607
137 -63607 -45446 18027 45950 32167 12674 -9342 -28467 -6223 52586 69051 9734 -42254
149 -42254 -12951 28081 -7955 -54766 -117 84786 36303 -106969 -123564 34257 131479 17212
161 17212 -128183 -82554 59074 51857 -78861 -85271 63714 111896 -45648 -165840 -49343
172 -49343 129255 102965 -61741 -96264 25965 80861 -7576 -51838 43917 106213 5970
183 5970 -104368 -44546 86426 86296 -18356 -42572 25717 30883 -46841 -48579 60218 95570
195 95570 -30974 -131996 -46234 87550 57179 -72221 -79820 29714 43089 -78698 -121762
206 -121762 11606 112929 5851 -150568 -109590 58917 88987 -50388 -122018 -23040 59648
217 59648 -16187 -109952 -47827 74847 50876 -85313 -114314 4805 77346 540 -82374
228 -82374 -40233 37269 13669 -57111 -36145 48360 47714 -48392 -83464 685 70144 22556
240 22556 -51012 -30173 36004 28040 -34227 -32614 39942 58645 -20041 -78296 -23577 63673
252 63673 56128 -22423 -51751 -6275 23210 -6314 -28904 3102 34363 -138 -57292 -49006
264 -49006 16368 46454 6988 -38545 -38062 -16693 -11061 -6478 14882 23502 -10874 -51080 -37978
277 -37978 16061 37638 4643 -24933 -14159 -602 -15203 -21233 15731 52028 20665 -51978
289 -51978 -68031 -332 59025 31553 -34079 -42989 1543 17769 -17345 -35266 4993 41411
301 41411 2081 -69782 -68292 14780 66889 19675 -55002 -54878 4992 30562 -6496 -31560 2951
314 2951 37389 7854 -44699 -31027 40876 70321 16645 -42024 -27820 30294 49153 17488
326 17488 -1284 18801 31449 6972 -11689 15375 49489 34198 -11929 -23462 11273 35957
338 35957 20827 679 7896 14254 -8432 -24446 5678 41572 20176 -33724 -38349 14391 43059
351 43059 6908 -29603 -7245 26359 4954 -35404 -14431 47274 50013 -17348 -51200 1013
363 1013 58699 38083 -17455 -17769 24511 28006 -8603 -8832 40219 56397 3740 -40418 -9386
376 -9386 43631 37366 -4545 -8599 20510 14420 -25484 -21210 37473 56237 -9609 -66977 -30451
389 -30451 38781 34879 -23478 -32036 16461 24313 -35647 -61350 6765 70805 25222 -66624 -67568
402 -67568 18910 62106 12264 -35544 -8992 31268 8395 -35586 -14061 52059 60580 -3386
414 -3386 -45319 -8712 46104 46270 9602 -3318 10941 12977 -803 4788 33333 39669 7553
427 7553 -19939 -8313 16745 17769 4128 4357 10923 -1537 -22531 -14248 21140 32283 -4343
440 -4343 -39301 -23855 15635 20518 -7455 -17195 6401 18671 -5074 -26365 -3927 34377 30185
453 30185 -12466 -30246 4149 41238 33096 -686 -9003 11748 22669 8577 -1057 15851 30926
466 30926 14977 -11903 -8891 19358 31088 11348 -11901 -12308 -1615 1912 1847 8674 9496 -10033
480 -10033 -29000 -18871 9132 14676 -8802 -25641 -15376 -2052 -7863 -14484 2090 19777 2175
493 2175 -35082 -37326 5564 36928 15730 -22832 -25049 3599 16320 177 -9000 7573 17722
506 17722 -5807 -32668 -20085 19527 32899 3056 -29587 -27993 -4880 4931 -2957 -8217 -5465
519 -5465 -9838 -23131 -24395 -6239 9591 4055 -15017 -24939 -21278 -11951 -1527 8847 10324 -5515
533 -5515 -23970 -20012 6471 23776 11294 -9519 -11121 3529 8451 1229 3395 19769 22829
546 22829 -2868 -26591 -10983 27238 34843 1417 -25926 -12261 16525 16717 -6934 -13443 4940
559 4940 9596 -13254 -27138 -5326 21572 12054 -20332 -29852 -7380 10631 1076 -13893 -11262
572 -11262 -3516 -8129 -13989 -3704 9044 2094 -16550 -19418 -4410 3253 -4672 -8494 1209 3549
586 3549 -12734 -23047 -2987 21983 11644 -22995 -31303 -1914 20911 7655 -14186 -7026 12066
599 12066 4919 -20542 -17670 17009 32461 3476 -29040 -18167 16666 27642 7703 -7962
611 -7962 -2101 3487 -4655 -6979 9163 22093 9930 -12571 -17344 -2863 8914 7985 3298 -2307
625 -2307 -12431 -20455 -11213 11384 18621 -1370 -22904 -19999 -2624 3603 -3829 -4946 4086 3696
639 3696 -12622 -20593 -1543 23392 19363 -9210 -24327 -8185 13828 15374 2799 -2024 4587
652 4587 5185 -5318 -9722 2604 15331 9341 -10178 -18700 -8351 7635 10398 -1076 -13014
665 -13014 -15286 -10032 -5878 -4076 -4192 -4595 -7072 -11530 -12945 -8469 -537 2089 -3861 -12000 -13955
680 -13955 -6356 5178 10813 4011 -8655 -11745 -932 10534 9079 -1508 -5582 1107 5952 379
694 379 -4121 4770 12714 2536 -16902 -18255 3673 18502 6810 -16074 -18820 -1910 8368
707 8368 701 -7854 -3010 3344 -2847 -11236 -4269 13316 20252 7563 -6621 -4280 9239 18772
721 18772 19434 16936 13611 8771 9064 18564 28272 27285 17905 12486 13846 15142 13757 18953 29199
736 29199 27709 7230 -9079 663 23195 26613 6787 -9542 -4944 5420 3364 -3566 25
749 25 8611 1946 -18216 -25278 -8086 11776 9674 -9119 -20853 -14419 -1961 1864 -1271 -3432
763 -3432 -4971 -7929 -9957 -5324 3034 7552 4613 -3044 -8993 -9102 -1825 6641 7904 -532 -11342
778 -11342 -10701 779 8130 1938 -7777 -7986 -3219 -3448 -8924 -8267 1085 5356 -3779 -15400 -13075
793 -13075 885 7910 -454 -11867 -11785 -1440 5861 3403 -2003 -1216 2999 1984 -2824 -2114 6121
808 6121 12250 7736 -2555 -4338 5482 16100 14377 3738 -3672 -946 6403 11034 10436 7783 5474
823 5474 3477 1667 2176 6505 11718 10846 3061 -5256 -4405 7462 17620 14753 918 -7882 -4346
838 -4346 5989 10580 6792 2791 2469 2290 -2230 -3670 3714 12643 9818 -4445 -14714 -8172 7677
853 7677 13736 4190 -6594 -7526 -2214 -999 -2047 -659 3634 1981 -5735 -11808 -7344 4047 8998
868 8998 2338 -9135 -13888 -8456 1073 5114 1281 -5077 -7196 -5898 -5355 -4936 -2653 584 -1295
883 -1295 -8613 -14652 -10273 1836 6519 -1507 -13630 -16142 -7422 558 -204 -5854 -8096 -4839 -3121
898 -3121 -5810 -5861 -427 3742 -1020 -9602 -10016 -121 9220 7763 -2087 -7271 -2164 5658 6850 2233
914 2233 -1452 -53 3118 2770 1143 2773 6808 6146 -1380 -7242 -3851 5487 9168 2391 -5960 -7175
930 -7175 -1106 4364 2782 -2142 -4598 -4239 -3681 -4366 -2909 1300 5263 2020 -7065 -11223 -4678 5958
946 5958 8679 584 -8285 -7670 501 6310 5174 2163 972 -128 -3086 -4769 -460 8302 11375
961 11375 2715 -9016 -9803 845 10592 7993 -2707 -9193 -6244 -717 874 221 1625 1569 -4060
976 -4060 -10324 -9897 -1769 5364 4439 -4947 -11466 -8512 -190 4864 2339 -3624 -6219 -4671 -1780 -14
992 -14 803 3041 4350 1091 -4226 -4803 1626 8373 7991 -140 -5883 -1685 6902 9083 3509 -864
1008 -864 -1 3506 1849 -2332 -500 6117 7478 -456 -7890 -4003 5425 7542 -791 -8501 -6755
1023 -6755 241 3514 547 -2842 -2349 -1565 -2946 -3994 -2167 1217 2274 -1364 -5851 -4475 1618
1038 1618 6769 5438 -1562 -6735 -4616 2966 7828 5582 -69 -1941 832 2900 1935 1755 4201
1053 4201 4708 -185 -7204 -5559 5130 11329 4851 -6763 -10376 -3446 3286 2173 -2654 -3043 -1146
1068 -1146 -2612 -6334 -5469 1585 5759 1409 -7909 -11038 -3716 5795 7679 2545 -2162 -2827 -532
1083 -532 2019 3889 5513 5517 2845 -410 -1058 3306 9139 11313 6896 -794 -5402 -1130 7360 10505
1099 10505 4555 -2389 -3133 789 2644 675 -119 1646 1782 -3929 -8782 -4261 5430 7725 -1118
1114 -1118 -9226 -7307 1650 5370 509 -3933 -1648 2907 2286 -1120 823 5909 6267 1262 -3006
1129 -3006 -584 5884 8087 4381 567 587 2365 4086 4517 3079 -75 -1837 216 2193 1425 -671
1145 -671 -807 705 -1189 -5282 -6660 -958 4643 518 -8223 -9949 -1684 5239 2332 -5232 -6606
1160 -6606 -2120 152 -2758 -3436 2293 6354 1280 -7418 -7135 1965 9096 5218 -3715 -6150 -2149
1175 -2149 2900 3943 2992 2367 -266 -3810 -4725 -1914 2516 4298 2112 -2522 -5797 -4911 -64 5655
1191 5655 4891 -2145 -7965 -5755 1631 4543 2446 -224 42 409 -2185 -3880 -170 6239 7030 -974
1207 -974 -6890 -3687 5213 8581 3194 -3353 -3080 787 1230 -1009 -110 4493 5448 -769 -6185 -3807
1223 -3807 3716 6966 1677 -4317 -4469 605 3462 2692 1603 1028 -139 -1303 -930 518 2261 2738
1239 2738 1244 -514 -1300 -989 1611 3829 1472 -3994 -6309 -1562 4155 3199 -3380 -6206 -2286 2013
1255 2013 -465 -5186 -4088 877 739 -5161 -6643 850 7172 2881 -6534 -7245 680 6556 3175
1270 3175 -1651 -345 3381 3226 561 1799 5875 6464 1788 -2198 -492 3728 5791 5480 3404 20
1286 20 -3093 -2786 2399 5165 1609 -3658 -5300 -1845 -436 -1938 -1799 833 788 -6141 -11593 -6438
1302 -6438 3953 6050 -2036 -8987 -6554 278 2839 -330 -1217 1229 1211 -3402 -4349 1422 8311 7376
1318 7376 4 -5246 -3210 2048 5268 3768 564 -1664 -2188 -794 504 344 -127 -1166 -3178 -5390
1334 -5390 -5849 -3100 379 262 -3019 -7101 -7182 -3016 -323 -714 -3750 -4732 -2797 -79 -129 -1404 -746
1351 -746 2400 2282 -1424 -3369 1153 6725 6144 504 -2433 1956 6973 5821 220 -1107 2632 4761
1367 4761 1903 -844 1980 5766 3668 -2018 -3688 1136 5100 2342 -2907 -3659 57 2509 2051
1382 2051 1598 939 -465 -2231 -1185 2777 4184 2348 360 862 1816 833 1419 5426 6931 1533
1398 1533 -4887 -3143 5925 9551 3578 -3031 -1835 2772 1450 -2786 -1470 4059 3646 -3784 -8583
1413 -8583 -3814 4481 4569 -2833 -7741 -5735 -2239 -2368 -2832 -1063 242 -3058 -6506 -6110 -1930 712
1429 712 -107 -2403 -4100 -4803 -4522 -865 3697 2773 -3243 -6899 -4052 1097 1835 -935 -1675 250 -34
1446 -34 -3690 -4430 1004 5369 1694 -5765 -6634 -689 4492 2964 -1781 -2958 -239 948 -1248 -1637
1462 -1637 692 2782 1249 -1739 -1952 1397 4268 2801 -1056 -2108 -159 2485 2925 1454 410
1477 410 594 1860 2257 1820 1079 1403 1765 1641 923 867 2744 4150 3523 188 -1448 334 4164 5227
1495 5227 1742 -1023 75 3443 4230 2010 257 1968 2703 213 -2963 -1035 4681 6464 936
1510 936 -5269 -4108 2020 4238 344 -3202 -2409 -699 -1993 -2841 -240 2984 1385 -4197 -7198 -3857
1526 -3857 670 2238 -144 -2079 -3260 -3300 -1771 1676 2769 82 -3415 -4163 -1120 841 770 972
1542 972 2446 1105 -3162 -4573 -565 5092 4082 -2004 -5413 -1416 3209 2167 -1659 -1421 1697
1557 1697 419 -4437 -5455 213 4660 1787 -3710 -4908 -1231 1634 393 -1322 -1309 -604 -1624 -1843
1573 -1843 -122 2188 1690 9 -963 -916 -281 466 2451 2946 1195 -1555 -157 3293 4683 1503 -1864
1590 -1864 -713 2788 3498 901 -825 1744 3742 1258 -2147 -566 3446 3481 -1149 -4309 -850 3615
1606 3615 3961 -721 -3438 -1473 974 292 -1145 -423 585 473 -1368 -2220 -184 2285 2206 -325 -2705
1623 -2705 -2678 -97 2675 3051 1240 -712 -1266 -161 946 1459 1642 1260 565 -414 -1265 -13 3232
1640 3232 4412 1859 -2550 -4292 -1290 2674 3119 291 -1740 -1202 -538 -1656 -1503 634 2517 -160
1656 -160 -4309 -5418 -922 3908 3487 -1475 -4294 -2713 -179 312 308 586 1079 377 -1516 -1419 1586 3805
1674 3805 2561 -254 -1659 -451 1399 2743 2961 1950 -128 -1009 410 1650 1305 -749 -738 824
1690 824 440 -1812 -2074 598 2513 -715 -4303 -4028 166 1793 -778 -3872 -2142 1259 970 -2243
1706 -2243 -2519 249 1890 -492 -2751 -1082 2905 3576 719 -1666 -372 2226 2523 1182 832 611
1722 611 592 695 1585 2409 2041 -175 -1005 -893 -605 -418 615 1618 -688 -3595 -3946 -529 2589 626
1740 626 -3677 -5102 -2071 261 -291 -1174 -314 232 -1455 -3501 -2875 1237 3664 1321 -2513 -3240 38
1757 38 3412 2758 864 -86 103 251 -382 494 2549 3681 1768 -1255 -1955 -308 1965 2240 1501 -954
1775 -954 -1992 -1794 440 1701 1136 -24 -1191 -1362 -1506 -977 74 1947 1750 -809 -3231 -1449 1480
1792 1480 2884 589 -2250 -2800 384 1631 666 -231 285 1102 -655 -2392 -1786 966 1823 -260 -3054
1809 -3054 -2032 730 1612 -183 -2229 -1932 -942 -418 -847 -766 -275 -29 -486 -801 -287 285 24 174 -410
1828 -410 -775 -398 1614 2548 961 -737 -1181 618 1844 1303 -650 -911 616 1073 -444 -820 1041
1845 1041 2261 918 -2859 -3532 -247 2684 1837 -1672 -2477 -670 84 -490 -328 533 941 -694 -2660
1862 -2660 -2049 1190 3082 2182 -572 -2444 -1636 312 2063 1810 70 -1076 -1202 -432 641 1250 1351
1879 1351 139 -981 -2321 -2273 -93 2392 1887 -758 -3244 -2678 -96 1594 399 -1030 -669 30
1895 30 235 -603 563 2211 2348 257 -1841 -725 2264 3427 2142 411 385 1091 1108 758 603 1157
1913 1157 1406 356 -892 -898 803 1500 736 -1317 -2435 -1830 -431 -43 -759 -1842 -1876 -838 -626 -759
1931 -759 -1070 -1247 -1003 -608 -1227 -983 292 1561 981 -924 -1010 938 2755 2066 -421 -1337 1084 2897
1949 2897 2306 1069 635 1325 746 -192 -360 1162 1611 633 -1745 -2010 -355 1126 777 -1110 -2484
1966 -2484 -2316 -1806 -261 -3 -243 -432 -1281 -1439 -1264 -675 282 902 161 -1177 -1937 -309 1859 2963
1984 2963 1063 -1152 -874 316 765 612 1200 2008 1422 -615 -1461 -47 2219 2536 -4 -2359 -2308
2001 -2308 82 1365 1165 209 -1016 -1137 -1327 -1422 -468 511 1366 -111 -1518 -1343 785 2283 1987 348
2019 348 -988 -313 1232 2024 1703 1600 1549 1426 1516 867 1340 1825 2609 1756 201 295 1868 2807 1737
2038 1737 461 -152 794 1639 893 -65 -88 847 921 123 -667 -197 826 460 -864 -1802 -500 714 1038
2057 1038 -577 -1413 -583 71 344 -586 -1029 -446 -522 -764 -895 -269 354 161 -828 -2061 -1885 -319 1094
2076 1094 661 -785 -2198 -1711 -33 711 -174 -1079 -1322 -1051 -1186 -1149 105 1057 763 -1360 -2651 -1919
2094 -1919 420 1346 146 -1518 -1715 -637 292 -23 -344 -42 -165 -1259 -2726 -1544 485 1273 -93
2111 -93 -1359 -1590 -1111 185 445 -179 -680 -869 -841 -282 141 463 1378 1220 -333 -1431 -1033 809 2047
2130 2047 1262 105 -434 324 1535 1343 679 352 744 461 54 315 1423 1680 1343 -133 -708 -146
2148 -146 1463 1665 304 -716 -897 452 952 681 -57 643 -299 195 -451 -223 130 429 -470 -1167 243
2167 243 839 1285 -294 -520 -1540 -682 1790 370 -559 10 -364 -452 -398 837 181 -299 -388 -767 -1370
2186 -1370 -729 393 649 -469 -1403 -1834 -454 -151 -188 -400 -588 -697 -1248 -1531 -1175 253 800 -1013
2204 -1013 -2044 -1813 -387 971 729 -399 -1365 -1144 -718 -273 453 556 363 -193 -982 -713 419 1678
2222 1678 876 -793 -1727 -1193 -21 1074 1081 27 -610 -578 -430 -204 -136 222 108 -395 -1001 -1001 -112 1292
2242 1292 714 -489 -1328 -835 236 642 153 -73 115 322 -80 -221 42 513 1137 497 -158 24 1106
2261 1106 1570 1147 155 178 550 946 611 525 824 812 902 488 389 597 858 392 -343 -672 97 973 788
2282 788 -1 -982 -783 255 873 130 -740 -782 -307 -345 142 326 993 527 -616 -1019 120 804 1551 1235
2302 1235 -472 -533 521 1679 1682 1054 170 108 603 380 624 1509 1434 881 -245 -841 -158 1069 1062 53
2322 53 -807 -807 -333 -26 242 -256 -162 -453 -1222 -1694 -843 222 352 -109 -1222 -1415 -473 263 890 171 -443
2343 -443 -764 -542 213 382 544 687 555 -631 -1332 -454 822 1227 10 -1191 -1249 45 738 200 -675
2362 -675 -630 -573 -813 -681 -107 143 214 191 -720 -704 -68 677 287 -425 -450 186 686 1133 527 300 470 824
2384 824 825 661 714 909 1200 794 476 584 663 988 353 -179 -614 332 750 357 -248 -437 61 -246 -300 -801
2406 -801 -58 74 -94 -878 -746 -258 454 693 -199 -1146 -887 142 809 697 312 113 -141 -378 235 976
2426 976 1325 933 -425 -858 -208 961 1443 1305 372 -613 -483 113 910 537 170 -221 -187 -107 -72 657
2446 657 971 482 -229 -1085 -606 -140 869 520 -228 -541 -115 39 -192 -43 -47 -142 -496 -1255 -1090 -210 473
2467 473 3 -931 -1514 -1312 -624 -707 -680 -616 -856 -903 -1255 -683 -551 -441 -499 -1025 -1158 -772 49 965 216 -289
2489 -289 -282 259 612 809 440 219 580 813 1112 835 778 675 817 164 159 97 814 303 -219 -660 -33 676
2511 676 531 -666 -1169 -694 -356 -301 -520 -41 -125 -604 -1050 -727 -421 315 -135 -308 -372 -398 133 1163 1001
2532 1001 788 1 62 363 306 783 778 1248 636 21 -126 173 1210 1122 363 -483 -570 -98 503 727 234
2553 234 -21 -781 -786 -942 -254 477 677 -261 -998 -719 179 1202 480 34 -395 -539 -98 192 790 880 889
2574 889 231 -103 -63 131 552 497 0 -558 -389 91 692 237 -622 -964 -839 -664 -774 -597 -669 -364 -591
2595 -591 -905 -1220 -1321 -664 -649 -1141 -1160 -790 -424 -312 -604 -388 9 -6 -460 -562 -190 42 497 223 -171
2616 -171 110 395 445 190 -570 -58 -68 210 165 -17 35 -376 -167 -14 97 3 -153 -494 -617 -505 290 730
2638 730 464 -290 -801 -737 207 897 354 -414 -456 -71 418 759 691 708 460 -434 -326 332 1123 1287 454
2659 454 21 -269 206 294 790 320 185 133 71 190 217 851 963 447 -321 -213 -2 492 844 829 521 115
2681 115 140 343 760 620 292 110 221 200 -33 648 1027 1011 250 -494 -126 723 646 191 -265 5 183
2702 183 139 134 257 242 -185 -723 -599 -102 349 210 45 -453 -160 -169 -108 -501 -678 -428 -33 -274 -40 -50 -378
2725 -378 -142 -284 -456 -263 -327 -140 -50 -375 -539 0 -131 -252 -668 -1051 -712 -216 46 -284 -484 -337 -5
2746 -5 -50 -459 -21 138 316 48 -530 -399 30 613 602 277 -394 -196 -318 61 5 386 651 -83 -863 -87
2768 -87 497 797 339 -230 -540 -717 56 419 913 280 -285 -342 -268 0 489 531 75 -140 -204 -501 630
2789 630 1093 670 -124 -462 -268 430 533 709 721 655 290 -181 244 520 942 749 -41 -250 22 366 657
2810 657 346 162 231 148 -58 -209 54 723 175 -43 -338 4 -14 100 -112 -301 -476 -607 37 89 162 -366
2832 -366 -543 -262 -318 -610 -686 -215 -252 -449 -234 31 -33 306 -441 -373 -400 40 225 -184 -351 -286 -333 48 371
2855 371 223 -196 -438 -476 -518 -38 435 287 -274 -521 -847 -207 -235 -98 -569 -890 -743 -681 2 -201 -339
2876 -339 -447 -815 -923 -560 -424 -211 -29 158 -482 -644 -415 358 326 390 -496 -419 -252 -173 134 711 614 345
2898 345 -114 -299 289 827 865 527 -24 -143 104 536 669 411 379 -545 -585 -434 400 447 807 8 -424
2919 -424 -507 128 136 369 339 294 406 4 493 392 713 196 511 404 198 496 301 425 691 380 -90 323
2941 323 593 140 22 144 56 207 -65 -11 -97 322 -16 -396 -536 -610 -379 -255 -472 -369 -355 79 -222 -290
2963 -290 -384 -173 -248 -91 84 -204 237 167 -7 51 173 206 -129 0 -307 -46 45 644 442 -186 -475 -394
2985 -394 -169 -44 -156 176 -693 -593 -210 -551 -73 140 -336 -875 -1423 -326 121 -139 2 -409 -637 -719
3005 -719 -417 60 -305 -140 -300 -453 -203 30 404 839 395 -135 26 -267 17 157 527 506 54 -259
3025 -259 -130 181 663 473 95 -164 -218 -111 247 454 833 509 -15 -319 354 434 505 564 546 594 499 310
3047 310 623 834 588 56 125 218 386 533 627 287 276 -56 70 224 -44 -219 -139 32 1 -46 -203 -188 -91
3070 -91 186 -571 -57 -299 -334 -88 -701 -22 76 355 -72 -311 -271 48 135 75 -30 45 123 344 -13 124 185
3093 185 97 -104 -324 -357 -162 194 182 -350 -117 -185 -704 -540 -253 140 -38 -496 -688 -535 -266 107 -29
3114 -29 1 -194 -868 -602 -190 233 110 -380 -242 -506 -604 -6 77 204 -409 -413 -676 -280 287 269 39 -337
3136 -337 -573 -419 -152 -161 -131 60 -172 -397 -189 16 -92 163 86 -279 -70 166 338 163 748 386 164
3157 164 -198 4 382 661 775 570 322 321 80 458 549 456 550 564 404 231 213 475 487 95 98 2 90 -198
3181 -198 150 -15 -74 -143 189 46 -27 -64 10 -153 -58 13 -285 -100 31 240 328 398 55 65 106 -14 290 149
3205 149 426 335 -254 -153 167 349 291 139 -114 -386 -179 44 192 -29 62 -490 -754 -703 -164 -204 -29 61
3227 61 -177 -262 -316 -225 147 -53 -74 -372 -488 -401 -7 249 234 111 -116 -403 23 180 40 138 70 18 -171
3250 -171 -267 92 414 34 -142 -357 -573 -493 33 136 -27 -323 -740 -360 -200 -203 -118 -163 -381 -241 -338 -16
3272 -16 215 16 25 -242 -387 -194 12 135 191 -35 -21 5 305 9 -119 309 145 56 115 -14 14 193 240
3295 240 154 -141 -96 200 -66 87 168 171 147 147 -69 229 255 201 -206 4 310 -9 -38 324 -72 134 17 140
3319 140 114 -256 -138 171 147 123 42 176 -44 -152 -74 110 307 199 -199 -430 66 56 567 343 -305 -418
3341 -418 -470 -104 379 119 87 -39 -66 -76 192 130 267 -193 -101 -337 187 303 -118 49 18 -172 -193 181 -197
3364 -197 -242 -53 -225 -324 -361 -21 -319 35 -94 144 -574 -274 -95 -48 55 -6 -104 -272 -374 -230 -115 -191
3386 -191 247 -549 -84 104 177 -15 191 -133 -263 -277 -124 39 -64 250 -106 113 -61 183 -151 -198 -175
3407 -175 -234 -29 -283 -62 65 -131 37 230 151 -116 -331 -327 -250 -2 141 482 84 -24 91 -167 51 384
3429 384 69 325 -110 44 424 54 384 88 117 232 -28 173 212 204 21 44 276 195 -316 44 390 160
3451 160 83 48 183 34 127 238 100 38 192 -56 -477 161 436 96 -57 15 -131 -112 364 331 49 -316
3473 -316 -382 -72 221 241 104 -77 -195 -279 -273 3 -223 144 -8 -14 -84 24 -215 30 -159 -308 -367 -209 -47
3496 -47 -11 234 -122 -23 -400 -207 -573 -187 -160 107 -252 -272 -258 -439 343 -252 -134 -57 -143 -43 -28 15 178
3519 178 -52 63 -119 -145 56 289 20 227 -55 -31 138 178 -183 22 19 -14 86 51 204 -114 -231 0
3541 0 104 41 -236 -134 -307 -319 24 110 295 -178 -263 75 273 184 438 140 20 -13 -21 255 438 80 122 253
3565 253 99 172 206 200 172 272 -127 80 288 649 363 -60 179 9 -154 -126 93 -70 120 230 -162 -39
3587 -39 -59 145 481 4 11 207 75 316 357 335 192 101 194 -220 68 329 229 179 -6 -23 51 98 30 -10 -15
3612 -15 -185 -89 24 -232 -68 -51 -282 -303 -261 -100 -157 -346 -111 -307 -488 -229 -278 11 -408 -422 -98 -289 -213
3635 -213 -60 -89 -34 -29 104 -139 -182 -476 -352 -2 -145 69 -62 -105 -67 30 -4 -239 114 85 -299 -36 -159
3658 -159 -37 -220 -146 79 -492 -191 -190 -361 -30 -324 180 195 47 -292 -311 -35 -60 225 -19 54 234 234 230 203
3682 203 143 219 137 37 96 302 155 51 140 -115 10 60 54 215 170 -386 113 171 396 284 -103 428 383 316
3706 316 -44 212 215 162 225 127 -66 137 605 111 142 325 196 211 -153 350 511 227 308 59 -190 -176 245
3729 245 -149 158 -366 -371 -342 238 -192 41 -361 -237 -336 -219 46 -40 -187 -242 -274 -5 -65 -124 -37 -117 -178 173
3753 173 203 131 -38 136 -305 -238 -213 -395 -295 -341 -347 -198 -42 -60 -156 -194 -244 -183 -254 -342 25 -190 -477 -285 -201
3778 -201 -57 -6 -214 -97 -195 -319 -263 -126 227 5 -19 -34 -198 -241 21 194 157 89 98 -27 23 -58 -8 -22 162
3803 162 114 134 -74 262 227 452 44 175 28 -291 328 412 -130 -159 215 361 397 234 342 -5 -262 97
3825 97 -211 326 323 31 422 327 129 456 169 234 41 93 -15 37 368 56 347 203 -16 142 -271 5
3847 5 211 424 5 85 -108 -51 286 29 -129 34 -204 -128 1 -183 31 133 -63 285 77 -95 140 68
3869 68 -109 215 53 23 -165 -4 113 -246 -380 38 -43 -350 -282 -165 -34 -327 340 254 -306 -172 -310 -354
3891 -354 -125 -30 4 -152 -44 -427 14 -123 -144 43 12 -183 -107 125 184 -34 -72 77 -67 -205 310 36
3913 36 45 62 221 64 -52 425 108 8 -72 -40 -62 33 355 141 190 -80 63 -2 -65 255 -67 -293 219 146
3937 146 118 31 214 131 114 86 69 115 265 137 287 -9 97 46 234 96 244 150 -187 209 -20 409 242
3960 242 39 90 189 78 252 -127 -2 -18 -54 -230 113 117 -101 -48 -246 -46 -146 219 88 4 204 5 352
3983 352 -228 -80 -48 -396 -306 -11 -160 282 51 71 -84 58 -162 -127 -169 -52 -337 -157 -176 99 -94 -254
4005 -254 46 112 -249 -194 -141 -79 1 125 -55 -118 -93 -7 157 -122 -38 223 -148 -321 -177 -308 117 -336 -308
4028 -308 -327 227 219 -201 165 61 -14 -221 -162 -108 -25 -122 -131 -329 -159 -283 -51 -95 4 59 179 87 -45 126 -102
4053 -102 146 -215 -28 2 29 -164 143 -71 156 140 11 127 -198 176 139 -133 -12 -157 163 -161 379
4074 379 10 -112 109 109 379 198 -28 241 -103 -94 297 -15 7 230 258 180 -6 158 167 -73 29 193 -94
4097 -94 -26 109 51 -178 -87 86 31 89 118 8 47 256 244 47 -26 -197 -20 102 13 -88 8 -176 125 46
4121 46 -57 82 234 -101 -4 -205 -72 -131 57 -87 19 -98 -103 -147 -60 -101 -447 7 -487 -199 -171 -267 110
4144 110 -12 30 375 -488 232 -196 -91 -178 280 11 -185 -72 -161 32 210 -13 -271 -129 -270 385 -136
4165 -136 319 -75 -294 -335 -136 -263 -12 -39 -32 11 -70 272 -146 -55 31 0 -67 -51 -266 44 138 161 36 1 -60
4190 -60 -140 -20 -81 173 89 148 84 106 -25 36 44 49 128 165 8 364 293 -44 225 136 87 193 -70 -59 255 50
4216 50 63 173 -126 -5 -56 312 302 125 178 -120 118 23 430 175 -6 165 35 152 112 413 201 462
4238 462 -106 117 -93 18 -200 72 76 -168 -63 -202 190 3 -59 -55 -138 -311 162 22 240 179 -170 28
4260 28 25 354 46 -173 314 -127 -185 -91 115 16 -229 38 -51 -188 -138 -190 -36 -93 -231 -181 -192 -212 -69 -132 -52
4285 -52 -168 -295 -589 -177 39 -95 -100 -97 -152 -197 229 25 -22 -43 -74 -84 -127 49 14 -79 34 144 15 -26 140
4310 140 -25 -188 19 65 157 63 40 -22 -36 204 165 2 -3 -55 -38 264 20 106 117 -235 -14 122 -213 290
4334 290 -92 -81 23 -16 149 247 155 235 179 35 148 239 357 -213 -1 218 187 -107 -30 8 112 67 0 -169
4358 -169 95 -199 120 -163 -55 -37 82 -87 221 -179 132 250 105 -72 -357 -328 9 75 -12 153 2
4379 2 122 -176 140 -35 46 -52 77 65 -8 100 -19 -120 -11 -54 -81 -63 44 25 117 76 -368 -112 -372 -279
4403 -279 -87 -437 62 -314 3 -364 -144 106 -234 115 -57 -226 -36 150 44 -236 -272 9 -245 -60
4423 -60 -179 -79 8 -33 161 -328 -33 61 -105 -355 -8 234 40 -142 -200 46 143 -204 168 97 -150 70
4445 70 277 59 144 -16 239 123 -20 241 -18 142 228 -27 23 -86 122 134 58 29 82 -31 -37 124 406
4468 406 1 128 192 -37 268 -24 147 -60 63 294 45 -161 -105 192 135 -188 -178 81 75 -21 99 27 -449
4491 -449 223 -37 -168 7 146 175 46 -87 49 -136 -246 -151 -7 207 -88 160 -73 98 -161 68 -9
4512 -9 -20 23 -231 138 -38 -366 193 -109 13 -95 -387 -133 -189 -195 -146 343 -10 -138 -335 21 160 -90 -36
4535 -36 61 -10 -27 85 -120 133 -268 -163 66 -289 108 101 -68 207 104 -308 86 -129 68 -27 -300 45
4557 45 29 -59 -1 45 -143 -111 -300 -70 211 -166 -131 97 -12 239 154 -53 -51 -17 -23 -187 -37 -69 217 195 92
4582 92 34 -40 223 190 27 100 52 -321 250 109 253 241 251 -16 218 403 167 -74 131 88 24 96 260 360
4606 360 -3 126 38 -26 254 -328 223 292 137 164 105 275 -32 389 -209 336 -81 96 -124 -88 59 43
4628 43 136 32 49 0 -40 -78 -36 -111 -111 -79 -191 -241 -270 -362 -234 74 80 -363 22 -1 96 -217 -224 51 116 48 -26 -57
4656 -57 29 -265 -165 93 -8 -343 -16 38 -290 -206 -185 -171 -24 182 102 -162 -205 -365 -211 -107 -5 200 -44
4679 -44 -214 -143 -134 210 2 -92 55 -251 -212 220 122 -179 -57 25 399 -16 128 64 -62 63 123 -134 -4
4702 -4 -136 109 1 154 159 60 241 -6 263 254 -41 14 55 118 10 221 -4 162 -78 -92 -196 180 364 122
4726 122 34 -2 -226 -19 -35 279 61 12 247 174 26 -13 21 -38 1 -78 104 325 -51 -109 -29 197 63 1
4750 1 2 -39 -199 34 -1 -33 -104 -134 -64 -14 83 102 125 -31 75 -333 77 -72 -252 124 -101 37 -91 124 -238
4775 -238 -141 -309 -193 -282 120 18 7 50 -92 274 -111 -45 77 133 -62 -23 -182 -416 -13 83 -497 -87 -159
4798 -159 -109 311 -12 208 -172 65 -49 -216 125 -23 -64 121 44 -255 -106 29 -91 -3 91 -91 238 -53
4820 -53 212 83 238 -38 -181 141 -93 127 -57 -144 49 143 134 -66 9 -115 28 -128 -132 -69 -92 -63 -168 47
4844 47 -104 -38 263 75 -154 -96 103 300 124 28 21 84 111 172 94 105 190 1 79 111 48 61 -96 118 -63
4869 -63 -25 254 -69 61 54 -149 102 160 127 -225 162 1 -61 -156 126 281 -306 55 130 -48 -53 -255 -81 78
4893 78 503 220 45 -139 -6 246 8 -41 -306 104 223 -82 -54 199 175 129 -230 170 96 -46 26 247
4915 247 3 39 185 -118 -115 8 187 -327 -52 -162 -39 191 32 21 137 -352 -53 -90 42 -22 23 290
4937 290 161 224 217 -58 193 -62 95 -42 -11 -234 -102 318 51 -103 -91 -103 -324 -142 -145 16 100 -118 121
4960 121 -98 -29 220 232 49 198 109 -106 155 -20 -11 60 128 -94 -85 5 -112 200 266 -201 -312 80 151 -150
4984 -150 273 211 -2 -108 -48 52 35 -22 -229 211 410 -237 25 -150 60 -227 53 -144 -55 157 -76 190
5006 190 110 46 -75 -152 40 83 -30 123 107 -67 24 -149 -121 151 -218 324 204 -120 -127 -286 -33 -10 31 -87
5030 -87 -137 -88 261 -45 36 -85 -222 95 9 -38 -250 206 455 -30 146 -220 -68 -90 -214 -155 39 -8 268
5053 268 -284 -281 -51 -163 -47 -125 27 -319 -49 -28 64 -266 -128 58 -181 -133 -24 -190 242 76 -8 80 -226
5076 -226 199 -79 -35 -116 -115 76 181 7 14 -19 18 -36 1 95 113 -28 -81 299 6 303 33 -63 119 -29 -68
5101 -68 305 104 210 27 -67 -12 -172 21 -33 -21 74 148 142 -234 169 224 29 -116 217 -14 239 323 125 230
5125 230 209 -60 128 -126 -47 -179 240 128 246 224 -231 -399 46 114 -65 379 252 -111 13 -198 8
5146 8 -127 -157 -175 18 89 135 -144 -32 -108 -23 -56 -196 118 65 52 212 -73 -188 122 -207 -77 -127 -121 -45 22
5171 22 -295 -114 -22 -84 315 -210 -326 -17 101 -34 229 90 51 99 340 -7 -124 13 206 170 -308 -149
5193 -149 -99 60 10 -11 6 -69 -214 56 -195 421 92 -181 -137 -202 -126 140 17 -199 92 11 387 -117 305
5216 305 350 111 -226 -54 171 180 -72 -72 -245 -22 150 -126 -197 98 -3 256 269 122 -57 105 108 76 455
5239 455 22 104 -182 -350 28 -265 151 126 -113 80 304 98 36 190 148 15 -50 49 36 219 212 157 -8
5262 -8 -68 -103 24 85 279 148 -106 326 -86 79 -195 251 -101 145 -143 -6 149 -107 157 -91 -195 -152
5284 -152 -51 182 -34 131 50 231 -74 -182 -115 -130 -36 -153 155 -258 110 -12 83 -173 -207 176 -81 -92
5306 -92 12 14 -84 -83 18 179 -45 -23 7 -163 35 -106 -37 -218 -291 -518 -213 1 -76 48 218 -244 -420 185
5330 185 -115 62 -61 42 -208 -64 -39 -194 51 81 108 82 -242 -28 247 -52 265 -41 -57 107 105 -141
5352 -141 -138 76 28 122 85 43 362 -2 -88 -171 156 65 235 12 26 -62 30 147 73 182 83 262 -1 339 25
5377 25 58 -36 -87 41 10 -6 -175 -56 -4 -40 11 157 -95 -146 -51 -83 -59 67 42 -156 -114 -301 232 90 -326
5402 -326 96 215 -110 17 306 174 -162 -27 -23 -210 114 170 155 -146 -162 139 169 204 141 249 -168 211 123
5425 123 -96 -119 115 266 279 125 42 31 49 -138 -96 -277 -29 -64 -12 -8 -185 77 -39 251 -121 60 -62
5448 -62 195 -36 -130 332 -86 -127 59 -39 55 28 165 -110 -67 -40 -119 263 227 59 88 -142 -77 -152 -18 157
5472 157 -144 -123 134 54 -91 -286 89 -62 -42 -6 124 119 -10 42 161 79 259 332 -25 271 62 68 -569 -75
5496 -75 -231 -63 -51 -58 35 -235 75 30 34 113 -52 11 -49 262 -236 244 104 24 263 222 -42 117 -104 -43 -65
5521 -65 80 -225 42 181 230 239 -82 -71 -65 -45 -157 78 12 -77 223 93 8 301 173 124 155 62 -25 119 -159
5546 -159 -50 88 -63 115 -131 153 -109 -122 -4 -83 56 -386 -252 90 -43 -44 264 -204 -107 15 -60 68
5568 68 -22 205 67 -331 -55 -131 131 -107 167 10 46 130 -180 -78 -30 271 -28 217 -40 133 -53 -241
5590 -241 -118 -81 79 -72 -60 -186 -146 -187 144 142 177 -63 -77 85 -63 -152 -92 -122 -356 180 -135 111 -106 -142
5614 -142 42 -161 -123 271 32 -109 -434 -99 141 206 51 -45 -203 -151 -32 -119 -27 35 166 195 199 204 304 -28
5638 -28 165 108 -121 42 -40 -57 144 179 294 9 65 55 -51 22 -80 -174 -60 10 234 32 -168 -56 102
5661 102 -157 92 2 17 -3 -2 114 86 83 363 154 -186 -68 20 -33 116 293 79 -64 272 -12 134 -275
5684 -275 -187 -159 -127 51 153 -162 182 -262 -147 107 194 224 66 -100 11 -2 -208 143 10 66 -86 -97 -43
5707 -43 1 -122 -2 125 -98 -106 26 193 -97 -188 -20 -82 21 -149 -184 6 126 -4 -191 29 146 -17
5729 -17 -153 -25 -38 145 145 8 127 283 -83 196 26 -244 -145 -57 -29 229 126 50 47 157 109 -21 -248 -202
5753 -202 304 -63 -33 -37 -24 -44 21 104 -72 82 -3 158 229 284 -94 -18 24 -120 183 103 25 -79 211 69 -54
5778 -54 -10 -98 -41 -99 73 -138 192 -104 -40 -78 87 -39 115 29 305 295 -65 -31 -222 332 115 64 -322 -23
5802 -23 171 -155 109 -14 -215 6 -267 196 -105 2 -278 -83 -6 59 -58 -132 19 94 -22 194 -20 -56
5824 -56 95 -87 94 -112 -215 18 -163 98 68 153 -313 111 -75 -27 13 20 116 143 -29 13 -137 -169 159 -666
5848 -666 -41 -233 125 49 -262 -344 99 19 -27 -89 -169 194 165 -107 54 164 81 73 -115 121 129 4 155 330
5872 330 41 -183 -246 -57 -22 139 214 -28 -45 -110 80 90 142 18 54 86 61 -201 150 -101 75 126 -3 142
5896 142 215 313 106 -104 -57 -109 43 92 170 8 -37 35 255 10 -55 -117 95 101 -265 407 -209 -168 -200 101 22
5921 22 286 -174 90 348 169 1 104 -199 22 -81 47 -22 -241 -7 -86 -77 -92 -134 -11 289 -316 20
5943 20 -122 -158 -142 150 -81 41 281 -169 -68 301 20 180 10 -325 -34 -305 -33 144 64 -216 -31
5964 -31 -230 -173 46 106 53 -95 -52 80 87 -87 -112 -27 38 30 164 61 -138 -26 -9 -317 -11 111 21 -372 -61
5989 -61 -152 232 -99 -82 -46 -111 129 131 11 56 205 28 -42 6 147 -103 177 -93 -9 206 286 61 228 -137
6013 -137 228 -21 -32 136 68 -162 203 257 -42 12 121 177 -1 -223 91 391 230 -52 308 228 166 -15
6035 -15 -17 110 -167 -45 -251 267 291 20 -141 184 13 168 4 -187 -95 31 228 118 -118 133 57 -102
6057 -102 -83 -391 -289 -66 52 -126 -212 342 -69 35 121 -24 113 -27 -277 30 -10 -148 -80 -86 -73 210 1
6080 1 72 -14 51 -199 -138 -44 -265 -22 138 -61 46 81 -9 167 -12 -21 -163 -184 -29 -83 -22 34 -254 -68 -181
6105 -181 145 -115 53 194 -242 -40 141 -47 -235 104 -54 173 161 -280 120 -44 -121 161 -167 -171 -35
6126 -35 -205 -104 -121 82 -174 129 -271 69 111 155 -13 125 26 129 -89 -156 51 112 -114 -16 284 -431 -9
6149 -9 -64 -119 -63 -65 -94 145 -76 245 -101 -76 -266 -40 33 245 -51 -236 -86 -79 177 23 55 -55 197 19
6173 19 11 58 -1 44 -30 -79 25 146 -3 173 141 156 -243 -35 210 -164 29 -134 220 9 -45 65 0 -6 -69
6198 -69 68 222 216 -279 -107 -179 83 -231 -236 -54 -75 7 -224 74 -238 240 119 -35 169 32 -156 121 102
6221 102 17 219 -19 44 209 -251 1 -7 -186 39 210 -220 137 -32 -188 76 -286 -168 -266 -212 -119 -24 -229
6244 -229 -272 158 -225 -274 110 95 118 163 212 -351 92 -376 -173 -40 -208 177 26 296 -109 96 8 -23 -37
6267 -37 362 293 55 -128 -207 24 62 89 -306 63 -261 155 238 -150 -220 -199 -52 14 135 -94 -21 -63 -256 -56
6291 -56 86 -44 -61 -427 37 7 -191 281 86 60 196 1 20 -109 122 2 231 -106 -128 24 -108 -26
6313 -26 -81 -64 97 22 -209 -219 239 108 85 16 69 -168 -52 25 106 -92 -260 11 -89 -13 -144 -280 83 -135
6337 -135 92 -147 -80 5 94 116 -40 -31 -51 157 -241 107 -148 -148 -29 312 -9 73 161 29 43 6 -115 119
6361 119 27 85 91 7 -245 -109 8 -275 216 270 -80 348 -158 -131 288 -182 -59 -74 40 98 -77 -269 -12
6384 -12 -147 -69 78 421 -38 196 -171 168 -42 -16 -88 264 86 61 -27 202 243 -26 143 135 28 -46 126
6407 126 -379 -167 -53 439 70 -61 237 -182 275 32 31 206 206 188 -228 -82 -180 14 111 -144 14 40 57
6430 57 -113 310 24 166 63 -91 26 -230 -133 -6 -85 19 147 28 -89 -268 -14 -298 -97 51 -116
6451 -116 139 9 77 30 -232 -99 132 -8 3 7 -99 -187 20 0 110 123 -20 155 43 -121 -45 -197 -176
6474 -176 36 115 -113 200 155 -270 200 156 -30 157 256 -48 122 -186 98 -225 -187 58 82 -26 -99 55
6496 55 277 233 107 -164 43 152 -41 -2 -306 129 250 -292 -17 114 -127 329 -45 235 25 37 -135
6517 -135 67 66 13 4 65 -34 50 -11 150 208 170 377 299 178 -168 90 210 83 -4 261 -28 -128 -31 252 -25
6542 -25 -90 24 -98 -154 -45 197 233 -149 131 -8 367 66 -350 -55 162 -43 -163 -62 88 -24 -40 157
6564 157 -97 151 -60 -322 -225 -136 -22 -18 -104 -340 -37 78 20 -15 44 -85 -171 79 -35 -61 34 97 58 35 41
6589 41 -116 -139 -18 -3 163 -126 -122 125 -304 -260 -21 -65 -60 -100 49 -31 300 -94 197 203 200 -73 -95 -92 -163 78
6615 78 -161 265 55 38 -175 26 -299 -55 127 30 -52 40 -275 12 27 18 208 65 -84 -181 -39 -173 30
6638 30 42 67 75 -14 48 -190 -158 287 -146 -38 -349 290 -152 -85 -59 -337 -159 17 101 24 -306 62 112 193 143
6663 143 -155 -132 33 -35 -114 67 94 -312 55 304 33 -233 -66 -126 -44 47 -16 344 173 -67 170 -121 -160
6686 -160 -140 -69 -386 9 255 160 68 -21 -13 139 -53 -15 -67 -182 2 -106 14 12 90 52 -214 7 177 -36
6710 -36 -65 -107 -240 90 98 -237 -95 -57 142 2 -169 17 -151 -23 153 -166 117 145 12 27 -55 -354 99
6733 99 -199 -238 -50 190 138 -32 56 -250 143 -114 14 -129 -108 29 -87 -27 278 -43 -150 245 206 45
6755 45 -132 99 -75 52 44 -19 54 84 -373 181 91 -114 179 -124 -279 -44 -63 258 -34 117 142 6 -33
6778 -33 45 -88 202 278 57 387 -225 50 258 -30 255 -225 -42 -215 92 179 -103 -59 -18 -126 -25 59
6800 59 -221 404 -160 92 -51 -193 192 -146 89 -50 -156 58 130 -3 33 44 -93 299 -47 136 -227
6821 -227 -265 -126 87 87 -25 26 115 -68 -98 -164 -340 -132 204 -78 7 -60 276 181 -195 17 -122 -197 -33 -212
6845 -212 -196 47 -269 8 118 113 32 -38 12 -109 75 98 69 87 -207 -94 -184 64 -170 -108 -92 -103 22 72 4
6870 4 -22 -172 -188 -244 -133 5 247 68 -102 -121 -106 0 269 237 137 23 34 95 186 -146 -14 138 -77 67
6894 67 232 -398 191 221 -45 31 -126 -62 -89 -28 34 -16 119 22 27 -215 287 90 -284 23 140 -22 139 -54
6918 -54 264 -132 49 129 94 102 25 245 104 108 123 51 -16 -64 198 99 51 -16 -90 148 20 50 234 -23 307 -9
6944 -9 131 -120 215 21 317 63 -92 83 33 -8 4 20 -138 158 51 -66 -16 -170 135 149 350 -241 8
6967 8 105 -133 46 27 -21 -112 -10 -11 -136 -174 10 60 -176 -46 131 -8 49 -79 32 -89 99 -32 4 -195
6991 -195 237 -126 103 132 -89 185 38 -77 121 -424 17 -28 -235 45 309 159 -169 -240 73 -279 167
7012 167 291 -71 55 174 -111 27 -27 107 269 -15 130 140 -15 92 -16 305 -56 -3 162 -211 140
7033 140 -171 -209 89 -277 191 28 147 81 -158 -6 -81 -19 192 -169 -145 -188 -220 168 44 -89 201 327
7055 327 134 24 -74 -56 -93 -53 80 -87 102 179 39 95 96 34 241 -56 198 143 281 13 -121 -225 -15
7078 -15 -190 82 265 247 151 -20 104 11 161 -20 193 -111 147 243 -56 -8 -77 112 -443 -99 178 43
7100 43 -7 91 -123 -72 -236 -106 200 -222 11 171 -164 -285 -89 40 3 -113 158 -55 -51 -79 -142 -61 173
7123 173 99 -266 24 -78 -90 -91 -29 7 -73 37 -21 -19 -188 -113 37 292 -255 14 -166 139 288 461 133 -180
7147 -180 -244 -238 63 -127 -53 -167 -208 87 255 46 116 32 -388 -291 113 112 -180 -114 29 -58 -112 -22 -48 94 191
7172 191 -158 62 -38 -22 122 32 53 -146 -34 25 -56 -339 -97 -32 -151 32 -105 -52 -213 -83 83 265
7194 265 -75 10 -148 -74 18 -49 74 128 1 271 -289 128 -77 241 -65 39 -44 -154 188 174 41 -32 -97
7217 -97 178 -1 -102 140 83 250 -48 -130 234 -81 -60 167 150 122 -40 -53 17 55 -62 66 -40 -215 -205
7240 -205 28 -26 -37 135 -113 148 -275 -61 173 -295 79 -272 80 -176 -75 -177 38 -113 19 422 191
7261 191 0 -90 -201 16 289 138 318 156 -37 -95 -245 -60 7 -22 109 -139 -79 -94 215 -24 -492 -129
7283 -129 8 247 151 -31 -127 226 83 -156 -36 -50 123 104 -146 137 -135 47 88 -351 58 219 -108 37
7305 37 -173 -111 -191 -62 34 -149 7 17 -98 -89 -32 258 213 16 116 58 239 194 -239 48 -133 35 -32 141
7329 141 -199 -195 -22 -126 -12 -70 -56 -78 33 -93 128 -56 -86 242 655 196 -51 -113 273 199 -12 -13 221
7352 221 -32 116 153 113 -40 -87 -55 -39 48 0 -49 -259 83 -63 60 4 141 16 -101 96 -28 152 201
7375 201 27 -68 -363 -228 -61 176 -66 -135 -411 -8 -180 217 -55 72 238 24 341 -37 51 -92 327
7396 327 -325 62 -36 207 225 -132 221 -161 -46 11 -74 -104 -132 181 -268 240 41 -142 9 18 37 112 78 109
7420 109 198 332 -88 -194 -393 16 275 -51 -68 137 143 -10 40 89 -69 95 -157 134 194 268 57 -122 -105
7443 -105 -74 -28 -176 62 -91 182 1 -7 -60 -222 148 -159 51 118 -149 174 -103 43 31 1 65 -110 48
7466 48 18 -98 3 81 225 19 74 -50 275 225 19 206 215 182 -114 34 23 -377 -80 -101 -4 252 411 86
7490 86 409 201 27 102 285 -78 -55 57 -18 129 68 67 -223 130 13 155 -127 41 263 100 -64 10 103
7513 103 -168 -236 204 83 -48 109 -57 -19 -239 26 -10 -141 414 168 181 168 -90 -164 -323 -311 11 -217
7535 -217 16 25 -49 161 -106 33 -47 -94 211 -144 -50 136 178 80 -130 41 -217 -49 -209 220 -171 116 188
7558 188 79 -58 -39 -53 -54 -36 -53 121 -320 -211 95 265 53 212 233 -10 118 -98 285 158 -194 138
7580 138 81 170 -273 137 34 -181 -85 -121 191 -218 87 -347 -22 33 -15 -108 -10 75 -185 77 -29 -117 144
7603 144 35 59 -75 193 -219 -283 121 -347 75 73 129 -45 -63 -44 53 -83 202 -72 -132 -120 230 -160 314
7626 314 -294 -21 -25 -69 103 -78 -15 -40 -99 -199 -388 -36 32 122 -53 -56 34 -210 173 1 139 156 144 -56
7650 -56 -132 -130 -45 61 -234 -253 -267 -112 -150 -192 57 105 -78 -153 -75 -156 82 60 -7 238 380 -3 64 -124 -173 -32
7676 -32 -84 -407 -149 -165 -4 87 56 318 19 221 62 82 34 -181 -71 -56 26 -104 -46 201 -374 135 -38
7699 -38 207 49 -257 268 111 1 -83 102 -360 30 38 256 -32 227 -138 37 -146 -20 5 -74 -1 329
7721 329 86 1 340 397 21 298 128 63 -121 -88 -4 -79 0 64 280 -109 -282 4 386 -55 -217 138 135
7744 135 313 -49 -355 -153 5 87 -81 -333 237 82 81 -232 -65 -316 -136 -227 82 -323 60 -476 -51
7765 -51 79 16 48 302 -18 217 -160 -199 -77 -136 1 197 38 106 393 65 -89 92 27 -6 70 -76 -76 57
7789 57 -51 -287 -94 72 100 -4 -51 -94 60 -52 -208 -203 86 -32 -95 -180 136 -10 166 -65 -96 33 195
7812 195 -123 -112 310 119 -284 -74 119 150 131 54 -178 -9 230 97 -34 -188 88 -167 201 41 -97
7833 -97 -57 79 111 16 121 -64 129 -3 198 -37 -71 -35 -208 269 192 -97 -32 155 -57 15 -27 -108 -110 129
7857 129 82 -131 198 -158 365 -59 -40 -128 14 62 242 -362 -83 119 -192 47 -77 -152 -308 -112 42 -40
7879 -40 105 -210 -21 -234 -224 327 133 226 -205 -57 -170 -85 65 59 -165 -12 -160 293 -175 86 -127 -200
7901 -200 -22 457 -206 93 -1 46 157 13 32 -59 238 107 -129 -71 165 -237 66 -236 117 -46 196 -240
7923 -240 120 10 227 71 -275 217 21 0 264 -236 -152 -217 -62 -100 234 -1 -38 83 -291 -37 17 125
7945 125 389 47 412 264 29 294 -22 252 -232 9 -82 42 81 172 -18 -102 -3 -72 -19 254 74 226
7967 226 -374 -51 290 206 106 103 100 82 -203 -224 65 40 -12 -48 37 -146 -81 -76 -27 66 297 187 211 -6 65 -159
7993 -159 -52 81 6 100 22 385 32 89 94 -95 -145 -40 271 -34 -34 -330 -128 -84 101 -157 -367 -24 -73 0
8017 0 85 36 -1 -145 -96 -104 273 -201 -11 309 -131 193 77 -43 -94 -72 102 -154 170 -40 300 -139 211
8040 211 245 -443 -55 -261 49 -44 73 75 -8 50 -46 -400 -82 -183 -38 191 -147 -47 -48 -81 91 -66 149
8063 149 194 200 42 -35 -227 1 -240 -177 -21 20 -29 -157 140 240 346 48 137 -326 39 6 0 354 225 -396
8087 -396 -16 99 35 189 -14 -70 56 310 80 -270 146 195 -15 -129 224 235 -101 63 -102 -50 -78 -5
8109 -5 113 170 163 -132 -127 -41 -107 -3 -159 343 61 99 14 5 -115 60 -165 -287 207 127 -269 242 43 -21 -21 -252
8135 -252 238 -57 199 -23 233 -97 -30 -120 79 36 -94 79 -100 202 102 107 222 60 -183 292 -51 -227
8157 -227 150 111 51 -14 1 281 88 -227 187 16 -52 -50 -129 -387 -152 -10 87 -344 101 -68 -346 -38 -161
8180 -161 81 23 -143 39 -163 2 -21 -159 98 -182 -142
8191a42
##END NTUPLES=NMR FID
##END=
