##TITLE=1H_Ser Ad-V
 CDCl3
 8 sc, 
 6.6.2023
##JCAMPDX= 6.0         $$ Bruker NMR JCAMP-DX V2.0
##DATA TYPE= NMR FID
##DATA CLASS= NTUPLES
##ORIGIN= UXNMR, Bruker Analytische Messtechnik GmbH
##OWNER= root
$$ XWIN-NMR		Version 3.5
$$ Tue Jun  6 15:52:08 2023 Russian Standard Time (UT+4h)  she@DPX200
##.OBSERVE FREQUENCY= 200.13135
##.OBSERVE NUCLEUS= ^1H
##.DELAY= (6, 6)
##.ACQUISITION MODE= SIMULTANEOUS
##.ACQUISITION SCHEME= undefined
##.AVERAGES= 8
##.DIGITISER RES= 18
##SPECTROMETER/DATA SYSTEM= spect
##.PULSE SEQUENCE= zg30
##.SOLVENT NAME= D2O
##.SHIFT REFERENCE= (INTERNAL, D2O, 0, 15.7039)
##AUDIT TRAIL= $$ (NUMBER, WHEN, WHO, WHERE, WHAT)
$$ ##TITLE= Audit trail, XWIN-NMR		Version 3.5
$$ ##JCAMPDX= 5.01
$$ ##ORIGIN= Bruker BioSpin GmbH
$$ ##OWNER= she
$$ F:/spectra/data/she/nmr/H-F/1/audita.txt
$$ ##AUDIT TRAIL=  $$ (NUMBER, WHEN, WHO, WHERE, WHAT)
(   1,<2023-06-06 15:51:07.62 +0400>,<she>,<DPX200>,
      <created by zg, POWCHK disabled, PULCHK disabled
       configuration hash MD5:
       00 E9 B6 7A A2 85 ED C7 34 08 36 98 17 FE 4E 26
       data hash MD5: 16K
       E9 C5 15 9F B8 77 05 00 73 09 49 7E 6A 2C 30 56>)
$$ ##END=
$$ 
$$ hash MD5
$$ 7E 75 E1 32 05 50 55 F8 2A 08 C7 F7 75 18 E4 57
##$RELAX= 
##$RELAX= 
##$RELAX= 
##$RELAX= 
##$RELAX= 
##$RELAX= 
$$ Bruker specific parameters
$$ --------------------------
##$DU= <F:/spectra>
##$EXPNO= 1
##$NAME= <H-F>
##$PROCNO= 1
##$TYPE= <nmr>
##$USER= <she>
##$AMP= (0..31)
100 100 100 100 100 100 100 100 100 100 100 100 100 100 100 100 100 100 
100 100 100 100 100 100 100 100 100 100 100 100 100 100 
##$AQSEQ= 0
##$AQ_mod= 1
##$AUNM= <au_zg>
##$AUTOPOS= <>
##$BF1= 200.13
##$BF2= 200.13
##$BF3= 200.13
##$BF4= 200.13
##$BF5= 200.13
##$BF6= 200.13
##$BF7= 200.13
##$BF8= 200.13
##$BYTORDA= 1
##$CFDGTYP= 0
##$CFRGTYP= 5
##$CHEMSTR= <none>
##$CNST= (0..31)
1 1 145 1 1 1 1 1 1 1 1 1 1 1 1 1 1 1 1 1 1 1 1 1 1 1 1 1 1 1 1 1 
##$CPDPRG= <>
##$CPDPRG1= <>
##$CPDPRG2= <>
##$CPDPRG3= <>
##$CPDPRG4= <mlev>
##$CPDPRG5= <mlev>
##$CPDPRG6= <mlev>
##$CPDPRG7= <mlev>
##$CPDPRG8= <mlev>
##$CPDPRGB= <>
##$CPDPRGT= <>
##$D= (0..31)
0 1.2 0 0 0 0 0 0 0 0.06 0 0.03 0 0 0 0 0.0002 0 0 0 0 0 0 0 0 0 0 0 0 
0 0 0 
##$DATE= 1686052266
##$DBL= (0..7)
120 120 120 120 120 120 120 120 
##$DBP= (0..7)
150 150 150 150 150 150 150 150 
##$DBP07= 0
##$DBPNAM0= <>
##$DBPNAM1= <>
##$DBPNAM2= <>
##$DBPNAM3= <>
##$DBPNAM4= <>
##$DBPNAM5= <>
##$DBPNAM6= <>
##$DBPNAM7= <>
##$DBPOAL= (0..7)
0.5 0.5 0.5 0.5 0.5 0.5 0.5 0.5 
##$DBPOFFS= (0..7)
0 0 0 0 0 0 0 0 
##$DE= 6
##$DECBNUC= <off>
##$DECIM= 32
##$DECNUC= <off>
##$DECSTAT= 4
##$DIGMOD= 1
##$DIGTYP= 9
##$DL= (0..7)
0 120 120 120 120 120 120 120 
##$DP= (0..7)
150 150 150 150 150 150 150 150 
##$DP07= 0
##$DPNAME0= <>
##$DPNAME1= <>
##$DPNAME2= <>
##$DPNAME3= <>
##$DPNAME4= <>
##$DPNAME5= <>
##$DPNAME6= <>
##$DPNAME7= <>
##$DPOAL= (0..7)
0.5 0.5 0.5 0.5 0.5 0.5 0.5 0.5 
##$DPOFFS= (0..7)
0 0 0 0 0 0 0 0 
##$DQDMODE= 0
##$DR= 18
##$DS= 0
##$DSLIST= <SSSSSSSSSSSSSSS>
##$DSPFIRM= 0
$$ [...]
##$SUBNAM2= <"">
##$SUBNAM3= <"">
##$SUBNAM4= <"">
##$SUBNAM5= <"">
##$SUBNAM6= <"">
##$SUBNAM7= <"">
##$SUBNAM8= <"">
##$SUBNAM9= <"">
##$SW= 18.05172834244
##$SWIBOX= (0..15)
0 0 2 0 0 0 0 0 0 0 0 0 0 0 0 0 
##$SW_h= 3612.71676300578
##$TD= 16384
##$TD0= 1
##$TE= 0
##$TE2= 300
##$TE3= 300
##$TEG= 300
##$TL= (0..7)
0 120 120 120 120 120 120 120 
##$TP= (0..7)
150 150 150 150 150 150 150 150 
##$TP07= 0
##$TPNAME0= <>
##$TPNAME1= <>
##$TPNAME2= <>
##$TPNAME3= <>
##$TPNAME4= <>
##$TPNAME5= <>
##$TPNAME6= <>
##$TPNAME7= <>
##$TPOAL= (0..7)
0.5 0.5 0.5 0.5 0.5 0.5 0.5 0.5 
##$TPOFFS= (0..7)
0 0 0 0 0 0 0 0 
##$TUNHIN= 0
##$TUNHOUT= 0
##$TUNXOUT= 0
##$USERA1= <user>
##$USERA2= <user>
##$USERA3= <user>
##$USERA4= <user>
##$USERA5= <user>
##$V9= 5
##$VALIST= <valist>
##$VCLIST= <CCCCCCCCCCCCCCC>
##$VD= 0
##$VDLIST= <DDDDDDDDDDDDDDD>
##$VPLIST= <PPPPPPPPPPPPPPP>
##$VTLIST= <TTTTTTTTTTTTTTT>
##$WBST= 1024
##$WBSW= 4
##$XGAIN= (0..3)
0 0 0 0 
##$XL= 0
##$YL= 0
##$YMAX_a= 133084
##$YMIN_a= -172909
##$ZGOPTNS= <>
##$ZL1= 120
##$ZL2= 120
##$ZL3= 120
##$ZL4= 120
##$ABSF1= 10
##$ABSF2= 0
##$ABSG= 5
##$ABSL= 3
##$ALPHA= 0
##$AQORDER= 0
##$ASSFAC= 0
##$ASSFACI= 0
##$ASSFACX= 0
##$ASSWID= 0
##$AUNMP= <proc_1d>
##$AZFE= 0.1
##$AZFW= 0.1
##$BCFW= 1
##$BC_mod= 2
##$BYTORDP= 1
##$COROFFS= 0
##$CY= 11.3945322036743
##$DATMOD= 1
##$DC= 2
##$DFILT= <>
##$DTYPP= 0
##$F1P= 15.7292609196834
##$F2P= 12.9074282941183
##$FCOR= 0.5
##$FTSIZE= 0
##$FT_mod= 4
##$GAMMA= 1
##$GB= 0.15
##$INTBC= 1
##$INTSCL= 1
##$ISEN= 128
##$LB= 0.24
##$LEV0= 0
##$LPBIN= 0
##$MAXI= 10000
##$MC2= 0
##$MEAN= 0
##$ME_mod= 0
##$MI= 1.114404
##$NCOEF= 0
##$NC_proc= 0
##$NLEV= 6
##$NOISF1= 3.799351
##$NOISF2= 2.8
##$NSP= 1
##$NTH_PI= 0
##$NZP= 0
##$OFFSET= 15.70392
##$PC= 1
##$PHC0= -19906.05
##$PHC1= 11.05272
##$PH_mod= 1
##$PKNL= yes
##$PPARMOD= 0
##$PSCAL= 0
##$PSIGN= 0
##$REVERSE= no
##$SF= 200.130013532006
##$SI= 16384
##$SIGF1= 3
##$SIGF2= 2
##$SINO= 400
##$SIOLD= 16384
##$SREGLST= <1H.CDCl3>
##$SSB= 0
##$STSI= 0
##$STSR= 0
##$SW_p= 3612.71676300578
##$SYMM= 0
##$S_DEV= 0
##$TDeff= 0
##$TDoff= 0
##$TI= <>
##$TILT= no
##$TM1= 0
##$TM2= 0
##$TOPLEV= 0
##$USERP1= <user>
##$USERP2= <user>
##$USERP3= <user>
##$USERP4= <user>
##$USERP5= <user>
##$WDW= 1
##$XDIM= 8192
##$YMAX_p= 0
##$YMIN_p= 0
$$ End of Bruker specific parameters
$$ ---------------------------------
##NTUPLES= NMR FID
##VAR_NAME=  TIME,          FID/REAL,        FID/IMAG
##SYMBOL=    X,             R,               I
##VAR_TYPE=  INDEPENDENT,   DEPENDENT,       DEPENDENT
##VAR_FORM=  AFFN,          ASDF,            ASDF
##VAR_DIM=   8192,          8192,            8192
##UNITS=     SECONDS,       ARBITRARY UNITS, ARBITRARY UNITS
##FACTOR=    0.0002768,     1,               1
##FIRST=     0,             0,               0
##LAST=      2.2672688,     0,               0
##MIN=       0,             -172909,         0
##MAX=       2.2672688,     133084,          0
$$ Real data points
##PAGE= N=1
##DATA TABLE= (X++(R..R)), XYDATA
0@%%%%%%%%%%%%%%%%%%%%%jOj3J6j6J6j6J6j7K2k8L1l3L7m1M5n2N7o1O9p5Q3r1
44d6R9j13J25j35J47j62J79j98K18k41K70l01L36l79M30m94N75o77Q15j008J288
65G28j738K533m179Q775m0540j38488J69647J07612j48912k4868J66049m545j68738
78g6664M2287J67461n4963j15045N7503M0883r4398l9673R2880K8547r1160l355
90d5697O6998k8535k3553O6839K3032o5598k8323N0569O338l5483L8830J8314
102D3731p4003j4567O4889J6563l0179L928J6079m4997l0093N7660K5596m5065
114a0458j7640R968J370n179Q032K7110R10k2236l730J1294K0335k550k7960J2780
128B046K3174k3036k2767K0809L0516k2953l5713M0071K8383n4148j4744N7742
$$ plain form
0 0 0 0 0 0 0 0 0 0 0 0 0 0 0 0 0 0 0 0 0 0 0 -1 5 -8 8 -8 8 -8 8 -9 13 -15 16 -17 20 -21 24 -28 29 -32 37 -38 45 -46
44 -46 53 -60 65 -70 77 -85 94 -104 114 -127 143 -158 178 -201 229 -265 310 -367 448 -560 728
65 728 -1010 1523 -2656 6119 -34421 -172909 -3262 104350 -44562 -69430 96619 92074 -76664
78 -76664 -34377 133084 78121 -36924 20579 61462 -32936 -72609 20271 48818 -42342 -45697
90 -45697 21301 -7234 -30787 36052 59084 -6514 -34837 15732 22070 -13413 25417 43731
102 43731 -30272 -44839 20050 36613 6434 10362 26441 -18556 -48649 9011 34607 -10458
114 -10458 -28098 -18130 -16760 -21939 -13907 13203 14113 -8123 -11853 -559 19776 17226 -10734 2046
128 2046 25220 2184 -20583 226 30742 7789 -27924 12147 40530 -13618 -28362 29380
140B9380O737o2480o491O3606j4901n9120M6373M7033o1534l3905O2898K8433
152D6029n6934j0416N7604k1302o0756L7083M7340l6581l3485L2457K1797m0237
164a7401j0077M8249m746l8656J5615J8784k4720j5958K9313J6590l1558J68L0950
177A6553k1288j8467L6555J6407l2912j5887K6103M218k9682J5720K9099k8228
189a809k5552J9815K0365p560j3165J0608j723k6308O138K7726K273j4529j1554
202a5275N169O994L94J7497R999j9308j4548P28J4011J2389p049o342m991j1722
216a2054K293J2399J1778m031k2721k696J0707m134M009J0495m513j3458n751
229a7677J6287J1233n497O247O71j5003q14J0501P427j129r178k806p616m360
$$ plain form
140 29380 36117 -26363 -32854 30752 15851 -43269 3104 50137 -11397 -45302 17596 46029
152 46029 -10905 -21321 36283 14981 -45775 -8692 38648 2067 -31418 1039 22836 -17401
164 -17401 -27478 20771 16025 -22631 -7016 11768 -12952 -28910 403 16993 -14565 -14397 16553
177 16553 -4735 -23202 13353 29760 -3152 -19039 7064 11282 -18400 -2680 26419 -1809
189 -1809 -27361 -7546 12819 5259 -7906 2702 979 -25329 -19191 8535 10808 -3721 -15275
202 -15275 -10106 -3112 -2718 14779 24778 5470 -9078 -8350 5661 18050 11001 4659 -332 -12054
216 -12054 -9761 2638 14416 10385 -12336 -15032 -4325 -8459 -4450 6045 1532 -11926 -17677
229 -17677 -1390 9843 4346 10593 11264 -3739 -4553 5948 13375 12246 3068 262 -7354 -11714
243a1714J6049P235p319o559r208j642O013P997Q602r487j3378J577K865J1078
257B109J3248m250j0298p424K319J0152L835L775o026j9552N63J3830L149N05
271E935k540m542p934j492J7046M401j4289m98K346m873J830Q772O381q881p977
286f315J0347o12p906Q733L486q670o389L121N551o439P59J2285o217r996O768
301a494M052j715o77M105J634j2366J2J2098k064j878L062k828l793k246N599
316A501N873p895k943J97l695M141K669j09K243m189k088L125K278K712m587j192
332a959P095p199n536R635M218n293k511N921N22j3713M155J8054q603j3516N074
347c656M325o551j916J6894L969k3414k141J7525j742n888Q804L443j6607j1024
$$ plain form
243 -11714 4335 11570 4251 -2308 -11516 -13158 -7145 852 9454 -33 -13411 -11834 -8969 2109
257 2109 15357 11107 809 -6615 -4296 5856 9691 13466 7440 -12112 -11549 2281 5430 5935
271 5935 3395 -1147 -9081 -10573 6473 10874 -3415 -3913 -1567 -6440 -4610 4162 10543 1662 -6315
286 -6315 4032 3420 -4486 4247 7733 -937 -7326 -4205 1346 -5093 -4334 7951 1734 -8262 -1494
301 -1494 2558 843 166 4271 5905 -6461 -6449 5649 3585 1707 4769 1941 -1852 -4098 1501
316 1501 7374 -521 -3464 -3267 -6962 -2821 -152 -261 1982 -2207 -4295 -1170 1108 3820 -767 -1959
332 -1959 5136 -2063 -7599 2036 6254 961 -1550 4371 4893 -8820 -4665 13389 4786 -8730 -3656
347 -3656 669 -5882 -7798 9096 13065 -10349 -12490 5035 3293 -2595 6209 9652 -6955 -17979
361a7979K1094J2990j5054o16P865j1272p601J6265J5722j4072j8546J0427M366
374C589j1589R886J4097j2246j7972N182J6365m408p300J2150l972j8484M228
387a0474J5683J651q664J198O968j1254n415J8428N360j1395n111J811K19n743
401f738O227J2979q847j3692K969N850L027J027J020j677j1615k161J2000N328
415E697q14m404n943J24J618O670Q559n620j0528l817L425P140O1N02J320j1949
431g959m133J2910P462l544n719L79N06o766N838J0587o012p657J714L460j01
446I65k523N378J742j0788k49P293l842m074M587M909o985p625J1441O026r978
461c723K115Q305n829q932M683J1698l426j0103M881K370p495K451P505N42p018
$$ plain form
361 -17979 3115 16105 1051 435 8300 -2972 -10573 5692 21414 7342 -11204 -777 3589
374 3589 -8000 1886 15983 3737 -14235 -9053 7312 2904 -4396 7754 3782 -14702 -10474
387 -10474 5209 6860 -1804 -606 6362 -4892 -10307 8121 13481 2086 -3025 -1214 -995 -6738
401 -6738 -511 12468 3621 -10071 -7102 -1252 1775 2802 3822 2145 -9470 -11631 369 5697
415 5697 4883 479 -5464 -5340 -3722 2948 11507 5887 -4641 -8458 -5033 2107 2168 2670 3990 -7959
431 -7959 -12092 818 8280 4736 -983 -604 -98 -6864 -1026 9561 3549 -4108 -2394 1066 965
446 965 -1558 3820 5562 -5226 -5475 1818 -2024 -6098 -1511 3398 -3587 -11212 229 6255 -3723
461 -3723 -1608 6697 868 -8064 -3381 8317 4891 -5212 -331 2039 -5456 -3005 4500 5042 -1976
476a976n683M586K81l621O869J663o667k587M093M761k349JQ226m766p389O289
492A731L595k683j479K308K335n212j592N940r31j297M74k031o37k506K61O316
508D592k775m738Q65P95J117J947L540L86r815k618Q452J582L8O26m399l697k368
525f470N313Q953q76o187n551j943M785K709K511J137q733l913N166K367L938
540C206J596m168n156r88P708K780n581J297O30n224J782M932L005q05o045K60
556g71K003p23K025K016L19m132p490L275O915L02K767k049p807k260K872O115
572C377K588k833l737o764n73R247L052r04k662o410j90L811K870J779k979m369
588d697j199R52O431J413l335o8l035r52O519J598j375k058l149k03Q41M159L162
$$ plain form
476 -1976 -7659 -3073 -2792 -6413 456 2119 -4548 -7135 -3042 1719 -630 -629 7597 2831 -4558 1731
492 1731 5326 2643 1164 3472 5807 595 -997 4943 4012 2715 3189 1158 521 -1985 -1724 4592
508 4592 1817 -2921 -2056 -1261 -144 1803 5343 5729 -4086 -6704 1748 3330 3368 3994 -405 -4102 -6470
525 -6470 -1157 7796 6920 733 -4818 -6761 -1976 733 3244 4381 -4352 -8265 -3099 -732 3206
540 3206 4802 634 -4522 -5510 2198 4978 -603 694 1324 -3900 -2118 2814 5819 5014 -1031 -771
556 -771 1232 509 2534 4550 4869 737 -6753 -3478 3437 3739 6506 4457 -3350 -5610 -2738 3377
572 3377 5965 3132 -605 -7369 -7942 1305 4357 3453 791 -5619 -5809 -1998 872 2651 -328 -4697
588 -4697 -5896 -4944 1487 2900 -435 -503 -3538 -4490 2029 3627 2252 194 -2955 -3158 -2317 1842 5004
605E004l917k682o55j885M478J813k186Q74k569l161P19K831L327q85j042J504
621A568l009K98L528o61J682k54m140KJ702O05Q28j342O60k363k092L387J59j643
639a085N24l771l61L893J52O12p4j958n9n9M130K772l391p67j426r89L636O33
657B412j220J589j810j095m25j36K067j146J03J265m332r13J649J10M275N15l395
674d87j584q73K811L508Q1n82m823k100M257J904J751k42n700j094K653K378K886
691D744k387l309k299j263M816L047j266q25m291j538M030K256J995p84m192j961
707c227o34K885M204j241r11j958l405L003K836Q15P59k815k553J63O50L303J079
724B953j939q80k891R34M056K95P86k175m145j7J839L328J764l542k569j493J27
$$ plain form
605 5004 1087 -1595 -2250 -4135 343 2156 -30 844 -1725 -4886 -4167 -1336 1991 1106 64 1568
621 1568 -1441 -1143 2385 1724 3406 3152 -988 -986 716 1321 2149 807 1467 -896 -2988 399 558 -1085
639 -1085 -561 -4332 -4693 -800 -648 -36 -110 -2068 -2127 -2186 1944 4716 1325 558 -868 -1857 1779 2412
657 2412 1192 2781 971 -124 -549 -685 1382 236 339 1604 -2728 -3641 -1992 -1882 2393 2908 -487
674 -487 -2071 -2944 -133 3375 3456 2874 -1949 -4049 208 2112 3863 3621 -2079 -3173 -520 1858 4744
691 4744 2357 -952 -3251 -4514 302 3349 2083 1258 -3033 -4571 -541 1715 3710 2926 -1266 -3227
707 -3227 -3861 -976 3228 1987 1076 -882 -4287 -1284 1552 2367 3126 311 -2242 -2079 -1429 1874 2953
724 2953 1014 134 -2757 -1823 2233 2528 3314 1139 -3006 -3023 -1184 2144 3908 366 -2203 -3696 -3569
741c569N064K479j795k334m718M47M189K172J400k794m211L32J583M248K059k686
757A866j613k369j147M387J779q02j773k992Q35J700M75K167j697k315mm04J764
774a43O03j354J586j531j190J936M42J499O66j134K94k217m44L966n52l93k28
791A806k792K00R47J834K127l374k640N29m91J754J089j069o33k736R2L974n25
808I2O86L44k234j15K6J500K191k299l61L10j873J684J275J71Q1k144K20R4k186
827b538K320J355j610j64j352L16J088m1K785l70l636k08P49J463K610j233n93
844I41k333j903M343K532j29j193l876o85J893J480L223k300m289m03K00K580
860H1K997j217j154l532j380L991J816o79o97k738l44J93J594L689j104l157l18
$$ plain form
741 -3569 1495 3974 2179 -155 -4873 -4426 -237 1935 3335 541 -3670 -3338 -1755 2493 4552 1866
757 1866 253 -2116 -3263 1124 2903 2101 328 -2664 -1829 -129 346 2513 816 -1499 -1503 -1907 -143
774 -143 460 -894 692 -839 -2029 -93 349 1848 2514 1380 1674 -543 -987 2979 2427 2034 1806
791 1806 -986 -786 161 1995 4122 748 -1892 -1363 -1854 -100 989 -80 -713 -3449 -3357 617 92
808 92 778 1122 -1112 -1227 -1201 299 2490 191 -170 140 -1733 -49 1226 1397 1478 -666 -446 -352 -2538
827 -2538 -218 1137 -473 -637 -1989 -1673 -585 -626 2159 1789 -1847 -2055 -1306 157 2767 1534 941
844 941 -1392 -3295 1048 3580 3451 2258 -1618 -2303 -410 1070 4293 1993 -2296 -2699 -2499 81
860 81 3078 1861 707 -2825 -4205 -214 1602 923 226 -2512 -2856 -2663 -1069 2620 1516 -1641 -1959
877a959m14J686J643j50R09k846k324K364N89J290J112j305j288k256P92M315
893B158q61l66k93l891o6K191L537J609l991k071M87q0L333K303k192k171l078
910c442J963L521N38P98j652l575M01K271K389N16l475k56j123j108L736J782
926C284j809j926j237Q49J402m28J830j155k632J47j98J341J601j456M04k69j491
943a743K078k07K55R28j211j45j139k93K961rj156N36j676l67J538N19J641k268
961B42k403P03M73K061N76j812K7j207n98L232R62r88q54j283J91O12J346J369
979B649k037n21Q92j169N33J579o58O1j386q28O96j172R66R57p27n5j840k01K023
998b38m34J427k35l112j29J480R69R89m71o10j825m77M114J677k386j019j962
$$ plain form
877 -1959 -2373 -687 956 806 1715 -1131 -3455 -1091 -502 788 1900 595 -693 -2949 -2157 2158
893 2158 1297 931 638 -3253 -3319 -1128 2409 4018 27 -2044 -1557 -1637 1696 3999 1807 -364 -3442
910 -3442 -1479 2042 2580 3378 1726 -1849 -1448 823 3212 3728 253 -3 -1126 -2234 1502 3284
926 3284 1475 -451 -1688 -839 563 135 1965 810 -1822 -1675 -1873 -532 1069 -387 17 -252 -1743
943 -1743 335 128 383 1311 100 -45 -1184 -1477 1484 1475 319 855 -821 -1188 350 869 2510 242
961 242 -2161 -1458 -985 1076 1652 -160 -133 -1340 -1938 1294 2256 1268 414 -869 -678 -66 1280 2649
979 2649 612 91 983 -186 347 1926 1268 1329 -57 -885 -189 -1361 -395 562 -165 -220 -2060 -2261 -238
998 -238 -672 755 520 -2592 -2721 -1241 -272 717 246 -364 -2189 -2666 1448 3125 739 -280 -2242
1015b242k25K749J056N67r74l216J21N04K355J840j951j352j156r73K238J360
1031G01j30Q57k267j664J294K116J632j343j136O07k504J206K806p05r27m79j499
1048a435J387R66N72j09k151j89p66N69K853o57j376m11k137P61K723Q32K40j637
1066C5j945n31N45L723J278k485j317j660J41L339J559n46j429k798J31J809J389
1083A238Q45k544n73N81r17K881P73l061k08P54K7M04M85M65j616j242J854j28
1101A8m39K042o10p92k25j126R05Q66K98R65j660j493J05R42K129k50p91K17k905
1120a804o67L461P01j296j040o68M41n84J774J890k774n19Q12p51J842o56p59
1137e97O25o21L82P16K07O78p56o17P42j455J220J270j901J62j05j210J90J142
$$ plain form
1015 -2242 -2467 282 1338 1905 931 -2285 -2164 -1660 695 2535 584 -768 -1924 -2897 -659 701
1031 701 571 1428 -839 -2503 -1209 907 2539 1196 60 667 -1837 -631 2175 1470 543 64 -1435
1048 -1435 -48 918 1490 1381 -770 -959 -1725 -1156 1697 1040 -336 -747 -2884 -2123 600 1432 1672 35
1066 35 -1910 -2441 -1896 1827 3105 620 -697 -2357 -2216 1123 2682 2136 707 -2091 -1960 -151 1238
1083 1238 2083 -461 -1034 -453 -1370 1511 2284 -777 -985 -231 -204 200 685 1150 -466 -1708 146 18
1101 18 -421 1621 1011 219 -6 -1132 -227 639 937 1902 242 -1251 -1146 -204 1925 1675 884 1101 -1804
1120 -1804 -2471 990 1691 395 -645 -1313 -872 -1456 318 2208 -566 -1085 -273 -1024 818 162 -597
1137 -597 28 -593 -211 505 712 1390 634 17 759 -696 524 1794 -107 55 -50 -1260 -1070 72
1155G2J242l35j917J31m26m26J883L61l57j1k495N61K059K10R73k04j320j283
1173a282o43L134J248k175L29j290j247J998J443O7j294k245P73N54P20J767j596
1190B61j652n01K60K863O75j657N91j525q33J819J567K87j594q64L64j031L83
1207e87L252j266j290p0p62M19N2J249O96k222r72L74p7J868O77j134l28k254
1225b375J111K290L0j30j061j735K07Q42K288O28k496j015J22L59K478M94j428
1242F09j172j678J166J838M66R7j584r90N71r3J670Q96j916j92n22l15J212J96
1260B59M33j46j571N03M10k03J484n59l87M4j001J038O52p21J013r75q91j2P85
1279A55R94j35j290J52r54q47K308N99q23j243j076J009M40P81J124j847j220
$$ plain form
1155 72 1314 979 -938 -807 -1233 -1659 224 585 228 217 -2278 -1717 342 552 1525 1321 1 -1282
1173 -1282 -1925 1209 2457 282 611 -679 -1926 72 1515 1582 288 -1957 -1184 -630 90 1857 261
1190 261 -1391 -1892 -1632 1231 1906 249 840 -685 -1518 301 1868 2155 561 -303 61 -970 -587
1207 -587 2665 1399 109 39 -723 -304 -252 997 1693 -529 -1501 -1127 -1204 664 1341 207 -121 -2375
1225 -2375 -1264 1026 1056 926 -135 -1870 -1663 -821 1467 2095 -401 -1416 -1294 -935 1543 2037 609
1242 609 -563 -2241 -1075 763 1229 1326 -258 -1248 -677 -770 900 1796 -120 -312 -834 -1149 63 259
1260 259 692 546 -1025 -522 -112 -315 1169 610 223 267 -734 304 956 235 1248 273 -618 -630 155
1279 155 1149 1014 -276 -124 -1078 -1925 383 982 159 -1084 -2160 -1151 -711 70 1194 -653 -1873
1296a873K89P35J478j13o13M22j413L31J739l86J64j74p46j5k42K54R06p96j5
1315f8P5j053N25N83O7Q28j390k97L76n28J436N71p60j1r26O80J047M15L93p65
1335A198j661J81K33J214J124j854q32p27j81K048L20m50r86j971Q11J385L11
1352A63J066j644j334N87K75J417R96j365m59m58k24J500K51J9l55j261L76J01
1370c49K87R86l73m13o35n83P87Q66K4P09j610r12Q32K59J555j64j175J40j279
1389a048M28K108j15m11q40j626O91J611P45N64k208j018L82J75J781M07j415
1406B11p95j151J050J585m27K87j202r22O24M12O46p9j176l06N5j59J676l61m83
1425e15M18j140M01L83J97J020l05r94L30n62O07J120r1Q7r20q64P54m3P23Q39
$$ plain form
1296 -1873 -1584 -849 629 516 -97 325 -1088 -757 982 596 760 586 -160 -175 -417 -163 743 -53 -68
1315 -68 7 -1046 -521 62 129 957 -433 -730 -354 -882 554 1125 365 354 -572 108 1155 1570 1963 1198
1335 1198 -463 -282 -49 1165 2289 435 -397 -1124 -1305 743 1063 613 -373 -2344 -1533 -148 163
1352 163 1229 -415 -1749 -1162 -887 530 1526 161 -298 -756 -980 520 771 790 435 -826 -450 -349
1370 -349 -62 924 551 138 -497 -1080 -293 573 597 1306 -304 -1216 -384 -125 1430 1266 91 231 -1048
1389 -1048 -620 1488 1373 962 122 -1504 -813 798 1543 2107 -101 -1119 -737 -562 1219 1626 211
1406 211 -584 -1735 -685 900 473 760 -442 -1364 -740 -328 318 239 -937 -1243 -1188 -1347 329 -32 -515
1425 -515 -97 -1237 -836 -453 -256 764 459 -535 -205 -767 -160 960 869 956 36 -828 -74 -117 606 1445
1445A445j959J25k97j33J704j42n20m48r80M98R55L10L81j288n64R16k60J268
1463A011J49r05k85l41K91J007K47m83n49r97O74J79J0P10o40o55L70q39M39N21
1483h6k3J27m14j78oj89J269N01r32J35q91j06J343K58K04m05j322K06M98J173
1503A162N15j841n03o4l11J814N09j346l60q49L00J066J085J67j866o94R07L27
1521A8P75L70j095l82K72l95P35Q05l82j46r95O38n59k8J443m19q27J39j233N84
1541f82J338j44k79j023k04P18KJ019J85j463l89N22Q7J296M6j131n89n06R69
1560b28Q65R09k41j716o89Q15k2J399M01j464n85n43L66J134J70K71j163j068
1578a389Q82K14J77J063j462l98R23n5J13M01n17J5k63L44K40j36N15n12o79P42
$$ plain form
1445 1445 -514 -389 -686 -819 885 743 223 -225 -1205 -707 248 558 939 -349 -913 3 -257 1011
1463 1011 1160 255 -30 -371 -80 927 1174 691 142 -855 -181 -2 8 718 78 -577 -207 -1046 -607 -86
1483 -86 -109 18 -396 -574 -580 -769 500 1001 69 204 -687 -793 550 808 1012 607 -715 -509 -11 1162
1503 1162 1677 -164 -667 -731 -1042 772 1281 -65 -425 -1274 -974 92 1177 1344 -522 -1216 -309 18
1521 18 793 1163 68 -314 -42 -437 298 1103 721 575 -420 218 -341 -369 1074 655 -172 -33 -1266 -682
1541 -682 656 512 233 -790 -994 -276 -274 745 930 -533 -922 -400 -313 983 1029 -102 -691 -1197 -228
1560 -228 637 1546 1305 -411 -1100 -285 -307 1092 1493 29 -556 -1099 -733 401 571 842 -321 -1389
1578 -1389 -507 -293 -116 947 -515 -913 10 -45 68 469 -48 -33 -296 48 288 152 667 155 -524 218
1598B18q9m70O81M55p05o77l82N74O14K92k9q11m22l3p8J697N30j279n69n93K61
1619h15J132M01J10j055p61R02j24R25O13j289m66P02r2K65p8o65J94k02M03J55
1639B55r03P24o0m38N26p61k1Q74r8p0o81k26O92n10J967k03j408l97k67N76J307
1660H78L71p87n55o36L21P29Q43K73j564o40L96N4P14N77j177m43l0K92O49L10
1680E75j73m02p33O65L00L3J093j568m69N35J44O34M03l23n50o55K45M30j08P65
1700H41o26j045J2L06r7J224l96k66o56l44M14L24P71Q4j179j95K45j31J289M76
1720A051p80k44q92N17J347p0j5j168o62P02L15P54K19j281o08K3M77J388o90
1739C83o85m81n43J135N90k51P18o96o94P17m07Q18J49l82j30k21o7j48K61N20
$$ plain form
1598 218 129 -341 340 795 90 -587 -969 -395 219 511 482 -329 -751 -784 -862 835 1365 86 -483 -1076 -815
1619 -815 317 718 828 -227 -988 -86 -210 715 1328 39 -427 275 183 448 370 -295 -101 -303 100 255
1639 255 -648 76 16 -422 104 -657 -678 196 98 28 -653 -879 -187 -697 1270 1067 -341 -738 -1005 -429 878
1660 878 1249 462 -93 -729 -408 321 1164 1437 -127 -767 -371 -317 397 974 -203 -646 -676 -384 265 575
1680 575 402 0 -733 -68 232 265 1358 -210 -679 -144 0 634 1037 714 164 -491 -246 184 76 841
1700 841 215 -830 -818 -512 -609 615 219 -47 -703 -1047 -633 -309 462 546 -633 -828 -583 -714 575 1051
1720 1051 271 27 -865 -348 999 929 914 -254 -916 -214 101 855 1074 -207 -815 -792 -315 1073 383
1739 383 -302 -783 -1326 -191 399 148 866 170 -524 193 -214 604 753 371 241 20 -47 -195 66 586
1759E86K98j220K56j96l67J058l12j15n47l39M90N99N7K92j273M4N52l8N09J26
1779D60p10l57q3P9J300j71j66n73l90M77N09L59o6p72k47J87N6Q91m47j11Q3
1800C08n63j0N77m09L40L1n71J99j40Q4P05l78k9J16n79M61J65M20K23j154j99
1821d03K06k3O77L39n00k98q72P37N07m9J13p57p44N53L03M59K2r42o7r5J41J253
1843E60j11o51k80m36N19P03n9K49n74n23Q14l44M79J16l44J64n11J49J25K03
1863B48K36J7o90J7k78J71P54k0m16m29m99Q48K90mN42j271j13N52M02P64l11
1884H10j000k39k09O78P74k91k85o17m42P48N05j1Rr22m77J23N08Q73j75p69J28
1905b81m46K42J086l56K61n24m32N15P7K94j49j97K37l36o4K17O8J68J65q60J91
$$ plain form
1759 586 884 -336 -80 -276 -643 415 103 -12 -559 -898 -408 191 248 540 -733 -689 -137 -175 334 460
1779 460 -250 -607 -690 -611 689 518 352 -221 -611 -134 375 734 668 -104 -351 -164 -108 783 336 225 308
1800 308 -255 -265 312 -97 243 274 -297 -98 -238 -154 551 173 144 260 -319 142 307 727 950 -204 -403
1821 -403 -197 -220 457 796 296 -2 -874 -137 370 321 434 -323 -1067 -514 -211 248 270 -672 -739 -834 -693 560
1843 560 449 -202 -482 -918 -399 304 245 494 -80 -603 211 -133 346 462 118 282 -229 -80 45 248
1863 248 484 501 -189 -172 -450 -279 475 455 39 -390 -889 -41 249 245 787 -484 -597 -45 357 1121 810
1884 810 -190 -429 -638 40 814 523 238 -379 -821 -73 432 421 430 -492 -969 -846 -338 535 360 -409 -281
1905 -281 -727 -485 601 245 506 -18 -450 65 142 436 287 90 327 -9 -73 144 212 380 545 -315 -124
1926a24O3m5M52l64j90J93o16O69L63qr9p37n04P96J25N88J09j061J96m5J95O48
1948F04P8k75m52n32O71N24n98N08o90n27N57j49O21j36n80J97k78P0P79o19M01
1969A74oo94N82l62J38O89o0n09n0l72L19L38q8O00r65k83K56Q6R32p9p49k24
1991c27j84K93N84k94K76o99m42P83K03J58L09j184m3J74K60O62l03j02k39m15
2011e30M28O38l74O8l75l69N31l7O64J01p91q4n5J44L46r8j6L61j470O40O8j13
2033c23R75o74l27K35o08O45K74L4J65p00J27N01j53M25J06j065j76L05N40K61
2053E67l60J68p64m32J076L99l97p3j002n60R32K5O44j9o78j63j60P13O58n54
2073B0K11p7m48O97P8l63K48R3j50n4j93K2q0J56K61o46Q2L4k06O73q8p92R7J85
$$ plain form
1926 -124 -61 -106 346 -18 -208 -15 -631 38 401 393 294 -443 -947 -151 -26 562 671 -390 -194 -239 -44 604
1948 604 682 407 -45 -577 94 618 20 528 -162 -689 -132 -281 340 204 -376 -179 -457 -387 392 -227 174
1969 174 168 -526 56 -306 -168 521 461 -48 -98 -470 -151 187 99 699 -266 -549 -293 -207 725 646 -103 -327
1991 -327 -511 -218 366 72 348 -351 -793 -10 193 351 660 -524 -567 -393 -133 529 226 124 -115 -530
2011 -530 -102 536 162 230 -145 -514 17 -20 644 745 -46 -130 -185 -41 305 207 191 552 -918 -278 -210 -323
2033 -323 652 -22 -349 -114 -722 -77 197 231 396 -304 -177 324 171 596 702 -363 -539 -234 306 567
2053 567 207 375 -389 -821 255 654 257 184 -818 -1378 -446 -421 223 204 -474 -637 -797 -84 574 20
2073 20 231 154 -294 403 481 118 366 459 309 255 62 84 4 160 421 -225 -143 -109 -315 358 270 -522 -425 -240
2097b40J23P77l79m7m71l03Q58O1J88J34p27k38O40l33N80o1m70n43k64P02P4
2118F1k87O44n96p69Q91m21N56Jm27M1R4J2O47o72j4L14o48P09Q7l83L78k81j08
2141a71M06p4l3K7R5J6o21m34R76K3P9K51p02k30J37M55O39j90k40o66l53Q09
2163A99J16q2L24p41n21N56K2K77L28q29L3j0N30m6M2j06k61j6L70k04K05L12
2185D98m94m9K11l72M41n5k89L94q59J11M42q1K68n5p58K47k98P06N33Q8k70o43
2207b84l43R23mK90K51p27j86K11K32L50k45k13m32m4K95Q1m44K42j56n91R89
2228A95p7k01K66m09m1L75O3N8k62k3Kn56Q64J87k3k99n2j78Q0j17J05J18k84
2251b09J4m28P7L33o3L43J05o48P8lL71L82k56q8j67j17N94K16j36K03q13j37
$$ plain form
2097 -240 -117 660 281 234 -237 -540 318 379 567 701 -26 -264 376 43 623 562 92 -451 -715 -13 61
2118 61 -226 418 -178 -947 -56 -477 79 80 -347 -306 -212 -200 447 -225 -239 75 -573 136 223 -160 218 -63 -171
2141 -171 235 161 128 155 250 266 -355 -789 187 210 289 540 -162 -392 -255 200 839 649 409 -257 -610 199
2163 199 315 233 557 -184 -705 -149 -127 150 478 -351 -318 -328 202 156 198 92 -169 -185 185 -19 186 498
2185 498 4 -45 166 -206 235 180 -109 285 -574 -463 -21 -102 166 111 -647 -400 -698 8 541 629 359 -284
2207 -284 -627 296 292 582 833 106 -80 131 363 713 468 255 -177 -221 74 155 -289 -47 -203 -794 195
2228 195 118 -83 183 -226 -267 108 171 229 -33 -56 -54 -610 254 441 418 119 67 -111 -31 -148 -43 75 -209
2251 -209 -195 -623 -546 -213 -276 67 172 -476 -398 -401 -30 352 96 8 -159 -276 318 534 398 601 -212 -349
2273c49M47K05J29j23j67k11j42N40N1m56J26l29l19O30n5j25J62o1M9k7J62J76
2295C13q3j22K07n28o6M26j6J61m5l50O6m9J42o7O2kj99p8L73l13M75J24r63M51
2319h1l28P07J24l60l78N9m7K63J05N0j49k92j09N10J03J06l5m84J01K82j2J58
2341B93N7k40k04o9P79r6n30K98k83k47L04j76J32m4oJ73k78l7K06J9J25On06
2364c24j05J65L56K13k1k55j22l53N40N63m08j03n31J05J65K85M25k48o46j03
2384d02r6N63R8k24Kl48J34R3J97J55K52m05k72J18k7M67m07N2K76k20J21K55
2406C82k65K15m31j43L74o2k24J85O2p0m2l50L91j94R2J5j69j59J59J57K59q3
2428I9l2k39j7N37j24J80O4o35l07O14pO4J35o24k19L02L83K25j79P3l53k14L39
$$ plain form
2273 -349 98 303 432 309 142 -69 -211 329 380 -76 50 -279 -598 32 -23 -148 14 -47 2 -25 137 313
2295 313 230 108 315 -213 -279 147 131 292 247 -103 -37 -86 56 -11 51 49 -150 -228 145 -168 307 431 -532 -81
2319 -81 -409 298 422 62 -316 -257 -304 -41 64 114 -35 -327 -436 74 177 283 248 -236 -135 147 135 293
2341 293 350 110 -94 -163 616 520 -10 288 5 -242 62 -114 18 -26 -32 141 -137 -174 32 51 176 182 -324
2364 -324 -429 -264 92 305 284 29 -93 -446 94 657 249 146 -385 -280 -115 170 595 347 -299 -402
2384 -402 -498 65 163 -61 -59 -407 -273 -180 17 172 424 19 -253 -135 -162 305 -102 -50 226 6 127 382
2406 382 117 332 -99 -242 132 70 -154 31 93 23 -19 -369 22 -172 -80 -65 -234 -393 -234 -77 182 99
2428 99 67 -172 -189 348 224 404 468 -167 -474 140 133 197 332 -292 -511 -209 174 399 220 293 -60 -274 65
2451F5J88m69N1m7k46N14J38l51K00J21n3n61L05L06J1J14J1j88j72j0L00N7R5
2474C79j17m33r8L76j89L41m5p64j44M63o2O30l14m60K36R5J41K61o15K23j51
2495b47L5L08J3L63k56l72K34N2J43J0k71J70l26k2K64L18m70L29m14m44M71J11
2517aO6o6k11K73l28k1N25k9N2m2k41Q9O6j47K92l19K4r5l42O52K9m27n4J63l22
2542d14K96oK02N7n83o9L18K12J98l04j61j34J50L24O1M9k24k01J27J68K21O5
2564C52l41l56K33Q4J46R8j14K92j85o43M11Q9K04j02j30O0l24q2N84m71K14L3
2586E2l22J31J04J35q7J02k89k85K15M63L20m33j14j18l22O66L73n45j69k49J56
2607b16M07K38k3m62K7j53k51M61j3j36J52j58k90L03M8L03q0k98L17l54M1N45
$$ plain form
2451 65 253 -216 -165 -212 -458 56 194 -157 43 164 111 -450 -145 161 172 286 297 109 -63 -73 227 284 379
2474 379 262 -171 -269 107 -82 259 214 -550 -694 -231 -293 337 23 -437 -201 -106 35 296 -319 -96 -247
2495 -247 -212 96 109 472 216 -156 78 130 273 283 12 182 -144 -166 98 416 -54 275 -139 -583 -112 -1
2517 -1 65 -1 -212 61 -267 -288 237 208 260 218 -23 66 132 -15 277 -42 -18 -113 -455 197 226 -201 -255 -92 -414
2542 -414 -118 -124 78 135 -448 -517 -199 13 211 -93 -254 -388 -238 86 147 196 -28 -229 -102 66 287 352
2564 352 11 -345 -112 -28 118 216 102 394 209 -434 -23 66 270 168 38 98 -226 -308 276 -195 19 52
2586 52 -270 -139 -35 100 13 115 -174 -459 -244 219 539 106 -8 -126 -448 218 591 46 -123 -372 -216
2607 -216 191 429 406 -56 -29 -182 -433 28 15 -121 31 -127 -417 -114 -66 237 157 -141 176 -178 -137 408
2629D08k51L60k47j05J85j13L56l72k00O1j49l2K16l72L6M63m84J61J09j75K70
2650A25K27m20j86K62L57l0j01j73j5m85K70N11p3Q7n11k10L11j5J88p1k87M1
2672a98k49K75L1J46j2j91P3P3O0j13Pj81M64r7k19L72o5K1J5n18K34M52k77J22
2696B25k16l4k6l21N18L25k82k77m59N9R39k21Lj26o22K24J17M41j21J7K7m13
2718b23o8L37Kk57J73k04J12K64j91K53l55O3J42j03L2O7M1j38J63p36O90J7J5
2741I6j84J94k96J29j64N37j19k05N8j56l68P94l27m8K25k44m9K89r9J84p2J70
2763C45l78j87M43R0r8ln19M75p7j32J77l96j07K16R4l32M45j36jk29J72P3L19
2786B54q6K06n63K60p4M9O86p90P9J03k40o0N17l98L01j29n18L63k61K34%P4j84
$$ plain form
2629 408 157 517 270 165 350 237 593 221 21 82 -67 -99 117 -255 -219 244 -240 -79 30 -145 125
2650 125 352 -68 -254 8 365 335 234 61 46 -439 -169 342 269 356 -155 -365 -54 -69 119 48 -239 -198
2672 -198 -447 -172 -141 5 -7 -198 -125 -52 8 -105 -98 -279 185 88 -131 241 176 197 212 -306 -72 380 103 225
2696 225 9 -25 -51 -372 146 471 189 -88 -547 -488 451 230 233 107 -515 -291 -174 267 146 163 190 -223
2718 -223 -291 46 48 -209 -36 -240 -128 136 -55 198 -157 -94 48 -55 -23 44 85 -53 110 -626 64 81 96
2741 96 -88 106 -190 -61 -225 312 193 -12 46 -110 -478 316 -11 -59 166 -78 -127 162 63 247 175 345
2763 345 -33 -220 223 313 215 212 -307 168 91 -41 136 -260 -367 -151 -57 -389 56 -80 -81 -310 -138 -65 254
2786 254 168 374 -189 71 -3 46 732 -58 21 124 -116 -176 341 -57 244 115 -403 -40 -301 -67 -67 7 -177
2809a77J72k66L46j75l5J36k26J29J97K58K9j55k45k28O3N72N9q21M01k42L12
2830A04K48p8j94J19l32L3K8l20L33j1j62M5k44K83j46K54K48l31q5K1m4M77j62
2853H4L8L1l55K2L48j27J01j78j30J63j64Q7K04l08K7p4L17q3L41k89K12o32K20
2876a45Q7O9K62j86k88L7K9K60J60n19K03J04j65Q5J76l9r2l51L19O2O7M8k79
2899i6J9j25l10Q46l15k42J07j90K10J01k29M12k04k33L45k63J30K89j32J99k83
2920C6oj45r1K43L78l47J7n6j83L22q6r3j06o18M71M68q1p5l51q2L86O1k05N5
2944h8J52m7K1j47L33j46N4j47j33L13M6k91K26J05j28O8k58j82L41j78J76j30
2966d0j91J94j25P1K05m18N43j97l21N70j65J0J1j88LN2J06K66m69J58r3QN02
$$ plain form
2809 -177 -5 -271 75 -100 -135 1 -225 -96 101 359 388 233 -12 -240 -177 395 454 -367 34 -208 104
2830 104 352 274 80 199 -133 -100 -72 -392 -59 -70 -232 -187 -431 -148 -294 -40 208 -123 -208 -187 -231 246 84
2853 84 122 153 -202 -180 168 41 142 -36 -166 -3 -167 -80 124 -184 -157 -231 86 3 344 55 267 -365 -145
2876 -145 -58 11 273 87 -201 -164 -135 125 285 -234 -31 73 -92 -7 169 130 38 -313 6 68 135 183 -96
2899 -96 -77 -202 -512 334 19 -223 -116 -306 -96 5 -224 188 -16 -249 96 -167 -37 252 120 319 36
2920 36 30 -115 -206 37 415 68 85 29 -154 168 82 -11 -117 -735 -264 204 123 48 -303 -385 1 62 -143 -88
2944 -88 64 17 38 -109 224 78 132 -15 -148 165 211 -80 146 251 123 191 -67 -249 92 -86 90 -40
2966 -40 -231 -37 -162 -91 114 -304 239 42 -279 291 126 136 147 -41 -38 14 120 386 -83 75 -18 -10 492
2989D92k07m04o7J55R3K23l38j30M4J1J59j06l8K62q5k60n8j23K78O8J09J71l63
3012a14J1O6RpJ36k43Kr5J90J94j95L06j53p8O8j37J01M89p89K98j42j30K03N05
3036D95m84j1j65O6QP3N43m59k98l5K34K58K85m90L77m99J25L7K85j95k78r1K18
3059an5q3L33j30l85L57l23K38K71p4K63l84k20J4m0K18J18j37K52l22m3K98l58
3082a93M37k58j36M83l06Q7L04m01j49NM5K30J08l78l07J47K60J12J41l02j47
3103b18ML49o5R8P8m60q4N35k82K64M50n56r1k13M57m7k58J04J53q0N1l70j05
3126b86M28M3j00j85j04N0K82j54n2O4J91o09K37L16Q9j76K4j87L70j84L6J77
3148B70j86k1J00l64L84Q1m15L44l45j07K94J7j52k2j58K02Q0o4K08k73N0q0J28
$$ plain form
2989 492 285 -119 -186 -31 62 285 -53 -183 -139 -128 31 -75 -113 149 64 -196 -254 -377 -99 -31 78 249 -114
3012 -114 -103 -37 -28 -35 101 -142 -140 -235 -45 149 -46 260 107 29 97 -40 61 550 -239 59 -83 -213 -10 495
3036 495 11 0 -165 -99 -91 -18 525 66 -232 -267 -33 225 510 20 397 -102 23 60 345 150 -128 -219 -1
3059 -1 -56 -139 194 64 -321 36 -287 -49 222 148 411 27 -193 -179 -219 -1 117 -20 232 -90 -133 165 -193
3082 -193 244 -14 -150 333 27 114 418 17 -132 -127 -82 148 256 -122 -429 -282 -22 90 231 -71 -218
3103 -218 -214 135 70 168 246 -214 -298 237 -45 219 669 113 22 -191 266 219 -39 65 218 138 189 -181 -286
3126 -286 142 185 85 -100 -204 -154 128 -26 -78 -14 177 -432 -195 121 210 34 58 -129 241 57 93 270
3148 270 84 63 163 -201 183 264 -151 193 -152 -259 35 52 -100 -122 -280 -78 2 -62 146 -127 -77 -157 -29
3171b9r4J83j02N4j26J36O3m3K2J07l08L46k25QP4L1j76Q7P2l60K01j61K78l88
3195c50K29p7LL10K00l66j93l65M54K76J89j77O1o06N62M7p0P7l4Q3k41j61K43
3218I4l1J03j68k44P25m93R8J58j63k66J96j46K29j27RJ20k1k37L39k65N7j1O9
3241B5n1o2L00J4j99l58N20m97K72L50l48J66k40j38N93l03m4K53k72j91J03J2
3263i5K62j28j82j30J12L03k43k30L72k61N6J43lL01j76j63N6M40l05K81l37Q5
3285A58q8n38N28j36l34P23l70l48K70j50n5L68k40J77n6O0K01J15k55J49l25
3306a46O8oL2J90j39K02J42m81L39o3n5L33m59l22N28Jj19j04q7J62k34J62K21
3329A65j19J6k52M4J47k8J07l7o3L41n16J97J94M6J63k85k56K54Q8j94K82m27
$$ plain form
3171 -29 -123 60 -42 12 -114 22 85 42 64 171 -137 209 -16 -8 66 97 -79 8 80 -280 -79 -240 38 -350
3195 -350 -121 -198 -195 115 315 -51 -244 -609 -155 121 310 133 194 -412 150 197 127 204 170 253 12 -149 94
3218 94 63 166 -2 -246 479 -14 84 242 79 -187 9 -137 92 -35 -26 94 73 -164 175 -90 -33 -44 25
3241 25 -26 -88 212 226 27 -331 189 -308 -36 314 -34 132 -108 -246 347 44 0 253 -19 -210 -107 -95
3263 -95 167 39 -143 -273 -161 142 -101 -331 41 -220 -164 -21 -24 277 101 -62 -6 434 129 410 73 158
3285 158 70 -468 60 -76 -410 313 -57 -405 -135 -285 -340 28 -212 -35 -91 -31 170 285 30 179 -146
3306 -146 -78 -84 -52 138 -1 201 343 -138 201 138 83 416 -43 -365 163 164 45 -59 -146 16 -218 -56 165
3329 165 46 62 -190 -146 1 -27 80 43 -20 321 -195 2 196 242 405 120 -136 118 206 12 294 -133
3351a33J01M2j55n1L29j30o1k6j52L48j38N18m60m7j96N61n31K58j4J02j93j79
3373b07J39J32J04Lm97J78J7J19k4R0K4M0m45K47K64k94K08j18k27K54j60L55
3395B02o0r1K03k66l73M70j63J44J84k06m15L87L1R1J09k77L15l98J96j24n7K40
3417A42j14J29l02K42j50O7m74K05J42o7J96m4K71o6j9k61rq6N12j58k07j6J43
3440G6Q4q9K9N6j91J35j19l07M76j7n27K19J27p1K58k93k2K83k43m0K28j28M18
3463C42n66n7M72j67j26Q3m5J29l4r9K30m9N0K73l84j73K63j51J58m02J45lm9
3486a60L24k1q3k86J06o9J14J88j07J38l25J50L8RJ16m72M94m7k12K01j48O8K81
3509B97m99R8K63j08K8k24k45M39k54K56k2J58o6k02k8J67p1J50j61M2Qj28Q5
$$ plain form
3351 -133 -32 10 -145 -196 133 3 -58 -84 -236 112 -26 492 32 -15 -211 350 -181 77 63 165 -28 -207
3373 -207 -68 64 168 171 -326 -148 -131 -12 -36 54 78 118 -327 -80 184 -110 98 -20 -247 7 -153 202
3395 202 142 51 254 -12 -385 85 -78 66 250 44 -371 16 47 138 247 -30 285 -113 83 -41 -98 142
3417 142 28 157 -145 97 -53 14 -460 -255 -113 -180 16 -28 243 177 158 -103 -112 -198 314 156 -51 -67 76
3440 76 160 71 100 156 -35 100 -19 -326 150 133 -394 -175 -48 -119 139 -154 -176 107 -136 -176 52 -76 342
3463 342 -224 -281 191 24 -102 -19 -64 65 31 -68 162 113 163 436 52 -121 142 -9 149 -253 -108 -111 -160
3486 -160 164 143 60 -226 -120 -189 -75 113 6 144 -181 -31 7 16 132 -340 154 107 -105 96 -52 16 297
3509 297 -202 -104 159 51 79 -145 -390 49 -205 51 29 187 121 -81 -109 58 -13 137 -24 18 26 -102 -17
3532a7L25m12K01P0l84N35j38m5K28n93J24L22l75M22m20q5K76m01J58M68j68
3553I1q8o5MK06l74K60K30k98l33K58J58L5k21M54j38j24j35k1L64k37J18l75
3575b31L75j95P4J01N9j92J33Q4k86j90K19M12l78q4K18k11L10j50j35J47j38
3596e8R7j01J16J45j86n3M1ko2P0J64j81J56l5k66j0J28P6k16j51J79p3M03j05
3620G6j46J27k69K39M4j09J73j29k66M31J41k12J96l40J81j47J01J13j11k81P4
3641a14M0K2J71p6q2p5N4L49k47J7m7j33N8k2L21j77j13Q4K8j93N17j91m17K64
3665C8k42L73qm29K54J77k33L73l99q7J35Q9j41J20j55K08m8k61J55J6K65n64
3687c64K56J04Q0j45L13m90P8LM3K77Q9l11M1K61k56O4O5J2J31l71K50R3k42n0
$$ plain form
3532 -17 308 -104 97 167 -217 318 180 135 363 -230 -106 216 -159 263 -157 -242 34 -367 -209 259 91
3553 91 3 -62 -58 148 -226 34 264 -34 -367 -109 49 84 -137 317 179 55 -80 -101 263 26 144 -231
3575 -231 144 -51 23 124 183 -9 124 208 -78 -268 -49 363 -15 -99 119 -92 218 68 -67 80 -58
3596 -58 39 -62 54 199 13 -40 1 -1 -63 7 171 -10 146 111 -155 -165 -37 39 -177 -328 -149 -222 181 76
3620 76 -70 57 -212 27 71 -38 135 6 -260 171 312 100 296 -44 137 -10 91 204 93 -188 -114
3641 -114 -74 -52 119 43 -39 -114 -60 289 42 59 12 -121 -63 -85 236 59 -54 30 58 -135 382 191 -226 38
3665 38 -204 169 161 -268 -14 163 -70 303 -96 -183 -48 41 -100 20 -135 73 25 -236 -81 -65 200 -364
3687 -364 -108 -4 76 -69 244 -246 -168 -165 -122 155 244 -67 -26 235 -21 43 108 120 251 -120 130 223 -19 -69
3711f9Nk50L22k55Q3q1K28J71k03K59q2j60K3K27j82l8m2J42J4K4R6j32J1N3k64
3736a00M00k11k85k31N27k6K4l9L5k77M9K0J72m9K26m04q1L56j55J44k96k5J87
3759c9O0q0n0j8M80k36O2J48m35K02L9l09P4O3j2R6K19m39K41l78K05L41l76m7
3783a89N0J90j10j3j36K99mj42J72l63L14R1k25J34m23J09K70n0J07j86p3%J40
3806c8J84l89k3K89P0k4m2k80J49J11j72p7J01J83l09N6K17L9m0p1R4J27J06j41
3830A20q2M6N3l8q8m9K66l10QJk57K85Nj42L86l89LK5j33J01J42l41M04JP8J89
3856B84k52n3J39P4p3j02J7p6K24k13K7j52J09N1k49N91k42jp0K59m24k5L37j84
3880dj52L46l42r5L73j42j28K21N7O3r0k57J60J4k65K52K14m29P0l6J65k2l8K75
$$ plain form
3711 -69 -64 -314 8 -247 -164 -245 -17 154 -49 210 128 -32 -9 218 36 -2 -44 98 112 136 232 100 111 164 -100
3736 -100 300 89 -196 -427 100 74 98 59 94 -183 -134 -114 58 9 235 -169 -250 106 -49 95 -201 -226 -39
3759 -39 21 -59 -109 -127 353 117 179 327 -108 94 133 -176 -102 -39 -51 45 264 -175 66 -312 -107 234 -142 -189
3783 -189 -139 51 -59 -72 -208 91 87 -55 117 -246 68 159 -66 68 -355 -246 24 -26 81 -105 -178 -178 -38
3806 -38 146 -243 -266 23 93 69 27 -253 -104 7 -165 -242 -141 42 -267 -211 6 45 5 -66 28 155 261 120
3830 120 38 84 137 99 11 -38 228 -82 -74 -73 -330 -45 -40 -182 204 -185 -182 -157 -290 -189 -47 -388 16 17 95 284
3856 284 32 -21 118 192 119 17 34 -42 182 -31 -4 -156 -47 4 -245 346 104 103 33 292 -132 -157 180 -4
3880 -4 -156 190 -152 -247 126 -16 -144 77 134 197 107 -150 10 24 -241 11 225 -204 -134 -170 -5 -27 -65 210
3904B10m87J32N46n04p4K30j50J09K37j67j39j88K14P1K02j36q3k35K12j73J05
3925f8J20Nr4n5P7j70N52j31J47n71K04j92o8O7J29l91N04q7k1J31r3o4L38j76
3949I3J58r5k14J29M6M1j38l4j75K68Q2k34q2L8K26rJ09n67L28J22j82j84J92
3972h2K6O9j81n5L31j52j6K88m41J74m1M9k4J1k63N21k54p1J61j25K9K60n4o0
3996A00k07J46O1L0k93J33p8QP9L49m80J33k83oK19N6M9j0J40k67K44j20n3l65
4020d15N12j46J23R0q2K42k45q4j06K19J26m66J99q8N4l7J14j84K06l32Q8J76
4042c6M7j16M63n52J50l00J66M59l92o3K59r8L67k21qM4K3l20j41J75J44R4m41
4065b97J37n3J79K09l61N1Q9k40J66Q2J2K3q1J82O5k48L64n33L71K8k66J23L67
$$ plain form
3904 210 -277 -145 401 -103 -177 53 -97 12 249 82 -57 -245 -31 40 242 106 23 -212 0 -173 -68
3925 -68 52 57 -37 -92 -15 -185 367 236 383 -188 16 -176 -244 -177 -48 -439 65 -22 -43 88 -5 -69 269 93
3949 93 251 156 -58 71 117 158 20 -14 -189 79 161 -73 -155 -117 109 100 209 -358 -30 92 -90 -274 -82
3972 -82 -56 13 -168 -223 108 -44 -60 228 -213 -39 -80 -31 -55 -44 -307 214 -40 -111 50 -75 -46 214 160 100
3996 100 -107 39 100 130 -163 -30 -108 -100 -21 328 -152 -19 -302 -308 -89 -33 16 6 146 -121 123 3 -50 -415
4020 -415 97 -49 74 164 82 324 79 -5 -111 108 234 -232 -33 -121 -67 -104 10 -174 32 -300 -212 -36
4042 -36 11 -105 358 -194 -44 -344 -178 281 -111 -174 85 -13 354 133 125 169 192 -128 -269 -94 50 144 -297
4065 -297 -160 -213 -34 175 -186 -135 -46 -286 -120 -38 -26 -3 -84 98 163 -85 279 -254 117 145 -121 2 369
4088C69l84J08l08M17n20K69J39K05l14k5N6j24K42m45L13J22k88J83j83J41J74
4109A47k59Q2K75l7k59J48J31l8j35J39l17L0J79m4k3M07q07L99j67P1P8l7KP
4133b8k7Q9j2k98K27q1J14l8J00k44J47j55L7K55l45L20j30J75o3k52L78l23j65
4156c19L31K4M2j50Rj42J26L8j06J35L2J23j85Q8J21l54J52K8J3J35M0M9l39O9
4180d0J96mJ93k44k76q5N37m0k52j16R4L79m5k96K71n71N59m29p7N08l16Kj20
4203a72Q3R4j56L13j3j76P4j77%N4J2r2J29K28n6rJ6m02J84K20J43m32J01j6M5
4228ek40J5K22L0j32K91r3Q2l10J44KQ8P4k71J99k21J94L06k89k37K27k85J99
4251a0L07l43O7J87k44j49j32L5L51J7j62K11m98L71j34jm5l9L93j27k3K17n04
$$ plain form
4088 369 -15 93 -215 202 -318 -49 90 295 -19 -44 12 -112 130 -315 -2 120 -168 15 -168 -27 147
4109 147 -112 -30 245 208 -51 97 228 190 55 194 -123 -93 86 42 19 426 -381 18 -149 -78 0 -37 -35 -28
4133 -28 -55 34 22 -276 -49 -130 -16 -54 46 -198 -51 -206 -169 86 -259 61 -69 106 43 -209 169 -154 -319
4156 -319 12 36 78 -72 -63 -205 -79 -41 -147 -12 20 143 -42 46 167 -187 -35 -7 6 141 181 230 -109 -40
4180 -40 156 152 345 101 -175 -260 277 237 -15 -131 -37 342 297 1 272 -299 260 -169 -246 262 -54 -52 -172
4203 -172 -89 5 -151 162 149 -27 47 -130 -130 -76 -64 -156 -27 201 145 136 152 -250 -66 154 297 -135 -34 -50 -5
4228 -5 -245 -230 -8 22 -110 181 88 170 -140 4 6 94 168 -103 96 -125 69 375 86 -151 76 -209 -10
4251 -10 297 -46 21 208 -36 -185 -317 -282 69 86 -76 135 -363 8 -126 -127 -172 -211 182 55 32 249 -255
4274b55K15J24k94N0K28j36o7J90O2l7k42K52j53j6K33j18j75j25J86J30R2k12
4296f8J28k50L07K3k94L46n91J92L48j14O0r8n8J93k91K17P4q7k56J93j09M9Q2
4319dJ8L01k85j09J54l04J28P0k17k5L19j53m4K67pj33j17J61j90J47J52j76n2
4342i9M7j3j81M80k88J49j60oK69j49k19K32l95K59N8J89j91J08j25J58j44R7
4364G6Q3j78j28p2Q1K79J9k52j9j44J50K10j38Q1j70M11m8l32L03l88J99R8Q3
4387B04m58Q9J81j50K22j86K70j82k02K64J10n18M74j2m5%N7j0j68P3m1J56j13
4410A5J91o03N36k23O6K43l68N9l6J45M7l59K88R7o1j01J98j96k49R8K29k5K15
4433B06j60L2k73K69L0k89J3M2K08Kl1J04j75l11K38j48J76K16p3q9l0j21J96
$$ plain form
4274 -255 -40 84 -210 -160 68 -68 -135 55 117 80 -162 90 -63 -79 154 36 -139 -264 -78 52 144 -68
4296 -68 60 -190 117 140 -154 192 -399 -207 141 27 87 -11 -69 124 -167 50 124 37 -219 -26 -135 -86 -4
4319 -4 14 315 30 -79 75 -229 -101 -31 -248 -273 46 -107 -151 116 109 -24 -141 20 -170 -23 129 -47 -99
4342 -99 -52 -65 -246 234 -54 95 -65 -71 198 49 -170 62 -333 -74 -16 173 -18 90 -35 123 -21 76
4364 76 159 -19 -147 -219 -138 141 160 -92 -111 -255 -105 105 -33 48 -122 289 241 -91 212 -176 23 121 204
4387 204 -254 -165 16 -134 88 -98 172 -10 -212 52 162 -356 118 106 61 61 118 108 -60 13 -28 128 15
4410 15 206 -397 139 -84 -18 225 -143 -84 -120 25 72 -287 1 98 37 -64 134 -62 -311 -213 16 -9 206
4433 206 46 78 -195 74 104 -185 -172 -130 78 80 49 153 -22 -333 -95 -243 -67 149 76 -13 -43 -164 32
4456C2J78l24P5k16j65P26k91K46m71J0K65J65o1o7j37J50q7n8L79n97M15j6k33
4479h2K86p7Q7k02J0r1L8l9qj59O8M83l88K05j18k11P6M14m73K13j62J75O8k0
4503I3K37k39J41k30L22k81K17j20J0j38j89L47l1l46L64n4k69M0K88k43m0n4
4525a75M1R0J09q2j10K76p6l21P9Jn5M64l63J96K1o7p0J47j11k0O7q2j62J41M9
4550a3m1K50j31j38J50K14K9n25m5N5J61M4l06K48MN6l4l8M0l3J64r2j79J44Q7
4575G1k54oM65j45j98K18O3j10k87J16mn5J71l22J44K91r4j85j44LL49J03k44
4598e4M8j93Q5K78j23J58j95j19P6N1J36k27QmK03k31K84j45k4N8r8L6Q6l11L00
4623H3q8k73K78j21L07n33N00mrj33J4l03M13J47m78M78k38j8j16J88j76K16l16
$$ plain form
4456 32 210 -114 -39 -255 -420 306 15 261 -210 -200 65 230 169 102 -35 115 28 -30 349 -248 167 151 -82
4479 -82 204 127 214 12 22 -69 -31 -70 -78 -237 -169 314 -74 131 13 -198 -122 292 -181 32 -130 45 113 93
4503 93 330 91 232 2 324 43 260 140 150 12 -177 170 139 -207 157 103 -166 -126 162 -81 -121 -175
4525 -175 -134 -44 65 -17 -127 149 73 -248 -169 -168 -223 241 -122 74 95 28 -42 105 -6 -26 41 -41 -203 -62 -13
4550 -13 -54 196 65 -73 77 291 320 -205 -250 -195 -34 10 -296 -48 -44 12 -22 -60 -20 -53 111 19 -160 -16 71
4575 71 -183 -189 276 131 -67 151 214 104 -183 -67 -71 -126 45 -277 -133 158 64 -121 -265 -262 87 190 -54
4598 -54 -6 -199 -114 164 41 199 4 -115 -39 12 148 -79 -71 -75 128 -103 181 36 12 70 -28 8 94 -217 83
4623 83 -5 -278 0 -121 186 -347 153 149 140 7 21 -282 131 278 -200 278 40 22 -94 94 -82 134 -182
4646a82M87m59N7J49k24J73p6k18J65r2J65q9k00M70j38K2J34j12Nl7q3o7J69
4669A9JJ4rj8L8r4J74l12J79j3j81N7K07l67L27J32J45j26m74M09J3J25k26O1
4693H1j99K65l46L1l8K25r7K64q8m10M18k77LL43j59m5q8N4K00m9K5k59j76J53
4717a69J42k8K4m1J41o6L3J43m73K68j28J71J62j64l8K20k73O0K23j31J30j11
4739I5j10p8K29j27j63J00k7N6j33K15k90J65L06j33j94L27n1j11oJ04m33K63
4761Dr7J50n5M9l60L22K85k05j76K03p5j18J71O7j84p0l4J97J6o7j2o9L24j41
4785A25l17L44m2k10K36k2k03O8K27Q0l31r2L65p5J45m2j50j73j30J45J47Pl08
4808b06K5O8J36k36J51K11k29MK3j7M7J70l00P1n3J42q0J65j70L76j51m0J4p3
$$ plain form
4646 -182 305 -154 -97 52 -172 1 -75 -293 -128 -220 -55 -144 -344 126 -12 10 144 32 37 0 -83 -150 19
4669 19 20 34 25 7 45 -49 125 -187 -8 -21 -202 -145 62 -305 22 154 299 173 -301 108 121 246 20 81
4693 81 -118 147 -199 -168 -206 19 -78 186 98 -312 106 -171 -168 175 16 -29 -117 -63 137 88 113 -146 -322 -169
4717 -169 -27 -55 -31 -72 69 3 36 179 -294 -26 -154 17 179 15 -23 197 -76 -16 207 76 206 95
4739 95 -15 -93 136 9 -154 -54 -81 -25 -158 57 -233 -68 238 105 -89 238 187 76 70 174 -259 4
4761 4 -93 57 2 51 -309 13 298 93 -83 120 45 -73 98 165 -19 -89 -123 74 90 23 11 -58 266 125
4785 125 -192 152 110 -100 136 114 -89 -21 206 286 -45 -137 228 153 298 256 106 -67 -197 -52 95 102 -206
4808 -206 -181 -113 23 -213 -62 149 -80 -76 -53 -70 -23 147 -153 -82 -135 7 -73 92 -78 298 147 107 121 48
4832D8J39l73Q9J17J27j99L48k87K04m45K47m6k13J89r4N0J54P4k97L76n5j83
4854c0j16K5J89L5j39R2p6J10l67K64n1k9J21O6k99mJ70k15N6K8J9J09k2P5m7
4879c6L1O0J54l71L75j86j44J39j49K38j75l8K64j55K54j86l0R9j2j87m2J45J99
4902B47j04l15J69J55oj32J26k59L41l17J35j19K17j78q1P9O6n1l28N72l91K67
4924I3j23ln3l9K19l5J7r9K41j86m6k1k89L55j82j8K15q6K30j49k88J66K07j96
4948g0j02k03N50j03k19O6J03j73J24j0m7J66r2o9L42n62L86j08L1J85j68j13
4970h6M1R5o4N3nj93J81r8K19l66N05m86J83Q9q0O4j5KJ45k65j57M75l52K9R0
4995Dj25o0K06P1P5j67m5L21o58L82j77J9j29K21K45l39L93l01j04K10q9j6K10
$$ plain form
4832 48 187 -186 -97 20 147 -52 296 9 213 -232 15 -31 -244 -55 -149 -99 55 129 -168 208 153 -30
4854 -30 -146 -121 68 103 -36 56 -20 90 -277 -13 -64 -93 28 94 -205 -209 -39 -254 -198 -170 -151 -42 -64 11 -36
4879 -36 -5 55 209 -162 213 27 -117 22 -127 111 -64 -102 162 7 261 75 45 144 132 -55 -97 48 247
4902 247 143 -172 -3 152 146 14 140 -119 222 -95 40 -79 138 -40 -121 -42 24 -27 -355 217 -174 93
4924 93 -30 -33 -86 -125 94 59 76 -23 218 32 -14 -35 -324 31 -151 -169 46 -40 190 41 -247 -81 126 -70
4948 -70 -172 -375 175 72 -147 -81 22 -151 -27 -37 -84 82 -10 -79 263 -299 87 -21 10 195 27 -86
4970 -86 -45 50 -14 39 34 -159 22 -76 143 -223 282 -204 -21 68 -12 52 37 39 184 -81 -238 237 -115 -86 4
4995 4 -121 -181 25 96 171 4 -41 280 -378 4 -173 -154 -283 -62 183 -156 237 -64 -168 42 -47 -63 147
5018A47K18k19o6j57r0J59N0p5J02j06n4J38Q6n5j09j22K11j93Q2r9J54j32L46
5041B16j05k6j7q9m4q3K28k49J28J6K52j86KK4j42j00P1J24Jj60L04k12J86l01
5065a62lK61j09p3J39r5N6Q6k00J70L1k78J69P0m9r7K01J30l12J29m7l46N92l93
5089a30J08L1k97J43J89K03k41j46J23J95q7l4J00n8l16J46r1L19m7j52O6o9r
5112e4l0N2k38R6Q0N3L01m44O9J61N2K7p4j38m1pL83P5l76J60k86L66N0l49j33
5137b45J26K37p8KP3j75R3P3J03k38j20L51k82R8j11J15n2J3j12J60K21m5m11
5160b04kL14l26K51j31J15q0LJ53o4K29j56j71L9J84k63P0L17m02J54n3J13M0
5183A30p4p3j28P5QKj38K82j99J45J01P1p2j17q8jK71l13Q8m55O37j96N6n5J38
$$ plain form
5018 147 365 146 80 -77 -167 -8 42 -33 69 -37 -91 47 133 78 -31 -153 58 -135 -53 -152 2 -130 216
5041 216 111 85 68 -21 -65 -148 80 -169 -41 -25 227 41 43 67 -75 -175 -104 20 21 -139 165 -47 139 -162
5065 -162 -165 96 -13 -86 53 -42 14 100 -100 70 101 -177 -8 62 13 -84 117 247 -65 64 17 -329 263 -130
5089 -130 -22 9 -288 -145 44 247 6 -140 -17 178 91 57 157 99 -217 -71 -162 157 110 -42 24 -45 -54
5112 -54 -84 -32 -270 -174 -94 -41 260 -184 -115 46 98 125 51 -87 -128 -135 248 323 -53 107 -179 187 237 -112 -245
5137 -245 -119 118 40 42 115 -60 33 106 209 -29 -149 202 -80 18 -93 22 -30 -17 -129 31 252 207 -204
5160 -204 -206 108 -218 33 -98 17 -63 -60 93 29 258 102 -69 -30 154 -109 -39 278 -124 30 -23 90 130
5183 130 56 -17 -145 -70 -62 -60 -198 84 -115 30 131 202 130 13 -75 -76 195 -118 -30 -485 152 -44 12 -43 95
5208I5j3j10R6k62P6J53L0J00K6m49N20m05J85j22J25R1j41J95l94L94l8O6k22
5231dp0J22K40l51Qn5m4j06K82K2j96L87K00m91J93m76M47O3l26Q2J89l9o9O3
5255G1l60L06qn0K24j49p7K72p9k55k02J59L15k13J38q5j6k34J88K36J12m6j86
5278F1j78J45j92J64k4K07m2l72M67l52n5J58k2J20k64L39n50K83M7k2K0J73j11
5301@j40L6J74k89K97J48k03nJ89J23j60l09R1K25j98N2L43m27J49j5J74k35j22
5324a02K12K59k84M9n2Kk69K40j8M3j58J75l57K29n4K91k21L28p8j82L21m42J57
5347H9J65l21K58q0j35K19k3k32N2J66k36J76k31K15j94J59J45j55Lo4m5k00L65
5370I6k72J64l8K79l4n1l75J67K75j70j41N3q7J76K46O3n11J94J59k37l8J46K85
$$ plain form
5208 95 82 -28 68 -194 -118 35 65 165 191 -258 262 -143 42 -80 45 136 -5 190 -204 190 152 218 -4
5231 -4 -74 48 288 -63 -55 -110 -154 -260 22 44 -152 235 435 -56 137 -339 108 171 -155 -73 116 77 8 71
5255 71 -289 17 9 -41 183 34 -43 229 150 -105 -307 -148 167 -46 92 7 -9 -243 -55 181 293 247 61
5278 61 -117 28 -164 0 -24 183 141 -231 236 -116 -171 -13 -35 85 -179 160 -390 -107 -60 -82 -62 111 0
5301 0 -140 -104 70 -219 78 226 23 18 207 330 170 -139 -48 177 -21 31 374 -53 96 81 255 20 -102
5324 -102 110 369 85 134 82 84 -185 55 37 80 -78 97 -260 -31 -85 206 -15 313 235 53 374 -68 89
5347 89 254 -67 191 111 -24 195 172 -60 -8 158 -78 98 -133 82 -112 47 192 37 40 -24 -69 -269 96
5370 96 -176 -12 -50 229 195 144 -231 -64 211 41 -100 -47 -134 42 288 351 -160 34 193 -44 -82 64 349
5393C49n10K07J71j46q6j25J71j76J51m48M21j8L28l06Q6K02k39L6l03L02j56
5414h9K61k68J18K3J26j56Q8J86n74L4K62j52J46j49L12k44K80m11K5P3J39j58
5436a28J10J78j79K2J12j15l03K61K51m3j83P3L45m29M5j3J45k97K11j45P1J00
5458H9L6q9p3KL3o3N2O5J19k33M5j45J75j64J10K70j25M6K0k10j14J01K44m8j04
5483C9k34K99k81K37j5j24J95k59j1M1o7R4L43k70K0J51J94l34j11p4L12l92L22
5506G5J14J44j92q3J07j79r3lL28m06J24k51P1J56O5J6m3J3K03j62NJ35q1j1k36
5531a84K46l9j53j54K41J22j55JJ41k92Q5J82NJ42M2j23l25K54k9P3j3K7q6m4
5555c6o4K51j64J4l9pr4K49J27k11K36k70L76m29O6J18p2Q0K1j81L84m04K18k01
$$ plain form
5393 349 -161 46 217 71 -15 -140 31 -145 6 -442 -21 -39 289 -17 69 271 32 68 -235 67 -89
5414 -89 172 -96 22 45 171 15 103 289 -285 -251 11 -141 5 -144 168 -76 204 -207 -182 -109 30 -128
5436 -128 -18 160 -19 3 115 0 -303 -42 209 166 -17 56 401 -28 17 4 149 -148 63 -82 -11 89
5458 89 125 36 -37 -35 -2 -65 -13 52 171 -62 -17 -162 13 -151 -41 229 104 150 170 -40 -154 -53 191 143 39
5483 39 -195 104 -177 60 45 -79 116 -143 -154 -113 -180 -86 257 -13 7 158 352 18 -93 -167 145 -247 75
5506 75 189 333 141 58 165 -14 -107 -110 218 -188 -64 -315 -244 -88 -23 -7 -50 -37 166 4 9 144 63 52 -184
5531 -184 62 23 -130 -284 -43 79 -76 -75 66 -226 -141 41 46 188 230 107 -218 36 7 80 67 94 8 -36
5555 -36 -100 151 -13 1 -38 -45 -139 110 237 26 262 -8 368 -61 5 123 51 131 152 -29 355 -49 169 -32
5579c2Q0k32K90J0P6k22j19O6Q8k3K18l4k24m8n3j41K60O4k23JJ31J84k27j23
5603b33M5J28K73q1rJ0k81P8K95k77J27k42K46j00j45R3j0M22k82P9j92J40n4
5626C0k07M35k03n4l6l5M26l25J87m9l45N76j83o9j76J90k71L2J69k90r1M13R9
5649B23k42j30J71j23j3K02k3m55M40J56k94J40J64l11O4J74J30k47j43K56R8
5670B37j56r9J14n4j79J67L1n4mk48K32o5Q6q6K19j9l95M54M2l57K73k15J18J03
5694A45j5N9j25k48J27P8k02J99J02k58J44n8M7R2q8J35n8O4k4O6r6k25K63N8
5718A82l13N8m0J49j48J32j84K56k17n5L16l5k16K45J30o5J8l02L83k55K9J08
5740A76m41M42j3j27n6q0L04j05j59n7K04n3k89K19J74j72l4j28j9K67O7p9kk61
$$ plain form
5579 -32 48 -184 106 116 192 -30 -149 -83 5 -18 200 166 -58 -106 -159 -300 -40 24 -199 -198 -67 117 -110 -233
5603 -233 -188 -60 213 132 123 133 -148 -70 225 -52 75 -167 79 -21 -166 -73 -83 339 57 136 -56 84 30
5626 30 -177 258 55 1 -35 -70 356 31 218 169 -176 400 217 148 -28 162 -109 -77 92 -198 -289 124 223
5649 223 -19 -149 22 -101 -114 88 65 -390 50 206 -88 52 216 -95 -31 143 273 26 -117 139 237
5670 237 81 -18 96 42 -137 30 61 7 3 -245 -13 -78 8 -78 141 122 -273 181 223 -134 139 -76 42 145
5694 145 130 189 64 -184 -57 21 -181 18 120 -138 6 -52 -5 87 -1 134 76 140 116 182 86 -139 124 182
5718 182 -131 -73 -113 36 -112 20 -164 92 -125 -180 136 101 -115 130 260 195 213 -89 294 39 68 176
5740 176 -265 177 164 37 -19 -99 205 100 -59 -116 88 35 -254 -35 139 -33 -67 -195 -214 53 120 41 39 -222
5764b22M36k74lm7J90Qj29kl5p2J80l01N17k26J26k36J48l94K65J08N8k22lK15
5788H5o8Mk0j16J66M9JJ10m06J29o5K91k55J42Rk7J14K38m39K0O8K4J74k14L66
5813C80k72m57J54K17M9j86o6K07k49J53k5L47J3m62L17P0l25L16o1R6k7k20N6
5836B5k7m6oJ61j64q3L01l58P6J65K5m0l5M00o34J11K56j26j3k2O4Mj01J74j05
5861BL6lJ5q0K23k9l71J94QJ15k52j1J60j59R6J03On6qn0P7r6L20q7k34r2o4N04
5889B67l06K47M5j67J20j50j79K54q9m2K6r7J36j48L44m40L21Ll65m1M92l73J79
5912C7o4O5J48m12J52K51K0l3j80K2J41N8k46O6j65j3L60m13N9M2j10J80l0K13
5936A48k03k45L37o9J18P2j95J51l04l1K92nn7j27K53n34N09K21l90l4J02N9j96
$$ plain form
5764 -222 214 -60 -63 -110 80 88 -41 -43 -78 -150 30 -271 246 20 146 -90 58 -336 -71 37 95 -127 -130 85
5788 85 17 21 1 -115 51 100 101 211 -195 -66 -131 160 -95 47 56 29 143 381 -58 -38 30 54 228 14 380
5813 380 108 -349 -195 22 71 -115 -181 26 -223 -70 -95 252 265 -197 120 190 -135 181 120 216 189 -31 25
5836 25 -2 -48 -54 107 -57 -140 161 -197 -121 44 69 29 -6 394 -240 -129 127 1 -12 -34 30 34 -67 107 2
5861 2 38 35 50 -30 193 164 -207 -13 -5 110 -142 -153 7 -152 -56 47 53 -3 -11 -61 16 -80 240 153 -81 -173 -237 267
5889 267 -39 208 253 86 206 56 -123 131 42 0 26 -71 65 -83 261 -179 142 145 -220 -261 231 -142 37
5912 37 -27 38 186 -226 -74 177 197 164 -16 6 147 205 -41 25 -140 -153 207 -206 -147 -105 -215 -35 -65 148
5936 148 -55 -300 37 -32 86 158 -37 114 -190 -221 71 66 9 -118 135 -399 110 331 -59 -93 9 68 -128
5959a28K99n2O6j64J16o8o5l19O0J15N7m3K21J21n7j93ln3N0P0J53j15j58L26
5983B36j60j20JJ07J1N5l81M47l21K6K56L2m9k68M6J56l0M8O2j09j78j10K30o7
6007h0P1K12l59O4J33j22K56k87j54J41r9K18K01o3Kk42J48j8O0j90R2J98j52
6030C0N8o7k40L41j16L6O9P8o7m24N90j32l5J1l07K72l39K52O6j96J54J37l20
6053a49L31k74N6k08K38K85l90j30K26k65J00K24k70J96m2j44K98OJ52l25nn2
6075a42K92L2k36J95l03J28j4J64j25O8j25L43k23j38R5kjj3k1mj08J29J0J79
6099A80j52J13q4n0m0K34j20k4l95J40L90l38Q3J96J42n94M35r8j47K82j98M0
6121ej56J54m3K5j60K65j63K23r0k87K33K9k84M68k2k01r3J49K0j18j94R8L25
$$ plain form
5959 -128 171 119 185 21 137 69 4 -315 -255 -140 -83 -126 95 216 159 -34 -37 -90 -40 30 183 68 -90 236
5983 236 76 -44 -43 64 75 130 -251 196 -125 -99 157 189 140 -128 -82 74 44 92 154 45 -133 -243 -13 -80
6007 -80 -9 203 -156 -92 41 -81 175 -112 -266 -125 -224 -6 195 132 134 -108 40 22 82 -108 -16 182 30
6030 30 88 21 -219 122 6 42 111 189 122 -302 288 156 121 132 -175 97 -242 10 76 -120 34 171 -149
6053 -149 182 -92 -36 -244 -6 279 -111 -241 -15 -280 -180 44 -226 -30 -72 -216 82 88 240 -85 -90 -142
6075 -142 150 182 -54 141 -162 -34 -48 116 -9 59 -66 277 54 -84 11 9 8 -5 -26 -30 -138 -9 1 180
6099 180 28 141 57 7 -33 201 81 57 -338 -198 192 -146 -63 133 275 -319 116 18 -129 153 -45 -5
6121 -5 -161 -7 -50 -25 -185 80 -83 140 50 -237 -4 25 -259 209 187 -14 -107 42 62 -56 -250 -152 173
6144A73lj60K39K8j41J31j57J17m83M39l67J89J77l9o6q4n3J63O8k97P9K11p7
6167H7o1k12m3M52j88k42M07j55k5P1n1J0K87l87p7l8J75J42k10L1p8j19J08J7
6191i9Q1Rj65K68q0j27R8km2P9Lk82K95J18k78Q6JQ0o1m8j09L23j50m2Q2n57O70
6218A51K5k3J54p0m53L10k55M5L02k36J22l86M27j0r3q5J02q6M0J2R5k22l8L48
6242A76j82P1L5qk15L29M4m61M82k35m1K2L41l39mj41qL59j6l74P4J70M2k97J72
6267dJ92k00J21r1Qm21K09J57J55k93K93o7k2n1j72L56k81k7J35k09J02j36J13
6290a33J85o9O4j01J55O9r8k93j48M98Kk20J17K53l46K48k88P6No5J57j09j9p4
6314a34j28N08j75K02l95L44k07k37J50K94j00j37LO5j50Qj0j80K42L9p1JJ56
$$ plain form
6144 173 170 10 249 277 136 267 110 227 -256 183 -184 5 182 143 77 -7 -60 103 171 -126 -47 164 87
6167 87 26 -186 -229 223 35 -207 200 45 20 91 40 50 337 -50 -127 -165 10 152 -58 -27 -105 -224 -116 -99
6191 -99 -18 -9 -174 94 14 -113 -15 -17 -59 20 23 -259 36 154 -124 -38 -37 43 -18 -66 -175 148 -2 -44 38 -519 151
6218 151 176 153 307 237 -216 94 -161 -116 186 -50 72 -314 113 103 10 -75 27 -59 -19 -7 88 -134 -172 176
6242 176 -6 65 100 92 -123 206 250 -211 271 36 -5 17 358 19 15 -126 -134 225 209 -165 -91 79 121 -176 -4
6267 -4 188 -12 109 18 26 -395 -186 -29 126 -167 126 59 37 -14 -186 170 -111 -138 -3 -212 -110 -246 -133
6290 -133 52 -17 47 -54 101 170 72 -221 -369 129 131 -89 28 281 -65 183 -105 -29 -24 -89 68 -41 -60 -134
6314 -134 -262 246 71 273 -122 222 15 -222 -72 222 122 -15 -12 53 -97 -89 -99 -279 -37 2 -69 -68 88
6337H8j80K98kN5k72Lk2j40K18J9K0k07J49o3N8M5N1l14L25J38l14K30k83L00
6361B00j63P9j70J3J68k28J82r5k97J37J1J25j49K40k60K14QO6j95K04k96N3R6
6384e7n8j69o9J30J05n2M42l54J34J00m12M78n47J64j40M70n39L72j41R7q5m9
6406a80M36j79J8k0q4j0J92p5l6j73N9Q7M9j51J78k2J00j81k27K02q1J77l02J20
6430a03l6K91j33K4lJ4M5k81J69J00j10R7jj28j75O8K19k08jN1jk7Q4J91K9r0
6456H5q6K93m04M7J51K9k35J81j28J70K5k2j36K45k34j03Q0j52K78j21K17l55
6478a75J87K10m04o9L02J9jj76O2K35j80l68O4M56m77L01P3p9L3j06Q7N1L4M5
6502A24M0p7K49m78P6J91l3j08j97L36p1j66k4O0J71j71M4m1J36NP4n0j29L66
$$ plain form
6337 88 -92 206 204 259 -13 -10 -32 -172 46 65 85 -122 27 -36 22 67 118 -196 129 267 -47 183 -100 200
6361 200 37 116 -54 -41 127 -101 81 -14 -311 -174 -163 -38 -187 53 -207 7 15 81 -114 90 -206 -153 -57
6384 -57 -115 -284 -353 -223 -118 -170 272 -82 52 152 -260 218 -329 -165 -305 165 -374 -2 -143 -46 -131 -180
6406 -180 256 77 95 75 -9 -19 173 98 62 -111 -52 35 84 -67 111 89 189 8 -219 -17 -98 79 -223 -103
6430 -103 -139 152 19 43 40 54 99 -182 -13 87 -23 74 73 -55 -230 -162 57 -151 -152 -101 -102 -129 -45 146 175 85
6456 85 -1 292 -112 -65 86 115 -120 61 -67 103 128 106 -30 215 -19 -122 -42 -194 84 -37 180 -175
6478 -175 12 222 -182 -251 51 70 69 -107 -45 190 10 -358 -294 162 -315 -14 59 -20 13 -93 -6 45 79 124
6502 124 164 87 336 -142 -66 125 92 -16 -213 123 52 -114 -138 -78 93 -78 -34 -75 61 66 140 90 -39 327
6526C27k7k65k5k27M82j18m8J23r5q3O7l16M57k56j18n6N23n12K70J32k36K1k99
6549b79K24Q6Ol7J49j71P2r6J78k49L38k87K99m07O23o52L09k37O4J16j11J45
6571H3m22P92n10J30k81l1K80J03j83K76l66o6L11p4J52j27l11M14j39L0n5k05
6593a99J18J94k97O1O1N8j1J51l63L88K24m30%J72k62K02l16K09J79q1j4M2J0
6616I6l2k5p1N3j9k90M74n3k04j01J55l6J17j03J72j55k51R9K22j75J89k03Q1
6639f0K39k80M15k07j75N4J95l28J71J37j47p2M56m2o64K74O4j55K7M6N6M8J22
6662A74j68J82k6k88Q9o6J57l0J00l70L07o9L52j06l19q1K13J1j62L3j5J98j24
6685hP9j05j34M44l85J43j83R7nK04l77M90k07J0L35m22qj8J50J34K3l37p3j8
$$ plain form
6526 327 300 35 10 -217 265 147 99 222 127 44 111 -205 252 -4 -122 -178 345 -167 103 235 -1 20 -279
6549 -279 -55 31 37 0 149 -22 50 -46 132 -117 221 -66 233 -174 449 -203 106 -131 -67 49 -62 83
6571 83 -339 453 -57 73 -208 -239 41 144 -39 237 -129 -195 116 42 194 67 -244 170 31 61 6 -199
6593 -199 -81 113 -184 -123 -62 -4 -15 136 -227 161 385 -45 -45 127 -135 67 -249 -40 139 58 44 86 96
6616 96 64 39 -32 21 2 -288 186 133 -71 -172 -17 -53 64 -39 133 -22 -273 -174 48 -127 62 -141 -60
6639 -60 179 -101 314 107 -68 -14 181 -147 24 161 14 -58 398 356 -308 -34 30 -125 -98 -52 4 52 174
6662 174 6 188 162 -126 -37 -103 54 24 124 -246 61 -8 344 238 -81 -162 51 62 -100 -67 -82 116 -8
6685 -8 71 -34 -168 276 -109 34 -149 -52 -57 147 -230 260 53 63 398 -24 -32 -50 100 234 257 -80 -153 -171
6709a71J31O5J9l5k5k99J75L23j56J6L15j96j95n2J16k92M54l37ML43l10K31j66
6732d2J37m26M06o5m7J10j19k89J97K17j7J50N6j47l12L08k91R8L22k62J1j14
6754a19J15M6N4k53L34l34J45j6k7N3k6J18j85K41r4k1M8l59L69j2J85p8k73n
6778i4K20j9P9l40J41Q9n9J8j01J61k6N7Kj83k35M67l15L86r0q9q9Q6J98m76L49
6803A37K5j75l57K27M1J75j3j84J10j86K74M1J72m52Q2j36r5M00J8q7k4o6J49
6826G6Q3l06R1K03k08j37L0J66r9J0J29K48r2l93P0j3m4J20P4l5K37k63j06J15
6850d4N7Q7M0k33O9q0L12k80J82j94K24j72l6J17k09K94j66j23kK15j20K44p7
6873A05j28J15l74L78j47J51j66J66l33N38l25n3L68l54P0j50K22J01j18j48K40
$$ plain form
6709 -171 -40 25 44 9 -16 -315 -140 183 27 43 358 162 -33 -85 31 -261 193 -144 -140 203 -107 124 -42
6732 -42 95 -331 75 10 -37 73 -46 -335 -138 79 62 212 268 121 -191 117 -174 -76 246 -16 -5 -119
6754 -119 -4 42 96 -157 177 -157 -12 -28 -55 -2 -28 90 -95 146 52 31 79 -280 89 77 262 184 -89 -94
6778 -94 126 107 186 -154 -13 76 17 35 -66 95 69 126 128 -55 -290 177 -138 248 158 69 -20 66 264 -212 137
6803 137 162 -13 -370 -143 -102 73 60 -124 -14 -200 74 115 287 -165 -83 -219 -314 86 104 17 -7 -73 76
6826 76 159 -147 -56 147 -61 -198 -168 -2 -101 -91 38 286 194 -199 -129 -142 -186 -66 8 -27 210 -53 -159 -44
6850 -44 13 100 140 -93 -24 -104 208 -72 110 -84 140 -32 -68 49 -160 134 -32 -155 -157 58 -62 182 105
6873 105 -23 92 -282 96 -51 100 -66 100 -233 305 -20 -73 295 -59 11 -139 83 184 66 -82 158
6894A58l19K72J67l53L5R4m5j13L64j60q4r1k5K78k34K13j16k6J6q3P4k76O0J44
6918e0J80R2k87J14q0o1L04m11K69l27K95J5k04K49j78q1M1L96k28k21K45J15
6940A87l84J60k3K91k09j54P2O6k35K42K7k25L3K64J8l06M63r0k13J2K11m13J73
6963c3P6J32k1n5j7m2j54J13J00j01K4Ml0j74K72j18R9j90K07O1k39j65M69j14
6987A04J62q8j97q6j21K98m2k69K23L4q7QJ02J80l7l9m23Q3K77J47l75J27L6j7
7011@k45J75M8J5M34m86r2K76l75M3J60k8J95K9k80J05j39l4K38J7j38K5J12k0
7035C5j8k4M6m0j36J29j77L43p9j69J73l5J2q1q0J40j14L4K60Rj38j09k64J22
7059a61L02m54N00j39j35J61N6m65K93J52j48K63k16R9j09K22K9k99L1m30L90
$$ plain form
6894 158 -161 111 278 -75 -40 54 9 -104 260 100 16 -75 -100 178 -56 157 41 15 31 -52 22 -254 -194 -50
6918 -50 130 222 -65 49 -31 -92 212 -199 70 -257 38 53 -151 98 -80 -161 -120 276 48 -173 72 187
6940 187 -197 -37 -60 231 22 -132 -60 6 -229 13 40 -185 -152 112 130 -176 287 197 -16 -4 207 -206 -33
6963 -33 43 175 154 99 82 40 -114 -1 99 -2 22 26 -4 -178 94 -24 75 -115 92 153 -86 -251 218 104
6987 104 266 178 -19 -105 -226 72 30 -239 -16 18 -69 -61 41 221 184 145 -278 -195 82 229 -146 -19 17 0
7011 0 -245 -70 -22 -7 427 -59 -151 125 -250 -207 -47 -75 120 149 -131 -26 -165 -199 39 56 -82 -57 55 35
7035 35 17 -7 39 -1 -137 -8 -185 158 79 -90 83 48 60 -21 -101 39 -75 -41 219 228 90 -19 -283 -161
7059 -161 141 -313 187 48 -87 74 130 -335 -42 110 -38 225 9 108 -1 221 250 -49 -18 -448 -58
7080e8k47P8N11l27J90j42p3n0M9L21l03J30P9j60L0L4J29j73Q6k15L22j94m8
7103c1J13R1j26l5j28r7K12J3J27k60O3J7J18k87R2JM6J29k21K41R5j93J58N1
7127A89n52O65j28k95J93o0J46J21k8k93J37j33J43l37K16j0J60p4m5N2n21L76
7149g8K1o4R3j4J87k27M2J10%k05K89l04P6J58K8r5R6N9l49m5M63k23k04L98j81
7174C1q2K69m32K23J50m1j49r4K82j93J61l02J37J08j92JJ64j66K33o3%j75O6
7197f4l5N4j3j06J20R9n9k25K04O8j62K44J5n06K91k09K66K44j57j66m6K05M4
7220A06j37O2R3r1j82K02k06J85J15l40N8L51k58N8j30q4K80P1oql82K16p8o6
7244a71L81k55R4k53K76j58l6J11J43N9l49J26J09j26l01L87j33M04j03k41J84
$$ plain form
7080 -58 -305 -227 284 -43 147 5 -68 -118 -69 252 -51 79 158 -2 28 62 191 18 104 -111 211 17 -31
7103 -31 82 173 47 12 -116 -213 -1 12 139 -121 -58 -41 77 -210 -118 -117 -71 58 -163 78 173 -20 138 189
7127 189 -363 302 174 -121 72 12 158 279 251 -42 95 -38 105 -232 -16 -26 134 60 15 67 -454 -78
7149 -78 -57 -121 -28 -42 145 -82 -40 70 70 -135 154 -150 -74 84 112 17 113 172 -177 -222 241 18 -186 212 31
7174 31 -51 218 -214 9 159 118 -31 -125 157 -36 125 -177 -40 68 -124 -123 41 -125 108 45 45 -130 -64
7197 -64 -99 -45 -58 -164 -44 55 -4 -229 -25 43 -119 125 140 -366 -75 -284 -18 226 69 -97 -143 62 106
7220 106 -31 31 124 33 -149 53 -153 32 147 -193 -135 216 -42 16 -114 -198 82 153 147 139 -243 -27 -105 -171
7244 -171 210 -45 49 -204 72 -86 -122 -11 132 191 -158 -32 77 -49 -350 37 -96 308 205 -36 148
7265A48l40J2L76k63J23J28l11J98p7K73m36O7J33J5L2m0l3J09n0k20K76j55K31
7288A96j86J28k35K54k55j28L62j62J34m0j26l9O7j10J87p3j28K36n3J58j91K12
7310B08j43p8n5r3pJ60K74k62j5J32l30M54j96J84j95K3k54L49j50M0M8k30j21
7333b57M44k14K35k74j48J74O0L9K3J50j25j05j01K78l3J00l57J32Q8n1j82P1
7355e3L19l64nN2J99k16n1K80k58L82n30L25j28R9q6J77l32l18K47J97k91K44
7377a11J96k28L0k1J0J1J80p5J13l98L10j62J86J5J36k89N5j60K51n6j10j06J12
7400a11M15p21O02k48Q2O8L4j93L8J90j65o5K26j30J2r6R5K6l4j65L12j11n4j25
7424a18J63J04J00N5k69K02o3q0j54O7k3L2K40l1k61j22R1J46k33L92l57j02L84
$$ plain form
7265 148 -192 -180 196 -67 56 184 -127 71 -6 267 -169 -102 31 46 78 38 5 114 64 -156 120 -35 196
7288 196 10 138 -97 157 -98 -226 136 -26 108 68 -58 -97 -30 -140 47 -26 -154 82 29 187 -4 208
7310 208 65 -13 -68 -161 -168 -8 266 4 -11 121 -209 245 49 233 38 61 -193 156 6 46 94 -136 -257
7333 -257 187 -27 208 -66 -214 -40 20 59 82 232 107 2 -99 179 146 246 -111 21 109 58 -124 -53
7355 -53 266 -98 -103 -51 148 -68 -119 161 -97 285 -245 80 -48 51 -35 142 -190 -508 -261 -64 -355 -111
7377 -111 85 -143 -113 -134 -124 -113 67 -8 105 -293 17 -145 41 56 192 -97 -42 -202 49 -7 -117 -223 -111
7400 -111 304 -417 185 -63 19 87 121 -72 -34 156 -9 -74 152 22 34 -62 33 59 25 -140 172 61 7 -118
7424 -118 45 149 249 304 35 237 174 94 -60 7 -16 16 256 225 -36 -158 -67 79 -154 238 -119 -221 163
7447A63n3j32J01k27K5J16j20J23L8pj34N7j0O7j14K1n9J29%p0J0L02Mk92J87
7472A25m5j83K71J09k85q0K3Q9J03r7j31Q0K18L9q1j08j70K24j0j32J88l34J55
7495c2J17J74k80j09J80M9j14J00N7j97K27j78j54j53N22k69OJ78j11k17M1P0
7517i3j46L18k7K07j40k0k61J13MM3J02r8j39J81m37L40O7J95j05k01J71k24J25
7540b5j33K71k69L3K27J9k7q3Mj23K12k14m3J02J48j33K83J86o19K70k35R4j1
7563f6L7J08k00K87m86K94q2n2K56K7N9k53k96L17Q8M6M2L4j65P0j35j99J37K19
7587H7j39J02j15j29J65J93k24k2L56l84J52j37J76j44m7L31k70o2J58j2r4J06
7609D7l8J24j27K03j57k43N99m71l6j91L53L00j49k54QQ4j90L55p7L0j56%m9J76
$$ plain form
7447 163 110 -22 79 -148 -123 -7 -127 -4 34 27 -107 -50 -60 7 -107 -86 -145 -16 -16 -86 -76 226 230 -62 125
7472 125 80 -103 168 277 -8 -88 -65 24 127 30 -101 -21 197 236 155 47 -123 101 91 -41 147 -187 -32
7495 -32 85 259 -21 -130 50 99 -15 85 142 -55 172 -6 -160 -313 209 -60 -54 124 13 -204 -163 -93
7517 -93 -239 79 52 259 119 99 -162 -49 -45 -2 100 2 -137 44 -393 -53 14 209 104 -97 74 -150 -25
7540 -25 -158 113 -156 -123 104 123 96 13 17 -106 106 -108 -151 -49 99 -34 249 435 -184 86 -149 -55 -66
7563 -66 -29 79 -121 166 -320 -26 -108 -160 96 123 182 -71 -367 -50 38 84 126 160 -5 65 -70 -269 -132 87
7587 87 -52 50 -65 -194 -29 164 -60 -82 274 -110 42 -95 81 -63 -110 221 -49 -111 47 35 -59 47
7609 47 9 133 6 209 52 -191 408 -63 -99 -290 63 363 214 -40 -32 52 -138 217 140 170 14 14 -35 141
7633A41k38Nn4K03K1o6k54O7J16j10%j09K54j67L26j77J49p2N6J90r9K4j34l72
7657c00K08R8K1q0J38O6p0o3Ok42K06J15Q8k86Oj0k80M49j55Q3P5J9j8o8J59l80
7683b15M29k36j73L44L1k49P5j87L38j15J55q8o5k03Rj43j9O17k77K6P8l31K80
7706H1nk03Q7j11K19J6R1O0l02L3K70m74R1J67kj3J33Mk91J42j97L10M6K5k60
7731h3l2J79j12J34k4J86pm03KL90j16M6m52L32O2K9o7j05j61l0J14Q0j06K58
7755A14k34J07J93p2j27K41j84j0J09j82J48K2l05K75j25J25n5j12L38j68k03
7776a05J98p0Q6J46m13J45PJ91k01o2NO0L1j08k3m7M57j7l47mj5J29j17K33j90
7801c1Q8K62m96K72n4j37J59k38J49R4l7j3k26L54Q7k91L22k21j84N7J49k64M9
$$ plain form
7633 141 -97 -92 -146 57 78 12 -242 -175 -59 -169 -169 -278 -24 -191 135 -42 107 35 91 281 182 206 72 -300
7657 -300 -92 6 27 -53 85 151 81 18 24 -218 -12 103 191 -95 -89 -99 -379 70 -85 -2 73 92 74 6 165 -215
7683 -215 214 -22 -195 149 180 -69 6 -181 157 42 197 109 44 -159 -150 -293 -312 305 28 54 132 -199 81
7706 81 76 -127 -40 -151 68 84 175 235 -67 -34 236 -238 -147 20 18 5 138 142 -149 -7 -204 106 152 177 -83
7731 -83 -115 64 -48 86 62 248 241 -162 -160 230 114 160 -292 40 102 131 64 -41 -202 -232 -118 -38 -144 114
7755 114 -120 -13 180 108 -19 222 38 28 137 -45 103 125 -180 95 -30 95 40 -72 266 98 -105
7776 -105 93 23 109 255 -158 -13 -6 185 -16 -78 -73 -13 18 -90 -113 -160 297 280 -67 -71 -86 43 -74 159 -31
7801 -31 57 319 -177 95 41 -96 63 -175 -26 68 31 18 -208 146 233 -58 264 43 -141 -84 65 -199 -150
7824a50J12j74j01J31K51k7J99k08j57P4N1K76k32j07j51K00Q7k15K57k13JK31
7846A35j20L23j90m8k23k7K36j0j49m7K45j27m7j8MpKr3K10k12J31R6J81m8l54
7871a57K57r8J33k40L24k08K14j95J73k28Q5P5k16p4J43J2n5k19J34P6k8R5L4
7894C7K3l44K40L93j87r7k4P8j87J2l14J59L33k43K78k52j73K12j93L61k10L39
7916B41j64k7P4J29n41K51OJ12L7j23k43L07j11K65n81P7K83R7j1K23o0l75O5
7939f9R1oo0o6J47j23Q1j24K39l74K14L14k63j4k73M72k69K99j81J20k56L2J3
7962e6l5J94n4m02L68k1ol4L4R7l1O1m09L25J35l45L24k80K58N1j68m4l37N17
7986A42r2p2J55k39J12n4Q8k23K3p9J37J55k56K33j99j52O61l19L02k31J45l11
$$ plain form
7824 -150 -38 -212 -313 -182 69 42 241 33 -124 -50 1 277 45 -62 -213 -13 74 -141 116 -97 -96 135
7846 135 15 338 148 100 -123 -150 86 76 -73 -120 125 -2 -49 -67 -63 -70 -68 -161 49 -163 -32 64 245 197 -157
7871 -157 100 2 135 -105 219 11 225 30 203 -25 60 135 -81 -155 -12 0 -55 -274 -140 -64 -92 3 37
7894 37 60 -284 -44 349 162 65 41 119 -68 -56 -370 -211 122 -121 157 -95 -268 -56 -249 112 -98 241
7916 241 77 50 124 253 -288 -37 -31 81 118 -5 -248 59 -52 213 -368 -291 -8 89 78 301 241 -134 -69
7939 -69 22 16 -44 -110 37 -86 -5 -129 110 -264 -50 264 1 -13 -286 186 -83 216 35 155 -101 -69 -56
7962 -56 -91 103 49 -353 15 -6 -12 -46 -12 85 54 115 -294 31 166 -179 145 -135 123 174 6 -38 -375 142
7986 142 50 -22 133 -106 6 -48 40 -183 -160 -239 -102 53 -203 30 -169 -321 340 21 323 92 237 -74
8008g4k79J34Q1MN0J44k69j65J71J71M9l9K21r8j22J23k05K31l53K89mQ7R0k33
8032DK8J09j2L6n6k69j44M23J6m06O1K35j37J30K2J31j09J67J74m80P5m4k63K82
8056b7J3k76N4K20R2J77m71K24J80k73J23j89j08K83j46m6J34J66J24k82J11O5
8078A48l1j86J11j26J46p6J3J63j87J67o4j09k4r0K46k0k32K03L1L07m17K34l44
8101a37J36j34K60j97k6O2q5L2L12l92J76J34l7l0k4J15j71K48n58K3M08j07j7
8124iKJ61l94M80m25L81j17k48k6K32J0j53rJ18K35j74j01m9p7K67J3j47J02l2
8148D0m34L68J50q0j5pJ04k65K01j12J01j70L54j06P9l65Q1N4o0J26L09j12j95
8171D6J89j20J0M0l60J59j15j15K76M2l2q4K9oJ35j54o1J35M1K75
$$ plain form
8008 -74 -353 -219 -138 -134 -84 60 -209 -374 -203 -32 17 -22 199 101 -21 102 -103 128 -225 64 60 147 237 4
8032 4 32 141 129 165 109 -160 -304 119 135 -271 -210 25 -112 18 40 171 62 229 403 -77 -2 -46 -309 -27
8056 -27 -14 -290 -236 -16 76 253 -218 6 186 -87 36 -153 -261 22 -124 -170 -36 130 254 -28 83 148
8078 148 117 -69 42 -84 62 -14 -1 162 -25 142 78 -31 -55 -145 101 81 -151 52 83 390 -27 207 -137
8101 -137 -1 -135 125 -72 -98 -36 -121 -89 223 -169 7 141 104 74 50 165 -6 242 -316 -293 115 8 -9
8124 -9 -7 154 -240 240 -185 196 79 -169 -195 37 47 -106 -115 3 238 64 -37 -86 -163 104 117 -30 72 40
8148 40 -394 -26 124 44 29 22 126 -139 62 -50 51 -119 235 129 208 -157 -76 -22 -82 44 353 241 46
8171 46 235 115 125 165 -195 -36 -151 -266 10 52 20 -64 -35 -41 94 -60 -121 14 55 330
8191C30
$$ Imaginary data points
##PAGE= N=2
##DATA TABLE= (X++(I..I)), XYDATA
0@%%%%%%%%%%%pJ5j6J6j6K4l2L2m0N0n8P2q8J04j20J37j60J84k10K42k75L14l59
34a91M06m56N12n74O41p16P96q85R86j093J207j334J474j625J791j972K172k396
52a257K643k915L218l557L942m385M896n493O207p074Q148r531J1384j4005J8025
67A0246k5043M0795j41642L0594K00569j68569l7901J40492K3264j64692M6793
78d5094J71135n1417j63650N4231P4514o2219l5118R4136K7849r0146j2372R2090
90E3939j6382n4639L4723J4528o8175k2398N4928J6322m6672K3620M0474m7907
102a7639j2105P0900J2640m3446l938K1090l1516l3248M9706L3170m7828j8803
114b1017K1182O67o805Q578K0366o054l7361j1776J4170J7857L089k2343L357
$$ plain form
0 0 0 0 0 0 0 0 0 0 0 0 0 -7 8 -8 8 -8 16 -16 16 -24 26 -32 40 -48 56 -64 73 -87 97 -113 129 -146 168 -191
34 -191 215 -241 271 -303 338 -378 418 -467 519 -574 633 -701 773 -852 939 -1033 1139 -1257
52 -1257 1386 -1529 1689 -1868 2074 -2311 2585 -2908 3299 -3775 4373 -5158 6226 -7779 10246
67 10246 -14797 25998 -115644 -85050 115519 -53050 -90951 49541 72805 -91887 -45094
78 -45094 126041 74624 -89026 -34795 39719 -22500 -57618 36518 64367 -25779 -38151 53939
90 53939 37557 -17082 17641 32169 -36006 -58404 -3476 12846 -33826 -10206 30268 -17639
102 -17639 -29744 41156 53796 10350 6412 27502 -4014 -37262 12444 45614 -2214 -21017
114 -21017 165 832 -5973 2605 22971 16917 -20444 -32220 -18050 -193 2896 -19447 -16090
127a6090K3592j5846j2135L0437K6346k7080m1442K9977L9372m3974k3582N0628
139B0203O254n6405L91O8509m320p0057K5899N5389n1170l7718N9452K4824o0622
152a9371j5631O4894j331o3123K7226N4352l4340l4962L2698K0514m2034j6898
164b8006N1307P475m5347O047K3316k0145j1100L0623J3998l8814j6412L2694
176E636n236k1197L0152J2115l7628j2412L6062J6323k9447k91K7104k1754k2431
189b3004K8081J9363j7829j8653J0564J0812j7707N28K3033n979k0239n533P111
202i452O245n435O068R754j5410j1210R275J3903J1037n710p809o57q132J931
216e602J6403Q872n546k1694n609J5935J533Q64P628j1251j9744m192J7461J4816
$$ plain form
127 -16090 7502 -8344 -20479 9958 36304 9224 -32218 -2241 37131 -6843 -30425 20203
139 20203 26457 -29948 -29557 38952 34632 -35425 -9526 45863 -5307 -43025 16427 41251 -19371
152 -19371 -35002 29892 28561 -34562 -7336 47016 12676 -22286 10412 30926 -11108 -28006
164 -28006 23301 30776 -14571 -8524 14792 -5353 -16453 14170 28168 -10646 -27058 5636
176 5636 400 -20797 9355 21470 -16158 -28570 7492 23815 -5632 -5923 21181 -573 -23004
189 -23004 5077 24440 6611 -12042 -1478 9334 -8373 -7845 15188 9209 -11030 -16563 -9452
202 -9452 -3207 -8642 -2574 7180 -8230 -19440 -10165 3738 14775 9065 1256 599 -7533 -5602
216 -5602 10801 19673 14127 -7567 -13176 2759 4292 5156 12784 1533 -18211 -22403 -4942 9874
230I874j0116o145r27j1380P021K1207O589p599j3678j976O020L650J3063K078
244A7681j8068o843J977N882Q728o9l101j0391j0546P367O210M96L810p301q675
259a2843K402N885R191J147j153l40j1617P68J4230J2m403l82l737m674k114J3021
275E393Q081j3908l643M142o991J188J0152M621r576j1500P950O373m583J0085
289G784N128j3894p335O085R586k361o345N035o607j0464J2218Q646n909n072
303c505Q54L696m382m27J0297m680q227O092K732k037j305J868O000l700k410
318H66L573n101j557L525n83K379m105o381K094M036M376l85l997K064n280n457
334i933J3287O001r681o860L437N185n316L899J5196j0376j8048R519J1253m955
$$ plain form
230 9874 -242 -6387 -7314 -18694 -11673 9534 16123 8524 -5154 -7130 -1110 2540 15603 17681
244 17681 -387 -7230 -5253 629 9357 9288 6187 -4204 -14750 -7383 -1173 -677 3133 -4168 -12843
259 -12843 -10441 -4556 4635 5782 4629 4289 -7328 -6560 7670 7682 3279 2897 -840 -5514 -7628 5393
275 5393 13474 -434 -4077 65 -6926 -5738 4414 9035 -541 -12041 -4091 2282 -2301 7784
289 7784 12912 -982 -8317 -2232 7354 4993 -1352 3683 -2924 -13388 -1170 7476 1567 -3505
303 -3505 -2651 1045 -3337 -3764 6533 1853 -6374 -282 2450 413 -892 976 6976 3276 866
318 866 4439 -662 -2219 1306 723 3102 -1003 -7384 -5290 -1254 3122 2737 -1260 804 -4476 -9933
334 -9933 3354 9355 -326 -7186 -3749 1436 -3880 19 15215 4839 -13209 -3690 7563 2608
348B608o051P107K036j8702l57K2734k218j4292N641O553j0468q153J6276J0504
362A3218j8988m506J3836o804q409J3990J3861j1123j6713J0733R756j2454N400
375A797J5084j1842j8679N355J7753r42r436Q612j370k0326M631K0047P85j2925
389a456m651M037n700k226J9574O156j8038p530P075O139K84J814O039j1151j4260
404a3894R801J1907k11m415m165l42l517R57J1328J27q951l485j479L647L427
419G35Q58M356m290p552K146N041M441j632l056J608p491n605J1288O714n421
434B140m734M15R33m337L723J2329m892j1304J204L613J468Q46M100J723j1191
449c964k462J1600O04m780J669j41p132n633J1503Q380j3498m617R705j986n236
$$ plain form
348 2608 -3443 3664 5700 -13002 -13359 9375 7157 -7135 -1494 5059 -5409 -13562 2714 13218
362 13218 -5770 -10276 3560 -3244 -11653 2337 16198 5075 -11638 -905 8851 -3603 1797
375 1797 16881 5039 -13640 -8285 9468 8526 -910 7702 6332 -13994 -9363 10684 11469 -1456
389 -1456 -6107 -2070 -7770 -9996 9578 15734 -2304 -9834 -2759 3380 3664 5478 11517 366 -13894
404 -13894 -4093 7814 7603 3188 -977 -1319 -4836 -3879 7449 7576 -1375 -4860 -6339 -2692 735
419 735 1593 5949 1659 -5893 -3747 1294 5735 4103 1047 2655 -4836 -10441 847 7561 2140
434 2140 -2594 -2179 -1246 -5583 -1860 10469 5577 -5727 -4523 -910 558 1404 5504 7227 -3964
449 -3964 -6426 5174 5778 998 2667 2526 -4606 -10239 1264 9644 -3854 -8471 1234 -752 -5988
464e988O269Q159n974j1806O625Q670o806q91N871q43m052j799M680R40o482L851
480D24M211p770l906J868K158j208m33O723l669j0490O011P904j594j143K50n59
496a223l721J59R321Q35n169r04p87K099L089m58J650m385o546M291M504l42j476
513I37j026J05m392L94R861J0n861M50j527r72M20K150O111k269n887j331L67
530b460M261K640j25P68p169n325N005L393J456J667m769n882J67P265N197n591
546D98j811O04n950J866P606K248l280p630q14O737K582J972M02m012m436l308
562f726O474Q940l008m366k447m524L453P084L521k237o278j987l03J690P240
577F526p2o334q63j447J267M440n07p0j911k568K51J71K412N94l931P82r52k273
$$ plain form
464 -5988 281 8440 2466 -9340 -2715 5955 -851 -1742 4129 3286 -766 -2565 2115 3055 -3427 424
480 424 4635 -3135 -7041 -5173 -3015 -4223 -4656 2067 -1602 -12092 -6081 1823 229 -914 -664 -1223
496 -1223 -4944 -4785 4536 5371 202 -702 -1489 610 3699 3241 4891 506 -6040 -1749 2755 2413 937
513 937 -89 16 -4376 -3982 5879 5889 28 478 -1049 -2021 -1601 549 6660 4391 -1496 -2827 -2460
530 -2460 1801 4441 4316 5084 -2085 -7410 -2405 988 2444 4111 -658 -6540 -6373 892 6089 498
546 498 -1313 -709 -6659 -4793 2813 5061 1781 -5849 -6663 74 2656 4628 5030 1018 -3418 -6726
562 -6726 -252 8688 5680 1314 -1133 -5657 -2204 4880 8401 6164 -114 -2101 -2404 -714 6526
577 6526 6454 120 -743 -2190 -923 3517 3010 2940 1029 -1539 -1288 -1117 1295 1889 -2042 -1260 -2212 -4485
595d485M754K633k083q06k568q69J804L588L201l620n228Q1P3N129M454l216k032
612H10l255l445M266M232P18l806n218J337J010J615M377j877k574J327j579K284
628B22K600j560j092l28J700J312k501J392P62k139K309j358k328J537j036r49
644a457J158j803j111l86J606L950k126j463p9k777L898K965r61K51k388k778
660c501J687L133K974m85l258j57l050O26M493n91q26j334l984O67K896J767Q89
677A946k403j033m91m42M235J17k078K75k309O1L522N82N8n05k289K82r94K714
695A248K308k425q53k283k300L590L329O86m7m504k497Q19L335M620j338m480
711g92k523k467L829O155n79j710m066k726L201L385K076r36n004j574J04L375
$$ plain form
595 -4485 269 2902 819 13 -2555 -3424 -1620 1968 5169 1549 -3679 -3598 -3525 1604 6058 2842 810
612 810 -2445 -5890 -1624 2608 3326 -480 -5698 -4361 -3351 -1736 2641 764 -1810 -483 -2062 222
628 222 2822 1262 170 -158 1542 2854 353 1745 2507 368 2677 1319 -1009 528 -508 -1457
644 -1457 -299 -2102 -3213 -3599 -1993 1957 -169 -1632 -1711 -4488 -590 2375 1414 1665 -723 -3501
660 -3501 -1814 1319 4293 3808 550 393 -2657 -2031 2462 1871 1045 -289 -4273 -3606 -710 1057 1946
677 1946 -457 -1490 -1981 -2423 1812 1929 -149 126 -2183 -2122 1400 1982 2040 1535 -754 -472 -1466 1248
695 1248 3556 1131 278 -2005 -4305 -715 2614 3300 3253 -1251 -3748 -2929 406 5026 3688 -792
711 -792 -3315 -5782 -1953 4202 3623 1913 -2153 -4879 -1678 1707 3783 2847 -2157 -3731 -3627 -252
727b52M875j616l466r00j563K720L808Rj332m381j175K558R21K631R4l684p26
744a479q51J124L725l29j317j105l127N70J599J751J919k347j493m49j169L556
760E78L064j438j967k538m16K940J217J924j351m391J31J018K200K445k855j810
776a249j434j463L402J864n93j225k402N12J687R73K678j173l325P60L84J450
792H46J505o53M26j590j238L103k09q83Q93q55l53j479r45K095o17o77J893k013
810g51j212M67R15K934j250j695M4j916R73L746L06q21k877p59K226O51J802N32
828C315m032j730Q05J315K313j441n79q05k764J827K814N3pk150j109J004p71
845a942K708J450k525o39o85O00K239N62P80o32l389N16R89P96K081r88j324k041
$$ plain form
727 -252 4623 3007 -459 -1359 -2922 -202 3606 3615 2283 -2098 -3273 -715 206 2837 2931 -753 -1479
744 -1479 -2330 -1206 2519 2190 873 -232 -3359 -2789 -1190 561 2480 133 -1360 -1809 -2978 578
760 578 3642 2204 237 -2301 -2717 223 1440 3364 2013 -2378 -2247 -1229 971 3416 561 -1249
776 -1249 -2683 -4146 -744 1120 527 -698 -3100 -2588 -901 72 2750 1577 -1748 -988 -604 846
792 846 2351 1698 2124 534 -704 2399 2190 1307 2200 1345 992 -487 -1432 663 46 -631 1262 -751
810 -751 -1963 -1496 -581 2353 1103 -592 -548 -2464 -1491 2255 2561 1740 -1137 -1896 330 981 2783 3315
828 3315 -717 -2447 -1642 -327 1986 545 -34 -839 -3603 -1776 1038 1091 1084 -1066 -2175 -1171 -1942
845 -1942 766 2216 -309 -948 -1633 -1033 1206 1768 2548 1916 -1473 -957 32 828 2909 1921 597 -1444
863a444j377L706K627p65r62l097j291Q76J637L887j381m957j082R95K640K988
879C000j027j555l172j909M236K674n68p75l139j315J164K860L746k358l959N32
895a565p56J149K670M71j325l918r68L557Q38M78R52k618j200j52J360K551j037
912D87r18O1k276O15K795J135j74j556p05O53j771K681K873k343k090j224N95
929a162K254Q27J090j024l828J8J335J521K274k639k549n79J06K874J397j249
945F66q16j307m18J827L33J433j182k617J208R71j39J295r30K20j36j445J344
962C07N80l50j63j576P28L05j910K072J236j313p4q08o21R32Q15J706j338j624
980a096L51n64P86L316j79j079j263j467K262Q69L59L87k351r19N9Q33K549j015
$$ plain form
863 -1444 -2821 885 3512 2747 1785 -1312 -2603 -1727 -90 3797 2416 -2541 -3623 -2628 12 3000
879 3000 1973 418 -2754 -4663 -427 2247 1679 904 -2235 -3550 -2386 474 4220 1862 -2097 -1565
895 -1565 -2321 -1172 1498 1969 644 -3274 -4242 -685 153 631 1583 -1035 -2235 -2387 -1027 1524 487
912 487 -431 -370 -2646 -2031 764 1899 1725 169 -536 117 -1654 1027 3900 1557 -533 -1757 -1162
929 -1162 1092 1919 3009 1985 -1843 -1825 -490 1031 3305 666 -1883 -2462 -2356 518 1915 666
945 666 -150 -1457 -1875 -48 285 1718 536 -2081 -873 98 -41 1254 324 544 408 -1037 307
962 307 887 537 374 -1202 -474 -169 -2079 -7 1229 -84 -158 -966 -1587 -655 160 1866 528 -1096
980 -1096 -745 -1309 -523 2793 2614 1535 272 -1195 1067 1936 2295 2682 331 -588 -529 304 2853 1838
998A838j843L06j913Q97K657p60j550q86n73P51J51K051P12l448N50N04J07J783
1016A334q1q53o20j417M67J083R99J640j918j587J14j539K079K025o99l89k153
1033a515k776K225L197J075j366k635L0k56J333L928j186l082j145K6K727K064
1049B644o17j555k448P62K164M88J447j405l819P55M74J141K342j626j341q06
1065a400n32J339P82J105M60l140n62R07q34K562J063j572k89j707K97J969O42
1082A090M62j400j513R69r55J921J492k426r14J045o83J191J098K3j801k222J814
1099h09J233j96J578j644k160O46K08J756J354j071j054j059p46J856R07J131
1115A930j311j955J394j96p34K903j74j979p0M06L79j178K72J804j782n38J279
$$ plain form
998 1838 -5 301 -1612 -715 1942 1182 -368 -1254 -1827 -1076 -925 1126 1838 -1610 -1060 -556 -449 1334
1016 1334 1253 400 -220 -1637 -1170 -87 912 2552 634 -953 -839 -2378 -299 1726 1027 638 -1515
1033 -1515 -4291 -2066 1131 2206 840 -1795 -1765 -2021 -688 3240 2054 -1028 -2173 -2147 580 2644
1049 2644 2027 472 -1976 -1214 950 1438 2885 1480 -2339 -1584 -1110 31 2373 747 -594 -1400
1065 -1400 -1932 -593 189 1294 1754 -1386 -1948 -1041 -1875 687 1750 178 -111 -1818 -1521 448 1090
1082 1090 1552 152 -1361 -392 -1347 574 2066 -360 -1274 -229 -912 279 1377 1400 -401 -2623 -809
1099 -809 424 228 1806 162 -1998 -1352 -1144 612 1966 895 -159 -1218 -1964 -108 799 1930
1115 1930 619 -1336 58 -138 -872 2031 1857 -122 -192 214 593 -585 -313 1491 -291 -829 450
1132D50j098K38Q46p18P05o69j128O28L26J067N9j391L3k23J268K644k104j432
1150d99L83r29J097K160K81j642l097P06J930J80J498n95k594j30m69Q08K292
1167A380j267q64J58l14P3L6J376J335k138J94O54j785J081J815p82p15j320R02
1185a81P42m03J169n89k011K0k99J976J116j895k25j017j098K472K249k37j740
1202D9k037Q13L20Q25L428j796k941o4N01J593J405l09m46k252p34K255R86r8
1220A498n72k094M31P6L45K147q51j476l00m81J296N78M00m8k297k27J509l16
1238c82J117O96j544o87m36L55J963k32j14q25j425P52J96J245J803k101j270
1255h89n0j69J752N62k93o79k059QK031J41J020p92k028N69K50J406O36j411m47
$$ plain form
1132 450 -648 -410 436 -282 423 -246 -1374 -746 -420 647 706 -685 -652 -875 393 3037 933 -499
1150 -499 -116 -1045 52 2212 2493 851 -2246 -1540 390 570 2068 1473 -1121 -1251 -1720 -912 1380
1167 1380 113 -751 -593 -907 -834 -798 578 1913 -225 -31 623 -1162 -81 1734 952 237 -1083 -181
1185 -181 561 158 1327 738 -1273 -1253 -1552 424 1540 -355 -580 -1597 -2695 -223 2026 1789 49
1202 49 -1988 -1175 -855 -30 3398 1602 -1339 -1403 -902 691 2096 1787 1341 -911 -1645 610 1596 1498
1220 1498 926 -1168 -737 -661 -316 1831 980 -496 -796 -1277 19 597 997 949 -1348 -1575 -66 -382
1238 -382 735 1431 -113 -800 -1236 -881 1082 850 736 -89 -1514 -762 -566 679 2482 381 -889
1255 -889 -939 -1108 644 1206 913 234 -1825 -1817 214 355 1375 583 -1445 -876 -626 780 1416 5 -442
1274d42l24j22J679N71p0o15j301R60J145j305J163K93j800J17l16P83K39q54
1292a99J148j007j267O85N3J61P34n98k08j038m50K048J46K22Q7j219l53Q14M94
1311B53J543j186j276N3n57J166J144l83p41j735%J699L84m5k94j431l34O96O93
1330c51J368r72l73j47k20R09Q97K1K26r38p37P67k10R07L81r44m9j016j64J502
1350H57p0L02p69j890L93P61Q99J007j439p40m03n88J926J036l20q50j787J54
1368a521J453L76J206q72k184R2M93J451J242j533o17r23m11K016O04k61m64j530
1386a383N21O09Q28P36l99j899M18j12R65P05l15J32j329n32J395K55P30K64j307
1405B82m45n30N18J384j14k47j62j565M84J160nQ64j331j072j01N5J786N56j442
$$ plain form
1274 -442 -766 -888 791 1362 1292 677 -624 336 1481 176 1339 1632 -168 -51 -367 416 655 -199
1292 -199 949 -58 -1325 -640 -587 -426 308 -290 -498 -1536 -1986 62 208 430 517 -702 -1055 -241 253
1311 253 1796 610 -666 -613 -1170 -4 1140 757 16 -1719 -1719 -20 364 319 25 -1406 -1740 -1044 -351
1330 -351 1017 45 -328 -475 -695 214 1111 1132 1358 420 -317 450 240 1147 1528 584 535 -481 -645 857
1350 857 787 1089 320 -1570 -1177 -416 483 1490 51 -689 -1092 -1680 246 1282 962 112 -1675 -1521
1368 -1521 -68 308 1514 642 -1542 -1450 -957 494 1736 203 -414 -1337 -1748 268 872 611 147 -1383
1386 -1383 -862 -253 575 1311 912 -987 -569 -681 284 989 674 806 -523 -1055 340 595 1325 1589 282
1405 282 -163 -693 -175 1209 1095 848 686 -879 -395 765 760 1624 293 -779 -880 -825 961 1517 75
1424G5m70j026K47J153N84K22j034j864Q90J017M69O46j129p20J40K37J372Q6
1442H95o75J10r68L40R50n48K05k5o56P55j148N26M84k90N9ko79N81n83L41J154
1463H26j222l27J09n4J133L92l02k24n11l09R07M32Q83q71j676O08m7O39J088
1482A474p89r65o09l34J156q8K08O5j592J99J019k54J279n52p12J27r6L22O95
1501E53p2K37r09o83J098j25N07N44j359l53K72j85O00M92mj158r99Q73R78j5
1521B92Q41o32j203q0l40J519R74l50j211r66L52R52M13J246p19k083K55N58P80
1540E98J089j093j335m25O79J140J31K6p29j546N26J337J41K45n50j531P99M41
1558e7K27N12n15mo49k05R53j29K24J111j242r39J79N5J114L86J71p64j360K31
$$ plain form
1424 75 -395 -1421 -1174 -21 563 785 -249 -2113 -1223 -206 263 909 -220 -940 -800 -563 809 895
1442 895 220 330 -638 -298 652 104 309 284 -372 383 -765 -239 245 -45 14 12 -667 -86 -669 -328 826
1463 826 -396 -723 -614 -668 465 857 555 331 -180 -489 418 850 1733 862 -814 -206 -253 386 1474
1482 1474 685 -280 -889 -1223 -67 -155 53 118 -1474 -1275 -256 -510 769 217 -495 -368 -464 -142 553
1501 553 481 718 -191 -874 224 99 606 1150 -209 -562 -290 -475 125 617 613 -545 -1544 -671 307 292
1521 292 1133 501 -702 -782 -1122 397 1371 1021 -190 -1156 -804 148 561 1807 1088 -995 -740 -182 598
1540 598 1687 594 -741 -1166 -487 653 784 810 81 -1465 -939 398 539 784 234 -1297 -498 -57
1558 -57 170 682 167 163 -486 -691 262 133 357 1468 226 -713 -534 -479 635 1021 1192 428 -932 -701
1578g01Q90J89R77j070j988J152J02P99Q28j121m76p96O31J221k21p1p12r27J216
1597g8P19n56Q08p46q94J75M95R70j66o01n8n89k17J151n55N32N20j387l18P79
1617a6m26O66K53j15l49r30O32Q5K01J000j128m26N90j6J57N13l74l01l87J49
1637b22P84n3L23n41r23L03M23P7J065p83r89m41J85Q71J61K39n71j640P76J170
1657B14k7O19n63j319K62O74J46N08l91O09q25n74J056m50J84Q70j132q4k6l79
1677f28P43L57k2l98j143O28P37j41O12p07j133O00L32N79Q50q52p22p19O06J449
1697A028O7J54j073j153Q84N14O15K88j082q09j03K16R63Kk26l09j233L11J016
1716G0k52J33J61j235M34L44Q2O46p7k24l65l42Q32K05m24O51q89m98P64J44L56
$$ plain form
1578 -701 189 378 1355 285 -1703 -551 -449 350 1178 57 -419 -1215 -584 637 416 345 -367 -1294 -78
1597 -78 641 85 893 147 -747 -572 -77 893 727 126 68 -521 -738 413 -142 390 910 -477 -795 -16
1617 -16 -442 224 477 362 13 -917 -285 -200 1 1001 -127 -553 37 21 178 691 317 16 -371 -222
1637 -222 562 509 832 291 -632 -329 94 171 1236 453 -536 -977 -792 79 240 479 -92 -1732 -956 214
1657 214 187 806 243 -1076 -814 -140 6 514 123 732 -93 -667 389 -61 123 993 -139 -223 -249 -628
1677 -628 115 472 450 52 -1091 -463 274 133 745 38 -1095 -495 -163 416 1266 414 -308 -1027 -421 1028
1697 1028 1095 1249 176 -977 -93 421 1036 1324 242 -567 -670 -454 509 511 285 -24 -1257 -946 70
1716 70 -182 -49 112 -1123 -689 -345 -263 383 306 82 -283 -625 207 412 -12 639 -250 -748 16 160 516
1737E16J50j032l36k8L56Q32k47J99o88j176J020M86L56M21o71q03K9J34J028
1756E46L41l95r7j027K96Q94m2M18m23j020N27K35n3M28q84q2j7j42P81O2n04
1777a58p4k41L24K54j98O2n1K7k70j89K30N64j42J77m05m47L83l8M98L31o98k06
1799b67o00L68Q17N6K76n92r23O39K42K75N45n87q16k3K60J066r1l98j51l00K7
1820a77N99J14n2J12r79P88J15m4M74p56J35p1o17O92L15j18K1p52l52J58R4J84
1842a17P87o80k17p12q6R25J87J17o34l80K31pJ029K28p68j83j52j78J144K90
1862H24k30m03p34J67J001J18K75p25j193M51L39M72L62p75k99m23K00J147o44
1881g0R4N6o23K25M40K25rj31n25L86j89N94L88p12L68m75o29N04J08M42J74n58
$$ plain form
1737 516 666 -366 -702 -730 -374 458 211 410 -278 -1454 -434 52 408 829 158 -645 -616 -482 546
1756 546 887 492 395 -632 -336 558 516 934 511 -509 18 253 200 628 -256 -338 -355 -497 284 346 -158
1777 -158 -232 -473 -149 105 -93 -31 -82 -55 -325 -514 -284 280 138 315 -90 -537 -154 -192 306 637 -61 -267
1799 -267 -867 -499 318 374 650 58 -865 -226 16 291 836 249 -567 -590 -330 736 645 247 96 -204 -177
1820 -177 422 536 484 596 -383 405 520 476 950 194 329 258 -359 333 648 530 551 -201 -553 -395 -301 -117
1842 -117 670 -10 -227 -939 -1025 -100 87 204 -430 -810 -579 -586 443 671 -97 -280 -432 -610 534 824
1862 824 594 191 -543 -376 625 743 1018 293 -900 -449 -110 362 724 -51 -350 -773 -573 574 -70
1881 -70 24 80 -543 -318 122 347 338 207 -318 68 -121 473 861 149 517 42 -587 -83 25 467 641 83
1903H3n43j52J06O30j2L0o76n95N51O59L2J39o77m05M96L8J041j76m08m7m84J93
1925a77Q52K4j81n99m16N20JoP81p97k20o7k12Q94l17j34R7k92j14K98j15M21
1947B41J08l06J38o74O50J89j5K51l43n89K99j38N83rm32l37J59j2O73j14k88
1968C4m02l27N41J85K4L50m75n94M22P5O24L04q40k32J32j75J131l13n1O0r56
1989d83L92L02r7R7j79o6J85o14L80M11n71M78j22m32L34j07N71Kn69l91j34L74
2011b39O30k06P8m73p04O56L36L71J41q56n19L36M39J038k94n25k99q25P76O76
2031E37M9L0j41r09J92K76K28J61o82j71j56K94N72j10k93n5l40o5R00l7J83k39
2053B24m60J49J00P35k03m40L53n64l73N54J28J97j40l49k99k36nR36j50j08k90
$$ plain form
1903 83 -460 -612 -506 124 112 142 -534 -1129 -578 81 113 252 -425 -830 -334 -296 745 569 161 114 -370 -177
1925 -177 675 699 518 -81 -497 23 24 18 799 2 -218 -285 -497 397 80 -54 43 -249 -363 -65 -180 241
1947 241 349 43 181 -493 157 346 331 582 239 -350 -51 -189 394 385 -47 -384 -225 -237 436 322 34
1968 34 -368 -695 -154 31 55 405 -70 -664 -242 -167 457 761 -79 -311 -179 -354 777 464 413 473 -483
1989 -483 -91 211 114 211 32 -34 151 -463 -83 328 -243 235 113 -319 15 -92 479 481 -88 -479 -613 -239
2011 -239 391 185 263 -210 -914 -258 78 449 590 -266 -785 -449 -10 1028 734 209 -90 -915 -139 537
2031 537 586 616 475 -434 -242 34 262 423 -259 -430 -586 -292 280 170 -123 -178 -518 -583 317 280 463 224
2053 224 -236 -87 13 748 545 105 458 -106 -479 75 203 400 260 -89 -388 -624 -629 307 157 49 -241
2074b41j056P67P35J70m5k28o49J91L22N67J81n20k6k85K63Q78n76m84L22q00
2094e14N15L79n2n4p48J19J88R7K87m06k24M59l06K3N59p1mP2J57k97n65N96M43
2117F53l57K39k85q98L14M29K70L13p39l44p0L40J10K4k0o8o66O24N82p20J80
2138h9m04r8N47L30pk22n78M28j7j86O91k15l67K88o60M41J57j4M42l79j37j08
2160a57m03O90L66m75M77o02m88N87K86L9%o4l45l29M49K61j48Q8k77k86J31O74
2182D74m43K69k05n75K48J02J003n28o62J94n12P76N41k22l27l28q66N11O23L2
2202A05m8m95l58J83k12R40J55m45J55l71J48M65o3k5L78p01O63n23K13L91m22
2223A33J01n4m63O17k0o01N53n63k93J23Q1O86j28m09j31k66L68Q74k77j34l64
$$ plain form
2074 -241 -1297 -530 205 375 330 102 -547 -356 -34 533 714 194 168 -117 146 1024 448 -36 286 -514
2094 -514 1 380 328 274 -474 -355 -167 -70 217 -189 -413 46 -260 -237 322 251 247 319 476 179 -386 210 653
2117 653 296 535 250 -648 -334 95 365 678 -61 -405 -475 -135 -25 -1 -21 -89 -755 -131 451 -269 -89
2138 -89 -493 -591 -44 286 279 57 -521 -93 -110 -296 395 180 -187 101 -559 -118 39 25 467 88 -49 -157
2160 -157 -560 130 496 21 498 -104 -592 -5 281 320 320 256 -89 -418 31 292 144 232 -45 -331 -200 474
2182 474 31 300 95 -480 -232 -130 873 345 -317 -123 -635 141 682 460 133 -195 -1061 -550 73 105
2202 105 57 -438 -796 -613 -825 115 270 -175 -20 -391 -243 222 159 134 512 -189 474 -49 164 555 133
2223 133 234 180 -283 334 314 -287 266 -297 -590 -467 -386 300 172 -237 -368 -634 -266 608 331 197 -167
2244a67l89O53L64J33M2p02K22n09K82N79l15j18k52l16K62L60j78Q9k96o1N4
2265b63n7Q1L05k73J77k83J29M91l87L1L36l02K09m89Q1M92j43j21J67k44K10
2286A47N8k19K30n97k3M02j73Q20l70n49M05m61L31O36n14L68l82k71M08N6q7
2307B15m1o4j29q6O3K19n0l36J90l56K11N51j59l9j60m02N25m70M61%l55K52N1
2330I1m57N32K2k08J88o41L9M5n7O41P5m45l8j37K39N70k29O3l00m15L91K10M45
2353F24J46r57m6J41M16J98l46k53k3k89L60L13k68J03o19M7M41O5J86Q5n03J5
2375a64k7j0Q06n26j48R3j00J13j54K57j66J12k98L31l31L28k75L46m8m63O3p3
2397c34K71L74j61n16K57j10m2O25N8k57m8o57J025Q5k46J27p10K31n0K04L50
$$ plain form
2244 -167 -556 97 461 594 636 -66 156 -353 -71 508 193 75 -177 -493 -231 129 -49 40 -256 -317 -263
2265 -263 -320 -239 66 -207 -30 -313 -184 307 -80 -49 287 -15 194 -295 -214 278 135 14 181 -63 147
2286 147 205 -14 216 -381 -404 -2 -175 645 275 -274 131 -330 1 637 123 491 109 -162 246 302 215
2307 215 174 110 -19 -105 -42 177 127 -209 -19 -375 -164 387 228 189 29 -373 152 -318 143 143 -212 40 91
2330 91 -366 166 188 -20 168 -473 -434 -389 -446 195 270 -175 -213 -350 -111 459 230 293 -7 -422 -31 179 624
2353 624 770 -187 -233 -92 324 522 176 -77 -100 -389 -29 284 16 119 -500 -453 -12 53 239 324 -179 -164
2375 -164 -191 -201 605 79 -69 24 -76 37 -117 140 -26 86 -212 119 -212 116 -159 187 139 -324 -261 -334
2397 -334 -63 311 150 -366 -109 -219 -261 364 422 165 117 -540 485 570 324 451 -259 -28 -78 126 476
2418D76j12l61O9l14R1M56l97O9m81j1K47L03j01K66l35n5J27k04L62ll24N35
2440C03l38K02n1j94N31L2l19j07l04M93j53NJ21n71K7L91k18K67L32o39j16m2
2462c48J96O23j10l83k28R7O4K64o5J37m20k67M01J42L08j87l23K15r5J9j5J74
2484A99j34k8k75J33k21K05k4R2O1k47k48M70J9n6J2p9N4O0Np9K01r5p5j62K60
2509D8O56o37K12l30l81O74k09L54l7p60K24J5L1L70K1n88M5k66O06K90k92p8
2531c2L3r0N6J28OJ0j30K10j19q4J64j9j61J38m85L45n8o8L48o19n6M34m26N18
2555D3J92m34J60l74k26M18L16k9j17l41J42J15J19N40j95m53J90o10M78N36l00
2576A70j6j35R1pk45N69j30o56O06l91J1O43j39k85R1l34K50J6r4P1o47L41J37
$$ plain form
2418 476 364 3 72 -242 -151 305 -92 -23 -504 -515 -268 35 -66 200 -135 -190 -63 -267 95 92 -232 303
2440 303 -35 167 116 -78 453 485 166 59 -245 248 95 100 221 -350 -323 68 -150 117 449 -190 -306 -348
2462 -348 -152 471 361 -22 -250 -153 -89 175 110 247 -173 -440 -39 103 411 224 -99 116 21 40 25 199
2484 199 65 37 -238 -105 -326 -121 -145 -53 8 -239 -487 -17 2 -54 -42 -121 -67 -7 -2 -81 120 25 -50 -212 48
2509 48 704 67 279 -51 -432 242 33 387 350 -410 -186 -171 -140 230 251 -337 -292 -558 48 338 46 -32
2531 -32 1 -89 -33 95 101 111 -19 191 72 -12 152 133 -28 110 -375 -30 -88 -156 192 -427 -483 -49 -475 43
2555 43 235 -199 -39 -413 -639 -221 95 66 -51 -392 -250 -135 -16 524 329 -124 66 -544 -66 470 170
2576 170 154 19 110 103 -142 427 297 -359 247 -144 -133 510 371 86 177 -157 93 109 15 86 -561 -220 -83
2599h3K4L95k54k96J28J52o5L96l99K91j40l75M44l66K47M25n59Q7j22n02M31
2620a41N8L19j73m58K60j84P1P34m92j42l9n3Q9O07k19j65l6J01J82j38L08j81
2642C08m08M46l0k25M10k25p33L06k39J25L42n5J63m13K7k6L0L22Q8j60k6J6k50
2665b07L56O1K4L14n82L03m42j04P40m21j97J06l13P0O08j88j32k94J67J46j24
2686a09J97j73j99K91p5K3N66m90p0O5l60M64j25J17L13p72L30J06k13L88K30
2707E04m28k04m8J04L18j35R9k09j41K36j8nK27l36J60N3m70L02J09J55j90k44
2729a61O6P3K47J82l2n76J4R7K24M9n7J59o01j1N04m4K36m21j82j1J37OL13m47
2753b36j22J67n3M59m16K6M02l60R3R2k31L66k46J59K84k65j47L13j89J10j06
$$ plain form
2599 -83 -59 336 82 -214 -86 66 1 397 -2 289 149 -226 218 -148 99 524 -35 52 -70 -572 -141
2620 -141 -83 236 63 -395 -135 -319 -248 486 -6 -148 -187 -240 -151 456 237 72 36 137 319 181 489 308
2642 308 -100 346 316 91 501 276 -457 -151 -390 -265 77 22 185 -228 -201 -227 -197 125 213 53 27 43 -207
2665 -207 149 210 234 548 -34 269 -173 -277 463 42 -155 -49 -362 -292 316 128 -4 -298 -131 15 -109
2686 -109 88 -85 -284 7 -68 -45 521 31 -39 26 -334 130 5 122 435 -337 -7 99 -114 274 504
2707 504 76 -128 -176 -72 246 111 210 1 -140 96 78 73 300 -36 124 177 -293 9 118 273 83 -161
2729 -161 -95 -22 225 407 375 -201 -187 -90 134 183 126 285 -316 -327 177 133 369 -52 -234 -245 -108 -102 211 -236
2753 -236 -358 -191 -244 215 -201 -175 227 -133 -40 52 -179 187 -59 100 384 119 -28 285 96 206 100
2774A00l81K12q6M71P3l38j78n7J18J32M8o8j83k65K22q9J25O76n35k85L71j60
2796g7J82K48j44k39R7k98K78J10l64L44j20o3k27K88Q0k17J26J15l91J67K0k79
2818c64N98m10k21M24j27q9K99Q7k20R5P4j14L7n6M20o92L99l53L1L31p9j42K9
2841d3l18M24J95j87o3m74L86M5J15j43L38m55L16l80M40K65m34l8k6j92J81J97
2863A49k6j50l6J77p6j93M30J94l63k24o4J47N3n5J81m2l73N4K48j53J28k48K64
2886B2k9k25L54P1j69n4k69J36L65p4J45k70j06J12O5L4j7O8pm27j81O05J87o08
2910b72K15k51N4N5P9QJ38q1J18j34L24k2k55J5pQ3K35k63J15J23k03J45k64r2
2934a37K79jj71L34m14J01j08N2K63o32J90m6j30O29M8k98J83m86L00P8K4J84
$$ plain form
2774 100 -281 -69 -155 316 389 51 -127 -184 -66 66 114 46 -137 -402 -180 -269 -144 532 -3 -288 83 -77
2796 -77 105 353 209 -30 67 -231 47 157 -207 137 17 -46 -273 15 95 -122 4 119 -272 -105 -85 -364
2818 -364 234 -176 -397 27 -100 -189 110 197 -23 72 146 32 69 13 433 -259 140 -213 -182 149 70 -72 -43
2841 -43 -361 63 258 71 8 -466 -80 -35 80 -63 275 -180 136 -244 196 461 27 -11 -37 -229 -48 149
2863 149 123 -27 -63 114 38 -155 275 469 106 -118 -182 -35 18 -37 144 102 -271 -217 31 -122 6 -242 22
2886 22 -7 -232 122 193 24 -30 -299 -163 202 128 273 3 -103 9 74 108 91 159 152 -275 -456 149 336 -272
2910 -272 -57 -308 -254 -199 -120 -112 26 -55 63 -71 253 231 -24 -9 -16 67 302 39 154 277 74 219 -45 -137
2934 -137 142 141 -30 304 -110 -9 -117 -65 198 -434 -244 -290 -420 209 257 -41 142 -344 -44 34 58 242
2956B42p3l32kK55L30j51k34p3M2j79L54M3j86r5j07l1J08J51Nk9j97N6J17j68
2980a54J44JL8k99L11l5m1J25J09l31J46mk01K99n3j50K76j48M7j05J15p7J68
3003A81m27L78l79Q5K61r2k16l25M20J6k65L05Q2m24K26J45j73M95j42l50L72
3024A73n31L82K62j37J66l37j6K96k90k0J47l17P2N7j9o6j26M47l02o7J23K18
3046A15j20J42l12L07O9j84l1jJ65j23q2k1K93M0j15M3l70K48K8P4M03l52j42
3069G4k70K78lP1j34O4k97J69J32m01N22j86n9L83l59pN3K51p3J6l82K52j85O2
3093b9L11n81M4M95n04N21j32l44j7J59L14l62J02K29n68R2L30l52L93q7J18m16
3115b84M7J94L8q3J73k4k71J32J67j42K61J06l59L63l01K71j31q0K27o21K92J25
$$ plain form
2956 242 169 -163 -165 90 420 269 35 -38 4 -175 179 222 36 -59 -166 -197 -89 62 67 38 -159 -103 14 -154
2980 -154 -10 -9 29 -270 41 6 -35 90 199 -132 14 10 -191 108 55 -95 181 33 80 -25 90 13 181
3003 181 -246 132 -247 -162 99 7 -209 -534 -114 -98 -363 -58 24 -400 -174 -29 -202 293 151 -199 173
3024 173 -358 24 286 149 315 -22 -38 258 -32 -52 95 -222 -150 -93 -112 -178 -304 143 -159 -226 -103 115
3046 115 -5 137 -175 132 201 17 -14 -15 150 27 -55 -76 217 257 142 185 -185 63 91 165 568 216 74
3069 74 -196 82 79 150 16 80 -217 -48 84 -317 205 19 -40 343 -16 -23 30 281 208 224 -158 94 -91 -29
3093 -29 282 -299 -255 240 -264 257 125 -219 -236 -77 237 -125 -23 206 -362 -270 60 -292 101 14 132 -284
3115 -284 -237 -43 -5 -88 85 61 -210 -78 89 -53 208 314 -45 318 17 288 157 77 304 -317 -25 100
3137A00J44l25J46k19N7K20j44j90K46p2k81j09O62k91Q8K96n53J31J21k85L75
3158A17j45J76J1l09j57L01J55L27o21M1p3p8rL06J16l53L08m76N90l89K29j59
3180i2l1J24L14l99L27n82J13J54J02K14Jj80J64l44J13n5lj0J99n81N11o5j71
3203a77J77K24j96r2j79j34L48J2N73o37j04J57l8K10J16k13ql4j16J92j73L02
3225B10k84l67O54k19k11M66k82k32N27k81J28n2O5r3k62K8J67oJ88n2k55m2J10
3248i5J38K79m91J52N2R3J23j78k4J96l93L81k28j57L06p5J3J00l00J34l5j7J63
3271A37k75R6K18k10j07M13k08k11k61J65M86N6j59o1l91N87%k68M58m88j55K05
3293B7j74K45J45m36J91j85pL26k06kj14L8J51l36K84O6j35J38J05N8k34QJ9N7
$$ plain form
3137 100 244 -81 65 -154 -97 123 -21 -211 35 -37 -318 -427 235 -56 32 328 -225 -94 27 -258 117
3158 117 -28 148 159 -150 -307 -6 149 476 -145 -104 -177 -255 -264 42 158 -195 113 -363 227 -162 67 -92
3180 -92 -123 1 315 -84 243 -339 -226 -72 30 244 245 65 229 -115 -2 -57 -60 -70 129 -452 59 -6 -177
3203 -177 0 224 28 -64 -243 -377 -29 -17 556 -81 -185 -28 -66 144 260 47 39 5 -111 81 -92 210
3225 210 -74 -441 213 -6 -217 249 -33 -265 262 -19 109 57 122 29 -233 -205 -38 -44 144 92 -163 -205 -95
3248 -95 43 322 -169 -17 35 128 251 73 49 245 -148 233 5 -152 154 79 92 192 -108 26 -9 -26 137
3271 137 -138 -42 176 -34 -141 272 64 -147 -408 -243 243 299 140 79 -312 275 275 7 465 -23 -178 27
3293 27 -147 98 243 -193 -2 -187 -194 132 -74 -76 -190 -152 -1 -337 -53 13 -122 16 121 179 -55 -47 -28 29
3317B9r2J1K48j96M6k51J49p1p2M37l72K38j48n3j34J75j1J50L5j02j44j87N7
3340b58L07J34k05P9l73L10M8m0L25n01P6M80k57M3L22n26j04K43k34n4J43k04
3362b46M04Jk61j82L55J71m46KJ66LO4R8L8k9m4j71J24q1m6K85j58j24j01M0p0
3387b08N42j52j53l11L91K97m70J46j4j59Q6l5Q4k1q9J20l53L08J2O0L2Q3k00
$$ plain form
3317 29 -63 -52 196 0 46 -205 -56 -127 -199 238 -134 104 -44 -97 -231 -56 -67 83 118 16 -128 -315 -258
3340 -258 49 183 -22 57 -316 -6 42 2 327 -174 -98 382 125 168 490 -36 -140 103 -131 -185 -42 -246
3362 -246 158 159 -102 -284 71 242 -204 -202 -36 -33 31 129 167 138 94 -77 47 -34 -80 205 47 -77 -178 -138 -208
3387 -208 334 182 29 -282 109 406 -64 82 68 -91 -5 -40 44 23 -66 54 -299 9 21 81 113 196 -4
$$ [...]
8191D2
##END NTUPLES=NMR FID
##END=
