##TITLE=1H_Ser Ac2O
 200.13MHz, ,
 8 sc
 
 3.2.2025
##JCAMPDX= 6.0         $$ Bruker NMR JCAMP-DX V2.0
##DATA TYPE= NMR FID
##DATA CLASS= NTUPLES
##ORIGIN= UXNMR, Bruker Analytische Messtechnik GmbH
##OWNER= pz
$$ XWIN-NMR		Version 3.5
$$ Mon Feb  3 19:14:26 2025 Russian Standard Time (UT+4h)  she@DPX200
##.OBSERVE FREQUENCY= 200.1313
##.OBSERVE NUCLEUS= ^1H
##.DELAY= (6, 6)
##.ACQUISITION MODE= SIMULTANEOUS
##.ACQUISITION SCHEME= undefined
##.AVERAGES= 8
##.DIGITISER RES= 18
##SPECTROMETER/DATA SYSTEM= spect
##.PULSE SEQUENCE= zg30
##.SOLVENT NAME= CDCl3
##.SHIFT REFERENCE= (INTERNAL, CDCl3, 0, 14.3821)
##AUDIT TRAIL= $$ (NUMBER, WHEN, WHO, WHERE, WHAT)
$$ ##TITLE= Audit trail, XWIN-NMR		Version 3.5
$$ ##JCAMPDX= 5.01
$$ ##ORIGIN= Bruker BioSpin GmbH
$$ ##OWNER= she
$$ F:/spectra/data/she/nmr/H-C/1/audita.txt
$$ ##AUDIT TRAIL=  $$ (NUMBER, WHEN, WHO, WHERE, WHAT)
(   1,<2025-02-03 19:12:44.03 +0400>,<she>,<DPX200>,
      <created by zg, POWCHK disabled, PULCHK disabled
       configuration hash MD5:
       00 E9 B6 7A A2 85 ED C7 34 08 36 98 17 FE 4E 26
       data hash MD5: 16K
       F5 25 97 55 8E 94 49 AC 3C BF B5 BC ED 5F FB BA>)
$$ ##END=
$$ 
$$ hash MD5
$$ 2C B4 94 EA 8E BA E9 E7 06 9D 2C D5 57 7C F2 BA
##$RELAX= 
##$RELAX= 
##$RELAX= 
##$RELAX= 
##$RELAX= 
##$RELAX= 
$$ Bruker specific parameters
$$ --------------------------
##$DU= <F:/spectra>
##$EXPNO= 1
##$NAME= <H-C>
##$PROCNO= 1
##$TYPE= <nmr>
##$USER= <she>
##$AMP= (0..31)
100 100 100 100 100 100 100 100 100 100 100 100 100 100 100 100 100 100 
100 100 100 100 100 100 100 100 100 100 100 100 100 100 
##$AQSEQ= 0
##$AQ_mod= 1
##$AUNM= <au_zg>
##$AUTOPOS= <>
##$BF1= 200.13
##$BF2= 200.13
##$BF3= 200.13
##$BF4= 200.13
##$BF5= 200.13
##$BF6= 200.13
##$BF7= 200.13
##$BF8= 200.13
##$BYTORDA= 1
##$CFDGTYP= 0
##$CFRGTYP= 5
##$CHEMSTR= <none>
##$CNST= (0..31)
1 1 145 1 1 1 1 1 1 1 1 1 1 1 1 1 1 1 1 1 1 1 1 1 1 1 1 1 1 1 1 1 
##$CPDPRG= <>
##$CPDPRG1= <>
##$CPDPRG2= <>
##$CPDPRG3= <>
##$CPDPRG4= <mlev>
##$CPDPRG5= <mlev>
##$CPDPRG6= <mlev>
##$CPDPRG7= <mlev>
##$CPDPRG8= <mlev>
##$CPDPRGB= <>
##$CPDPRGT= <>
##$D= (0..31)
0 0.7 0 0 0 0 0 0 0 0 0 0.03 0 0 0 0 0 0 0 0 0 0 0 0 0 0 0 0 0 0 0 0 
##$DATE= 1738595563
##$DBL= (0..7)
120 120 120 120 120 120 120 120 
##$DBP= (0..7)
150 150 150 150 150 150 150 150 
##$DBP07= 0
##$DBPNAM0= <>
##$DBPNAM1= <>
##$DBPNAM2= <>
##$DBPNAM3= <>
##$DBPNAM4= <>
##$DBPNAM5= <>
##$DBPNAM6= <>
##$DBPNAM7= <>
##$DBPOAL= (0..7)
0.5 0.5 0.5 0.5 0.5 0.5 0.5 0.5 
##$DBPOFFS= (0..7)
0 0 0 0 0 0 0 0 
##$DE= 6
##$DECBNUC= <off>
##$DECIM= 32
##$DECNUC= <off>
##$DECSTAT= 4
##$DIGMOD= 1
##$DIGTYP= 9
##$DL= (0..7)
0 120 120 120 120 120 120 120 
##$DP= (0..7)
150 150 150 150 150 150 150 150 
##$DP07= 0
##$DPNAME0= <>
##$DPNAME1= <>
##$DPNAME2= <>
##$DPNAME3= <>
##$DPNAME4= <>
##$DPNAME5= <>
##$DPNAME6= <>
##$DPNAME7= <>
##$DPOAL= (0..7)
0.5 0.5 0.5 0.5 0.5 0.5 0.5 0.5 
##$DPOFFS= (0..7)
0 0 0 0 0 0 0 0 
##$DQDMODE= 0
##$DR= 18
##$DS= 0
##$DSLIST= <SSSSSSSSSSSSSSS>
##$DSPFIRM= 0
$$ [...]
##$SUBNAM0= <"">
##$SUBNAM1= <"">
##$SUBNAM2= <"">
##$SUBNAM3= <"">
##$SUBNAM4= <"">
##$SUBNAM5= <"">
##$SUBNAM6= <"">
##$SUBNAM7= <"">
##$SUBNAM8= <"">
##$SUBNAM9= <"">
##$SW= 18.0517328524113
##$SWIBOX= (0..15)
0 0 2 0 0 0 0 0 0 0 0 0 0 0 0 0 
##$SW_h= 3612.71676300578
##$TD= 16384
##$TD0= 1
##$TE= 0
##$TE2= 300
##$TE3= 300
##$TEG= 300
##$TL= (0..7)
0 120 120 120 120 120 120 120 
##$TP= (0..7)
150 150 150 150 150 150 150 150 
##$TP07= 0
##$TPNAME0= <>
##$TPNAME1= <>
##$TPNAME2= <>
##$TPNAME3= <>
##$TPNAME4= <>
##$TPNAME5= <>
##$TPNAME6= <>
##$TPNAME7= <>
##$TPOAL= (0..7)
0.5 0.5 0.5 0.5 0.5 0.5 0.5 0.5 
##$TPOFFS= (0..7)
0 0 0 0 0 0 0 0 
##$TUNHIN= 0
##$TUNHOUT= 0
##$TUNXOUT= 0
##$USERA1= <user>
##$USERA2= <user>
##$USERA3= <user>
##$USERA4= <user>
##$USERA5= <user>
##$V9= 5
##$VALIST= <valist>
##$VCLIST= <CCCCCCCCCCCCCCC>
##$VD= 0
##$VDLIST= <DDDDDDDDDDDDDDD>
##$VPLIST= <PPPPPPPPPPPPPPP>
##$VTLIST= <TTTTTTTTTTTTTTT>
##$WBST= 1024
##$WBSW= 4
##$XGAIN= (0..3)
0 0 0 0 
##$XL= 0
##$YL= 0
##$YMAX_a= 673374
##$YMIN_a= -700696
##$ZGOPTNS= <>
##$ZL1= 120
##$ZL2= 120
##$ZL3= 120
##$ZL4= 120
##$ABSF1= 10
##$ABSF2= 0
##$ABSG= 5
##$ABSL= 3
##$ALPHA= 0
##$AQORDER= 0
##$ASSFAC= 0
##$ASSFACI= 0
##$ASSFACX= 0
##$ASSWID= 0
##$AUNMP= <proc_1d>
##$AZFE= 0.1
##$AZFW= 0.1
##$BCFW= 1
##$BC_mod= 2
##$BYTORDP= 1
##$COROFFS= 0
##$CY= -3
##$DATMOD= 1
##$DC= 2
##$DFILT= <>
##$DTYPP= 0
##$F1P= 0
##$F2P= 0
##$FCOR= 0.5
##$FTSIZE= 0
##$FT_mod= 4
##$GAMMA= 1
##$GB= 0.15
##$INTBC= 1
##$INTSCL= 1
##$ISEN= 128
##$LB= 0.25
##$LEV0= 0
##$LPBIN= 0
##$MAXI= 10000
##$MC2= 0
##$MEAN= 0
##$ME_mod= 0
##$MI= 1.114404
##$NCOEF= 0
##$NC_proc= 0
##$NLEV= 6
##$NOISF1= 3.799351
##$NOISF2= 2.8
##$NSP= 1
##$NTH_PI= 0
##$NZP= 0
##$OFFSET= 14.38212
##$PC= 1
##$PHC0= -19.17799
##$PHC1= 9.992222
##$PH_mod= 1
##$PKNL= yes
##$PPARMOD= 0
##$PSCAL= 0
##$PSIGN= 0
##$REVERSE= no
##$SF= 200.129724274929
##$SI= 16384
##$SIGF1= 3
##$SIGF2= 2
##$SINO= 400
##$SIOLD= 16384
##$SREGLST= <1H.CDCl3>
##$SSB= 0
##$STSI= 0
##$STSR= 0
##$SW_p= 3205.1282051282
##$SYMM= 0
##$S_DEV= 0
##$TDeff= 0
##$TDoff= 0
##$TI= <>
##$TILT= no
##$TM1= 0
##$TM2= 0
##$TOPLEV= 0
##$USERP1= <user>
##$USERP2= <user>
##$USERP3= <user>
##$USERP4= <user>
##$USERP5= <user>
##$WDW= 1
##$XDIM= 8192
##$YMAX_p= 0
##$YMIN_p= 0
$$ End of Bruker specific parameters
$$ ---------------------------------
##NTUPLES= NMR FID
##VAR_NAME=  TIME,          FID/REAL,        FID/IMAG
##SYMBOL=    X,             R,               I
##VAR_TYPE=  INDEPENDENT,   DEPENDENT,       DEPENDENT
##VAR_FORM=  AFFN,          ASDF,            ASDF
##VAR_DIM=   8192,          8192,            8192
##UNITS=     SECONDS,       ARBITRARY UNITS, ARBITRARY UNITS
##FACTOR=    0.0002768,     1,               1
##FIRST=     0,             0,               0
##LAST=      2.2672688,     0,               0
##MIN=       0,             -700696,         0
##MAX=       2.2672688,     673374,          0
$$ Real data points
##PAGE= N=1
##DATA TABLE= (X++(R..R)), XYDATA
$$ plain form
0 0 0 0 0 0 0 0 0 8 -8 8 -8 16 -16 24 -32 41 -50 64 -74 94 -113 137 -162 191 -222 259 -302 352 -405 466
30 466 -530 605 -687 781 -883 996 -1117 1250 -1399 1561 -1739 1934 -2148 2377 -2627 2903
46 2903 -3205 3535 -3896 4291 -4724 5202 -5734 6325 -6986 7729 -8570 9534 -10649 11961
60 11961 -13524 15424 -17794 20839 -24914 30672 -39461 54620 -87874 303997 -283392 -155245
72 -155245 673374 -599343 58103 436253 -657131 177414 300034 -700696 359554
81 359554 104908 -603132 497559 -5686 -446761 640045 -143831 -268584 638771 -303207
91 -303207 -147818 562074 -461117 -14962 425417 -563972 97967 275799 -602440 243482
101 243482 157745 -524893 407066 67700 -406658 518462 -55533 -290765 547093 -194229
$$ packed form
0@%%%%%%%Qj6J6j6K4l2M0n6P3r1J14j38J68k07K50k99L53m13M81n61O54p57Q71
30D66r96J135j292J468j664J879k113K367k649K960l300L673m082M525n004N530
46B903o108O740p431Q187r015R926j0936J2059j3311J4715j6299J8104k0183K2610
60A1961k5485K8948l3218L8633m5753N5586p0133R4081j42494L91871n87389J28147
72a55245Q28619j272717O57446L78150j093384Q34545J22620j000730J060250
81C59554k54646p08040J100691n03245m41075J086806p83876j24753R07355r41978
91c03207J55389P09892j023191M46155M40379r89389O61939J77832q78239Q45922
101B43482q5737o82638R31959l39366m74358R25120n73995k35232Q37858p41322
$$ plain form
111 -194229 -186692 502245 -344587 -102615 397033 -466934 -3339 298936 -503322 140875
121 140875 224229 -466759 288469 145410 -392743 405684 51504 -307803 459265 -78467
131 -78467 -246347 433286 -231193 -189963 373007 -348731 -99257 316040 -405735 26321
141 26321 267171 -401958 172138 220418 -357411 297634 142058 -315892 360513 16534
151 16534 -286506 368092 -125515 -245825 346090 -249815 -173940 317828 -325425 -55984
161 -55984 299037 -343161 88821 269375 -332239 213701 199184 -318763 291839 85369
171 85369 -306608 319762 -54084 -282787 316293 -179899 -218877 310889 -257942 -107540
181 -107540 306804 -289236 24602 285011 -293686 143508 227135 -292187 221063 125679
$$ packed form
111a94229P537O88937q46832K41972M99648q63967M63595L02275q02258O44197
121A40875Q3354o90988P55228j43059n38153P98427l54180l59307P67068n37732
131g8467j67880O79633o64479M1230N62970p21738K49474M15297p21775M32056
141B6321K40850o69129N74096M8280n77829O55045j55576m57950O76405l43979
151A6534l03040O54598m93607j20310N91915n95905P5875M91768o43253K69441
161e5984L55021o42198M31982J80554o01614N45940j4517n17947O10602k06470
171H5369l91977O26370l73846k28703N99080m96192l8978N29766n68831J50402
181a07540M14344n96040L13838K60409n78697M37194Q3627n19322N13250r5384
$$ plain form
191 125679 -293467 252746 1349 -279692 260803 -109149 -228984 266246 -182080 -138490
201 -138490 273178 -214839 -25392 268190 -225528 77260 228328 -237587 144322 148420
211 148420 -252950 177190 47784 -255363 193278 -45229 -226073 210413 -108660 -158408
221 -158408 232610 -140968 -68816 243127 -160243 14717 223125 -182400 73107 167351
231 167351 -209780 104625 88821 -228427 124667 13806 -218120 150890 -37901 -172788
241 -172788 183986 -67278 -106244 209374 -88898 -41217 208880 -118248 4621 175259
251 175259 -156747 31810 120278 -189365 55216 65279 -198340 88048 24684 -176503
261 -176503 131467 -1007 -132293 171859 -25185 -85231 190188 -61621 -49884 177868
$$ packed form
191A25679m19146N46213k51397k81041N40495l69952j19835M95230m48326M3590
201a38490M11668m88017J89447K93582m93718L02788J51068m65915L81909M098
211A48420m01370M30140j29406l03147M48641k38507j80844M36486l19073m9748
221a58408L91018l73578P2152L11943m03370J74960K08408m05525K55507R4244
231A67351l77131L14405j5804l17248L53094j10861k31926L69010j88791j34887
241a72788L56774k51264l8966L15618k98272M7681K50097l27128J22869J70638
251A75259l32006J88557Q8468l09643K44581J0063k63619K86388o3364k01187
261a76503L07970j32474j31286L04152j97044o0046K75419k51809J1737K27752
$$ plain form
271 177868 -110280 -25512 143077 -156848 -40 103011 -182686 39017 71641 -178447
281 -178447 91262 48504 -151330 141856 21944 -117525 172872 -18277 -89263 175279
291 175279 -71672 -67412 154322 -124775 -41809 125336 -159623 -2120 100855 -166780
301 -166780 51248 81758 -151191 105460 58524 -127140 143113 20746 -107191 154379
311 154379 -31592 -91861 144114 -85731 -71507 125854 -125208 -36516 110612 -140803
321 -140803 13437 99198 -135869 67112 82571 -122815 108150 50948 -112116 127146
331 127146 3563 -104982 126423 -48960 -92553 117495 -90830 -64986 111265 -111718
341 -111718 -20672 108569 -114121 29634 100574 -109155 70724 77499 -107163 92928 37844
$$ packed form
271A77868k88148Q4768J68589k99925J56808J03051k85697K21703L2624k50088
281a78447K69709m2758j99834K93186j19912j39469K90397j91149p0986K64542
291A75279k46951M260K21734k79097Q2966J67145k84959J57503J02975k67635
301a66780K18028L0510k32949K56651m6936j85664K70253j22367j27937K61570
311A54379j85971o0269K35975k29845J4224J97361k51062Q8692J47128k51415
321a40803J54240Q5761k35067K02981J5459k05386K30965n7202j63064K39262
331A27146j23583j08545K31405j75383m3593K10048k08325K5844J76251k22983
341a11718R1046J29241k22690J43755P0940k09729J79879O775j84662K00091n5084
$$ plain form
352 37844 -108878 98148 -9114 -106101 97095 -48820 -88659 99577 -71964 -54310 106736
363 106736 -79937 -10964 110141 -82927 27577 98999 -90671 51601 69670 -104007
373 -104007 62415 29667 -113742 69829 -7713 -108618 83004 -32832 -84211 102116
383 102116 -46819 -47429 117644 -58631 -11124 117799 -76613 15360 97891 -100511 32123
394 32123 63872 -121037 47229 28330 -125927 68978 1132 -109731 97222 -17313 -77972
405 -77972 122125 -34924 -43409 131040 -59753 -16164 117938 -91404 3255 88708 -119772
416 -119772 22670 55860 -132196 49857 29185 -122769 84213 9125 -96508 115886
426 115886 -11691 -65432 131815 -40706 -39449 125616 -77428 -19563 101848 -112008 1675
$$ packed form
352C7844j46722K07026j07262r6987K03196j45915l9839J88236j71541J7654J61046
363A06736j86673O8973J21105j93068J10504P1422j89670J42272J8069j73677
373a04007J66422l2748j43409J83571p7542j00905J91622j15836n1379J86327
383A02116j48935o10J65073j76275M7507J28923j94412R1973Q2531j98402J32634
394C2123L1749j84909J68266j8899j54257J94905o7846j10863K06953j14535o0659
405g7972K00097j57049q485J74449j90793M3589J34102k09342R4659Q5453k08480
416a19772J42442L3190j88056J82053k0672j51954K06982p5088j05633K12394
426A15886j27577n3741J97247j72521J257J65065k03044N7865J21411k13856J13683
$$ plain form
437 1675 72732 -131032 31951 48088 -127456 70874 28740 -105920 107526 7375 -78589
448 -78589 128254 -23311 -55390 126503 -62488 -37264 107234 -99653 -17041 82312 -121650
459 -121650 12635 61448 -121916 51183 45571 -104930 88507 27761 -82726 111476 158
470 158 -65406 113571 -37324 -53677 99740 -74842 -39221 81894 -99332 -13551 69231
481 69231 -104446 23243 61479 -94792 61130 50006 -81604 87402 26408 -73587 95966
492 95966 -9510 -69859 90973 -48252 -61486 82488 -77046 -39464 78750 -88881 -3603
503 -3603 78621 -87361 36101 72956 -82888 66495 52486 -83355 80863 17022 -86837
514 -86837 82930 -23272 -83329 82460 -55258 -64043 86490 -72037 -29279 92623 -77188
$$ packed form
437A675P1057k03764J62983J6137j75544J98330m2134j34660K13446j00151q5964
448g8589K06843j51565l2079J81893j88991K5224J44498k06887Q2612R9353k03962
459a21650J34285M8813j83364J73099n612j50501J93437o0746j10487J94202j11318
470A58o5564J78977j50895j6353J53417j74582L5621J21115j81226Q5781Q2782
481F9231j73677J27689L8236j56271J55922j1124j31610J69006o0994r9995J69553
492I5966j05476o0349J60832j39225j3234J43974j59534L7582J18214j67631Q5278
503c603Q2224j65982J23462L6855j55844J49383j4009j35841J64218o3841j03859
514h6837J69767j06202o0057J65789j37718q785J50533j58527M2758J21902j69811
$$ plain form
525 -77188 10961 91270 -80143 44132 73680 -87645 63283 39711 -96909 71339 -983
536 -983 -97763 77482 -35419 -81201 88066 -56230 -47520 100016 -66549 -6688 102562
547 102562 -75567 28244 87010 -88786 50505 53745 -102325 62921 13077 -105695 73809
558 73809 -22122 -90799 88127 -44750 -58316 102273 -57662 -18493 106480 -69054 15780
569 15780 92611 -84019 37434 61404 -98891 49551 23267 -104103 60841 -8806 -91730
580 -91730 76299 -28418 -62995 92193 -39569 -28091 99007 -50946 1035 89378 -67174
591 -67174 18843 64106 -84626 29369 32662 -93898 40962 6409 -87400 58373 -9534
602 -9534 -65470 77885 -19282 -37332 89980 -31267 -14003 86321 -50129 -27 67504
$$ packed form
525g7188Q8149Q0309j71413J24275K9548j61325J50928k3572j36620J68248p2322
536i83r6780J75245j12901m5782J69267j44296Q710J47536j66565N9861J09250
547A02562j78129J03811N8766j75796J39291L240j56070J65246m9844j18772J79504
558G3809r5931o8677J78926j32877j3566J60589j59935L9169J24973j75534Q4834
569A5780P6831j76630J21453K3970j60295J48442k6284j27370J64944o9647q2924
580i1730J68029j04717l4577J55188j31762J1478J27098j49953N1981Q8343j56552
591f7174Q6017M5263j48732J13995L293j26560J34860l4553r3809J45773o7907
602i534n5936J43355r7167j8050J27312j21247J7264J00324j36450N0102O7531
$$ plain form
613 67504 -71665 9152 42578 -85958 21712 22164 -84985 41496 9933 -69430 64370
624 64370 1365 -47999 80639 -11326 -30275 82639 -31997 -19807 70424 -56437 -12058
635 -12058 52157 -75017 747 37104 -79637 22623 28540 -70558 48903 21577 -55433
646 -55433 69747 8228 -43046 77058 -14975 -35862 71007 -42998 -28887 58773 -65745
657 -65745 -14791 48264 -75354 9270 41715 -71685 38475 34756 -61442 62656 20231
668 20231 -52255 73798 -4594 -46373 71426 -34469 -39474 62282 -59031 -24891 53968
679 53968 -70457 -153 48975 -68712 29123 42723 -60589 53187 28768 -53572 64615
690 64615 5118 -49490 63688 -22909 -44372 56716 -46017 -31946 51041 -57405 -10014
$$ packed form
613F7504j39169Q0817L3426j28536J07670M52j07149J26481l1563p9363J33800
624F4370o3005m9364J28638r1965j8949J12914j14636J2190R0231j26861M4379
635a2058O4215j27174P5764L6357j16741J02260N917r9098J19461k7326p7010
646e5433J25180o1519n1274J20104r2033k0887J06869j14005J4111Q7660j24518
657f5745N0954O3055j23618Q4624L2445j13400J10160l719r6198J24098m2425
668B0231p2486J26053p8392m1779J17799j05895n005J01756j21313L4140P8859
679E3968j24425P0304M9128j17687R7835J3600j03312J13776k4419q2340J18187
690F4615n9497n4608J13178q6597k1463J01088j02733J4071Q2987j08446M7391
$$ plain form
701 -10014 48745 -57254 16631 45591 -51805 39025 34957 -48101 50424 14519 -47819 51059
713 51059 -10812 -46522 47125 -32199 -37657 45304 -43415 -19166 46899 -44898 4367 47378
725 47378 -42498 24708 40531 -42221 35757 24137 -45497 37752 2539 -48008 36391 -16429
737 -16429 -43456 37829 -26907 -29441 43340 -29329 -9762 48206 -29325 7805 46059 -32816
749 -32816 17885 34314 -40614 21030 16779 -47817 22745 428 -48175 28415 -9704 -38858
761 -38858 38437 -14071 -23041 48015 -17587 -7360 50493 -25196 3044 42989 -37277 8372
773 8372 28343 -48774 13334 13199 -52883 22630 2624 -46634 36248 -3391 -32887 48924 -9494
786 -9494 -18327 54134 -19760 -7783 48952 -34113 -1322 36320 -47460 5185 22442 -53639
$$ packed form
701a0014N8759j05999P3885K8960r7396R0830m068q3058R8525l5905o2338R8878
713E1059o1871l5710R3647p9324n458Q2961q8719K4249O6065r1797M9265M3011
725D7378q9876O7206J5823q2752P7978j1620o9634Q3249l5213n0547Q4399n2820
737a6429k7027Q1285o4736k534P2781p2669J9567N7968p7531L7130L8254p8875
749c2816N0701J6429p4928O1644m251o4596P0562k2317m8603P6590l8119k9154
761c8858P7295n2508q970P1056o5602J0227N7853p5689K8240L9945q0266M5649
773H372J9971p7117O2108j35o6082P5513k0006m9258Q2882l9639k9496Q1811n8418
786i494q833P2461p3894J1977N6735q3065L2791L7642q3780N2645J7257p6081
$$ plain form
798 -53639 15850 12224 -49564 30532 5861 -38034 44601 -535 -25078 51673 -11309 -15640
810 -15640 48754 -26446 -9878 38405 -41160 -3653 26723 -49095 7160 18300 -47419 22507
822 22507 13101 -38508 37565 7155 -28084 46328 -3384 -20540 45801 -18481 -16056 38138
834 38138 -33706 -10909 28856 -43028 -1064 22531 -43323 13631 19286 -36777 28784 15325
846 15325 -28910 38350 6499 -24186 39521 -7477 -22559 34404 -22356 -20023 28372 -32421
858 -32421 -12404 25535 -34846 740 25657 -31635 15547 24672 -27650 26483 18258 -26841
870 -26841 30494 5573 -28851 29170 -9592 -29393 27263 -21578 -23768 28514 -27086 -11216
882 -11216 32207 -27557 4485 33842 -27621 17337 28839 -30453 24221 16461 -35378 26338
$$ packed form
798e3639O9489l626o1788Q0096k4671m3895Q2635m5136k4543P6751o2982m331
810a5640O4394p5200J6568M8283p9565L7507L0376p5818N6255J1140o5719O9926
822B2507r406n1609P6073l0410l5239P4412m9712j7156O6341o4282K425N4194
834C8138p1844K2797L9765p1884M1964K3595o5854N6954N655n6063O5561j3459
846A5325m4235O7260l1851l0685O3707m6998j5082N6963n6760K333M8395o0793
858c2421K0017L7939o0381L5586K4917n7292M7182R125n2322N4133q225m5099
870b6841N7335k4921l4424N8021l8762j9801N6656m8841k190N2282n5600J5870
882a1216M3423n9764L2042K9357o1463M4958J1502n9292N4674p760n1839O1716
$$ plain form
894 26338 544 -37864 27884 -13108 -33501 31865 -21104 -21357 37873 -24379 -5308 41273
906 41273 -26959 8885 37467 -32178 17512 25549 -39173 21591 9457 -43417 25185 -4933
918 -4933 -40233 31488 -14045 -28769 39426 -18913 -12905 44425 -23485 1625 41938 -30591
930 -30591 11262 31011 -39254 16772 15413 -44988 21891 858 -43095 29588 -8830 -32582
942 -32582 38854 -14448 -17324 45123 -19753 -3149 43653 -27725 6079 33686 -37248 11329
954 11329 19114 -43842 16431 5907 -43085 24246 -2498 -34155 33937 -7068 -20903 41155
966 41155 -11694 -9002 41539 -19454 -1724 34066 -29659 1967 22415 -38008 6233 12060
978 12060 -39760 14388 6124 -33943 25579 3136 -24045 35232 -1156 -15246 38541 -9936
$$ packed form
894B6338k5794l8408O5748m0992k0393O5366n2969k53N9230o2252J9071M6581
906D1273o8232L5844K8582o9645M9690Q037o4722O0764j2134n2874O8602l0118
918d933l5300P1721m5533j4724O8195n8339O008N7330o7910K5110M0313p2529
930c0591M1853J9749p0265N6026j359o0401O6879k1033m3953P2683l8418k3752
942c2582P1436n3302k876O2447o4876J6604M6802p1378L3804K7607p0934M8577
954A1329P785o2956O0273j0524m8992O7331k6744l1657O8092m1005j3835O2058
966D1155n2849K692N0541o0993J7730L5790o3725L1626K0448o0423M4241N827
978A2060n1820N4148q264m0067N9522k2443k7181N9277l6388j4090N3787m8477
$$ plain form
990 -9936 -10317 34448 -22081 -7724 26195 -32953 -3349 18696 -37758 5863 14571 -35259 18844
1003 18844 12367 -28409 30923 8021 -22092 37002 -1658 -18858 35714 -15441 -17175 30086
1015 30086 -28385 -12811 25016 -35539 -2763 22714 -35473 11640 21468 -31252 25478 17078
1027 17078 -27219 33741 6683 -25605 34973 -8297 -24724 31835 -22873 -20378 28749 -32146
1039 -32146 -9696 27816 -34408 5946 27309 -32253 21324 22818 -29812 31215 11641 -29326
1051 -29326 33908 -4322 -28923 32234 -19811 -24449 30336 -29754 -13413 30173 -32799 2338
1063 2338 29905 -31383 17576 25651 -29649 27322 15176 -29755 30117 214 -30130 28692
1075 28692 -14337 -26752 27434 -23544 -17204 28478 -26142 -3097 29901 -25101 10594 27433
$$ packed form
990i936l81M4765n6529J4357L3919n9148K9604K2045n6454M3621Q708m9830N4103
1003A8844o477m0776N9332k2902l0113N9094l8660j7200N4572n1155j734M7261
1015C0086n8471J5574L7827o0555L2776K5477n8187M7113R828n2720N6730q400
1027A7078m4297O0960k7058l2288O0578m3270j6427N6559n4708K495M9127o0895
1039c2146K2450L7512o2224M0354K1363n9562N3577J494n2630O1027j9574m0967
1051b9326O3234l8230k4601O1157n2045m638N4785o0090J6341M3586o2972L5137
1063B338K7567o1288M8959Q075n5300N6971j2146m4931N9872k9903l0344N8822
1075B8692m3029j2415N4186n0978O340M5682n4620K3045L2998n5002L5695J6839
$$ plain form
1087 27433 -24584 19249 19011 -26646 21899 6116 -29212 21433 -6678 -28198 21991 -15108
1099 -15108 -20980 25261 -18085 -9061 28977 -18307 3164 29067 -19700 11241 23002 -23959
1111 -23959 14154 12066 -28946 14884 686 -30292 17260 -7004 -25296 22685 -9989 -15346
1123 -15346 28658 -11164 -4801 31041 -14327 2330 27337 -20735 5376 18709 -27893 7198
1135 7198 8964 -31656 11385 1980 -29124 18893 -1327 -21315 27241 -3712 -12162 32068 -8770
1148 -8770 -5526 30485 -17433 -1996 23512 -26971 1255 14798 -32670 7246 8094 -31719 16672
1161 16672 4131 -25121 26645 416 -16796 32873 -5960 -10192 32485 -15715 -6054 26279
1173 26279 -25968 -2195 18084 -32377 4302 11713 -32099 14028 7962 -26209 24218 4443
$$ packed form
1087B7433n2017M3833k38m5657M8545j5783l5328N0645k8111k1520N0189l7099
1099a5108n872M6241m3346R024L8038m7284K1471K5903m8767L0941J1761m6961
1111b3959L8113k088m1012M3830j4198l0978M7552k4264j8292M7981l2674n357
1123a5346M4004l9822O363L5842m5368J6657K5007m8072K6111J3333m6602L5091
1135G198J766m0620M3041r405l1104M8017k0220j9988M8556l0953q450M4230m0838
1148h770L244L6011m7918J5437K5508n0483K8226J3543m7468L9916Q48l9813M8391
1161A6672j2541k9252N1766k6229j7212M9669l8833m232M2677m8200R661L2333
1173B6279n2247K3773K0279n0461L6679P411m3812M6127o066l4171N0427j9775
$$ plain form
1185 4443 -18643 30619 -1862 -12888 30687 -11395 -9622 25402 -21521 -6499 18584 -28061
1197 -28061 -682 13523 -28542 8508 10950 -24081 18495 8454 -18159 25343 3112 -14024
1209 -14024 26447 -5876 -12214 22722 -15885 -10342 17588 -22864 -5493 14423 -24286 3113
1221 3113 13509 -21276 12875 12407 -17104 19929 8223 -14896 21864 246 -14857 19608
1233 19608 -9142 -14696 16398 -16242 -11413 15235 -18701 -4120 16332 -17339 5037 17259
1245 17259 -15286 12360 14761 -15414 15478 7850 -17786 15095 -1253 -19617 14305 -8916
1257 -8916 -17723 15713 -12788 -11105 19043 -13589 -1898 21625 -13961 6293 20218 -16247
1269 -16247 10993 13726 -20356 12675 4382 -23429 13865 -4258 -22266 16880 -9498 -15892
$$ packed form
1185D443k3086M9262l2481j1026M3575m2082J773L5024m6923J5022K5083m6645
1197b8061K7379J4205m2065L7050K442l5031M2576j0041k6613M3502k2231j7136
1209a4024M0471l2323o338L4936l8607N543K7930m0452J7371J9916l8709K7399
1221C113J0396l4785L4151m68k9511L7033j1706k3119L6760k1618j5103L4465
1233A9608k8750n554L1094l2640M829K6648l3936J4581K0452l3671K2376J2222
1245A7259l2545K7646K401l0175L0892p628k5636L2881j6348j8364L3922k3221
1257h916q807L3436k8501J683L0148l2632J1691K3523l5586K0254J3925l6465
1269a6247K7240K733l4082L3031q293k7811L7294j8123j8008L9146k6378o394
$$ plain form
1281 -15892 21527 -11687 -6345 24961 -13449 2374 23966 -16972 7803 17634 -21914 10300
1293 10300 8276 -25617 12378 -358 -24876 16129 -5859 -18924 21391 -8497 -9909 25436
1305 25436 -10799 -1427 25115 -14772 3964 19607 -20391 6616 10919 -24828 9016 2763
1317 2763 -24937 13350 -2356 -19795 19275 -4901 -11595 24043 -7349 -3928 24537 -11829
1329 -11829 892 19927 -17886 3203 12339 -22874 5465 5217 -23849 9744 932 -19895 15875
1342 15875 -857 -13069 21204 -2682 -6771 22770 -6850 -3351 19545 -13199 -2201 13715
1354 13715 -19003 -696 8494 -21331 3539 5979 -19198 10244 5366 -14500 16749 3968
1366 3968 -10295 20050 -453 -8395 19072 -7727 -8135 15429 -15079 -6712 12006 -19356 -1938
$$ packed form
1281a5892L7419l3214N342L1306l8410J5823K1592m0938K4775R831l9548L2214
1293A0300k024l3893L7995j2736k4518M1005k1988j3065M0315k9888j412L5345
1305B5436l6235R372K6542l9887J8736J5643l9998K7007M303l5747L3844o253
1317B763k7700L8287j5706j7439L9070k4176o694L5638l1392L421K8465l6366
1329a1829J2721J9035l7813K1089R136l5213K8339k48k9066L3593q812k0827L5770
1342A5875j6732j2212L4273k3886m089K9541k9620L499K2896l2744J0998J5916
1354A3715l2718J8307R190k9825K4870K440k5177K9442m878j9866L1249j2781
1366C968j4263L0345k0503p942K7467k6799m08K3564l0508Q367J8718l1362J7418
$$ plain form
1379 -1938 10700 -19266 5915 10663 -16418 14055 9126 -13685 19004 3990 -12830 19635
1391 19635 -4395 -12990 17440 -12961 -11341 15277 -18492 -5959 14740 -19706 2604 14984
1403 14984 -18079 11564 13417 -16326 17523 7995 -16133 19208 -800 -16613 18005 -10017
1415 -10017 -15122 16695 -16324 -9621 16935 -18339 -639 17682 -17604 8781 16209 -16684
1427 -16684 15310 10698 -17221 17607 1718 -18090 17169 -7748 -16788 16533 -14399 -11374
1439 -11374 17224 -16819 -2508 18205 -16416 6730 17129 -15859 13099 12018 -16738 15313
1451 15313 3585 -18152 14872 -5199 -17476 14517 -11107 -12905 15786 -13035 -5126 17637
1463 17637 -12624 2970 17606 -12549 8440 13893 -14322 10269 6995 -16969 10054 -554
$$ packed form
1379a938J2638k9966K5181M748k7081L0473m929k2811L2689j5014j6820L2465
1391A9635k4030q595L0430l0401J620K6618l3769J2533K0699l4446K2310J2380
1403A4984l3063K9643J853k9743L3849r528k4128L5341k0008j5813L4618k8022
1415a0017n105L1817l3019O703K6556l5274J7700J8321l5286K6385P428l2893
1427a6684L1994m612k7919L4828j5889j9808L5259k4917r040L3321l0932L025
1439a1374K8598l4043J4311K0713l4621K3146J0399l2988K8958j081k8756L2051
1451A5313j1728k1737L3024k0071j2277L1993k5624j798K8691k8821P909K2763
1463A7637l0261J5594J4636l0155K0989N453k8215K4591l274k3964K7023j0608
$$ plain form
1475 -554 -17835 10556 -5755 -14906 13046 -7533 -8580 16522 -7689 -1572 18206 -8815 3320
1488 3320 15964 -12183 5232 10244 -16455 5818 3636 -18767 7553 -1153 -17123 11461 -3165
1501 -3165 -11946 16296 -4057 -5747 19322 -6153 -1190 18343 -10617 884 13676 -16087 2056
1514 2056 7806 -19660 4611 3491 -19177 9591 1458 -15006 15585 104 -9560 19703 -2931
1527 -2931 -5455 19752 -8502 -3297 15992 -15038 -1611 10791 -19515 1792 6734 -19942 7635
1540 7635 4477 -16591 14509 2606 -11591 19379 -1092 -7575 20027 -7160 -5275 16737 -14135
1553 -14135 -3311 11895 -18994 314 8092 -19613 6363 5990 -16482 13184 4239 -11948 17978
1566 17978 816 -8414 18683 -4963 -6598 15716 -11484 -5300 11525 -16115 -2351 8528
$$ packed form
1475e54j7281K8391j6311r151K7952k0579j047K5102k4211O117J9778k7021J2135
1488C320J2644k8147J7415N012k6699K2273k182k2403K6320q706j5970K8584j4626
1501c165q781K8242k0353j690K5069k5475M963J9533k8960J1501J2792k9763J8143
1514B056N750k7466K4271j120k2668K8768q133j6464L0591j5481r664K9263k2634
1527b931k524K5207k8254N205J9289l1030J3427J2402l0306K1307M942k6676K7577
1540G635l158k1068L1100j1903j4197L0970k0471o483K7602k7187J885K2012l0872
1553a4135J0824J5206l0889J9308P778k7705K5976l73k2472K9666q945j6187K9926
1566A7978j7162r230K7097k3646j635K2314k7200O184J6825k7640J3764J0879
$$ plain form
1578 8528 -16969 2915 7371 -14486 9339 6588 -10884 14029 4081 -8516 15121 -1049 -7997
1591 -7997 13090 -7271 -7768 10208 -11985 -5629 8551 -13443 -819 8646 -12075 5324 8941
1604 8941 -9782 10208 7195 -8690 12010 2687 -9401 10998 -3286 -10201 9292 -8219 -8996
1617 -8996 8937 -10298 -4825 10314 -9761 1037 11680 -8698 6003 10845 -9032 8349
1629 8349 7026 -11082 8384 1382 -13036 7963 -3739 -12636 9038 -6553 -9027 11688 -7201
1642 -7201 -3371 14083 -7430 2032 13993 -9056 5203 10474 -12217 6365 4717 -14996 7135
1655 7135 -880 -15027 9260 -4335 -11481 12706 -5867 -5657 15559 -6998 17 15711 -9313
1668 -9313 3646 12289 -12787 5271 6509 -15795 6463 898 -16053 8831 -2677 -12803 12412
$$ packed form
1578H528k5497J9884M456k1857K3825k751j7472K4913r948j2597K3637j6170o948
1591g997K1087k0361m97J7976k2193O356J4180k1994J2624R465k0721J7399L617
1604H941j8723J9990l013j5885K0700r323j2088K0399j4284o915J9493j7511p77
1617h996J7933j9235N473J5139k0075J0798J0643k0378J4701M842j9877J7381
1629H349j323j8108J9466p002j4418K0999j1702q897K1674j5591k474K0715j8889
1642g201L830J7454k1513R462J1961k3049J4259N271k2691J8582j648j9713K2131
1655G135q015j4147K4287j3595p146K4187j8573K10K1216k2557P015J5694k5024
1668i313J2959Q643k5076J8058J238k2304K2258n565j6951K4884j1508j0126K5215
$$ plain form
1681 12412 -4188 -7254 15501 -5324 -1873 15966 -7753 1415 12992 -11443 2830 7788 -14729
1694 -14729 3876 2792 -15478 6376 -253 -12887 10247 -1462 -8147 13761 -2516 -3561 14922
1707 14922 -5029 -789 12743 -8983 214 8442 -12844 1218 4282 -14289 3704 1889 -12596
1720 -12596 7837 1200 -8708 11852 349 -5062 13666 -2074 -3211 12349 -6256 -2854 9158
1733 9158 -10531 -2326 6117 -12794 25 4753 -12158 4352 4812 -9617 9034 4476 -7212
1746 -7212 11855 2051 -6373 11884 -2615 -6657 10016 -7777 -6378 8220 -11186 -3695 7762
1759 7762 -11785 1354 8235 -10459 7013 7805 -9085 10874 4902 -8835 11992 -478 -9388
1772 -9388 11095 -6477 -8873 9903 -10731 -5798 9813 -12137 -255 10380 -11387 5916
$$ packed form
1681A2412j6600l066K2755k0825L451J7839k3719R168J1577k4435J4273M958k2517
1694a4729J8605j084j8270K1854o629j2634K3134j1709o685K1908j6277j045J8483
1707A4922j9951M240J3532k1726R197Q228k1286J4062L064j8571J7993j815j4485
1720a2596K0433o637r908K0560j1503n411J8728j5740j137J5560j8605L402J2012
1733I158j9689Q205Q443j8911J2819M728j6911J6510M60j4429J8651m558j1688
1746g212J9067r804q424J8257j4499m042J6673j7793J399J4598j9406P491J1457
1759G762j9547J3139O881j8694J7472P92j6890J9959n972j3737K0827j2470q910
1772i388K0483j7572k396J8776k0634M933J5611k1950J1882J0635k1767J7303
$$ plain form
1784 5916 9845 -10472 10318 6693 -10529 11872 1083 -11231 11278 -5139 -10704 10550 -9564
1797 -9564 -7524 10779 -11176 -1951 11576 -10769 4205 11185 -10199 8680 8239 -10626 10371
1810 10371 2742 -11576 10121 -3353 -11369 9675 -7795 -8560 10295 -9532 -3226 11455 -9313
1823 -9313 2740 11436 -9048 6997 8764 -9856 8594 3707 -11239 8395 -1934 -11469 8210
1836 8210 -5905 -9130 9173 -7346 -4515 10821 -7053 658 11509 -6981 4305 9719 -8219
1849 -8219 5546 5635 -10409 5312 891 -11593 5532 -2445 -10379 7342 -3554 -6718 10043
1862 10043 -3563 -2413 11803 -4249 746 11039 -6578 1983 7838 -9822 2300 3714 -12079
1875 -12079 3429 578 -11753 6151 -790 -8782 9885 -1364 -4818 12478 -2840 -1708 12398
$$ packed form
1784E916L929k0317K0790l625j7222K2401j0789j2314K2509j6417n565K1254k0114
1797i564K040J8303k1955R225J3527k2345J4974O980k1384J8879m41j8865K0997
1810A0371p629j4318K1697j3474q016K1044j7470p65J8855j9827O306J4681k0768
1823i313J2053Q696k0484J6045J767j8620J8450m887j4946J9634j0329r535J9679
1836H210j4115l225J8303j6519K831J5336j7874P711J0851j8490J1286N414j7938
1849h219J3765Q9j6044J5721m421j2484J7125p977p934J7721j0896l164J6761
1862A0043j3606J150J4216j6052M995J0293j7617Q561N855j7660J2122J414j5793
1875a2079J5508k851j2331J7904o941p992J8667j1249l454J7296j5318J132J4106
$$ plain form
1888 12398 -6009 -272 9612 -10010 498 5831 -12797 2202 2853 -12904 5668 1399 -10333
1901 -10333 9849 484 -6761 12897 -1421 -3855 13199 -5042 -2328 10826 -9423 -1353 7342
1914 7342 -12672 698 4527 -13115 4481 3053 -10902 9067 1965 -7523 12313 -208 -4819
1927 -4819 12865 -4111 -3403 10687 -8696 -2261 7445 -11933 -96 4880 -12442 3739 3517
1940 3517 -10359 8152 2538 -7228 11325 540 -4831 11837 -3062 -3715 9802 -7272 -3073
1953 -3073 6875 -10237 -1316 4824 -10718 1990 4152 -8897 5989 3832 -6376 8870 2441
1966 2441 -4795 9413 -604 -4572 7930 -4465 -4665 5916 -7410 -3545 4832 -8230 -649
1979 -649 5011 -7144 3197 5424 -5571 6274 4492 -4901 7313 1644 -5468 6589 -2157 -6091
$$ packed form
1888A2398j8407N737R884j9622J0508N333j8628J4999O51j5757J8572m269j1732
1901a0333K0182r365p245J9658j4318k434J7054j8241K714J3154k0249Q070Q695
1914G342k0014J3370L829j7642J7596j428j3955J9969p102r488J9836j2521m611
1927d819J7684j6976P08J4090j9383O435R706j9378J1837M976j7322J6181k22
1940C517j3876J8511n614r766J8553j0785n371J6668j4899o53J3517j7074M199
1953c073R948j7112Q921O140j5542J2708K162j3049J4886k157j0208J5246o429
1966B441p236J4208j0017l968J2502j2395k00J0581j3326L865Q377j3062P581
1979f49N660j2155J0341K227j0995J1845j782r393J2214n669p112J2057q746l934
$$ plain form
1993 -6091 5384 -5322 -5351 5133 -6507 -2606 6016 -6099 1209 6836 -5298 4356 6267 -5362
2007 -5362 5761 3664 -6468 5606 -29 -7553 5095 -3293 -7119 5502 -4908 -4611 6903
2020 6903 -4962 -948 8163 -4784 2357 7809 -5493 4099 5309 -7083 4424 1637 -8469
2033 -8469 4534 -1771 -8144 5459 -3653 -5657 7156 -4150 -1944 8475 -4375 1457 8192
2046 8192 -5333 3374 5766 -7008 3942 2146 -8378 4160 -1184 -8086 5104 -3007 -5721
2059 -5721 6770 -3464 -2257 8063 -3626 841 7849 -4496 2411 5680 -6103 2651 2476 -7450
2073 -7450 2753 -315 -7384 3584 -1662 -5542 5215 -1785 -2695 6734 -1756 -232 6907 -2604
2087 -2604 892 5348 -4344 866 2839 -5999 879 684 -6424 1769 -196 -5139 3634 -135 -2962
$$ packed form
1993f091J1475j0706k9J0484j1640L901Q622j2115P308N627j2134R654J911j1629
2007e362J1123k097j0132J2074n635p524J2648q388l826J2621j0410K97J1514
2020F903j1865M014R111j2947P141N452j3302R592J210j2392J1507k787j0106
2033h469J3003o305o373J3603r112k004J2813j1306K206J0419j2850N832O735
2046H192j3525Q707K392j2774J0950j796j0524J2538n344o902J3190q111k714
2059e721J2491j0234J207J0320j1689M467P008j2345O907L269j1783Q754j75r926
2073g450J0203l068p069J0968n246l880J0757p000r10R429q490J524P139r511
2087b604L496M456r692N210J973q838O878j95p108Q193j965m943Q773l769k827
$$ plain form
2102 -2962 5447 -59 -1120 6031 -962 -431 5105 -2866 -672 3227 -4821 -778 1641 -5715 99
2117 99 1200 -5046 2057 1563 -3502 4161 1812 -2281 5255 910 -2060 4947 -1164 -2598 3765 -3497
2133 -3497 -2791 2818 -4838 -1777 2747 -4812 423 3331 -3928 2926 3525 -3181 4549 2444 -3226
2148 -3226 4811 85 -3796 4136 -2633 -3931 3485 -4401 -2755 3539 -4801 -326 4073 -4169 2405
2163 2405 4223 -3650 4239 3029 -3719 4637 615 -4284 4121 -2052 -4414 3603 -3870 -3308 3702
2178 3702 -4280 -1042 4360 -3758 1542 4626 -3279 3314 3684 -3516 3788 1521 -4283 3285 -956
2193 -956 -4700 2892 -2648 -3935 3231 -3051 -1951 4151 -2688 387 4711 -2415 2080 4110 -2892
2208 -2892 2486 2252 -3912 2161 89 -4694 1925 -1484 -4250 2502 -1882 -2672 3776 -1528 -643 4713
$$ packed form
2102b962Q409n506j061P151o993N31N536p971K194L899q048M043K419p356N814
2117I9J101o246P103m94n065P663k349m093P536m345k970P007o111j434O363p262
2133c497P06N609p656L061M524p559N235K908p259O854N99o706P730k105n670
2148c226Q037m726l881P932o769j298P416p886J646O294q340M475M399q242O574
2163B405J818p873P889j210o748Q356m022m899Q405o173k362Q017p473N62P010
2178C702p982L238N402q118N300L084p905O593L70p200P304k267n804P568m241
2193i56l744P592n540j287P166o282J100O102o839L075M324p126M495K030p002
2208b892N378k34o164O073k072m783O619l409k766O752m384p90O448n304Q85N356
$$ plain form
2224 4713 -1362 811 4518 -2115 1123 3226 -3565 754 1404 -4776 690 158 -4918 1639 -102
2239 -102 -3856 3361 155 -2227 4873 -10 -1063 5306 -1144 -769 4448 -3169 -934 2974 -4982
2254 -4982 -596 1853 -5650 872 1481 -4922 3132 1444 -3542 5137 918 -2405 5940 -749 -1927
2269 -1927 5347 -3164 -1803 3993 -5371 -1087 2817 -6260 666 2301 -5682 3184 2088 -4371 5459
2284 5459 1338 -3180 6414 -440 -2643 5860 -3034 -2507 4580 -5374 -1783 3477 -6343 88 3019
2299 3019 -5883 2746 2879 -4623 5057 2094 -3583 6127 263 -3170 5714 -2397 -3057 4488 -4743
2314 -4743 -2379 3530 -5836 -543 3183 -5507 2077 3161 -4330 4365 2540 -3427 5481 811 -3216
2329 -3216 5101 -1726 -3343 4076 -3972 -2857 3327 -4979 -1263 3368 -4662 1113 3675 -3750 3249
$$ packed form
2224D713o075K173L707o633L238K103o791M319O50o180N466n32n076O557j741
2239a02l754P217l206k382P100m883j053O369o450L75N217p617K235L908p956
2254d982M386K449p503O522O09o403Q054j688m986Q679m219l323Q345o689j178
2269a927P274q511J361N796r364M284L904r077O926J635p983Q866j096o459R830
2284E459m121m518R594o854k203Q503q894N27P087r954L591N260r820O431K931
2299C019q902Q629J33p502R680k963n677R710n864l433Q884q111o60P545r231
2314d743K364N909r366N293L726q690P584J084p491Q695j825n967Q908m670m027
2329c216Q317o827j617P419q048J115O184q306L716M631q030N775K562p425O999
$$ plain form
2344 3249 3465 -3222 4305 2047 -3502 4107 -198 -4100 3403 -2363 -4123 3158 -3528 -2831 3738
2359 3738 -3510 -595 4592 -3119 1625 4729 -3157 2883 3496 -3997 3064 1190 -5013 2908 -1092
2374 -1092 -5227 3201 -2476 -4060 4239 -2853 -1725 5372 -2822 674 5705 -3326 2163 4511 -4448
2389 -4448 2661 2249 -5742 2769 -186 -6106 3404 -1756 -4947 4675 -2317 -2663 6053 -2563 -263
2404 -263 6444 -3311 1303 5327 -4737 1934 3073 -6148 2276 647 -6624 3139 -981 -5498 4593
2419 4593 -1677 -3266 6118 -2039 -876 6595 -2944 726 5479 -4476 1440 3246 -5963 1844 935
2434 935 -6404 2750 -588 -5326 4218 -1170 -3154 5649 -1524 -1014 6146 -2355 352 5163 -3776
2449 -3776 779 3144 -5244 971 1201 -5760 1672 92 -4993 3121 -141 -3231 4658 -216 -1534
$$ packed form
2344C249K16o687P527k258n549P609m305l902P503n766j760P281o686O97O569
2359C738p248K915N187p711M744L104p886O040O13p493P061j874o203P921m000
2374a092m135Q428n677j584Q299p092J128P097q194L496N031r031N489K348q959
2389d448P109m12p991Q511k955n920R510n160l191R622o992l46Q716q616K300
2404b63O707r755M614M024j0064O671J139r221Q424j629p271R763m120m517J0091
2419D593o270j589R384q157J163P471r539L670M753r955N916J806r209P807r09
2434I35p339R154l338m738R544n388j984Q803p173N10P160q501K707M811q939
2449c776M555K365q388O215K30o961P432j580n085Q114l262l090P889m874j318
$$ plain form
2464 -1534 5353 -907 -658 4747 -2405 -605 3292 -4033 -556 1850 -4881 161 1190 -4533 1708
2479 1708 1232 -3313 3519 1250 -2121 4563 489 -1640 4433 -1201 -1791 3403 -3118 -1834 2397
2494 2397 -4302 -1064 2054 -4328 679 2307 -3536 2646 2413 -2752 3997 1625 -2580 4219 -100
2509 -100 -2918 3665 -2174 -3064 3028 -3619 -2290 2990 -4061 -508 3460 -3675 1677 3646 -3232
2524 -3232 3323 2799 -3301 3863 957 -3802 3631 -1278 -3925 3281 -3009 -3083 3410 -3671 -1217 3912
2540 3912 -3533 1049 4090 -3251 2785 3240 -3412 3476 1405 -3882 3338 -844 -4140 3078 -2475
2555 -2475 -3424 3309 -3134 -1656 3860 -2998 447 4176 -2752 2028 3566 -3019 2592 2039 -3751
2570 -3751 2430 85 -4218 2273 -1361 -3820 2672 -1889 -2460 3523 -1800 -682 4203 -1731 693
$$ packed form
2464a534O887o260K49N405p152J800L897p325L477K406o731N042J029n723O241
2479A708m76m545O832k269l371O684m074k129O073n634n90N194o521J284M231
2494B397o699L238L118o382N007J628n843O182k33n165O749k372m205O799m319
2509a00k818O583n839q90O092o647J329N280p051L553L968p135N352J969o878
2524c232O555n24o100P164k906m759P433m909k647P206o290p4O493p081K454N129
2540C912p445M582L041p341O036M55o652O888k071n287P220m182l296P218n553
2555b475r49O733o443J478N516o858L445L729o928M780J538o585N611n53n790
2570c751O181k345m303O491l634k459O492m561n71N983n323J118M885n934K424
$$ plain form
2585 693 4008 -2216 1228 2827 -3238 1150 1203 -4116 1159 -104 -4128 1845 -613 -3173 3049 -564
2601 -564 -1640 4070 -657 -455 4278 -1458 -10 3528 -2802 -76 2189 -4044 92 1124 -4536
2616 -4536 1013 760 -3965 2560 761 -2855 4017 515 -1868 4751 -508 -1563 4406 -2265 -1508
2631 -1508 3456 -4002 -1136 2589 -4913 108 2201 -4772 2044 2099 -3880 3946 1620 -3075 5051
2646 5051 234 -2681 5000 -1857 -2449 4185 -3963 -1884 3364 -5178 -485 2940 -5138 1691 2740
2661 2740 -4351 3840 2172 -3588 5095 684 -3192 5173 -1472 -3056 4468 -3645 -2497 3755 -4938
2676 -4938 -1075 3453 -5048 1068 3416 -4421 3255 3010 -3816 4606 1631 -3633 4844 -527 -3672
2691 -3672 4257 -2707 -3393 3760 -4141 -2096 3690 -4418 0 3936 -3995 2204 3742 -3664 3630
$$ packed form
2585F93L315o224L444J599o065M388N3n319N275j263m024N973k458k560O222l613
2601e64j076N710m727K02M733n736J448L538o330K726K265o233M136J032n660
2616d536N549k53m725O525j799l616O872l502k383O619n259j055N969o671P57
2631a508M964p458K866L725p502N021K093o973O816N5n979P826k326m695Q126
2646E051m817k915P681o857n92O634q148K079N248q542M693L425q078O829J049
2661B740p091Q191j668n760Q683m411l876Q365o645j584P524q113J148O252q693
2676d938L863M528q501O116K348p837P676k45o826Q422k975n264Q477n371l145
2691c672P929o964o86P153p901K045N786q108M418L936p931O199J538p406P294
$$ plain form
2706 3630 2548 -3761 3996 489 -4084 3691 -1668 -4066 3517 -3098 -3073 3776 -3549 -1110 4371
2721 4371 -3371 1011 4557 -3283 2524 3720 -3819 3018 1888 -4709 2973 -220 -5129 3156 -1715
2736 -1715 -4487 3984 -2347 -2743 5150 -2567 -669 5791 -2993 957 5226 -4084 1791 3534 -5490
2751 -5490 2198 1380 -6296 2874 -435 -5839 4232 -1415 -4101 5808 -1961 -1798 6739 -2817 16
2766 16 6272 -4354 1100 4505 -6065 1826 2189 -7043 2825 319 -6645 4427 -835 -4886 6219
2781 6219 -1593 -2616 7307 -2647 -715 6959 -4363 416 5265 -6296 1205 3022 -7427 2344
2795 2344 1167 -7173 4122 14 -5507 6124 -763 -3310 7402 -1933 -1498 7153 -3803 -414
2809 -414 5582 -5857 344 3449 -7166 1517 1781 -7040 3408 775 -5561 5526 47 -3559
$$ packed form
2706C630j082o309P757l507m573P775n359k398P583o615K5O849p325K439N481
2721D371p742M382L546p840N807J196p539O837j130o597P682l193m909Q285m871
2736a715k772Q471o331l96P893p717J898O460q784L950M269r310N875J743r024
2751e490P688q18p676R170l309n404J0071n647k686R909p769J63Q537r556K833
2766A6O256j0626N454L405j0570P891L63r232R868k506o964J1072n262m051J1105
2781F219p812j023R923r954J932P674j1322M779M849j1561P501J817j0449R771
2795B344j177q340J1295m108n521J1631o887k547J0712r335M35Q651j0956L389
2809d14N996j1439O201L105j0615Q683K64q821J0448k633o336J1087n479l606
$$ plain form
2823 -3559 6892 -1083 -1974 6842 -2932 -1173 5469 -5086 -620 3675 -6543 439 2367 -6617
2837 -6617 2310 1787 -5450 4481 1399 -3947 6091 411 -2909 6399 -1508 -2556 5525 -3835 -2307
2852 -2307 4282 -5613 -1347 3496 -6188 668 3326 -5589 3184 3149 -4586 5210 2159 -4026 5997
2867 5997 -29 -3983 5592 -2717 -3820 4853 -4911 -2753 4491 -5862 -485 4504 -5675 2331
2881 2331 4361 -5081 4694 3280 -4831 5835 943 -5047 5775 -1973 -4928 5350 -4437 -3843
2895 -3843 5224 -5668 -1456 5509 -5748 1532 5500 -5485 4051 4366 -5498 5375 1955 -5868
2909 -5868 5588 -1085 -5908 5461 -3674 -4760 5601 -5085 -2332 6046 -5371 754 6076 -5255
2923 -5255 3374 4980 -5477 4767 2543 -5995 5074 -502 -6098 5006 -3029 -5041 5290 -4358
$$ packed form
2823c559J0451p975q91Q816r774J759O642j0555M466M295j0218O982J928q984
2837f617Q927n23p237R931l082n346J0038n680l320R308p907j048Q081r360J528
2852b307O589r895M266M843r684O856K658q915Q773l5p735R796l051o185J0023
2867E997o026l954R575q309j103Q673r764K158P244j0353N377M989j0179Q006
2881B331K030r442R775j414q111J0666m892n990J0822p748k955J0278r787N94
2895c843R067j0892M212O965j1257P280L968j0985R536L15r864J0873l420p823
2909e868J1456o673m823J1369r135j086J0361j0686K753Q378j1417O125N322j1331
2923e255Q629J606j0457J0244k224q538J1069n576n596J1104q035k012J0331r648
$$ plain form
2937 -4358 -2689 5818 -4652 200 6059 -4578 2575 5146 -4938 3755 2956 -5673 3995 323
2951 323 -6062 4032 -1872 -5404 4512 -3013 -3494 5456 -3209 -963 6096 -3320 1084 5686 -4027
2966 -4027 2103 3968 -5197 2395 1688 -6138 2660 -236 -5900 3598 -1241 -4403 4982 -1627 -2297
2981 -2297 6109 -2102 -434 6133 -3204 563 4793 -4815 964 2835 -6173 1547 1066 -6385 2834
2996 2834 125 -5276 4647 -325 -3420 6210 -1038 -1773 6651 -2491 -873 5717 -4491 -370 4070
3011 4070 -6255 444 2540 -6852 2086 1599 -6091 4329 1043 -4565 6252 110 -3086 7027
3025 7027 -1737 -2165 6360 -4129 -1534 4829 -6200 -477 3361 -6985 1467 2422 -6373 3898
3039 3898 1780 -4926 5980 697 -3503 6806 -1195 -2634 6248 -3642 -2006 4904 -5687 -993
$$ packed form
2937d358J669Q507j0470M852N859j0637P153K571j0084Q693p99q629R668l672
2951C23o385J0094n904l532R916p525m81Q950q665K246P059r416M404M602r713
2966d027O130J865r165P592p07p826Q798k896n664R498m839l162R385o609o70
2981b297Q406q211J668O567r337L767M230r608N779J871r008P720m81p451R219
2996B834k709n401R923m972l095R630p248p35Q424r142J618O590j0208M121M440
3011D070j0325O699K096r392Q938m87p690J0420l286n608J0817o142l196J0113
3025G027q764m28Q525j0489K595O363j1029N723L838j0346Q452R55q795J0271
3039C898k118o706J0906n283m200J0309q001j439Q882r890J636O910j0591M694
$$ plain form
3053 -993 3562 -6566 863 2830 -6033 3228 2380 -4774 5262 1488 -3638 6141 -273 -3121 5708
3068 5708 -2589 -2827 4644 -4622 -2084 3723 -5577 -427 3400 -5283 1847 3290 -4406 3879 2708
3083 2708 -3756 4923 1144 -3631 4831 -1102 -3722 4157 -3234 -3246 3719 -4337 -1779 3866 -4374
3098 -4374 444 4115 -3920 2557 3822 -3717 3795 2452 -4051 3935 288 -4588 3692 -1831 -4446
3113 -4446 3778 -3157 -3164 4359 -3502 -1081 5100 -3523 1092 5167 -3815 2520 4006 -4689 3100 1882
3129 1882 -5625 3316 -375 -5787 3909 -1976 -4648 4945 -2702 -2472 6036 -3136 -128 6225 -3888
3144 -3888 1532 5053 -5101 2450 2854 -6234 3007 474 -6437 3844 -1280 -5287 5119 -2229
3158 -2229 -3134 6304 -2828 -723 6581 -3716 1029 5517 -5085 1920 3337 -6325 2506 1075 -6659
$$ packed form
3053i93M555j0128P429J967q863R261q48p154J0036l774n126R779o414k848Q829
3068E708q297k38P471r266K538N807r300N150L827q683P130J443p696Q285j171
3083B708o464Q679l779m775Q462n933k620P879p391j2O965q056K558N645q240
3098d374M818L671q035O477J265p539P512j343o503P986l647m876Q280n523k615
3113d446Q224o935pP523p861K421O181q623M615M075q982O335J486q695P789j218
3129A882p507Q941l691n412R696n885k672R593p647K30Q508r172L008O353j0113
3144c888N420L521j0154P551M04r088R241k533o911J0281n124m007J0406p348
3158b229r05R438r132K105P304j0297M745M488j0602P005J417r662Q831j431p734
$$ plain form
3173 -6659 3476 -557 -5664 4893 -1435 -3664 6210 -2031 -1485 6680 -3015 50 5777 -4475
3187 -4475 849 3896 -5954 1419 1839 -6535 2435 376 -5784 3970 -329 -4017 5596 -870 -2148
3202 -2148 6295 -1902 -860 5731 -3545 -241 4128 -5186 295 2450 -6020 1354 1347 -5620 3060 785
3218 785 -4288 4818 385 -2820 5813 -683 -1900 5609 -2428 -1577 4512 -4372 -1173 3279 -5608
3233 -5608 -123 2610 -5635 1829 2383 -4825 3955 2001 -3853 5424 771 -3281 5674 -1268 -3099
3248 -3099 5055 -3597 -2705 4235 -5224 -1371 3812 -5692 875 3632 -5215 3359 3204 -4487 5130
3263 5130 1789 -4106 5724 -567 -4007 5320 -3119 -3568 4697 -5014 -2123 4398 -5653 244 4344
3278 4344 -5367 2865 3890 -4848 4756 2506 -4674 5481 131 -4710 5302 -2485 -4298 4871
$$ packed form
3173f659J0135m033n107J0557o328k229R874q241N46Q165r695L065N727j0252
3187d475N324L047r850P373M20q374Q970k059o160R754m299l688R613o466j278
3202b148Q443q197J042O591r276L304M369r314N481K155q470P374po967Q680k275
3218G85n073R106m433l205Q633o496j217P509q037Q51O089q884L199M452q887
3233e608N485K733q245P464N54p208Q780j954n854R277m653m052Q955o942j831
3248c099Q154q652Q92O940r459L853N183r504O567K757q847Q574j55p691R617
3263E130l341n895R830o291l440R327q439m49Q265r711K891O521j0051N897M100
3278D344r711Q232J025q738R604k250p180J0155n350m841J0012p787j813R169
$$ plain form
3292 4871 -4439 -2892 4777 -5203 -534 4882 -5040 2114 4551 -4713 4045 3224 -4708 4822 884
3307 884 -4919 4727 -1724 -4680 4448 -3605 -3415 4533 -4364 -1149 4854 -4277 1317 4716 -4120
3322 -4120 3123 3598 -4358 3859 1460 -4785 3807 -840 -4808 3706 -2539 -3905 4106 -3209 -1986
3337 -1986 4785 -3199 176 5059 -3247 1788 4343 -3901 2435 2611 -4809 2542 587 -5334 2844
3352 2844 -958 -4811 3691 -1673 -3250 4849 -1961 -1265 5577 -2402 264 5180 -3499 1042 3708
3367 3708 -4869 1449 1812 -5784 2088 310 -5532 3368 -550 -4110 4895 -1023 -2259 5909 -1817
3382 -1817 -781 5778 -3221 105 4467 -4906 640 2709 -6065 1512 1262 -6049 3095 380 -4822
3397 -4822 4890 -210 -3126 6162 -1216 -1703 6212 -2865 -833 5037 -4781 -165 3397 -6115 884
$$ packed form
3292D871r310J547P669r980M669N416r922P154K437r264Q758q21p932R530l938
3307H84n803R646o451k956R128q053J90P948q897L215O003r131N594L399q836
3322d120P243M75p956Q217k399o245Q592m647l968Q514o245j366Q011p315J223
3337a986O771p984L375M883q306N035K555q244O336J76p420P351j955n921Q178
3352B844l802l853Q502n364j577Q099o810O96O842p979K666M916q679M541K666
3367C708q577O318L63p596P872j778n842Q900l918l560R005n918j236Q168p726
3382a817J036O559q999L326M362r373N546K069q774P577k50p311R144k715n202
3397d822R712n100k916R288p378m87P915r077K032N870r818M616L562r512O999
$$ plain form
3412 884 2007 -6188 2623 1139 -5062 4547 475 -3501 5934 -601 -2182 6032 -2339 -1353 4963
3427 4963 -4318 -708 3439 -5633 356 2226 -5776 2010 1534 -4779 3933 1013 -3389 5235 88
3442 88 -2329 5401 -1539 -1824 4561 -3388 -1485 3366 -4760 -644 2521 -5074 897 2227 -4380 2729
3458 2729 2027 -3422 4170 1351 -2802 4618 -158 -2668 4138 -2117 -2622 3391 -3572 -1978 2971
3473 2971 -4175 -442 3068 -3893 1520 3095 -3336 3131 2478 -3130 3789 990 -3344 3642 -1013
3488 -1013 -3482 3279 -2657 -2968 3251 -3453 -1503 3651 -3470 499 3959 -3293 2210 3469 -3457
3503 -3457 3153 2014 -3994 3302 47 -4365 3300 -1754 -3963 3646 -2751 -2519 4269 -3079 -477
3518 -477 4759 -3237 1353 4300 -3712 2471 2850 -4461 2869 807 -4920 3092 -1083 -4551 3597
$$ packed form
3412H84J123q195Q811j484o201R609m072l976R435o535j581Q214q371R86O316
3427D963r281L610M147r072N989J870q002P786m76o313Q712k920m402Q624n147
3442H8k417P730o940k85O385p949J903M851q126M116L165p595N971J330o607P109
3458B729p02n449P592k819m153P420m776k510O806o255n05O013o963J594M949
3473B971p146L733L510o961N413J575o431O467o53n608O919k799m334O986m655
3488a013k469O761n936l11O219o704J950N154p121L969L460p252N503J259o926
3503c457O610j139o008P296l255m412P665n054k209P609o397K32O788p348K602
3518d77N236p996M590K947q012O183L79p311P330k062n727Q012m175l468Q148
$$ plain form
3533 3597 -2235 -3089 4415 -2675 -1023 4939 -2922 854 4583 -3437 2007 3162 -4263 2364 1199
3548 1199 -4821 2642 -596 -4565 3202 -1621 -3296 4086 -1974 -1418 4733 -2222 207 4563 -2844
3563 -2844 1134 3450 -3818 1424 1757 -4617 1705 258 -4641 2385 -600 -3620 3491 -860 -2079
3578 -2079 4425 -1137 -707 4536 -1900 40 3719 -3094 304 2338 -4158 609 1122 -4459 1424
3593 1424 456 -3795 2752 260 -2561 3944 -74 -1439 4380 -979 -917 3874 -2371 -822 2847 -3724
3609 -3724 -488 1900 -4366 494 1512 -4076 2063 1385 -3186 3501 1027 -2401 4303 -17 -2094
3624 -2094 4230 -1710 -1984 3513 -3331 -1580 2870 -4314 -389 2546 -4333 1408 2443 -3722 3199
3639 3199 1988 -3119 4249 746 -2863 4322 -1176 -2752 3793 -3048 -2214 3207 -4138 -919 2996
$$ packed form
3533C597n832q54P504p090J652N962p861L776L729q020N444J155p425O627j165
3548A199o020P463l238l969P767m823j675P382o060N56O151o955K429M356p407
3563b844L978K316p268N242L33o374O322j447m899P026k985l020P111m351j219
3578b079O504n562M30N243o436J940L679o813L398K034o496M767N13n581N883
3593A424r68m251O547k492k821O505m018j365N819n359O2M791o245J549L669o571
3609c724L236K388o266M860J018n588O139o78m571O687k474l428O704m320k077
3624b094O324n940k74N497o844J751M450p184L925K935o879N741J035o165O921
3639C199j211n107P368l503l609P185n498j576O545o841Q34N421p345L219L915
$$ plain form
3654 2996 -4292 963 2927 -3788 2837 2398 -3305 3998 1150 -3143 4179 -737 -3123 3740 -2605
3669 -2605 -2693 3292 -3726 -1461 3234 -3930 407 3334 -3584 2228 2989 -3265 3372 1836 -3306 3619
3685 3619 19 -3510 3313 -1777 -3226 3109 -2937 -2157 3272 -3203 -394 3554 -2983 1356 3360
3700 3360 -2844 2456 2416 -3138 2745 752 -3574 2595 -946 -3574 2592 -1958 -2723 3052 -2274 -1201
3716 -1201 3653 -2214 426 3814 -2384 1423 3101 -2977 1821 1728 -3815 1852 207 -4151 2154
3731 2154 -841 -3583 3001 -1301 -2291 3970 -1454 -791 4463 -1964 308 3996 -2938 815 2734
3746 2734 -4103 1153 1249 -4684 1790 114 -4304 2912 -464 -3067 4159 -901 -1550 4811 -1635 -427
3762 -427 4484 -2883 188 3250 -4175 680 1767 -4889 1488 661 -4599 2788 47 -3423 4114
$$ packed form
3654B996p288N255J964o715O625m39n703P303k848m293P322m916k386O863o345
3669b605q8N985p018K265M695p164M337K927o918N812P61o254O637j536n142O925
3685C619l600l529O823n090j449O335o046P80N429o475K809L948o537M339K004
3700C360o204N300m0n554N883j993m326O169l541k628O166m550p65N775n326J073
3716a201M854n867K640L388o198L807J678o078M798r3n543N667j645m358O305
3731B154k995k742O584m302r90O261n424O63N254o427K272L688o934L753J919
3746B734o837N256R6n933O474j676m418P216l376k603P226n060o49O361o446J208
3762d27M911p367L071L062p425M855J087o656O377q27n260P387k741l470P537
$$ plain form
3777 4114 -454 -2009 4923 -1312 -952 4713 -2643 -373 3618 -4065 144 2263 -4844 1013 1226
3792 1226 -4674 2410 655 -3666 3840 161 -2410 4712 -694 -1447 4595 -2059 -915 3615 -3529
3807 -3529 -452 2382 -4441 331 1512 -4338 1720 1152 -3471 3188 757 -2350 4050 6 -1620
3822 -1620 4030 -1343 -1383 3260 -2750 -1149 2372 -3682 -430 1835 -3764 820 1721 -3154 2307 1617
3838 1617 -2394 3314 993 -2085 3502 -240 -2152 3058 -1775 -2154 2511 -2889 -1539 2376 -3247
3853 -3247 -281 2566 -3000 1254 2608 -2595 2502 2037 -2583 2955 740 -2842 2856 -890 -2967
3868 -2967 2583 -2186 -2388 2672 -2745 -1080 3054 -2722 566 3218 -2569 1902 2709 -2750 2524
3883 2524 1435 -3219 2587 -225 -3435 2597 -1593 -2989 2838 -2279 -1748 3383 -2402 -92 3716
$$ packed form
3777D114m568j555O932o235L60N665p356K270L991p683M209K119p107N857K13
3792A226n900P084j755m321P506l679k571P122n406p53O042o654J144M530p144
3807c529L077K834o823M772J181n850O058n68m623O659k431l107O400m044j626
3822a620N650n373m0M643o010J601L521o054L252K265n599M584R01m875N461o90
3838A617m011N708k321l078N587l742j912N210m833l79M665n400J350L915n623
3853c247K966K847n566M254J354n203N097m65m620N538k215l582N698l746k077
3868b967N550m769k02N060n417J665M134n776L288K652n787M471Q07n459N274
3883B524j089m654N806k812l210O032m190j396N827n117N31N131n785K310L808
$$ plain form
3898 3716 -2520 1298 3263 -2889 2001 2016 -3489 2209 392 -3817 2316 -979 -3447 2785 -1723
3913 -1723 -2218 3419 -1949 -611 3776 -2099 710 3450 -2524 1444 2318 -3208 1648 796 -3671 1788
3929 1788 -471 -3386 2256 -1096 -2371 2961 -1284 -967 3485 -1420 164 3342 -1924 690 2440
3944 2440 -2744 812 1228 -3376 954 210 -3390 1522 -243 -2677 2426 -311 -1551 3220 -483
3959 -483 -656 3363 -1082 -294 2824 -2111 -196 1895 -3055 -36 1064 -3367 696 746 -2905 1792
3975 1792 719 -2093 2824 485 -1390 3279 -285 -1155 2959 -1499 -1145 2255 -2640 -880 1708
3990 1708 -3196 -76 1493 -3045 1212 1543 -2497 2438 1290 -2001 3159 414 -1878 3129 -901
4005 -901 -1929 2713 -2265 -1675 2278 -3080 -787 2228 -3136 639 2301 -2825 2067 2008 -2503 2974
$$ packed form
3898C716o236L818J965o152M890J5n505N698j817m209O133l295k468O232m508
3913a723m95N637n368J338M387n875K809K740n974L968Q74n526M856q52m467N459
3929A788k259k915N642l352j275N332m245L17M452m905J584L178n266K614J750
3944B440n184L556M16m604M330p44l600M912j765k434N103k737j240M771l703
3959d83j73M019m445P88L118m935J915K091m950L019J100m431M063N0l651M697
3975A792j073k812M917k339j875M669l564q70M114m458L54L400m895J760K588
3990A708m904L120J569m538M257L31m040M935j148l291N160k745k292N007m030
4005i01j028M642m978N90L953n358K293L015n364L775J662n126M892n9m511N477
$$ plain form
4021 2974 1066 -2436 3110 -371 -2490 2831 -1881 -2253 2519 -2786 -1295 2499 -2937 139 2639
4036 2639 -2678 1628 2359 -2427 2591 1494 -2463 2746 76 -2622 2505 -1331 -2512 2297 -2241
4051 -2241 -1706 2460 -2475 -362 2704 -2266 1002 2677 -2170 1896 1983 -2408 2115 740 -2839 1963
4067 1963 -545 -2927 1987 -1401 -2346 2368 -1710 -1166 2908 -1643 93 3100 -1709 965 2614
4082 2614 -2196 1271 1529 -2876 1266 345 -3203 1449 -486 -2851 2062 -843 -1860 2832 -867
4097 -867 -714 3297 -1172 56 3078 -1873 405 2208 -2832 488 1148 -3496 921 347 -3401 1766
4113 1766 -1 -2589 2867 -155 -1595 3622 -670 -825 3661 -1694 -429 2977 -2888 -152 1988
4128 1988 -3761 481 1210 -3854 1556 752 -3211 2854 428 -2225 3791 -243 -1449 3930 -1379
$$ packed form
4021B974j908l502N546l481k119N321m712l72M772n305J491L794n436L076K500
4036B639n317M306P31m786N018j097l957N209k670k698N127l836j181M809m538
4051b241N35M166m935K113L066m970L268J675m847M066Q7m391M523j375l579M802
4067A963k508k382M914l388r45M714m078N44M074m551J736L007m809K674J649
4082B614m810L467K58m405M142r21l548M652j935k365M913k905j017M692l699
4097h67J53M011m469J228L022m951K278J803n040L320O60m644M417n74l748N167
4113A766j767k588N456l022j440N217m292j55M486n355J265L406n865K736K140
4128A988n749M242P29n064N410q04l963O065k426k653O016m034j206N379n309
$$ plain form
4143 -1379 -1013 3319 -2756 -644 2327 -3725 38 1569 -3931 1169 1154 -3303 2561 831 -2399 3575
4159 3575 191 -1701 3804 -984 -1344 3288 -2353 -1064 2490 -3371 -450 1844 -3693 672 1597
4174 1597 -3238 2071 1428 -2506 3166 839 -1981 3499 -290 -1796 3097 -1674 -1702 2471 -2800 -1189
4190 -1189 2072 -3215 -133 2013 -2872 1265 1970 -2382 2371 1519 -2083 2796 539 -2115 2629
4205 2629 -825 -2258 2208 -1954 -1908 2087 -2453 -970 2312 -2361 371 2564 -2058 1537 2336 -2140
4221 -2140 2157 1459 -2500 2183 118 -2925 2089 -1096 -2782 2250 -1794 -1927 2757 -1983 -571
4236 -571 3300 -2076 722 3216 -2369 1512 2333 -2994 1798 954 -3572 1959 -416 -3489 2380 -1268
4252 -1268 -2617 3055 -1592 -1218 3665 -1828 164 3675 -2278 1044 2844 -3059 1412 1431 -3700 1669
$$ packed form
4143a379L66M332o075K112K971o052L763J531n500N100j5m457N864j730l230N974
4159C575l384j892N505m788l60M632n641J289L554n861K921K294n537M365R25
4174A597m835N309o43l934N672k327k820N480l789j506M893m771k8M173n271J611
4190a189L261n287L082K146m885M137P05m352M753q52l602M879k257k654M744
4205B629l454j433M466m162M6L995m540J483L282m673K732K193m622L595P99m476
4221b140M297o98l959M683k065l043N014l185j686N032m044j33M684m740J412
4236e71L871n376K798K494n585L881Q21n327M792q44m526N531k375l073N869l648
4252a268j349N672m647L74M883n493J992L511n953L322J800n903M471J9n131N369
$$ plain form
4268 1669 56 -3724 2206 -810 -2946 3042 -1222 -1642 3737 -1505 -300 3829 -2077 549 3113
4283 3113 -2965 929 1816 -3759 1235 571 -3879 1873 -234 -3210 2787 -637 -2004 3607 -941
4298 -941 -805 3816 -1553 -25 3223 -2515 321 2076 -3349 565 957 -3643 1195 318 -3144 2128
4314 2128 61 -2119 3038 -154 -1143 3397 -737 -609 3059 -1740 -441 2195 -2733 -295 1391
4329 1391 -3225 292 986 -3020 1330 910 -2337 2457 778 -1680 3136 136 -1364 3090 -975
4344 -975 -1377 2552 -2197 -1248 2014 -3009 -593 1776 -3103 653 1827 -2708 1912 1651 -2227 2817
4360 2817 982 -2104 3051 -308 -2142 2685 -1665 -1997 2317 -2657 -1279 2309 -2939 -13 2393
4375 2393 -2694 1448 2324 -2440 2491 1626 -2431 2841 261 -2603 2703 -1222 -2560 2525 -2313
$$ packed form
4268A669j613l780N930l016k136N988m264m20N379n242J205M129n906K626K564
4283C113o078L894Q87n575M994o64m450N752k107k976N997l424j367N611m548
4298i41J36M621n369J528L248n738K836J755n425L914L92m600M838q77l462N272
4314B128k067k180N157l192r89M540m134J28L668m799J299K636m928K438J686
4329A391m616L517O94m006M350m20l247M794j679k458M816l000j500M454m065
4344i75m02L929m749R49L262n023K416K369m879L756J174m535M620k61l878N044
4360B817j835l086N155l359j834M827m350l32M314m974J378L588n248K926K406
4375B393n087M142Q76m764M931q65m057N272k580k864N306l925j338N085m838
$$ plain form
4390 -2313 -1850 2584 -2744 -532 2798 -2680 979 2739 -2592 2108 2093 -2666 2588 742 -2925 2556
4406 2556 -721 -2925 2476 -1864 -2275 2636 -2313 -1005 2933 -2273 476 3022 -2235 1557 2419
4421 2419 -2407 1994 1239 -2808 1941 -156 -2949 1963 -1195 -2474 2198 -1602 -1415 2705 -1593
4436 -1593 -156 2966 -1627 833 2642 -2021 1193 1710 -2596 1186 512 -3080 1321 -398 -2880
4451 -2880 1812 -733 -2030 2577 -793 -966 3167 -976 -90 3117 -1615 271 2387 -2469 379
4466 379 1374 -3197 627 576 -3242 1351 147 -2635 2338 47 -1703 3216 -318 -955 3349 -1097
4482 -1097 -562 2841 -2223 -383 1969 -3171 -3 1239 -3474 853 898 -3068 2113 691 -2255 3132
4498 3132 242 -1546 3579 -725 -1219 3274 -2030 -993 2561 -3178 -488 1871 -3642 535 1520
$$ packed form
4390b313M63M434n328K212L330n478L659J760n331M700j5m759N254j846l667N481
4406B556l277k204N401m340m11M911m949J308L938n206K749K546n257L792Q62
4421B419m826M401p55m047M749k097k793M912l158j279M672l800J87M120m298
4436a593J437L122m593K460J809m663L214N17m306L782o74l592M401j719k482
4451b880M692k545j297M607l370j73M133m143Q86L207m732J886K116m856K848
4466C79R95m571L824n1l818M593j204k782M973k291j750M919l534o37M304m446
4482a097N35L403n064J840K352n140L168J242m713M327M5l966N181j422k946N387
4498C132k890j788N125m304m94M493n304J037L554n739K690K359n513M177R85
$$ plain form
4513 1520 -3386 1925 1277 -2652 3116 761 -2047 3645 -353 -1730 3363 -1780 -1499 2739 -2960
4528 -2960 -979 2116 -3506 88 1786 -3272 1508 1591 -2631 2695 1168 -2048 3251 160 -1852
4543 -1852 3070 -1196 -1779 2504 -2410 -1394 2104 -2961 -409 1977 -2851 865 1997 -2438 2086
4558 2086 1680 -2100 2701 791 -2133 2674 -482 -2258 2330 -1719 -2046 2111 -2364 -1230 2248
4573 2248 -2403 72 2507 -2161 1263 2422 -2099 2011 1642 -2350 2094 348 -2718 1963 -887
4588 -887 -2671 2018 -1599 -1977 2417 -1786 -793 2876 -1786 498 2953 -1925 1263 2331 -2473 1551
4604 1551 1143 -3117 1621 -132 -3261 1964 -974 -2704 2632 -1341 -1507 3372 -1568 -206 3589
4619 3589 -1969 701 3038 -2772 1187 1799 -3540 1446 498 -3771 1972 -497 -3223 2790 -970
$$ packed form
4513A520m906N311o48l929N768k355k808N692l998j377N093n143K81M238n699
4528b960J981L095n622L594J698n058M780Q3m222N326j527l216N299l091k012
4543a852M922m266n83M283m914J016L498n065K552K386m828L716J132m435M524
4558B086m06l780M801j910k924M807l156j776M588m049l27M157m475J134L478
4573B248m651K475K435m668L424J159m521M110l69l992M444j746l066M681k850
4588h87j784M689l617l78M394m203R93L669m662K284K455m878L188J068m804M024
4604A551m08m260M738j753l129N225k938j730N336l973j66M879m940J362L795
4619C589n558K670K337n810L959O12n339M986r48m269N743k469k726O013l760
$$ plain form
4634 -970 -2021 3607 -1309 -663 3894 -1849 325 3308 -2718 794 2110 -3576 1134 783 -3866 1682
4650 1682 -146 -3314 2553 -615 -2165 3418 -916 -914 3764 -1476 -50 3317 -2394 408 2240 -3260
4666 -3260 698 1067 -3668 1304 275 -3320 2200 -94 -2311 3146 -382 -1236 3621 -943 -495 3286
4682 3286 -1901 -194 2347 -2892 40 1348 -3381 583 772 -3181 1525 508 -2375 2560 338
4697 338 -1480 3141 -186 -962 3034 -1157 -846 2346 -2183 -735 1610 -2886 -216 1217 -2874 802
4713 802 1217 -2357 1940 1112 -1746 2747 596 -1521 2847 -445 -1559 2445 -1725 -1518 1973 -2606
4729 -2606 -965 1823 -2861 171 1921 -2590 1532 1847 -2211 2491 1243 -2062 2858 74 -2157
4744 -2157 2629 -1329 -2131 2287 -2337 -1474 2193 -2716 -257 2334 -2537 1180 2252 -2260 2229
$$ packed form
4634i70j051N628m916O46M557n743K174K983o026L512J316n686M710l51m649N548
4650A682j828l168N867l168j550N583m334KM678n240J426L367n711K802J832n500
4666c260L958L69m735M972j029l595N520k294k217N457l528q54M857m564M48L781
4682C286n187J707K541n239K932J308m729L964J89l953M706j017k883M935k222
4697C38j818M621l327p76L996m191L11L192m529J448K345m496K670J433m091L676
4713H02M15l574M297q28k858M493k151k117M368l292j114M004m170K07L491m579
4729b606J641K788m684L032J750m511M122L15m058M702j248l305M920k784k231
4744b157M786l958q02M418m624Q63L667m909K459K591m871L717J072m512M489
$$ plain form
4759 2229 1644 -2213 2584 431 -2393 2430 -990 -2348 2216 -2030 -1760 2224 -2429 -583 2441
4774 2441 -2331 808 2463 -2164 1855 1891 -2229 2281 743 -2499 2207 -607 -2551 2054 -1634
4789 -1634 -2030 2157 -2025 -927 2488 -1944 412 2598 -1832 1360 2118 -2019 1735 1123 -2354 1667
4805 1667 -114 -2517 1552 -1033 -2160 1757 -1368 -1259 2202 -1272 -133 2463 -1215 710 2245
4820 2245 -1526 1004 1449 -2065 942 404 -2500 962 -349 -2367 1373 -625 -1663 2034 -624
4835 -624 -732 2565 -707 -26 2574 -1229 277 1994 -2006 307 1074 -2631 497 359 -2711 1097
4851 1097 77 -2169 1938 -12 -1344 2644 -234 -669 2796 -910 -363 2304 -1867 -256 1503
4866 1503 -2609 59 885 -2809 751 571 -2385 1704 459 -1639 2547 132 -1005 2853 -602
$$ packed form
4759B229n85l857M797k153k824M823l420j358M564m246K70L984m653J846L024
4774B441m772L139J655m627M019L6m120M510j538l242M706k814j944M605l688
4789a634l96M187m182J098L415m432K356K186m430L192P58m137L754o12l477M021
4805A667j781k403M069k585j127L917l125J09L461l474J139K596l678J925J535
4820B245l771K530M45l514L007n38k904L462j311k018L740j998j038L697k658
4835f24j08L297l272O81K600l803J506J717m000K313P67l705L128j38l070L808
4851A097j020k246M107j950j332L988k878m35L465l706N47K667m171J611J759
4866A503m112K668Q26l694L560j80k956M089j245k098M186k415j137L858l455
$$ plain form
4881 -602 -766 2474 -1645 -642 1767 -2526 -260 1184 -2823 492 907 -2487 1557 778 -1867 2472
4897 2472 405 -1333 2780 -367 -1050 2496 -1437 -911 1896 -2320 -588 1343 -2691 190 1125 -2369
4913 -2369 1215 1046 -1760 2057 747 -1270 2441 55 -1129 2123 -916 -1144 1621 -1792 -927 1214
4929 1214 -2108 -260 1176 -1911 669 1260 -1462 1498 1118 -1203 1869 552 -1274 1776 -406
4944 -406 -1456 1378 -1237 -1412 1230 -1649 -848 1371 -1561 33 1684 -1329 912 1724 -1251 1407
4960 1407 1182 -1478 1405 278 -1834 1201 -637 -1875 1221 -1096 -1455 1560 -1183 -582 1987 -1085
4976 -1085 321 2096 -1154 875 1653 -1573 974 823 -2088 957 -97 -2242 1162 -637 -1837
4991 -1837 1652 -873 -1004 2189 -887 -74 2415 -1141 516 2033 -1726 777 1225 -2296 908 307
$$ packed form
4881f02j64L240m119J003K409m293K266J444m007L315M15l394M044p79k645M339
4897B472k067j738M113l147o83L546l933N26K807m216J732J931m034K881R35l494
4913b369L584j69k806L817j310k017L711k386j184L252l039k28K765l413Q65K141
4929A214l322J848J436l087K580N91k722K960l80k321L072j317j826L050k182
4944d06j050K834k615j75K642k879Q01K219k932J594J651l013K241Q12k975K658
4960A407k25k660K883j127k112L035j838j238L096k317l59L015k743O01K569l072
4976a085J406J775l250K029P78l226K547j51k911L045j054k145L404j799j200
4991a837L489k525j31L193l076Q13K489l556J657J517l759K503M48l521L204o01
$$ plain form
5007 307 -2551 1144 -359 -2177 1717 -656 -1325 2330 -757 -422 2627 -1066 244 2223 -1658 481
5023 481 1420 -2275 613 481 -2530 930 -95 -2195 1499 -331 -1393 2145 -407 -527 2409 -696
5039 -696 -26 2149 -1293 184 1384 -1933 236 691 -2261 555 168 -2065 1159 46 -1403 1842
5055 1842 8 -723 2204 -277 -334 2047 -937 -269 1480 -1650 -266 886 -2093 10 525 -2008
5071 -2008 701 533 -1531 1443 528 -968 1958 271 -704 1936 -395 -756 1546 -1203 -819 1102
5087 1102 -1753 -516 872 -1825 160 977 -1505 1048 1047 -1129 1623 790 -1065 1764 59 -1207
5103 -1207 1552 -851 -1260 1271 -1564 -1009 1251 -1788 -221 1396 -1632 720 1472 -1424 1481 1155
5119 1155 -1395 1767 379 -1582 1695 -608 -1646 1490 -1444 -1299 1515 -1700 -504 1644 -1616
$$ packed form
5007C07k858L695j503j818L894k373o69L655l087L35L049l693J310J979l881K139
5023D81R39l695K888j32l011L460j025k100L694j830j062L538k552j20K936l105
5039f96O70K175l442J477J200l317K169M55k952K816l87k233L224j113j449L245
5055A842j834p31K927k481n7K381k984O68J749l130J384J152k979K103N15k533
5071b008K709j68k064K974r15j496K926j687r75K640k331l61K302k749L84J921
5087A102k855J237J388k697J985Q17k482K553jk176K752q33j855K829j705j266
5103a207K759k403m09K531k835N55K260l039J567J617l028K352P52k896K905l26
5119A155k550L162j388j961L277k303j038L136k934J45K814l215J196K148l260
$$ plain form
5134 -1616 524 1704 -1439 1321 1394 -1490 1613 569 -1672 1527 -404 -1743 1352 -1172 -1444 1376
5150 1376 -1483 -669 1625 -1401 303 1740 -1239 1048 1496 -1319 1337 729 -1586 1277 -161 -1748
5166 -1748 1151 -874 -1519 1253 -1193 -844 1536 -1094 39 1779 -1015 721 1586 -1135 951 962
5182 962 -1470 893 152 -1756 786 -479 -1644 930 -686 -1083 1381 -607 -324 1682 -531 268
5198 268 1666 -758 442 1185 -1230 355 490 -1629 323 -12 -1649 622 -179 -1292 1142 -140
5214 -140 -683 1649 -170 -185 1748 -493 -32 1428 -1109 -75 864 -1686 19 410 -1880 416 223
5231 223 -1592 1097 243 -1054 1695 112 -571 1933 -355 -408 1667 -1031 -360 1157 -1672 -205
5247 -205 714 -1910 277 538 -1633 961 524 -1148 1597 350 -740 1851 -125 -597 1628 -856
$$ packed form
5134a616K140J180l143K760P3k884L103j044k241L199j931j339L095k524k72K820
5150A376k859Q14K294l026J704J437k979K287M48k815K656o08k315K863j438j587
5166a748K899k025o45K772k446L49K380k630J133J740k794J736Q65k721K086J1
5182I62k432K363p41j908K542j265j165K574j616l97K464j988K83K006k213P99
5198B68J398k424J200P43k415J585J35k119J952l35j637K271q01j113K434j282
5214a40n43K332j819j5J933k241M61J460k537J034R39k550J705L91k290K296j93
5231B23j815K689q54j297K749j583o83K504k288n3K075k698O71J517k829J467
5247b05R19k624K187K61k171K594m37j672K745j247j090K591j976m72K225k484
$$ plain form
5263 -856 -579 1136 -1519 -417 763 -1783 49 641 -1582 748 636 -1135 1411 499 -788 1715
5279 1715 67 -687 1518 -638 -729 1104 -1305 -565 776 -1569 -166 722 -1410 520 768 -1031
5295 -1031 1123 718 -708 1372 320 -708 1245 -292 -835 874 -876 -796 627 -1149 -498 682
5311 682 -1016 71 856 -739 655 953 -595 943 693 -706 835 118 -966 618 -436 -1083
5327 -1083 533 -730 -852 741 -698 -333 1090 -512 234 1236 -479 538 1069 -790 539 551
5343 551 -1177 497 -19 -1413 515 -371 -1222 845 -447 -737 1278 -402 -146 1499 -467 205 1340
5360 1340 -817 281 850 -1264 274 275 -1541 376 -99 -1428 808 -177 -935 1253 -192 -385 1568
5377 1568 -329 -1 1462 -736 110 1009 -1280 127 467 -1606 287 92 -1489 748 -41 -1023 1255
$$ packed form
5263h56K77J715k655J102J180k546J832N92k223K330j12j771K546r12j287K503
5279A715j648p54K205k156r1J833k409P40J341k345J403Q88k132J930K48j799
5295a031K154m05j426K080j052j028J953j537n43J709j750Q0J423j776O51J180
5311F82j698J087P85j595J394K98j548J538k50j399J541p17j084J584j054o47
5327a083J616j263j22J593j439L65J423j602P46J002j715J017N31j859J329J2
5343E51j728J674n16j394J928q86q51K067j292k90K015j680K56J645j966O72J135
5360A340k157J098N69k114J538Jj816J917m75j329K236r85p58K188j445j93J953
5377A568j897L28J463k198Q46Q99k289J407L40k073J893j95j581K237p89r82K278
$$ plain form
5394 1255 -29 -551 1571 -229 -154 1494 -655 -66 1042 -1165 -46 560 -1536 130 231 -1426
5410 -1426 514 180 -1042 1028 182 -587 1377 81 -305 1359 -325 -269 989 -864 -330 590 -1211
5427 -1211 -229 390 -1220 143 421 -930 689 483 -648 1089 404 -451 1164 35 -530 937 -500
5444 -500 -639 687 -990 -572 565 -1094 -209 662 -924 399 844 -716 877 776 -648 1061 350
5461 350 -808 959 -215 -984 746 -762 -936 747 -970 -512 941 -876 48 1127 -766 611
5477 611 1095 -819 831 691 -1006 855 59 -1228 783 -509 -1200 829 -785 -776 1098 -844 -126
5494 -126 1326 -751 471 1291 -876 769 860 -1165 861 227 -1397 812 -386 -1342 920 -730
5510 -730 -944 1169 -785 -290 1425 -774 339 1370 -861 642 974 -1130 692 349 -1399 654
$$ packed form
5394A255j284n22K122j800P5J648k149N89J108k207J119O06k096J666J01j657
5410a426J940l34j222K070q46p69J964j296l86J664j684N6J258j853N34R20j801
5427a211R82O19j610J363K78j351J619k06j131J737o85q55J615j129n65J467j437
5444e00j39J326j677M18J137j659Q85Q71j586J323M45j560J593j01j424J709p11
5461C50j158J767j174p69J730j508j74J683j717M58J453j817R24J079j893J377
5477F11M84j914J650j40j697J861p96j287K011j292o91K029j614RJ874j942P18
5494a26J452k077J222Q20k167J645R1k025K026o34j624K209j198r56K262j650
5510g30k14K113j954M95J715k199J113J031k231J503L32k104J822l43j748K053
$$ plain form
5526 654 -225 -1354 748 -506 -989 1041 -514 -402 1306 -496 87 1366 -608 390 1026 -874 398
5543 398 513 -1248 338 22 -1315 526 -251 -1030 803 -255 -565 1162 -224 -121 1316 -359 88
5560 88 1104 -745 98 654 -1144 60 232 -1327 242 70 -1146 613 89 -754 1061 133 -401
5577 -401 1283 -82 -204 1188 -489 -279 859 -990 -289 526 -1242 -99 436 -1218 374 444 -931
5594 -931 927 473 -632 1241 206 -526 1223 -287 -615 1000 -887 -596 730 -1264 -305 665 -1321
5611 -1321 258 687 -1063 880 669 -847 1274 393 -758 1337 -188 -753 1114 -821 -723 914
5627 914 -1253 -451 777 -1301 128 841 -1121 743 853 -843 1171 543 -780 1208 -25 -868
5643 -868 1026 -641 -868 821 -1035 -619 767 -1090 -76 878 -944 507 920 -781 932 684
$$ packed form
5526F54q79j129K102j254m83K030j555J12J708j802N83J279j974R98O36j900J272
5543C98J15j761J586l16j337J841p77p79J833j058l10J727j386J03J437j675M47
5560H8J016j849Q43N56j798J204J72j559J569j72j216J759n24q43J815r28n34
5577d01J684j365j22J392j677K10J138j849P01Q15j768J143N35j654J592P0j375
5594i31J858m54j105J873j035p32J749j510l28J615j887K91J326j994R59R70j986
5611a321J579M29j750J943k11j516K121q81j151K095j525n65J867j935R8J637
5627I14k167Q02J228k078J429P13j962J864J10j696K014o28j323J988j233q43
5643h68J894j667k27J689j856M16J386j857J014R54j822J451M13j701J713k48
$$ plain form
5659 684 -773 1033 196 -877 872 -391 -954 744 -784 -762 782 -907 -304 921 -771 270
5675 270 1043 -662 636 876 -715 773 439 -898 632 -86 -1077 524 -463 -983 645 -569 -622
5692 -622 909 -468 -96 1120 -425 262 1081 -607 393 771 -927 327 289 -1189 328 -55 -1184
5709 -1184 582 -191 -882 931 -216 -424 1281 -258 -56 1321 -527 93 1030 -992 93 603 -1330
5726 -1330 238 189 -1440 539 23 -1139 1007 -37 -700 1416 -172 -321 1490 -509 -144 1213
5742 1213 -1012 -44 824 -1422 91 441 -1526 433 223 -1277 973 156 -845 1396 9 -451
5758 -451 1508 -389 -331 1281 -890 -263 905 -1365 -80 558 -1515 272 354 -1292 803 305 -899
5775 -899 1274 165 -542 1459 -206 -433 1270 -753 -376 915 -1208 -295 626 -1387 91 516 -1265
$$ packed form
5659F84j457J806q37j073J749j263n63J698j528K2J544j689O03J225j692J041
5675B70P73j705J298K40j591J488l34j337J530p18r91J601r87n20J628j214n3
5692f22J531j377L72J216j545O87Q19j688J000L78j698J254l8j478J517l83j129
5709a184J766p73o91J813j147k08J705j539K02J377j848O20R37k022J085N10j933
5726a330J568m9j629J979n16j162K146j044o63K116j588j49J811j999L65J357
5742A213k225R68Q68k246J513L50j967J959k10j500K250q17j001K241j387m60
5758d51J959j897N8J612k171O27J168k270J285O38k073J787Q2j646K095m98j204
5775h99K173j109p07K001j665k27J703k023L77J291k123R13R21k013J478M25j781
$$ plain form
5792 -1265 585 485 -913 1067 421 -643 1251 83 -595 1103 -409 -651 867 -899 -602 654
5808 654 -1133 -300 677 -1050 211 746 -827 727 743 -725 982 439 -767 1004 -50 -898 823
5825 823 -580 -932 771 -920 -638 855 -964 -101 1069 -830 453 1084 -841 830 804 -986 914
5842 914 253 -1173 873 -369 -1256 900 -770 -994 1061 -908 -390 1293 -847 239 1359 -911
5858 -911 666 1066 -1086 789 500 -1396 787 -118 -1436 899 -543 -1130 1151 -711 -598 1434
5874 1434 -766 11 1542 -884 481 1259 -1134 680 667 -1468 726 40 -1594 860 -440 -1330
5890 -1330 1149 -629 -764 1464 -715 -116 1620 -837 315 1345 -1166 524 766 -1451 585 173
5906 173 -1584 742 -203 -1373 1013 -366 -846 1374 -423 -288 1542 -544 59 1373 -873 190
$$ packed form
5792a265J850j00j398J980o46j064J894j168o78J698j512k42J518j766K97J256
5808F54j787Q33R77j727J261N35j573J554J6j468J707n43j206J771j054q48J721
5825H23j403l52J703j691K82J493j819Q63J170j899J283O31j925J671k6j790J900
5842I14o61j426K046j242q87K156j670k24K055j969N18J683k140J086J120k270
5858i11J577M00k152J875k89j896K183r05j318K335j442n87K281j862J13K032
5874A434k200P77J531k426J365P78k393J814j3k135K194o86j634K454j300q90
5890a330K479j778j35K228k179N99J736k457J152J030k511J690K42k217K036m12
5906A73j757K326r45j170K386j379m80K220j797J35J830k086O03J314k246J063
$$ plain form
5922 190 899 -1286 224 415 -1519 406 70 -1382 756 -59 -995 1187 -75 -540 1475 -273 -221
5939 -221 1411 -656 -140 1073 -1156 -96 646 -1474 110 388 -1484 545 303 -1149 1101 285
5955 285 -797 1453 50 -558 1513 -380 -506 1262 -1018 -446 939 -1463 -201 713 -1518 291
5971 291 654 -1333 903 602 -1039 1391 345 -827 1530 -175 -819 1366 -865 -750 1107 -1360
5987 -1360 -441 941 -1533 104 900 -1394 856 837 -1177 1355 536 -1021 1530 -47 -967 1434
6003 1434 -812 -912 1245 -1340 -583 1032 -1542 26 1022 -1453 728 933 -1203 1267 690 -1042
6019 -1042 1467 63 -1070 1324 -615 -1038 1131 -1135 -760 1016 -1316 -188 1078 -1218 473
6034 473 1058 -1029 978 809 -983 1187 303 -1042 1107 -367 -1139 965 -862 -917 964 -1035 -399
$$ packed form
5922A90P09k185J510J91j934J925l36j452K138q15r36K182j262m65K015j748N2
5939b21J632k067N16J213k229J060P42k120J584K78j872K029k42j452K250q16
5955B85j082K250j403o08K071j893j26J768k280N72J385k402J262R14k231J809
5971B91L63j987K236l01j641K430j046j172K357j705o44K185k231J15J857k467
5987a360R19J382k474J637P96k294K250j9k014K532q19j557K551j577r20K401
6003A434k246j00K157k585P57J615k574J568R96k475K181K05k136K470n77j732
6019a042K509j404j133K394j939m23K169k266L75J776k332J128J266k296J691
6034D73N85k087K007j69j792K170q84j345K149j474p72K104j827n5J881j999O36
$$ plain form
6051 -399 1087 -1003 224 1188 -884 708 999 -906 889 528 -1105 873 -45 -1270 803 -536
6067 -536 -1133 900 -744 -710 1128 -705 -133 1326 -692 322 1247 -841 542 868 -1107 583 328
6084 328 -1358 601 -166 -1356 801 -370 -998 1141 -424 -485 1410 -508 7 1453 -792 224
6100 224 1087 -1188 335 624 -1495 454 92 -1544 738 -139 -1234 1170 -249 -688 1551 -414
6116 -414 -229 1612 -725 82 1309 -1187 199 787 -1530 363 291 -1581 706 65 -1329 1143 -97
6133 -97 -797 1492 -254 -363 1566 -586 -114 1286 -1036 -23 825 -1434 137 415 -1489 462 167
6150 167 -1276 917 93 -843 1338 -60 -446 1459 -344 -236 1241 -809 -216 854 -1220 -68
6166 -68 509 -1382 216 345 -1173 698 323 -855 1141 240 -583 1300 -74 -459 1130 -548 -461
$$ packed form
6051c99J486k090J227R64k072J592K91j905J795l61j633J978r18j225K073j339
6067e36n97K033j644L4J838j833N72J459k018J014R25k088J383L26j975J690k55
6084C28j686J959p67j190K157j171o28K139j565o1J895j918N15J446k245J016
6100B24Q63k275J523K89k119J949l62j636K282q77j095K404j419m39K239j965
6116d14J85J841k337Q07J227k496J386N88k317J893p2j872K287o41j394K472j240
6133i7p00K289j746j09J929k152M72J400k322J013Q48k259J571K78j904J951k95
6150A67j443K193q24r36K181j398l86J905j803J08J477k050N93J070k074J152
6166f8N77j891J598J29j518J871l75j178J996r01q23J883j374l85J589j678Q7
$$ plain form
6183 -461 831 -972 -411 589 -1176 -117 532 -1053 311 603 -834 796 613 -634 1035 304
6199 304 -634 978 -155 -743 840 -618 -741 704 -890 -483 757 -921 -4 901 -816 541 889
6216 889 -783 833 637 -862 903 94 -1041 857 -438 -1037 808 -810 -753 951 -920 -226 1128
6233 1128 -853 340 1172 -851 737 881 -1044 838 326 -1207 798 -219 -1216 885 -607 -951
6249 -951 1020 -775 -423 1266 -752 145 1277 -799 557 1013 -1007 663 489 -1237 660 -78
6265 -78 -1317 764 -436 -1079 961 -594 -552 1242 -628 -39 1336 -719 334 1152 -941 496 617
6282 617 -1219 535 125 -1321 646 -249 -1161 882 -352 -684 1166 -390 -195 1322 -474 72 1161
6299 1161 -761 180 807 -1084 189 327 -1292 321 60 -1232 590 19 -879 993 -22 -473 1239
$$ packed form
6183d61J292j803N61J000j765J059O49j585J364K92j437J630j83j247J669p31
6199C04r38J612j133n88J583j458j23J445j594M07J240j678R17R05j717J357L48
6216H89j672J616j96j499J765q09j135J898j295n99J845j618N7J704j871O94J354
6233A128j981J193Q32k023J588J44j925J882n12j533K005j017r97K101j492l44
6249i51J971j795L52J689k018Q97J132k076J356M56k020J670j74j726J897p38
6265g8j239K081j200o43K040j555M2J794j870N89J375k055J053Q18k093J437J21
6282F17j836J754m10j446J967q95r12K043j234l32J850j556J95J517j796N46J089
6299A161j922R41O27j891J273J38j619J613k61j292J822n71q98J872j015m51J712
$$ plain form
6316 1239 -155 -199 1243 -492 -163 966 -970 -126 602 -1267 47 368 -1294 437 305 -1082 930
6333 930 285 -745 1328 79 -505 1395 -359 -474 1150 -900 -436 848 -1315 -197 664 -1436
6349 -1436 262 599 -1234 849 491 -957 1231 328 -764 1396 -184 -722 1249 -793 -673 1027
6365 1027 -1256 -449 849 -1412 85 793 -1250 700 787 -997 1199 453 -876 1366 -45 -860
6381 -860 1272 -657 -812 1070 -1214 -557 958 -1397 -39 915 -1277 622 854 -1101 1147 621
6397 621 -943 1306 78 -944 1200 -523 -916 1031 -1002 -691 919 -1167 -206 946 -1085 387
6413 387 1003 -900 837 825 -846 1023 374 -969 941 -223 -1060 797 -667 -911 815 -880 -504
6430 -504 966 -828 50 1123 -751 538 1022 -811 749 581 -1016 733 52 -1213 686 -402
$$ packed form
6316A239j394m4J442j735L29J129j936Q44P28j869J314L21j662J731j32j387K012
6333I30o45j030K073j249n84J900j754j15J624k050M64J284k163J118Q61k100
6349a436J698L37j833K083l58j448K188r03j092K160j580n38J971k042J20J700
6365A027k283Q07J298k261J497P08k043J950Q7j784K196p46j329K242j411q15
6381h60K132j929j55J882k284O57J515k355J358R54k192J899K32j955K248n26
6397F21j564K249j228j022K144j723l93J947k033L11J610k086R61J152k031J472
6413C87O16j903J737j2j671J869o49j343J910j164q37J857j464k44J726j695L76
6430e04J470j794Q78J073j874J289M84j833J560j68j597J749o81j265J899j088
$$ plain form
6446 -402 -1116 848 -622 -738 1073 -638 -201 1275 -634 273 1266 -788 466 900 -1105 524 331
6463 331 -1363 578 -114 -1343 783 -378 -1029 1116 -412 -498 1422 -517 -69 1463 -764 231 1113
6480 1113 -1124 273 582 -1453 413 142 -1475 733 -122 -1185 1174 -238 -617 1523 -400 -198
6496 -198 1536 -705 61 1235 -1160 178 734 -1501 378 236 -1572 667 -16 -1252 1133 -135
6512 -135 -772 1453 -294 -296 1497 -610 -56 1229 -1030 35 743 -1392 152 360 -1466 483 153
6529 153 -1194 892 91 -755 1292 -22 -398 1381 -343 -222 1146 -797 -196 769 -1180 -98 485
6546 485 -1305 220 324 -1131 699 295 -813 1077 199 -511 1212 -84 -430 1090 -580 -465 824
6563 824 -990 -370 604 -1164 -72 562 -1071 404 601 -810 880 546 -629 1110 240 -624 1022
$$ packed form
6446d02p14J964j470j16J811j711M37J476j909R07R93k054J254M34k005J629j93
6463C31j694J941o92j229K126j161o51K145j528q6J920j939M48J532k227R95Q82
6480A113k237J397L09k035J866k71j617K208q55j063K359j412l79K140j923K02
6496a98J734k241P66J174k395J338N56k235J879j42j808K239o83j236K385j268
6512a35o37K225j747kJ793k107N54J285k259J065P08k135J544K08j826J949l30
6529A53j347K086q01q46K047j314l76J779j724J21J368j943O01R65j949J082N83
6546D85j790J525J04j455J830m04j108J890q78p10J723j296l46J520j670J15J289
6563H24j814O20R74j768J092O34j633J475J97j411J690l34j175J739q70q64J646
$$ plain form
6580 1022 -254 -724 835 -726 -688 701 -975 -390 751 -985 148 867 -832 638 793 -761
6596 -761 943 473 -855 988 -39 -956 848 -575 -920 808 -892 -592 900 -956 -21 1024
6612 1024 -902 530 1005 -872 863 631 -944 953 104 -1068 879 -466 -1025 846 -778 -719
6628 -719 957 -881 -153 1067 -800 354 1075 -782 635 744 -955 743 233 -1089 716 -261
6644 -261 -1078 718 -613 -786 862 -645 -295 1064 -624 180 1051 -685 481 836 -815 553 394
6661 394 -1034 522 -99 -1076 594 -379 -872 792 -451 -432 1038 -396 -20 1111 -511 242 893
6678 893 -677 281 504 -983 271 118 -1104 365 -110 -949 596 -153 -615 928 -104 -266 1092
6695 1092 -183 -55 998 -513 -54 715 -831 -55 385 -1064 106 217 -1054 438 188 -779 838
$$ packed form
6580A022j276m70J559j561L8J389j676N85J141j736J133P19j699J470J55j554
6596g61J704m70j328J843j027r17J804j423l45J728j700L00J492j856R35J045
6612A024j926J432M75j877J735k32j575J897q49j172J947j345n59J871j624N9
6628g19J676j838P28J220j867J154P21j857J417J09j699J698n10j322J805r77
6644b61q17J796j331j73J648j507L50J359j688Q04Q71j736J166L55j651J368j59
6661C94j428J556o21r77J670r73m93J664j243J9J470j434L76J131j622P53O51
6678H93j570R58K23j487J254j53j222J469m75q39J545p49m62J543j032j62J358
6695A092j275J28J053j511M59P69j546P76M40j449J170J11j271J492k50r67J617
$$ plain form
6712 838 122 -491 1126 -32 -339 1097 -426 -307 848 -858 -232 578 -1129 -48 439 -1134 343
6729 343 392 -944 798 326 -650 1122 110 -493 1152 -308 -481 973 -776 -415 703 -1079 -191
6746 -191 576 -1126 223 554 -940 649 500 -739 1033 301 -599 1086 -123 -595 949 -618 -567
6763 -567 711 -980 -346 591 -1074 47 622 -920 551 590 -718 910 411 -634 1007 -5 -640
6780 -640 861 -492 -654 645 -814 -469 646 -904 -99 677 -782 366 742 -628 684 565 -599
6797 -599 767 201 -719 655 -232 -827 542 -543 -714 606 -651 -411 736 -572 48 899 -528
6814 -528 356 832 -603 518 499 -805 487 74 -960 506 -284 -897 618 -451 -606 852 -412
6831 -412 -174 1057 -478 197 1035 -612 345 757 -902 378 299 -1125 461 -55 -1130 635 -271
$$ packed form
6712H38p16o13J617j158l07J436j523J19J155j706O26Q10j707J081M87j573J477
6729C43M9j336J742m72r76J772j012o03J645j460j73J454j749L61J118j782Q88
6746a91P67j702J349L31j494J589j49j239J772p32r00J685j209m72J544j567N1
6763e67J278j691O34R37j665J121N75j542J471L9j308J628m99j045J641j012o35
6780f40J501j353j62J299j459L45J115j550Q05P76j459J148L76j370J312j19j164
6797e99J366n66r20J374q87n95J369j085j71J320j257K40J147j308O20Q51j427
6814e28Q84M76j435J121j9j304J292m13j034J466p90o13J515j069j55J458j264
6831d12K38J231j535O75Q38j647R57M12j659J280p9j424J586n16j075J765r06
$$ plain form
6848 -271 -826 891 -335 -414 1191 -403 -38 1198 -608 172 916 -927 236 498 -1199 329 100
6865 100 -1200 572 -75 -956 936 -151 -521 1218 -281 -149 1257 -558 43 972 -949 122 591
6882 591 -1219 279 213 -1258 538 6 -1019 894 -85 -637 1194 -218 -234 1241 -502 -74 998
6899 998 -837 1 608 -1129 89 312 -1180 378 143 -966 755 116 -624 1088 8 -339 1136
6916 1136 -234 -239 962 -628 -237 630 -945 -151 402 -1096 103 320 -941 514 347 -681 881
6933 881 283 -482 1018 -29 -423 907 -403 -451 706 -786 -361 532 -1001 -105 510 -890 354
6950 354 573 -726 731 497 -606 935 240 -604 905 -247 -666 775 -650 -616 668 -881 -355
6967 -355 717 -863 119 758 -761 549 746 -688 820 450 -727 831 -54 -876 768 -489 -785
$$ packed form
6848b71n55J717j226p9J605j594L65J236j806P80P44j843J163K62j697J528k29
6865A00j300J772o47q81J892j087l70J739j499J32J406j815O01R29j921J071M69
6882E91j810J498o6j471J796n32j025J913r79n52J831j412j6J475j743M28J072
6899I98j835Q38O07j737J218K23j492J558k35j109J721o39p40J712j080l47J475
6916A136j370nJ201j590L91Q67j575P94N53j498J199K17j261J455j67j028J562
6933H81n98p65J500j047l94J330j310m8J157j492M25Q93j533Q96O15j400J244
6950C54K19j299J457k34j103J541o95q44J509j152m19J441j425L4J284j549N26
6967c55J072j580R82O39j519J310J97j434J508l70j177J558q85q22J644j257k96
$$ plain form
6984 -785 721 -793 -490 826 -819 -9 902 -751 462 852 -737 776 526 -817 813 46 -938
7001 -938 770 -429 -883 718 -732 -538 832 -751 -77 920 -722 346 889 -707 632 578 -828
7018 -828 658 175 -915 615 -262 -917 613 -529 -638 741 -557 -225 913 -499 192 904 -531
7035 -531 425 713 -682 431 277 -884 416 -104 -912 465 -310 -721 652 -315 -379 844 -321 10
7053 10 916 -399 204 740 -622 202 428 -849 216 97 -920 292 -99 -806 545 -86 -512 829
7071 829 -86 -208 957 -224 -54 871 -477 -28 616 -778 2 336 -943 101 197 -909 403 161
7089 161 -657 722 117 -428 939 -60 -289 933 -380 -228 713 -730 -171 476 -977 -3 325 -960
7107 -960 320 276 -736 727 241 -531 949 55 -362 975 -280 -320 798 -679 -280 535 -933 -115
$$ packed form
6984g85J506j514L03J316j645Q10R11j653J213L90j589J513k50j343J630p67r84
7001i38J708j199m54J601j450J94J370j583O74R97j642J068N43j596J339n4j406
7018h28J486m83j090J530q77o55J530j142j09J379j298L32J138j412O91P12j435
7035e31R56K88j395J113j54j161J300n20q08J377p75m11J373r67o4J223j165L31
7053A0R06j315O03N36j362Q24K26j277J065j19j017J212l91p07J351o31m26J341
7071H29r15j22J165j181J70R25j348M49O44j394P80L34j279J044R6j106J312k42
7089A61q18J379o05n45J367r99k29J222j313J52R41j443N59O47j453R74L28j285
7107i60J280m4j012J463m86p72J480q94m17J337j255m0J118j477L99Q15j468Q18
$$ plain form
7125 -115 436 -924 220 403 -786 618 357 -581 840 194 -465 882 -169 -460 719 -513 -431
7142 -431 527 -790 -267 480 -806 88 482 -694 424 483 -514 666 330 -483 759 11 -539 638
7160 638 -380 -523 522 -605 -405 480 -648 -114 576 -586 249 604 -505 503 475 -501 577 223
7178 223 -576 501 -126 -673 448 -411 -587 482 -479 -337 644 -435 13 745 -404 282 695 -482
7196 -482 370 477 -662 368 153 -768 392 -134 -763 498 -274 -530 696 -308 -204 843 -333
7213 -333 59 855 -518 199 649 -739 238 304 -905 301 4 -896 485 -142 -685 752 -185 -379
7231 -379 955 -270 -89 932 -479 75 763 -734 137 436 -936 237 145 -971 465 31 -811
7248 -811 725 -59 -518 978 -148 -202 984 -391 -65 826 -693 8 520 -953 112 259 -970
$$ packed form
7125a15N51j360J144J83j189J404k61r38J421o46o59J347j051k91J179j232Q2
7142d31R58j317N23P47j286Q94L94j176J118N9r97J180l36q13J242p48n50J177
7160F38j018j43J045j127K00Q85j128N34O90j162Q35L55j109J008k8r76J078l54
7178B23p99J077o27n47J121q59j76J069r61J42R81j079M48P32j149O86M13j177
7196d82Q52J07j139J030k15r21J160n26o29J261p72k56J226j004J04J047j176
7213c33L92P96j373P17M50j388R77O6j209J206k97r00J381o27n43J437r37j94
7231c79J334j225J81J021j411N54O88j497Q71K99j372J173r2j116J436m34q42
7248h11J536p84m59J496j126n4J186j375L26Q91j519P01N12j473J065J47j229
$$ plain form
7265 -970 293 114 -841 626 61 -594 876 -20 -293 975 -270 -211 810 -550 -137 574 -810 -19
7283 -19 361 -906 209 238 -777 480 206 -580 755 134 -407 855 -54 -312 783 -377 -326 612
7301 612 -676 -270 478 -797 -74 431 -772 240 469 -628 567 388 -509 752 162 -471 750
7318 750 -183 -514 636 -505 -465 609 -700 -235 603 -715 65 645 -660 489 553 -608 688 356
7336 356 -660 734 -5 -720 668 -385 -664 653 -625 -443 701 -707 -60 768 -660 324 792
7353 792 -693 562 525 -754 669 144 -819 672 -244 -800 686 -545 -604 782 -635 -172 885
7370 885 -652 206 864 -640 512 642 -797 597 277 -908 625 -109 -876 639 -442 -653 785
7387 785 -523 -292 871 -559 132 878 -599 382 715 -704 485 349 -872 496 -31 -914 561
$$ packed form
7265i70J263j79r55J467n65o55J470q96k73J268j245N9J021j360M13P11j384P91
7283a9L80j267J115K9j015J257k74p86J335o21n41J262r09k58J095j160N1R38
7301F12j288M06P48j275P23N05j203J012K29j097J195j79q97J261n90o33J221
7318G50r33l31J150j141M0J074j309M65Q38j318P80N80j305J149O4j161J296l32
7336C56j016J394p39p15J388j053k79J317j278J82J144j408O47Q28j428R84M68
7353G92j485J255l7j279J423n25r63J491r16n56J486j231n9J386j417M63J057
7370H85j537Q58O58j504J152J30j439J394l20j185J533p34p67J515j081k11J438
7387G85j308K31J163j430O91P46j477R81L33j419J189j36j221J368n27q83J475
$$ plain form
7404 561 -278 -754 656 -337 -412 840 -396 -70 910 -453 195 784 -605 249 488 -817 271 156
7422 156 -939 348 -59 -776 530 -138 -564 797 -200 -263 893 -295 -32 849 -498 39 579 -774
7440 -774 110 340 -928 217 118 -879 482 47 -641 773 16 -400 992 -139 -244 936 -446 -144
7458 -144 747 -720 -94 514 -943 63 316 -963 345 238 -784 685 180 -555 954 24 -400
7475 -400 969 -307 -328 817 -628 -238 605 -919 -67 445 -945 253 381 -814 643 311 -629
7492 -629 920 127 -482 964 -233 -394 843 -622 -335 620 -838 -146 513 -910 200 435 -778
7509 -778 544 365 -632 819 233 -523 884 -73 -495 735 -440 -467 627 -711 -292 534 -795 1
7527 1 548 -723 362 537 -587 653 414 -522 720 95 -543 650 -256 -594 557 -515 -441 523
$$ packed form
7404E61q39m76J410r93p5J252j236L26R80j363O48N89j389Q54K39j305J088j15
7422A56j095J287m07p17J306o68m26J361r97o3J156j188K63Q81j347N37N40j353
7440g74Q84K30j268J145r9r97J361m35o88J414p57m16J392j131j05J180j382L02
7458a44Q91j467O26O08j457J006K53j279J308j07j022J469n05p35J509r30m24
7475d00J369j276k1J145j445L90Q43j524Q52N12j390J198J28j195J457l32r40
7492f29J549p93o09J446j197j61J237j465K87R55j458O92O59j423J110K35j213
7509g78J322j79r97J451n86p56J407r57m22J230j175k7J094j338M19Q26j329P96
7527AN47j271J085J75j124J240k39r36J242o25o38J193r06l38J151j072P4R64
$$ plain form
7545 523 -629 -149 614 -609 185 635 -535 469 534 -533 535 256 -618 524 -82 -705 489 -323
7563 -323 -640 539 -477 -366 687 -433 -30 760 -452 226 686 -553 399 504 -697 371 178
7580 178 -836 414 -122 -809 516 -289 -598 713 -340 -243 852 -356 -3 852 -546 189 625 -737
7598 -737 262 315 -934 362 58 -921 518 -154 -694 751 -197 -350 911 -316 -57 925 -498 98
7616 98 783 -747 199 451 -924 278 136 -928 455 -3 -755 725 -90 -479 919 -190 -211 959
7634 959 -351 -45 763 -640 21 504 -882 107 261 -918 288 153 -733 597 56 -515 823 -7
7652 -7 -298 921 -213 -141 786 -482 -149 587 -738 -49 387 -878 127 252 -766 438 254 -602
7670 -602 723 145 -452 840 -36 -358 786 -343 -357 626 -639 -300 472 -801 -83 487 -736 261
$$ packed form
7545E23j152M80P63j223P94M50j170J004O5j067J068k79q74J142o06o23J194q12
7563c23l17J179j016J11J053j120M03P90j212O78M60j239R52J05j201J068j93
7580A78j014J250n36o87J325q05l09J311j053R7J095j208L53Q55j398P35M36j362
7598g37R99N3j249J296l04r79J439o72n40J445r48j53J261j227K59R82j423N96
7616I8O85j530R46K52j375J202j42j064J383m58p52J480q15l89J398j109k1J170
7634I59j310L06Q08j403O61M83j386R89J54j179J206j35q86J330n41n71J338q30
7652gk91J219j134P2R27j268L33P36j325O89M36j265J005J25j018J204j84q56
7670f02J325n78n97J292q76l22J144j129j4R83j265L39P72j273P18N70j223R97
$$ plain form
7688 261 484 -655 552 411 -544 749 223 -521 775 -146 -633 701 -486 -489 626 -711 -294 617
7706 617 -747 95 680 -701 449 617 -644 693 370 -715 751 -14 -728 719 -410 -683 680
7723 680 -682 -411 735 -742 -34 793 -757 368 753 -732 623 494 -768 717 136 -842 725
7740 725 -298 -785 759 -562 -570 821 -672 -187 914 -679 241 844 -720 500 626 -780 623
7757 623 256 -907 646 -187 -894 655 -434 -654 768 -534 -289 904 -580 133 901 -629 362
7774 362 707 -756 495 312 -886 511 -70 -906 581 -253 -750 719 -364 -414 888 -419 -61
7791 -61 929 -501 199 796 -678 242 477 -879 288 175 -1004 440 -32 -860 645 -163 -579 878
7809 878 -194 -284 1026 -354 -56 907 -596 35 667 -857 141 380 -1033 313 136 -942 564
$$ packed form
7688B61K23j139J207j41r55J293n26p44J296r21m87J334j187lJ115j337M17R11
7706F17j364Q42N85j381J150J68j261J337l23j085J466p65p14J447j129k73J363
7723F80j362K71J146j477P08Q27j550J125L85j485J355j29j262J485n81r78J567
7740G25j023m87J544j321qJ391j493M85J101j593R20O03j564J220J26j406J403
7757F23l67j163J553q33p07J549j089k20J422j302K45J193j484P13P68j530R91
7774C62L45j463J251j83j198J397n81q36J487q34m97J469j083n0J302j307L58
7791f1R90j430P00N97j474R20K35j356J167j13j179J444m72q28J505q08m16J457
7809H78j072r0J310j380K98R63j503O31O32j524R98K39j413J346j77j078J506
$$ plain form
7826 564 22 -680 884 -45 -430 1043 -241 -244 1008 -537 -125 759 -848 -15 505 -1067 164 283
7844 283 -1034 506 201 -827 867 93 -560 1031 -158 -416 1069 -482 -295 859 -820 -163 579
7861 579 -1011 93 447 -1054 397 319 -844 791 227 -625 1006 -26 -467 1038 -360 -373 827
7878 827 -758 -229 634 -958 -50 452 -988 324 410 -827 665 297 -616 895 102 -489 936 -231
7896 -231 -428 795 -592 -367 632 -821 -209 499 -867 170 542 -720 510 467 -571 743 303
7913 303 -532 774 -10 -531 684 -445 -530 573 -608 -341 566 -711 -27 598 -631 308 595 -570
7931 -570 559 449 -577 642 117 -653 619 -196 -669 553 -484 -508 593 -561 -203 698 -549
7948 -549 125 715 -530 404 584 -610 496 319 -723 499 -22 -796 519 -297 -698 613 -407
$$ packed form
7826E64n42p02J564r29l85J473j284lJ252j545M12Q84j607Q33N20j572J231J19
7844B83j317J540l05j028J694p74o53J591j189k58J485j551J87J154j679O57P42
7861E79j590J104L54j501J451p8j163J635n64q52J631j032m41J505j398j3J200
7878H27j585N29Q63j592R08N02j440J312Q6j237J492l68r13J511p93n91J425j167
7896b31j97J223j387K25R99j453O12P08j366J037L72j262J230m3j038J314m40
7913C03q35J306p84n21J215j129q5J103j181K67R07j277O84O25j229R39K87j165
7931e70J129j10j026J219n25p70J272q15m73J222j037k4J101j154L58R01j247
7948e49O74N90j245R34J80j194J106j77j042J222n21p74J315q16m01J311j020
$$ plain form
7965 -407 -424 776 -471 -83 844 -499 223 763 -632 377 463 -767 409 128 -873 469 -158 -755
7983 -755 603 -294 -490 806 -363 -139 855 -419 129 793 -575 297 536 -765 309 195 -885
8000 -885 379 -78 -776 528 -217 -541 697 -261 -230 832 -339 43 786 -489 109 554 -660 166
8018 166 296 -825 202 53 -794 403 -36 -554 625 -26 -324 779 -155 -98 723 -299 -25 592
8036 592 -539 -16 364 -714 16 170 -739 254 94 -571 471 69 -388 650 38 -223 712 -149 -154
8055 -154 574 -388 -145 407 -625 -104 289 -658 67 263 -591 346 284 -448 556 222 -365 663 46
8074 46 -340 616 -244 -383 488 -495 -293 408 -649 -117 406 -582 190 458 -507 451 365 -432 596 172
8094 172 -466 607 -164 -540 497 -443 -439 452 -587 -218 483 -568 96 500 -487 408 471 -429 552 277
$$ packed form
7965d07j7J200j247L88R27j343P22N40j395J009Q6j230J176k81j001J342o27n97
7983g55J358q97j96J296j169K24R94j274N48O64j368Q72K39j301J074j14j080
8000h85J264m57o98J304p45l24J238r58L1J062j171L82P43j275N98M45j214Q26
8018A66J30j121J027j49q47J197m39n18J179o51k98J103r34N7Q21j022K74O17
8036E92j131N23L80j078P30J54r09R93j60o65J042m02m57J038o12k61R35q61n
8055a54P28r62K43N52j032N21L93r47P25J96q54R37o2p32J004l34n87J028o17
8074D6l86R56q60j39Q71r83K02P01j057N32N23r88P72K68r65R58q6p97J028m24
8094A72o38J073p71l76J037r40MQ91j039L69P01j051O64M04r87Q95O3r00R81k75
$$ plain form
8114 277 -489 558 -45 -539 473 -329 -515 477 -488 -327 541 -498 -6 580 -424 252 566 -440
8132 -440 416 380 -516 452 98 -591 389 -181 -582 410 -337 -409 522 -360 -114 620 -344 125 654 -335 297
8153 297 458 -475 322 180 -591 281 -43 -600 310 -234 -484 432 -235 -258 593 -193 -36 647 -257 92
8173 92 543 -401 132 318 -572 101 116 -700 188 -11 -615 364 -47 -400 575 -4 -214 736
$$ packed form
8114B77p66J047o03m94J012q02j86R92r65J61Q68j039M92N86j004O76L14j006
8132d40Q56l6q96R68l54o89R80n70m01R92p47p2R31q82K46P34r64M69N29r89O32
8153B97J61r33P97j42p71Q72l24n57R10n44k50R16o67k3Q51p86J57O83r04L49
8173I2M51r44N33J86q90O73J5q16Q88j99o04R79m11l53R75n79k10R50
8191G36
$$ Imaginary data points
##PAGE= N=2
##DATA TABLE= (X++(I..I)), XYDATA
$$ plain form
0 0 0 0 0 0 0 0 0 0 0 0 0 -8 8 -8 10 -14 16 -16 24 -26 32 -37 40 -46 54 -64 77 -85 93 -107 119 -137 154 -172
34 -172 192 -214 236 -262 292 -325 357 -395 433 -476 524 -578 637 -698 767 -840 926 -1023
52 -1023 1132 -1252 1392 -1553 1742 -1969 2241 -2579 3002 -3550 4285 -5318 6846 -9272 13538
67 13538 -22308 46339 -221727 -499879 603904 -305537 -400893 588931 -488652 -203537
77 -203537 565525 -547189 62663 528487 -551692 280287 394974 -561407 419909 200848
87 200848 -539361 497078 -21860 -496673 502907 -241083 -399979 502420 -369443 -212210
97 -212210 515715 -423506 -2607 482038 -453216 180867 393728 -464467 314696 241042
107 241042 -482034 369283 38198 -478788 394400 -132873 -398261 431510 -244701 -258742
$$ packed form
0@%%%%%%%%%%%qJ6j6J8k4L0l2M0n0N8o9P7q6J00j18J41j62J78k00K26k56K91l26
34a72L64m06M50m98N54o17O82p52Q28r09J000j102J215j335J465j607J766j949
52a023K155k384K644k945L295l711M210m820N581o552P835r603J2164j6118K2810
67A3538l5846O8647k68066k78152J103783r09441r5356R89824j077583K85115
77b03537P69062j112714O09852M65824j080179Q31979J14687r56381R81316k19061
87B00848p40209J036439n18938m74813R99580p43990j58896R02399q71863J57233
97b12210P27925r39221M20899M84645r35254O34083K12861q58195P79163p3654
107B41042p23076Q51317l31085n16986Q73188n27273k65388Q29771o76211j4041
$$ plain form
117 -258742 458921 -311476 -87957 463547 -344673 77715 411248 -385818 184722 282060
127 282060 -436264 244010 124261 -450333 292085 -19335 -409699 341506 -124948 -305896
137 -305896 400390 -184105 -159437 436657 -234955 -27699 407236 -302747 66561 317357
147 317357 -370604 133257 192202 -415603 190454 68204 -405384 264624 -21182 -327951
157 -327951 347696 -86904 -215873 401417 -154951 -103956 401145 -235467 -14435 337835
167 337835 -324317 51349 233081 -388355 120793 129731 -393129 208539 47031 -337932
177 -337932 299246 -20989 -244831 365284 -90564 -147704 376312 -177125 -71086 326916
187 326916 -268311 -7907 243969 -333098 60225 158187 -348397 142159 88388 -308649
$$ packed form
117b58742P17663p70397K23519N51504q08220M22388L33533p97066N70540R7338
127B82060p18324O80274j19749n74594P42418l11420l90364P51205m66454j80948
137c05896P06286n84495K4668N96094o71612K07256M34935p09983L69308K50796
147C17357o87961N03861N8945o07805O06057j22250m73588O70008k85806l06769
157c27951O75647m34600j28969O17290n56368N0995N05101o36612K21032L52270
167C37835o62152L75666J81732o21436N09148Q938n22860O01668j61508l84963
177c37932O37178l20235k23842O10115m55848n7140N24016n53437J06039L98002
187C26916n95227K60404K51876n77067L93323R7962n06584M90556n3771l97037
$$ plain form
197 -308649 230894 32963 -235071 297647 -28847 -161166 316404 -107784 -102786 285730
207 285730 -193102 -54587 225213 -260503 231 163036 -284971 74543 115773 -263226
217 -263226 157610 75594 -215414 224252 26142 -165481 253630 -41896 -127053 241219
227 241219 -121430 -95715 203376 -188418 -53524 164578 -220998 9104 136339 -216062
237 -216062 84245 113369 -188203 150240 79259 -159760 185961 22933 -142323 187709
247 187709 -47627 -127974 170634 -111645 -101182 153257 -150859 -51959 145260 -160567
257 -160567 14068 139897 -153169 77548 120592 -146292 120093 77301 -147579 137186
267 137186 15049 -150187 138513 -48483 -137805 140397 -94220 -99292 150007 -116857
$$ packed form
197c08649N39543j97931k68034N32718l26494j32319M77570m24188M998L88516
207B85730m78832J38515K79800m85716K60734J62805m48007L59514M1230l78999
217b63226M20836q2016k91008M39666j98110j91623M19111k95526q5157L68272
227B41219l62649K5715K99091l91794J34894K18102l85576K30102J27235l52401
237b16062L00307K9124l01572L38443p0981k39019L45721j63028j65256L30032
247A87709k35336q0347K98608k82279J0463K54439l04116R8900J97219l05827
257a60567J74635J25829k93066K30717M3044k66884K66385m2792k24880K84765
267A37186j22137j65236K88700j86996q9322K78202k34617n072K49299k66864
$$ plain form
277 -116857 -40014 158803 -125969 22378 151364 -134958 70384 117470 -150054 97611
287 97611 61612 -163491 111927 816 -160223 125893 -47747 -130828 144804 -77637
297 -77637 -79041 162212 -94841 -20539 163567 -111851 27181 138916 -134404 57395 91666
308 91666 -155630 76587 37111 -161602 96152 -8514 -142408 121655 -38528 -100813
318 -100813 146542 -59072 -51049 157108 -80694 -8107 143735 -108569 21320 108066 -136749
329 -136749 42117 62739 -152091 64652 22883 -143941 94308 -4669 -113529 125261
339 125261 -24522 -72950 144382 -46956 -36898 141168 -77304 -12278 116150 -110094
349 -110094 5840 81288 -132422 27292 50097 -134268 57452 29002 -115693 91690
$$ packed form
277a16857P6843J98817k84772J48347J28986k86322K05342M7086k67524K47665
287I7611l5999k25103K75418j11111j61039K86116j73640q3081K75632k22441
297g7637j404K41253k57053P4302J84106k75418J39032J11735k73320J91799L4271
308I1666k47296K32217l9476j98713K57754j04666j33894K64063j60183o2285
318a00813K47355k05614Q023K08157k37802P2587J51842k52304J29889Q6746k44815
329a36749J78866K0622k14830K16743m1769j66824K38249r8977j08860K38790
339A25261j49783m8428K17332j91338J0058J78066k18472O5026J28428k26244
349a10094J15934P5448k13710J59714K2805j84365J91720k8450j44695K07383
$$ plain form
359 91690 13543 -86988 117891 -6178 -61255 125516 -36410 -44578 113554 -72907 -32346
370 -32346 91251 -103631 -14163 71214 -117090 16616 59032 -111640 55695 49678 -95955
381 -95955 90559 32493 -81405 109761 1280 -73091 110694 -39893 -65932 100850 -78567
392 -78567 -49759 90842 -102705 -18238 85788 -108839 24641 80948 -103564 66564 66101
403 66101 -97459 94603 34524 -95630 104707 -9782 -93131 103223 -53840 -79578 100637
414 100637 -84666 -48563 101767 -98153 -4031 101710 -100455 41270 89969 -101434
424 -101434 74625 60029 -105495 91360 15577 -107823 96744 -30815 -98189 100563
434 100563 -65930 -69577 107618 -84748 -25419 112782 -92551 21608 105098 -99045 57740
$$ packed form
359I1690p8147j00531K04879j24069n5077J86771j61926q168J58132j86461M0561
370c2346J23597j94882Q9468Q5377j88304J33706M2416j70672J67335o017j45633
381i5955J86514n8066j13898J91166j08481p4371J83785j50587k6039J66782j79417
392g8567K8808J40601j93547Q4467J04026j94627J33480N6307j84512J70128m63
403F6101j63560J92062o0079j30154K00337j14489q3349J96354j57063k5738J80215
414A00637j85303L6103J50330j99920R4122J05741k02165J41725M8699j91403
424a01434J76059j4596j65524J96855p5783j23400K04567j27559o7374J98752
434A00563j66493l647J77195j92366N9329J38201k05333J14159Q3490k04143J56785
$$ plain form
445 57740 77581 -108423 77735 34194 -115366 86886 -12011 -109369 94846 -47681 -84008
456 -84008 105884 -67780 -42855 114823 -77636 1547 111417 -86562 35889 88833 -99240
467 -99240 54975 50621 -110958 64470 9212 -111202 74592 -22583 -92711 90254 -40395
478 -40395 -58362 105926 -50548 -20276 110382 -63006 9126 96224 -81659 26226 66183
489 66183 -101163 37352 31730 -110216 52174 4324 -100881 74459 -12504 -74750 98128
500 98128 -24871 -42918 111396 -41841 -17159 105642 -67246 -1142 82865 -94553 11792
511 11792 53972 -111531 30940 30173 -109306 59335 14444 -89715 89663 543 -63505
$$ packed form
445E7740J9841j86004J86158m3541j49560K02252r8897r7358K04215j42527l6327
456h4008J89892j73664K4925J57678j92459P9183J09870j97979J22451N2944j88073
467i9240J54215m354j61579J75428n5258j20414J85794r7175p0128J82965j30649
478d0395j7967J64288j56474L0272J30658j73388P2132Q7098j77883J07885L9957
489F6183j67346J38515n622j41946J62390m7850j05205J75340q6963o2246J72878
500I8128j22999j8047J54314j53237K4682J22801j72888O6104Q4007j77418J06345
511A1792M2180j65503J42471p67j39479J68641m4891j04159J79378q9120o4048
$$ [...]
8191H4
##END NTUPLES=NMR FID
##END=
