##TITLE=1H_Ser Am-Bn2
 CDCl3
 8 sc, 
 25.10.2023
##JCAMPDX= 6.0         $$ Bruker NMR JCAMP-DX V2.0
##DATA TYPE= NMR FID
##DATA CLASS= NTUPLES
##ORIGIN= UXNMR, Bruker Analytische Messtechnik GmbH
##OWNER= root
$$ XWIN-NMR		Version 3.5
$$ Wed Oct 25 14:41:14 2023 Russian Standard Time (UT+4h)  she@DPX200
##.OBSERVE FREQUENCY= 200.13135
##.OBSERVE NUCLEUS= ^1H
##.DELAY= (6, 6)
##.ACQUISITION MODE= SIMULTANEOUS
##.ACQUISITION SCHEME= undefined
##.AVERAGES= 8
##.DIGITISER RES= 18
##SPECTROMETER/DATA SYSTEM= spect
##.PULSE SEQUENCE= zg30
##.SOLVENT NAME= D2O
##.SHIFT REFERENCE= (INTERNAL, D2O, 0, 15.7039)
##AUDIT TRAIL= $$ (NUMBER, WHEN, WHO, WHERE, WHAT)
$$ ##TITLE= Audit trail, XWIN-NMR		Version 3.5
$$ ##JCAMPDX= 5.01
$$ ##ORIGIN= Bruker BioSpin GmbH
$$ ##OWNER= she
$$ F:/spectra/data/she/nmr/H-F/1/audita.txt
$$ ##AUDIT TRAIL=  $$ (NUMBER, WHEN, WHO, WHERE, WHAT)
(   1,<2023-10-25 14:40:00.93 +0400>,<she>,<DPX200>,
      <created by zg, POWCHK disabled, PULCHK disabled
       configuration hash MD5:
       00 E9 B6 7A A2 85 ED C7 34 08 36 98 17 FE 4E 26
       data hash MD5: 16K
       D5 7C 33 CA 63 63 20 11 E4 EA 1B 8D 2B 0B 61 0E>)
$$ ##END=
$$ 
$$ hash MD5
$$ 1A F0 EC 90 05 47 DB AB 1C 27 01 87 8F 2E 89 AE
##$RELAX= 
##$RELAX= 
##$RELAX= 
##$RELAX= 
##$RELAX= 
##$RELAX= 
$$ Bruker specific parameters
$$ --------------------------
##$DU= <F:/spectra>
##$EXPNO= 1
##$NAME= <H-F>
##$PROCNO= 1
##$TYPE= <nmr>
##$USER= <she>
##$AMP= (0..31)
100 100 100 100 100 100 100 100 100 100 100 100 100 100 100 100 100 100 
100 100 100 100 100 100 100 100 100 100 100 100 100 100 
##$AQSEQ= 0
##$AQ_mod= 1
##$AUNM= <au_zg>
##$AUTOPOS= <>
##$BF1= 200.13
##$BF2= 200.13
##$BF3= 200.13
##$BF4= 200.13
##$BF5= 200.13
##$BF6= 200.13
##$BF7= 200.13
##$BF8= 200.13
##$BYTORDA= 1
##$CFDGTYP= 0
##$CFRGTYP= 5
##$CHEMSTR= <none>
##$CNST= (0..31)
1 1 145 1 1 1 1 1 1 1 1 1 1 1 1 1 1 1 1 1 1 1 1 1 1 1 1 1 1 1 1 1 
##$CPDPRG= <>
##$CPDPRG1= <>
##$CPDPRG2= <>
##$CPDPRG3= <>
##$CPDPRG4= <mlev>
##$CPDPRG5= <mlev>
##$CPDPRG6= <mlev>
##$CPDPRG7= <mlev>
##$CPDPRG8= <mlev>
##$CPDPRGB= <>
##$CPDPRGT= <>
##$D= (0..31)
0 1.2 0 0 0 0 0 0 0 0.06 0 0.03 0 0 0 0 0.0002 0 0 0 0 0 0 0 0 0 0 0 0 
0 0 0 
##$DATE= 1698230400
##$DBL= (0..7)
120 120 120 120 120 120 120 120 
##$DBP= (0..7)
150 150 150 150 150 150 150 150 
##$DBP07= 0
##$DBPNAM0= <>
##$DBPNAM1= <>
##$DBPNAM2= <>
##$DBPNAM3= <>
##$DBPNAM4= <>
##$DBPNAM5= <>
##$DBPNAM6= <>
##$DBPNAM7= <>
##$DBPOAL= (0..7)
0.5 0.5 0.5 0.5 0.5 0.5 0.5 0.5 
##$DBPOFFS= (0..7)
0 0 0 0 0 0 0 0 
##$DE= 6
##$DECBNUC= <off>
##$DECIM= 32
##$DECNUC= <off>
##$DECSTAT= 4
##$DIGMOD= 1
##$DIGTYP= 9
##$DL= (0..7)
0 120 120 120 120 120 120 120 
##$DP= (0..7)
150 150 150 150 150 150 150 150 
##$DP07= 0
##$DPNAME0= <>
##$DPNAME1= <>
##$DPNAME2= <>
##$DPNAME3= <>
##$DPNAME4= <>
##$DPNAME5= <>
##$DPNAME6= <>
##$DPNAME7= <>
##$DPOAL= (0..7)
0.5 0.5 0.5 0.5 0.5 0.5 0.5 0.5 
##$DPOFFS= (0..7)
0 0 0 0 0 0 0 0 
##$DQDMODE= 0
##$DR= 18
##$DS= 0
##$DSLIST= <SSSSSSSSSSSSSSS>
$$ [...]
##$SUBNAM1= <"">
##$SUBNAM2= <"">
##$SUBNAM3= <"">
##$SUBNAM4= <"">
##$SUBNAM5= <"">
##$SUBNAM6= <"">
##$SUBNAM7= <"">
##$SUBNAM8= <"">
##$SUBNAM9= <"">
##$SW= 18.05172834244
##$SWIBOX= (0..15)
0 0 2 0 0 0 0 0 0 0 0 0 0 0 0 0 
##$SW_h= 3612.71676300578
##$TD= 16384
##$TD0= 1
##$TE= 0
##$TE2= 300
##$TE3= 300
##$TEG= 300
##$TL= (0..7)
0 120 120 120 120 120 120 120 
##$TP= (0..7)
150 150 150 150 150 150 150 150 
##$TP07= 0
##$TPNAME0= <>
##$TPNAME1= <>
##$TPNAME2= <>
##$TPNAME3= <>
##$TPNAME4= <>
##$TPNAME5= <>
##$TPNAME6= <>
##$TPNAME7= <>
##$TPOAL= (0..7)
0.5 0.5 0.5 0.5 0.5 0.5 0.5 0.5 
##$TPOFFS= (0..7)
0 0 0 0 0 0 0 0 
##$TUNHIN= 0
##$TUNHOUT= 0
##$TUNXOUT= 0
##$USERA1= <user>
##$USERA2= <user>
##$USERA3= <user>
##$USERA4= <user>
##$USERA5= <user>
##$V9= 5
##$VALIST= <valist>
##$VCLIST= <CCCCCCCCCCCCCCC>
##$VD= 0
##$VDLIST= <DDDDDDDDDDDDDDD>
##$VPLIST= <PPPPPPPPPPPPPPP>
##$VTLIST= <TTTTTTTTTTTTTTT>
##$WBST= 1024
##$WBSW= 4
##$XGAIN= (0..3)
0 0 0 0 
##$XL= 0
##$YL= 0
##$YMAX_a= 152049
##$YMIN_a= -180286
##$ZGOPTNS= <>
##$ZL1= 120
##$ZL2= 120
##$ZL3= 120
##$ZL4= 120
##$ABSF1= 10
##$ABSF2= 0
##$ABSG= 5
##$ABSL= 3
##$ALPHA= 0
##$AQORDER= 0
##$ASSFAC= 0
##$ASSFACI= 0
##$ASSFACX= 0
##$ASSWID= 0
##$AUNMP= <proc_1d>
##$AZFE= 0.1
##$AZFW= 0.1
##$BCFW= 1
##$BC_mod= 2
##$BYTORDP= 1
##$COROFFS= 0
##$CY= 11.3945322036743
##$DATMOD= 1
##$DC= 2
##$DFILT= <>
##$DTYPP= 0
##$F1P= 15.7292609196834
##$F2P= 12.9074282941183
##$FCOR= 0.5
##$FTSIZE= 0
##$FT_mod= 4
##$GAMMA= 1
##$GB= 0.15
##$INTBC= 1
##$INTSCL= 1
##$ISEN= 128
##$LB= 0.24
##$LEV0= 0
##$LPBIN= 0
##$MAXI= 10000
##$MC2= 0
##$MEAN= 0
##$ME_mod= 0
##$MI= 1.114404
##$NCOEF= 0
##$NC_proc= 0
##$NLEV= 6
##$NOISF1= 3.799351
##$NOISF2= 2.8
##$NSP= 1
##$NTH_PI= 0
##$NZP= 0
##$OFFSET= 15.70392
##$PC= 1
##$PHC0= -23506
##$PHC1= 9.65272
##$PH_mod= 1
##$PKNL= yes
##$PPARMOD= 0
##$PSCAL= 0
##$PSIGN= 0
##$REVERSE= no
##$SF= 200.130013532006
##$SI= 16384
##$SIGF1= 3
##$SIGF2= 2
##$SINO= 400
##$SIOLD= 16384
##$SREGLST= <1H.CDCl3>
##$SSB= 0
##$STSI= 0
##$STSR= 0
##$SW_p= 3612.71676300578
##$SYMM= 0
##$S_DEV= 0
##$TDeff= 0
##$TDoff= 0
##$TI= <>
##$TILT= no
##$TM1= 0
##$TM2= 0
##$TOPLEV= 0
##$USERP1= <user>
##$USERP2= <user>
##$USERP3= <user>
##$USERP4= <user>
##$USERP5= <user>
##$WDW= 1
##$XDIM= 8192
##$YMAX_p= 0
##$YMIN_p= 0
$$ End of Bruker specific parameters
$$ ---------------------------------
##NTUPLES= NMR FID
##VAR_NAME=  TIME,          FID/REAL,        FID/IMAG
##SYMBOL=    X,             R,               I
##VAR_TYPE=  INDEPENDENT,   DEPENDENT,       DEPENDENT
##VAR_FORM=  AFFN,          ASDF,            ASDF
##VAR_DIM=   8192,          8192,            8192
##UNITS=     SECONDS,       ARBITRARY UNITS, ARBITRARY UNITS
##FACTOR=    0.0002768,     1,               1
##FIRST=     0,             0,               0
##LAST=      2.2672688,     0,               0
##MIN=       0,             -180286,         0
##MAX=       2.2672688,     152049,          0
$$ Real data points
##PAGE= N=1
##DATA TABLE= (X++(R..R)), XYDATA
0@%%%%%%%%%%%%%%%%%%%mJ2j6J6j6J6j6K2l0L2l3L9m6N2o0O7p4Q3r3J04j15J28
41F8j44J59j75J92k11K34k58K85l16L47l82M21m62N10n67O32p07P93q94J017j173
62f31J371j630J993k537L427n129R507m0599q6859J07347J06714K4297J7804N898
76A40973m3929l3746K3772L5693p837k1741m4841o7729k7500J6110J9860l460
88a4375o8300o9416J5219N2001K3488j216n046l514n922L4313O8483K4095l416
101D6394Q339j0204L249M4419L1380j4851m0000l1540j3420O487K4491j9331o4558
114b9145k6480k550j0776J6687J2276k4012k1106J999K0124K8280K6421J2970
126D688j5005p069K8078L3955K9484L827l6085j5779J9458J0869J852m480k2955
$$ y = [0, 0, 0, 0, 0, 0, 0, 0, 0, 0, 0, 0, 0, 0, 0, 0, 0, 0, 0, 0, -4, 8, -8, 8, -8, 8, -8, 14, -16, 16, -17, 22, -24, 28, -32, 35, -39, 44, -49, 55, -60, 68, -76, 83, -92, 100, -111, 123, -135, 150, -166, 181, -201, 220, -242, 268, -299, 333, -374, 419, -475, 542, -631, 740, -890, 1103, -1434, 1993, -3136, 6371, -34228, -121087, -13740, 92974, 117271, 135075, 140973, 97044, 63298, 87070, 122763, 114926, 93185, 48344, -19385, -46885, -30775, -10915, -14375, -82675, -152091, -136872, -84871, -61383, -62599, -67645, -71159, -77081, -42768, 25715, 49810, 46394, 54733, 44529, 47778, 92197, 123577, 108726, 68726, 37186, 23766, 30253, 54744, 35413, -29145, -55625, -58175, -68951, -52264, -39988, -64000, -85106, -83107, -62983, -34703, -8282, 4688, -10317, -17386, 10692, 44647, 74131, 77958, 41873, 26094, 45552, 56421, 58273, 53793, 30838]
139C0838l5558k2232J4987J1337j9896j3142j6080k4478J3168L5091J0211j4797
151c0551j6349N892K2148K8782K9672L30k0625q903M757K6432K5776j1817k1625
164C3919j7069j9960L966K3282K269l0857l6290n712J0563J0522J7860n296l0532
177d3335q912J5139K5051K5662K777j2210j1299K095K6602K3913K432j4992k5968
190F955m191J8434P605K020j1049l3781k2259O631K2573J1957j4214j9824j5402
203d4545j483K7721K4965j296r182j2730J713K3929J9763Q758n199k1442j1326
216c54J0986K3119J0586k1948k4841j1202m838J4585J5109j1562k1879j8844j518
229d2601J9878J6531N069r829j7363J997J7745K2830J7284j0270j8079Q11Q786
$$ y = [30838, -4720, -26952, -11965, -628, -20524, -33666, -49746, -74224, -61056, -25965, -15754, -30551, -46900, -41008, -18860, 9922, 39594, 39924, 19299, 10396, 15153, 41585, 67361, 55544, 33919, 16850, -3110, 856, 24138, 26407, -4450, -40740, -46452, -35889, -25367, -7507, -12803, -43335, -52247, -37108, -12057, 13605, 16382, 4172, -7127, -5032, 21570, 45483, 47915, 32923, 6955, 2764, 21198, 28803, 30823, 19774, -14007, -36266, -29635, -7062, 4895, -9319, -29143, -44545, -46028, -18307, 6658, 5362, -3820, -16550, -14837, 9092, 28855, 37613, 32414, 10972, -354, 10632, 33751, 44337, 22389, -2452, -13654, -18492, -3907, 11202, -360, -22239, -41083, -42601, -22723, -6192, -1123, -10952, -28315, -26318, -8573, 14257, 31541, 21271, 3192, 4003, 12789]
242A2789J6321J4297o692k2038k0929J078J8344M312q041j5043k2940m415J2102
255b0855J1111O097j3354k0213N99J6018K0591J2026m336j0220j0764Q728K9931
268B5359J2098p849r501j3873k821J3362J1992j239k0542k1203k948O724J1807
281A366K625j6733j5647q317N455K5320J2147j1203j1858m577Q751J7029J6611
294B0969O504j6297j5409R085J3373J0034M245j4998j8836p330O355J5985K534
307A6214j5601j8084j1181O203J3553N817J524j3396j6686R772J9732J0802K004
320A0673q335r503J78J4167K0727K249j4705j2155p636P265J6651K027r027j6246
334c670j6550L485J5025P601n486j6029q389J364Q633J8405L842j5876q578L270
$$ y = [12789, 29110, 43407, 36715, 14677, -6252, -5174, 13170, 17482, 9441, -5602, -28542, -32957, -20855, -9744, -3647, -17001, -37214, -36615, -20597, -6, 12020, 7684, -2536, -13300, -4572, 25359, 37457, 29608, 20107, 6234, 3413, 16775, 28767, 27528, 6986, -14217, -17165, -10441, 1366, 3991, -12742, -28389, -36706, -31251, -5931, 6216, -4987, -16845, -21422, -12671, 4358, 20969, 27473, 11176, -4233, 4852, 18225, 28259, 32504, 17506, -1330, -8660, -2305, 13680, 16214, 613, -17471, -28652, -22449, -8896, -3079, -1555, -14951, -31637, -21865, -2133, 8669, 10673, 2338, -7165, -6987, 7180, 27907, 30156, 15451, 3296, -4340, 2925, 19576, 21603, 12576, -3670, -20220, -16735, -1710, 5891, 405, -15624, -24013, -22649, -14016, 4389, 8231, -7645, -16223, -12953]
348a2953J2668J7020M961p487j3130q538J0282J5547O903n803j9073j0199M282
361e520N262R841J052j8850j4660J853J2714J1245r52o606j1380q103J4378J9407
375I681N125m465j2933o781R896J1516Q959o82j5140j1521J191J3442J0819p824
389A1283j2788r801q652R705J7849M12j2010j4184l838R269J1741J0546k474j4378
403g320n580N848J3030J3958m282j3072n405n28R380J3768M3j3602j6645j360
417a1767J0901O066L782m138j9154p797R179J1380P922m874j1775o396L168J3299
431b04J2748j390q376j1746j95J7096R059q05m512j3229p945Q197J4109M675j2078
446E404j2745l681n08J0213J0429o389j2720q540N17J5047J1326k173q846j0099
$$ y = [-12953, -285, 16735, 21696, 14209, 1079, -7459, 2823, 18370, 25273, 19470, 397, -9802, -5520, -258, 9583, 10635, -8215, -22875, -21022, -8308, 2937, 1985, -4621, -16001, -24104, -9726, 9681, 14806, 10341, -2592, -9373, 523, 12039, 20998, 20316, 5176, -6345, -5154, 8288, 19107, 11283, -1505, -11306, -19958, -10253, 7596, 8008, -4002, -18186, -22024, -12755, -1014, 9532, 7058, -7320, -12900, -7052, 5978, 19936, 15654, 2582, -2823, -3351, 6029, 19797, 19840, 6238, -10407, -11767, -866, 5200, 8982, 4844, -14310, -22107, -12928, -1548, 6374, 1500, -10275, -16671, -13503, -204, 12544, 11154, 2778, -8968, -9163, 7933, 16992, 16187, 11675, -1554, -9499, -1302, 12807, 17482, 5404, -7341, -11022, -11530, -1317, 9112, 2723, -9997, -18537, -18020, -2973, 8353, 6180, -2666, -12765]
460a2765j198R947J5125Q799j1163j4647J998N350O426R236k550j3092r467K376
474e625J2128N419m334r776j2613k54J0782Q317L265j0367j5261J464J1433P891
488B469L776l495p535p298M337J7916O714p631p339p456L68J2890R935q53j2733
503D065j3881R35R858Q812O61j0316q848m675J030J3104P481r312r644m328K722
518a2336J0685R148J713j0785j2222N865J3145P645J003q769q073L5M386R854
532A1294N114q154j1178o081M477J0199K543l182j0903j2234M681J4071N135l413
546B369r844p078K251P206J1323M848p869r008l611P196J3774M318n093q569q658
561f445M692J1509M515l743j1261q259J309N429P269J405j0062r135k404O496
$$ y = [-12765, -13963, -4016, 11109, 19908, 8745, -5902, -3904, 1446, 7872, 17108, 14558, 1466, -8001, -5625, 6503, 11922, 7588, -2188, -14801, -15055, -4273, 4044, 7309, -3058, -18319, -16855, -5422, 2469, 6245, 2750, -4785, -12083, -7746, 10170, 16884, 9253, 1914, -5542, -5174, 7716, 17651, 16798, 4065, -9816, -8881, 977, 9789, 10450, 134, -8714, -13389, -12359, 745, 8226, -1086, -10730, -15058, -12336, -1651, 7497, 9210, -1575, -13797, -7932, 5213, 12858, 13861, 5092, -2981, -2946, 1440, 11294, 16408, 8254, -2924, -9005, -4528, 5671, 8214, 5032, -5871, -18105, -13424, 647, 5782, 2369, -7475, -14553, -12302, -5096, 6227, 11075, 3206, -5802, -9413, -2217, 11557, 15875, 10782, 2213, -6445, -1753, 9756, 14271, 10528, -733, -8992, -7683, -2254, 5015, 6420, -3642, -12777, -15181, -8685]
575h685J0949J314n878n970m660P359J2755L748m089q882n047O083Q942Q119j008
590A5050j2307p938P27N882R342J80r427r268n482N848J0437K015n576j0283m560
605a5360O709P473O984J269j0840p067N713Q899P757k59o998o487k580P484R255
620A1952r16o143r438m343O600O288J249j671j0308q102M159J0887P013m846p885
635e504k885q25P454J1768J6p363o792j225P449P446K140l886j0447n208M354
650c508P972O223n955j2437k901J816N002Q742M57q965q240J575R334N616J707
665F438j338q632l412Q163Q018L492n007r815k768L874O122M941m081q453q161
680a0619n63R973N717l599m505o194l473P328J0029L305o434p926J528M155P667
$$ y = [-8685, 2264, 3578, -2300, -8270, -12930, -5571, 7184, 10932, 6843, -2039, -7086, -1003, 7939, 16058, 15050, 2743, -5195, -4468, 1414, 10756, 10936, 1509, -7759, -13241, -7393, 3044, 5059, -517, -10800, -15360, -8651, -1178, 5806, 7075, -3765, -10832, -5119, 3780, 11537, 11278, 4280, -2207, -4787, 2697, 11952, 11036, 4893, -4545, -8888, -2288, 4000, 5249, 3578, -6730, -14832, -10673, 214, 7227, 2381, -5504, -8389, -9214, -1760, 10008, 10024, 2661, -4131, -5356, 2093, 9539, 11679, 7793, -2654, -7862, -3508, 4464, 10687, 4732, -7705, -10606, -8790, -3788, 4954, 5411, -3554, -11794, -10219, -885, 4731, 6438, 5100, -3532, -6944, 1219, 9237, 12729, 7722, -2093, -4861, -987, 5135, 10076, 5995, -2458, -10619, -11182, -1209, 4508, 909, -3596, -9790, -13263, -5935, 4094, 7399, 965, -6961, -5433, -1278, 6389]
695F389O970l500q341l828N20Q420O525m417p829o156j327M767N219J451q132
710c269j0477J580O106M267M193k830p844k750M429J1001O138l878n048m449J760
725a071Q564N183M7n412j0202m27P007L835p06o106p580m208J979R387L093p975
741d592n754k347J692Q531O498k88n118n806K722Q980N911J532n568n585m48K892
757C252P652L227r118q399j882J796N629K007l021p422q441K969Q666L526m85
772d4m935n194J666O316P320L756o168n798R70N659P014J528l281n648p456K767
788a528Q446J817l960o614o089J6M181N258N30p835n445R22M992P839J335m198
804c33l456l472M318J0399L181l815o318l374L191M606M528K13r215o485J542
$$ y = [6389, 13359, 9859, 1518, -2310, -1790, 6630, 13155, 8738, 909, -5247, -6574, -1807, 3412, 4863, -3269, -13746, -12166, -6060, -1793, 2400, -430, -8274, -11024, -6595, 4406, 10544, 6666, 1618, -2831, -1071, 7493, 12676, 12723, 7311, -2891, -3318, 3689, 7524, 6818, 712, -6868, -11076, -9097, 290, 3383, -4592, -10346, -12693, -11001, -2470, 4028, 3740, -1378, -7184, -4462, 4518, 10429, 11961, 6393, 808, 360, 3252, 10904, 14131, 5013, -3386, -5268, -3472, 2157, 4164, 1143, -6279, -14720, -11751, -3085, 441, -44, -4979, -10173, -8507, -2191, 5129, 8885, 2717, -3081, -2111, 3548, 10562, 12090, 8809, 3161, -4295, -1528, 6918, 8735, 4775, -1839, -7928, -7912, -3731, 1527, 2057, -5778, -11223, -10301, -5309, 2530, 3865, -333, -3789, -7261, -2943, 7456, 10637, 6822, 504, -2870, 321, 4927, 9455, 9668, 453, -6032, -4490]
819d490M616M855r86o175n236k374L908P701J990m083o244k209N622N579L303
834E777R04o738n438L918O031M161j402n697m047j841L955O665n23n671o354k852
850i152N318N915Q29q27o519m785M039P194M754k169n969j613L04M042P126l82
866H105o555n162r74N445M723n97l109o923l777M053N532L456k918p504j406K445
882e166M242O259j14n709m356J070P254M957r08k776n875k987N026N031J467l919
898C496p466k194K268L141L508j825o209l950P23P430M677k148k791l976q52O074
914i4O614J967l901o318N4M167L626L079k756o265m334P03N851L479m510n072
930c710l421j292M575M961O65m988n970J433N467M164L187k267m968j259K508
$$ y = [-4490, 126, 4981, 3995, -2180, -7416, -9790, -5882, 1819, 3809, -274, -6518, -8727, -3105, 2474, 5777, 6681, -57, -5495, -1577, 4454, 8615, 7213, 1516, -2531, -4372, -417, 6248, 5725, 54, -6300, -9152, -3834, 2081, 2910, 2083, -4436, -9221, -5182, 2012, 6766, 4597, -1372, -2985, -2681, 1361, 8487, 8105, 1550, -3612, -4586, 859, 5582, 4985, 1876, -5047, -8824, -4771, 761, 4217, 1299, -6205, -7611, -5166, -924, 5335, 5221, -488, -4844, -3774, 3480, 8437, 7529, 4753, -1122, -4109, 917, 5948, 7415, 3496, -3970, -6164, -3896, -755, 2753, 928, -5281, -9231, -8508, -1078, 3599, 1451, -1340, -5316, -6168, -94, 6520, 8487, 4586, -1732, -1678, 2489, 6115, 9194, 6438, 173, -4161, -3458, 2393, 5872, 1362, -3710, -7131, -8423, -3848, 1113, 1778, -3210, -9180, -7747, -2280, 1884, 5071, 2804, -2164, -3423, -915]
945i15O280M854l560n130k760N66M336L122m26n171p471P03N184J775N57l246
961a302o036j047K669N495L579l653m011j741K679O386L021j344l247m741J681
976a612O754K766r80m142n164j001K737N251J773o298m622j386N74N362L430l399
992D3m013l354J635O137L293m48m367l231J580K860M802K969n532n439J200K358
1008D93L312J980k505n087l534K772N498Q23k117m136m154K180M754K602R57m812
1024i74m920J132M850M480j16l257k778l477K701P670N23m272l126k511J281M700
1040A906L150o60n976l612J286L413M860k4n004k252j116J108O085K302m336m265
1056c135o88K855K564K189O1n942l950L745M210J592l92m238l377M17L444M727
$$ y = [-915, 5365, 10219, 6659, 1529, -1231, -665, 3671, 6793, 6367, 1196, -6275, -5572, -388, 1387, 1944, -1302, -7338, -8385, -5716, -221, 3358, -295, -4306, -6047, -3368, 3018, 6039, 4695, 1448, -3293, -1612, 5142, 7908, 6928, 2786, -2378, -3379, -642, 4609, 6382, 84, -4538, -5924, -5350, 12, 3442, 43, -3970, -7324, -5689, 448, 3741, 3293, -1074, -4305, -2725, 135, 4937, 7906, 2374, -3065, -1865, 493, 3805, 5785, 3280, -1807, -5341, -2569, 2929, 3752, 1635, -2501, -6655, -4475, 279, 2881, 3838, -974, -5894, -4762, 88, 4568, 4452, 1195, -1583, -5060, -2359, 5311, 5834, 1562, -1564, -4075, -2794, 1906, 5056, 4396, -1580, -5192, -3906, -493, 4367, 4343, -661, -2913, -4029, -2921, 3164, 5466, 1130, -3135, -3823, -968, 1596, 3785, 3846, -2096, -6046, -2301, 1909, 3501, 3109, -1129, -4506, -4089, -645, 4082]
1072D082K94l539m216j945M901M187m68k82l820n085L032O405J527k577l962j761
1088c227m47K832N443l71m845l023j295L467M980n91k059l077k181K422M331K949
1104E308k861n647r4K208J295L932K95n310l392O68M173L261p24k134l907k088
1120e017L948M207J085k152n336j457L469K837K329p38m331l298N97N123L498
1135D764k310k758k226j907L482M578L26l105m336l34K986K662J802j575m659
1150b610j069J484L769L411k331l643j668J61L077L362M74l580m985M48M034J739
1166B073Q37j712m671j315K267L958K435k714l577j616P85M187K950l76k561m159
1182c209K34M711K364k44j884l864n97J863L580J937l970l993o84R28L108K592
$$ y = [4082, 4376, 837, -3379, -5324, -423, 3764, 3296, 3014, -806, -5891, -2859, 3546, 5073, 2496, -1466, -3227, -3674, -842, 4601, 4230, -615, -3638, -4933, -1466, 3514, 2923, 864, -2213, -4394, -1972, 2359, 5308, 2447, -3200, -3294, -1086, 209, 4141, 4436, -874, -4266, -3598, 575, 3836, 3112, 978, -2929, -5017, -1069, 3138, 4223, 2071, -3265, -4722, -1253, 1584, 3913, 3175, -1156, -4454, -3857, 1266, 4764, 2454, -304, -2530, -4437, -955, 3623, 3949, 844, -3492, -3826, -840, 1822, 3624, 2049, -2610, -3679, -2195, 1574, 4985, 2654, -989, -2657, -2496, 581, 3943, 4417, 837, -4148, -3700, 334, 2073, 2910, 1198, -3473, -4788, -2521, 1437, 3872, 1158, -2419, -4035, -3250, 937, 3887, 3511, 950, -3209, -2975, 1736, 4100, 3856, 1972, -1892, -2489, -626, 2954, 4891, 921, -3072, -3756, -2828, 280, 2872]
1198B872j940l031l224O68M898K164m08k311k899K31L158L361J716l108m283M97
1214a639J995L024J854k197l505l032O61M845J158j832k996k962M18K479K799
1229A070J345l954l478R94K511L398J280k098k386j566J711M956J878k109l314
1244B38j810J017K589K005L59l940m221R20K597K134j23l063k630j326J758M795
1260A299R58k791k758j153K297L597J468O08l046l052J554L571K526n29l235k249
1276i35n78J339L741M09l749l165j122J777K898Q53j045l190k972K304L417J874
1292A856m08l186j382J012K339L746N17l311k406k96K625L032j6j358l038k892
1308c166J901L114R45j397l486j770R50J726L022p5l645k014j82L548L126k28
$$ y = [2872, 932, -2099, -5323, -4655, 243, 2407, 1999, -312, -3211, -2980, 178, 3539, 5255, 2147, -2136, -1639, 356, 3380, 5234, 3037, -468, -3500, -2839, 2006, 3164, 1332, -1664, -4626, -4208, -1729, 1070, 2415, -1539, -5017, -4023, -1512, 1886, 3166, 1068, -1318, -2884, -1173, 3783, 5661, 3552, 238, -1572, -555, 2034, 4039, 4398, 458, -3763, -2843, -246, 1888, 1765, -1298, -3928, -5254, -3496, 1299, 2257, -534, -3292, -4445, -2148, 1449, 2917, 3525, 479, -2573, -1019, 2552, 5078, 4549, 1314, -935, -1513, -174, 3567, 3976, 227, -2938, -4060, -2283, 615, 1468, 423, -2767, -5739, -3435, -18, 1856, 1448, -1738, -3120, -2108, 231, 3977, 4494, 1183, -1223, -1519, 1106, 4138, 4122, 2764, -274, -3166, -1265, 1849, 2794, 1397, -2089, -3859, -2909, -1183, 1839, 1764, -1881, -3895, -4077, -529, 2597, 2369]
1324B369j830j692j987K359M091J158k012l680p32J539J812J953j70m191j876
1339b889J23K590L080j598k157j985p11K051L410M84j778l628j75K639K119J653
1355C228n40l697j576J533K732J990j531k433j720q07K716K732l23j867l842l02
1371c707L182J649J203q78l258j420J372L480K108j821k439q75j35K489K858q71
1387B937k715k566l87K894J769j7j569l071q69J237K630K354k349k956j2R44K384
1404F38K627q05k174k237P14L713J300l76j625l187m17J807K153Q28j981l858
1420b880p03J250K250J082j048k231k142Q17M030J479q18j125j924l4K838K780
1436C621O33k329k486J35J368K207J011k118k475j987M37K955P45j783k397j706
$$ y = [2369, 539, -1153, -3140, -781, 3310, 4468, 2456, -1224, -1956, -417, 1395, 3348, 3178, -1013, -2889, -2766, -176, 2904, 1306, -851, -2836, -3547, -1496, 1914, 2398, 620, -3008, -3183, -544, 1575, 3228, 2688, -1009, -2585, -1052, 1680, 3670, 2139, -294, -2014, -2821, -105, 2627, 2304, 437, -3405, -3707, -525, 1124, 2327, 1449, -1809, -3229, -1857, 1623, 3731, 1910, -529, -1404, -1539, 950, 3808, 2937, 222, -2344, -2731, 163, 1932, 1915, 346, -2725, -3594, -2357, 273, 2627, 278, -2678, -2690, -1746, 638, 3265, 2460, 286, -1951, -1237, 2476, 3776, 3400, 1775, -1412, -1829, -22, 2131, 2959, 978, -2880, -3583, -2333, -83, 999, -49, -2280, -4422, -3605, 425, 1904, 1086, -39, -1963, -1997, 841, 3621, 4254, 1925, -561, -426, 942, 3149, 4160, 2042, -433, -2420, -1983, 972, 1717, -66, -2463, -4169]
1452d169L70K178J846M80k238k905J683K303J874J749j681j798p19J567L468J126
1468E134j961k215j764O95J960P75q5k709l654N85K290J003m1j790j608j180J538
1485c027L327J000j911j180l86J574K877Q97J64j931k248J273K610J418p62k688
1501A007j973j69P42K296M62l232k705m42J386K206O44q50j989j716J934L042
1517F43J203j46j948j341J367J722K217M71k227k524j16J526K259m64j456k213
1533a027j899Q95K777L77j412k421p62Q99J431J851L49k665j082Q39K246K308
1549B704k68j342j206q43J384K658N79j483l041j178J921R67J003j51l142k048
1565c486P16K148J744o90j723j098p97K129K767J63j097j822l01J844J487Q24
$$ y = [-4169, -3799, -1621, 225, 705, -1533, -4438, -2755, -452, 1422, 3171, 1490, -308, -1027, 540, 4008, 5134, 3173, 958, -806, -111, 1849, 2624, 2539, -170, -3824, -3239, -949, 54, 13, -1777, -3385, -4565, -3027, 300, 1300, -611, -1791, -2177, -603, 2274, 3171, 3335, 1404, -844, 429, 3039, 4457, 3695, 1007, -966, -1135, -393, 1903, 2365, -867, -3572, -4014, -2628, -422, 222, -628, -2617, -4333, -2399, 643, 1846, 1700, -248, -1589, -222, 1500, 3717, 4188, 1961, -563, -679, 847, 3106, 2642, 1186, -1027, -2926, -2031, 746, 1123, -289, -2710, -3472, -2573, -1142, 709, 1058, -1607, -2689, -1850, 396, 2704, 2436, 1094, -112, -955, 429, 3087, 3666, 2183, -858, -2036, -115, 852, 1855, 1704, -1438, -3486, -2770, -622, 1122, 432, -1291, -2389, -3186, -1057, 1710, 1873, 776, -1046, -1347, 497, 1984, 2808]
1581B808o33j921j251K50J805J660j209k536q37k66J135K104k5k133j775j12K320
1598f16J459P65q41k465j62J499J779J939j144k279q77L84J649J432j1k162k465
1615b116k59K050J275l82r27j778j143J577K147Q16j427j471l10R61J940K012
1631B965o86j739j146J88K324J145p92j298j466o53J171J303O87k423k319PQ58
1648a874J066J449j106k056o94P63K648J450k91j183j192L54K012J459M73j146
1664B132k444Q7J499J089J64j150k149j154k09K262O17j812j134r98K37J995R63
1681eJ82j138j569Q49J964J538O81j638q67qQ10K025J056j650j962q69O68R64
1699A031N38l00k122j946N70J520M11K66j777j187K66J298J783R08j358j360j62
$$ y = [2808, 2175, 254, -997, -747, 1058, 2718, 1509, -1027, -1864, -2130, -995, 1109, 1084, -1049, -2824, -2936, -616, 843, 1608, 767, -1698, -1860, -361, 1418, 3357, 2213, -66, -943, -559, 1090, 2522, 2511, 349, -2116, -2375, -325, 950, 568, -359, -2137, -3280, -1703, 444, 1260, -167, -1638, -1948, -987, 953, 2965, 2279, 540, -606, -418, 1906, 3051, 2259, 961, -505, -1158, 13, 1316, 2003, -420, -2739, -2732, -1874, -808, 641, -465, -2521, -3215, -2452, 196, 1646, 1355, 172, -1020, -666, 1346, 2805, 3278, 2132, -312, -225, 1274, 2363, 2527, 1377, -772, -1926, -2135, 127, 744, -1068, -2202, -3200, -2963, -968, -5, 177, -961, -2530, -1681, 283, 1821, 2502, 864, -3, -11, 799, 2824, 3880, 2230, 268, -601, 67, 1031, 1569, 1269, -853, -2799, -2229, -709, -298, -32, -1809, -2996, -2730, -1432, 351, 1259, -99, -1459, -1621]
1716a621J450K163L2K06j093k003Q81K422M92r65j477j369K36M34J532j95k218
1733a093j270k71Q38K073J16j143j082q53J057K242J065n92j311n70M39J352J639
1750B636O4k029j332K83Q85J522k75j681r86j083J122J508L15j026j606q29J267
1767a245Q70J132K36j808q10O93J283J396o3j387q03n39J322J827k46j130j638
1784i10o06J340R77O06n84j781p55M62J383J175n03j449o37j28J144J834J52j303
1802D17j583j70J521R93K3k84j729q98Q86J353R29q49j704p67N12R05J679j85
1820A049j204j215K2J720J056J03p22j018p56J159J264P30j269j809k68M93O70
1837ER87n54j112j453N3J689J296p76n18r42m98J079J738O97q90j500L2Q86R94
$$ y = [-1621, -171, 1992, 2024, 2230, 1137, -866, 15, 2437, 2929, 1964, 487, -882, -646, -212, 1320, 1125, -1093, -2363, -2634, -1796, 277, 393, -750, -1832, -2685, -1628, 614, 1679, 1087, -224, -794, -355, 997, 2636, 2700, 671, -661, -378, 507, 2029, 1754, 73, -913, -1996, -874, 634, 949, -77, -1683, -2512, -1245, -375, 757, 993, -815, -1625, -932, 351, 1747, 1684, 297, -506, -1045, 277, 2104, 1858, 728, -910, -1516, -176, 801, 1407, 823, -958, -1713, -1251, 132, 1307, 804, -645, -1282, -1410, -266, 1568, 1720, 417, -1166, -1336, 185, 1178, 1201, 917, -812, -1710, -824, 529, 1458, 609, -1095, -1862, -1350, -445, 1234, 1049, -155, -1370, -1348, 372, 1428, 1531, 809, -209, -965, 194, 1458, 2188, 919, -890, -1158, -665, 5, 992, 438, -674, -2127, -2074, -385, 911, 135, -383, -1325, -1823, -744, 994, 1691, 801, -699, -667, 219, 1213]
1856A213R85p48j260o93K6J490Q40j030q45j637J52J095Q62K92j279j911L25J146
1874i77P72R73o42j114j67L86J714R86p98o96p45J13J239R57j39j182j613J64
1892g69J037M17N82j294j192o35K00J450R00j218o85m65J05J616R59l49n98j099
1910a038L67J661R19l54q32r40m8J80J406M65j415q57n18R7J213M62n35q55j326
1929a948N92J203M61L49j176n43J18O99J511N72j575j054K18M84J411Rm06j007
1947h2j026K93J335O38n36r46j165N50Q81N75N70j270j257M47P21J234j07o75
1965A80p66o18O71J428L63o17r20n76K78Q45N95J36j376q78P4J067R41K7r04o29
1985f79k34M75J325L97j046j166kR06N47O54L12j887p82N57O14J060j22j341n49
$$ y = [1213, 2198, 1450, 190, -503, -477, 1013, 1853, 823, -22, -1659, -1507, -412, 450, 742, -537, -2448, -2123, -977, -205, 768, 126, -988, -1155, -769, 945, 1931, 1133, 437, -308, -195, 1044, 2001, 1862, 680, -933, -769, 268, 685, 1267, -27, -1219, -1854, -1654, -204, 696, -522, -1207, -1672, -1567, 49, 1008, 659, 61, -1038, -671, 990, 1909, 1555, 723, -217, -265, -85, 1321, 1786, 371, -486, -1004, -907, 306, 768, 233, -622, -1948, -1356, -153, 308, 657, -519, -1062, -944, -245, 1266, 1838, 263, -791, -573, -89, 1322, 1331, 925, -82, -1108, -815, 520, 1158, 622, -324, -1489, -939, -58, 517, 1087, -183, -1440, -993, -272, 962, 855, 180, -586, -1204, -533, 895, 1258, 641, -279, -855, -577, 268, 863, 999, -377, -1255, -1181, -114, 827, 854, -50, -679, -913, -438, 887, 1284, 238, -928, -930, -24, 523, 1177, 1489, -398, -1180, -623, -9, 1051, 929, -412, -961]
2004i61l77R93R26j7n77r27n11R62Q22J53K64q60j063O84J237M95n36q15j99M9
2024b58N77R47j76j101o85k35P08R92k30p30n70o92O57Q95O19m92j151r4N03M15
2044a01J467l5j277r58L56J111M48p5j17j031m95P60O20L69m86j221k70L78N62
2063EN41n33o13n70j03J532L46q83km27l00J014J116j21n65j023j79R12P21O42
2083A510l77j621n1p5J119O99o22q27p58j34P01M33N56m99j689L92R23J90M76
2102C46p8r27M8l4J487K68n92n89j70q7J231K32k99m75r05P8Q43L44j53n26q55
2123h13l42L29J057N70j075p67j05M3R44J039l50q84o60L38J146K65K37o19q89
2142e36J73M68P62Q74j335o12n2J89M43L72l08p93p82L67R39K2j01j86j130K47
$$ y = [-961, -1338, -345, 581, 564, -13, -940, -1451, -489, 333, 486, 750, -110, -1173, -489, 748, 1243, 707, -108, -307, -258, 319, 1266, 1090, -11, -696, -931, -223, 769, 539, -191, -761, -1453, -796, 99, 718, 226, -925, -1019, -516, -101, 1366, 1331, 54, -904, -548, 563, 1011, 936, 819, -212, -707, 53, 673, 1042, 556, -665, -935, -557, 5, 546, 13, -600, -1170, -1273, 259, 605, -278, -280, -707, -1007, 7, 1123, 1002, 437, -586, -765, 147, 868, 1510, 1133, -488, -539, -614, 505, 1204, 582, -245, -1003, -1137, -436, -3, 553, 54, -1635, -1243, -320, -130, 346, 268, -659, -611, -645, 842, 1110, 518, -71, -241, -328, 903, 1135, 836, 361, -544, -466, 377, 721, 568, 42, -813, -1155, -826, 231, 801, -274, -1041, -1146, -1103, -159, 880, 530, -354, -1014, -676, 470, 735, 972, 353, -536, -363, 105, 867, 1741, 406, -206, -258, -69, 374, 746, 438, -355, -1137, -770, 169, 191, 90, -96, -1226, -979]
2162i79P44M87j5m36o24J27P84P29J70n14j08p53L45J050J95n67m80n11N3M58
2182A55O30k42q17n84j69N22O22J74p41j63l45J02R57L84k47o03m55P24O38L44
2202H86Om69j003L94P11N17oj082k96k38L80Q01Q8r66n85j04L48P02K55o1p21
2223d43p18K86Q92N66l67n04K1O9K90R28j27p92l76k09J98J145l96K36r68l57
2243f26M09O94J93k46p93m01M04L44K29L00q53m58j03P78N19j18q3q09k13O20
2263b13P01M0j17p75m4J35O03N70l80n24m56L0O76M73k01n31l91k27M51O24K71
2284G15m90j029K23M38K25N97l73p82j97J29N77Q35m46m67m29j01N12O12K46p21
2304G4m69k02P59L39J71l9r99j7J19N89O88q23j79k27l29N08O20k78o66p70M76
$$ y = [-979, -235, 252, 237, -199, -823, -696, 88, 817, 987, 473, 365, -388, -43, 1007, 1202, 635, 155, -356, -303, 155, 785, 543, -274, -858, -1027, -505, 117, 291, -450, -613, -958, -856, 101, 485, 238, -365, -820, -96, 542, 886, 892, 423, -580, -186, 525, 1042, 1036, -46, -342, -580, -200, 601, 689, -277, -862, -966, -618, 84, 339, 278, -443, -1161, -875, 17, 583, 216, -288, -267, -198, 92, 1020, 893, 101, -275, -484, -286, 859, 463, 699, -269, -626, -217, 477, 670, 424, -369, -770, -366, -22, 207, 507, -346, -804, -907, -129, 390, 272, 189, -620, -833, -213, 488, 528, 411, -364, -408, -273, 330, 900, 520, -4, -460, -430, 246, 719, 518, -13, -404, -631, -180, 444, 715, 225, -804, -581, -143, 82, 679, 306, -476, -673, -544, 33, 868, 422, -45, -474, -575, -63, 549, 795, 74, -395, -597, 162, 501, 672, 633, -366, -383, -264, 325, 1013, 190, 11, -216, -545, -37, 583, 305, -361, -1131, -655]
2325f55O46K76J68n10o77J73K42O77M65p07m33J2J12N27N22k02l62q75M14P54
2345E67p9K26n11o70j12L30M18J87n86m76l7K85O62R7k14m29m78K68Q05K90j63
2366C80m37l01M5O31J75L96m59j126L45L87L94J82o35k21m69L42P79m5m94k72
2386d03j65P5L65J46N19o92o88M11M33J85M01n21l01lqR09j11%l51m21J31O65
2408E76K60j57m81p53M25J38M87j26m87l46k83J51P68K4n43l16l47O49O54m6K2
2429B69o38j73M50L46L80K22q40p5j38K67P72q9n34k41k37P0N92j35k3q03m35
2450i93N45K73K21k17l11m71N17R6N13J12o00j01Q3M52N17kk84J12q02Q07M56
2471I23J04l25p49k12l5J93M51n3p11m00M1L95M80j57l41l89J3K83N45Q8N8n01
$$ y = [-655, -9, 267, 435, -75, -752, -579, -337, 340, 805, 98, -335, -323, -211, 316, 838, 636, 274, -601, -187, 567, 488, 714, 203, -467, -579, -249, 169, 356, -230, -706, -743, -458, 204, 301, 87, -342, -820, -552, 253, 543, 380, -57, -358, -313, 318, 493, 889, 430, -696, -351, 36, 430, 612, -23, -244, -713, -371, 408, 363, -131, -403, -568, -493, -128, 18, 537, -155, -843, -432, 1, 186, 587, 66, -235, -238, -246, 663, 552, 552, 201, -220, -89, 576, 836, 679, 198, -555, -130, 8, 495, 369, -118, -464, -747, -596, 172, 196, -347, -663, -1010, -361, 293, 247, 269, -369, -542, -92, 254, 634, 856, 16, -59, -197, 70, 842, 753, 219, -22, -259, -189, 403, 268, 245, -558, -993, -448, -175, 46, -171, -482, -953, -436, -340, 173, 285, -315, -416, -333, 119, 636, 634, 350, 462, -340, 467, 923, 1027, 702, -47, -259, -294, -101, 350, 297, -414, -814, -773, -378, 102, -55, -396, -785, -772, -489, 56, 144, 202, -299]
2493b99l4L11L50M84k0n79r4K8M08M29n08m33P2n04N35R5J64m52q62J9N28J22
2515b40J39q3n24l66N74L75Q06o43l34K11k8N05L58k67K20o04Q7K96O7J52%q75
2537a74k45K86J82K17k08q69J57R4K11N39j53l25m45N5Q15Q8k4J7m52j09O56K65
2559E78K25j21m93j13P7J53M24l56m26o34J51P96J13l40j09o85J5L84L94L93m85
2580e9n85J84K26M02L71k36l06j48K89L71J03l34R8m33j53M80m1P15r27p07M48
2601b42R2J30L76m45r9p43M91N66p0j30k79k97R6O09K99J26n04k32K9J99M68J0
2623D50n87q8o4J62O42Q0l88m81M8J62L34p9K1k88n24N78n2P4J19m28j60K50k9
2646b48N87L5k45l10k23M86K84Q2k50l11l59M88N52j18M3n23q2j15L36pK95k02
$$ y = [-299, -333, -22, 328, 812, 792, 213, 119, 147, 555, 984, 476, 43, 115, -389, 146, 241, 405, -47, -909, -890, -362, -240, -101, -184, -708, -1074, -500, -125, 681, 38, -296, -85, -113, 392, 750, 483, 703, 99, 186, 482, 549, 701, 701, -174, -419, -133, 49, 266, 58, -811, -654, -560, -349, 190, 37, -288, -733, -678, 137, 225, 201, 218, -234, -343, 313, 578, 803, 682, 189, 76, 153, 306, 730, 374, -52, -686, -535, 261, 374, 34, -75, -760, -745, -361, 33, 426, -59, -644, -460, -234, 168, 539, 303, -3, -151, 138, 509, 612, 278, 376, -57, -210, 270, 229, 944, 17, -690, -242, -150, -20, 356, -89, -188, -931, -440, 126, 56, -74, -353, -650, -554, 55, 354, 480, -24, -256, -227, -28, 440, 450, -137, -225, -289, -127, 515, 595, 207, -274, -226, -64, 270, 191, 212, -76, -600, -22, -74, 0, 119, -309, -469, -219, -248, 339, 374, 129, -181, -404, 82, 366, 448, 198, -113, -472, 16, 568, 450, 493, -30, -112, -227, 109, 102, 397, 195]
2668A95k64j42j41Q46m28j9l48j42K01M08Ln8l32r3L83j82L59N7l91n8J35J38
2690A27K94j07j1l93k9K11L27j15k9o43l1L23J63l6K07o59k23J46L57N44l23k24
2712a24k38o4K50N97k4n1m12k40L52K88N6m4l71j93P2K23L96j06o76J72j85J07
2734b15M53K1q1q48K21L86K36r2k50l25l7L91L65K46l29j02n3q3K76K91k58q9
2756A24n64L05L23Pj39j62r2j88K06K01M5M0n34J70O9R0N70k22k88j55l2K64O2
2779A00k3Jl43L5J93L34Pl12k14k09K44M50J6j00l34j41J18K90L95k25k63j02
2801h3j2K21K41M5k53n03j04N88O5O7j79k97J37l60M10J30n5l00n9J59O0J30K48
2824B96q8m64J07L93J02o3j74j41p0n1J29O39n16k58L8l44O31j77O3m85n8r6M52
$$ y = [195, -69, -211, -352, 494, 66, 47, -301, -443, -242, 166, 169, 111, -221, -314, 69, -113, 246, 303, -88, -146, -11, 127, 421, 314, 303, -90, -119, 92, 419, 304, 275, -368, -399, -76, 87, 51, 258, -401, -624, -478, -121, 423, 100, -124, -362, -426, -176, 421, 397, 346, -66, -306, 46, 334, 390, 346, -25, -218, -146, 77, 473, 367, -309, -137, -322, -215, 238, 259, 178, -670, -449, -63, 173, 81, -169, -494, -531, -140, 225, 471, 142, 40, -13, -96, 180, 471, 213, 124, -440, -135, 188, 195, 56, -106, -198, -386, -180, 21, 66, 106, -428, -258, -189, -99, 471, 249, -39, -194, -226, 38, 100, 77, 78, -265, -230, -37, 297, 304, -8, -222, -431, -187, 263, 279, 179, -155, -296, -178, 112, 507, 282, 19, -83, -95, 126, 367, 412, 159, -344, -448, 140, 205, 272, 93, -204, -67, -427, -17, 113, 58, -242, -301, -142, -82, 48, 296, 208, -256, -149, 244, 346, 283, 109, -32, -102, -153, -24, 615, 99, -159, -121, -465, 166, -11, 52, -433, -491, -587, -135]
2847a35J35J31j26l60J80K5O33k80j83N8k34Q1L04m4K33j14o20K33J77K81l40
2868C5j91j56J92k20M33j09k17n4j11k3M51j27o1j51n6J86L51K89j66l95K72M1
2890B13N0J27M0l09k36J40J45J6P6l10q5p24N02M09j64j2k80p4P3J59P9K22l78
2913c21j8K01J88M64k10l45J99J5J52R8k79J14k59j36N25l59J84j70l14j19j43
2934e33J81N67l85j34j11Q3J10J58r2J87l38R1N34J29r9j78J89k67J46J26L55
2955G19n05k70K39o56L91L02k15k76P9l58J35K37J77k69j11J14j16M41J97k37
2975A8k65J63K59n0K09L9K52l81K7J93o0R9k67l88n7J84k9K35m18j92j72M5J83
2998c73J92j81J75k73j03P48k05P9J7j47K90j18J63L72l45l85M45j84L81k42m97
$$ y = [-135, 0, 131, 5, -355, -175, -150, 483, 203, 20, 78, -156, -75, 229, 185, 418, 304, -316, -83, 94, 375, 35, -156, -312, -120, -340, 93, -16, -233, -287, -398, -421, 30, -97, -158, -309, -365, -179, 172, 461, 295, -100, 172, 213, 263, 390, 430, 121, -115, 25, 170, 186, 262, -48, -133, -857, -355, 54, -110, -122, -402, -476, -403, -244, -165, 57, -321, -339, -138, 50, 514, 304, -41, 158, 173, 325, 423, 144, 258, -1, -137, 388, 29, 213, 43, -271, -390, -533, -352, 215, -170, -304, -415, -332, -222, -64, -156, 31, -307, -216, 318, 447, 348, 170, 359, 92, 238, 364, 719, 214, -56, 183, -473, -82, 220, 5, -271, -192, -550, -415, -178, -1, -270, -381, -267, -383, 58, 255, 18, -247, -84, 175, 125, 334, 373, 625, 244, 271, 464, 404, 503, 236, -152, -209, -25, -54, 181, -237, -429, -601, -556, -373, -181, -362, -187, -460, -563, 185, -20, 59, 76, -71, 219, 101, 264, 636, 291, -94, 351, 167, 548, 306, -191]
3019a91k21p1K31M2K28l33qm7J07p2J30Q3j9j48K21M8N7M90k81l43L4J32J93K66
3043E28l47m4O9j84lJ57O7l43m18J19L39L3k2l2r3k73j1N88K99m05K43k32q6K07
3067A56N6J9J56n12L79l5pj86Ml47K17l2K7J88j48k88J6L02l2J21M9K6m47L66
3091D8J64l66N16k64j79L08k42K25K1K5l93k1k66M50Rj11J5k95J41L71J50l61
3113e5j53J68J9J65j8L14m51J6K17n4o0J90k34j98p3K17j2J45j98k89j13J12J35
3136b10M2M41m78r9M75m1l7J32K5k62N8M9L67J46j72k33m58M29pk75J19l6j69
3159a94k97K02J17j15r2J0K32m3J62K69l38J48l24O70O0k06J07l36k0L59k39K50
3181C82j43n86J27J98O3J53j22m18jQ2K94j20m3J60j91k31L06K31K27k92r6K41
$$ y = [-191, -412, -483, -252, -210, 18, -315, -323, -370, -263, -335, -205, -122, -141, -289, -68, -20, 37, 527, 246, -97, -63, 69, 262, 528, 181, 137, 206, 22, 19, 176, 243, -100, -518, -399, -60, -27, -49, -81, -174, -447, -458, 130, 429, 24, 267, 35, -51, 156, 212, 231, 387, -125, 254, 219, 212, 26, 30, -317, -100, -132, -105, 83, -65, -353, -337, -35, -67, 54, 103, 129, -318, 48, 212, -154, 362, 98, -81, 227, -15, 210, 231, 256, -137, -158, -424, 26, 35, -76, -61, -356, -215, 156, 306, -55, -208, -40, -21, 144, 126, 440, -11, 5, 222, 168, 108, 298, 64, -134, -207, 10, -2, 143, -55, -344, -457, -345, -210, -168, 273, -205, -304, 171, 130, 93, 225, 250, -12, 46, 95, 462, 608, 436, 203, -255, 174, 167, -108, 11, -25, -194, -491, -289, -172, -287, -379, -369, -137, -180, -18, 251, -87, 61, -263, 407, 467, 261, 368, 32, 12, 371, 132, 382, 239, -347, -220, -22, 41, 194, 72, -346, -347, -265, 29, -91, -134, 26, -165, -396, -90, 141, 368, 76, -20, 221]
3203B21j30K25O1j60k57K29k56J38J51k23rk62J84j47j20J81q8j45K51n6L28k1
3225I5m8k27K50l31L32K62j55M0k33J34K0j14M02q5m13k22K73mj90M49n24J7j30
3248d02L99k7mj27nj2J15J44R3j79q4K23L2j6K64l46j6o9P5l9J32j80k04K38j94
3273a89K19k3N3m8j74m5L23N5K2L4l50K48q5lJ55j13k37J2j2J17L2N6m2m21L31
3298h5Q8K03k20K2k21K53M5M8Q6J9j77L48l36K50p4J18l59k31R9K27P5r8k77k96
3322d93M42k11J33J64j37l59J87J86J84j36j31K37j94J19M50N5k51k80K14J76
3342C55m4p7M6J5n80K49l9K19n0m94M24k44j4K17k87K34j70J24K12k42J42J22
3364A18m8l46M20J95M4m4j96J36j89n2K04j68r7k07n2L71k25M6J20n2m46M21j46
$$ y = [221, 91, 316, 377, 217, -40, 189, -67, 71, 222, -1, -10, -272, -88, -235, -355, -174, -262, -407, -156, -212, 116, 95, 47, -180, 70, -261, 71, 333, 178, 218, -15, 119, 139, 25, 427, 342, -71, -293, -20, -24, -214, 235, -289, -272, -402, -3, -30, -34, -161, -166, -178, -63, 81, 174, -5, -89, 134, 166, 150, 414, 68, 52, -17, 58, 19, 151, -29, -233, 5, -189, 30, 7, 60, 12, -162, -207, 116, 171, 193, 227, -123, 125, 40, 37, 192, 79, -158, -146, -158, -41, -9, 47, 5, -416, -85, 3, 206, -14, 8, -213, 40, 85, 133, 219, 238, 61, 409, 73, 323, 249, 367, 8, -223, -124, 103, 178, 80, -197, -493, -51, -262, -129, 35, -102, -461, -274, -88, 96, -40, -171, 66, -128, -9, 441, 496, 245, -35, 179, 355, 311, 234, 280, 295, -285, -36, -75, 144, 94, -400, 24, -220, -234, -17, -304, -70, -240, -116, 96, -146, -4, 118, 70, -276, 144, 339, 383, 339, 143, 279, 90, 38, 242, 74, -23, -230, -282, 89, -136, -90, 30, -22, -468, -47, -193]
3387a93Q8L93m49J38j63Q7K98M7m6jk27K59J16q3J29k29l01J68J04P3m02NJ42
3410d7l6N9Q1l5j32j47p6L41j05o1K32k38o1L33o3K85k38j80K69O5k72L60l51
3433a7K0j65J45K18j6j62j36J55j90L17j10P5j0l81O5K60pK82m17n1r4J61l7M58
3457C63l91P4k62J28J85k7j67J47q4j19K37pJ87p3j44m4j9K27r2J5r0k26J38j51
3481a95L13j39p9k20J41K41L8j99o9Q8J37j77j20K71P2n1j63K8K50L5k08N0l7
3504Gr9L36R3l03O6l74M56n19O2J33j78K86k44J12M4N0j32j56K71L39k02M7Q1
3527A76j5o9J32K3l2N2j57l12L79R9o3P1l32J43j84R7J10j53j07k8p9p9L18q7
3551i7L04l98LR0L18j33L6j71J35l05K84J75Ok30k97K38L4k9m9N2L2j50K66j18
$$ y = [-193, -105, 288, -161, -23, -186, -99, 199, 246, 200, 199, -28, 231, 347, 264, 393, 164, -137, 31, 135, 208, -194, -189, -47, -83, -24, 57, 22, -110, -257, -333, 8, -97, -158, 74, -164, -225, 108, 45, 330, 92, -88, 181, 246, -26, 334, -17, 3, -162, -17, 201, 185, 23, -113, 42, -148, 169, 59, 134, 124, -257, -192, 68, 61, 343, -74, -125, -219, -58, -95, 363, -28, 46, -216, -88, 97, 70, -97, 50, -34, -153, 84, 77, 264, 191, 47, 3, -16, 211, 119, 134, 44, -182, -44, -195, 118, -21, -100, -320, -179, 62, 100, -99, -168, -80, 57, -120, -240, 31, 103, 52, -111, -83, 167, 202, -6, 44, 7, -92, 244, 337, 34, 100, -274, 182, -337, -275, -142, -320, -34, -278, -166, -122, -72, -204, -360, -89, 250, 48, 95, 176, 161, 92, 224, 247, 215, 267, 110, -202, 177, 276, 213, 284, -48, 95, -89, 8, 118, -35, -142, -170, -249, -328, -10, -97, 207, -191, -188, -98, 220, 87, 123, -48, 87, -218, 66, 241, 247, 17, -280, -42, -8, -37, -86, -34, -2, -152, 114, -4]
3575dN7q3j2j45K12M5qL1K29j89k86L72j04k87O3M08n41J93J14J24%l62J63l1
3599d1n7Q7q8j52K35kJ26p2Q7j49r6L12l38L1L17p6l27J42p0K90J1l52K21n5O7
3624E1P8j45K47l33L1k92M73O4j09J78l27L2K25R4k19P0j18O0j37L59j09k86j42
3647b55J15j16J1J35K74k69k49J32L17j22J46j29p6P9R9K47M3l03l63M12q2L26
3669C72l19O7j71j44q9K01K5L3n9r9j31R4L27k39q0J54pJ74j19j06J19j13J43
3692C3Q6K34j14j48m7o8M3j64M54j16m69J27n1q7J58P2kN2k83J96L72l19j5J7
3716c9oJ0M2p6J32J11m6q5K59k34L9j20J27k60r8J52Q0o0l4q6K10j56J65J99L9
3741B65n43Q9K88N7p1j15N9p8N4J58m6k9k3p6J13j59J42J57j30k33n0K42r0K68
$$ y = [-4, 53, -30, -42, -187, 25, 70, 62, 93, 322, 133, -153, 219, 115, -172, -109, 299, -242, -49, 65, 189, 189, -173, -10, -41, -98, -11, -99, -251, -16, -18, 108, 36, 123, -26, -122, 190, -148, -117, 200, 124, -203, -61, -131, 159, 170, -182, 39, -16, 51, 129, -16, 231, -102, -71, -363, 110, 174, 65, 243, -84, -52, 173, 267, 48, 118, 0, 60, -77, 282, 173, -113, -255, -140, -256, -245, -110, 164, -105, -354, -222, 95, -27, 119, -10, -86, -7, 92, 339, 382, 79, -284, 128, 46, 372, 53, 120, -51, -195, -284, -83, -58, -25, -84, -183, -314, -220, 107, -132, -212, -58, -65, 109, -10, -116, 3, -110, 33, 119, 353, 239, 91, 44, -24, 19, -145, 309, 193, -276, -149, -200, -287, -129, -57, -59, -7, -290, -94, 278, -41, -56, -39, -45, -35, 7, -69, 63, 174, 128, 43, 302, 68, 107, -13, 114, -146, -244, -92, -12, -72, -106, -192, 18, -138, 27, 226, 265, -278, -189, 99, 156, 85, -30, 29, -49, 5, 163, 117, 88, 65, -11, 102, -57, 85, 242, 112, -121, -171, 71, -19, 249]
3765B49j86N7n3j11J74M7J5j19k15J27J09Q2N3j53M8j95j27K01j30oj63R0J20
3788h6J21K27k79N0j23J86K0L3r0p6j82K17P9M4J38j65j69K83k03k29L78j3j85
3811b4J9j48K40k48M5L4p6M9K35l13K00J72J31m04M3L71l27K09K3j71Q5L38k37
3834B46k0l38J76r5Nj3K23m00j0O6l0K81k72J21J69k72K98j31MP5J79K07m40M09
3858D38j48j34k13J79j40O0j08j26K1J93j07j49J09j4j71M04l16J4R6J3K82p3
3880A10o0j89K06j37K72Oj98J6M66k26k63q2J11j79J21K6k00P6k15j8K89k43L88
3903G7k93J58k12P8K87n1m4mJ0R4m3K05j95J39K0k39Qm8l9J54L9l25J9j5O2O7
3929i1j22NK77j25m7q3o0jK94j03J13P6j53J76nP2k06L7l5M2P3R0l62R4o2J7o1
$$ y = [249, 63, 120, 67, -44, 130, 177, 192, 73, -142, -15, 94, 176, 229, 76, 124, -71, -198, 3, -127, -133, -296, -206, -86, 35, 262, -17, 33, -90, 96, 116, 149, 59, -17, -199, 18, 97, 141, 279, 114, -55, 228, 25, -204, 174, 161, -24, -5, -153, 87, -161, -116, -82, -158, -109, 126, -187, 13, 185, 316, -88, -45, 326, -1, 208, 231, 60, 145, 483, 246, 226, -112, 64, -31, -26, -39, 184, -216, -226, -160, -190, 91, -181, -60, 109, -163, 135, 4, 8, 83, 262, 469, 29, 438, 290, 156, -57, 122, -18, 42, -66, -192, -171, 22, -85, -234, -125, -139, -310, 94, -222, -208, -112, -99, 183, 110, 50, -139, 67, -70, 202, 208, 10, 26, 492, 266, 3, -79, 32, -147, -26, 0, -200, -124, -339, -357, -68, -311, 77, -216, -58, -270, -192, 95, 44, 0, -4, 6, 100, 57, 262, 67, 206, 226, -13, -5, -53, -92, 62, 101, -224, -205, -220, -158, -91, -213, -208, 69, -56, -103, -186, -246, -247, 47, -56, 57, 133, -20, 156, 151, 223, 17, 54, 19, 61, 134, 224, -138, -44, -106, -89, -150]
3956a50k91L89j1J95k38J94l06K21K7J02j51j10k1J03l9J80J17j0j54l2j46K37
3978A06o7o8J23j94k74M84L4j45j49P1L0oK02k29L45k14J55o0q4j68p9J49M8O5
4002G5j75rJ07p2j69L25l09N8NJ95m5j03K84j23P3q8Q9R8k00O2L8j79K2m7N4J15
4028H1l0j51j03K60J08r8Kk64J1K08P6ll14l6K45N6j27K67r9J92k73R0K19l23
4052fK10q3p9j42j29L91k15J57k8k85J71L7j57p2K25N0Q0p7qq6J01k20L41k9k32
4077h5L88m89L83j45J66j48q7nk6O6j93Q1K9k35M99l20K37l49K29Q7j68K32l94
4100b47K41m6J02l9j74M0m2K32J66k49J84J2m0k71L8J88j30L5O5KML7p7o8j91
4125b28L3L40J00l02O1N8p1J6Q3K13l44j3M8k22P1M2J78oj1k01J09k5p3J72J27
$$ y = [-150, -441, -52, -63, 132, -106, 88, -218, 3, 30, 132, -19, -129, -150, -47, -86, 94, 211, 201, 47, 15, -131, 106, 39, -29, 94, -100, -374, 110, 144, -1, -150, -79, -49, -55, 147, -82, 263, 49, 204, 144, 60, -108, -187, -38, 10, 75, -100, -109, -2, -74, -243, 82, -227, -169, -164, 31, -14, -117, 167, 44, 117, 29, 118, 216, 16, 78, 116, -63, -41, -88, -34, 81, 51, -100, -203, 57, 165, 67, 69, -195, -184, 24, 100, 97, -217, -253, -8, 48, -79, 188, 89, 281, 8, 98, 317, -6, 204, 121, 42, -100, -229, 162, -53, 104, 76, -209, -38, -1, -158, -230, -5, 45, 125, 48, 40, -46, 55, -165, 176, 147, -85, 303, -186, 197, 52, 218, 70, -17, -22, -48, 18, -175, -94, -65, -300, 199, -121, 116, -233, -4, 83, -85, 147, -247, -6, -52, 50, 11, -163, -123, -165, 67, 233, -16, 168, 180, 140, -131, -93, 95, -35, 0, 65, 67, 71, 108, 31, -37, -228, -195, 145, 245, -57, 4, 62, -9, 7, 90, 303, -41, -54, -6, -228, -157, -115, 63, 57, 46, -155, -46, -71, -144, 28, 155]
4150A55j93j89LJ95J07l56K02M9q5NJ23nj24J25m5n3j16K02qp8J02k78J57K36
4174A31j21L49m85K73k44O6Q6J10k32L28m23m5K35j49j9J20O8k16L13l91J43R9
4196dn5QK24j65r6K8q9J72K20j50k6J36O0k09L4J04l36J84J44m5q7J46j90P3n68
4221d87N57N0j69rJ4J32k33K01n5K22k45j55K53n3j94K93j14Ol3K33j37j61J96
4244A12j00j71M2J58j38n8n3N6J43J30j65J81l19J05j51L65o9j26j30K75l57L93
4266A23n9k25L29m4m5m8J00l35K21L7L9k4q5R8K2k62K46RJ49J1m46K10J16l39
4290b02M21k71L3L5J28Nj12l4P4k50J80j85K74j70J74J62j62j26J67jO0l67k3
4313a90P9J71J18P6k5k12j83j54M84k19o1J14j59M4K05j42L8m8o8P8K8j03J06
$$ y = [155, -38, -227, -224, -29, 78, -278, -76, -27, -112, -107, 16, 11, -113, 12, -33, -86, -202, 0, -8, -86, 16, -262, -105, 131, 10, 359, -126, 147, -97, -31, 55, 165, -67, 261, -162, -207, 28, -121, -140, -20, 48, -168, 145, -246, -103, -4, -59, -51, 173, 8, -88, -60, -149, 23, 243, 93, 67, 203, 263, 54, 88, 192, -144, 40, 184, 139, 52, 198, 8, 81, -487, 70, 120, -49, -58, -44, 88, -145, 56, 1, 223, -22, -177, 76, 23, -171, 122, 8, 14, -19, 214, 77, -84, 112, 12, -159, -117, 41, -97, -155, -208, -152, -9, 121, -44, 137, -182, -77, -228, 137, 68, -58, -188, 87, -270, 123, 64, -161, 168, 124, 79, 31, 131, -204, 17, 54, 93, 69, -16, 82, 104, -158, 88, 97, 246, 257, -189, 21, 137, -202, 219, -52, -19, 16, 144, 149, 37, 3, 77, -173, 7, -178, 96, -74, 100, 262, 100, -26, 141, 140, 200, -167, -190, -111, 60, 178, 254, 229, 17, -166, -320, 164, -55, -116, -2, -161, -117, 88, -54, -16, -64, -132, -54, -26, -129, -23]
4336b3K24q8J69m53M44L8j20l79nN05k90k75M36m87L51mQm03j5L68R7k55J67j9
4360ij31M0qL4r9L81j30n0r7K4j65M29M6l9k14O1L7k85L09j25m2j3J48p7j44k
4386a21J32J34j1j49L1M02k13l60M94k15k60L21p3K7j15J28Q8j91j50q3M15k47
4408a6n2M9j60pJ6j6j51M28n0M5j30r4j45K61p6J93j34J42j30J91j38J95j89O3
4432I5K4k13Q0m5j17Nk03K57PK07r6n0J4jl9J76p8j82j02K68J41n5K41n02K10
4457D2J07m07M58J3k62J02J4M1j65j96L47j80m8j31J09K61l38K43j87K81o1RR8
4480A50Rk10N3L3p5J06j1k0M6J15k00J78p7k11O0j8j1K59j35J40k68K26l36K79
4504H2L0k86J76j5j07J51L42l40n5p8K03j04J86k36K01l83Q1R0O4O0L0j00j43
$$ y = [-23, 201, 113, 282, -171, 273, 311, 191, -188, -193, 312, 22, -253, 183, -304, 47, 43, 51, -352, -367, 1, 98, -157, 10, -9, -140, -100, -108, -74, -173, 208, 78, 28, -69, -45, -210, 219, 265, 226, 12, 73, 110, -175, 134, 9, -33, -46, 102, 25, -119, -121, 11, 145, 134, -15, 16, 418, 205, -155, 339, 124, -136, 185, 112, 139, 24, 152, 240, 49, -101, -184, 231, -16, -68, -19, -179, -186, -170, -186, -337, 91, 41, 86, -44, -138, -283, -22, -98, 95, -39, 103, -27, 164, 26, 221, 32, 95, 119, -94, -14, -59, -176, -171, -374, -117, -110, 97, 1, -49, -35, -36, -75, 101, 23, -159, -261, 7, 148, 93, 334, -168, 42, 149, -258, 200, 213, -49, 53, 67, 108, -57, -253, 94, -86, -134, -265, -156, 105, -233, 10, -177, 104, 43, 52, 150, 159, -51, 2, 35, -40, 66, 55, 35, 81, 196, -4, 174, 97, -114, -54, -72, -83, 176, 41, 181, -87, 139, -197, 82, 112, -174, 2, -13, -120, 31, 373, 33, -22, -100, 103, -1, 185, -51, 150, -233, -152, -62, 2, 62, 92, -8, -151]
4527a51M7j9K45p4j62K61j94N1K48k71J25j98q9J92j01J14j42rM2P2k93M17l22
4550b11J51J6j35P3J40J86j09j21j43P4J90j70J81R6j24J44l62Q9MJ3k0K02k78
4573a14J69r4n8j97J94m6J10o9P2j95K27l18L80J01j20K47j85k60L84r3J16J8
4595B69l08M0j39L33k53l1Mq3j13L66q6P8m23L69j19lJ20l06K43q1M4L61r5k4
4619A63j23L23k63P2L2j72j25J52R0r1j20R2J03j44j47o0nL21K0j83Np7O6O2j00
4644a09k32J86K71J15M6j27k38P6J46k6P0n1o4n6JL23n57K81Rj35n6j72K38J28
4668F7J15k22o9o0J35l4J9J05Jq7j82M35k76J61O2j40k28M84l06N0n5j19K1M0
4692h3j8J51L3j73J83r0J68r1P1k9j86R3J29j48J03j13M4j28K13l54J24J89j11
$$ y = [-151, -104, -123, 122, 48, -114, 147, -47, 4, 252, -19, 106, -92, -181, 11, -90, 24, -118, -127, -85, -13, -306, 111, -211, -60, -44, -179, -106, 34, 220, 111, -10, -153, -79, 111, -59, 122, 218, 94, 238, -124, -35, -31, -18, -38, 164, -114, 55, -39, -97, -294, -100, -146, -36, -105, -33, -228, -1, -319, 61, 162, 42, 289, 104, -156, 228, 135, 251, 269, -39, 1, -138, 195, -58, -89, -85, -168, -281, 85, -1, 77, -346, 23, -96, -99, 21, -285, -42, -123, -79, 282, 187, 163, 40, 363, 100, 172, 204, 32, -93, 59, 149, 58, -62, 30, 133, -11, -158, -218, -223, 98, 118, -65, -60, -137, -71, -9, -109, -341, -155, 116, 231, 277, 150, -88, -12, 134, 108, 178, 127, 63, 7, 8, 331, -226, 55, 64, -71, -127, -299, -61, 67, 182, -40, -109, -169, -34, -68, -49, 56, 57, -30, -212, 223, -53, 108, 170, 30, -198, 286, -20, 30, -25, -144, -123, -83, -101, 50, 83, -90, 93, 3, 171, 80, 151, 122, -64, 29, 158, 10, 113, 0, 44, -84, 129, -225, -101, 88, -23]
4715b3j20K58k67k5j2K76J10r9M5j96K6k72J64N8J49j55J93l7j18m4K88l46K8
4738a19K0n7J40K89k93k43M34j24q7j11j4N9J14j54m2J58L2L34J9n15Q7K57m7
4761A37j31M49n46j01L41k06K38j15l7K27l31k30Q6K82j79R0R8j06j48j24M53
4782A47l54K14qJ13K9k56K5K70j60L8O1M6j10q4l2MJ73j28Nk2j31r7K3J63O1Q7
4808G7J00l11O6K33j89J21j7q7J13j09L1K8O1j74N7O1J00l56l3J06L0J62jl35
4832b66J77j11lJ64j71m4J26J97k06J47j45L35m5m08M31N7k09J01j39K67j18k76
4854a39R0r7J91j43K11k95J79kj00K02l25M15l04j30Q5J92J44j37O6l07J58J59
4876A13k12K26j49L3J92j06m2l62L46j8j37J49j15k32L20j01K3K71k64L9P8k49
$$ y = [-23, -143, 115, -152, -177, -189, 87, 197, 98, 143, -53, -27, -299, -135, -77, 72, -83, 110, 73, -45, -89, 199, -147, -119, -99, -156, -16, 273, -20, -263, 171, 47, -40, -151, -165, -106, 8, -146, -188, -30, 2, 336, 355, -160, -73, 184, 137, 6, 455, -91, -192, 149, -57, 181, 66, 29, 256, -75, -305, -219, 63, -116, -26, 72, -34, -182, -306, 147, -207, 7, -1, 112, 141, -115, -90, 180, 20, 58, 119, 165, 55, -29, -61, -57, 116, -12, -7, -29, -160, -257, -234, -71, -10, 77, 177, -134, -68, 165, -24, 97, 80, -7, 106, -3, 28, 56, 117, -57, 0, 61, 161, -195, -228, -122, -92, 70, 69, -266, -89, -200, -203, -39, -210, -254, -128, 69, -137, 10, -135, 200, 155, -253, 178, 235, 26, 127, -12, 255, 137, -139, -49, -146, 45, -98, 113, -182, -3, -5, -105, 97, -228, 187, -117, -247, -162, 30, 174, 37, 103, -204, -46, 113, -99, 127, -22, 11, 203, 97, 55, -307, 39, 21, -116, 33, -82, -314, 6, -95, -72, 199, -65, -26, 52, -197]
4898a97M65r1j65K4l5m6J14k83L19k50L04q6k9J55k45J09l3J01l09K86j41K51
4920B18l22K44n6m4j47P7k8J8J94l06J27m8O4j38R4K14k31L0J90k74q9J17J84
4943H8l8P3r7O7n6J38j13J92k25R1K3j52J29j34J53R4l76Q6N8j71J05l6k3r7J57
4968f4p7K01k5k66K70J20p1o1r1J65j51o5K87j86J7r7K69o2j02N8lK1k43J14j06
4993a48k22K26J10k14J20j49M30L0p2k50M47k52l0O3k7J83k62K24l76O4K13l46
5015b38L86k75k1K79q6J37k44j00K14pp2P3p0J74m01J02K07l04L37Pok82K43L7
5039I0p7N4j41Q2K4j7K89k6m96L67r7J92l50l6o3K09Oj6k24P4M7N4J1k0n2K68
5065A52k70QK08j62r8K05m9M9k71K81j58l5L12Qj48q9J8j47J71L15k56k57Q7j79
$$ y = [-197, 268, 177, 12, 36, 1, -45, 69, -214, 105, -145, 159, 73, 44, 199, -46, 63, 30, 131, -178, 108, -33, 218, -104, 140, 84, 40, -107, -30, -58, -40, 154, -152, -25, -73, -9, -147, -53, 161, -70, -40, 150, -124, -213, -96, 88, 50, 123, 26, 93, 37, 175, 62, 254, 29, 120, 143, -9, 120, -14, 139, 233, -143, -57, 1, -170, -65, -101, -124, -221, -64, -141, 60, 35, -231, 39, 159, 88, 27, -64, 101, -50, -115, 172, -14, 3, -94, 175, 113, 11, 69, 66, 87, -156, -42, -148, -370, -144, -34, -248, -128, -277, 153, 183, 111, -139, 308, 56, 26, 89, 62, 245, -17, 207, -169, -105, 108, -238, 148, -127, -148, 131, 45, 182, -62, -162, 52, 45, -27, 46, -24, 150, -251, -149, 58, -246, 91, 98, 92, -190, 53, 90, 13, 67, -74, 8, 32, 15, 304, 278, -218, 149, 52, 244, -106, -142, -205, 4, 10, -6, -230, -156, -109, -55, -44, -64, -116, 152, -118, -110, 98, -64, -162, 43, -6, 43, -228, 53, -105, -140, 172, 180, 32, -57, -39, -186, -15, 300, 44, -213, -126, -305]
5089c05N9r5N42k11j16J19L7o4J8j27Q7N4J06K84m26J02r6K45j65o4L8o3K04k26
5113f3j15M11J74n62K9J35m4j44k3J51N7q0k1j27J29K57n9k73j3M25l31K8J61
5136A02l58M34J64j59j67Q0j25Jj17r6K04J51k24j25K54j01J45Q0o8j84K73%r2
5159G2j51R8L8p7k0N1J08k03k4Q6K7j61J64j6J58o7j50P4Q0k37LK70j81J24k32
5184a66J95J06k55K87k67O1k70K20q3L4N0J99k39J06k49L24r1nP1M6K7j43j45
5207a87K51J45k42q6O2p6J4K23j36L36j64j30n9K2j41J52K68l42nQ1P4k94J28
5230a06K90j87o1j7J88j07K1r0K6N1o0K97k15J79j23J8J83l09k02L48j01j81N
5253a53J19j14K03l13J48K96k96K69l66K34q7J48J7P7k78K02j00J75K2k47K53
$$ y = [-305, -246, -341, 201, -10, -126, -7, 30, -34, -16, -143, -56, -2, 104, 388, -38, 64, -32, 213, 48, -16, 22, -41, 163, -63, -178, 233, 407, -155, -126, 9, -35, -179, -202, -51, 6, -74, -95, -222, -93, 164, 105, -168, -181, 244, -87, -59, 102, -256, 178, 342, 183, 16, 96, -29, -28, -145, -241, -37, 114, -110, -235, 19, -82, 63, 143, 75, -109, 164, 164, 72, -79, 19, 57, -20, -40, 11, 119, -84, -108, -22, 5, -156, 8, -8, 150, 83, -67, 7, 87, -150, -147, 123, -58, 66, -166, 29, 135, -120, 167, -100, -39, -309, -89, -172, -138, -88, 111, -128, -22, -271, 53, -38, -43, 28, 74, 101, -42, -187, 64, 209, -33, -119, -57, -133, -119, 104, -32, 304, 140, 10, -49, -27, -168, -16, 252, -90, -95, -14, 60, -234, -106, 184, -3, -64, -81, 107, 0, 21, -69, -43, 8, -52, 245, 30, 209, 86, 104, 287, -22, -224, 124, 23, -158, -153, -34, -148, 55, -258, -110, 186, -110, 159, -207, 27, -60, 88, 105, 182, -96, 106, 6, 181, 203, -44, 209]
5274B09o0j30J53j16j36J6L3r4pJ73K8j23J27p7j72Q9J81l3k10L14k17K50p6j68
5298d6M1J19k97N11k22R6l10J78l3J02j16oL4j00N2j58j45M16p3j19L17l20k3
5321a02Q6K7l1p6L62q5k92j4O6J00m9l0j0K10l8j65N3J21m13L22j26J02j84L21
5345A55p8k24J61q9J64m7j37p4J32M9j00K3K29k26J36m9K46m28L34j57M8jj79
5368a12J01Oj06J66L0j90O8j63J21M7K6j30K77j12m13M81j04j26J14O0o8m7J80
5391A06j12N2o7O6l62L37j73O9N1p4m8L32j56j44N8J78j04j28L42O0l21%M2J6
5415B0k25R3L9j09P1J98n0K4M8j10j41R6J79n1k7Ol26K28J73j39k5K13k36K27
5439A76q3o0j19k11K91J03P2l21K78q5l7j11nJ24j65P3Q8k4nJ5M2j55J63j70K04
$$ y = [209, 149, 19, 172, 56, -80, -64, -31, -125, -132, 41, 69, -54, 73, -4, -176, -87, 94, 61, -149, 165, -52, 198, 122, -46, -5, 114, -183, 328, 106, 202, -108, 70, 37, 139, 23, 17, 51, -49, 3, -155, -300, 116, 43, -76, 241, -79, -102, -16, 11, -20, -96, 266, 181, -111, -125, -59, 41, -8, -38, -48, 162, 124, -41, 12, 133, -280, 42, -84, 18, -166, 155, 77, -147, 14, -75, 89, 42, -95, -169, -37, 12, -88, -65, 164, -62, 74, 25, 271, -157, 177, 20, 68, 67, -112, -11, -5, -111, 55, 85, -105, -37, -200, -79, -32, -6, -136, 141, 29, -384, 97, -7, -133, -19, 41, -27, -74, 106, -6, 46, -21, 45, -317, 20, -153, -84, -33, -107, -155, 177, 21, -123, -65, 113, 9, -119, 223, 283, -38, -38, 4, 20, -205, -112, -73, -182, -111, 87, 37, 61, 109, -1, -142, -46, 133, 82, 55, 61, -265, -37, 136, -3, -28, 185, -51, 176, 93, 33, -86, -297, -6, 97, 169, -152, 126, 41, 4, -107, -112, 12, -153, -80, 8, -16, -21, -6, 36, -119, 44, -126, 78]
5464G8K38k84j52J52L31m27J18j48K0j49O6K99l66J18n5J03m9P2j11K12J20l64
5486a78J75R7j65pL04k29q3n9J35K7N5P4o0j15j13L41j76m5Q8k7Q3j47qP2j75
5511a36P8K2L4O1j59J20n0m5J88K7lj77r2j13M85j95r4J20j16R2o6J39k80N5P
5536i8J09J08j27rk90L20J63l72Q1k6K48n5k09MM15m30J57J22j07K7j09l1M33
5559C24l83K75j60K8M1l31K64M1O6l84M73m82K20l4Q4k23J33j29L00n9l41J92
5581h5j07K34l14K97J34Ol45Q2J45N6k79K78J37k2k35q4j5R4m1j1K02k70M02O1
5605C20m20J22k95J85K90j43j8j59L2K4K46j63N3j81k45L49j02P9L0k6J34k26
5627a14M2l3P7J03k61O2J93r1l8j6Q4k3r8K67j20mp5n7Lp6L4J11j90J35K16j63
$$ y = [78, 316, 32, -120, 32, 363, -64, 54, -94, -74, -223, -157, 142, -224, -106, -161, -58, -107, -35, -146, 66, 186, -178, -3, 94, -71, -78, 226, -3, -86, -145, -10, 17, 72, 146, 86, -29, -142, 199, 23, -22, 66, 39, 122, -25, -33, 39, -136, -58, -36, -2, 59, -100, 20, -30, -75, 113, 140, 137, -40, -132, -245, 240, 45, -49, 71, -45, 47, -19, 120, -160, -105, -98, 11, 119, -8, -17, -307, 13, 176, -196, -115, -141, 107, 52, -157, -153, 262, -168, -11, 111, 4, 31, -78, -109, 324, -59, 216, 56, 84, 125, -206, 58, 99, 165, -219, 254, -228, -8, -42, 42, -181, -48, -177, 123, 64, -277, -85, -192, 42, -272, 25, 159, 165, -180, -98, 47, 103, -176, 102, 239, 217, -18, -102, -117, -23, -64, -75, 127, -143, 259, 320, -100, 22, -273, -88, 202, 59, 41, -118, -86, -62, 184, 21, 74, -107, -352, -3, -105, -26, 4, -22, 112, -114, -72, -105, -28, 75, -186, -124, 69, -22, -60, -76, 8, -15, -113, 154, 34, 30, -45, -102, -99, -175, -141, -30, -220, -85, 131, -32]
5653c2n6Q6q6J68J15k60n9J41J78j96O7j79n8K98l5L2l15K12o3q0O0J60k19J66
5677D5r8j02m5kL90k61M4N9J07p9k24OK15l5J20K6j02j61Nk5J82Q3k40J16j44
5702a20J06n6K46j15j23r6P1K15k18m9J57r4L4K20k76kM0j04K00k2k01J30J95
5725A38j81J10Q8j38K30q2o1l47K72k07L53j86J71l89K20M6j15J01J89j23r5O9
5747F3Q4L2l10J77kn7n7K0P1j71L15j43Q9r9k47M42l1l3j1j07k04K97k42Q5L32
5772B93m10J24J22j92J37l83O9P4J73mN3n3nj05K51j00J03j69n5nJ19k54J19J34
5796C6m1J04o5k1J8m6k08K83l3j0j06K4R0j84L8o5L5N5K20j58j78K26j6O0q4J84
5822A58l64K17mO8j4o4L2k70L69o2l88L2K87k3j7r2mJ71k52J1J58J16J20l06Q
$$ y = [-32, -88, -2, -88, 80, 195, -65, -124, 17, 195, -1, 66, -113, -171, 127, 92, 124, -191, 21, -42, -122, -62, 98, -121, 45, -53, -155, -200, -202, 188, -73, -29, 30, 137, 58, -166, -160, 55, 20, 140, 166, 64, -97, -92, -117, 65, 148, -92, 24, -120, -14, -70, 176, 61, -62, -158, -87, 128, -90, -139, 18, -76, -42, 178, -98, -100, -60, -164, 36, 14, -187, -57, 138, -43, 67, 155, 17, 247, 165, 104, -243, 29, -178, 175, -11, 160, -229, -9, 37, -78, 23, 212, 89, -6, 63, 147, 179, -131, 46, 44, -13, -70, -50, 21, -150, 165, 22, 111, 12, -235, 207, 176, 143, 132, 25, -179, 118, -124, -39, 293, -117, 7, 129, -63, 74, -309, -240, -166, 7, 3, 56, 3, -2, -107, 144, 44, 147, -22, -77, -82, 37, -217, -98, 36, -5, 99, 34, 13, 31, -15, -223, 60, 27, 17, -89, -65, 25, -159, -121, -186, -151, -96, 124, -34, -212, 14, -2, 58, -26, 158, -206, 11, 7, 75, 61, -3, 29, -241, 128, 66, -322, -290, -3, -26, -43, -135, -139, 32, -220, -209, -51, 65, 185, -121, -113]
5847a13J14P6R8R8r0l21J82Jk93K34Ok88J96P3q5K66k35p7J26j38J07l79K40J82
5871b0k56J3K26J1j06J36J07j25L15j96NK4o7J52k11O9k62J02R9J4K75m99J80
5894a4J73k88O2R3L4o5M1L9m72N98k51j5o9J29LJ49j0j84L2J14m9k3k37L28j60
5919d2p1m2K5PO9j2P9k12K30p0k82J05L12k10j0K8o3J01J11k73n8L82j11q2K65
5944A76m02K48K3l5j58J84Q3j98J19l2j17J97%k31PK8L6J07J55j84j37J9J17r9
5968i4J31l3j12J83k48L23q7j03Q6j37P2N6r8J05k13K78k19J2J12L6O5j36j3J66
5992A32j36p5n6l3K21JJ3k36L02k34Q3lJ90k41J9KJ39j12r1j49L87k51J08K01
6016A81J24j94J43j08N9r1m5J15k14L39m72J52k00J61Q7o1j80L58j17Rl09K30
$$ y = [-113, 1, 77, 175, 273, 183, -138, 44, 45, -248, -14, -8, -296, -100, -27, -112, 154, -81, -158, -32, -170, -63, -442, -202, -20, -276, -263, -37, -26, -132, 4, 111, -14, 301, 105, 110, 134, 67, 219, 8, 77, -185, -83, 16, 30, 305, -194, -14, 159, -129, -67, 26, 60, -5, 36, 75, -397, 201, -50, -65, -134, -5, -2, 147, 137, -47, -15, 99, 50, 27, -210, 118, -42, -113, -155, -130, -123, -54, -66, 13, -199, 31, -39, -321, -216, 96, -114, -124, -96, -159, -58, 53, -220, -278, 104, -7, -89, 176, -226, 22, 45, 10, -148, 36, 119, -79, 40, 8, -109, 88, 88, -143, -136, -108, -72, 35, 190, 6, -131, -112, 5, -94, 37, 4, -108, 75, -173, 150, 63, -40, 46, -91, -19, 37, -61, 44, -169, 109, -110, -98, 14, 50, 115, -21, -34, 132, -4, -79, -135, -168, 53, 54, 67, -169, 133, -101, -18, -21, 169, -72, -53, -51, 88, -24, -115, -264, 123, -128, -20, 181, 305, 111, 254, 146, 205, 114, 69, 184, -30, 309, -163, -11, -211, -50, 37, -24, -204, 154, 37, 46, -263, -33]
6038c3j1J74j68M8K61k41N2l1Q7j04j24O8J07j83M9K47l64r7K84K7k81J48J04
6061A9l6J6J26k82L5L0l3R9K7N9j62K16O9j89O0N7j95K8n1J41J67J12m70O7J26
6086C6j10O4L7j07O8k5j80J11k2Qn5J28q3J61J71k83K68L6J22l37K89j82K0j10
6110B5N3j06J3r3K35R9r0k81Q9o8J79j61J05J69m07L53j49P6k98M89m0j56J67
6133B03l8l07L82l24K19J5j04m53P26l53q4J93N5k52Q4K23j87q7N2L22p2j90J47
6156A70m01J37J79j91Q4l1j2M1N1j55K12j73Kr2J86pP3j17k21J86L23k55j59O9
6180a01J39l05M0L26k40J20j13J14L9m8k13K82k47M6K54o2j90J46J92o0j93l4
6202a08Q5J7R8O1j74K8k23P4J97j05L4J89k79J83o4k01K04j6n7J6lm7r5l2J4n1
$$ y = [-33, -44, 130, -38, 10, 271, 30, 82, 51, 138, 34, -90, -22, 85, -98, -49, 198, -166, -263, 21, 48, -233, -85, 19, -17, -1, 125, -157, -122, -92, -125, -26, 1, 60, -102, 114, 183, -6, 54, 111, -84, -56, -107, 34, 201, 313, -157, -90, 36, -74, -10, 27, -80, -12, -37, -217, -106, -128, -120, -175, -47, -130, 31, 202, -81, 187, 223, 345, 8, 297, 115, 135, 25, 78, -28, -15, -108, 127, 226, 136, -145, -56, -124, 55, -106, -1, 168, -239, 114, -35, 41, -257, 232, 192, 36, 203, 165, -142, 240, -84, 135, 150, 46, -407, 319, -34, -118, 75, 130, -122, -38, 185, -2, -89, -37, 285, 213, 23, 170, -231, -94, 85, -106, -22, -53, -65, -24, 27, -128, 84, -89, -87, -179, 7, 0, 73, -44, -265, -79, 244, -11, -170, -101, 38, -267, -227, 99, -141, -21, -134, -20, 19, -29, -242, 40, -207, -161, 93, 31, -159, -13, 179, 119, -74, -108, -23, -6, 92, 153, -21, 7, -216, -142, 55, -50, -16, 173, -106, 77, 13, -188, 16, 0, -57, -41, -44, -91, -186, -218, -204, -255]
6228b55J49K00k4J2q0p3l0J61R8q1J35l97K75j3pJ05j30q2J41j50n9m3n5N2l6
6253a87J41R8L1M9j03N5l28L41J97l61J91No9k73J88J77L5K7k00n1pM0k2J34p6
6278C2r7J59l13P3J17Jo9J65O6o3Pk60N9n7K34N9q8J5M1K9o6J90m67L98j57r0
6304h2R1j18m7K63m0l18L83j50k5l2j32K22j09n7n2n6L06l50L15J17q7m8j52R2
6328f6K03p1n1j5j41K58K3l87L19m5K1j92J51q5J69j01k74J86Q3J69l48K14l76
6351c56K28J63l0q3nn4J05l4K23k64K07k0J13l51J17J0K28l94K27J35p9m6K77
6374C17k07j56K58l44k3M8J18L0r2j35R8K1Q3j10K13N9r0mJ31j90k31J25J39k23
6398a65P0L18k40J3j11K72j50L9P4m9j52j69J85J33j98Q8j43K17j33L77l78j07
$$ y = [-255, -106, 94, 70, 82, 2, -71, -101, 60, 158, 77, 212, -185, 90, 77, 70, 175, 45, -37, 104, -46, -105, -148, -203, -151, -187, -46, 52, 83, 132, 29, 84, -244, 97, 294, -67, 124, 129, 60, -213, -25, 152, 187, 214, 14, -37, -44, -4, -26, 108, 32, -65, 94, -219, -146, -29, -28, -97, 68, 134, 71, 78, -182, -123, -180, 54, 113, 25, 40, 81, 110, 44, 234, -233, 165, 8, -82, 9, -109, -156, 107, 67, -251, 132, -18, -43, -75, -207, 15, -94, -151, -203, -259, 47, -303, 12, 129, 42, -6, -158, -66, 137, 66, 15, 0, -141, 117, 140, -247, 72, 27, 48, -144, 7, -78, 91, -10, -284, -98, -15, 154, -194, 20, -356, -128, 35, 5, -78, -83, -137, -32, -66, 157, -107, 100, 80, 193, -158, -41, -31, 197, -197, 30, 165, 86, 40, 317, 110, -46, 212, -132, -155, -107, 11, 41, -51, -186, -88, -67, 16, -94, 119, 178, 88, 84, 215, 25, -206, -81, 58, -165, -95, 223, -17, -4, -115, 157, 7, 46, 120, 71, -81, -250, -65, 68, -130, -42, -185, 32, -101, 276, -102, -209]
6420b09j7Q1N4Q7P6O9j7M5r8Nj18J66l06M51j69R9k21L6j16J09m5J52j90n1K31
6445A04l6L1j4j70J51J08j92R2N2k74R9Jj52J91J95l66L77p3j73L06j61j3j75
6468i2k7J66k36qK72j89r3K20k27J62L6j94K83r9k3l0o4J93O7Lm7R5l38K40r1
6493b1J4k13L12L6m55M23j8q3OJ42j28J6L3j50O3J14j61M1j54N4J11j26M3J23
6517B2lj34K0O9K3j9k7j02R2J7K4QK71j99k4j03JK65j77J81k93M1n0J02K39k67
6543b3P0J7j43k64L46k07J27M6J1Q2j26J79k90L19j27mo9L44j36j03J27m9j74
6566d7n0J50l29J41K66k18J5M6n3j13lO5K36j21J76q9N3k87JJ23j00J01M3p6l
6591g3J05J84j24j20L01m53L11j08m8l6J08j1l12M18k68J33J92j21O6j99K52k18
$$ y = [-209, -226, -145, -91, -4, 72, 141, 124, 169, 71, 76, -42, 124, -182, 269, 100, 199, -22, 14, -102, 7, -38, 114, -76, -127, 104, 68, 99, 85, -85, 66, 174, -18, 74, 126, -148, -49, -48, -200, -9, 186, -180, 197, 124, -49, 257, 96, 83, -92, -119, 47, -189, -197, 75, -114, -207, 13, -214, -52, -16, -210, 73, -26, -49, -79, -143, 50, 117, 120, 73, 168, -170, 70, -21, -7, -220, 92, 128, -327, 96, 78, -5, 1, 143, 15, 31, 64, -86, -23, 91, -70, -29, -183, -129, -18, -144, -101, 22, 19, -115, -95, -26, -3, -22, -49, -151, -59, -42, -18, -10, 261, 62, 38, -65, -64, 201, 24, 205, -88, -47, -97, 5, 244, -23, 47, 64, -79, -343, 3, -204, -77, -31, -20, 62, -64, 115, -175, 144, 17, 13, -56, 288, 152, 49, 176, 127, -47, -97, 53, -276, -135, 131, -87, -72, -26, -79, -192, -195, -130, 106, -15, 161, 72, 125, -162, -161, -38, -138, -37, 6, -70, -73, 32, 216, 92, -28, 273, -180, 131, 23, -25, -61, 47, 36, -276, 142, -126, 7, 199, 78, 144, -55, 197, -21]
6613b1J81j91l8K85l61K03kJ88j48j33K14r6k56J27J1m2k3J70j51Q0R7r4j39J68
6637B9m6l41N38j79j02L61k13o5J87k34J92O1k11N7L2M7k88K94j92p7K72m8p7
6660cJ38P6k48J06Q9m72M05K63j92q8k5J44k58J92L9k33k65L68J30j77LK70l30
6683f8j0j1Q7J18o0j01N8K35m02K24n7j75P9J62J57j59k68K19p1J02J76o1k44
6706g0O3l5k4J07k35J71r7J86q6m9j05oK58o4J74k41L6J90o8j05M2k12J59K9P2
6731I0j23O0J27m0k88K11j05j29N4K54j95k00J37j2J64R0j48J56j71MM6l30K48
6754a00K47K67k47P9j63j86%P2N2L4K3j09N7K05l77L12K5m05pLL36j91J39k27
6778a61J32J09j28K8K7J70j31J30O0J13n78K51J97l09k81K32K69k15J44j69J26
$$ y = [-21, 160, -31, -69, 216, -145, 58, 56, 244, 96, -37, 177, 81, -175, -48, -37, -79, -102, 68, -83, -3, 94, 0, -139, 29, -17, -358, 180, 1, -101, 260, 47, -18, 169, -65, 127, 188, -23, 34, 66, 113, -175, 119, -73, -150, 122, 74, -3, 135, 211, -37, 69, 158, -314, 91, 354, 162, 74, 49, 193, -65, 127, 166, -67, -332, 36, 166, -11, -8, 262, -68, -78, -89, -2, 116, 56, -45, 13, 248, -154, 70, 13, -162, -83, 79, 236, 77, -191, 28, -43, 59, 235, 174, -70, -7, -42, -66, 41, -194, -23, -120, 66, -20, -69, -174, -180, 78, 14, 188, -53, -17, 173, 105, 0, 42, -170, -11, 18, 90, -33, 27, 154, 114, -174, 37, -68, -197, -143, 111, -84, -284, -147, -159, 5, 95, -53, 103, -68, -64, -18, -348, -100, 147, 414, 167, 246, 83, -103, -103, -31, 21, 55, 78, -31, 26, 231, -146, 166, 191, -214, -221, -218, 118, -73, 66, -161, -29, 80, -48, -20, 7, 177, 46, 176, 236, 349, -229, 22, 219, -90, -371, -139, 130, -85, 59, -110, 16]
6799A6k5Q7o0l71M74P9j57l2K1J43j39N8J42m38J17K26j45opM8j05J35j87K06
6823H0J49q4k84J89q5J4n9Q9j71J97m6L8%J76j55M0j96j07J21m6L08k00P0nl3
6848@k31O6K1P8L63m28J8N1r9K14k61L89k69K43j90K86m05J05L72k51j18Q0j80
6871a46K04j78N6J08j84l4K94j63jq4K48K4j4Oj41Q8n3r7J03o5n8J83j83P1j07
6896a23R9L1N3j7L5p0j87Q5m0J55N9k6L5k44r1J76J12jJ6N8o6K7q4k12K45M8j08
6923c5J42j3p8m7J47J37k80O0L2j74p0k9K26Qp5L04j39j2j49K42j50k10K21j96
6947a38K19l3l4l0PK94j2j49j47J60k92M5j15J31n8J03j72J08J12j70o1K04r5
6970a23R1Q8k33J22J14J8k07j09L69k3j48J06j21K08j97M4jj99J26L55l50J74
$$ y = [16, -9, 78, 18, -353, 121, 200, 43, 11, 32, 175, 36, 94, 236, -202, -85, 141, -4, -10, -17, 31, -74, 61, -126, 80, 229, 145, -139, 50, -35, -21, -80, 9, -162, 35, -11, 27, 27, 203, 48, 88, -108, -215, -94, -140, 168, -32, 38, 33, 0, -231, -165, -144, -66, 297, -131, -113, -62, -161, 53, -208, 181, -88, 155, -35, 251, -154, -49, 323, 72, -46, 34, -146, 58, -120, -64, 44, -140, -174, 120, -43, -44, -128, 120, 144, 130, 136, -5, 83, 30, -67, 36, -29, -87, 96, -87, -16, -123, -24, 7, 60, 43, 78, 8, -179, -94, -134, 21, 80, 54, 89, -155, -246, -70, 42, 41, 57, 115, 49, 76, -8, -220, 25, 73, -35, 107, 94, 16, -31, 116, 253, -27, 33, 65, -109, -179, -208, 18, 26, -49, 255, 116, 104, -45, 197, 47, -163, 58, -138, 81, 48, 14, -16, -9, 285, 273, 124, -23, 137, -155, -110, -225, -94, -152, -49, -221, -113, -1, -171, -232, -28, -123, -32, 56, -177, -55, 59, 77, -130, -239, 130, 107, -41, 65, -56, 152, -45, -1, -2, -201, -75, 280, -70, 104]
6992A04j31j5P4r4j44K52o5O8J23lj37J6k42N8O2P1n0p7P2L4M8j5K41l74J31L2
7018C9l7J7J70j06k69K4J81j22J74N3q2rM5j48O0Kk30L74q7n2Q8j39k6J37K21
7043B78j36j46J2J16k21L1J22L1J38qj41M4j4P8r6k04K49k4l44K71q0o5J22k26
7067b13K24j69M30m51J65J9J57j16k79O46m91R2J38mj71P9K63k2k84J6J38j13
7089E4jj9N8j92J76kr8ko5J04J2k20qK20j48l8L37k43K50j2K1j54p2j64K99k76
7115a83L32k51j25K23K6Rj15M3l6l0R6j30J18Q8j18J58j15j90J86J30j40J4j48
7138a58J76l20K81J3O5J6j93J84p9N1m3J06p9l9K41j76Oo6k1M1n8M1l7P7j07k31
7164c09L91J26k75nj37L30j6r9m3J75j91oJ86k97r9M78k70J19k75K13K88L1j25
$$ y = [104, -27, -42, 32, -62, -206, 46, -19, 49, 172, 169, 32, 48, -194, -136, -74, -3, -53, -130, -58, -24, 24, 9, 250, -124, 7, 39, 2, 19, 189, 83, -186, -162, 19, -103, 71, 124, 42, 33, 78, -70, -10, -8, -238, 136, 49, -3, 85, -54, -80, 57, 278, 142, -4, 8, 124, -97, -66, 56, 87, 225, 217, 76, 120, 106, 184, 88, -116, 133, 109, -235, 36, -44, -109, 13, -213, 11, -158, 272, -179, -14, 5, 162, 46, -233, 413, -78, 14, 152, 148, -23, 56, 319, 297, 13, 29, 167, 54, 53, 34, 92, -100, 76, 74, -24, -26, -91, 13, 25, -195, -203, 17, -131, -169, 168, -75, 175, 163, 184, 30, -42, -206, 93, -183, 149, -102, -227, -4, 22, 31, -84, -41, -77, -107, -11, -141, -23, 65, -53, 105, -10, -200, -14, 116, -24, -10, -158, 18, -302, -21, -8, 57, 73, -120, 64, -15, 36, -7, 99, 20, -19, 222, 46, 52, -14, -35, 6, -52, -11, -48, 29, -78, -309, 82, 208, -67, -72, -209, 121, 105, 6, -37, 138, -53, -59, 127, -170, -269, 209, -61, 58, -217, -4, 284, 315, 190]
7187A90N0k84j07O5L2O4L6k00K40j41J90k40J8K7O5R9n6O4j57L8J05N5p2j34m9
7212a02J83k49J93K13j89j39Q7n7M7j95K38J67m73J89J21J04k32m4l5o4K02j07
7234a42j2L18j41p6K43m5j75K03P5l41K14J04k41J53j84K32k30l4j9P2J06Q4j35
7257B9Nj9l3L2m2J53n2R5k69J38K81n47K21L5N1OK3j24p3J97O4O6l33J28J33j58
7283GK8k6j12m1L53l05K39j92j19M13k54n5M9J61k81K46R9j47k7o1j9j22K16R5
7307A45l21j18K11k7k0K74j19J04KM8k93j87K53j25J9J56Om5qL2J10j43N2R8r6
7332Hj72J15J54O9jk19J31l32K40J04Q3j78J39J28m77J63q8J14J35k69R9K23k49
7355h0n4Q5K90m86K71m2J04M1r6j9L0j18p4J49j44L33j60N5J92k02j33J78l71
$$ y = [190, 240, -44, -151, -86, -54, 10, 46, -154, 86, -55, 135, -105, -87, -60, 5, 104, 48, 112, -45, -7, 98, 153, 81, -53, -102, 81, -168, 25, 238, 49, -90, -3, -60, -13, -208, 30, 197, -276, -87, 34, 138, -94, -138, -173, -237, -35, -142, -154, 164, 23, -53, 190, 145, -30, 173, 248, -93, 121, 225, -16, 137, -47, 185, -45, -79, -98, -26, 80, 164, 29, 34, 15, -18, 14, -28, 125, 73, 168, -101, 37, 318, -229, -8, 27, 78, 84, 107, -17, -90, 107, 171, 237, -96, 32, 165, 7, 35, 9, -103, -144, 209, -96, 143, -49, -168, 245, -9, -64, -15, 146, -135, 111, 210, 63, 36, -25, -44, -166, 50, 145, -176, -294, -83, -110, -130, 144, 25, 129, 131, 179, -114, -301, -48, -173, -154, 2, 8, -37, -45, -13, 97, -46, 6, 104, 8, -164, -49, 105, 174, 173, -46, 85, -247, -7, 97, 180, 2, 141, 269, -208, -45, -133, -19, 116, -153, -54, 169, -80, -134, -49, 241, -245, 26, -16, 88, 129, 33, 14, 44, -74, -148, 1, -143, 190, 30, 85, 277, 75, -58, 120, -251]
7378b51O06k47j72r5J17J86k56K63r8j75o7J62K9O9j21j11J84p9L0j35K34j9k00
7401a46N8P9Ln4K73m7j97J76o3j11L7J3r2K39j1m22L52p4O5r3r6L1K48J41l65
7426e6J11L2p1J08k31J29j26J7J90j73K29k37J71k2j8o3p7q2M08j13j3n4k5n8
7450b4m7J23k01K92Oj51q4L49j43j25N4k55R8J66J27l7nm66K83J99k77J84m4o0
7474c8J44j44L2o9J82m7pj89K64l33K02j7j25J50J92j13j02M1j77K57j39O3K3
7497E0J61j79J63p9k38K02q9j4j2O4Oj12J69k53K24J0K2J37l94K22j83J10l7J78
7521A28j57M9j57J46qM9Q4k08J90l01L84j5k32j32J27j45J73P6j1j48J50j64J91
7544F9j1k02L0R6L4J97j81k17K89k12K96r4k13J34j09K0K04l16PJ03l7L03j20
$$ y = [-251, 355, 108, -64, -159, -42, 144, -112, 151, 53, -122, -189, -27, 2, 71, -50, -161, 23, -56, -26, -161, 73, 54, -146, -88, -9, -6, -60, 213, 166, -31, 145, 82, -29, 8, 21, -71, 168, 157, -265, 87, 13, 78, -15, -111, -80, 168, 309, -56, 55, 87, 16, 124, -107, 22, -104, -87, 103, -70, 159, -78, 93, 71, 53, -10, -87, -169, 239, 126, 113, 59, 34, -24, -71, 52, -149, 143, 149, -2, -86, 263, 120, -5, 49, -206, -108, 58, 185, 148, 143, -323, -40, 159, -118, 66, 22, -38, 106, -38, -6, -75, 107, 60, 53, -136, 128, -205, -3, -20, -145, 5, 197, 84, -18, 23, -154, 103, -36, 27, 50, 211, 32, 195, 116, -122, 80, -9, -23, -35, 29, 35, -77, 92, -161, 63, 73, 95, 232, -162, 60, -123, -13, -50, 128, -29, 20, -137, 9, 1, 50, 134, -74, 116, -185, 199, 184, -48, -180, -53, -198, -25, 51, 40, -108, 42, -122, 69, 58, -144, -114, -18, 16, 213, 32, -185, 104, -108, 188, 94, -119, 15, -94, -74, 130, -186, -179, -76, -113, 190, 70]
7567G0n02L32J43N2J07r1j05o3J57N2l72K16K5j33N8P4O8N7k55J35m7l1J17k70
7591b06L38k34R9J80k65O8j21J22L34m15J26j51J65J21j76j04K16r2%k79J22P
7613a45M4M2j24Q6PJ98ol73K20J19%q8k0P2j10J59j23J07nj39j8M2J99oj0k66
7639a38j0J63j48J94l64L74J28l23J30l4j38J48K8j25J2L1L13j74m2J65k37n1
7661i8Q3p4J96P2k5M9l2j89m0J34k67J74J46j06p4Q2l00q0L77l18L38q4J95r4
7685F5l7j3j59J99j15J9L9J57l43P1Q4N0m31L27J61P3q9j77N7L2R1j95j68P9K28
7710En6J03j22J44j1J52K9j33p5k05J16P8j25R3N9k1j43k13L42L2l9o1J20j08
7734c9K11m8J61m43K91p4q7K48m25K75l14L86l6K5k59J77j08K17j06N9k53K39
$$ y = [70, -432, -100, 43, 95, 202, 111, 6, -57, 100, 152, -220, -4, 21, -112, -54, 20, 88, 145, -110, 25, -22, -53, 64, -206, 132, -102, -3, 177, -88, -20, -141, -19, 315, -100, 26, -125, 40, 161, -15, -119, 97, 5, 5, -274, -152, -145, -101, -59, -183, -97, -90, 108, 102, -271, -51, 68, 68, -20, -40, 32, -78, 81, -42, 65, 60, -79, -97, -55, 144, 138, 128, -138, -148, 15, -133, 61, -303, 71, 199, -124, 6, -28, -166, -18, 10, -115, -103, -72, 241, 67, 25, 190, -47, -98, -15, -89, 107, 179, 154, 203, 171, -18, -58, 76, -191, -17, 129, 23, -51, 31, -269, -349, 28, -290, 48, -36, 159, 65, 28, 15, -144, 55, -60, -41, -2, 155, -188, -117, -33, 17, -414, -87, 74, 147, 58, -119, -62, -30, 61, -134, -302, -223, 5, -51, 52, -70, 74, 63, 215, 244, 111, 36, -169, -53, 25, -100, -7, 52, 31, -112, -325, 17, 49, 10, -51, 69, -39, 172, 124, 285, -158, 133, 59, -28, 220, -205, 70, -244, 142, 106, 131, -128, 49, -59, 158, 52, 111, -142, 97]
7756I7M7j15j9M2n8p1j3J73k51J35N8L7j25J44l8K7k39J67L7lj21K93l25L02m81
7781c00L55O9q2Q5O2k26J2J6j85K13j11Q4q0R7J93j97P7n2KO4k3k06K01Nm8k3
7807BJ18q4j50J58J33j99j37K69k89L86k12K5N3J97l89j7J7R2j43K27n7N2j29
7830g7O2Q8R2j10K6pk59J72nj85J91j97J26R7j34J9L6K46j95R5k62J92q7K8J44
7855I6j74q4m2J56j02J09q4L6P3j4Q7j43j97L93j56n2J42L5j33K12N8k45o0L11
7879B22l10O0J96j99o8K02j54M6M8j22j7j1J4j49N27j15k32j10K92j26J42j70
7901c4M5J30O6o7j96P7J30j19j01J01J06n6k07J70J68k27L2j27K27J37m37J25
7923e7P8k7k02L26o1N5m22R4L18k62J79R6j62J10j69J79o2j1j08L57l0j28k18
$$ y = [97, 144, 29, 10, 52, -6, -77, -90, 83, -168, -33, 25, 62, -63, 81, 43, 70, -169, -2, 35, 32, -89, 204, -121, 181, -300, 55, 124, 42, 127, 189, -37, -25, -9, -194, 19, -92, -8, -88, 9, 202, 5, 82, 30, 32, 96, 73, -133, 68, 73, 25, 2, 120, 36, -114, 44, 177, -22, -159, 110, -179, 207, -5, 20, 73, 270, -119, -136, -119, -27, -170, 57, 0, 52, -77, -15, 73, 165, 55, 81, 74, -185, -13, -18, -203, -12, -209, -83, 14, -120, -101, -65, 181, -14, 81, -181, 11, -76, -48, 96, -78, -162, -204, -48, -150, -41, -125, -89, -16, -30, 57, -86, -283, 110, -46, -98, 44, 79, -54, 158, 216, -29, -89, 222, -88, -28, 168, -31, -99, 103, -51, -5, 43, -79, -96, -107, -93, -242, 285, 170, -62, -172, 120, -6, 136, -34, 11, 141, 207, 140, -56, 21, 151, 32, -69, 32, 138, 82, -125, 45, 213, -14, 18, -109, 118, 255, -182, -57, 21, -6, -208, 118, 57, 112, -310, -216, 102, -160, 19, 115, -47, 63, -106, 73, 11, 0, -108, 249, 219, 91, -127]
7946a27J60r9l1m7j05M53l90L81r0k52K35j96o1l1J31O9k03L71j88j35Q7J80j73
7969f1j08K82k54K20q8J13M9k02P1M4j54q2N9K56j61J7J14j00j04j6J42j82J40
7992eK2r8RJ23j81r3M2L49k90J94M0k17O5J79l48J29J52l3M3j7j98O8J00pj5N7
8018G0n2r8o3K13j33M1o0J36K6k05L4P0R9j03K64k88J56j34J9j88L77k66K79k43
8042d9J42j22J90k41O5j49J20n8k10M16p8K2J10qj00j72M04l12J23k56k1KJ13
8065f9O6J0j02L3k3K27k02J33o7N3k9J36k05N3J81k48m6K03k24r5L17j03k3l5
8089e9K89r6j24j80K05j41J72O7j04j93J05P0l8o2J10m14K61J18M7Rj67l1L05
8112A49ok19K24J41m17n1J0K33O7m12L48%J1m0R2l20K01j53J05R3l19M42j90j84
$$ y = [-127, 33, -66, -97, -144, -249, 204, -186, 195, 105, -147, 88, -108, -169, -200, -69, 0, -203, 168, -20, -155, -68, 112, -61, -169, 113, -141, 79, -9, 104, 153, -49, 22, 66, -88, -170, -111, 145, -16, 1, 115, 15, -89, -105, 37, -145, -5, 17, -81, -72, 51, -130, -223, -181, 168, -122, 72, 112, -105, -40, 139, -209, -80, 72, 39, 82, 65, -133, -65, 35, 28, 13, 70, 18, -80, -143, 70, -63, -22, -82, 54, 80, -125, -91, -21, 78, -25, 239, -49, 107, -27, -8, -196, 181, -85, 194, -49, 93, -29, 161, -80, -15, -164, -44, -102, -312, 104, 26, 48, 158, 150, 50, -122, 282, -30, 93, -163, -184, -182, -69, -3, 7, -95, -62, -85, 142, -60, 73, 6, 59, 30, 166, -39, 14, 195, -53, -99, 104, -120, -215, 102, -1, -24, -59, 230, 134, 10, -170, 35, -106, 66, 133, 29, -164, -59, 11, -27, -89, 21, -393, -132, -14, 33, 42, -125, -156, 149, 143, -76, 148, 289, -128, -179, -169, 64, 131, -281, 67, 67, 78, 38, 130, -190, 11, -142, -37, 56, -263, 179, -11, -195]
8136a95j09K90n7K11n8L2q7K05l05k42N61k28l9j14J7K22L3l06P0P4j28O9j09
8159a93J99p7NR3J90j72j15J55k90J96J1Qq2J09k49k0O8J98j14J30j13J77L1j2
8183A33q7m3R6j03o5OJ9j30
$$ y = [-195, -304, -14, -71, 140, 82, 114, 27, 232, -73, -315, 246, 18, -21, -135, -118, 104, 137, -169, -99, -25, -153, -84, -193, 6, -71, -66, 27, 217, 45, -70, 85, -205, -9, 2, 10, -72, 37, -212, -232, -164, 34, -80, 50, -63, 114, 145, 133, 46, 3, 99, -4, -69, -63, -44, -174]
8191a74
$$ Imaginary data points
##PAGE= N=2
##DATA TABLE= (X++(I..I)), XYDATA
0@%%%%%%%%%%%%Qj6J6j6K0k8L2m0M8n6P2q7J00j16J35j53J77k05K34k68L04l44
34a83L90m38M92n52O19o92P69q54R48j051J163j287J421j567J728j903K098k312
52a211K545k806L100l430L803m231M723n298N987o826P870r213J1017j3578J7536
67I988k4539M0655j51247n5143J57880m4820n869n816J573M013Q0036O6501J9797
80I3009j4022J000j7660K3200M6138K0384k8525o4644o2103K3706L9488j8506
92D1465n5609m3941k7988j4210Q806L7288o941l6196j971R536J6746N4605L7133
105A8723r394j6899J0822L5268L8945L1028q252n0160j0169K6382j746k083n511
118E6954m4872l8331n062N252J764q723j8661k7245j1858K8749L0143R100m761
$$ y = [0, 0, 0, 0, 0, 0, 0, 0, 0, 0, 0, 0, 0, 8, -8, 8, -8, 12, -16, 16, -24, 24, -32, 40, -47, 53, -63, 72, -81, 96, -109, 125, -143, 161, -183, 207, -231, 261, -291, 328, -364, 405, -449, 499, -552, 611, -676, 745, -822, 906, -997, 1101, -1211, 1334, -1472, 1628, -1802, 2001, -2230, 2493, -2805, 3182, -3644, 4226, -4987, 6030, -7548, 9988, -14551, 26104, -125143, -180286, -22406, -67226, -73095, -78911, -77338, -73325, 6711, 73212, 93009, 78987, 79987, 62327, 85527, 131665, 152049, 123524, 58880, -3223, 20483, 59971, 41465, -14144, -58085, -86073, -100283, -91477, -54189, -61130, -97326, -99297, -89761, -73015, -18410, 18723, 9329, -7570, 3252, 38520, 77465, 108493, 100241, 50081, 39912, 66294, 64548, 62465, 56954, 12082, -26249, -31311, -26059, -24295, -33018, -51679, -78924, -90782, -62033, -31890, -22790, -27551]
131b7551k3054L885M7475L2062P387L579o806r673M844K8679J8091k4870k3556
144C0492r238j8385M537J9418j6414l9971k6542J705J8138J0918L517j4941k5387
157f2153L324K5370L1511K5017j0061j7717O377R238K0260K9097o08l0337k4019
170E299Q205K1124K443n459k0179l8438j0626J8449J3471K470j6627k4557p500
183e1925J0774K7435J9216p319j3995p938J4020L4449J4434m755q665j9853n295
196E83K2623K2305j160k7810k7075q390L506J8061R166k2364k3899r320N115K3645
210a5014J3385n007r136j2112L701K6353K5554O648k0175j6738R282J3523J6469
223C6733J0439j8750k5995j0367N203J6503M279j5423k1517j8854L124J8232J0270
$$ y = [-27551, -50605, -46720, 755, 32817, 40204, 43783, 36977, 27304, 32148, 60827, 78918, 54048, 30492, 21254, 2869, 7406, 26824, 10410, -29561, -56103, -54398, -36260, -25342, -21825, -36766, -62153, -58829, -33459, -1948, 23069, 13008, -4709, 1668, 10906, 31166, 60263, 59655, 29318, 5299, 13504, 34628, 37071, 31612, 11433, -27005, -37631, -19182, -5711, -3241, -19868, -44425, -51925, -41151, -13716, 5500, -1819, -15814, -23752, -9732, 24717, 39151, 34396, 25731, 5878, 583, 23206, 45511, 44351, 16541, -10534, -18924, -15418, 2643, 11809, -10555, -34454, -43774, -38659, -15014, -1629, -6636, -15772, -27884, -24183, 2170, 27724, 34372, 14197, -2541, 6741, 20264, 36733, 47172, 28422, 2427, -7940, -2737, 13766, 18045, 2622, -18895, -37749, -34625, -16393, -6123]
236f123J04j7546j8677J1601K1478J5644J0463p946j4866k149J7322K7299M712
249D1316j4341j2186j0961L536J6848L679r591k0476k1769K322J5590P236m993
262c790j8086j4693k661J3270K6692N931j7129p704J188J0402K2434J3305m117
275B5042j4984j0144J1085J6271O669n504k0646j5717P80P530J4133q71k5829
288a2185j7845j81R584J3275M593n067j5988r743J8452K1902N819o37j1064r468
302h553Q845J7201J5317n82j9411j3570L2J1057J1886m447j2460j5900j4294J0218
316a4661J7935k105j0675j2782p620P921J5848J4388l185j7512m500Q159J5401
329F612J8199p03j3309j0026m347J1379J7785N68j3645j7341n805O774O974O381
$$ y = [-6123, -6019, -23565, -42242, -30641, -9163, 6481, 16944, 8998, -5868, -8017, 9305, 36604, 41316, 26975, 14789, 3828, 7364, 24212, 27891, 18300, -2176, -23945, -21623, -6033, 1203, -3790, -21876, -36569, -39230, -25960, 732, 6663, -10466, -18170, -16982, -6580, 15854, 29159, 25042, 10058, -86, 10999, 27270, 33939, 28435, 7789, -7928, -7148, 382, 14515, 13644, -12185, -30030, -30211, -20627, -7352, -2759, -7826, -23814, -33557, -15105, 6797, 12616, 11979, 915, -8553, 292, 17493, 32810, 32228, 12817, -753, -721, 10336, 22222, 17775, 5315, -10585, -24879, -14661, 3274, 1169, -9506, -22288, -29908, -21987, -6139, 8249, 5064, -12448, -16948, -8789, 6612, 24811, 24108, 10799, 773, -3574, 7805, 25590, 26158, 12513, -4828, -10633, -3859, 3115, 9496]
343I496n593k2445r134J0165J2398R000l484j3317q418K044J7369J7110Q46r087
357F950j3090j255J5546J0709L307l465j8129j0053R674J2940L418j0496j4075
370h019q987j962J3588J4672o516j3966j0464q75J5504J2607K312m649j1724l624
384a2103J1660J5923P642j1416j3541j212K579J1211J3706p727j9318j0880J539
397a1937J2083P410j173r461j5807k449J2216J0584N543q635j4423R17R477J1168
411E513J0479l924j3999p779P404J6656N341m474p619j4661k752J4404R285j809
425A2065j1078j4415k824P648J0743N313r615j2288n413N437J8470P097q806o920
439d586n869M36J4822J3573n94j3718j0279M640P166P585N386j1276j5037k602
$$ y = [9496, 3903, -18542, -27676, -17511, -5113, 3887, 403, -12914, -21332, -19288, -1919, 15191, 16037, 6950, -6140, -7395, 8151, 18860, 22167, 18702, 573, -9480, 194, 13134, 16552, 6056, -8019, -17006, -18968, -5380, 9292, 2776, -11190, -21654, -22529, -7025, 5582, 7894, 3245, -8479, -12103, -443, 15480, 23122, 11706, -1835, -3047, -468, 10743, 24449, 16722, -2596, -13476, -11937, 146, 7556, 6383, -3078, -18885, -21334, -9118, 1466, 7009, -1626, -16049, -15132, -5655, 5513, 15992, 12068, -1931, -9710, -2306, 14350, 19691, 15217, 7598, -7063, -9815, 4589, 13874, 12065, 987, -13428, -16252, -8604, 2139, 7452, -2163, -14451, -19864, -14427, 4043, 11140, 2334, -4586, -10455, -10019, 4803, 18376, 17782, 4064, -6215, -1575, 5591, 13176, 18562, 7286, -7751, -10353]
453a0353N930J1917M555j1848j2549o315M033J2313R129l52j4267j3126Q662J2986
467G15M639M455m501j1588k294R636J3700L035r659r042m909M865J3342M021o394
482A0021j2410j2326N632J3358L121m920q418p647j514O620J4191K339j4034p313
496a3300R74O159J3983O642p400j1367p087Q679J4637N318m767j1231o752L182
510b330N597R307K405j4824j1018Q52O175Q191K279o478j1938q307R681J4661
524D253J590n756q914m619O986Q997O935J976r708q103J738R746J0588j192q557
539E960q001n766P752J4534j606j1336j0594l865O250P771M713k238j2189q076
553a6691K227J0278J1252j003j0182n797q04R342J3691J032p642q018k829Q177
$$ y = [-10353, -4423, 7494, 12049, 201, -12348, -18663, -14630, -2317, 6812, 6460, -7807, -20933, -12271, 715, 5354, 9809, 5308, -6280, -8574, 1062, 14762, 17797, 8138, -904, -5813, -948, 12394, 16415, 10021, -2389, -14715, -9083, 4275, 7396, 2476, -5942, -13589, -15103, -8483, 5708, 8047, -5987, -13300, -12326, -6167, 7816, 14458, 7058, -4309, -11396, -2717, 11920, 17238, 12471, 1240, -5512, -2330, 3267, 12574, 14979, 155, -10863, -10011, -3836, 4355, 6634, 156, -11782, -20089, -10408, 4253, 5843, 87, -8827, -13446, -6460, 2537, 9472, 11448, 1740, -6363, -4625, 5121, 15709, 14517, 5960, -2041, -7807, -55, 14479, 12873, 1537, -9057, -12922, -6672, 1099, 5812, 3574, -8615, -16691, -14464, -4186, 7066, 6063, -4119, -9916, -10720, -1378, 12313, 13345, 5703, -2315, -5144, 3033]
567C033Q381K885k716j1532p116K932P650O239m263j1357n420o04P120R590k183
582B639r459p293L6J0058R613K350m370j0686l155R359R371O709l035j0743n779
597d385J838Q295Q603l321j0558q573j189Q756O061j484m396j1355m914R619R428
612B425K044m011q056k749M274R271Q307l902q251l844J156R740O857l527n450
627D284q153l874P656R328M52r725j0296P2L977N803O910m371j0972l479M408
642g980R470O405k071n582o666M84R849P654J031p654j1073R45P122M530L318
657I782l976j1854n705M505R139K764m820m480n893p47J0486P255j610o373o801
672h328K643R391O198J727o118p834j826M334R583L240r057p312l149j029P596
$$ y = [3033, 11414, 14299, 11583, 51, -7065, -4133, 3517, 9756, 5493, -5864, -11284, -11888, -4768, 4822, 2639, -6820, -14113, -14077, -4019, 5594, 7944, 3574, -7112, -10267, -908, 8463, 15172, 12137, 1394, -4385, -2547, 5748, 14351, 11030, 472, -8101, -9290, -534, 5527, 4043, -353, -11708, -16622, -7003, 2425, 4469, 458, -7598, -10347, -6073, 3198, 11505, 7603, -648, -4492, -3336, 6404, 13261, 9734, 4284, -3869, -7743, -87, 9241, 9693, -32, -10328, -10256, -6279, -476, 6434, 2063, -8909, -12388, -7980, 1490, 7895, 5824, 242, -6424, -5940, 3909, 11563, 12594, 4940, -6133, -5188, 1934, 6464, 9782, 5806, -6048, -11753, -7248, 1891, 4655, -165, -4645, -10538, -11285, -799, 6456, 4846, -1527, -8328, -5685, 3706, 9904, 11631, 5513, -2321, -4147, 187, 9770, 13010, 3953, -3359, -6508, -7537, 59]
687E9O428l722r866p363M129P856L968K383n959p937J644O336R015N075o401p324
703a679k54L787P313L712l001q018q212M148Q530L2k570o278r240j43O366P228
719A721O20q547n783M63M928R220L634l564m303m340M594J0820L712l319n517
734D339m757Q18N092O334l70j1766o719J376K230N376J309o596p707l881M797
749a0125R193K742l444n011l284N107P069N863K060q221n782M911O636M597K04
764A2515n981o823l981M563P966j366o467o949m259L189N920K202j436p636n344
779a3887M768Q005N447q77m994k938p45O279J0519K83o527m623j869L686N971
794H498J527l370q808m992L625N011K691k955p993l296L25M624Q313l71p038m323
$$ y = [59, 6487, 2765, -7101, -14464, -10335, -2479, 1489, 3872, -2087, -10024, -8380, -2044, 6971, 12046, 5645, -1679, -1933, 1854, 9167, 12879, 9878, 1860, -6352, -2204, 6326, 6358, 3788, -2490, -11730, -11873, -5507, 1721, 2341, -6206, -11989, -11526, -6598, 2622, 6256, 2692, -1611, -5951, -1357, 9463, 13175, 9856, 4339, -418, 400, 5492, 11826, 11456, -310, -7029, -5653, -3423, 1953, 3262, -3334, -11041, -14922, -10125, -932, 1810, -1634, -6645, -9929, -4822, 2247, 8110, 10170, 1949, -3833, 1078, 7714, 12311, 12515, 6534, -289, -4270, 293, 8259, 6893, 426, -6523, -10782, -7593, -1673, 529, -907, -8543, -13887, -9119, -1114, 4333, 3456, -1538, -4476, -5221, 1058, 11577, 11860, 5333, 710, -1159, 2527, 8498, 10025, 6655, -2153, -7145, -3520, 1491, 4182, 1227, -6766, -10062, -9737, -5113, 3200, 2829, -4209, -8532]
810h532O73O725O408J578j743p099k949O498O310K336l338p320l379J421M713
825B302N303k373p919n746L85O504M270j141k817o083k818P038P472J275l727
840A925n201r35L136N268N247k378q121l220J304O463M414l669m788m829l080
855h464N899O204N28n070o805N53M133L955M653k012p418j419L741O624L821l301
871E622m729l885q24O490M995j106o008o975J2M930K901J749l123p486j809M063
887e183O599L474m062l735j903L52P493N556j479m588n451J200O093K492O02l707
903C753o928k005L085N818J415o246n447j577P59N805M574k198n297m353K652
918f190P464L275N41k724m702K45M407N777K594o090n852J32J372M203K890m115
$$ y = [-8532, -7859, -1134, 5274, 6852, 5109, -1990, -4939, 1559, 7869, 10205, 6867, -453, -3832, -2411, 2302, 7605, 5232, -2687, -8433, -8048, -1544, 2726, 1585, -1232, -7315, -10133, -3095, 4377, 5652, 1925, -3276, -4211, -1075, 4193, 9440, 7062, -1059, -4279, -2975, 3488, 7902, 4233, -555, -5384, -8464, -2565, 3639, 4167, -903, -7708, -7155, -3022, 933, 5586, 3574, -3844, -5263, -1522, 5102, 8923, 5622, 893, -2992, -3816, 2674, 7669, 6563, 555, -6420, -6408, -1478, 1423, 3172, 49, -7437, -9246, -5183, 1416, 4890, 828, -2907, -4810, -4458, 3035, 8591, 7112, 2524, -2927, -1727, 4366, 6858, 7460, 3753, -3175, -5180, -2095, 3723, 5138, -1108, -6555, -8132, -7373, -1568, 3006, 808, -4489, -8842, -6190, 1274, 4549, 5090, 2366, -2336, -2091, 2316, 8093, 10687, 4597, -1255, -1123, 249, 4452, 7342, 3227]
934C227o433m934K578O207J247k032l955m897N90N240N008K267m875n109J358
949d513M240N566K395k714m450l193L141O960J065l236l940m989M72M377K814
964C995m04o251m745L77L705M524N41m701l162j176L266P770J897m277l372j605
980c618K405M995M014k10o742l956K443K993L313P58n978m933n61K985M820R02
996C630m528m591j766L416M526J665L96n402m489M342N147J852K36l304l976l84
1012c230M502N720j239n038l019j750L335N037k55k184m671l829L476N720J973
1027D548k838m509j989M66L136O846q14o895k009R01K374M986J265l242n584j881
1043e239M408L843J594j597n545k189K491K107M154M07o018l354J962L884K613
$$ y = [3227, -3206, -8140, -5562, 645, 1892, -140, -4095, -8992, -8402, -3162, 1846, 4113, -762, -5871, -4513, -273, 5293, 7688, 4974, 524, -2669, 472, 7432, 8497, 5261, 1321, -3668, -3196, 1181, 3995, 3591, -2660, -7405, -7028, -3323, 1201, 1742, -2959, -6121, -7297, -4031, 3739, 5636, 1359, -2013, -3618, -1213, 3782, 7796, 7586, 844, -3112, -669, 2324, 5637, 6395, 417, -4516, -5077, -2092, 2728, 3630, -898, -5489, -7255, -3839, 687, 2352, 2748, -2654, -7143, -2801, 2346, 4198, 4434, 1130, -2846, -3230, 1272, 6992, 5753, 715, -2304, -4054, -719, 4318, 4063, 1879, -2792, -6621, -3145, 2575, 4548, 1710, -2799, -4788, -4322, -1186, 5660, 4846, -2049, -4058, -3157, -783, 4203, 5468, 2226, -3358, -5239, -831, 3012, 4606, 3009, -2536, -4725, -2234, -127, 4027, 4434, -1584, -4938, -2976, 908, 3521]
1058C521o75j261m723k286N762M555j361k518l940j937L021M160K403k251m900
1073b430k615P96N343M189k862l160k080k371M310O301n66m483l704j56K369L194
1089B075L291k001n815j595J811L239L705k029m642j382nK931M027J15m348m374
1105d997J015N081J280Q69j092n002j993L405M434J899k982l621j790K44M700
1120A450L547j898l691l931M19N402K483o91k294l781j458L131M403K143m251
1135I83m013J15M78L488L572j745m276l084J688M343J628n78k700m051J55L509
1151d88L010J507l631m473P39K548K915K192j810l757l076K363N378J041k092
1166B366k009l821K44M329K337n9l957l929M78K445L422J614l356l066j959J815
$$ y = [3521, 2846, 1585, -3138, -5424, 338, 4893, 3532, 1014, -2926, -4863, -1842, 2318, 4721, 2470, -2430, -5045, -4249, 1094, 5283, 2421, -739, -2819, -5190, -880, 5421, 4855, 372, -3332, -3488, -1119, 2075, 5366, 3365, -2450, -4045, -2234, 1005, 4710, 2681, -1961, -3343, -3348, -417, 3610, 3725, -623, -4997, -3982, 1099, 2379, 3248, 2156, -2846, -4839, -1434, 3000, 4899, 1917, -1704, -3494, -3250, 1450, 4997, 3099, -592, -4523, -4104, 1298, 3781, 3090, 796, -2985, -4443, -1312, 3091, 5234, 983, -3030, -2915, -2437, 1051, 4623, 2878, -1398, -4482, -2794, 1549, 3177, 2599, -101, -4152, -3997, -488, 2522, 4029, 398, -4075, -3336, -788, 2127, 4319, 2509, -1248, -4324, -1961, 3417, 4458, 2366, 357, -3464, -3220, 1109, 3446, 3387, -570, -4499, -4021, -1576, 1846, 3460, 104, -2962, -4921, -3106]
1182c106N371J573k627k280k136J227L499K937L8m044l648K023K549K286O07l262
1198A007l587j283K067M503L70l465k785k049J736L791J667n07l549l127K788
1213b423L317K192P35l049k758J62K352M613O07m136k359j404J773L295P97j491
1229B223m079l517K571L628Q03r20l415k463P64K465L977P45m076k019K51L109
1245D7L229O21q23l181k628L298L834N01j504l700j755R69J844K951r98m684k511
1262d490K67K549K889k35k393k561j380K936M493N97j663k923p30K156K178L403
1278E093l91m824j633J510K271K438q77k613k725j564K821K933l84k540l502o93
1294d680K469K116J552q17m028j251J895L566K773j421k438j275o24L188L972
$$ y = [-3106, 2265, 3838, 1211, -1069, -3205, -1978, 1521, 4458, 4496, 452, -3196, -1173, 1376, 3662, 4269, 1007, -2580, -3863, -1796, 2707, 3077, -388, -3173, -5222, -3486, 305, 1972, 1465, -2084, -5211, -2423, 894, 3086, 3821, 772, -1986, -1824, 528, 5141, 5748, 1612, -747, -2151, -378, 2917, 3714, 2223, -1856, -5373, -2802, 826, 1629, 709, -2706, -5169, -4405, -1940, 2037, 2782, -1294, -3313, -3062, 47, 3276, 3897, 3074, -107, -2735, 563, 4397, 4898, 3394, -306, -2061, -1092, 752, 3703, 2705, -1979, -4490, -4223, -1674, 1215, 980, -1413, -3974, -5354, -2418, 2075, 2672, 1009, -1914, -2644, -488, 1690, 5093, 4702, -122, -1755, -245, 2026, 4464, 3587, 974, -1751, -3315, -494, 2439, 2055, -485, -3987, -4680, -2211, -95, 1457, 640, -3388, -4639, -2744, 822, 3595, 2174, -264, -1539, -2163, 1025, 4997]
1309D997q74k428l083n43K404J865J061j514m290j341J979K580J812k260k941
1324b576p90j22K757L226l20l321k184Q52L093K014M18q83l930p81K772K603J463
1341D291k436l309o43O72J984K727j241l456k499O85L772J328o58j384k856m65
1357c488L312K439P01k353k626K17J230K626J766j585k981j868N34L572J417j489
1373A424j771k330p59K678K921L19l043k524P90J333K448J913j805k996p99J500
1389g01L420J178k024j834k317M42K728J856m83l015l319J233J915J638P96j838
1405c25k407j026J948L612O16j604j819j170J023L282J663j38k607k811J059K773
1421B069J337n87k274k497r57J072L307O3l050j824o69R33K861J668r66k499j535
$$ y = [4997, 4123, 1695, -1388, -1931, 473, 2338, 3399, 1885, -2405, -3746, -1767, 813, 2625, 365, -2576, -3366, -3488, -731, 2495, 2175, -1146, -3330, -2478, 615, 2629, 3047, 2164, -1766, -2547, 225, 2828, 4291, 1855, -1454, -2097, -1425, 559, 3286, 2045, -1411, -3910, -3225, 547, 1875, 1217, -167, -3023, -3488, -176, 2263, 2964, 611, -2015, -1798, -568, 2058, 3824, 2239, -742, -2610, -2076, 1496, 2913, 1424, -347, -2677, -3436, -758, 2163, 2482, -561, -3085, -2295, -962, 1486, 3399, 1594, -1402, -2201, -701, 2719, 3897, 1873, 39, -2278, -1836, 892, 2748, 2265, -750, -4069, -2836, -921, 717, 1513, -325, -2732, -3758, -1810, 1802, 2418, 814, -1005, -2175, -1152, 2130, 3793, 3655, 1048, -1763, -704, 2069, 3406, 2819, 545, -1952, -2909, -1837, 1470, 1533, -1517, -3341, -4010, -3077, -216, 1452, 486, -2013, -3548]
1438c548J736L115J662L79k249j936M86K057K533N68k958k456k37J263J516M3
1454A974j152l016k482J995K726j49l58k332j960J107K354K837L93k694j181O46
1470a292K242K840Jq36j946j923J893L289k24j479k563j710%J533J612m89l846
1487b898j758Q74J863J932J47j751j455n05K279L046P70j162k010k19J985J777
1503B915J216M1l269k165J322J767J255j069k393k056j079K180K450m95k036k263
1519c679o96K159K181J070l78k494p79J581K497K027p97j686q14k46J173K908
1535D027o51k349k340j09J549R48M00j049k963j351J898J785J017j218k017n54
1551b977O86K273K534p16j954j459N47K821J582n87j001k282j478K373K014N62
$$ y = [-3548, -1812, 1303, 2965, 3344, 1095, -841, -355, 1702, 4235, 4803, 1845, -611, -848, 415, 1931, 1974, 822, -2194, -4676, -2681, 45, -104, -462, -2794, -4754, -3647, -1293, 1544, 1937, -757, -1938, -1292, 950, 3790, 3791, 2955, 1009, -914, 979, 4268, 4044, 2565, 2, -1708, -1708, -175, 1437, 948, -2898, -4656, -3782, -1919, 13, 160, -1591, -3046, -3551, -1272, 1774, 2544, 1382, -628, -847, 1138, 2915, 4131, 4172, 903, -1262, 60, 1827, 3082, 2013, -380, -2436, -3515, -1335, 1115, 620, -1416, -3679, -4375, -2216, -35, 1035, 657, -1837, -2616, -1035, 1462, 3489, 2692, 1006, 192, -54, 1119, 4027, 3376, 1027, -1313, -1422, 127, 1075, 1475, 426, -2537, -3888, -1990, -205, 812, -406, -2423, -2977, -2291, -18, 2516, 1800, -154, -1613, -1066, 1755, 3337, 2750, 1749, -533, -2011, 362, 2376, 2938]
1567B938k150k240n83r4J883J824j171k169j301K58K472J431j88j153j472K59
1583a456J825J836Q84j587k560K90J259J137J307r61k972j253P84K341N50j161
1599B63j291j920r6K653J650j27j213k456N01K208J465J298j335j825j002R38
1615b89K799O59j848r30j463m58K051J050m26k461j916R24J202J061O20j344j851
1632b620M54Q65K703R34j881r97K3Q96J810J138l47k272k078J270J928K50k37
1649A839j823k235j16J244J668j52j883j223n96R25K446P43l92j360j286J186
1665a015K744O49q7j191j395P38Q33J742M66k583j485j10N96J051K59j441j946
1682b175j157J141J989J42m26j728j106J297J449J684P31k079j287J053J493K045
$$ y = [2938, 788, -1452, -2035, -2129, -246, 1578, 407, -1762, -3063, -2805, -333, 1098, 910, -243, -1715, -1456, 369, 2205, 3089, 1502, -1058, -768, 491, 1628, 2935, 1974, -998, -2251, -1467, 874, 1424, 263, -1028, -2948, -3044, -391, 1259, 1132, -81, -2537, -2036, 172, 1637, 2935, 1600, -225, -1227, -289, 2510, 3169, 1321, 391, -1072, -1530, 521, 1571, 1145, -1316, -3232, -2308, -1106, -45, 575, -769, -2620, -2166, -1301, 1402, 2336, 455, -542, -519, 377, 2187, 3325, 2978, 706, -1372, -102, 1826, 2076, 1839, 16, -2219, -2335, -1091, 577, 425, -1458, -2681, -3277, -2352, 94, 837, 445, -915, -2201, -1015, 1729, 2378, 2291, 1100, -295, 443, 1276, 3018, 3484, 901, -584, -694, -98, 953, 1212, -229, -2175, -3332, -2191, -202, -60, -486, -2214, -3320, -2023, -574, 1110, 1841, -238, -1525, -472, 1021, 3066]
1698C066J2j040j525j362J467K350p44q88j764j463N34J036Q19r7k381j405O26
1715b759J659J652m17j275o31n21J649K384L59j340j043o0J072J346P72l51k230
1732B66j295J268J044Q34r08k145q90j64Q91J812l28j439j503J66J419J199M30
1749F57j51j669q59J792J403P51m20j458p19M46J265J608q38j339j271k36J254
1766B16J044n65k64k122q50J511J638L78r25j363l11N97J171J628m71j497r72
1783a157K69J629J116n24r07j330m37J435J263Mr31j972j3O94Q85J407p61j577
1801i07r87J139J254J055q95l42j162n75J867J150J01j366j876L89R76P97N87
1818A205p33j520j079Q52J649P98j014q53q40K07J725J216j89q27j741N57J533
$$ y = [3066, 3078, 2038, 513, -849, 618, 2968, 2224, 1336, -428, -1891, -1357, -321, 498, 401, -1980, -3385, -2759, -1100, 552, 135, -1140, -1771, -2292, -643, 1741, 2100, 760, -283, -343, 729, 2075, 2847, 2496, 266, -1029, 239, 1283, 2117, 1209, -936, -1826, -1990, -1099, 713, 385, -1054, -2557, -2391, -972, 227, 657, 506, -1163, -2022, -230, 1173, 1924, 1504, 46, -673, -227, 1038, 2646, 1808, 469, -802, -1038, 216, 1260, 695, 431, -1691, -2541, -1030, 608, 986, 61, -1302, -1613, -1016, 155, 1783, 1312, -185, -1157, -888, 741, 1857, 1333, 426, -904, -1341, 94, 1357, 1361, 430, -1542, -1555, -861, 24, 1431, 670, -907, -1894, -755, 499, 1554, 659, 317, -845, -1420, 447, 1597, 1698, 332, -1544, -1155, -179, 618, 1205, 472, -1048, -2127, -1275, 374, 1172, 158, -695, -1535, -1328, 397, 1613, 1424, 597, -1144, -587, 946]
1835I46M37N70p86j769j82N55J561K77j633j040m09k98J474Q27o49j080j037O44
1853a592J468M17P11p47j568K69J136J515O82j235j256o1J14J591M44o22j310
1870d4j102L96J330kj06j128j293k4R69J239K15j475r67M52P15J587Q71p66r74
1889a07p46P77J871J13l24q83j101K38O25J181j15j881j249M34L79R99K34r28
1907d83r16o19P12J716K75n22j168l81Q96J105Q18J90j488q57N96P79P84Q9j051
1926D75r91o07Q16J276P8j066r56m99K67J511J6K88j612p12R88J028M72o8j039
1945c35m21m32J152J868o89r64o37n98J076P73K36Nj496j042Q47J205N07o12j187
1964g44j53k1M99J573r3j441n57J7R61O81K43m76j225m71J128N08O89m69j694
$$ y = [946, 1383, 1953, 1167, -602, -784, -229, 1332, 1609, -24, -1064, -1473, -1771, -297, 530, -119, -1199, -2236, -1592, -124, 293, 1004, 257, -1311, -1042, 94, 1609, 2291, 1056, -200, -261, -147, 1444, 1888, 1266, -44, -1146, -750, 580, 578, 472, -656, -1949, -1973, -1004, 235, 450, -1025, -1992, -1540, -825, 762, 1633, 867, -107, -853, -76, 1795, 1908, 1584, 701, -400, -162, 463, 1644, 1529, -352, -1601, -1167, -788, 211, 445, -483, -1399, -2018, -1306, 410, 685, 163, -1005, -1386, -490, 615, 1433, 1623, 135, -722, -126, 653, 1437, 1526, 475, -516, -1123, -307, 969, 1047, -19, -975, -1474, -1207, 304, 320, 608, -1004, -1716, -728, 300, 772, 704, -335, -756, -1188, -36, 1832, 1143, 179, -458, -1056, 20, 793, 1029, 1034, -462, -1504, -657, 548, 1055, 443, -744, -897, -918, -419, 1154, 1061, -380, -937, -920, 41, 722, 965, 489, -736, -1207, -79, 429, 1118, 649, -1045]
1983a045L6M50L86J189j03j546o86M91J111Q20k21m39j048n17J163J132J87r35
2001D25r55N9L45N49P35m36r57q90L2J199N02m28j33r96m62J031J112j39q58o03
2021h68Q9O72N92Q32o05j285K9N31P11R56o20j057n96N9Q61N60K4r00j370M44
2041i41R94o1O97m59j387l47P37J059O07m91q24m78J72J303Q44n21l48r02k37
2060e83J191K97qo29o75l28O64O97K91j329p80L96j65O24J159o77j047m81N46
2079h37J179M0L79p85r89L67Q86O23Q56j120j165J48M82N56N00k50j113p06L79
2098e70J126m0l15l47j040R0N50Q96L1j039l87Q1L74R96L84n61m22k99K24J378
2118A110p1n55n46k91J53N70Q52j02j552m83L12L64P53J80j182o05k50R37O98
$$ y = [-1045, -1009, -559, -173, 1016, 913, -633, -1319, -828, 283, 1103, 882, 443, -605, -1122, 41, 1173, 1360, 425, -530, -471, -126, 423, 1158, 722, -235, -1125, -1093, 106, 608, 180, 47, -949, -1411, -380, 732, 593, -265, -868, -779, -107, 485, 1317, 712, -573, -544, -13, 698, 1654, 1034, -23, -619, -560, 301, 861, 885, -15, -1385, -941, 53, -8, 689, 230, -1157, -1504, -767, 292, 899, 408, -416, -894, -722, 581, 1425, 904, 556, -346, -583, 608, 905, 897, 268, -407, -735, -71, 626, 917, -412, -1192, -796, -961, -337, 822, 145, -902, -1383, -837, 342, 382, 761, -24, -1013, -646, 240, 863, 1719, 599, -566, -418, 64, 620, 1120, 870, -243, -949, -570, 556, 516, 201, -146, -1186, -1096, -546, 350, 381, -658, -1045, -964, -590, 406, 790, 229, -193, -492, -268, 1110, 1039, 484, -62, -353, -200, 370, 1222, 1120, -432, -915, -603, -239, 514, 694, -488, -1093, -1343, -406, 292]
2137B92K25n05q17m34P26N75N84J67j009p94Q65N89P12l66j66m84n83M66J282
2156A325m15q17l05m84M07O57K05o08p77n54M95P85P53p17p06k89p9Q72J273P6
2176A097j107l76q5Q34O34L33l13j143m71O06J045L8o63q43l33J66M40O36r0r50
2196e45p07J09J010K28k91R5n06o93J141O84K24l15q58j22O65M75N76m84r15l4
2216b63j31P15N99k99p30n69k43O94N36N9o62m39k26O74M9Q28l00r67j54N81M98
2237B50M48j52m14k15m92J051O32n31m25l89k94P24K53K39j93r79j72K79Q07K78
2257G05r02l57R3p9M52P87l22n40m34j84J014K37m3k10p98j29M54O52P18o38q30
2278c54J45j09O58J52j15n00o59L22Q12L42k68k02r80M1Q87L23j05m24m58j06
$$ y = [292, 517, 12, -805, -1239, -513, 62, 646, 813, -196, -990, -125, 464, 1176, 810, 644, 160, -423, 43, 1325, 910, 93, -212, -696, -289, 368, 573, -35, -812, -1366, -871, -86, 667, -50, -756, -1045, -1124, -252, 1021, 1097, -10, -386, -471, 363, 997, 1330, 1017, -126, -597, 9, 1054, 1092, 429, -414, -747, -581, -141, 495, 405, -545, -1252, -1143, -133, 95, -196, -101, -607, -1300, -159, 525, 749, 434, -424, -546, 119, 594, 1170, 686, -229, -263, -394, 321, 920, 621, -109, -678, -921, -227, 309, 368, -294, -733, -959, -285, -236, 592, 292, -675, -829, -248, 250, 698, 546, 132, -83, -575, 476, 1108, 577, 152, -237, -531, 193, 446, 685, 492, -487, -659, -380, 427, 705, -197, -554, -461, -540, -88, 699, 377, -163, -597, -781, 233, 470, 427, 217, -581, -710, -256, 396, 1114, 476, -354, -209, -318, 340, 492, 377, -123, -782, -460, 352, 694, 426, 224, -756, -715, 172, 495, 390, -34, -492, -598]
2298e98OQ05J01l09k96n40J70Q84J32j54j02p52K83M38O64L4n26n52N8K87L86
2319D19K93l10o48k08J66P55J77l77n83k31p0M75M03K48q02p31N55L41O1M62l27
2340F8o75j68N11J090j52j84l36n04L4R49Q5k9p91l24K53K76L97O8p85l39j94
2361g50M50P33r3o60l17m39N41P06J70o2p23j69J88Q29j9M32r53k25J16M51N12
2382G18J65p67k67o1J10N15j97k8n51l71M85O70j88k37l34n05J53M44N53J32q53
2403d14j52j21M52Q52j94l6l19n25N87P65K8m06l27m94L11K95L60j90p47n20M89
2424c06O9O14l13l62m82l13P89J35L96l36n73J02N08K88K85J41o63l50M66M76
2444E71K87j73k25j98l06N86k7K04l33p99j52M75O9L10l85r32OP40M4M29p1p38
$$ y = [-598, -592, 213, 314, 5, -291, -831, -661, 223, 355, 201, 99, -653, -370, 68, 732, 766, 240, -312, -254, 33, 419, 712, 402, -246, -454, -288, 467, 644, 267, -316, -547, -617, -142, 261, 509, -293, -1024, -469, -128, -67, 395, 68, -607, -775, -264, 826, 674, 490, 154, -350, -316, 633, 718, 689, -102, -426, -173, 103, 500, 568, -217, -556, -750, -300, 433, 340, -320, -637, -1076, -535, 171, 341, 279, -444, -613, -425, 404, 385, 817, -136, -361, -245, 206, 718, 883, 116, -151, -212, -102, 413, 216, 188, -363, -734, -249, 421, 233, -4, -338, -843, -690, -246, 307, 439, -414, -566, -687, -235, 617, 423, 387, 68, -457, 130, 895, 923, 517, 190, -304, 7, 302, 662, 472, -275, -795, -306, -237, 377, 64, -298, -780, -1093, -304, -169, 227, -109, -682, -580, -72, 216, 501, 642, -21, -371, 95, 571, 858, 685, 460, 262, -44, 542, 515, 719, 386, -413, -565, -90, -21, 289, -96, -1028, -1022, -282, -238, 191, 120, -618]
2466f18J6k14J002K94l6k71m77M23L71K56K28k10q46k3K71M41N1n04o05K50k18
2487d19R1O41l23m18n30K20N03n9L93j86n88P9P06J25K49J06p97J52K49K77N30
2508A001n42l40m8J83J64J8j58k30o56j00M51L35J33o37n89K29L01J32N67m68
2528b54k78mM30Q14j19j25l71k51J37N30K77k9l89o67L67N4K31K0m58j58n62J97
2550f08O54r5k65k07k9k66Q23K14j54p86K88j2N97L66O7k25m25R3P8P04L0l83
2572D59n67k1J5L44J71o8l82q41N33K8K90Nk8k32j13O6L87O0k02l32M5K94M14
2595C25Q7j40L6o31L23N50J29k65l71k79p8K82Q03l61r91L55M0J40K54K1l74J59
2617A4o38M7N76R3J57m18p0K23o7L77M8k86l35M6L77L63k02j2m21j93M91K96k33
$$ y = [-618, -602, -816, 186, 480, 444, 173, -304, 119, 490, 746, 974, 764, -82, -105, 166, 607, 658, 154, -451, -201, -419, -328, 313, -10, -428, -958, -738, -235, -294, 99, -87, -675, -596, 110, 235, 484, 590, -207, -55, 194, 471, 1001, 459, 119, 71, 254, 418, 436, 278, 48, -608, -708, -257, 78, 211, -426, -1015, -786, -485, -353, 214, -254, -532, -536, -106, 708, 589, 464, 93, -158, -21, 509, 786, 757, 368, -299, 68, 122, 353, 373, -85, -243, -805, -608, 46, -49, -314, -521, -550, -816, 7, 221, 67, -719, -431, -443, 154, 520, 587, 362, -63, 30, 108, 812, 842, 459, -108, -129, -114, 230, 401, 333, -49, -890, -357, -329, -39, -34, -62, -294, -407, -341, 46, 106, -96, -428, -383, -89, 325, 412, 272, 308, -323, 0, 550, 679, 414, 43, -236, -314, -32, 771, 410, -581, -226, -186, -46, 208, 229, -145, 14, -624, -577, -1, 92, 249, -169, -239, -16, -83, 294, 342, 56, -279, -233, 144, 507, 305, 293, -128, -321, 170, 466, 233]
2640B33q0k71m48N40L58l7o6o50K6K33J01O99o18m4k71l66N06M26M9m07k64K68
2662h3J01N3M22l25k31n5K9K43O92n20l43J06j61j22N99j76k80l52K15K14m0J23
2684A09J2p02Q8L00M45p8N3l83p7ML53L19l23k22J13j21L35L17k19Rn38k09K59
2707a56N09J39m31n88M23k99Q4N81k1n33k80K43L28J20N3k5j04k57K70J48K20
2728D24l77k06K48J95j86K34r5l68n4P2K14J17L2k88l00k14L87L40J32l72m03
2749d68l7L39K89K50k38j59k78J34M60L48k60m30q7Q7J25K92k66j51j62O7L54
2770B09k42K33l95l6j15kM49K11k90l88K62p9K78j78K55k25k50K84J20P7J04k40
2792D2k03k82L50L63K00l16j65k95K36L27l9q1M7o44M16J68L1J9m5j73k56L35
$$ y = [233, 153, -118, -566, -26, 332, 295, 229, -421, -395, -162, -61, 638, 20, -24, -295, -661, -155, 271, 320, -87, -351, -83, 18, 71, 493, 168, -63, -118, -89, 154, 846, 326, -17, 89, -72, -194, 405, 229, -51, -403, -188, 26, -14, 109, 121, -581, -493, -193, 252, 174, 227, -156, -233, -229, 124, 443, 120, -102, 11, -110, 225, 542, 323, 332, -206, -415, -156, 353, 492, 61, -527, -104, -403, -319, 262, 241, -292, -572, -329, -1, 119, 172, 147, 43, -214, 56, 204, 424, 47, -159, 89, 284, 98, 332, 237, -131, -185, -113, 101, 218, 250, -38, -338, -552, -165, 175, 307, -65, -468, -505, -166, 123, 373, 135, -24, -302, -168, 292, 640, 380, -50, -137, -50, 75, 367, 101, -50, -212, -145, 209, -33, 200, -195, -231, -346, -348, 101, 312, 22, -366, -104, -183, 95, -83, 172, -53, -303, -19, 101, 178, 282, 42, -161, -443, -93, 270, 470, 154, -11, -306, -70, 257, 218, 137, 184, -460, -44, 124, 155, 174, 129, -44, -300, 35]
2814C5L17P5n91q7r8J71L30J38j32k00l56P6L59L04k73q1j69J52j78N52L8l17
2836F5k33J35K01L9J93l04j52k38L72q2K12k45J03o46K75Q8J74K64n43l26M36
$$ y = [35, 352, 427, -164, -251, -349, -178, 152, 290, 158, -42, -398, -322, 37, 341, 68, -13, -182, -30, -208, 344, 382, 65, -168, -33, 168, 207, 400, 96, -56, -294, 78, -4, 208, -37, 66, -580, -305, -217, -43, 221, -322, -648, -212]
$$ [...]
8191c60
##END NTUPLES=NMR FID
##END=
