##TITLE=1H_Ser AM C8
 CDCl3
 8 sc, 
 17.11.2022
##JCAMPDX= 6.0         $$ Bruker NMR JCAMP-DX V2.0
##DATA TYPE= NMR FID
##DATA CLASS= NTUPLES
##ORIGIN= UXNMR, Bruker Analytische Messtechnik GmbH
##OWNER= root
$$ XWIN-NMR		Version 3.5
$$ Thu Nov 17 15:37:50 2022 Russian Standard Time (UT+4h)  she@DPX200
##.OBSERVE FREQUENCY= 200.1313499994
##.OBSERVE NUCLEUS= ^1H
##.DELAY= (6, 6)
##.ACQUISITION MODE= SIMULTANEOUS
##.ACQUISITION SCHEME= undefined
##.AVERAGES= 8
##.DIGITISER RES= 18
##SPECTROMETER/DATA SYSTEM= spect
##.PULSE SEQUENCE= zg30
##.SOLVENT NAME= CDCl3
##.SHIFT REFERENCE= (INTERNAL, CDCl3, 0, 15.7039)
##AUDIT TRAIL= $$ (NUMBER, WHEN, WHO, WHERE, WHAT)
$$ ##TITLE= Audit trail, XWIN-NMR		Version 3.5
$$ ##JCAMPDX= 5.01
$$ ##ORIGIN= Bruker BioSpin GmbH
$$ ##OWNER= she
$$ F:/spectra/data/she/nmr/H-F/1/audita.txt
$$ ##AUDIT TRAIL=  $$ (NUMBER, WHEN, WHO, WHERE, WHAT)
(   1,<2022-11-17 15:36:45.35 +0400>,<she>,<DPX200>,
      <created by zg, POWCHK disabled, PULCHK disabled
       configuration hash MD5:
       00 E9 B6 7A A2 85 ED C7 34 08 36 98 17 FE 4E 26
       data hash MD5: 16K
       9C C8 19 FC DF AC 5D 15 58 37 97 A5 D4 14 6D AA>)
$$ ##END=
$$ 
$$ hash MD5
$$ F4 EC 80 71 0E E4 AA 57 F7 1A 1B C1 41 2C 17 2F
##$RELAX= 
##$RELAX= 
##$RELAX= 
##$RELAX= 
##$RELAX= 
##$RELAX= 
$$ Bruker specific parameters
$$ --------------------------
##$DU= <F:/spectra>
##$EXPNO= 1
##$NAME= <H-F>
##$PROCNO= 1
##$TYPE= <nmr>
##$USER= <she>
##$AMP= (0..31)
100 100 100 100 100 100 100 100 100 100 100 100 100 100 100 100 100 100 
100 100 100 100 100 100 100 100 100 100 100 100 100 100 
##$AQSEQ= 0
##$AQ_mod= 1
##$AUNM= <au_zg>
##$AUTOPOS= <>
##$BF1= 200.13
##$BF2= 200.13
##$BF3= 200.13
##$BF4= 200.13
##$BF5= 200.13
##$BF6= 200.13
##$BF7= 200.13
##$BF8= 200.13
##$BYTORDA= 1
##$CFDGTYP= 0
##$CFRGTYP= 5
##$CHEMSTR= <none>
##$CNST= (0..31)
1 1 145 1 1 1 1 1 1 1 1 1 1 1 1 1 1 1 1 1 1 1 1 1 1 1 1 1 1 1 1 1 
##$CPDPRG= <>
##$CPDPRG1= <>
##$CPDPRG2= <>
##$CPDPRG3= <>
##$CPDPRG4= <mlev>
##$CPDPRG5= <mlev>
##$CPDPRG6= <mlev>
##$CPDPRG7= <mlev>
##$CPDPRG8= <mlev>
##$CPDPRGB= <>
##$CPDPRGT= <>
##$D= (0..31)
0 1.2 0 0 0 0 0 0 0 0.06 0 0.03 0 0 0 0 0.0002 0 0 0 0 0 0 0 0 0 0 0 0 
0 0 0 
##$DATE= 1668685004
##$DBL= (0..7)
120 120 120 120 120 120 120 120 
##$DBP= (0..7)
150 150 150 150 150 150 150 150 
##$DBP07= 0
##$DBPNAM0= <>
##$DBPNAM1= <>
##$DBPNAM2= <>
##$DBPNAM3= <>
##$DBPNAM4= <>
##$DBPNAM5= <>
##$DBPNAM6= <>
##$DBPNAM7= <>
##$DBPOAL= (0..7)
0.5 0.5 0.5 0.5 0.5 0.5 0.5 0.5 
##$DBPOFFS= (0..7)
0 0 0 0 0 0 0 0 
##$DE= 6
##$DECBNUC= <off>
##$DECIM= 32
##$DECNUC= <off>
##$DECSTAT= 4
##$DIGMOD= 1
##$DIGTYP= 9
##$DL= (0..7)
0 120 120 120 120 120 120 120 
##$DP= (0..7)
150 150 150 150 150 150 150 150 
##$DP07= 0
##$DPNAME0= <>
##$DPNAME1= <>
##$DPNAME2= <>
##$DPNAME3= <>
##$DPNAME4= <>
##$DPNAME5= <>
##$DPNAME6= <>
##$DPNAME7= <>
##$DPOAL= (0..7)
0.5 0.5 0.5 0.5 0.5 0.5 0.5 0.5 
##$DPOFFS= (0..7)
0 0 0 0 0 0 0 0 
##$DQDMODE= 0
##$DR= 18
##$DS= 0
##$DSLIST= <SSSSSSSSSSSSSSS>
$$ [...]
##$SUBNAM2= <"">
##$SUBNAM3= <"">
##$SUBNAM4= <"">
##$SUBNAM5= <"">
##$SUBNAM6= <"">
##$SUBNAM7= <"">
##$SUBNAM8= <"">
##$SUBNAM9= <"">
##$SW= 18.0517283424941
##$SWIBOX= (0..15)
0 0 2 0 0 0 0 0 0 0 0 0 0 0 0 0 
##$SW_h= 3612.71676300578
##$TD= 16384
##$TD0= 1
##$TE= 0
##$TE2= 300
##$TE3= 300
##$TEG= 300
##$TL= (0..7)
0 120 120 120 120 120 120 120 
##$TP= (0..7)
150 150 150 150 150 150 150 150 
##$TP07= 0
##$TPNAME0= <>
##$TPNAME1= <>
##$TPNAME2= <>
##$TPNAME3= <>
##$TPNAME4= <>
##$TPNAME5= <>
##$TPNAME6= <>
##$TPNAME7= <>
##$TPOAL= (0..7)
0.5 0.5 0.5 0.5 0.5 0.5 0.5 0.5 
##$TPOFFS= (0..7)
0 0 0 0 0 0 0 0 
##$TUNHIN= 0
##$TUNHOUT= 0
##$TUNXOUT= 0
##$USERA1= <user>
##$USERA2= <user>
##$USERA3= <user>
##$USERA4= <user>
##$USERA5= <user>
##$V9= 5
##$VALIST= <valist>
##$VCLIST= <CCCCCCCCCCCCCCC>
##$VD= 0
##$VDLIST= <DDDDDDDDDDDDDDD>
##$VPLIST= <PPPPPPPPPPPPPPP>
##$VTLIST= <TTTTTTTTTTTTTTT>
##$WBST= 1024
##$WBSW= 4
##$XGAIN= (0..3)
0 0 0 0 
##$XL= 0
##$YL= 0
##$YMAX_a= 220254
##$YMIN_a= -422641
##$ZGOPTNS= <>
##$ZL1= 120
##$ZL2= 120
##$ZL3= 120
##$ZL4= 120
##$ABSF1= 10
##$ABSF2= 0
##$ABSG= 5
##$ABSL= 3
##$ALPHA= 0
##$AQORDER= 0
##$ASSFAC= 0
##$ASSFACI= 0
##$ASSFACX= 0
##$ASSWID= 0
##$AUNMP= <proc_1d>
##$AZFE= 0.1
##$AZFW= 0.1
##$BCFW= 1
##$BC_mod= 2
##$BYTORDP= 1
##$COROFFS= 0
##$CY= 11.3945322036743
##$DATMOD= 1
##$DC= 2
##$DFILT= <>
##$DTYPP= 0
##$F1P= 2.36226072786647
##$F2P= -0.459571619588291
##$FCOR= 0.5
##$FTSIZE= 0
##$FT_mod= 4
##$GAMMA= 1
##$GB= 0.15
##$INTBC= 1
##$INTSCL= 1
##$ISEN= 128
##$LB= 0.24
##$LEV0= 0
##$LPBIN= 0
##$MAXI= 10000
##$MC2= 0
##$MEAN= 0
##$ME_mod= 0
##$MI= 1.114404
##$NCOEF= 0
##$NC_proc= 0
##$NLEV= 6
##$NOISF1= 3.799351
##$NOISF2= 2.8
##$NSP= 1
##$NTH_PI= 0
##$NZP= 0
##$OFFSET= 15.70392
##$PC= 1
##$PHC0= -18034.06
##$PHC1= 18.0007
##$PH_mod= 1
##$PKNL= yes
##$PPARMOD= 0
##$PSCAL= 0
##$PSIGN= 0
##$REVERSE= no
##$SF= 200.130013532006
##$SI= 16384
##$SIGF1= 3
##$SIGF2= 2
##$SINO= 400
##$SIOLD= 16384
##$SREGLST= <1H.CDCl3>
##$SSB= 0
##$STSI= 0
##$STSR= 0
##$SW_p= 3612.71676300578
##$SYMM= 0
##$S_DEV= 0
##$TDeff= 0
##$TDoff= 0
##$TI= <>
##$TILT= no
##$TM1= 0
##$TM2= 0
##$TOPLEV= 0
##$USERP1= <user>
##$USERP2= <user>
##$USERP3= <user>
##$USERP4= <user>
##$USERP5= <user>
##$WDW= 1
##$XDIM= 8192
##$YMAX_p= 0
##$YMIN_p= 0
$$ End of Bruker specific parameters
$$ ---------------------------------
##NTUPLES= NMR FID
##VAR_NAME=  TIME,          FID/REAL,        FID/IMAG
##SYMBOL=    X,             R,               I
##VAR_TYPE=  INDEPENDENT,   DEPENDENT,       DEPENDENT
##VAR_FORM=  AFFN,          ASDF,            ASDF
##VAR_DIM=   8192,          8192,            8192
##UNITS=     SECONDS,       ARBITRARY UNITS, ARBITRARY UNITS
##FACTOR=    0.0002768,     1,               1
##FIRST=     0,             0,               0
##LAST=      2.2672688,     0,               0
##MIN=       0,             -422641,         0
##MAX=       2.2672688,     220254,          0
$$ Real data points
##PAGE= N=1
##DATA TABLE= (X++(R..R)), XYDATA
$$ [...]
$$ plain form
1829 -317 -721 -428 -362 -555 -157 47 -394 30 122 -32 211 219 401 133 367 410 291 185 473 435 340 231
1851 231 284 -201 37 -46 260 -619 -401 -365 -534 -363 -132 -490 -259 -446 -371 -213 114 161 -76 292 261 123
1873 123 327 447 179 543 270 64 101 136 167 327 187 -67 -301 64 129 -394 -329 -25 -419 -442 -363 -420 -532
1896 -532 -340 -351 -166 -300 -117 23 94 272 104 159 229 244 671 612 376 455 197 -149 276 258 353 7 -15
1919 -15 -157 -138 -244 -288 -288 -432 -568 -344 -226 -153 -156 23 -51 -53 138 276 280 212 346 302 372 354 385 467 396 231 215
1946 215 121 65 -48 10 -49 -16 -2 -417 -219 -98 -163 -358 -331 -143 -262 -323 -63 -101 -91 -234 104 102 35 318 324
1971 324 517 333 231 350 296 550 373 234 373 109 -232 -50 9 -289 -213 48 -91 -485 -243 -350 -388
1992 -388 -307 -77 -471 -325 36 -251 -347 172 160 277 297 181 321 363 563 323 213 543 208 154 413 104
$$ packed form
1829c17m04K93O6j93L98K04m41M24R2j54K43QJ82k68K34M3j19j06K88l8r5j09
1851B31N3m85K38q3L06q79K18L6j69J71K31l58K31j87P5J58L27M7k37L68l1j38
1873A23K04J20k68L64k73k06L7L5L1J60j40k54k34L65O5n23O5L04l94k3P9n7j12
1896e32J92j1J85j34J83J40P1J78j68N5P0J5M27n9k36P9k58l46M25j8R5l46k2
1919a5j42J9j06m4%j44j36K24J18P3lJ79p4kJ91J38Mo8J34m4P0j8L1Q2p1j65j6
1946B15r4n6j13N8n9L3J4m15J98J21o5j95K7J88j19o1K60l8J0j43L38ko7K83O
1971C24J93j84j02J19n4K54j77j39J39k64l41J82N9k98P6K61j39l94K42j07l8
1992c88Q1K30l94J46L61k87r6N19j2J17K0j16J40M2K00k40j10L30l35n4K59l09
$$ plain form
2014 104 -16 -78 -311 -327 -174 -61 -348 -264 -176 -483 -402 -269 -172 -189 -264 -99 1 51 -93 131 159 253 332 359
2038 359 323 483 321 264 185 41 -310 33 51 -54 -68 -255 -302 -384 -118 -359 -275 -256 -384 -370 -225 -454 -211
2061 -211 259 -288 55 79 243 107 208 374 414 181 253 361 351 107 -2 157 41 -46 -510 105 -225 -213
2083 -213 -148 -352 -303 -525 -188 -136 -529 -377 -369 -97 -61 -58 -118 257 21 231 225 294 402 468 477 392 272 -46 358
2108 358 304 208 78 -45 4 -88 -145 -192 -186 -442 -151 -297 -126 -461 -332 -181 -269 -114 -89 68 -9 209 -70 353
2132 353 167 331 168 46 659 485 285 121 405 -16 -170 171 -234 -60 152 -189 -339 -103 17 -227
2152 -227 -585 -363 -280 -85 -119 -70 -208 -101 81 -36 199 263 401 350 320 278 156 319 259 205 391 160 -81
2175 -81 -11 23 27 36 -114 -338 -534 -332 -182 -292 -43 -153 -260 -450 151 100 180 15 9 226 66 0 552 326
$$ packed form
2014A04j20o2k33j6J53J13k87Q4Q8l07Q1J33R7j7p5J65J00N0j44K24K8R4P9K7
2038C59l6J60j62n7p9j44l51L43J8j05j4j87m7q2K66k41Q4J9j28J4J45k29K43
2061b11M70n47L43K4J64j36J01J66M0k33P2J08j0k44j09J59j16q7m64O15l30J2
2083b13O5k04M9k22L37N2l93J52QK72L6Lo0L75k36K10oO9J08O6Rq5j20l18M04
2108C58n4r6j30j23M9r2n7m7Ok56K91j46J71l35J29J51q8J55K5J57p7K18k79M23
2132C53j86J64j63j22O13j74k00j64K84m21j54L41m05J74K12l41j50K36J20k44
2152b27l58K22Q3J95l4M9j38J07J82j17K35O4J38n1l0m2j22J63o0n4J86k31k41
2175h1P0L4MRj50k24j96K02J50j10K49j10j07j90O01n1Q0j65oK17j60o6N52k26
$$ plain form
2199 326 182 -2 214 238 244 265 292 102 208 -322 79 -316 -546 -139 -314 -319 -500 -152 -390 -115 -302 -198
2221 -198 -84 -161 31 6 -13 1 133 14 89 302 296 300 315 140 164 258 250 31 317 175 -338 47 -241 -389 -52
2246 -52 -234 -440 -416 -428 -250 -249 -366 -190 -105 -137 -100 -383 148 109 124 35 498 139 360 387 409 182 321 443
2270 443 30 25 86 -122 -245 -65 -99 -459 -336 -296 -220 -333 -347 -712 -247 -31 -340 151 -111 20 -355 -21
2292 -21 259 330 491 442 70 153 269 521 308 407 114 -22 -140 -66 -344 -344 -449 -403 -490 -273 -374 -662 -203
2315 -203 -366 -170 -57 -140 -200 25 600 486 87 32 383 5 245 342 361 227 154 169 3 94 56 -38 -335
2338 -335 -271 -458 -341 1 -319 -579 -276 -300 -332 -431 -137 -39 -33 395 40 -30 16 180 -20 299 322 213 -37
2361 -37 353 127 -71 296 241 31 -97 89 38 -68 103 -135 -405 -244 -227 -330 -471 25 -401 -350 186 -437
$$ packed form
2199C26j44j84K16K4OK1K7j90J06n30M01l95k30M07j75nj81L48k38K75j87J04
2221a98J14p7J92k5j9J4J32j19P5K13oMJ5j75K4R4qk19K86j42n13L85k88j48L37
2246e2j82k06K4j2J78Jj17J76Q5l2L7k83N31l9J5q9M63l59K21K7K2k27J39J22
2270D43m13nO1k08j23J80l4l60J23M0P6j13j4l65M65K16l09M91k62J31l75L34
2292b1K80P1J61m9l72Q3J16K52k13R9k93j36j18P4k78%j05M6q7K17j01k88M59
2315b03j63J96J13q3o0K25N75j14l99n5L51l78K40R7J9j34p3J5j66R1l8r4k97
2338c35O4j87J17L42l20k60L03k4l2r9K94R8OM28l55p0M6J64k00L19K3j09k50
2361c7L90k26j98L67n5k10j28J86n1j06J71k38k70J61J7j03j41M96m26N1N36o23
$$ plain form
2383 -437 24 294 25 -464 190 257 -178 25 98 -79 -65 116 298 93 401 357 23 151 88 -123 -410 -63
2405 -63 -104 -57 -49 -377 -456 -81 -116 -241 -162 -6 -373 -61 114 357 -379 40 127 -64 -78 426 247 253 184 248 325
2430 325 132 243 44 141 -52 -65 -246 -91 -111 -81 -259 -229 -525 -135 -163 -130 -101 -42 36 -142 -61 -30 -105 97
2454 97 -119 -97 -86 180 12 223 364 315 314 103 84 95 -52 116 -15 -227 -399 -283 -554 -367 -260 -227 36
2477 36 -145 -54 -250 202 219 -81 -159 287 -45 49 174 347 291 589 390 -443 158 -5 215 70 -161 -136
2499 -136 -136 -155 9 -329 -133 -417 -264 -420 -292 -183 -130 -94 -137 -56 -12 -31 -4 148 -35 165 118 266 197 232
2523 232 61 -66 221 214 220 243 -85 361 -71 -344 -154 -226 -172 -87 -184 -305 -193 -444 -270 14 -377 241 111
2546 111 -10 152 92 170 -11 381 349 319 185 141 422 436 78 -89 94 -36 -214 -180 146 -390 -27 1 -265
$$ packed form
2383d37M61K70k69m89O54O7m35K03P3j77J4J81J82k05L08m4l34J28o3k11k87L47
2405f3m1M7Ql28p9L75l5j25P9J56l67L12J75K43p36M19Q7j91j4N04j79Oo9O4P7
2430C25j93J11j99R7j93j3j81J55k0L0j78L0k96L90k8L3K9N9P8j78Q1L1p5K02
2454I7k16K2J1K66j68K11J41m9jk11j9J1j47J68j31k12j72J16k71J87J07L3K63
2477C6j81R1j96M52J7l00p8M46l32R4J25J73n6K98j99q33O01j63K20j45k31K5
2499a36%j9J64l38J96k84J53j56J28J09N3L6m3Q1M4j9K7J52j83K00m7J48o9L5
2523B32j71j27K87pOK3l28M46m32k73J90p2N4Q5r7j21J12k51J74K84l91O18j30
2546A11j21J62o0P8j81L92l2l0j34m4K81J4l58j67J83j30j78L4L26n36L63K8k66
$$ plain form
2569 -265 -349 -362 -121 -336 -136 21 -177 43 134 -264 135 228 148 -110 258 204 317 153 21 -93 209 91
2591 91 7 -66 -80 -100 -175 -45 -105 -181 -253 -235 -366 -320 -40 -63 -19 -211 -78 71 -163 -104 265 264 -178 -188 408 66
2617 66 65 74 308 353 172 118 57 -216 106 213 222 -164 33 -349 -191 -288 -90 -148 -358 -303 -79 -227 184 -43
2641 -43 149 -4 -183 257 -97 286 -45 205 -13 84 340 238 347 145 395 345 154 134 -23 -129 -65 -224
2663 -224 -205 -314 -289 -196 -145 -148 -374 -15 -14 -67 -184 -131 143 -107 -1 -32 209 36 506 185 128 198 234 160 184
2688 184 347 133 -106 231 -257 -146 53 -247 67 -288 -89 -250 -109 -44 27 -206 -343 -319 -83 -33 96
2709 96 28 228 5 321 200 85 346 394 334 539 -61 -2 117 -43 187 -50 -331 -214 -342 -288 -322 -139
2731 -139 -312 -161 -41 -280 -321 -193 -4 -198 -143 270 182 264 63 136 51 -7 318 209 171 84 93 87 255 -223
$$ packed form
2569b65q4j3K41k15K00J57j98K20R1l98L99R3q0k58L68n4J13j64j32j14L02j18
2591I1q4p3j4k0p5J30o0p6p2J8j31M6K80k3M4j92J33J49k34N9L69jm42j0N96l42
2617F6jRK34M5j81n4o1k73L22J07Rl86J97l82J58r7J98n8k10N5K24j48M11k27
2641d3J92j53j79M40l54L83l31K50k18R7K56j02J09k02K50n0j91k0j57j06O4j59
2663b24J9j09K5R3N1lk26L59Jn3j17N3K74k50J06l1K41j73M70l21n7P0L6p4K4
2688A84J63k14k39L37m88J11J99l00L14l55J99j61J41O5P1k33j37K4K36N0J29
2709I6o8K00k23L16j21j15K61M8o0K05o00N9J19j60K30k37k81J17j28N4l4J83
2731a39j73J51J20k39m1J28J89j94N5M13q8Q2k01P3q5n8L25j09l8q7RoJ68m78
$$ plain form
2755 -223 108 -124 209 -123 -109 -111 -141 -241 95 -190 -119 -200 168 75 -145 2 -208 181 -14 -72 -52 283 233
2778 233 370 155 172 63 85 182 242 32 189 131 -273 22 -233 -342 -252 -228 -393 -367 -237 -272 -211 -237 -59 -92
2802 -92 227 147 -64 136 238 48 62 28 127 362 67 177 93 226 349 279 53 -19 -140 -130 -392 -107 -255
2825 -255 -69 -73 -181 -449 -231 13 -278 -52 -23 -134 36 -171 71 -85 -83 214 45 309 170 229 109 173
2847 173 91 135 170 -99 -174 -172 97 -59 -213 -233 -56 -19 -132 -55 -370 -94 -268 8 -67 164 -134 -159 367 175
2871 175 128 69 285 230 140 -48 163 171 262 -90 -25 -44 203 134 -97 -79 -123 -385 -230 -217 -470 -313 -361 -139 -410
2896 -410 -110 -240 -208 84 -67 189 134 56 42 206 242 223 371 263 11 102 220 -6 259 117 79 -347 -18
2919 -18 -190 -149 -86 -5 -261 -349 -269 -269 -233 -121 21 -371 136 230 -59 -160 -28 149 -154 34 163 349 -75
$$ packed form
2755b23L31k32L33l32J4kl0j00L36k85P1q1L68r3k20J47k10L89j95n8K0L35n0
2778B33J37k15J7j09K2R7O0k10J57n8m04K95k55j09R0K4j65K6J30l5O1k6J78l3
2802i2L19q0k11K00J02j90J4l4R9K35k95J10q4J33J23p0k26p2j21J0k62K85j48
2825b55J86mj08k68K18K44k91K26K9j11J70k07K42j56KK97j69K64j39N9j20O4
2847A73q2M4L5k69p5KK69j56j54k0J77L7j13P7l15K76j74K76p5K31k98k5N26j92
2871A75m7n9K16n5r0j88K11QR1l52O5j9K47o9k31J8m4k62J55J3k53J57m8K22k71
2896d10L00j30L2K92j51K56n5p8j4J64L6j9J48j08k52R1J18k26K65j42l8m26L29
2919a8j72M1O3Q1k56q8Q0%L6J12J42l92N07R4k89j01J32J77l03J88J29J86m24
$$ plain form
2942 -75 120 -183 168 15 -114 -83 87 57 -148 -25 -172 -54 -147 -85 -73 -343 -437 -79 -201 -39 7 80 -241
2965 -241 -247 -218 -97 178 197 -245 281 7 62 372 318 96 -12 225 -92 -5 51 44 -96 -101 14 -175 -86 -137 -156
2990 -156 -137 -350 -91 -140 -79 54 -87 85 42 29 80 324 84 257 185 147 84 -37 245 67 -58 203 336
3013 336 -292 -97 37 -191 -58 -145 -331 -294 -19 -192 -323 22 -132 -5 -108 -75 -22 124 116 214 31 -27 246
3036 246 174 160 275 -40 162 69 159 -164 -29 132 -102 374 161 -299 -18 -73 -91 -258 -13 120 -469 -81
3058 -81 -156 103 78 -214 32 -94 107 272 41 -65 65 207 79 398 -11 107 194 282 27 -47 96 -140
3080 -140 3 -28 -59 -266 -64 152 -32 -110 31 -183 -222 -31 -17 88 271 245 -10 74 82 126 323 235 201 104
3104 104 -215 186 168 360 53 148 215 -1 -128 -81 -138 38 -178 -173 -230 -376 79 163 -191 -56 64 -32 -38 118
$$ packed form
2942g5J95l03L51j53j29L1J70l0k05J23j47J18r3O2J2k70r4L58j22J62M6P3l21
2965b41oK9J21K75J9m42N26k74N5L10n4k22j08K37l17Q7N6pj40nJ15j89Q9n1j9
2990a56J9k13K59m9O1J33j41J72m3j3N1K44k40J73p2l8o3j21K82j78j25K61J33
3013C36o28J95J34k28J33q7j86L7K75j73j31L45j54J27j03L3N3J46qR8j83n8K73
3036B46p2j4J15l15K02r3R0l23J35J61k34M76k13m60K81n5j8j67K45J33n89L88
3058h1p5K59k5k92K46j26K01J65k31j06J30J42j28L19m09J18Q7Q8k55p4J43k36
3080a40J43l1l1k07K02K16j84p8J41k14l9J91J4J05J83k6k55Q4QM4J97q8l4r7
3104A04l19M01j8J92l07R5O7k16j27M7n7J76k16Nn7j46M55Q4l54J35J20r6oJ56
$$ plain form
3128 118 207 416 125 166 -7 126 38 115 176 370 -6 44 -16 228 -94 202 -29 -181 -171 47 -231 -57 -242
3151 -242 88 -248 50 -180 -12 -123 -4 89 -97 23 -53 84 116 -48 198 159 167 326 135 260 -77 163
3173 163 64 126 -48 -143 5 -30 -224 -124 -331 -83 -205 -181 -199 -348 26 -238 -150 -160 30 31 62 109 175 164 310
3198 310 -32 61 282 137 139 65 -54 15 -117 -228 174 -171 6 -118 -225 -38 -81 -229 -346 -277 -103 -57 129
3221 129 -84 -52 -94 111 336 28 -95 -91 284 -168 208 -61 183 -31 177 109 353 65 302 5 236 -268
3243 -268 -17 -318 -71 206 37 118 3 -69 -50 -66 -125 -114 -37 15 -229 248 -303 278 72 99 404 -83 -80 286
3267 286 51 -258 43 73 41 -159 -36 -175 -289 -295 -216 -193 -27 -85 -426 -236 -183 -77 61 -194 100 -26 -177
3290 -177 -191 625 77 137 168 299 316 8 410 106 208 125 -12 63 168 -60 118 152 -245 16 102 -160 -242
$$ packed form
3128A18Q9K09k91M1j73J33q8P7O1J94l76N0o0K44l22K96k31j52J0K18k78J74j85
3151b42L30l36K98k30J68j11J19R3j86J20p6J37L2j64K46l9QJ59j91J25l37K40
3173A63r9O2j74r5J48l5j94J00k07K48j22K4j8j49L74k64Q8j0J90JL1M7O6j1J46
3198C10l42R3K21j45Kp4j19O9j32j11M02l45J77j24j07J87m3j48j17O9J74M6J86
3221A29k13L2m2K05K25l08j23ML75m52L76k69K44k14K08o8K44k88K37k97K31n04
3243b68K51l01K47K77j69Q1j15p2J9j6n9J1P7N2k44M77n51N81k06K7L05m87LL66
3267B86k35l09L01L0l2k00J23j39j14oP9K3J66n8l41J90N3J06J38k55K94j26j51
3290a77j4Q16n48O0L1J31J7l08M02l04J02q3j37P5J05k28J78L4l97K61Q6k62q2
$$ plain form
3313 -242 -37 -253 36 69 40 -204 -78 -30 211 293 42 119 224 345 33 175 277 -7 266 -17 -221 39
3335 39 -60 -38 -6 -139 -28 66 -150 42 -65 -34 -91 -238 -280 -95 -213 184 -25 131 76 265 159 -4 89
3358 89 -158 159 326 136 -67 78 78 -122 -198 26 -46 134 -46 57 -197 -33 -183 -211 -9 -321 -259 -205 -200
3381 -200 -13 10 -1 40 168 157 35 13 295 112 179 -27 274 254 -131 223 303 45 -189 94 -86 -116 -30
3404 -30 8 -104 -189 -183 69 -156 -152 -45 -327 30 -17 85 -25 -109 13 38 184 111 66 308 44 302 229 16
3428 16 137 62 164 22 81 135 225 -28 222 -112 -98 -145 -219 39 -239 -164 -210 -319 129 83 22 -77 -258 -125
3452 -125 -32 281 -172 39 109 98 92 219 213 24 -29 51 11 -14 -63 -107 -258 -47 -247 -39 -126 -116 -156 18 -166
3477 -166 -50 -145 -204 29 -44 5 159 -174 -198 296 149 121 168 67 -50 67 34 45 94 151 -5 -28 312 -172
$$ packed form
3313b42K05k16K89L3k9k44J26M8K41Q2k51P7J05J21l12J42J02k84K73k83k04K60
3335C9r9K2L2j33J11R4k16J92j07L1n7j47m2J85j18L97k09J56n5J89j06j63R3
3358H9k47L17J67j90k03J45%k00p6K24p2J80j80J03k54J64j50k8K02l12O2N4N
3381b00J87K3j1M1J28j1j22k2K82j83O7k06L01k0l85L54Q0k58k34K83j80l0Q6
3404c0L8j12q5OK52k25MJ07k82L57m7J02j10q4J22K5J46p3m5K42k64K58p3k13
3428A6J21p5J02j42N9N4R0k53K50l34J4m7p4K58k78P5m6j09M48m6o1r9j81J33
3452a25R3L13m53K11P0j1oJ27oj89n3Q0m0k5m9m4j51K11k00K08q7J0m0J74j84
3477a66J16r5n9K33p3M9J54l33k4M94j47k8M7j01j17J17l3J1M9N7j56k3L40m84
$$ plain form
3501 -172 -29 -218 -280 -189 -80 -19 -128 -30 142 -46 -163 -88 164 -95 -156 -145 -235 62 390 -9 -97 -1 53 192
3525 192 -68 215 -36 219 170 116 -13 -146 -91 -98 -72 4 -51 -247 47 231 29 -235 5 -165 54 256 -78
3548 -78 42 -210 -7 39 52 34 131 163 98 -10 266 257 -89 -250 35 -152 -174 -30 -128 -101 -181 -3 -306 -90
3572 -90 -175 -152 -170 -200 123 -146 -277 35 -175 383 205 -135 163 363 94 68 -77 155 47 47 -165 -11 68
3595 68 17 -129 207 -73 -440 -65 -120 -82 150 -154 -288 123 -236 -9 32 145 -145 66 81 187 297 238
3617 238 69 28 203 66 197 18 165 164 58 -40 16 19 -52 -37 29 -217 -221 -60 -255 70 -219 117 -108 -121
3641 -121 -85 -230 27 53 171 66 335 86 50 137 73 317 277 -147 165 36 30 -79 42 -81 -253 -129 72
3664 72 15 -154 -150 -374 -86 -241 -76 -9 124 -112 139 -51 95 176 374 229 160 37 28 -89 101 130 162 144
$$ packed form
3501a72J43j89o2R1J09O1j09R8J72j88j17P5K52k59o1J1r0K97L28l99q8R6N4J39
3525A92k60K83k51K55m9n4j29j33N5pK6P6n5j96K94J84k02k64K40j70K19K02l34
3548g8J20k52K03M6J3j8R7L2o5j08K76rl46j61K85j87k2J44r8K7q0J78l03K16
3572i0q5K3j8l0L23k69j31L12k10N58j78l40K98K00k69k6j45K32j08%k12J54P9
3595F8n1j46L36k80l67L75n5L8K32l04j34M11l59K27M1J13k90K11J5J06J10n9
3617B38j69m1J75j37J31j79J47jj06r8N6Lp1J5O6k46mJ61j95L25k89L36k25j3
3641a21L6j45K57K6J18j05K69k49l6Q7o4K44m0m24L12j29oj09J21j23j72J24K01
3664G2n7j69Mk24K88j55J65O7J33k36K51j90J46Q1J98j45o9j23rj17J90K9L2j8
$$ plain form
3688 144 -207 15 -45 157 -39 -395 -105 -31 113 -172 -97 -24 -319 -239 -203 -162 -136 -41 -18 -105 -3 89 139 -153
3712 -153 92 139 366 88 115 240 11 27 53 289 104 -132 41 -35 52 10 -5 111 -52 -123 -88 2 -132 -41
3736 -41 -150 116 -200 -19 -78 -99 34 -11 196 276 89 14 -160 90 -26 161 -33 88 131 84 -76 -198 -173
3759 -173 -316 72 -51 -136 17 -144 -188 10 -109 -177 96 66 -47 246 191 239 147 99 351 80 -12 24 90 260
3783 260 141 274 -124 305 316 52 1 -131 -54 -64 -155 -92 -168 36 -86 37 -43 -184 -38 141 159 317 326 110
3807 110 110 273 163 -85 309 128 41 224 59 34 351 56 -88 -59 10 8 -233 -91 28 -135 -284 -175 -28
3830 -28 -22 -153 -133 -114 -42 -102 146 24 142 -36 319 50 -36 276 -89 131 239 150 -31 15 -48 -97 -5 260
3854 260 -42 -22 -31 -167 -192 -171 -199 -381 -250 86 -99 -186 115 6 -319 162 29 81 140 121 -142 190 179 216
$$ packed form
3688A44l51K22o0K02j96l56K90P4J44k85P5P3k95Q0L6M1K6R5K3q7J02R2N0k92
3712a53K45M7K27k78K7J25k29J6K6K36j85k36J73p6Q7m2j5J16j63p1L5R0j34R1
3736d1j09K66l16J81n9k1J33m5K07Q0j87p5j74K50j16J87j94J21M3m7j60j22K5
3759a73j43L88j23q5J53j61m4J98j19o8K73l0j13K93n5M8r2m8K52k71r2L6O6J70
3783B60j19J33l98M29J1k64n1j32P7j0r1O3p6K04j22J23q0j41J46J79J8J58Rk16
3807A10%J63j10k48L94j81q7J83j65k5L17k95j44K9O9kk41J42J19j63j49J09J47
3830b8Oj31K0J9P2o0K48j22J18j78L55k69q6L12l65K20J08q9j81M6o3m9R2K65
3854B60l02K0rj36k5K1k8j82J31L36j85q7L01j09l25M81j33N2N9j9k63L32j1L7
$$ plain form
3878 216 245 42 90 149 107 -192 -149 -124 -2 30 14 68 -142 -72 -27 109 -246 -163 -22 -73 -186 27 79 189 274
3903 274 288 193 -83 403 -43 287 96 116 327 -59 283 144 160 114 -238 -55 319 -148 -107 49 15 -173
3925 -173 -194 -125 -182 -161 30 20 123 93 -149 -16 198 222 -114 -50 -181 103 229 306 -54 -56 95 -152 13 148
3949 148 117 -215 -251 -87 -185 -97 -230 -336 -118 45 -163 169 -58 -235 114 -37 43 90 44 -96 21 121
3971 121 322 40 203 151 232 104 116 -137 37 -15 -177 -160 -229 168 -89 182 -118 -106 68 -135 -109 -82 -136
3994 -136 -63 -141 -77 -138 123 195 189 -147 157 -49 239 -142 54 268 226 21 26 -27 -315 -21 131 147 -170 37
4018 37 -69 -97 -222 -220 -55 34 -1 76 193 134 -52 102 93 177 -68 61 309 -14 -25 244 254 206 166 -48 117
4043 117 38 17 98 -204 -331 -328 -55 12 -270 -209 -95 -5 -28 35 262 12 35 65 154 -98 -9 125 74 -1 -212
$$ packed form
3878B16K9k03M8N9m2k99M3K5J22L2j6N4k10P0M5J36l55Q3J41n1j13K13N2J10Q5
3903B74J4r5k76M86m46L30j91K0K11l86L42j39J6m6l52J83L74m67M1J56l4j88
3925a73k1O9n7K1J91j0J03l0k42J33K14K4l36O4j31K84J26P7l60kJ51k47J65J35
3949A48l1l32l6J64r8Q8j33j06K18J63k08L32k27j77L49j51Q0M7m6j40J17J00
3971A21K01k82J63n2Q1j28J2k53J74n2j62J7o9L97k57K71l00J2J74k03K6K7n4
3994a36P3p8O4o1K61P2ol36L04k06K88l81J96K14m2k05Nn3k88K94J52J6l17K07
4018C7j06k8j25KJ65Q9l5P7J17n9j86J54rQ4k45J29K48l23j1K69J0m8m0k14J65
4043A17p9k1Q1l02j27LK73O7k82O1J14R0k3O3K27k50K3L0Q9k52Q9J34n1p5k11
$$ plain form
4068 -212 -28 -189 382 -258 -154 -122 141 7 94 6 -251 -217 -254 -153 -156 149 -60 -401 111 -83 -184 21
4090 21 34 72 -102 58 -174 -195 12 -33 -114 137 -26 -27 372 166 16 78 96 62 23 169 181 238 45 165 223
4115 223 -151 -5 -1 -77 91 120 -5 81 -48 95 -8 -12 320 -41 -46 147 203 113 -115 71 28 60 4 -153 -186
4140 -186 36 -28 108 -74 -116 -169 216 -7 -236 71 -73 -477 -96 -237 -196 20 -66 -53 46 -175 -384 344
4162 344 259 73 239 0 -128 187 84 -170 97 286 -352 9 -141 39 -178 112 27 9 103 -176 27
4183 27 -224 -126 -307 -246 -135 -68 212 225 2 192 104 -150 160 159 64 99 10 129 201 60 -46 186 114 144 93
4208 93 -72 224 -102 119 -85 27 26 -31 119 -62 -2 84 -165 -362 89 121 148 11 -105 76 41 86 42 318
4232 318 -116 -10 259 -207 36 61 114 20 -57 -61 3 -116 -66 -74 -399 -316 -397 -35 -85 -60 -160 -79 126 168 33
$$ packed form
4068b12J84j61N71o40J04L2K63j34Q7q8k57L4l7J01lL05k09l41N12j94j01K05
4090B1J3L8j74J60k32k1K07m5q1K51j63jL99k06j50O2J8l4l9J46J2N7j93J20N8
4115B23l74J46Mp6J68K9j25Q6j29J43j03mL32l61nJ93N6r0k28J86m3L2n6j57l3
4140a86K22o4J36j82m2n3L85k23k29L07j44m04L81j41M1K16q6J3R9k21k09P28
4162C44q5j86J66k39j28L15j03k54K67J89o38L61j50J80k17K90q5j8R4k79K03
4183B7k51R8j81O1J11O7K80J3k23J90q8k54L10jr5L5q9J19P2j41j06K32p2L0n1
4208I3j65K96l26K21k04J12jn7J50j81O0Q6k49j97M51L2K7j37j16J81l5M5m4K76
4232C18m34J06K69m66K43K5N3r4p7mO4j19N0ql25Q3q1L62n0K5j00Q1K05M2j35
$$ plain form
4257 33 -182 122 115 224 -65 -300 293 136 17 168 78 51 55 51 259 -108 25 -64 82 102 73 -123 -395 35
4281 35 -15 -219 156 85 8 140 -43 -69 -166 -38 74 -14 196 -143 148 201 198 190 220 132 194 144 77 -140 93 -105
4307 -105 -142 112 -93 -357 -17 -221 -220 54 24 -83 -136 -80 177 -31 131 -240 -245 -28 286 -24 305 204 98
4330 98 173 283 26 254 74 19 57 -242 221 167 178 -57 -86 -69 -349 -214 -90 144 195 96 35 -95 -109 -49
4354 -49 -23 -31 10 99 85 100 -109 316 290 42 68 171 -121 -28 -215 -121 -38 107 33 12 120 -15 -28 -31 -273 -363
4380 -363 -15 40 30 221 -99 -48 252 21 -18 63 -75 -19 -2 -69 144 18 293 86 -261 37 98 250 192
4403 192 -23 -55 -86 127 -41 -13 22 -7 -65 -129 -84 145 -42 -55 -149 -150 -162 265 137 124 131 182 -212 237 310 -117
4429 -117 -42 76 222 155 26 290 -410 -50 -159 104 -4 -351 -49 -161 -105 -94 -76 -159 -296 93 -208 -65
$$ packed form
4257C3k15L04pJ09k89k35N93j57j19J51r0k7MmK08l67J33q9J46K0k9j96k72M30
4281C5n0k04L75p1p7J32j83k6r7J28J12q8K10l39K91N3lqL0q8O2n0o7k17K33j98
4307a05l7K54k05k64L40k04JK74l0j07n3N6K57k08J62l71nK17L14l10L29j01j06
4330I8P5J10k57K28j80n5L8k99M63n4J1k35k9J7k80J35J24K34N1r9o1j30j4O0
4354d9K6qM1Q9j4J5k09M25k6k48K6J03k92R3j87R4Q3J45p4k1J08j35j3lk42r0
4380c63L48N5j0J91l20N1L00k31l9Q1j38N6J7o7K13j26K75k07l47K98O1J52n8
4403A92k15l2l1K13j68K8L5k9n8o4M5K29j87j3r4jj2M27j28j3PN1l94M49P3m27
4429a17P5J18J46o7j29K64p00L60j09K63j08l47L02j12N6J1J8q3j37L89l01J43
$$ plain form
4451 -65 -97 66 52 -224 104 -35 -150 84 -283 -24 -78 102 142 -156 293 118 -170 151 1 -290 -17 -54
4473 -54 166 -140 -73 -109 -248 -248 86 47 36 -27 155 139 -144 -153 150 42 161 157 110 174 144 8 162 220 51 1
4499 1 -67 43 79 -29 -244 -239 -300 -67 -118 -59 -32 33 -171 252 68 310 215 78 77 86 -232 -1 -48 107 146 221
4525 221 -60 -177 196 316 197 136 28 -81 -216 -27 32 -369 10 -217 -67 -275 -299 -258 -193 -126 -83 -53 158
4548 158 -54 72 66 99 169 105 94 6 108 62 26 287 -144 -49 203 -131 180 -106 28 -182 -131 -97 -258 11
4572 11 -236 -218 -89 -179 31 -124 -34 155 154 56 -58 265 -20 94 106 -158 359 -73 48 210 57 -305 -25
4595 -25 34 -25 -32 -322 -148 -133 -3 -59 -281 -83 -296 120 210 11 -154 46 1 110 139 -230 177 -71 152
4618 152 44 83 217 52 79 -111 -24 325 42 -251 -158 29 -52 -276 -170 -99 -110 -173 20 1 38 -120 37
$$ packed form
4451f5l2J63j4k76L28j39j15K34l67K59n4J80M0k98M49j75k88L21j50k91K73l7
4473e4K20l06O7l6j39%L34l9j1o3J82j6k83rL03j08J19mm7O4l0j36J54N8j69n0
4499Ao8J10L6j08k15No1K33n1N9K7O5k04M23j84K42r5j37jRl18K31m7J55L9P5
4525B21k81j17L73J20j19o1j08j09j35J89N9m01L79k27J50k08k4M1O5O7M3L0K11
4548A58k12J26oL3P0o4j1q8J02m6l6K61m31R5K52l34L11k86J34k10N1L4j61K69
4572A1k47J8J29r0K10j55R0J89jr8j14L23k85J14J2k64N17m32J21J62j53l62K80
4595b5N9n9pk90J74J5J30n6k22J98k13M16R0j99j65K00m5J09K9l69M07k48K23
4618A52j08L9J34j65K7j90Q7L49k83k93R3J87q1k24J06P1j1o3J93j9L7j58J57
$$ plain form
4641 37 -63 -70 49 -256 47 75 139 5 50 314 385 99 22 20 -160 72 21 -103 -15 2 86 -368 141 -132 -75
4666 -75 115 -214 -14 55 -115 -50 -38 22 173 -198 12 40 -2 177 239 -127 49 -92 272 100 162 45 107
4689 107 12 -30 0 -150 -13 22 -34 -4 -92 -200 -127 35 -213 -46 -245 76 7 -105 -229 -20 -39 178 59
4712 59 50 319 34 55 130 259 29 280 173 -74 115 -41 140 9 -112 134 -89 68 -77 -3 394 -164
4734 -164 -226 80 -50 -83 81 6 51 -182 -80 -98 24 60 33 186 61 73 -71 150 15 -175 -193 -6 14
4757 14 -17 -100 -187 -185 60 -134 -113 110 -130 -1 -96 -189 -178 -185 -83 105 -35 254 -257 214 -8 170 166 9 168
4782 168 -36 83 22 -25 142 27 -189 155 -26 -215 3 36 -112 -246 160 -328 -336 -179 196 -207 -108 42
4804 42 21 19 190 -10 -200 91 -286 -16 -46 24 6 177 317 239 -341 -104 -11 -27 -142 -222 -154 111 205 -77
$$ packed form
4641C7j00pJ19l05L03K8O4j34M5K64P1k86p7kj80K32n1j24Q8J7Q4m54N09k73N7
4666g5J90l29K00O9j70O5J2O0J51l71K10K8m2J79O2l66J76j41L64j72O2j17O2
4689A07r5m2L0j50J37L5n6L0q8j08P3J62k48J67j99L21o9j12j24K09j9K17j19
4712E9rK69k85K1P5J29k30K51j07k47J89j56J81j31j21K46k23J57j45P4L97n58
4734a64o2L06j30l3J64p5M5k33J02j8J22L6k7J53j25J2j44K21j35j90j8J87K0
4757A4l1q3q7KK45j94K1K23k40J29r5r3J1pJ02J88j40K89n11M71k22J78mj57J59
4782A68k04J19o1m7J67j15k16L44j81j89K18L3j48j34M06m88qJ57L75m03R9J50
4804D2k1kJ71k00j90K91l77K70l0P0j8J71J40p8n80K37R3j6j15q0O8K65R4k82
$$ plain form
4828 -77 -58 -123 31 262 -183 -110 95 -41 -42 -166 162 66 56 28 464 47 119 -113 72 19 92 -230 19 18 -10
4853 -10 219 -29 -49 51 6 -213 -154 97 -108 -31 168 -306 -83 -178 -115 -98 -97 -49 119 -155 118 86 -13 -156
4877 -156 -122 1 74 154 -352 32 -304 38 6 -56 -144 -6 -350 -66 7 76 -128 -187 6 -6 -425 217 -157
4900 -157 -37 19 -126 248 -100 52 -11 50 232 47 31 285 182 88 -18 -190 -71 116 78 288 -63 -107
4922 -107 -255 -77 -245 57 28 -25 -116 97 142 -155 3 -47 -157 -24 81 -29 -80 64 -78 -53 -115 178 82
4945 82 -8 134 76 -114 -188 164 -127 211 16 -207 -233 -147 -61 -35 -65 22 -332 -143 -16 -258 -17 238 14
4968 14 -2 260 28 -23 139 126 82 -80 200 -32 16 347 -210 85 -335 106 104 283 -353 161 96 6 54 -53
4992 -53 15 57 -248 184 -42 97 -181 -148 305 92 -43 28 -66 51 -64 86 40 49 127 -6 58 -10 351 -245
$$ packed form
4828g7J9o5J54K31m45P3K05j36jj24L28r6j0k8M36m17P2k32J85n3P3l22K49jk8
4853a0K29k48k0J00m5k19N9K51k05P7J99m74K23r5O3J7JM8J68k74K73l2r9j43
4877a56L4J23P3Q0n06L84l36L42l2o2q8J38l44K84P3O9k04n9J93j2m19O42l74
4900a57J20N6j45L74l48J52o3O1J82j85j6K54j03r4j06j72J19J87l8K10l51m4
4922a07j48J78j68L02k9n3r1K13M5k97J58n0j10J33J05j10n1J44j42K5o2K93r6
4945H2r0J42n8j90p4L52k91L38j95k23k6Q6Q6K6l0Q7l54J89J27k42K41K55k24
4968A4j6K62k32n1J62j3m4j62K80k32M8L31n57K95m20M41kJ79o36N14o5r0M8j07
4992e3O8M2l05M32k26J39k78L3M53k13j35P1r4J17j15J50m6RP8j33O4o8L61n96
$$ plain form
5016 -245 -203 -75 -147 12 -57 -62 -27 -226 -133 -253 -7 -79 139 116 -152 -76 -99 -17 -56 -103 -188 135 66 237 -10
5041 -10 135 131 -207 28 122 9 -41 -25 46 113 41 83 -95 -255 82 -70 -163 99 -59 -43 -165 -105 64 -114
5065 -114 180 -88 184 149 242 -2 -106 21 9 259 273 -3 -19 -162 -180 -34 -35 -75 222 -200 -219 21 83 73
5089 73 -288 -196 -109 -251 -14 -30 39 113 -272 -2 -83 -20 158 8 15 117 45 28 132 133 99 -279 -198 -124 -33 205
5115 205 -191 -186 374 -86 25 -114 -36 -136 -245 77 46 -95 -15 -45 -1 140 -22 3 136 105 73 27 89 32
5139 32 129 58 -8 -155 128 -52 -167 97 -74 -137 44 -357 -261 -169 102 -137 -84 234 -166 -22 86 47 15
5162 15 100 36 58 27 58 41 100 143 163 -156 36 67 -98 27 -144 -13 35 -26 -14 -94 -11 -116 -120 -109 162 -159
5188 -159 209 12 -217 122 -193 139 89 -67 -96 119 -92 43 13 -10 -112 -27 78 106 36 -2 -147 -77 -251
$$ packed form
5016b45M2J28p2J59o9nL5j99R3j20K46p2K18k3k68P6k3Q2l9m7q5L23o9J71k47
5041a0J45ml38K35R4j13n0J6P1O7p2M2j78j60L37j52r3K62j58J6j22O0J69j78
5065a14K94k68K72l5R3k44j04J27j2K50J4k76j6j43j8J46jm0K97m22j9K40O2j0
5089G3l61R2Q7j42K37j6O9P4l85K70q1O3J78j50PJ02p2j7J04Jl4l78Q1P4R1K38
5115B05l96NN60m60J11j39P8j00j09L22l1j41Q0l0M4J41j62K5J33l1l2m6O2n7
5139C2R7p1o6j47K83j80j15K64j71o3J81m01R6R2K71k39N3L18m00J44J08l9l2
5162A5Q5o4K2l1L1j7N9M3K0l19J92L1j65J25j71J31M8o1J2q0Q3j05mJ1K71l21
5188a59L68j97k29L39l15L32n0j56k9K15k11J35l0k3j02Q5J05K8p0l8j45P0j74
$$ plain form
5211 -251 -25 174 73 -255 193 -185 33 217 8 -95 -201 -30 -206 126 -62 36 -107 133 76 -58 27
5232 27 190 -44 238 265 -130 62 -146 129 146 -10 147 -84 -161 100 -93 89 39 -155 -315 -114 -20 196
5254 196 31 -69 31 98 -88 2 180 2 -152 215 156 126 -282 174 -351 -244 122 -14 89 -163 40
5275 40 10 65 -138 -167 81 135 -74 -171 -12 -194 9 90 -159 -173 -141 69 -41 1 -49 156 3 -94 212 69
5299 69 85 3 -55 -67 150 -86 -117 -24 -151 -184 -65 83 -7 -322 -90 144 -348 -199 -40 153 79 -15 -127 -58
5323 -58 109 -23 -124 29 94 37 56 -59 -139 82 21 118 132 -8 -54 41 -310 -21 36 -220 -4 -251 -179 67
5347 67 3 31 25 -118 -145 -9 303 -3 146 93 -26 -71 18 52 15 224 241 -249 70 -107 53 130 329 -105
5371 -105 -144 -118 -73 81 96 -35 14 146 -228 -83 88 107 91 106 -66 117 181 178 159 -29 -28 98 116 -14 278
$$ packed form
5211b51K26J99j01l28M48l78K18J84k09j03j06J71j76L32j88R8j43K40n7j34Q5
5232B7J63k34K82K7l95J92k08K75J7j56J57k31p7K61j93J82n0j94j60K01R4K16
5254A96j65j00J00O7j86R0J78j78j54L67n9l0m08M56n25J07L66j36J03k52K03
5275D0l0N5k03k9K48N4k09r7J59j82K03Q1k49j4L2K10j10M2n0K05j53r7L06j43
5299F9J6q2n8j2K17k36l1R3j27l3J19J48r0l15K32K34m92J49J59J93p4r4j12O9
5323e8J67j32j01J53O5n7J9j15q0K21o1R7J4j40m6R5l51K89N7k56K16k47P2K46
5347F7o4K8oj43k7J36L12l06J49n3j19m5Q9L4l7K09J7m90L19j77J60P7J99m34
5371a05l9K6M5J54J5j31M9J32l74J45J71J9j6J5j72J83O4lj9j88JJ26J8j30K92
$$ plain form
5396 278 298 13 123 -142 -23 158 185 -255 230 36 41 53 11 -81 126 -67 -128 84 -346 115 83 214 115
5419 115 43 -63 31 -291 201 176 90 -98 259 140 -42 -132 -177 -40 -202 105 71 -52 -30 74 -208 -69 178
5442 178 -155 -157 -181 112 166 -53 65 22 -165 -44 42 67 -48 109 180 180 26 245 -78 107 10 -188 88 -107
5466 -107 -277 -115 143 -93 16 -14 -181 -233 95 -333 -226 -269 -19 122 44 -47 -4 -91 -227 -133 226 -16 -8
5489 -8 38 21 181 115 -106 -90 100 -183 103 140 -78 -50 -59 -97 210 -257 -69 -39 -63 174 -83 -1 7 -97 -76 -27
5515 -27 -142 48 199 183 66 51 28 2 -29 122 45 74 116 -203 -99 200 19 -227 -88 9 -161 -131 213 -13
5539 -13 -8 90 -144 106 -318 -135 -288 88 4 13 -146 -161 210 135 -36 -54 268 230 53 -50 -144 36 10 31 239
5564 239 -161 -178 -77 334 25 -101 -389 -142 137 -280 32 -131 -19 72 -55 152 -287 196 -32 -56 -47 126
$$ packed form
5396B78K0k85J10k65J19J81K7m40M85j94NJ2m2r2K07j93o1K12m30M61l2J31r9
5419A15p2j06R4l22M92k5q6j88L57j19j82r0m5J37j62L07l4j23K2J04k82J39K47
5442A78l33kk4K93N4k19J18m3j87J21Q6K5j15J57P1%j54K19l23J85r7j98K76j95
5466a07j70J62K58k36J09l0j67n2L28m28J07m3K50J41p8r1M3q7j36R4L59k42Q
5489hM6j7J60o6k21J6J90k83K86L7k18K8rl8L07m67J88L0k4K37k57Q2Qj04K1M9
5515b7j15J90J51j6j17j5k3k6l1J51p7K9M2l19J04K99j81k46J39R7j70L0L44k26
5539a3NR8k34K50m24J83j53L76q4Rj59j5L71p5j71j8L22l8j77j03r4J80k6K1K08
5564B39m00j7J01M11l09j26k88K47K79m17L12j63J12R1j27K07m39M83k28k4RJ73
$$ plain form
5586 126 218 -11 135 -86 214 50 137 -36 -186 -154 -214 130 98 -179 -93 -383 148 -111 -3 82 67 123 -135
5609 -135 -40 144 -33 -5 51 -72 149 -10 164 -40 11 92 129 175 51 -25 85 218 213 -11 -267 -280 23 -41
5633 -41 -90 -25 -158 -44 -17 132 -82 -126 117 296 116 165 46 -64 -28 -21 -177 -186 36 104 145 40 14 223 -4
5658 -4 -185 128 -154 158 196 26 -64 86 -48 77 -79 -108 49 -125 177 -39 -75 -99 -123 140 80 143 -111
5681 -111 -60 138 -10 142 10 48 21 131 -65 157 13 -63 62 -26 188 -213 135 -395 -15 1 -327 114
5703 114 -101 -84 34 160 250 131 60 140 215 61 -201 208 20 -46 217 81 -72 -123 33 1 326 -48 27
5726 27 -25 -240 -145 164 -175 -175 -133 229 -43 99 84 -13 87 -49 235 250 38 93 -106 -74 235 99 -35 -101
5750 -101 41 149 -7 15 -171 -40 114 -196 -238 17 -117 -40 -242 -121 30 -14 -288 -70 -41 46 255 -190
$$ packed form
5586A26R2k29J46k21L00j64Q7j73j50L2o0L44l2k77Q6k90N31k59J08Q5j5N6k58
5609a35R5J84j77K8N6j23K21j59J74k04N1Q1L7M6j24p6J10J33nk24k56j3L03o4
5633d1m9O5j33J14K7J49k14m4K43J79j80M9j19j10L6Pj56rK22O8M1j05k6K09k27
5658dj81L13k82L12L8j70r0J50j34J25j56k9J57j74L02k16l6k4k4K63o0O3k54
5681a11N1J98j48J52j32L8k7J10j96K22j44p6J25q8K14m01L48n30L80J6l28M41
5703A14k15J7J18J26R0j19p1Q0P5j54k62M09j88o6K63j36j53n1J56l2L25l74P5
5726B7n2k15R5L09l39%M2L62k72J42j5r7J00j36K84J5k12N5j99L2L09j36j34o6
5750a01J42J08j56K2j86J31J54l10m2K55j34P7k02J21J51m4k74K18K9Q7K09m45
$$ plain form
5772 -190 -21 330 96 166 -315 106 64 92 83 -103 91 -55 28 254 -20 20 -253 -161 -66 -52 61 16 -89 106
5796 106 291 -48 -48 -32 125 163 -35 -123 225 -46 134 -32 125 -37 313 -52 222 135 -41 229 -54 -100
5818 -100 -31 -132 89 180 -199 -66 174 22 77 -121 63 86 -129 58 76 135 30 -5 -142 -53 -68 102 -44
5841 -44 89 -355 -175 105 -65 51 69 122 112 -107 28 -184 -54 -20 170 -6 105 141 -72 -170 151 -215
5863 -215 1 51 -165 -43 174 75 -324 58 26 -72 211 187 179 103 -54 184 -14 -32 302 67 -13 90 -105
5886 -105 82 1 154 -132 -187 107 101 41 -69 -149 -130 -143 115 -76 257 -193 -121 17 109 -87 -84 67 174 69
5910 69 -292 259 19 -147 255 -99 -43 10 -75 261 -202 186 -73 -179 33 -5 -184 -9 -201 -125 -57 89
5932 89 120 -286 -51 241 167 -144 -136 314 -9 29 245 -166 62 -109 14 145 221 -25 12 -287 -171 25 -104
$$ packed form
5772a90J69L51k34P0m81M21m2K8rj86J94j46Q3K26k74M0k73R2R5J4J13m5j05J95
5796A06J85l39%J6J57L8j98q8L48k71J80j66J57j62L50l65K74q7j76K70k83m6
5818a00O9j01K21R1l79J33K40j52N5j98J84K3k15J87J8N9j05l5j37Q9j5J70j46
5841d4J33m44J80K80j70J16J8N3j0k19J35k12J30L4J90j76J11L6k13r8L21l66
5863b15K16N0k16J22K17r9l99L82l2r8K83k4qp6j57K38j98j8L34k35q0J03j95
5886a05J87q1J53k86n5K94oo0j10q0J9j3K58j91L33m50P2J38R2j96LJ51J07j05
5910F9l61N51k40j66M02l54N6N3q5L36m63L88k59j06K12l8j79J75j92P6O8J46
5932H9L1m06K35K92p4l11QM50l23L8K16m11K28j71J23J31P6k46L7k99J16J96j29
$$ plain form
5955 -104 -23 -31 -15 -107 -149 -127 -80 120 -114 70 21 277 57 97 272 -45 62 -113 -94 205 -53 -220 2 177
5979 177 -2 0 -263 89 -129 -169 -56 86 -51 -273 3 -70 -180 209 -120 55 -148 3 -14 70 -391 138
6001 138 78 8 -42 84 -107 76 195 -148 -250 -35 -89 51 49 -140 221 10 40 67 -256 257 -135 15 297
6024 297 188 -82 -397 81 71 -14 -272 94 -98 219 -42 44 -16 317 -122 163 159 -216 -33 -12 -45 -151 163
6047 163 93 18 -34 29 -82 44 49 -49 -42 86 115 136 -59 -76 -33 -222 25 -186 218 114 121 -143 -31 -69 -107 -11
6073 -11 -10 47 32 192 41 130 250 -132 22 212 74 170 38 -94 128 -165 297 115 22 13 37 302 -85 -24
6097 -24 140 -221 -135 -214 25 -112 207 57 -110 28 210 32 239 198 237 -167 -117 -108 10 146 -84 143 -77
6120 -77 -41 -185 -48 20 -124 -108 146 -49 -199 116 -93 368 -170 23 -43 89 -48 -151 20 -85 224 69
$$ packed form
5955a04Q1qJ6r2m2K2M7K00k34J84m9K56k20M0J75l17J07j75J9K99k58j67K22J75
5979A77j79Kk63L52k18m0J13J42j37k22K76p3j10L89l29J75k03J51j7Q4m61N29
6001A38o0p0n0J26j91J83J19l43j02K15n4J40kj89L61k11L0K7l23N13l92J50K82
6024B97j09k70l15M78j0q5k58L66j92L17k61Q6o0L33m39K85ml75J83K1l3j06L14
6047A63p0p5n2O3j11J26Nr8PJ28K9K1j95j7M3j89K47k11M04j04Pk64J12l8l8R6
6073a1JN7j5J60j51Q9J20l82J54J90j38R6j32j32K22k93M62j82r3rK4K65l87O1
6097b4J64l61Q6p9K39j37L19j50j67J38J82j78K07m1L9m04N0RJ18J36k30K27k20
6120g7L6j44J37O8j44J6K54j95j50L15k09M61n38J93o6J32j37j03J71j05L09j55
$$ plain form
6142 69 -116 64 -173 174 64 25 91 -54 -1 -60 -317 -83 -66 -70 91 -70 5 15 95 -50 13 20 -93 -119 348
6167 348 183 -209 186 215 53 137 154 95 1 -88 45 5 -164 -140 238 -184 -76 -101 -90 271 85 74 168 164 154
6192 154 136 296 179 170 60 217 114 -173 -11 3 -131 -103 38 47 -123 156 186 166 -61 41 -46 -91 -145 -298
6216 -298 -19 -132 49 46 246 -174 -343 55 90 -335 66 68 258 -89 130 -93 -183 10 184 2 -35 107
6238 107 132 152 66 -177 186 -133 -30 99 -131 22 -92 -225 -236 -106 -209 67 201 -158 -11 44 -63 -41
6260 -41 38 18 -165 -50 88 -184 -126 -221 86 300 73 130 -226 57 248 26 -192 -76 -278 53 46 -42 103
6283 103 -85 -110 92 -171 -268 -91 -32 -251 135 -158 -8 44 42 -38 26 228 -182 7 48 -27 218 -268 41
6306 41 -100 1 30 30 -212 -207 -126 -1 -20 64 25 109 91 -18 -70 -102 -198 -200 13 32 42 15 138 142 78 -214 10 -49
$$ packed form
6142F9j85J80k37L47j10l9O6j45N3n9k57K34J7mJ61j61P5J0Q0j45O3Pj13k6M67
6167C48j65l92L95K9j62Q4J7n9r4q9J33m0j69K4L78m22J08k5J1L61j86j1R4mj0
6192A54j8J60j17rj10J57j03k87J62J4j34K8J41Rj70K79L0k0k27J02q7m5n4j53
6216b98K79j13J81lK00m20j69L98L5m25M01KJ90l47K19k23r0J93J74j82l7J42
6238A07K5K0q6k43L63l19J03J29k30J53j14j33j1J30j03K76J34l59J47N5j07K2
6260d1P9k0j83J15J38k72N8r5L07K14k27N7l56K83J91k22k18J16k02L31pq8J45
6283A03j88k5K02k63r7J77N9k19L86k93J50N2kq0O4K02m10J89M1p5K45m86L09
6306D1j41J01K9%k42NQ1J25j9Q4l9Q4j8j09n2l2r6kK13J9J0k7J23Mo4k92K24n9
$$ plain form
6334 -49 -2 23 -190 32 3 -52 181 -138 127 -98 -58 46 10 -88 -20 45 -76 -131 132 69 -110 -36 44 114 -12
6359 -12 -40 149 36 -77 265 145 -126 -192 232 -229 136 -186 -109 -141 272 -57 76 77 181 -185 66 -60
6381 -60 29 32 21 4 382 153 7 -132 -187 238 317 5 -36 -72 -123 -56 36 -11 -179 68 -436 62 49 -235 41
6406 41 144 -67 -36 -297 -219 140 -271 -15 -115 -59 -52 -213 -120 140 188 174 1 34 252 123 104 11 -99 101
6430 101 25 227 -20 85 -341 182 54 -245 -128 179 -1 99 -70 -34 239 21 -5 50 -123 248 -191
6451 -191 26 105 140 115 80 -19 105 136 -228 99 -55 -101 -88 192 262 67 -124 -51 -110 -125 34 -298 -25 -77
6475 -77 160 -255 -118 404 51 66 82 -26 -141 190 -108 25 -25 75 116 166 79 -132 -41 -21 -56 -18 -22 -24 6
6500 6 -231 -228 -205 -200 -9 42 54 79 80 16 -31 -72 62 -144 13 92 -18 -50 1 -40 -37 -23 54 58 244 137 197 2 17
$$ packed form
6334d9M7K5k13K22k9n5K33l19K65k25M0J04l6r8O8O5j21n5K63o3j79P4Q0P0j26
6359a2k8J89j13j13L42j20k71o6M24m61L65l22P7l2M13l29J33JJ04l66K51j26
6381f0Q9Lj1j7L78k29j46j39n5M25P9l12m1l6n1O7R2m7j68K47n04M98j3k84K76
6406D1J03k11L1k61P8L59m11K56j00N6Pj61R3K60M8j4j73L3K18j29j9r3j10K00
6430A01p6K02k47J05m26N23j28k99J17L07j80J00j69L6K73k18k6N5j73L71m39
6451a91K17P9L5k5l5r9J24L1l64L27j54m6J3K80P0j95j91P3n9j5J59l32K73n2
6475g7K37m15J37N22l53J5J6j08j15L31k98J33n0J00M1N0q7k11R1K0l5L8mkL0
6500Fk37LK3NJ91N1J2K5Jo4m7m1J34k06J57P9j10l2N1m1LJ4P7MJ86j07O0j95J5
$$ plain form
6529 17 -164 -11 -135 224 -42 -498 -299 -44 -1 -80 -17 347 -76 238 20 -137 199 139 65 101 151 193 98
6552 98 51 192 106 -113 -210 206 93 -35 -21 -152 -110 58 -241 383 -69 -24 9 4 -250 11 258 -44 -36 -71
6576 -71 3 -90 -88 109 101 -1 127 53 -22 -117 -197 49 181 -94 25 177 48 -2 -9 61 33 113 -331 -185 53 27
6602 27 -187 -69 54 19 -208 -282 -99 17 43 166 -44 22 69 -20 -87 43 -109 -134 22 63 55 -144 237 -86
6626 -86 8 -127 15 -79 124 -91 -14 -220 0 104 74 146 -69 177 173 -143 -52 95 368 37 88 134 -110 203
6650 203 20 255 65 -54 130 83 -153 38 7 -148 -136 -246 -73 -123 55 51 412 -14 39 12 73 16 5 -69
6674 -69 -103 289 192 103 220 58 -12 -82 107 221 36 -40 -84 -56 -12 -36 -274 51 -156 16 -6 103 3 42
6698 42 35 104 -178 -6 68 -125 77 0 -148 170 51 231 253 -234 81 67 -109 69 -85 73 192 -114 -185
$$ packed form
6529A7j81J53j24L59k66m56J99K55M3p9O3L64m23L14k18j57L36o0p4L6N0M2r5
6552I8m7J41q6k19r7M16j13j28J4j31M2J68k99O24m52M5L3nk54K61K47l02Ql5
6576g1P4r3KJ97qj02J28p4p5r5q0K46J32k75J19J52j29n0pP0k8Q0m44J46K38k6
6602B7k14J18J23l5k27p4J83J16K6J23k10O6M7q9o7J30j52k5J56M1qj99L81l23
6626h6R4j35J42r4K03k15P7k06K20J04l0P2k15K46ml16R1J47K73l31N1M6k44L13
6650B03j83K35j90j19J84m7k36J91l1j55J2j10J73n0J78mL61m26N3k7O1n7j1p4
6674f9l4L92r7q9J17j62p0p0J89J14j85p6m4K8M4k4k38L25k07J72k2J09j00L9
6698D2pO9k82J72P4j93K02p7j48L18j19J80K2m87L15j4j76J78j54J58J19l06p1
$$ plain form
6721 -185 3 36 -185 -13 59 229 -237 -186 106 -78 142 115 -31 -124 18 108 -22 65 177 116 -99 -164 51
6744 51 -84 272 -126 -92 57 31 -61 -204 -39 -43 88 -160 29 135 211 -13 85 103 -171 409 -428 -66 -69 -16
6768 -16 68 -243 -109 -208 106 -97 64 56 -40 240 222 -109 246 -165 140 -162 -36 53 -204 93 -85 57 -59
6791 -59 -51 66 239 79 -105 -25 -113 -169 102 -179 -249 -303 33 24 65 -196 135 -32 -122 251 151 -57 292 150
6815 150 -104 123 78 -57 -92 -232 116 -40 173 22 41 110 40 77 -198 -31 -60 -83 28 -30 58 -33 57 -24
6839 -24 -92 0 -6 421 17 108 106 190 -15 0 62 -143 60 -160 -349 31 222 -115 41 -57 61 238 -25 72
6863 72 118 16 -26 -72 -199 -88 -25 38 -3 -156 -36 117 -67 -105 334 0 19 68 -63 18 -300 83 103 167
6887 167 133 -67 -6 -10 208 -105 -27 89 -179 -199 24 89 -148 64 -200 187 -43 -40 -24 79 -103 -26 67 2
$$ packed form
6721a85J88L3k21J72P2J70m66N1K92j84K20k7j46r3J42R0j30Q7J12o1k15o5K15
6744E1j35L56l98L4J49k6r2j43J65mJ31k48J89J06P6k24R8J8k74N80q37L62lN3
6768a6Q4l11J34r9L14k03J61qr6K80j8l31L55m11L05l02J26Q9k57K97j78J42j16
6791e9QJ17J73j60j84Q0q8n6K71k81p0n4L36rM1k61L31j67r0L73j00k08L49j42
6815A50k54K27m5j35l5j40L48j56K13j51J9O9p0L7k75J67k9k3J11n8Q8r1R0q1
6839b4o8R2oM27m04R1kQ4k05J5O2k05K03k20j89L80J91l37J56r8J18J77k63R7
6863G2M6j02m2m6j27J11O3O3m1j53J20J53j84l8M39l34J9M9j31Q1l18L83K0O4
6887A67l4k00O1mK18l13P8J16k68k0K23O5k37K12k64L87k30LJ6J03j82P7R3o5
$$ plain form
6911 2 309 257 15 213 44 -53 -158 98 -79 0 34 -191 -110 -4 -92 -22 -108 -35 -1 -244 -239 38 24 -366 52
6936 52 -115 -39 3 130 67 154 -191 -18 -8 31 2 -89 117 103 343 -266 41 136 -59 138 -96 -348 -30 91
6960 91 20 -65 -11 192 -15 79 -18 -73 -66 155 24 -56 -100 -115 -29 177 -145 -252 -138 57 153 58 203 114 -48
6985 -48 -479 44 -34 -230 -72 127 -15 78 74 209 -90 140 60 67 152 167 161 99 63 -33 22 -91 31 70 141 106
7011 106 -77 -55 245 122 -161 -225 92 10 -122 41 -230 -37 108 19 -19 -69 75 4 13 -147 151 165 108 -89
7035 -89 52 77 -10 -28 -66 97 2 -118 -152 -22 -231 118 90 -254 -131 -175 -93 35 -99 28 90 53 -11 59 5
7060 5 136 85 75 -154 191 173 -76 87 105 -202 132 24 -269 34 123 313 70 -28 15 -274 -354 -32 125
7083 125 -76 -229 12 -231 -176 -79 -29 -57 -60 61 142 261 -6 -47 3 158 -98 38 -67 102 -74 -103 -88 -336
$$ packed form
6911BL07n2k42J98j69r7j05K56j77P9L4k25Q1J06q8P0q6P3L4k43NK77j4l90M18
6936E2j67P6M2J27o3Q7l45J73J0L9k9r1K06j4K40o09L07R5j95J97k34k52L18J21
6960I1p1q5N4K03k07R4r7n5PK21j31q0m4j5Q6K06l22j07J14J95R6r5J45q9j62
6985d8m31N23p8j96J58J99j42R3mJ35k99K30q0PQ5J5oo2l6r6N5j13J22L9P1l5
7011A06j83K2L00j23k83o4L17q2j32J63k71J93J45q9l8n0J44p1Rj60K98J4n7j97
7035h9J41K5q7j8l8J63r5j20l4J30k09L49k8l44J23m4Q2J28j34J27O2l7o4P0n4
7060EJ31n1j0k29L45j8k49J63J8l07L34j08k93L03Q9J90k43r8M3k89q0L22J57
7083A25k01j53K41k43N5R7N0k8lJ21Q1J19k67m1N0J55k56J36j05J69j76k9J5k48
$$ plain form
7107 -336 256 -57 -102 32 -110 -278 152 -41 -146 67 -151 67 37 -119 85 14 -89 -386 191 13 29
7128 29 110 -145 -163 -19 160 129 28 159 51 64 -118 -48 44 61 5 -276 93 111 -143 -169 -137 36 -351 -9
7152 -9 78 -167 108 61 63 -154 52 112 229 34 37 -64 -165 48 41 -142 106 -73 201 -33 126 47 54 -191 57
7177 57 92 110 24 -141 -22 -91 -200 44 -55 -103 52 183 -61 -104 21 99 12 110 81 66 37 80 -47 -29 -61 -84
7203 -84 5 -65 24 -58 95 -134 -96 0 -155 -122 37 87 -140 -95 126 84 -29 107 -11 451 197 302 -95 136
7227 136 -74 203 -82 34 199 -70 -109 -86 39 -233 111 89 -144 -78 -8 -177 289 -139 -38 -16 -137 -75
7249 -75 64 -179 -152 -27 187 109 35 155 114 -117 41 117 32 7 158 118 298 221 -281 132 24 58 138 -32
7273 -32 -56 -26 -62 -100 -250 85 67 285 39 -223 7 -20 -26 -149 248 252 -282 -423 -30 -170 208 -95 -192 -92
$$ packed form
7107c36N92l13m5J34j42j68M30j93j05K13k18K18l0j56K04p1j03k97N77j78J6
7128B9Q1k55j8J44J79l1j01J31j08J3j82P0R2J7n6k81L69J8k54k6L2J73l87L42
7152iQ7k45K75m7Kk17K06O0J17j95Lj01j01K13pj83K48j79K74k34J59p9Pk45K48
7177E7L5J8q6j65J19o9j09K44r9m8J55J31k44m3J25P8q7R8k9j5k9M3j27J8l2k3
7203h4Q9p0Q9q2J53k29L8R6j55L3J59N0k27M5K21m2j13J36j18M62k54J05l97K31
7227A36k10K77k85J16J65k69l9K3J25k72L44k2k33O6P0j69M66m28J01K2j21O2
7249g5J39k43K7J25K14p8p4J20m1k31J58P6q5k5J51m0J80p7n02M13j08L4Q0j70
7273c2k4L0l6l8j50L35j8K18k46k62K30k7oj23L97Mn34j41L93j40L78l03r7J00
$$ plain form
7297 -92 125 47 -130 177 -136 -152 -118 -33 -14 -34 -304 -137 -74 -74 100 -32 176 -26 -87 -55 56 13 122 247
7321 247 13 94 103 20 -172 35 -142 258 -127 -120 147 97 179 -267 -31 18 -71 130 -36 199 -32 123 87 251
7345 251 49 22 -2 -252 179 -50 318 -279 -64 2 53 121 -111 -52 -71 -234 232 157 84 2 -117 64 -126
7368 -126 1 92 38 30 -202 -30 -55 127 -157 33 -36 110 126 -111 191 -93 104 141 63 52 90 -28 -59 -191
7392 -191 -33 152 -82 -152 -181 -22 -62 -126 -176 -180 203 206 108 -51 -256 -27 192 127 -135 124 93 -131 -220 -120
7416 -120 -193 -34 166 334 46 45 -148 -8 99 259 -66 -117 -288 145 -143 105 -258 -159 227 -179 31 -95
7438 -95 -145 -133 -174 15 -225 24 26 -60 -120 40 -173 45 -96 -91 270 10 -154 -4 54 -270 42 -48 44 45 93
7463 93 -37 65 109 -155 -185 -110 -22 -234 -5 -76 -109 -78 33 147 309 100 137 -24 -48 183 25 39 199 156
$$ packed form
7297i2K17p8j77L07l13j6L4Q5J9k0k70J67O3%J74j32K08k02o1L2J11m3J09J25
7321B47k34Q1Rq3j92K07j77M00l85PK67n0Q2m46K36M9q9K01j66K35k31J55l6J64
7345B51k02k7k4k50M31k29L68n97K15O6N1O8k32N9j9j63M66p5p3q2j19J81j90
7368a26J27R1n4qk32J72k5J82k84J90o9J46J6k37L02k84J97L7p8j1L8j18l1j32
7392a91J58J85k34p0k9J59m0o4n0mL83Lr8j59k05K29K19o5k62K59l1k24q9J00
7416a20p3J59K00J68k88jj93J40J07J60l25n1j71M33k88K48l63R9L86m06K10j26
7438i5n0J2m1J89k40K49Kq6o0J60k13K18j41NL61k60j64J50N8l24L12r0R2JM8
7463I3j30J02M4k64l0P5Q8k12K29p1l3L1J11J14J62k09L7j61k4K31j58J4J60m3
$$ plain form
7487 156 163 -168 10 -162 36 -232 -318 15 30 208 -28 -107 -93 -152 -66 -63 -233 284 6 48 54 147 22 8 -75
7512 -75 -74 138 -262 -150 173 220 25 196 76 -76 94 302 -123 66 174 -85 -130 101 105 274 340 -146 -80
7535 -80 93 23 274 0 19 245 301 333 155 -82 154 -81 -10 328 105 -50 65 -118 74 -25 -164 79
7557 79 2 -103 201 -172 149 -17 -359 66 157 -80 177 -105 66 -3 -115 85 -283 -125 96 -31 240
7578 240 77 -79 107 -51 16 -112 31 27 -6 -57 26 129 27 -8 122 -95 -167 278 100 151 -90 179 -77
7601 -77 -200 75 237 -244 -17 2 75 91 -161 84 -27 268 93 -60 104 -16 177 184 326 -405 50 -183
7623 -183 78 118 -181 116 -167 -40 259 156 35 98 -58 -196 213 77 144 -39 -83 70 -183 148 20
7644 20 148 -15 184 -17 31 -36 -89 40 117 -58 -141 -69 -43 -116 -295 37 15 -32 82 -79 -252 76 59 43
$$ packed form
7487A56Pl31J78j72J98k68q6L33J5J78k36p9J4n9Q6Lj70N17k78M2OR3j25j4q3
7512g5JK12m00J12L23M7j95J71j20j52J70K08m25J89J08k59m5K31MJ69O6m86O6
7535h0J73p0K51k74J9K26N6L2j78k37K36k35P1L38k23j55J15j83J92r9j39K43
7557G9p7j05L04l73L21j66l42M25R1k37K57k82J71o9j12K00l68J58K21j27K71
7578B40j63j56J86j58O7j28J43ml3n1Q3J03j02l5J30k17p2M45j78N1k41K69k56
7601g7j23K75J62m81K27J9P3J6k52K45j11K95j75j53J64j20J93PJ42p31M55k33
7623a83K61M0k99K97k83J27K99j03j21O3j56j38M09j36O7j83m4J53k53L31j28
7644B0J28j63J99k01M8o7n3J29P7j75q3P2K6p3j79L32k2m7J14j61j73L28j7j6
$$ plain form
7668 43 152 50 -154 163 -102 65 -94 -28 39 -81 1 161 -50 116 53 238 -85 -103 -113 -185 -146 -1 -91
7691 -91 -18 -37 -167 11 28 -67 18 117 -252 -304 24 63 -394 136 65 95 -20 -227 -144 29 60 117 44 107 228
7716 228 22 189 126 20 -60 24 -45 -164 -121 164 92 194 44 39 -89 -92 20 57 294 -28 246 81 -30 -40
7740 -40 -33 129 -3 108 -93 169 -42 201 53 -7 248 131 -42 -88 358 -61 -50 -87 -44 -104 -110 4 -72 -87
7764 -87 186 -123 -52 -56 80 149 -1 249 -1 4 -43 44 69 180 109 3 -34 -118 33 19 -191 188 58 -264 161
7789 161 -160 46 28 89 -259 -107 54 139 310 -165 -10 205 85 -124 75 -33 -154 -193 75 10 -45 0
7811 0 -128 -217 -59 -35 151 80 15 547 -32 -179 -229 -5 -29 -54 -97 250 -37 -110 96 96 35 -291 241 -235 -105
7836 -105 80 31 186 139 -99 101 55 -72 -26 -180 4 -48 -203 101 -9 75 -259 60 -140 -131 43 29 -87
$$ packed form
7668D3J09j02k04L17k65J67j59O6O7j20Q2J60k11J66o3J85l23j8j0p2L9J45r0
7691i1P3j9j30J78J7r5Q5R9l69n2L28L9m57N30p1L0j15k07Q3J73L1N7p3O3J21
7716B28k06J67o3j06q0Q4o9j19M3K85p2J02j50nj28lJ12L7K37l22K74j65j11j0
7740d0PJ62j32J11k01K62k11K43j48o0K55j17j73m6M46m19J1l7M3o0oJ14p6j5
7764h7K73l09P1mJ36O9j50K50k50Nm7Q7K5J11p1j06l7q4J51j4k10L79j30l22M25
7789A61l21K06j8O1l48J52J61Q5J71m75J55K15j20k09J99j08j21l9K68o5n5M5
7811@j28q9J58K4J86p1o5N32n79j47n0K24k4k5m3L47k87p3K06%o1l26N32m76J30
7836a05J85m9J55m7k38K00m6j27M6j54J84n2j55L04j10Q4l34L19k00RJ74j4j16
$$ plain form
7859 -87 -232 48 48 -106 -11 92 -85 -133 45 16 -40 -15 -9 -135 128 76 -6 73 -130 -251 -348 17 292 -55 29
7884 29 289 -100 -165 -67 64 -51 35 -160 99 -116 -54 49 -31 64 208 -140 -174 102 143 1 55 70 364 -13
7908 -13 -212 155 -168 26 80 -41 -43 22 -139 -74 -223 75 -28 -116 35 -153 28 84 -43 -85 -171 -25 29 -111
7932 -111 -196 150 85 183 64 78 -99 -219 -231 162 -128 73 37 -29 -101 -96 24 -166 -285 26 163 -92 38
7955 38 55 119 137 -75 57 159 6 91 80 94 58 -101 -43 -157 227 -19 -42 -64 65 196 83 179 272 -108
7979 -108 146 -91 -133 -27 -78 -129 -130 36 -47 -50 -128 3 4 -107 -65 -62 -129 105 -126 177 315 74 -51 -102 12
8004 12 66 -224 37 -171 409 74 -72 -152 -209 -182 -39 35 17 36 131 84 33 -43 97 -175 -78 -107 -55 -105 94
8029 94 73 -79 -172 -140 121 -119 98 206 -2 228 103 -182 168 47 150 -330 4 -30 211 58 124 14
$$ packed form
7859h7j45K80%j54R5J03j77m8J78k9n6K5Oj26K63n2q2P9k03j21r7L65K75l47Q4
7884B9K60l89o5R8J31j15Q6j95K59k15O2J03q0R5J44l48l4K76M1j42N4J5K94l77
7908a3j99L67l23J94N4j21kO5j61O5j49K98j03q8J51j88J81N6j27m2q6J46N4j40
7932a11q5L46o5R8j19J4j77j20j2L93k90K01l6o6p2NJ20j90j19L11J37k55J30
7955C8J7O4J8k12J32J02j53Q5j1J4l6j59N8j14L84k46k3k2J29J31j13R6R3l80
7979a08K54k37m2J06n1n1jJ66q3lp8J31Jj11M2Lo7K34k31L03J38k41j25n1J14
8004A2N4k90K61k08N80l35j46q0n7K7J43P4j8J9R5m7n1p6J40k72R7k9N2n0J99
8029I4k1j52r3L2K61k40K17J08k08K30j25k85L50j21J03m80L34l4K41j53O6j10
$$ plain form
8051 14 56 -153 -131 119 134 110 -34 44 -268 101 127 27 -180 -121 46 -140 96 -51 -232 -67 -186 -60 43
8074 43 197 40 -29 -86 -53 3 26 -78 -7 204 16 -314 -84 -35 42 -20 -159 110 -25 138 -204 117 -89
8097 -89 80 -56 -7 205 30 234 57 -16 71 59 182 149 -370 116 -120 -144 168 75 56 -168 -151 -26 -150
8120 -150 204 -31 -142 -120 -101 -291 -22 202 -176 43 198 -135 -127 -107 -19 52 -82 55 -20 -122 -131 58 39 12
8144 12 -204 -253 -106 177 44 -48 45 10 -79 -87 69 -4 -29 177 -46 327 137 -40 -121 -86 -61 -52 -71 -7 -65 49
8170 49 -109 9 -123 43 -35 -183 86 50 265 123 5 -51 -224 -89 -294 169 -62 22 105 71 108
$$ packed form
8051A4M2k09K2K50J5k4j44P8l12L69K6j00k07N9J67j86K36j47j81J65j19J26J03
8074D3J54j57o9n7L3N6K3j04P1K11j88l30K30M9P7o2j39K69j35J63l42L21k06
8097h9J69j36M9K12j75K04j77p3Q7j2J23l3n19M86k36k4L12r3j9k24J7J25j24
8120a50L54k35j11K2J9j90K69K24l78K19J55l33QK0Q8P1j34J37p5j02rJ89j9k7
8144A2k16m9J47K83j33r2R3l5q9qJ56p3k5K06k23L73j90j77q1L5K5Rj9O4n8J14
8170D9j58J18j32J66p8j48K69l6K15j42j18n6j73J35k05M63k31Q4Q3l4L7
8191A08
$$ Imaginary data points
##PAGE= N=2
##DATA TABLE= (X++(I..I)), XYDATA
$$ plain form
0 0 0 0 0 0 0 0 0 0 0 0 0 0 8 -8 8 -8 8 -16 16 -16 24 -24 32 -39 41 -48 56 -68 77 -87 101 -113 127 -144 165
35 165 -182 205 -230 256 -285 317 -353 389 -430 475 -525 579 -638 702 -771 851 -939 1035
53 1035 -1145 1266 -1405 1565 -1751 1969 -2230 2547 -2948 3462 -4159 5145 -6646 9202 -14325
68 -14325 28437 -144817 -422641 99474 220254 -127519 -87496 93531 -51143 -6228 170152
79 170152 -4955 -132575 115216 137493 -101963 -65978 86530 27614 -8949 -10155 -89880
90 -89880 -19737 128337 -10025 -165945 -17230 76329 -44830 -36542 24616 -62380 -39020
101 -39020 91397 16457 -63836 57094 69116 -44945 25590 102342 -18543 -39920 71421
112 71421 6812 -81450 15487 42279 -55336 -40426 4354 -26927 4084 37333 -35819 -39619
$$ packed form
0@%%%%%%%%%%%%Qj6J6j6J6k4L2l2M0m8N6p1Q0q9J04j24J45j64J88k14K40k71L09
35A65l47L87m35M86n41O02o70P42q19R05j000J104j217J340j473J622j790J974
53A035k180K411k671K970l316L720m199M777n495O410p621R304j1791J5848k3527
68a4325M2762j73254k77824N22115J20780l47773M0023J81027j44674M4915J76380
79A70152j75107j27620K47791K2277k39456L5985J52508n8916l6563j206p9725
90h9880P0143J48074j38362j55920J48715R3559j21159Q288O1158q6996K3360
101c9020J30417p4940q0293J20930J2022j14061P0535P6752j20885k1377J11341
112G1421o4609q8262R6937K6792r7615J4910M4780l1281L1011L3249p3152l800
$$ plain form
124 -39619 41061 14460 -21275 31367 -9004 -67664 46065 75077 -81357 -55188 100885
135 100885 21441 -87229 33950 78993 -46295 -27421 59313 -14202 -43202 46587 5532
146 5532 -75827 1189 44023 -28491 -19272 27889 -11687 -8945 46697 8389 -27974 28897 19917
159 19917 -37918 8259 33598 -40609 -33868 28995 -5970 -30759 19227 1549 -37585 21913
171 21913 39793 -31136 -10389 46053 -12102 -37048 34633 21181 -39177 -631 26594 -19643
183 -19643 -4432 38294 -4673 -25316 26893 18380 -20240 8860 11898 -29872 -6038 18955
195 18955 -24751 -26141 16082 -8680 -30678 18319 18124 -30970 -144 36338 -7567 -13352 29667
208 29667 7589 -20617 14137 16988 -15080 5130 21794 -15128 -11731 27056 5660 -18231
$$ packed form
124c9619Q0680k6601l5735N2642m0371n8660J13729K9012j56434K6169J56073
135A00885p9444j08670J21179M5043j25288J8874Q6734p3515k9000Q9789m1055
146E532q1359P7016M2834p2514R219M7161l9576K742N5642l8308l6363N6871q980
159A9917n7835M6177K5339p4207O741O2863l4965k4789M9986j7678l9134N9498
171B1913J7880p0929K0747N6442n8155k4946P1681j3452o0358L8546K7225m6237
183a9643J5211M2726m2967k0643N2209q513l8620K9100L038m1770K3834K4993
195A8955m3706j390M2223k4762k1998M8997j95m9094L0826L6482m3905n785M3019
208B9667k2078k8206L4754K851l2068K0210J6664l6922L397L8787k1396k3891
$$ plain form
220 -18231 8649 5855 -18677 721 5679 -23865 -12828 9040 -16463 -21618 11383 2270 -19733
233 -19733 8417 18460 -6893 6213 21623 -4966 21 29033 4556 -18606 12743 16783
245 16783 -16618 -4983 16842 -6389 -11805 8890 -6918 -15329 13010 4494 -26128 -7004 12657
258 12657 -9605 -13087 5431 -4912 -8671 12847 2575 -15079 12327 20700 -9188 -2621 20365
271 20365 3447 -6629 11063 3548 -10546 8774 10275 -16795 -6602 15691 -4253 -12971 7314
284 7314 833 -12860 2866 4949 -11622 -2722 8137 -9549 -10261 9846 87 -10715 6795
297 6795 5321 -9909 4174 12689 -4593 -661 13406 -546 -7352 11927 7791 -10639 2951
310 2951 11767 -7761 -5018 9906 -3430 -9410 5995 786 -11633 246 5274 -10847 -6277
$$ packed form
220a8231K6880k794k4532J9398M958k9544J1037K1868k5503n155L3001r113k2003
233a9733K8150J0043k5353J3106J5410k6589M987K9012k4477k3162L1349M040
245A6783l3401J1635K1825k3231n416K0695j5808q411K8339q516l0622J9124J9661
258A2657k2262l482J8518j0343l759K1518j0272j7654K7406Q373k9888O567K2986
271B0365j6918j0076J7692p515j4094J9320J501k7070J0193K2293j9944q718K0285
284G314o481j3693J5726K083j6571Q900J0859j7686p12K0107r759j0802J7510
297F795j474j5230J4083Q515j7282L932J4067j3952o806J9279m136j8430J3590
310B951Q816j9528K743J4924j3336n980J5405n209j2419J1879N028j6121M570
$$ plain form
323 -6277 7634 -3976 -8975 5043 -633 -8835 5900 6969 -7055 786 9829 -2443 -2755 12238
337 12238 4525 -5555 7074 7230 -5972 2407 10057 -4841 -6315 5581 -1995 -9296 2551 1871
351 1871 -11175 -3633 4431 -6479 -6218 4996 -2353 -6512 4770 1936 -6406 2647 7374 -2995
365 -2995 -1020 8758 1467 -2543 7709 4259 -3629 5665 6971 -5485 -2018 5993 -2068 -5106 2879
380 2879 -1558 -9453 -860 2486 -6972 -3810 3093 -4283 -4796 4321 167 -4026 4029 3799 -4926 -609
396 -609 6175 349 -841 5074 -223 -2670 6981 5195 -4629 1079 7140 -201 -2810 1141 -1495
411 -1495 -2952 2298 -1469 -8242 -511 3766 -5031 -5240 2073 255 -1651 1315 -2391 -4702 3839
426 3839 6286 -4158 -4753 4259 2854 -1629 1654 1671 837 4795 2671 -2556 2033 7261 916 -3329
$$ packed form
323f277J3911j1610m999J4018n676q202J4735J069j4024P841R043j2272l12J4993
337A2238p713j0080J2629J56j3202Q379P650j4898j474J1896p576p301J1847o80
351A871j3046P542Q064j0910K61J1214p349m159J1282k834q342R053M727j0369
365b995J975R778p291m010J0252l450p888R294J306j2456L467Q011q061l038P985
380B879m437p895Q593L346r458L162O903p376n13R117m154m193Q055k30q725M317
396f09O784n826j190N915n297k447R651j786r824N708O061p341k609L951k636
411a495j457N250l767o773P731M277q797k09P313j818j906K966l706k311Q541
426C839K447j0444n95R012j405m483L283J7q34L958k124n227M589N228o345m245
$$ plain form
442 -3329 1152 363 -2964 1138 -176 -6637 -2235 2177 -3605 -5257 281 571 -2942 -829 60 -2300
458 -2300 -13 1826 -2192 5 4792 -298 -1894 5573 4599 -1318 2619 7702 2087 -1823 2502
473 2502 2255 -845 790 -1135 -5457 -3274 -476 -2110 -2839 -2731 -4052 -1741 964 -2256 -3912 2383
489 2383 3222 -4195 -2433 4623 2617 -654 2090 2221 1452 3358 4708 1851 1227 1920 1194 2894 2661
506 2661 -3928 -4846 2589 1079 -6405 -4719 -655 -3007 -3724 -469 -1573 -3311 1013 1943 -2855 -1731
522 -1731 3224 3957 1754 -2539 -3048 5310 8879 -909 -6421 3678 9397 431 -3912 1286 2416
537 2416 870 649 -3147 -5387 349 2622 -3717 -7191 -1687 2422 331 -4390 -5536 1135 7259
552 7259 287 -7705 -866 7432 2755 -2636 -832 1395 1747 2358 584 -1668 2269 4277 -166 -1790
$$ packed form
442c329M481p89l327M102j314o461M402M412n782j652N538K90l513K113Q89k360
458b300K287J839m018K197M787n090j596P467r74n917L937N083n615l910M325
473B502k47l100J635j925m322K183K798j634p29J08j321K311K705l220j656O295
489B383Q39p417J762P056k006l271K744J31p69J906J350k857o24O93p26J700k33
506B661o589r18P435j510p484J686M064k352p17L255j104j738M324R30m798J124
522a731M955P33k203m293n09Q358L569r788n512J0099N719q966m343N198J130
537B416j546k21l796k240N736K273o339l474N504M109k091m721j146O671O124
552G259o972p992O839Q298m677n391J804K227L52O11j774k252L937K008m443j624
$$ plain form
568 -1790 1447 814 1087 1590 -3061 -4045 2259 2417 -5742 -4872 3520 888 -5400 -2022 879 -1510 -676
585 -676 1714 -242 -1573 431 1330 1209 1869 490 -604 1993 1900 -1516 1569 4467 -682 -1820 3511
602 3511 2123 -3016 -804 2932 -1261 -3569 -74 -859 -3001 -1213 -1189 -2581 -603 -173 -2807 -1759
618 -1759 1799 694 -365 1446 81 -969 2973 4032 -358 -587 2945 1741 444 1613 1530 917
634 917 1594 -253 -2226 953 1931 -3427 -4036 1173 -1112 -4219 -942 -121 -3508 -1511 2123 -1326
650 -1326 -3209 1442 1964 -1208 1609 3103 243 113 2230 1377 1783 2387 -488 -1070 2790 2354 -1996
667 -1996 190 2508 -1849 -2877 646 -970 -2782 -369 -1256 -4122 -1240 1554 -2626 -3242 1522 1187
683 1187 -1636 920 1225 -755 1830 3142 -98 200 3188 1577 -1281 1680 2723 -651 -174 1134
$$ packed form
568a790L237o33K73N03m651r84O304J58q159Q70Q392k632o288L378K901k389Q34
585f76K390j956j331K004Q99j21O60j379j094K597r3l416L085K898n149j138N331
602C511j388n139K212L736m193k308L495p85k142J788K4j392J978M30k634J048
618a759L558j105j059J811j365j050L942J059m390k29L532j204j297J169q3o13
634I17O77j847j973L179R78n358o09N209k285l107L277Q21l387J997L634l449
650a326j883M651N22l172K817J494k860j30K117q53M06O04k875n82L860m36m350
667a996K186K318m357j028L523j616j812K413q87k866K882K794m180o16M764l35
683A187k823K556L05j980K585J312l240K98K988j611k858K961J043l374M77J308
$$ plain form
699 1134 -846 -78 2175 -1434 -2482 614 -725 -3588 -1074 727 -2340 -2584 75 -1192 -1469 1471
715 1471 29 -2180 1142 2630 -794 -326 2939 2236 167 1547 1358 283 1874 1684 -1537 141
731 141 2641 -505 -2390 265 409 -1291 -882 -937 -2927 -1359 315 -2558 -2893 689 -71 -2441 -465
748 -465 647 205 1409 1841 -126 546 3462 2024 181 1913 2146 -339 808 1490 -698 -260 1226
765 1226 -988 -2039 151 -124 -2248 -1127 94 -2286 -1878 -132 -1746 -2187 164 -300 -1173 502
781 502 840 -376 1085 2954 1325 595 2087 1580 177 2112 1595 -472 303 736 -1402 -942 1077
798 1077 -259 -1966 -964 -268 -1424 -748 -537 -1861 -1388 318 -1140 -1489 68 63 -489 495 1067 193
816 193 1172 2230 978 811 2126 941 -388 822 518 -797 20 183 -846 -1108 151 -225 -823
$$ packed form
699A134j980P68K253l609j048L096j339k863K514J801l067k44K659j267k77K940
715A471j442k209L322J488l424M68L265p03k069J380j89j075J591j90l221J678
731A41K500l146j885K655J44j700M09n5j990J568J674k873l35L582p60k370J976
748d65J112m42J204M32j967O72K916j438j843J732K33k485J147O82k188M38J486
765A226k214j051K190k75k124J121J221k380M08J746j614m41K351m64q73J675
781E02L38j216J461J869j629p30J492n07j403J935n17k067P75M33k138M60K019
798A077j336j707J002O96j156O76K11j324M73J706j458l49J557nn52R84N72q74
816A93R79J058j252j67J315j185j329J210l04j315Q17J63j029k62J259l76n98
$$ plain form
833 -823 258 -268 -1560 -714 -218 -758 -734 -449 -903 -1217 -636 -466 -201 796 956 -655 437 1692 790
852 790 791 1541 631 125 891 417 -188 109 893 -417 -602 370 -220 -1024 -15 -479 -1232 -547 -383 -1640
872 -1640 -1395 -560 -1039 -1177 -174 -296 -992 269 1480 716 906 1310 730 937 2061 1193 557 951 940
891 940 -377 -175 910 -26 -559 -74 -1048 -1187 125 -449 -1476 -1342 -838 -1255 -1359 -659 -957 -899 510
910 510 896 -788 764 1540 684 948 1553 1383 926 1413 770 556 970 855 -234 -515 -69 -1042 -681
929 -681 370 -982 -1709 -548 -742 -1678 -1157 22 -806 -1398 -280 -131 -424 362 754 296 798 857 617
948 617 1347 1743 552 337 1192 1147 -44 662 920 -577 -449 174 -749 -903 -523 -389 -977 -1141 -778 -956
968 -956 -795 -436 -1140 -521 396 -255 -867 -12 1112 433 391 720 777 513 1330 1724 809 601 739 644 209
$$ packed form
833h23J081n26j292Q46M96n40K4K85m54l14N81J70K65R97J60j611J092J255r02
852G90JP50r10n06P66m74o05K97P84j310j85R72n90q04J009m64p53O85J64j257
872a640K45Q35m79j38J003j22o96J261J211p64J90M04n80K07J124q68o36L94j1
891I40j317K02J085r36n33M85r74j39J312n74j027J34N04m17j04P00k98N8J409
910E10L86j684J552P76q56K64O05j70m57M87o43k14M14j15j089k81M46r73L61
929f81J051j352p27J161j94r36N21J179q28n92J118J49k93P86L92m58N02N9k40
948F17P30L96j191k15Q55m5j191P06K58j497J28O23r23j54L80J34n88j64L63j78
968i56J61L59p04O19R17o51o12Q55J124o79m2L29N7k64Q17L94r15k08J38r5m35
$$ plain form
989 209 74 -177 645 -186 -1383 -1192 -310 -746 -1728 -951 -535 -1084 -1019 -22 -706 -443 -172 469 467 -276 -36
1010 -36 1357 1337 708 190 794 1408 896 545 1259 673 203 265 -338 -549 -316 -225 -721 -1813 -1770 -976 -574
1031 -574 -1005 -1485 -1148 146 -50 -848 236 891 608 304 504 956 764 595 926 513 948 1174 873
1050 873 566 253 67 709 224 -979 -1173 -850 -695 -1442 -1292 -424 -963 -1439 -379 290 -182 -78 67
1069 67 161 527 331 546 733 554 42 212 636 396 122 806 820 -183 216 1066 231 -361 393 513 -306
1090 -306 -1082 -829 -703 -486 -516 -953 -631 442 -152 -492 352 686 191 453 231 -578 -109 780 123 -637
1110 -637 -2 599 92 456 642 779 821 632 145 180 884 532 -994 -619 -49 -994 -1106 -265 -993 -948 -457
1131 -457 -127 -651 -225 310 60 -453 423 -69 -418 232 155 235 1073 986 307 1057 1747 1260 488 1132 1137 -188
$$ packed form
989B09j35k51Q22q31j197J91Q82m36r82P77M16n49O5R97o84K63K71O41kp43K40
1010c6J393k0o29n18O04O14n12l51P14n86m70O2o03k11K33R1m96j092M3P94M02
1031e74m31m80L37J294j96p98J084O55k83l04K00M52j92j69L31m13M35K26l01
1050H73l07l13j86O42m85j203j94L23J55p47J50Q68n39m76J060O69m72J04J45
1069F7R4L66j96K15J87j79n12J70M24k40k74O84J4j003L99Q50q35n92P54J20q19
1090c06p76K53J26K17l0m37L22J073n94l40Q44L34m95K62k22q09M69Q89o57p60
1110f37O35O01n07L64J86J37M2j89m87L5P04l52j526L75N70r45j12Q41p28M5M91
1131d57L30n24M26N35k50n13Q76m92l49O50p7Q0Q38q7o79P50O90m87p72O44Nj325
$$ plain form
1153 -188 -168 184 -802 -853 -832 -1481 -1633 -1157 -1029 -1120 -1118 -599 -452 -515 109 6 489 720 384 99 775 971
1175 971 548 562 1314 1383 943 1232 961 628 471 400 -800 -800 -878 -1294 -1723 -1534 -952 -1331 -1001 -845 -942 -440
1197 -440 469 432 410 775 782 502 978 1046 639 645 585 446 675 888 1122 196 268 528 9 -365 -418 -549 -943
1220 -943 -999 -938 -1291 -1013 -463 -692 -585 -45 110 277 547 736 759 769 848 487 309 330 433 271 163 136
1242 136 -297 364 100 300 348 349 -268 -447 -535 -80 -521 -752 -657 -924 -696 -428 25 28 158 -129 229 -5
1264 -5 420 319 215 113 457 34 43 181 -83 200 137 317 458 131 577 858 419 420 386 -131 -383 -463 -525
1287 -525 -656 -508 -719 -534 -751 -422 -35 -87 156 -334 -285 -73 -92 235 230 107 87 176 694 861 371 945
1309 945 965 168 585 597 436 330 433 -662 -705 -428 -754 -1274 -1044 -673 -1016 -576 -514 -457 -308 166 194 43
$$ packed form
1153a88K0L52r86n1K1o49j52M76J28r1KN19J47o3O24j03M83K31l36k85O76J96
1175I71m23J4P52O9m40K89k71l33j57p1j200%p8m16m29J89N82l79L30J56r7N02
1197d40R09l7k2L65Pk80M76O8m07Oo0j39K29K13K34r26P2K60n19l74n3j31l94
1220i43n6O1l53K78N50k29J07N40J55J67K70J89K3J0P9l61j78K1J03j62j08k7
1242A36m33O61k64K00M8Jo17j79q8M55m41k31R5k67K28K68M53LJ30k87L58k34
1264eM25j01j04j02L44m23RJ38k64K83o3J80J41l27M46K81m39Jl4n17k52q0o2
1287e25j31J48k11J85k17L29L87n2K43m90M9K12j9L27nj23k0Q9N18J67m90N74
1309I45K0p97M17J2j61j06J03j095m3K77l26n20K30L71l43M40O2N7J49M74K8j51
$$ plain form
1331 43 347 472 159 351 1013 494 131 804 865 297 713 873 193 592 241 -272 -702 -59 -518 -1115 -780
1352 -780 -1051 -1311 -737 -671 -748 -505 44 -56 -7 508 514 536 521 1115 130 339 1000 595 571 1062 542 113 278
1375 278 457 -107 -111 -111 -191 -884 -637 -519 -660 -608 -787 -1110 -669 -376 -130 73 134 220 24 431 458 293 393
1398 393 678 175 284 586 421 136 687 289 193 259 260 15 -215 -120 -216 -664 -548 -635 -789 -450 -290 -485
1420 -485 -506 -412 -695 -69 404 -92 -14 369 361 286 485 745 411 276 582 227 400 702 519 330 -28 148
1442 148 -330 -233 -501 -197 -441 -591 -762 -494 -376 -561 -375 -115 -502 -210 -425 95 101 162 375 355 339 189
1464 189 610 749 795 603 178 167 277 265 643 219 11 -224 -385 -661 -223 -334 -483 -984 -583 -878 -632
1485 -632 -247 -409 -433 -261 -149 88 186 242 500 600 298 771 594 505 362 656 554 217 76 5 -161 -41
$$ packed form
1331D3L04J25l13J92O62n19l63O73O1n68M16J60o80L99l51n13m30O43m59n97L35
1352g80k71k60N74O6p7K43N49j00M9N15OK2j5N94r85K09O61m05k4M91n20m29J65
1375B78J79n64m%q0o93K47J18j41N2j79l23M41K93K46K03O1Q6j96M07K7j65J00
1398C93K85n03J09L02j65k85N51l98r6O6Jk45k30R5r6m48J16q7j54L39J60j95
1420d85k1R4k83O26M73m96P8L83qp5J99K60l34j35L06l55J73L02j83j89l58J76
1442A48m78R7k68L04k44j50j71K68J18j85J86K60l87K92k15N20OO1K13k0j6j50
1464A89M21J39M6j92m25j1J10j2L78m24k08k35j61k76M38j11j49n01M01k95K46
1485f32L85j62k4J72J12K37R8N6K58J00l02M73j77q9j43K94j02l37j41p1j66J20
$$ plain form
1507 -41 -300 -179 -96 -378 -545 -278 -150 -331 -214 -515 -513 -255 -241 66 66 -39 -247 -16 389 181 495 553 631
1530 631 606 669 487 559 246 185 464 -176 -595 -245 -109 -247 -106 -348 -411 -391 -645 -548 -71 -170 -463 -376 -191
1553 -191 -194 -366 364 342 149 305 599 204 559 659 301 525 330 198 161 530 161 -166 -14 168 -387
1574 -387 -462 -50 -521 -592 -369 -397 -435 -469 -383 -531 -550 17 -204 -24 191 277 329 349 612 325 604 624 949 664
1598 664 907 551 -136 40 162 -348 76 -182 -428 -385 -512 -551 -566 -452 -514 -555 -448 -285 -103 -322 -32 -133
1620 -133 252 388 426 514 722 613 626 591 583 502 425 544 151 -10 150 -80 -609 -327 -139 -376 -384 -564 -559 -794
1644 -794 -290 -144 -437 -229 -83 -213 -4 189 216 7 472 -65 297 576 650 295 400 682 31 -217 859
1665 859 340 -258 -167 -230 -283 -284 130 -427 -498 -377 -372 -497 65 -340 -345 85 -21 -589 -132 281 26 -12 586 428
$$ packed form
1507d1k59J21Q3k82j67K67J28j81J17l01KK58J4L07%j05k08K31M05k08L14N8P8
1530F31k5O3j82P2l13o1K79o40m19L50J36j38J41k42o3K0k54R7M77r9k93Q7J85
1553a91lj72P30k2j93J56K94l95L55J00l58K24j95j32l7L69l69l27J52J82n55
1574c87p5M12m71p1K23k8l8l4Q6j48j9N67k21J80K15Q6N2K0K63k87K79K0L25k85
1598F64K43l56o87J76J22n10M24k58k46M3j27l9j5J14o2m1J07J63J82k19K90j01
1620a33L85J36L8Q8K08j09J3l5qq1p7J19l93j61J60k30n29K82J88k37qj80Nk35
1644g94N04J46k93K08J46j30K09J93K7k09M65n37L62K79P4l55J05K82o51k48J076
1665H59n19n98R1o3n3jM14n57p1J21Nj25N62m05nM30j06n68M57M13k55l8N98j58
$$ plain form
1689 428 -122 527 485 100 407 736 59 -1 223 41 -139 80 284 -401 -181 -80 -205 -466 -100 -607 -863
1710 -863 -71 -105 -352 -64 -45 -412 -84 421 186 -117 672 430 87 346 635 282 518 458 537 32 558
1731 558 92 -383 -235 40 -287 -557 -40 -343 -709 -169 -411 -413 -275 -166 -442 -142 348 69 -204 441 142
1752 142 -321 654 706 87 457 538 243 117 615 355 -84 139 176 -403 -131 3 -417 -546 -64 -528 -532 -430
1774 -430 -370 -485 -129 101 -184 -282 351 184 -93 404 288 -7 120 439 298 279 812 640 301 237 411
1795 411 10 22 87 -458 -388 -99 -643 -479 -133 -254 -415 -420 -105 -293 -424 -121 -64 183 116 113 -221 323 492
1818 492 471 284 707 276 85 369 701 300 250 221 -259 233 7 -178 -86 -175 -429 -638 -140 -367 -383 -475
1840 -475 -340 -436 -690 -22 -12 99 120 135 269 354 323 361 329 397 469 311 199 277 387 328 -26 -98 -321 -121
$$ packed form
1689D28n50O49m2l85L07L29o77o0K24j82j80K19K04o85K20J01j25k61L66n07k56
1710h63P92l4k47K88J9l67L28N05k35l03P89k42l43K59K89l53K36o0P9n05N26
1731E58m66m75J48K75l27k70N17l03l66N40k42kJ38J09k76L00M90k79k73O45k99
1752A42m63R75N2o19L70Q1k95j26M98k60m39K23L7n79K72J34m20j29M82m64mJ02
1774d30O0j15L56K30k85r8O33j67k77M97j16k95J27L19j41j9N33j72l39o4J74
1795D11m01J2O5n45P0K89n44J64L46j21j61nL15j88j31L03N7K47o7ll34N44J69
1818D92k1j87M23m31j91K84L32m01n0k9m80M92k26j85R2q9k54k09M98k27j6r2
1840d75J35r6k54O68J0J11K1J5J34Q5l1L8l2O8P2j58j12P8J10n9l54p2k23K00
$$ plain form
1864 -121 -277 -441 -456 -319 -461 -465 -432 -492 -375 3 -83 -135 147 -145 -111 200 418 477 -10 342 368 244 507
1887 507 169 311 178 101 -121 215 -41 -276 -88 -501 -251 -614 -448 -349 -354 -193 -468 -504 -326 -283 116 -3
1909 -3 76 -23 -216 163 304 502 447 513 75 422 322 266 283 281 129 -10 163 -161 -253 37 -74 -203 -350 -419
1933 -419 -284 -480 -243 -303 -306 -140 -92 -2 -238 -20 -126 248 242 412 157 293 665 -8 34 245 90 160 112
1956 112 115 -9 40 -215 -255 -147 -139 -198 -373 -359 -242 -239 -371 -130 -365 -229 -152 -325 -179 269 364 168 199 313
1980 313 368 241 463 220 267 405 508 -70 204 203 124 -104 -81 -397 -296 33 -285 -333 -599 -366 -464 -585 -377
2003 -377 -272 -13 -63 -188 -243 86 177 456 411 649 341 198 541 251 170 185 369 -150 75 57 120 -74 -239
2026 -239 -233 -332 -424 -163 -410 -463 -352 -466 -116 -242 -130 -54 101 -30 105 241 290 53 63 587 598 339 140
$$ packed form
1864a21j56j64j5J37j42mL3o0J17L78q6n2K82k92L4L11K18N9m87L52K6j24K63
1887E07l38J42j33p7k22L36k56k35J88m13K50l63J66R9nJ61k75l6J78M3L99j19
1909cP9r9j93L79J41J98n5O6m38L47j00n6J7kj52j39J73l24r2K90j11j29j47o9
1933d19J35j96K37o0lJ66M8R0k36K18j06L74oJ70k55J36L72o73M2K11j55P0m8
1956A12Lj24M9k55m0J08Qn9j75J4J17Lj32K41k35J36P7j73J46M48R5j96L1J14
1980C13N5j27K22k43M7J38J03n78K74jp9k28K3l16J01L29l18m8k66K33r8j21K08
2003c77J05K59n0j25n5L29R1K79m5K38l08j43L43k90q1J5J84n19K25j8O3j94j65
2026b39Or9r2K61k47n3J11j14L50j26J12P6J55j31J35J36M9k37J0N24J1k59j99
$$ plain form
2049 140 406 211 224 395 -168 102 -103 -41 -255 123 -190 -314 -553 -566 -396 -177 -124 -364 -275 -65 41 186
2071 186 -93 -135 9 374 152 63 265 263 438 496 176 424 378 147 39 -126 208 12 -330 -141 -380 -192
2093 -192 -181 -407 -365 -68 -214 -282 30 33 -42 -39 -273 28 162 472 440 407 135 244 321 418 198 116 188 134 134 68
2119 68 3 -29 -256 -115 -59 -363 -319 -365 -341 71 -158 -200 -260 -195 -43 -147 1 194 346 247 332 -151 108 412
2143 412 23 460 252 322 70 77 204 143 -105 -61 -210 133 -66 -135 -363 -258 -55 -213 -395 -199 -174 -153 -282
2166 -282 0 -20 59 190 178 393 436 278 -9 230 243 85 425 414 105 -2 44 -64 -254 -86 -95 -453 -212
2189 -212 -225 -106 -264 -418 -272 -327 -157 -76 -178 -86 217 109 -187 236 106 105 164 92 263 208 304 103 -58
2212 -58 264 139 -223 390 0 25 253 -168 -57 -182 -180 -354 -323 -194 -180 -303 -286 -175 -366 92 -155 -159 -22
$$ packed form
2049A40K66j95J3J71n63K70k05O2k14L78l13j24k39j3J70K19N3k40Q9K10J06J45
2071A86k79m2J44L65k22q9K02kJ75N8l20K48m6k31j08j65L34j96l42J89k39J88
2093a92J1k26M2K97j46o8L12Lp5Lk34L01J34L10l2l3k72J09P7R7k20q2P2n4%o6
2119F8o5l2k27J41N6l04M4m6K4M12k29m2o0O5J52j04J48J93J52r9Q5m83K59L04
2143D12l89M37k08P0k52PJ27o1k48M4j49L43j99o9k28J05K03j58j82J96K5K1j29
2166b82K82k0P9J31j2K15M3j58k87K39J3j58L40j1l09j07M6j08j90J68rl58K41
2189b12j3J19j58j54J46n5J70Q1j02R2L03j08k96M23j30jN9p2J71n5R6k01j61
2212e8L22j25l62O13l90K5K28m21J11j25Kj74L1J29J4j23J7J11j91M58k47mJ37
$$ plain form
2235 -22 -8 183 157 584 315 134 230 337 369 264 538 103 68 142 85 -16 -221 -143 -276 -325 -394 -347 -250 -35
2259 -35 -636 -112 -456 -512 -189 -158 55 -130 142 421 313 401 312 362 470 616 293 152 348 117 -37 155
2281 155 -3 -255 -203 -90 54 -297 -262 -225 -546 -121 -212 -294 -398 64 -157 -259 70 -27 -55 357 432 230 214
2304 214 497 183 131 511 496 2 122 223 -181 -148 -132 -210 -462 -160 -175 -666 -424 -190 -423 -476 -296 -394 52
2327 52 87 25 140 272 216 -113 101 452 229 297 664 261 -80 480 188 -149 52 187 -328 -131 -152 -438
2349 -438 -441 -200 -278 -499 -149 100 -313 -405 94 -124 -38 72 60 -5 0 118 218 3 373 286 97 400 176
2372 176 125 77 80 13 51 299 -162 -217 184 -36 -526 53 -76 -528 -97 -104 -224 -264 -17 -9 -236 -73 -88 -342
2396 -342 55 373 155 156 300 141 228 443 166 -136 -70 297 -181 -35 223 -32 0 -113 -465 -523 -199 -205 -182
$$ packed form
2235b2J4J91k6M27k69j81R6J07L2j05K74m35l5P4n7j01k05P8j33m9o9M7R7K15
2259c5o01N24l44n6L23L1K13j85K72K79j08Q8q9N0J08J46l23j41J96k31j54J92
2281A55j58k52N2J13J44l51L5L7l21M25r1q2j04M62k21j02L29r7k8M12P5k02j6
2304B14K83l14n2L80j5m94J20J01m04L3J6p8k52L02j5m91K42K34k33n3J80r8M46
2327E2L5o2J15J32n6l29K14L51k23O8L67m03l41N60k92l37K01J35n15J97k1k86
2349d38lK41p8k21L50K49m13r2M99k18Q6J10j2o5NJ18J00k15L70q7j89L03k24
2372A76n1m8Lo7L8K48m61n5M01k20m90N79j29m52M31pj20m0K47Qk27J63j5k54
2396c42L97L18k18JJ44j59Q7K15k77l02O6L67m78J46K58k55L2j13l52n8L24oK3
$$ plain form
2419 -182 -172 -210 -1 -200 -205 -75 -112 -340 161 -67 190 114 289 161 330 89 210 505 399 -98 354 13
2441 13 179 61 163 -460 -165 -269 -414 -196 -231 -353 -53 -161 -8 67 -211 -251 -14 90 103 232 371 352
2463 352 120 469 134 360 50 76 275 188 231 -32 57 -206 -429 -81 -500 -337 -499 -157 -107 -263 -280 -379
2485 -379 -89 -20 -113 35 -120 -68 11 46 122 327 2 116 121 195 270 180 175 113 -119 -74 228 69 -140 -296 -114
2510 -114 -98 -173 -207 -81 -241 -398 -235 -62 -93 194 -134 -61 69 233 -57 -17 221 145 466 141 332 159
2532 159 463 308 189 206 256 -5 53 -162 -176 -94 -88 -154 -88 -303 -105 -357 -138 -43 -191 -81 -120 45 -172 169
2556 169 -115 207 -20 431 15 305 403 264 133 131 369 90 -1 3 4 -23 -214 -87 -87 -228 -117 -291 -132 0
2580 0 -362 -389 -73 6 -31 136 108 38 138 127 441 296 167 93 358 348 416 59 317 99 108 105 -31 100 -173
$$ packed form
2419a82J0l8K09j99nJ30l7k28N01k28K57p6J75j28J69k41J21K95j06m97M52l41
2441A3J66j18J02o23K95j04j45K18l5j22L00j08J53P5k78m0K37J04J3J29J39j9
2463C52k32L49l35K26l10K6J99q7M3k63Q9k63k23L48m19J63j62L42N0j56j7r9
2485c79K90O9r3J48j55N2P9L5P6K05l25J14NP4P5r0no2k32M5L02j59k09j56J82
2510a14J6p5l4J26j60j57J63J73l1K87l28P3J30J64k90M0K38p6L21l25J91j73
2532A59L04j55j19J7N0k61N8k15j4Q2Oo6O6k15J98k52K19R5j48J10l9J65k17L41
2556A69k84L22k27M51m16K90R8j39j31kK38k79r1MJk7j91J27%j41J11j74J59J32
2580@l62k7L16P9l7J67k8p0J00j1L14j45j29p4K65j0O8l57K58k18Rlj36J31k73
$$ plain form
2605 -173 -382 -109 -132 -124 -229 -132 -84 -285 -248 -279 -77 -167 -211 -75 15 56 -136 153 16 152 364 131 17 61
2629 61 219 148 63 213 -197 17 -116 -28 -272 -272 -167 -158 -266 -287 -451 -67 -118 -357 -72 -165 -53 20 203 -118
2653 -118 150 175 98 121 265 226 201 215 103 126 -149 245 219 135 -71 -29 -195 -320 -343 -335 -233 -143 -382 -228 -249
2678 -249 -157 146 -369 -215 195 -243 58 -206 91 68 192 67 33 314 246 144 3 -5 174 -188 226 -26
2700 -26 21 -139 -184 84 -107 -268 -250 -172 -399 -78 -494 -175 -24 -31 -121 -12 -172 220 165 93 300 191 221 366
2724 366 222 29 240 83 147 226 -69 35 -57 -171 111 8 77 -320 -146 -533 -61 -204 -128 -404 -210 -89
2746 -89 -173 95 58 232 46 -9 250 197 288 -26 39 154 345 104 -48 -325 -2 49 -174 -31 -197 -268 -284
2769 -284 -224 -49 -347 -500 -186 -204 -87 117 -100 -238 -6 -15 117 125 173 -32 304 286 93 256 222 194 -77
$$ packed form
2605a73k09K73k3Qj05R7M8k01L7l1K02r0m4J36R0M1j92K89j37J36K12k33j14M4
2629F1J58p1q5J50m10K14j33Q8k44%J05Rj08k1j64L84n1k39K85r3J12P3J83l21
2653a18K68K5p7K3J44l9k5J4j12K3k75L94k6q4k06M2j66j25k3QJ02R0k39J54k1
2678b49R2L03n15J54M10m38L01k64K97k3J24j25l4K81o8j02j41qJ79l62M14k52
2700b6M7j60m5K68j91j61J8P8k27L21m16L19J51pr0J09j60L92n5p2K07j09L0J45
2724C66j44j93K11j57O4P9k95J04r2j14K82j03O9l97J74l87M72j43P6k76J94J21
2746h9q4K68l7J74j86n5K59n3R1l14O5J15J91k41j52k77L23N1k23J43j66p1j6
2769b84O0J75k98j53L14j8J17K04k17j38K32rJ32QM8k05L36j8j93J63l4k8k71
$$ plain form
2792 -77 -70 81 -6 40 -72 -82 -112 -11 -259 -110 -148 11 -208 -100 -14 -110 -151 -200 -118 -157 -246 -195 -182 262 215 81
2818 81 -84 340 345 23 191 181 114 105 -133 80 -115 -203 0 141 -196 -237 -88 -390 197 36 -208 -43 -190
2841 -190 -157 -119 -250 -164 116 402 -141 169 157 237 216 648 207 -129 323 205 -129 236 130 225 195 100 -180
2864 -180 -141 -7 -3 -302 -144 -147 -269 -119 -106 -388 -133 -78 106 196 -177 37 178 247 328 182 287 78 263
2887 263 285 373 225 -157 170 25 -42 -68 44 -70 -266 -166 -276 -449 23 -204 -408 -46 -82 -98 85 102
2909 102 -43 -94 60 -76 38 321 -22 277 302 321 270 59 192 216 102 -25 175 13 89 23 66 -217 -65
2932 -65 -43 -271 -223 -118 -81 -384 160 -413 169 -186 1 171 105 -5 2 24 59 286 -3 203 -84 186 293
2955 293 -66 -161 -23 103 -92 -363 188 14 -114 55 -183 -415 -106 -24 -212 -66 -43 -7 -21 27 -85 48
$$ packed form
2792g7PJ51q7M6j12j0l0J01k48J49l8J59k19J08Q6r6m1m9Q2l9q9N1J3M44m7j34
2818H1j65M24Nl22J68j0o7rk38K13j95q8K03J41l37m1J49l02N87j61k44J65j47
2841a90L3L8j31Q6K80K86n43L10j2Q0k1M32m41l36M52j18l34L65j06R5l0r5k80
2864a80L9J34Mk99J58lj22J50J3k82K55N5J84R0l73K14J41O9Q1j46J05k09J85
2887B63K2Q8j48l82L27j45o7k6J12j14j96J00j10j73M72k27k04L62l6j6J83J7
2909A02j45n1J54j36J14K83l43K99K5J9n1k11J33K4j14j27K00j62P6o6M3k83J52
2932f5K2k28M8J05L7l03N44n73N82l55J87J70o6j10PK2L5K27k89K06k87K70J07
2955B93l59r5J38J26j95k71N51j74j28J69k38k32L09Q2j88J46K3L6j4M8j12J33
$$ plain form
2977 48 114 173 -5 293 361 55 257 417 181 -112 62 93 -111 5 -60 -103 69 67 -350 -254 146 -129 -241
3000 -241 -188 20 -90 -154 295 145 -240 241 -191 -137 249 41 88 48 297 142 29 206 14 85 86 78 61 -19
3024 -19 98 -59 -106 214 -202 -298 -105 -77 -185 -89 -48 -41 83 220 19 74 38 141 -43 198 299 182 50
3047 50 159 141 267 191 41 -84 172 -183 -302 -204 -31 -153 -9 -33 -246 -193 -99 4 -160 -65 -14 -233 -172
3070 -172 -202 41 69 71 33 97 262 185 174 132 340 268 -3 124 23 8 28 103 -243 -312 -61 -93 -302 29 -267
3095 -267 -305 -211 -422 -39 -158 -53 -366 94 97 -81 61 210 271 168 340 101 42 154 418 93 17 -188
3117 -188 138 -165 -82 150 -152 -342 -128 -144 -120 -171 -318 -155 -243 -519 -124 -170 -261 302 176 53 131 249 130
3140 130 371 119 207 78 191 -217 267 119 183 -56 -131 -1 -86 -131 -17 -313 -19 -135 -116 -286 4 -253
$$ packed form
2977D8O6N9j78K98O8l06K02J60k36k93J74L1k04J16o5m3J72km17R6M00k75j12
3000b41N3K08j10o4M49j50l85M81m32N4L86k08M7m0K49j55j13J77j92P1Jqj7q0
3024a9J17j57m7L20m16r6J93K8j08R6M1PJ24J37k01N5l6J03j84K41J01j17j32
3047E0J09j8J26p6j50j25K56l55j19R8J73j22J44k4k13N3R4J03j64R5N1k19O1
3070a72l0K43K8Kl8O4J65p7j1m2K08p2k71J27j01j5K0P5l46o9K51l2k09L31k96
3095b67l8R4k11L83j19J05l13M60Lj78J42J49O1j03J72k39n9J12K64l25p6k05
3117a88L26l03Q3K32l02j90K14j6K4n1j47J63q8k76L95m6r1N63j26j23P8J18j19
3140A30K41k52Q8j29J13m08M84j48O4k39p5J30q5m5J14k96K94j16J9j70K90k57
$$ plain form
3162 -253 -130 -289 113 60 -374 420 185 68 -116 191 -21 296 119 -56 260 5 196 -71 -91 90 60
3183 60 92 -187 64 -193 -242 -265 -57 -387 -242 -105 -103 -177 6 -230 -19 74 -98 -188 174 247 11 -13 -80 336
3207 336 35 80 224 113 248 299 -62 143 -83 -243 117 -129 -45 -248 -110 -339 1 -47 -155 -340 -300 -72
3229 -72 -155 -187 -86 161 33 268 152 203 220 -26 381 308 98 60 137 52 226 -90 27 -28 203 86 -168
3252 -168 37 -141 -242 131 220 -117 24 -152 -85 75 -70 100 19 71 -47 3 -109 12 94 1 304 251 100
3275 100 166 182 -29 -125 96 -1 -116 -392 34 -131 31 -188 -42 -168 -36 22 -73 15 -254 -147 59 -141
3297 -141 -29 -57 103 79 -122 203 41 111 130 -55 161 148 21 -41 117 -109 -98 -293 109 -99 -134 -174 -55
3320 -55 -212 -7 -96 -289 -52 100 -45 -290 124 -14 -82 -7 173 -105 334 91 -27 106 94 20 -44 -33 0
$$ packed form
3162b53J23j59M02n3m34P94k35j17j84L07k12L17j77j75L16k55J91k67k0J81l0
3183F0L2k79K51k57m9k3K08l30J45J37Kp4J83k36K11R3j72r0L62P3k36k4o7M16
3207C36l01M5J44j11J35N1l61K05k26j60L60k46Q4k03J38k29L40m8j08j85M0K28
3229g2q3l2J01K47j28K35j16N1J7k46M07p3k10l8P7q5J74l16J17n5K31j17k54
3252a68K05j78j01L73Q9l37J41j76O7J60j45J70q1N2j18N0j12J21Q2r3L03n3j51
3275A00O6J6k11r6K21r7j15k76M26j65J62k19J46j26J32N8r5Q8k69J07K06k00
3297a41J12k8J60k4k01L25j62P0J9j85K16j3j27o2J58k26J1j95M02k08l5m0J19
3320e5j57K05q9j93K37J52j45k45M14j38o8P5J80k78M39k43j18J33j2p4o4J1L3
$$ plain form
3343 0 1 177 -187 18 -3 -75 -173 30 -308 -229 -117 -183 147 -32 -40 -96 218 -11 -12 52 415 20 91 43 286 137
3369 137 334 27 63 4 129 -73 47 84 -68 -112 -303 -73 -95 -169 -351 -136 -128 -9 -101 122 -99 24 137
3392 137 -166 -26 48 283 208 39 69 130 81 154 288 -22 195 205 156 83 53 291 85 -24 -261 3 -115
3415 -115 -30 -2 6 -67 -47 -265 -209 23 24 -169 180 300 -11 64 -120 131 106 260 -11 -167 107 191 233 -92
3439 -92 74 332 169 -160 -81 -208 82 -142 -360 28 -158 5 -295 -230 -2 77 284 -148 67 -31 128 -9
3461 -9 -74 122 30 -123 313 -2 -38 199 112 167 8 -82 37 43 -87 193 65 -396 -231 -85 -68 -226 -43 -26
3485 -26 -406 -65 -125 69 40 169 165 246 199 212 42 138 -200 100 246 -1 -34 127 154 65 -2 -79 -18 139 44
3510 44 -113 -100 -125 -43 -259 -18 -101 -358 238 -168 -208 -174 -183 4 -47 50 -208 203 378 382 41 182 158 -113 -33
$$ packed form
3343@JJ76l64K05k1p2r8K03l38P9J12o6L30j79qn6L14k29jO4L63l95P1m8K43j49
3369A37J97l07L6n9J25k02J20L7j52m4j91K30k2p4j82K15QJ19r2K23k21J23J13
3392A37l03J40P4K35p5j69L0O1m9P3J34l10K17J0m9p3l0K38k06j09k37K64j18
3415a15Q5K8Qp3K0k18N6K32Jj93L49J20l11P5j84K51k5J54k71j56K74Q4M2l25
3439i2J66K58j63l29P9j27K90k24k18L88j86J63l00O5K28P9K07m32K15r8J59j37
3461io5J96r2j53M36l15l6K37q7N5j59r0J19Oj30K80j28m61J65J46J7j58J83J7
3485b6l80L41o0J94k9J29mQ1m7J3j70R6l38L00J46k47l3J61K7q9o7p7O1J57r5
3510D4j57J3k5Q2k16K41q3k57N96m06m0L4rJ87n1R7k58M11J75Ml41J41k4k71Q0
$$ plain form
3535 -33 -4 -437 -241 9 -161 -56 181 77 -162 -21 -316 -424 -258 -205 -30 -104 127 -7 -115 286 247 -185
3557 -185 -6 343 92 90 213 -54 269 -19 -28 165 -30 270 85 -92 183 51 -424 -52 -95 -143 18 -152
3579 -152 -144 48 -28 -154 -108 -428 -230 -80 211 59 -39 -60 238 246 -24 99 133 -43 -65 75 -386 -79 517
3602 517 -21 106 30 70 -183 -178 -38 -358 -248 -175 -59 -31 47 57 106 -107 -14 23 116 140 129 -1 41 9 317
3627 317 233 162 226 -27 95 35 102 -46 -190 -135 176 -33 -136 11 -282 -36 -92 -339 -62 122 16 -155
3649 -155 -219 -50 117 6 -24 317 43 26 19 -153 -145 -180 152 1 -40 168 -239 -56 20 -44 -380 -61 51 -259
3673 -259 51 -5 -212 -44 -88 -87 114 179 200 -19 -2 95 -22 -39 370 114 11 313 56 -50 59 199 141
3696 141 154 168 20 3 158 -107 -209 162 -228 -344 -292 -76 -287 186 -58 -342 -173 190 -120 42 92 45
$$ packed form
3535c3K9m33J96K50j70J05K37j04k39J41k95j08J66N3J75p4K31j34j08M01l9m32
3557a85J79L49k51kJ23k67L23k88rJ93j95L00j85j77K75j32m75L72m3m8J61j70
3579a52QJ92p6j26M6l20J98J50K91j52r8k1K98Qk70J23L4j76k2J40m61L07N96
3602E17n38J27p6M0k53NJ40l20J10P3J16K8P8J0M9k13R3L7R3K4j1j30M2l2L08
3627C17q4p1O4k53J22o0O7j48j44N5L11k09j03J47k93K46n6k47K77J84j06j71
3649a55o4J69J67j11l0L41k74j7pj72Ql5L32j51m1K08m07J83P6o4l36L19J12l10
3673b59L10n6k07J68m4JK01O5K1k19J7R7j17j7M09k56j03L02k57j06J09J40n8
3696A41J3J4j48j7J55k65j02L71l90j16N2K16k11M73k44k84J69L63l10J62N0m7
$$ plain form
3718 45 227 257 -140 123 489 -140 0 8 88 -91 51 51 216 63 46 -6 66 40 -38 -122 -293 -263 -184 -84 -261
3743 -261 -42 -215 -129 168 -164 66 24 328 124 71 88 199 -120 34 30 -79 4 281 160 126 97 -80 82
3766 82 -198 107 -66 -126 -12 -283 -248 -135 -120 -4 62 -297 10 37 100 -230 121 -49 149 317 -93 250
3788 250 114 59 73 -85 158 -331 51 -41 -160 164 -115 -2 -245 -282 -189 -212 -286 -193 120 -13 -51 22 -52 63
3812 63 -186 86 118 72 67 88 169 -98 71 132 3 -5 10 -155 31 -59 -100 -87 -410 17 -195 -201 -253 -139 -144 29
3838 29 -42 12 30 -172 -60 -20 -161 -232 172 74 -7 -69 269 158 -139 183 -34 105 23 114 -343 69 89 -78
3862 -78 7 -128 191 -37 6 -208 8 -74 -256 -66 -93 28 -64 -112 154 -1 -199 58 -39 -141 99 72 -19
3885 -19 341 209 -87 105 164 136 -175 216 -71 -102 -35 -261 -129 145 -267 -57 -32 337 -50 -17 -110 -130 -145
$$ packed form
3718D5J82L0l97K63L66o29J40QQ0j79J42%J65j53j7n2P2k6p8q4j71L0P9J00j77
3743b61K19j73Q6K97l32K30m2L04k04n3J7J11l19J54mj09Q3K77j21l4k9j77J62
3766H2k80L05j73o0J14k71L5J13J5J16O6l59L07K7O3l30L51j70J98J68m10L43
3788B50j36n5J4j58K43m89L82r2j19L24k79J13k43l7R3k3p4R3L13j33l8P3p4J15
3812F3k49K72L2m6nK1Q1k67J69O1j29qJ5j65J86r0m1J3l23M27k12on2J14nJ73
3838B9p1N4J8k02J12M0j41p1M04r8q1o2L38j11k97L22k17J39q2R1m57M12K0j67
3862g8Q5j35L19k28M3k14K16q2j82J90k7J21r2m8K66j55j98K57r7j02K40k7r1
3885a9L60j32k96J92N9k8l11L91k87l1O7k26J32K74m12K10K5L69l87L3r3k0j5
$$ plain form
3908 -145 -266 -99 61 131 -131 -142 41 -40 252 164 103 143 303 -140 -164 401 81 49 -113 260 -26 -147 172
3931 172 -97 -35 -93 38 70 -11 -84 -53 -30 119 47 131 185 -163 39 96 391 94 49 32 142 65 128 118 -1
3956 -1 -179 30 -194 -47 75 -64 -74 -204 -281 73 -275 -138 147 -26 -6 25 52 83 -25 -76 28 155 -47
3979 -47 -52 417 103 229 333 91 243 134 226 323 95 -19 86 -40 -214 33 16 -85 -397 -131 -218 -88
4001 -88 -112 -111 -169 78 -41 222 204 106 123 132 125 178 354 -99 121 109 -22 -27 232 28 -232 -45 250 -38 -143
4026 -143 5 -30 -96 -180 -151 32 143 -187 -204 107 263 -58 6 116 -177 -102 103 22 205 182 -107 11 89
4049 89 20 47 -159 114 -29 -183 -36 41 -125 -133 -112 -168 -49 206 21 -209 41 -194 -61 126 -3 211 86
4072 86 110 -20 155 70 -158 -56 38 170 -19 -16 -2 -239 69 40 -71 -92 112 -83 122 -114 13 -216 73
$$ packed form
3908a45j21J67J60P0k62j1J83q1K92q8o1M0J60m43k4N65l20l2j62L73k86j21L19
3931A72k69O2n8J31L2q1p3L1K3J49p2Q4N4l48K02N7K95k97m5j7J10p7O3j0j19
3956aj78K09k24J47J22j39j0j30p7L54l48J37K85j73K0L1K7L1j08n1J04J27k02
3979d7nM69l14J26J04k42J52j09R2R7k28j14J05j26j74K47j7j01l12K66q7J30
4001h8k4Jn8K47j19K63j8r8J7RpN3J76m53K20j2j31nK59k04k60J87K95k88j05
4026a43J48l5o6q4K9J83J11l30j7L11J56l21O4J10k93P5K05q1J83k3k89J18P8
4049H9o9K7k06K73j43j54J47P7j66qK1n6J19K55j85k30K50k35J33J87j29K14j25
4072H6K4j30J75q5k28J02R4J32j89LJ4k37L08k9j11k1K04j95K05k36J27k29K89
$$ plain form
4095 73 -166 -35 -167 -414 131 -187 34 -29 47 -184 -135 127 -8 39 114 57 144 50 352 125 37 328 108
4118 108 -30 -58 -4 -13 83 -3 -280 -15 46 -309 26 -87 201 -12 55 -359 -5 -285 113 22 -84 67 -182
4141 -182 213 219 50 83 154 -134 220 -172 -15 -236 -169 -108 26 -202 -291 131 -90 -294 39 -176 -264 -189 -103
4164 -103 -191 80 113 -202 376 184 -265 -60 296 72 203 401 -121 403 -220 -72 154 274 71 -15 -283
4185 -283 -177 -17 -101 -238 93 -1 -219 -72 -133 56 20 -220 -66 -81 43 -185 51 75 -211 46 48 116 259
4208 259 -80 178 -79 409 140 103 -43 281 34 -86 35 -338 -287 83 -109 -244 -100 -331 -12 -7 -270
4229 -270 -111 -457 -1 -96 233 151 -74 -56 -130 207 202 -37 136 78 -71 4 23 110 166 -221 -136 -62 -81 -48 -246
4254 -246 173 -140 -112 -33 -71 -235 -163 -68 201 163 276 -233 301 20 -57 114 -56 124 4 122 90 112 -92
$$ packed form
4095G3k39J31j32k47N45l18K21o3P6k31M9K62j35M7P5n7Q7r4L02k27q8K91k20
4118A08j38k8N4rR6q6k77K65O1l55L35j13K88k13O7m14L54k80L98r1j06J51k49
4141a82L95Oj69L3P1k88L54l92J57k21O7O1J34k28q9M22k21k04L33k15q8P5Q6
4164a03q8K71L3l15N78j92m49K05L56k24J31J98n22N24o23J48K26J20k03q6k68
4185b83J06J60q4j37L31r4k18J47o1J89l6k40J54j5J24k28K36K4k86K57KO8J43
4208B59l39K58k57M88k69l7j46L24k47j20J21l73N1L70j92j35J44k31L19Nk63
4229b70J59l46M56r5L29q2k25J8p4L37nk39J73n8j49P5J9Q7N6l87Q5P4j9L3j98
4254b46M19l13K8P9l8j64P2R5K69l8J13n09N34k81p7J71j70J80j20J18l2K2k04
$$ plain form
4277 -92 311 -38 131 -78 -29 209 -229 58 -317 -32 49 -164 -418 -103 -199 -51 -304 -42 87 -237 96
4298 96 -70 -155 61 167 210 115 74 -81 334 -33 173 -107 -140 -32 197 38 145 -211 167 -134 -72 85
4320 85 -140 -5 -30 25 -29 -169 -68 -171 -295 63 23 -29 332 341 123 140 145 189 133 33 -290 12 -26 153 -105
4345 -105 -319 -19 91 27 -228 26 9 -122 -123 -27 -42 -81 2 -164 -74 158 300 81 -242 -100 154 80 207
4368 207 140 23 -123 156 57 154 215 144 110 -40 -147 -68 -72 -112 -124 -68 -118 349 -132 -163 200 -302 -164 30 -69
4393 -69 101 83 -84 -49 79 109 189 61 225 -96 239 -78 -145 199 50 9 77 -54 -217 -53 -214 160 215
4416 215 -74 1 -95 -200 100 31 -78 -33 172 -311 -28 -111 128 -220 128 28 144 106 -34 185 -176 -32
4438 -32 -206 337 56 79 -25 31 -15 -331 -146 -37 39 -124 -104 186 68 18 -144 -147 -183 26 -152 134 188 -31
$$ packed form
4277i2M03l49J69k09M9K38m38K87l75K85Q1k13k54L15r6J48k53K62J29l24L33
4298I6j66q5K16J06M3r5m1j55M15l67K06k80l3J08K29j59J07l56L78l01O2J57
4320H5k25J35k5N5n4j40J01j03j24L58m0n2L61Rk18J7NM4n6j00l23L02l8J79k58
4345a05k14L00J10o4k55K54j7j31jR6j5l9Q3j66R0K32J42k19l23J42K54p4J27
4368B07o7j17j46K79r9R7O1p1l4j50j07P9mm0j2N6n0M67m81l1L63n02J38J94r9
4393f9J70j8j67L5J28L0Q0j28J64l21L35l17o7L44j49m1O8j31j63J64j61L74N5
4416B15k89P5r6j05L00o9j09M5K05m83K83q3K39l48L48j00J16l8j40K19l61J44
4438c2j74N43k81K3j04N6m6l16J85J09P6j63K0K90j18n0j62ll6K09j78K86N4k19
$$ plain form
4462 -31 235 180 157 45 9 5 -53 121 -83 -39 37 -201 -137 52 -97 45 -264 59 224 -289 -64 -11 -139 77
4486 77 -131 14 -166 -158 52 -121 30 -119 52 -169 73 149 30 153 176 252 130 -78 151 122 -184 -20
4508 -20 -10 9 308 -190 -117 178 38 -266 -72 89 -54 -136 -41 59 -255 -171 -302 -116 -218 22 -58 18 116
4531 116 83 439 316 -213 25 121 116 194 85 -201 -79 124 -63 35 -109 -212 58 -34 -202 -108 -17 -58 223
4554 223 19 67 35 -95 -213 214 41 157 -150 167 -53 161 -4 10 101 -236 120 240 109 -131 -92 302
4576 302 -104 -98 -170 -229 61 -10 93 -25 -224 -181 204 116 -216 70 -150 -19 197 133 64 73 -108 207 -60 50
4600 50 21 -139 64 61 -101 -168 15 20 -136 185 -215 -26 29 13 -101 85 170 17 -52 -37 67 79 111 164 -8
4625 -8 64 180 -79 110 38 54 224 92 67 43 -100 128 -96 -257 39 -212 62 -112 -204 -240 -95 239 15
$$ packed form
4462c1K66n5k3j12l6mn8J74k04M4P6k38O4J89j49J42l09L23J65n13K25N3j28K16
4486G7k08J45j80QK10j73J51j49J71k21K42P6j19J23K3P6j22k08K29k9l06J64
4508b0J0J9K99m98P3K95j40l04J94J61j43q2R5J00l14Q4j31J86j02K40q0P6R8
4531A16l3L56j23n29K38R6nP8j09k86J22K03j87R8j44j03K70r2j68R4R1m1K81
4554B23k04M8l2j30j18M27j73J16l07L17k20K14j65J4R1l37L56J20j31k40L9L94
4576C02m06Op2n9K90p1J03j18j99M3L85q8l32K86k20J31K16o4o9Rj81L15k67J10
4600E0k9j60K03lj62o7J83Nj56L21m00J89N5j6j14J86Q5j53o9J5J04J2L2N3j72
4625hP2J16k59J89p2J6J70j32k5k4j43K28k24j61K96k51K74j74r2l6J45L34k24
$$ plain form
4648 15 53 -58 26 29 33 256 29 107 -32 -68 -270 359 -323 -103 307 -110 115 -167 73 194 -223 220 -374
4671 -374 -309 67 55 -145 -101 28 -275 -165 40 -135 -330 -96 -80 82 -44 31 -2 -14 160 444 -135 94
4693 94 295 189 -72 120 -145 66 -96 -49 -132 -181 59 -141 73 -97 11 -175 44 -137 -167 -8 80 -172
4715 -172 -18 -112 -15 86 -71 -107 171 209 124 26 82 16 -195 -16 315 -97 -76 -256 -113 154 -180 126 -31
4738 -31 -52 -290 -36 -158 -124 -134 -103 83 74 188 -71 95 4 320 344 190 187 82 292 -141 -200 -65 71 4
4762 4 4 71 10 -244 -67 -30 -230 -45 -388 -210 40 40 -330 60 -117 73 -261 31 -21 -9 -43 -41 63 50 139
4787 139 -8 130 181 105 -51 -136 165 244 84 148 -100 -106 -31 85 12 -110 -228 -232 -168 -124 24 -91 -114 81 -49
4812 -49 16 -166 171 -88 83 10 69 57 5 190 174 85 120 105 -220 -57 98 88 103 1 -224 56 -13 -183
$$ packed form
4648A5L8j11Q4LMK23k27P8j39l6k02O29o82K20M10m17K25k82K40J21m17M43n94
4671c74O5L76j2k00M4J29l03J10K05j75j95K34J6J62j26P5l3j2J74K84n79K29
4693I4K01j06k61J92k65K11j62M7q3m9K40k00K14j70J08j86K19j81l0J59Q8k52
4715a72J54r4R7J01j57l6K78L8q5r8N6o6k11J79L31m12K1j80J43K67l34L06j57
4738c1k1k38K54j22L4j0L1J86rJ14k59J66r1L16K4j54lj05K10m33n9J35J36o7
4762D%O7o1k54J77L7k00J85l43J78K50%l70L90j77J90l34K92n2J2l4KJ04j3Q9
4787A39j47J38N1p6j56q5L01P9j60O4k48oP5J16p3j22j18mO4M4J48j15k3J95j30
4812d9O5j82L37k59J71p3N9j2n2J85j6q9L5j5l25J63J55j0J5j02k25K80o9j70
$$ plain form
4836 -183 -21 1 70 159 -54 -126 343 46 161 -219 123 207 0 -70 -5 -97 104 -117 137 79 12 61 19 92
4860 92 -62 295 81 -47 -21 -85 -155 -89 87 256 154 -35 -225 -131 93 -224 -126 -143 -47 -16 139 -37 41 316
4884 316 34 -12 137 217 303 44 221 184 -86 -98 -31 -173 90 39 -40 -234 -321 -226 -276 -57 -133 -167 92 -124
4908 -124 97 -59 -50 60 -145 232 178 327 -51 129 35 49 -6 -45 -32 7 -35 -14 164 262 251 -321 86 22 -242
4933 -242 25 -63 -78 61 -112 157 -308 -2 39 296 75 74 116 -261 97 155 -219 -84 -44 278 292 -275 -257
4956 -257 -367 -291 -5 -107 -5 53 -276 94 27 -1 135 34 -222 120 56 74 -181 -28 -52 -150 52 -3 58
4979 58 -84 -25 180 48 -86 -122 93 29 23 202 -197 -59 -16 47 53 -29 105 -98 -382 -2 -30 -113 79 30 -60
5004 -60 85 -186 167 65 -100 -52 129 95 282 -89 -125 210 49 -252 83 -128 -235 -72 147 -229 -188 -327
$$ packed form
4836a83J62K2O9Q9k13p2M69k97J15l80L42Q4k07p0O5r2K01k21K54n8o7M9m2P3
4860I2j54L57k14j28K6o4p0O6J76J69j02j89j90R4K24l17R8j7R6L1J55j76P8K75
4884C16k82m6J49Q0Q6k59J77l7k70j2O7j42K63n1p9j94q7R5n0K19p6l4K59k16
4908a24K21j56RJ10k05L77n4J49l78J80r4J4n5l9J3L9m2K1J78R8j1n72M07o4k64
4933b42K67q8j5J39j73K69m65L06M1K57k21jM2l77L58N8l74J35M0L22J4n67J8
4956b57j10P6K86j02J02N8l29L70o7k8J36j01k56L42o4J8k55J53k4r8K02n5O1
4979E8j42N9K05j32j34l6K15o4oJ79l99J38M3O3Oq2J34k03k84L80k8q3J92m9r0
5004f0J45k71L53j02j65M8J81l4J87l71l6L35j61l01L35k11j07J63K19l76M1j39
$$ plain form
5026 -327 14 5 111 56 -109 189 -25 57 -80 6 114 -53 -64 325 113 6 -200 -65 113 77 23 128 -42
5049 -42 29 95 14 122 57 -125 -156 108 11 -77 11 -91 151 23 142 3 30 -38 -255 154 -94 54 42 -5
5073 -5 -93 62 151 -132 -34 221 -220 -103 121 120 235 -205 -33 -183 -100 45 -8 76 -349 -42 117 0 38 -95
5097 -95 -91 40 -118 48 -53 -51 44 -19 91 -35 -48 -247 148 18 132 52 -150 -71 -17 -29 144 112 28 -103 -40
5122 -40 -93 143 120 159 11 -57 86 194 -193 -47 -108 -122 -101 181 -141 -15 21 61 67 -131 193 61 91 8 24
5147 24 22 22 -6 -172 29 -50 148 129 36 -164 -214 -79 94 -51 -266 -129 -19 -271 143 -95 144 163 -116 49
5171 49 136 21 -87 78 41 212 -118 189 245 93 48 -52 -84 103 -44 -189 -219 29 26 26 -33 -143 89 136
5195 136 -116 -59 -65 -231 -243 28 155 112 -47 46 -146 -31 -15 27 -45 -73 43 58 -89 112 -71 -53 -159 68
$$ packed form
5026c27L41rJ06n5j65K98k14Q2j37Q6J08j67j1L89k12j07k06J35J78l6n4J05j70
5049d2P1O6q1J08o5j82l1K64r7q8Q8j02K42j28J19j39K7o8k17M09k48J48j2m7
5073eq8J55Q9k83R8K55m41J17K24jJ15m40J72j50Q3J45n3Q4m25L07J59j17L8j33
5097i5MJ31j58J66j01KR5o3J10j26j3j99L95j30J14q0k02P9N4j2J73l2q4j31O3
5122d0n3K36k3L9j48o8J43J08l87J46o1j4K1K82l22J26L6M0Oj98L24j32L0q3J6
5147B4k%k8j66K01p9J98j9r3k00n0J35J73j45k15J37J10k52M14k38K39J9k79J65
5171D9Q7j15j08J65l7J71l30L07N6j52m5j00l2J87j47j45l0K48l%n9j10K32M7
5195A36k52N7oj66j2K71J27m3j59R3j92J15J6M2p2k8J16J5j47K01j83J8j06K27
$$ plain form
5219 68 -1 25 0 11 8 -15 159 -290 -177 -140 1 -129 58 26 293 19 -191 0 36 -92 180 134 -86 146
5243 146 -103 -31 75 117 -197 -139 -16 15 -138 -144 -141 159 23 -73 -41 87 -279 -23 -317 -87 -10 -47 -28 146
5267 146 3 67 -191 125 -262 30 53 258 190 2 13 -140 -41 -18 -52 -33 37 64 31 63 -77 -156 169 -208
5291 -208 26 56 77 110 -43 -125 71 -36 142 124 142 -252 179 -32 -7 80 137 -133 167 120 191 -283 -113 35
5315 35 -69 -110 -91 -281 67 -175 13 -58 32 -19 -248 -110 -82 -178 -86 43 -83 149 89 -21 1 -40 122 122 221
5340 221 210 -203 368 41 -2 75 -174 231 39 -269 53 -63 32 183 -2 -82 15 33 89 -114 60 21 -105
5363 -105 -242 -31 118 -41 -19 206 3 -91 43 19 -47 51 216 266 149 85 -5 -11 -70 -133 136 -11 -128 -143
5387 -143 177 -106 -156 36 51 -36 -27 -163 17 86 -136 -79 41 48 82 -28 276 60 122 -34 253 95 -53 -87
$$ packed form
5219F8o9K6k5J1lk3J74m49J13L7J41j30J87l2K67k74k10J91L6j28K72m6k20K32
5243A46k49P2J06M2l14N8J23L1j53oLL00j36r6L2J28l66K56k94K30P7l7J9J74
5267A46j43O4k58L16l87K92K3K05o8j88J1j53R9K3l4J9P0K7l3L2j40p9L25l77
5291b08K34L0K1L3j53q2J96j07J78j8J8l94M31k11K5Q7N7k70L00m7P1m74J70J48
5315C5j04m1J9j90L48k42J88p1R0n1k29J38K8r6R2J29j26K32o0j10K2m1J62%R9
5340B21j1m13N71l27m3P7k49M05j92l08L22j16R5J51j85q0R7J8N6k03J74l9j26
5363a05j37K11J49j59K2K25k03r4J34k4o6R8J65N0j17o4r0on9o3K69j47j17j5
5387a43L20k83n0J92J5q7Rj36J80O9k22N7J20PL4j10L04k16O2j56K87j58j48l4
$$ plain form
5411 -87 -230 13 -108 -35 -155 77 -113 3 -52 11 72 78 -117 -191 58 76 4 -8 5 -61 166 305 102 -218
5435 -218 -299 336 289 39 228 -173 -227 -80 51 280 -109 -174 -87 -207 32 1 -102 -110 82 40 23 -330 -215
5458 -215 -57 -71 50 16 -72 -41 108 12 282 5 63 79 31 90 -16 -13 14 75 -103 -84 199 -89 119 -142 -214
5483 -214 -224 -156 -149 212 -41 -42 22 -110 -53 -81 4 88 48 -119 75 23 -172 71 1 165 -255 54 163 222 10
5508 10 49 -199 -229 -101 3 240 -3 -117 -240 99 18 56 -34 -77 -44 -177 -121 222 2 163 -9 23 248
5531 248 99 -76 -150 211 -157 -123 -51 -13 -20 -18 -49 -25 -37 -145 -45 -101 -12 152 170 15 121 -63 28 255 -141
5556 -141 150 92 -63 67 153 5 -121 82 173 -147 71 34 -95 178 -152 140 -39 39 229 -236 -9 -129
5578 -129 -214 -141 230 -113 20 -1 120 96 182 186 -3 11 238 -212 25 74 -21 -36 230 153 -181 135 -237 13
$$ packed form
5411h7j43K43j21P3j20K32j90J16n5O3O1Oj95p4K49J8p2j2J3o6K27J39k03l20
5435b18q1O35m7k50J89m01n4J47J31K29l89o5Q7j20K39l1j03qJ92m2j7l53J15
5458b15J58j4J21l4q8L1J49r6K70k77N8J6m8N9j06LK7O1j78J9K83k88K08k61p2
5483b14j0O8PL61k53jO4j32N7k8Q5Q4m0j67J94n2j95K43p0J64m20L09J09N9k12
5508A0L9k48l0J28J04K37k43j14j23L39q1L8r0m3L3j33N6L43k20J61j72L2K25
5531B48j49j75p4L61l68L4P2L8pKl1K4j2j08J00n6Q9J64J8j55J06j84R1K27l96
5556a41K91n8j55J30Q6j48j26K03R1l20K18l7j29K73l30K92j79P8J90m65K27j20
5578a29q5P3L71l43J33k1J21k4Q6Mj89J4K27m50K37M9r5j5K66p7l34L16l72K50
$$ plain form
5602 13 -74 222 -102 -93 99 -116 48 -48 -72 -39 -200 -122 -171 -54 -7 -38 -286 256 192 217 -88 86 -164 6
5626 6 54 -293 -54 -59 211 -202 105 -53 29 -28 -24 27 -27 65 -45 -224 -155 -9 103 -64 -64 -114 99 41 153 35
5652 35 -23 -20 35 295 118 16 165 -143 -135 187 163 -151 -15 -132 -199 49 175 -29 -23 -135 -248 123 144 61
5676 61 -144 -62 -43 30 -70 14 -27 99 -145 -95 169 257 27 22 95 -239 41 281 -34 -166 -2 165 -9 -305
5700 -305 -173 5 -52 57 -51 80 34 103 -6 31 -65 246 358 139 207 72 -214 -133 173 -65 195 11
5722 11 33 11 51 -48 65 192 86 25 -187 223 -11 -91 -25 -133 148 -104 36 217 -326 90 1 23 -73 -200
5746 -200 36 18 -160 85 97 -18 124 -52 -34 87 40 26 65 8 69 77 74 94 15 -179 -29 -315 -44 -187 33
5771 33 75 -52 -52 7 27 -147 267 153 -122 19 -85 43 -59 -99 71 105 -111 -87 114 -217 -126 -254 -189 22
$$ packed form
5602A3q7K96l24RJ92k15J64r6k4L3j61P8m9J17M7l1k48N42o4K5l05J74k50J70
5626FM8l47K39nK70m13L07j58Q2n7MN1n4R2j10j79O9J46J12j67%n0K13n8J12j18
5652C5n8LN5K60j77j02J49l08QL22k4l14J36j17o7K48J26k04Oj12j13L71K1q3
5676F1k05Q2J9P3j00Q4m1J26k44N0K64Q8k30nP3l34K80K40l15j32J64J67j74k96
5700c05J32J78n7J09j08J31m6O9j09L7r6L11J12k19O8j35k86Q1L06k38K60j84
5722A1K2k2M0r9J13J27j06o1k12M10k34q0O6j08K81k52J40J81n43M16q9K2r6j27
5746b00K36j8j78K45J2j15J42j76J8J21m7j4L9n7O1QlK0p9j94J50k86K71j43K20
5771C3M2j27%N9K0j74M14j14k75J41j04J28j02m0J70L4k16K4K01l31R1j28O5K11
$$ plain form
5795 22 208 -111 -33 -216 -42 -154 40 -285 -33 46 -27 -98 -32 47 78 66 58 99 -13 121 265 57 -80 -48
5819 -48 30 128 -139 -63 15 -40 203 -45 221 262 -35 -167 -25 -191 -112 116 -8 43 -5 24 63 -84 18 142
5843 142 149 -116 -205 317 4 -126 -212 238 -20 83 -116 320 -111 -108 204 -67 -291 -48 -30 -22 -56 -162 183
5866 183 -87 226 -477 69 28 -170 -9 194 -148 -8 294 124 -89 -339 51 53 157 156 179 50 -35 117
5888 117 -125 -78 114 -101 -109 0 112 -304 -351 -119 46 379 -129 -20 120 -131 -166 -198 -98 106 4 184
5910 184 -178 -35 159 240 155 -55 123 -176 -3 16 326 250 155 -42 -37 -87 84 -122 10 -218 -156 -286 -2
5933 -2 17 90 -142 -250 -7 -285 -213 83 92 4 130 -43 334 194 73 -133 8 66 246 -21 167 -98 60
5956 60 -123 151 229 -179 -145 -112 -76 145 -12 309 -116 189 -8 -21 253 -107 67 203 -216 56 262 70
$$ packed form
5795B2J86l19P8j83J74j12J94l25K52P9p3p1O6P9L1j2qM1j12J34J44k08j37L2
5819d8P8R8k67P6P8n5K43k48K66M1k97j32J42j66P9K28j24N1m8K9L9j47J02J24
5843A42Pk65q9N22l13j30q6M50k58J03j99M36m31LL12k71k24K43J8Ql4j06L45
5866A83k70L13p03N46m1j98J61K03l42J40L02j70k13k50L90KJ04jK3j29q5J52
5888A17k42M7J92k15qJ09J12m16m7K32J65L33n08J09J40k51l5l2J00K04j02J80
5910A84l62J43J94Q1q5k10J78k99J73J9L10p6r5j97Nn0J71k06J32k28O2j30K84
5933bJ9P3k32j08K43k78P2K96Rq8J26j73L77j40j21k06J41N8J80k67J88k65J58
5956F0j83K74P8m08L4L3L6K21j57L21m25L05j97j3K74l60J74J36m19K72K06j92
$$ plain form
5978 70 129 -87 8 -59 220 180 42 77 -203 -136 77 -63 59 69 113 51 103 183 -18 222 82 -41 31 -96
6002 -96 88 82 62 -72 62 46 22 13 -66 162 -61 -181 -27 -139 -80 34 -101 47 67 -10 -251 -52 76 -3
6026 -3 191 136 19 -6 -71 258 -28 122 2 40 -132 -194 72 84 -71 -182 -96 135 -333 -96 97 176 115 35
6050 35 309 -119 87 -45 -9 -21 -168 190 159 -1 -26 -21 -239 -221 -160 -203 -73 -130 -37 -68 199 237 271 31 121
$$ packed form
5978G0N9k16R5o7K79m0j38L5k80O7K13j40J22J0M4o2N2Q0k01K40j40j23P2j27
6002i6J84ok0j34J34j6k4rp9K28k23j20J54j12N9J14j35J48K0p7k41J99J28p9
6026cJ94n5j17k5o5L29k86J50j20L8j72o2K66J2j55j11Q6K31m68K37J93P9o1q0
6050C5K74m28K06j32L6j2j47L58l1j60k5Nk18J8O1m3J30n7R3l1K67L8L4k40R0
$$ [...]
8191e6
##END NTUPLES=NMR FID
##END=
