##TITLE=1H_Ser ABuN
 200.13Hz, CD3OD.
 8 sc
 
27.3.2026
##JCAMPDX= 6.0         $$ Bruker NMR JCAMP-DX V2.0
##DATA TYPE= NMR FID
##DATA CLASS= NTUPLES
##ORIGIN= UXNMR, Bruker Analytische Messtechnik GmbH
##OWNER= pz
$$ XWIN-NMR		Version 3.5
$$ Fri Mar 27 15:18:08 2026 Russian Standard Time (UT+4h)  she@DPX200
##.OBSERVE FREQUENCY= 200.1313
##.OBSERVE NUCLEUS= ^1H
##.DELAY= (6, 6)
##.ACQUISITION MODE= SIMULTANEOUS
##.ACQUISITION SCHEME= undefined
##.AVERAGES= 8
##.DIGITISER RES= 18
##SPECTROMETER/DATA SYSTEM= spect
##.PULSE SEQUENCE= zg30
##.SOLVENT NAME= CDCl3
##.SHIFT REFERENCE= (INTERNAL, CDCl3, 0, 14.3821)
##AUDIT TRAIL= $$ (NUMBER, WHEN, WHO, WHERE, WHAT)
$$ ##TITLE= Audit trail, XWIN-NMR		Version 3.5
$$ ##JCAMPDX= 5.01
$$ ##ORIGIN= Bruker BioSpin GmbH
$$ ##OWNER= she
$$ F:/spectra/data/she/nmr/H-C/1/audita.txt
$$ ##AUDIT TRAIL=  $$ (NUMBER, WHEN, WHO, WHERE, WHAT)
(   1,<2026-03-27 15:15:37.04 +0400>,<she>,<DPX200>,
      <created by zg, POWCHK disabled, PULCHK disabled
       configuration hash MD5:
       00 E9 B6 7A A2 85 ED C7 34 08 36 98 17 FE 4E 26
       data hash MD5: 16K
       E5 A5 2E 07 09 99 12 67 54 B9 31 B4 B5 2C 5B 81>)
$$ ##END=
$$ 
$$ hash MD5
$$ F5 38 3A 7C EF A4 BB 9C FC BE 6B 85 98 84 EA A0
##$RELAX= 
##$RELAX= 
##$RELAX= 
##$RELAX= 
##$RELAX= 
##$RELAX= 
$$ Bruker specific parameters
$$ --------------------------
##$DU= <F:/spectra>
##$EXPNO= 1
##$NAME= <H-C>
##$PROCNO= 1
##$TYPE= <nmr>
##$USER= <she>
##$AMP= (0..31)
100 100 100 100 100 100 100 100 100 100 100 100 100 100 100 100 100 100 
100 100 100 100 100 100 100 100 100 100 100 100 100 100 
##$AQSEQ= 0
##$AQ_mod= 1
##$AUNM= <au_zg>
##$AUTOPOS= <>
##$BF1= 200.13
##$BF2= 200.13
##$BF3= 200.13
##$BF4= 200.13
##$BF5= 200.13
##$BF6= 200.13
##$BF7= 200.13
##$BF8= 200.13
##$BYTORDA= 1
##$CFDGTYP= 0
##$CFRGTYP= 5
##$CHEMSTR= <none>
##$CNST= (0..31)
1 1 145 1 1 1 1 1 1 1 1 1 1 1 1 1 1 1 1 1 1 1 1 1 1 1 1 1 1 1 1 1 
##$CPDPRG= <>
##$CPDPRG1= <>
##$CPDPRG2= <>
##$CPDPRG3= <>
##$CPDPRG4= <mlev>
##$CPDPRG5= <mlev>
##$CPDPRG6= <mlev>
##$CPDPRG7= <mlev>
##$CPDPRG8= <mlev>
##$CPDPRGB= <>
##$CPDPRGT= <>
##$D= (0..31)
0 0.7 0 0 0 0 0 0 0 0 0 0.03 0 0 0 0 0 0 0 0 0 0 0 0 0 0 0 0 0 0 0 0 
##$DATE= 1774610136
##$DBL= (0..7)
120 120 120 120 120 120 120 120 
##$DBP= (0..7)
150 150 150 150 150 150 150 150 
##$DBP07= 0
##$DBPNAM0= <>
##$DBPNAM1= <>
##$DBPNAM2= <>
##$DBPNAM3= <>
##$DBPNAM4= <>
##$DBPNAM5= <>
##$DBPNAM6= <>
##$DBPNAM7= <>
##$DBPOAL= (0..7)
0.5 0.5 0.5 0.5 0.5 0.5 0.5 0.5 
##$DBPOFFS= (0..7)
0 0 0 0 0 0 0 0 
##$DE= 6
##$DECBNUC= <off>
##$DECIM= 32
##$DECNUC= <off>
##$DECSTAT= 4
##$DIGMOD= 1
##$DIGTYP= 9
##$DL= (0..7)
0 120 120 120 120 120 120 120 
##$DP= (0..7)
150 150 150 150 150 150 150 150 
##$DP07= 0
##$DPNAME0= <>
##$DPNAME1= <>
##$DPNAME2= <>
##$DPNAME3= <>
##$DPNAME4= <>
##$DPNAME5= <>
##$DPNAME6= <>
##$DPNAME7= <>
##$DPOAL= (0..7)
0.5 0.5 0.5 0.5 0.5 0.5 0.5 0.5 
##$DPOFFS= (0..7)
0 0 0 0 0 0 0 0 
##$DQDMODE= 0
##$DR= 18
##$DS= 0
##$DSLIST= <SSSSSSSSSSSSSSS>
$$ [...]
##$SUBNAM0= <"">
##$SUBNAM1= <"">
##$SUBNAM2= <"">
##$SUBNAM3= <"">
##$SUBNAM4= <"">
##$SUBNAM5= <"">
##$SUBNAM6= <"">
##$SUBNAM7= <"">
##$SUBNAM8= <"">
##$SUBNAM9= <"">
##$SW= 18.0517328524113
##$SWIBOX= (0..15)
0 0 2 0 0 0 0 0 0 0 0 0 0 0 0 0 
##$SW_h= 3612.71676300578
##$TD= 16384
##$TD0= 1
##$TE= 0
##$TE2= 300
##$TE3= 300
##$TEG= 300
##$TL= (0..7)
0 120 120 120 120 120 120 120 
##$TP= (0..7)
150 150 150 150 150 150 150 150 
##$TP07= 0
##$TPNAME0= <>
##$TPNAME1= <>
##$TPNAME2= <>
##$TPNAME3= <>
##$TPNAME4= <>
##$TPNAME5= <>
##$TPNAME6= <>
##$TPNAME7= <>
##$TPOAL= (0..7)
0.5 0.5 0.5 0.5 0.5 0.5 0.5 0.5 
##$TPOFFS= (0..7)
0 0 0 0 0 0 0 0 
##$TUNHIN= 0
##$TUNHOUT= 0
##$TUNXOUT= 0
##$USERA1= <user>
##$USERA2= <user>
##$USERA3= <user>
##$USERA4= <user>
##$USERA5= <user>
##$V9= 5
##$VALIST= <valist>
##$VCLIST= <CCCCCCCCCCCCCCC>
##$VD= 0
##$VDLIST= <DDDDDDDDDDDDDDD>
##$VPLIST= <PPPPPPPPPPPPPPP>
##$VTLIST= <TTTTTTTTTTTTTTT>
##$WBST= 1024
##$WBSW= 4
##$XGAIN= (0..3)
0 0 0 0 
##$XL= 0
##$YL= 0
##$YMAX_a= 194837
##$YMIN_a= -260516
##$ZGOPTNS= <>
##$ZL1= 120
##$ZL2= 120
##$ZL3= 120
##$ZL4= 120
##$ABSF1= 10
##$ABSF2= 0
##$ABSG= 5
##$ABSL= 3
##$ALPHA= 0
##$AQORDER= 0
##$ASSFAC= 0
##$ASSFACI= 0
##$ASSFACX= 0
##$ASSWID= 0
##$AUNMP= <proc_1d>
##$AZFE= 0.1
##$AZFW= 0.1
##$BCFW= 1
##$BC_mod= 2
##$BYTORDP= 1
##$COROFFS= 0
##$CY= -3
##$DATMOD= 1
##$DC= 2
##$DFILT= <>
##$DTYPP= 0
##$F1P= 0
##$F2P= 0
##$FCOR= 0.5
##$FTSIZE= 0
##$FT_mod= 4
##$GAMMA= 1
##$GB= 0.15
##$INTBC= 1
##$INTSCL= 1
##$ISEN= 128
##$LB= 0.25
##$LEV0= 0
##$LPBIN= 0
##$MAXI= 10000
##$MC2= 0
##$MEAN= 0
##$ME_mod= 0
##$MI= 1.114404
##$NCOEF= 0
##$NC_proc= 0
##$NLEV= 6
##$NOISF1= 3.799351
##$NOISF2= 2.8
##$NSP= 1
##$NTH_PI= 0
##$NZP= 0
##$OFFSET= 14.38212
##$PC= 1
##$PHC0= -3720.406
##$PHC1= 24.3923
##$PH_mod= 1
##$PKNL= yes
##$PPARMOD= 0
##$PSCAL= 0
##$PSIGN= 0
##$REVERSE= no
##$SF= 200.129724274929
##$SI= 16384
##$SIGF1= 3
##$SIGF2= 2
##$SINO= 400
##$SIOLD= 16384
##$SREGLST= <1H.CDCl3>
##$SSB= 0
##$STSI= 0
##$STSR= 0
##$SW_p= 3205.1282051282
##$SYMM= 0
##$S_DEV= 0
##$TDeff= 0
##$TDoff= 0
##$TI= <>
##$TILT= no
##$TM1= 0
##$TM2= 0
##$TOPLEV= 0
##$USERP1= <user>
##$USERP2= <user>
##$USERP3= <user>
##$USERP4= <user>
##$USERP5= <user>
##$WDW= 1
##$XDIM= 8192
##$YMAX_p= 0
##$YMIN_p= 0
$$ End of Bruker specific parameters
$$ ---------------------------------
##NTUPLES= NMR FID
##VAR_NAME=  TIME,          FID/REAL,        FID/IMAG
##SYMBOL=    X,             R,               I
##VAR_TYPE=  INDEPENDENT,   DEPENDENT,       DEPENDENT
##VAR_FORM=  AFFN,          ASDF,            ASDF
##VAR_DIM=   8192,          8192,            8192
##UNITS=     SECONDS,       ARBITRARY UNITS, ARBITRARY UNITS
##FACTOR=    0.0002768,     1,               1
##FIRST=     0,             0,               0
##LAST=      2.2672688,     0,               0
##MIN=       0,             -260516,         0
##MAX=       2.2672688,     194837,          0
$$ Real data points
##PAGE= N=1
##DATA TABLE= (X++(R..R)), XYDATA
0 0 0 0 0 0 0 0 0 0 0 0 0 0 0 0 0 -8 8 -8 8 -8 8 -13 16 -16 17 -24 24 -29 32 -37 41 -46 53 -61 69 -77 85 -93
38 -93 102 -115 127 -140 155 -170 187 -209 229 -252 276 -304 336 -370 408 -452 501 -558 624 -702
58 -702 794 -906 1048 -1228 1468 -1798 2280 -3039 4369 -7122 14896 -77869 -260516 42950
72 42950 63955 37554 98133 -88918 -94222 2734 4211 129222 36449 -150364 -21255 40141
84 40141 -15901 76198 39949 -100579 -38987 28977 6428 61009 18883 -73337 -18094 -24373
96 -24373 16039 126327 -33873 -100955 28278 -34965 17152 123101 -34095 -76032 -34034
107 -34034 -25968 108887 72337 -72862 -52459 -58533 11555 149166 30320 -117071 -61933
118 -61933 8472 51709 80532 4990 -88053 -63001 16173 83852 67957 -70635 -75004 34523
130 34523 -7533 11961 88984 -31683 -83181 -4850 16499 56040 27449 -41395 -17662 -41029
142 -41029 -10145 101755 27517 -66703 -28358 -27742 7016 90149 36866 -68249 -72285 -9987
154 -9987 64727 75102 -11588 -65617 -51069 -15021 83965 94397 -61995 -96724 -7980 27947
166 27947 72952 41423 -66950 -62459 -11002 43895 80020 -13219 -64724 -13747 -14264 22630
178 22630 73316 -864 -61865 -34069 6318 42012 35775 -4968 -27884 -43406 -21967 57246
190 57246 67871 -23450 -62615 -28889 5425 54697 52559 -24477 -60661 -43346 19497 85655
202 85655 31921 -53552 -57015 -28681 43078 84573 1263 -65456 -46360 -3581 52144 59365
214 59365 -8380 -60528 -48099 16159 65730 32374 -30421 -42077 -24173 5534 52290 40733
226 40733 -32204 -50285 -16341 16390 46113 27703 -22847 -45361 -35407 27577 70209 10821
238 10821 -43538 -39561 -21147 32299 64347 12916 -49779 -60963 -4573 67327 50727 -21206
250 -21206 -51598 -39242 8215 61735 43240 -28176 -60262 -31435 30701 64449 18328 -42357
262 -42357 -46116 -14219 33282 53075 7594 -39225 -42087 -11334 42005 49414 -6521 -40753 -33546
275 -33546 -2662 39792 40774 -3966 -41692 -42287 6863 54753 32938 -19065 -42874 -34004 13911
288 13911 56605 30872 -28492 -54598 -24788 36336 54864 9725 -35501 -46388 -16299 42583
300 42583 54428 -1216 -48041 -42317 5018 49469 36377 -13198 -42685 -34788 10909 51317
312 51317 30226 -21984 -46633 -25407 24779 47256 15982 -24065 -40755 -21825 27362 48968
324 48968 12710 -34092 -44536 -8304 38926 40764 924 -34478 -40887 -4238 45108 42228 -10274
337 -10274 -47220 -33385 15061 46357 27106 -16540 -44817 -30574 23822 52667 17634 -31429
349 -31429 -44504 -13684 32467 43314 7756 -33252 -42761 -6473 41117 40498 -4854 -39536 -33607
362 -33607 5291 40039 32581 -9543 -40811 -31188 13680 45040 25078 -19501 -41978 -21895
374 -21895 21918 42223 17842 -23082 -43118 -17620 32009 44096 6526 -33677 -38096 -4191
386 -4191 34343 37860 1528 -38105 -38514 5330 44656 32447 -14645 -40930 -25617 13180 41978
399 41978 26626 -19475 -44826 -21242 26993 43368 11167 -27540 -36887 -11701 27799 39993
411 39993 8079 -33635 -38359 -564 35017 32974 -1751 -35036 -32563 4658 37878 31194 -10544
424 -10544 -40034 -25779 14303 40103 22806 -19083 -38608 -19654 20207 41462 16984 -26063
436 -26063 -41183 -12182 31950 38672 4647 -30594 -35781 -4121 34487 36835 -1355 -39942 -32263
449 -32263 10986 37528 25025 -10828 -35653 -24358 12042 38369 23896 -19740 -38526 -15904
461 -15904 20059 36243 14233 -22341 -35622 -13956 25681 38987 7901 -31202 -35049 -1617
473 -1617 30114 31382 3395 -33678 -35194 6346 37573 27588 -9723 -36290 -24045 10056 37267
486 37267 27434 -19501 -41310 -15325 20783 38060 14547 -27227 -34544 -8180 25021 35001 5429
499 5429 -28003 -31268 -3888 30174 31892 -2174 -31456 -26297 4550 28514 26553 -2836 -33852
512 -33852 -27657 9000 36630 25549 -16587 -37368 -16670 15547 36771 18936 -24091 -36313
524 -36313 -12058 23841 39144 7476 -31808 -32538 -2912 31126 33023 -3545 -34150 -27628 7585
537 7585 33600 23284 -9931 -32116 -22182 11648 35263 19452 -20483 -32733 -8627 15195
549 15195 27331 16231 -20018 -32933 -8027 20705 30379 7640 -24621 -28545 -6382 25817
561 25817 33957 -1740 -30891 -23709 -411 28539 32815 -6384 -38254 -25651 14497 38860 17463
574 17463 -20815 -31134 -14439 16765 35959 12719 -25819 -32217 -4787 25889 28801 -278
586 -278 -25501 -23337 -964 24654 25500 -3354 -25430 -21295 559 27950 25866 -9038 -29449
599 -29449 -19826 8929 32314 16933 -14415 -26686 -18326 12382 34831 15651 -19955 -35362
611 -35362 -12402 27864 32898 3933 -25891 -32620 -1640 33014 27521 -4707 -30798 -26334 7665
624 7665 34982 22363 -16992 -33911 -10843 17349 23990 10392 -11686 -25326 -14376 16060
636 16060 29276 7692 -18893 -24021 -7221 17261 24415 7041 -18521 -26876 -5143 22672 25515
649 25515 2526 -24388 -26702 1095 28410 25222 -7186 -29822 -19119 7502 29095 22345 -13246
662 -13246 -34485 -16755 19904 36133 8434 -27303 -27044 -2406 23215 26386 -922 -24073 -21549
675 -21549 554 24760 21387 -6366 -22679 -17372 4187 23507 15725 -6458 -18727 -17268 1255
688 1255 24995 21283 -8980 -28638 -16989 13041 29130 12536 -15705 -26067 -12777 17041
700 17041 30629 7926 -21549 -28975 -6975 28135 29511 -4192 -28017 -23544 6062 30454 17659
713 17659 -10293 -25627 -18683 12398 30798 11121 -16961 -25538 -8126 18683 22196 2754 -14646
726 -14646 -18868 -6539 14874 21486 5141 -16534 -22215 -3380 20059 19849 558 -18043 -21756
739 -21756 -456 23330 19909 -2521 -23274 -22766 6899 29588 16931 -12574 -28247 -13025 16074
752 16074 25605 10085 -15651 -27838 -7934 21939 25507 2331 -22723 -23195 2836 23594 16903
765 16903 -4578 -20097 -16098 3655 20463 16068 -5311 -21980 -15005 8951 21288 11296 -8144
778 -8144 -19731 -12741 8769 22188 12003 -11018 -23667 -11415 15361 26107 6762 -19386
790 -19386 -23511 -2726 20349 21352 990 -21302 -22652 2331 25873 18906 -8199 -25212 -15029
803 -15029 11056 24279 10910 -12634 -22203 -8749 13582 21054 7489 -14052 -21403 -4804 16701
816 16701 18784 1673 -15028 -16669 -2403 15009 17870 1964 -16790 -18172 449 18588 17350
829 17350 -2561 -20083 -15835 5096 20066 14929 -6320 -21807 -13867 9749 22859 11428 -13226
842 -13226 -22822 -6699 15194 20953 4642 -16883 -19361 -1601 16601 18617 415 -19663 -16548
855 -16548 3883 18253 14556 -5166 -18442 -11930 5302 17444 12727 -7078 -18963 -9769 8011
868 8011 18732 9642 -11071 -18571 -6642 11157 18333 6063 -13364 -18101 -4473 14591 19492
881 19492 1357 -17850 -16021 911 16877 16443 -3649 -19150 -12970 4529 18910 13868 -8714
894 -8714 -19418 -9100 8220 19169 8682 -12236 -17189 -5669 10578 17957 5042 -13579 -16062
907 -16062 -3560 13343 16912 1067 -15181 -14554 -459 14811 15386 -2151 -16540 -12655 2397
920 2397 16830 13880 -6709 -17665 -9594 5738 18108 10025 -10084 -16270 -7829 8320 19036
933 19036 6248 -12810 -15834 -5319 12526 17551 1417 -13783 -15261 -1781 15491 15186 -1861
946 -1861 -15550 -12979 2636 16335 12088 -5555 -16274 -9640 4931 16154 10367 -8487 -15478
959 -15478 -8114 7306 18087 5862 -11417 -13958 -6069 11156 17602 1524 -12825 -14247 -2336
972 -2336 15578 13508 -2171 -12946 -13530 1748 16308 10782 -4351 -14156 -10570 4497 15954
985 15954 10466 -7556 -15626 -7785 7148 17100 6555 -11407 -14222 -5121 10591 16944 1199
998 1199 -12501 -12687 -2496 14074 13172 -2486 -11556 -11950 778 14800 10243 -2698 -13346 -11600
1012 -11600 4316 15710 9211 -6889 -15236 -7205 7299 15488 6468 -10547 -12953 -4503 8609
1025 8609 15511 1748 -11748 -10753 -3037 11479 13756 -838 -10727 -12621 -583 15175 10829 -3438
1039 -3438 -12652 -11661 4590 15797 8106 -6917 -14520 -6145 7356 12999 5820 -8611 -12339 -4023
1053 -4023 7210 13403 3405 -9858 -11590 -3934 10653 14406 -919 -11047 -11266 -1356 14706 11132
1067 11132 -4359 -11935 -10678 4434 15055 6193 -5443 -11828 -7432 6376 12588 5906 -6666
1080 -6666 -12773 -5075 7771 13463 3855 -10579 -11885 -2198 10275 12985 -1072 -11475 -9616 378
1094 378 12394 9199 -3649 -9467 -9293 2017 13278 6416 -3546 -9528 -9543 4258 12794 6790 -4673
1109 -4673 -13743 -6721 9081 12797 4035 -9112 -13140 -1751 10210 10799 593 -9910 -9876 -890
1123 -890 10739 10719 -2734 -10383 -8310 1412 11855 7495 -3175 -9818 -9492 4849 13062 4811 -4845
1138 -4845 -12074 -6200 8882 10408 2507 -5768 -10835 -2977 7395 9853 3645 -9020 -11191 -1007
1152 -1007 9433 11062 -24 -10895 -10148 1328 13011 8357 -4591 -10291 -8672 4278 14284
1165 14284 5161 -7254 -11383 -4432 8996 10108 1471 -5925 -10935 -2457 9327 8379 1083 -7615
1179 -7615 -10496 306 9838 7436 -1722 -8515 -6660 783 8612 7842 -1967 -9432 -7683 3605 10820
1194 10820 4541 -3521 -9045 -7264 6142 10772 3255 -4626 -11483 -5236 9642 10412 1591 -8188
1208 -8188 -11442 932 10490 6422 -247 -8725 -9296 2919 10322 5934 -2884 -9385 -6570 4705
1222 4705 9688 3527 -4657 -7996 -3696 4768 7073 3837 -3167 -10135 -4337 7782 7848 1536 -4835
1237 -4835 -9402 -2043 8211 7242 1773 -6609 -10053 -149 9525 8455 -1073 -11063 -7981 5373 9658
1252 9658 4592 -3096 -10182 -6106 6769 10147 2570 -6363 -9806 -1807 8940 7487 -490 -6672
1266 -6672 -7641 1027 7499 4883 98 -5974 -7689 2304 8258 4065 -1285 -6668 -6033 2798 6557
1281 6557 4743 -1010 -8430 -5821 4306 7768 4823 -3732 -10736 -2951 7444 7096 2251 -5022 -9837
1296 -9837 -1822 8347 7929 970 -8569 -8667 3456 8998 4655 -2198 -8429 -5318 4799 6908 3563
1311 3563 -2233 -8532 -4454 5895 7197 1947 -4396 -6871 -1623 4635 5558 2654 -4366 -8030 -1573
1326 -1573 5839 6567 1976 -6538 -8205 1195 7421 5488 -294 -7607 -7005 2500 8079 5904 -2670
1341 -2670 -10013 -4355 6093 7984 2615 -5231 -8703 -1052 6989 6181 1295 -6074 -7644 549 7294
1356 7294 5327 -1287 -7002 -4789 2813 5210 3331 -409 -6045 -5272 2949 6142 3841 -1837 -7141
1371 -7141 -3691 3832 5903 3123 -2699 -7221 -2892 4359 6751 3084 -5625 -8251 -84 6728 5905
1386 5905 434 -6629 -6695 1473 7022 5053 -1391 -7652 -5434 3790 7336 3246 -3259 -7090 -2661
1401 -2661 4781 5441 1938 -3307 -6663 -2145 4586 5545 1653 -4788 -6197 -85 4887 4735 930 -5320
1417 -5320 -5675 -8 5118 5757 41 -6853 -5742 2103 6865 3972 -2285 -6641 -4095 3686 6693
1432 6693 3056 -3465 -7554 -2268 5482 5933 1608 -5223 -6683 637 5641 4906 237 -6040 -5001
1447 -5001 1482 5544 4616 -1741 -5988 -3010 2041 5504 2927 -2240 -4758 -3465 2536 5928 2258
1462 2258 -2699 -6205 -2964 4504 5789 1190 -4108 -6559 -521 5376 5029 810 -5748 -5618 1420
1477 1420 5225 4684 -1319 -6182 -3723 1756 5487 3883 -2636 -5538 -3496 2828 6858 1788 -3744
1492 -3744 -5427 -2260 5002 5358 58 -3318 -5523 -674 5254 3545 545 -4135 -5258 1125 4494
1507 4494 3839 374 -5671 -4110 1579 4896 4616 -2114 -6143 -2880 2743 6195 2283 -3925 -4877 -2100
1523 -2100 3694 5270 367 -3125 -5119 -1191 4924 3740 474 -3865 -5885 919 5208 3345 92
1538 92 -5664 -4189 2535 4684 3431 -2212 -5826 -1411 2536 4201 2172 -3229 -4075 -1473 2304 4957
1554 4957 811 -3035 -4488 -1906 4676 4305 263 -3429 -5688 661 5557 3070 -114 -5370 -4056
1569 -4056 3346 4080 2236 -1520 -5354 -1431 2437 3600 2674 -3059 -4370 -1268 2095 5016 1643
1584 1643 -3693 -4199 -1262 4055 4394 -329 -3176 -4637 309 5063 2193 -348 -3816 -3923 2433 3745
1600 3745 2087 17 -4686 -2605 2141 3277 3358 -1917 -5479 -1411 2328 4599 1967 -3883 -4310 -822
1616 -822 3889 4420 -305 -3543 -3714 -78 4719 2563 -667 -3076 -4103 1717 4073 1647 183 -4536
1632 -4536 -3453 2784 3591 2486 -1481 -5405 -1234 2866 3426 1856 -3277 -4137 15 2303 3741 697
1648 697 -3331 -3382 -326 3601 3168 -97 -2951 -4044 604 4661 2454 -317 -4233 -3735 2572 3974
1664 3974 2218 -1236 -5242 -1226 3484 2797 1864 -2396 -4337 -302 2227 3349 1294 -3474 -3293 52
1680 52 2939 3649 -483 -3464 -2918 423 3730 2526 -723 -3594 -3575 1752 3944 1290 -1045 -3856
1696 -3856 -2280 2449 2888 1903 -1659 -4703 -992 2536 3181 1776 -3742 -4248 269 3212 3623 -207
1712 -207 -3742 -2929 690 3959 2504 -1478 -3484 -2176 1735 3387 1595 -1319 -3673 -1640 2502
1727 2502 2286 1274 -994 -3984 -990 2812 2649 1162 -2774 -3335 238 2302 2781 529 -3315 -2757
1743 -2757 368 2812 3220 -576 -3968 -2415 1426 3448 2267 -1355 -3575 -1613 2063 3774 1601
1758 1601 -2449 -3885 -276 2848 2917 643 -2961 -3042 580 2824 2371 20 -2901 -2392 457 2669
1774 2669 2666 -806 -3228 -1748 1094 2739 1849 -1121 -3029 -1834 1334 2911 2000 -1713 -3670 -1501
1790 -1501 2627 3310 705 -2488 -3077 -165 2553 3244 482 -3657 -2892 1378 3534 2247 -1225 -3666
1806 -3666 -1459 1740 2525 1778 -1636 -3332 -1107 2206 2843 863 -2387 -2628 -210 1884 2190 799
1822 799 -1977 -2469 -197 2262 2583 524 -2538 -2474 73 2202 2804 -81 -3073 -2032 538 3020
1838 3020 2518 -771 -3502 -2153 1489 4046 1586 -2695 -3223 -614 2256 2870 607 -2561 -2611 -356
1854 -356 2680 2899 -307 -3376 -2086 928 2369 1397 -525 -2253 -1807 427 2466 2268 -1237 -2775
1870 -2775 -1258 1362 2487 1336 -1189 -2579 -1528 1311 3065 1263 -2089 -3129 -580 2316 3091
1885 3091 96 -2721 -2453 115 2889 2477 -965 -3320 -1829 1365 2710 1785 -1438 -3074 -1179 1631
1901 1631 2863 431 -2119 -1972 -195 1218 2609 1029 -2051 -2418 -134 2019 2023 -251 -1737 -1497
1917 -1497 114 1535 2072 371 -2431 -2321 589 3072 1846 -1272 -2550 -1193 767 2484 2141 -1267
1933 -1267 -3194 -1299 2150 3184 418 -2889 -2036 29 1843 2429 -353 -2603 -1688 556 2446 1844
1949 1844 -1003 -2138 -1261 805 2502 1106 -970 -2088 -1104 1402 1928 946 -1022 -2330 -964 1305
1965 1305 2617 903 -2241 -2064 144 1506 1909 328 -1848 -1918 -697 2490 2877 -847 -2870 -1604
1981 -1604 1299 2512 1019 -949 -2179 -1509 1467 2708 855 -1726 -2582 16 2074 1717 238 -1448
1997 -1448 -1736 -338 1200 2150 81 -2380 -1345 357 1320 1740 -93 -1924 -1483 230 2190 1620
2013 1620 -1039 -1978 -1132 755 2209 1065 -1098 -2756 -1244 1746 2108 423 -1755 -1983 -152 1206
2029 1206 1917 462 -1895 -2107 335 2291 1946 -921 -2183 -591 600 1698 1571 -687 -2420 -1309
2045 -1309 1439 2127 501 -1510 -1486 -341 998 1716 862 -1126 -2196 -352 1769 1823 43 -1776 -1607
2062 -1607 296 1414 1671 16 -2340 -1740 956 2351 1102 -875 -1972 -996 889 1923 1327 -1527
2078 -1527 -2228 -396 1592 1906 168 -1148 -1797 -306 1688 1868 143 -2043 -1984 920 1685 852 -321
2095 -321 -1625 -1230 459 1737 1663 -770 -2424 -819 1375 1356 640 -885 -2060 -718 1070 2229 966
2112 966 -1934 -2099 460 1635 1191 -34 -1550 -1873 259 1758 1357 -387 -2441 -910 1405 1200
2128 1200 1031 -353 -2290 -936 1075 2217 927 -1644 -2007 406 1300 1468 414 -1429 -1702 -2
2144 -2 1612 1604 -43 -1737 -919 341 1157 1251 297 -2026 -1835 509 2150 1417 -1276 -2048 -419 902
2162 902 1574 1011 -1082 -2283 -408 1415 1781 110 -1690 -1106 153 856 1465 396 -1798 -1785 449
2179 449 1998 1169 -768 -1720 -817 618 1372 1244 -652 -2409 -903 1435 1813 532 -927 -1664 -444
2196 -444 808 1391 830 -1455 -1988 232 1476 1488 -8 -1302 -1163 122 1302 1771 -203 -2096 -1216
2213 -1216 918 1848 824 -733 -1484 -917 835 1692 1092 -1143 -1918 -444 1577 1216 276 -1066 -1792
2230 -1792 -275 1134 1715 265 -1882 -1318 707 1536 993 171 -1309 -1234 121 1314 1411 -789 -2013
2247 -2013 -520 1077 1314 707 -451 -1626 -1146 1244 1939 542 -1370 -1751 54 1192 1052 438 -1221
2264 -1221 -1431 -16 1320 1438 -307 -1851 -700 660 1170 985 -181 -1758 -1028 737 1734 680
2280 680 -1244 -1212 -337 445 1018 864 -904 -1832 -655 1464 1450 13 -1127 -1091 200 1038 1335 62
2298 62 -1633 -1382 317 1543 1087 -687 -1418 -323 528 1216 1043 -672 -1831 -462 1229 1458 46
2315 46 -1092 -1082 -387 771 1331 494 -1339 -1645 248 1351 1046 -483 -1258 -1174 48 1253 1280 -374
2333 -374 -1824 -817 850 1287 691 -751 -1410 -734 474 1437 608 -1276 -1604 174 1360 1162 -67
2350 -67 -848 -1170 -266 1330 1449 -391 -1693 -1032 548 1247 576 -502 -1273 -706 257 1403 731 -921
2368 -921 -1674 -354 955 925 256 -738 -1179 -673 948 1474 149 -1242 -1007 53 1040 1092 -142 -1240
2386 -1240 -1344 283 1570 896 -857 -1363 -631 622 1097 728 -533 -1421 -591 1008 1600 150 -1256
2403 -1256 -1020 -13 649 711 328 -1130 -1571 -26 1437 1026 -558 -1144 -446 230 1003 1010 -247 -1400
2421 -1400 -852 696 1359 578 -858 -1392 -305 479 1232 837 -688 -1518 -525 1150 1351 -52 -1325
2438 -1325 -1052 -24 1019 1116 -12 -1480 -1011 709 1218 649 -517 -865 -629 510 1211 677 -784
2455 -784 -1169 -421 676 1181 351 -757 -1145 -298 817 1254 353 -1216 -951 141 930 740 -19 -747
2473 -747 -746 -555 1237 1266 -363 -1230 -717 810 1113 260 -374 -1432 -764 856 1125 303 -910 -1441 -68
2492 -68 1147 1106 62 -1058 -1025 -26 655 920 116 -1072 -723 -115 843 931 -149 -928 -1023 133 1124 844
2512 844 -611 -1233 -581 740 1012 655 -461 -1157 -494 909 1144 315 -743 -780 115 803 1167 170 -1174
2531 -1174 -849 155 1025 1171 -502 -1300 -282 470 1010 681 -675 -1054 -821 479 1224 169 -543 -824
2549 -824 -610 511 847 518 -358 -1179 -327 1038 842 172 -1136 -854 95 586 1027 -56 -1267 -769
2567 -769 166 1037 981 -281 -949 -612 361 1369 731 -681 -1124 -740 871 1042 73 -746 -1041 -471 832
2586 832 891 177 -1008 -811 118 729 624 -5 -899 -613 41 929 1080 -275 -1122 -670 134 1217 761
2605 761 -566 -961 -653 359 1434 420 -731 -1031 -522 808 934 139 -690 -826 99 640 922 220
2623 220 -1019 -808 -32 827 1045 -98 -1084 -462 197 932 791 -618 -999 -346 399 988 87 -624 -809
2642 -809 -821 542 1155 223 -659 -794 -318 641 736 163 -747 -1175 -176 807 826 -278 -1132 -585 143 962
2662 962 919 -355 -1036 -931 437 1007 464 -536 -647 -589 641 947 315 -665 -1130 -277 731 949 -1
2681 -1 -803 -1020 -60 857 1012 179 -1090 -822 151 782 855 -24 -872 -640 378 967 823 -603 -919 -490
2701 -490 557 1182 295 -538 -1119 -547 570 1083 161 -779 -977 -154 1039 982 55 -728 -972 -25 1016
2720 1016 771 -86 -1034 -716 456 1035 649 -472 -913 -453 416 1014 461 -635 -912 -205 873 977
2738 977 244 -984 -893 -229 776 992 -92 -981 -913 48 1107 833 -163 -896 -742 93 1238 579 -552
2757 -552 -841 -511 318 1046 578 -480 -1219 -527 664 1010 227 -763 -1001 -206 949 1154 168 -770 -905
2776 -905 -187 1060 896 -84 -928 -613 0 1061 803 -491 -1110 -836 452 1071 517 -424 -1036 -633 497
2795 497 1120 207 -654 -1010 -376 751 919 135 -805 -910 25 894 813 -252 -797 -831 147 1046 589 -180
2815 -180 -817 -707 390 992 609 -486 -723 -371 602 997 363 -631 -901 -262 646 843 172 -754 -953
2834 -953 87 943 856 -174 -882 -684 -32 904 903 -357 -979 -610 191 975 398 -342 -841 -802 330 1025
2854 1025 411 -616 -925 -479 688 1022 133 -500 -800 -248 791 952 -72 -962 -757 131 879 661
2872 661 6 -939 -728 337 1104 763 -260 -1008 -601 390 783 297 -451 -877 -303 866 824 171 -605
2891 -605 -768 -186 850 931 50 -871 -738 9 732 591 -204 -726 -542 250 790 385 -469 -743 -313 663
2911 663 848 374 -660 -738 -257 580 789 295 -578 -776 -335 630 826 -46 -743 -951 -102 975 739 -135
2931 -135 -897 -642 286 899 594 -254 -766 -410 605 880 556 -349 -945 -394 679 895 427 -740 -849
2950 -849 -175 761 1046 58 -987 -772 -111 861 846 29 -1139 -731 174 968 686 -293 -781 -606 257 744
2970 744 523 -553 -1149 -100 588 799 393 -757 -929 -144 815 1036 109 -883 -894 16 732 871 -24
2989 -24 -922 -683 320 895 822 -235 -1169 -450 278 974 532 -547 -890 -301 614 1133 322 -527 -664 65
3009 65 589 1096 204 -909 -798 99 949 749 -229 -891 -549 73 863 851 -340 -786 -533 638 1029 442
3029 442 -495 -930 -385 532 1016 284 -672 -1076 -54 773 807 254 -521 -920 130 603 729 -4 -905 -805
3049 -805 112 887 767 -245 -883 -453 371 1110 563 -488 -878 -437 724 1078 386 -712 -785 -138 602
3068 602 835 24 -614 -852 43 666 702 113 -849 -678 308 734 659 -489 -1017 -736 382 1124 693 -595
3088 -595 -625 -475 653 1076 356 -542 -891 -246 746 905 153 -630 -952 -144 748 900 -43 -919 -680 304
3108 304 878 762 -283 -943 -578 398 981 311 -360 -703 -336 417 692 200 -548 -774 -332 796 916
3127 916 256 -749 -730 -282 906 800 10 -957 -899 176 907 733 -157 -1062 -597 489 832 477 -426
3146 -426 -1001 -559 494 1042 514 -596 -899 -342 836 1015 92 -820 -892 96 995 712 -212 -844 -711
3165 -711 169 764 678 -351 -1020 -765 302 928 759 -366 -866 -503 505 932 490 -565 -1034 -324 631
3184 631 879 28 -689 -1104 90 535 785 166 -819 -807 120 1158 689 -195 -818 -807 328 821 626 -91
3204 -91 -1048 -448 368 946 502 -548 -1128 -351 556 974 227 -766 -760 -140 714 707 84 -668 -504 95 875
3225 875 464 -24 -791 -513 424 957 471 -422 -959 -412 580 795 462 -600 -840 -231 811 647 272
3244 272 -753 -855 -89 833 807 -131 -595 -514 60 801 554 -173 -788 -579 225 858 608 -292 -794 -449
3264 -449 697 734 451 -504 -877 -270 654 861 334 -583 -711 -79 630 918 32 -798 -669 97 738 588
3284 588 79 -905 -534 258 948 636 -218 -983 -352 426 793 334 -383 -813 -461 611 850 158 -709 -728
3304 -728 -25 577 852 15 -603 -832 -65 762 596 165 -680 -308 286 604 500 -330 -756 -515 506 1034
3324 1034 397 -485 -854 -330 641 961 63 -515 -656 191 588 608 17 -585 -674 177 745 536 -167 -655
3344 -655 -453 148 866 302 -213 -740 -622 183 717 478 -390 -792 -405 467 732 185 -503 -705 -181 616
3364 616 816 207 -617 -582 99 748 770 -101 -617 -467 202 752 585 -160 -793 -466 151 938 624 -304 -666
3385 -666 -232 348 595 190 -618 -991 -36 630 655 16 -723 -673 64 490 656 84 -846 -583 133 729 628
3406 628 -221 -744 -557 380 967 444 -334 -868 -405 252 917 334 -384 -765 -328 497 713 115 -601 -736
3426 -736 -60 918 778 -180 -622 -826 102 939 585 -166 -697 -595 297 948 433 -387 -864 -515 458 958
3446 958 265 -444 -890 -280 480 567 169 -753 -708 -139 791 830 -86 -696 -611 345 682 653 -298 -885 -674 292
3468 292 890 517 -343 -936 -451 290 866 371 -634 -939 -138 303 914 290 -587 -850 -150 900 755
3487 755 84 -830 -825 77 904 891 -61 -786 -563 284 1011 700 -246 -894 -576 333 757 413 -501 -704 -178
3508 -178 415 765 240 -563 -1064 -347 667 763 -16 -773 -698 145 846 643 40 -714 -704 337 853 543
3528 543 -168 -643 -443 320 831 325 -340 -950 -330 515 698 27 -419 -889 -183 684 747 145 -572 -638 -128
3549 -128 989 710 82 -864 -609 191 679 551 -228 -741 -628 561 701 464 -284 -754 -381 666 657 110
3569 110 -391 -946 -343 707 587 82 -656 -845 104 604 829 -178 -688 -573 195 824 566 -155 -811
3588 -811 -729 194 725 395 -443 -880 -279 224 673 434 -649 -881 -65 620 712 -34 -708 -791 3 832 756
3609 756 57 -783 -610 195 740 656 -354 -966 -405 289 753 439 -440 -797 -279 383 825 230 -617 -971
3629 -971 -303 599 949 -15 -615 -713 51 649 803 -217 -925 -593 284 1029 739 -47 -680 -640 231 1000
3649 1000 425 -557 -919 -485 477 866 272 -488 -796 -112 475 807 172 -557 -734 73 646 718 75 -771
3669 -771 -683 412 912 584 5 -720 -588 306 795 393 -354 -803 -358 350 761 245 -518 -842 -292 396
3689 396 880 -53 -625 -643 114 665 694 120 -875 -816 172 778 772 -105 -738 -566 185 1114 217 -312 -861 -227
3711 -227 473 1004 190 -429 -1058 -322 607 631 -29 -732 -750 12 837 810 -66 -881 -536 98 807 409 -102
3732 -102 -674 -344 339 762 351 -505 -937 -299 520 1018 119 -486 -951 -432 728 962 109 -539 -801 -34
3752 -34 744 752 5 -819 -832 80 601 630 -215 -983 -605 290 871 459 -312 -966 -458 361 911 257 -473 -990
3774 -990 -89 548 903 120 -653 -677 -77 904 890 -23 -610 -790 255 793 759 -292 -949 -538 198 875
3794 875 552 -396 -1002 -445 398 909 400 -629 -636 -77 696 986 19 -727 -820 -163 757 747 -51 -759 -546
3815 -546 193 918 694 -95 -843 -516 280 941 510 -424 -875 -307 320 834 83 -485 -769 -255 767 946
3835 946 -50 -622 -671 14 896 619 -33 -629 -560 146 864 601 -216 -937 -442 218 790 368 -242 -810 -241
3856 -241 426 954 291 -399 -939 -218 627 999 328 -580 -681 -115 741 547 -31 -588 -486 42 841 792
3876 792 -309 -866 -570 331 691 492 -433 -678 -433 311 941 303 -495 -1168 -446 514 774 74 -707 -885
3896 -885 -231 748 861 33 -922 -771 196 850 619 -235 -868 -650 293 894 480 -464 -919 -613 413 756
3916 756 624 -399 -815 -276 455 880 258 -369 -975 146 639 796 71 -571 -693 41 965 580 -260
3935 -260 -852 -569 277 822 466 -338 -821 -317 606 801 595 -455 -772 -337 492 866 397 -471 -714 -209
3955 -209 493 914 97 -499 -999 64 764 753 52 -778 -671 118 813 402 -163 -853 -708 187 794 695
3975 695 -292 -819 -237 480 851 325 -693 -733 -297 430 854 296 -749 -749 -107 750 849 24 -958 -741 114
3996 114 969 508 -289 -898 -469 287 977 611 -211 -903 -407 353 774 405 -685 -921 -427 658 627 254
4016 254 -787 -783 -300 614 840 -323 -743 -751 72 1072 760 -227 -756 -636 558 961 657 -294 -706 -239
4036 -239 528 805 392 -611 -757 -42 601 880 300 -720 -804 -76 611 728 179 -970 -734 265 768
4055 768 924 -228 -962 -757 320 996 596 -427 -860 -458 606 929 330 -706 -1099 -167 692 747 91
4074 91 -649 -843 1 672 755 65 -774 -613 161 806 866 -146 -692 -472 295 868 477 -376 -877 -399 309
4095 309 753 289 -411 -1148 -244 678 974 198 -619 -930 -152 629 770 259 -621 -800 -220 713 877 -39
4115 -39 -760 -627 160 860 780 -36 -647 -469 299 1010 409 -361 -796 -159 550 653 259 -422 -639 -190 527
4136 527 790 201 -704 -853 -142 810 827 -24 -717 -774 20 790 635 -24 -770 -467 277 779 554 -432 -691
4157 -691 -402 504 1030 445 -556 -838 12 808 684 98 -817 -696 -83 798 737 44 -711 -736 116 806
4177 806 768 -402 -830 -635 205 635 405 -576 -798 -647 325 917 346 -547 -832 -97 783 582 270 -523
4197 -523 -773 -14 783 652 -49 -776 -747 332 821 820 -239 -832 -602 342 840 442 -558 -716 -323 425
4217 425 801 89 -534 -841 -60 591 830 87 -624 -737 -45 795 651 51 -672 -552 54 631 546 -62
4237 -62 -946 -652 283 572 516 -257 -743 -403 423 593 365 -433 -586 -347 496 1127 217 -351 -622 -121 670
4258 670 725 69 -563 -873 246 774 728 -143 -704 -678 167 862 366 -343 -874 -393 308 779 464 -529 -887
4279 -887 -228 562 889 99 -609 -671 -229 800 823 34 -641 -853 166 614 439 -178 -819 -641 137 740
4299 740 610 -344 -751 -316 302 853 301 -508 -615 -215 729 693 320 -604 -765 -139 765 835 -5 -643 -767
4320 -767 127 747 751 -161 -881 -511 256 815 407 -333 -981 -509 300 731 340 -526 -729 -507 403 894 176
4341 176 -469 -517 -94 722 740 64 -688 -839 26 445 742 -7 -632 -654 304 694 536 -340 -927 -595 225
4362 225 735 317 -522 -1102 -389 507 769 408 -566 -751 -120 562 672 55 -567 -737 -71 658 638 -119
4382 -119 -976 -372 74 696 635 -161 -640 -381 338 801 402 -516 -695 -327 524 838 156 -568 -781 -184
4402 -184 771 939 123 -757 -436 -171 632 764 -106 -639 -651 314 717 546 -357 -821 -397 353 808 433
4422 433 -413 -866 -399 401 992 293 -713 -760 -110 762 821 137 -825 -751 85 573 834 -43 -869 -822 -296
4443 -296 710 826 -317 -961 -427 361 819 479 -413 -991 -407 590 708 252 -589 -820 -349 608 1145
4462 1145 308 -620 -831 7 913 905 136 -948 -482 284 648 666 -260 -901 -540 419 1009 683 -392 -688
4482 -688 -489 609 697 319 -598 -703 -274 530 786 150 -643 -1006 -315 487 717 4 -893 -746 219 676
4502 676 640 -111 -836 -409 346 725 811 -160 -846 -418 613 938 330 -593 -962 -197 485 818 344 -749
4522 -749 -970 -114 840 798 -34 -923 -833 46 866 863 14 -915 -712 195 1111 439 -518 -797 -407 350 873
4543 873 420 -648 -641 -142 629 997 267 -666 -947 -70 984 868 -26 -717 -900 -8 1025 705 -183 -1063
4563 -1063 -893 242 965 697 -346 -1047 -444 369 962 472 -659 -1078 -248 614 1116 260 -810 -846 -24
4582 -24 1073 889 -55 -954 -693 91 1038 721 -32 -838 -571 399 621 855 -478 -1035 -512 506 955
4601 955 522 -535 -1000 -277 709 1068 83 -572 -1105 -45 848 1069 -7 -1000 -700 193 914 979 -261
4620 -261 -1087 -889 258 1172 914 -366 -1096 -542 459 832 730 -712 -1029 -299 660 1141 302 -707
4638 -707 -1030 -251 775 992 126 -976 -904 275 1243 967 -155 -1103 -914 202 916 939 -400 -1198 -468
4657 -468 518 1299 711 -490 -1064 -438 749 1152 413 -800 -929 -207 697 1199 288 -790 -981 -183 852
4676 852 1147 -69 -1131 -842 191 1005 887 -323 -979 -831 526 1037 389 -671 -829 -255 629 1149
4694 1149 393 -534 -994 -240 865 741 98 -1117 -960 -188 883 884 -29 -893 -799 99 1218 830 -392
4713 -392 -1224 -556 386 1086 631 -493 -1186 -485 826 1324 506 -807 -1025 -302 846 1075 115 -909
4731 -909 -908 79 1166 1142 -457 -1206 -1017 141 1135 626 -497 -1129 -686 676 1246 606 -570 -1093 -560
4750 -560 669 1000 465 -782 -977 -341 971 932 -9 -911 -861 65 1030 1066 -198 -1070 -688 165 1221
4769 1221 659 -440 -958 -730 635 1121 767 -778 -1137 -354 813 1038 143 -742 -1034 -275 970 1013
4787 1013 -51 -1147 -940 94 1180 996 -337 -1029 -849 288 1125 958 -471 -896 -489 466 1145
4804 1145 551 -537 -1177 -572 755 1055 214 -785 -1104 -219 776 988 176 -776 -978 -112 826 780 -9
4823 -9 -1089 -760 235 1058 693 -84 -958 -847 414 1201 786 -527 -1183 -476 644 1042 452 -740 -995
4842 -995 -267 814 1036 269 -691 -1070 -221 999 1012 -73 -937 -818 102 967 900 -316 -1062 -663 376
4861 376 1115 767 -604 -1271 -629 498 1172 285 -826 -1061 -303 839 913 128 -914 -1064 -116 903
4879 903 1001 -126 -967 -853 94 1226 865 -99 -947 -591 388 1107 645 -459 -1197 -609 694 1340 742
4898 742 -557 -1117 -306 785 1156 53 -981 -1241 -4 1043 951 -46 -1039 -1072 195 1201 1005 -205
4916 -205 -973 -937 411 1077 771 -411 -1212 -366 855 1059 534 -671 -1133 -286 1022 1028 392 -983 -904
4935 -904 -203 749 1074 -23 -1205 -976 160 1079 1004 -340 -1303 -762 562 1260 764 -433 -1104 -879
4953 -879 709 1334 746 -713 -1151 -615 937 1082 15 -787 -947 -190 852 1254 -67 -1001 -778 41
4971 41 870 887 -319 -1117 -658 410 1300 783 -434 -1387 -778 820 1043 641 -721 -1055 -603 840 1147
4990 1147 297 -737 -1179 -64 1020 1121 93 -925 -1037 5 1195 933 -259 -1286 -885 308
5006 308 965 843 -386 -1319 -792 612 1088 475 -627 -1014 -437 814 1024 454 -925 -979 149 1230
5024 1230 1102 147 -1105 -1289 291 1089 827 -133 -1150 -788 379 1375 761 -559 -1255 -385 738 1242
5042 1242 512 -750 -1300 -282 944 1088 535 -778 -964 0 1012 986 -88 -1064 -895 214 1072 903
5060 903 -212 -1321 -858 433 1176 539 -432 -1105 -510 621 1343 280 -815 -1230 -463 846 1082 339
5078 339 -605 -938 -157 1080 1015 114 -1144 -935 300 1090 864 -160 -1099 -855 242 1219 830 -654
5096 -654 -1140 -738 628 1154 623 -663 -1152 -680 869 1225 291 -936 -997 -300 947 954 -168 -1095 -1037
5115 -1037 42 1147 942 -204 -967 -1033 388 1124 767 -392 -983 -512 486 1172 519 -651 -895 -342
5133 -342 587 1305 550 -885 -955 -411 720 1185 -28 -903 -999 191 941 846 -133 -1003 -993 12 1228
5152 1228 658 -371 -1255 -872 400 1029 553 -597 -1046 -519 677 1315 512 -943 -1090 -235 806 1121
5170 1121 56 -1080 -810 -289 949 831 110 -1105 -837 260 1086 865 -470 -1192 -523 392 1138 453
5188 453 -592 -963 -436 697 1151 344 -707 -898 -404 746 1007 373 -952 -993 -46 925 593 -102 -1023
5207 -1023 -804 -107 1144 937 -358 -1185 -516 353 1169 635 -597 -973 -586 388 1030 610 -795 -1062
5225 -1062 -168 860 1233 155 -739 -1191 109 1105 969 -120 -955 -818 79 1137 864 75 -1146 -815
5243 -815 424 977 674 -472 -1073 -647 505 1345 256 -665 -1043 -370 564 985 356 -722 -997 -280
5261 -280 907 1076 0 -992 -809 -98 817 903 -311 -1286 -922 152 987 638 -459 -1001 -704 460
5279 460 935 597 -359 -943 -400 660 1043 337 -812 -1125 -208 837 1015 296 -911 -891 28 751 837
5298 837 169 -1046 -917 197 1023 791 -283 -1194 -630 522 860 666 -684 -972 -489 447 1026 419
5316 419 -685 -1080 -103 865 910 264 -783 -1090 -214 814 944 -210 -950 -869 47 966 961 -289 -1117 -448
5336 -448 272 1029 733 -470 -1186 -621 643 1258 375 -530 -1134 -225 875 979 368 -625 -1140 -223 895
5355 895 863 151 -846 -843 258 1084 786 22 -1153 -855 557 1105 698 -477 -1226 -726 638 1167 592
5374 592 -486 -1001 -277 717 1050 267 -801 -962 51 998 1099 40 -992 -997 6 961 704 -197 -942
5393 -942 -965 387 1019 925 -275 -1291 -523 342 1140 614 -561 -929 -285 501 1092 316 -775 -1049 -370
5412 -370 847 978 76 -839 -926 -40 948 1005 -176 -842 -734 320 1085 793 -534 -1287 -665 471 1007
5431 1007 372 -488 -1182 -330 683 921 171 -604 -1198 -225 852 932 91 -784 -1081 -76 1022 657 -342
5450 -342 -1033 -735 338 1181 835 -649 -1018 -510 520 1179 654 -336 -1045 -508 781 1125 300 -765
5468 -765 -1133 -261 889 840 436 -798 -827 108 1131 627 -83 -953 -900 303 1015 787 -512 -918 -516
5487 -516 505 1035 491 -417 -1132 -593 658 957 198 -783 -976 -336 811 1232 72 -901 -1016 -40 884
5506 884 846 -144 -845 -779 145 903 991 -159 -931 -619 284 1054 772 -550 -1181 -312 644 1196 215 -583
5526 -583 -835 -270 702 840 68 -860 -1073 -64 1050 950 50 -828 -922 36 1060 673 -259 -895 -623
5545 -623 343 937 523 -399 -1017 -419 495 894 262 -571 -998 37 715 1015 147 -800 -997 87 785
5564 785 956 -13 -1038 -916 184 868 850 -349 -1292 -664 328 901 731 -541 -928 -470 733 879 569
5583 569 -486 -1179 -551 758 1036 233 -744 -1036 -148 798 1040 81 -923 -860 230 1240 681 -111 -965
5602 -965 -786 342 1173 540 -545 -1104 -428 522 1044 449 -574 -1118 -142 692 778 179 -1048 -933 -131
5621 -131 878 992 -170 -728 -821 153 1037 759 -275 -899 -681 257 1026 585 -436 -825 -390 617 1048
5640 1048 477 -670 -955 -318 541 990 244 -603 -999 41 739 882 12 -725 -603 60 735 673 -441
5659 -441 -880 -649 211 929 420 -373 -975 -325 474 876 386 -588 -1056 -531 699 737 147 -753 -866 188
5679 188 550 778 -85 -598 -947 -73 841 844 -238 -862 -607 250 1080 600 -523 -895 -560 441 724 524
5699 524 -600 -1034 -436 643 990 100 -734 -972 -25 598 789 33 -890 -867 -67 806 892 -150 -897 -946
5719 -946 404 853 653 -403 -984 -599 436 993 282 -497 -1076 -535 521 767 248 -592 -1070 -205 514
5738 514 1000 12 -593 -920 -40 840 675 -66 -641 -849 -108 951 666 -213 -906 -530 348 1148 511 -449
5758 -449 -931 -346 479 1030 249 -865 -1084 -381 713 737 142 -605 -775 -191 958 811 89 -626 -859
5777 -859 86 926 766 -239 -937 -485 199 921 663 -432 -716 -601 316 804 506 -633 -1123 -329 600
5796 600 909 415 -347 -800 -234 753 880 117 -818 -777 -83 885 715 31 -936 -589 65 896 740 -289
5816 -289 -899 -661 309 939 455 -462 -876 -436 368 809 266 -418 -764 -226 734 686 26 -834 -838 40 735
5837 735 701 -103 -781 -759 166 701 612 -276 -904 -613 491 878 397 -466 -940 -425 488 881 423 -537 -792
5858 -792 -254 716 679 277 -791 -725 -49 804 641 -34 -813 -791 65 594 686 -311 -783 -551 280 764 454
5879 454 -479 -989 -197 375 832 651 -774 -931 -153 572 792 191 -620 -825 133 742 552 190 -753 -723
5899 -723 93 979 685 -326 -963 -517 256 1100 719 -360 -798 -500 544 927 197 -653 -939 -64 415
5918 415 741 5 -689 -735 68 560 780 -85 -769 -616 33 699 666 -182 -721 -567 352 999 596 -219 -833
5939 -833 -435 577 735 191 -422 -692 -244 620 869 36 -435 -698 -235 817 864 -118 -740 -910 6 592
5959 592 584 -196 -795 -609 335 805 530 -167 -818 -322 378 688 334 -194 -931 -75 630 790 198 -754 -718
5980 -718 44 572 840 35 -762 -698 87 569 704 -240 -918 -416 330 697 521 -229 -862 -474 176 925
6000 925 218 -277 -834 -408 634 639 79 -558 -851 4 683 679 181 -401 -832 13 666 662 -277 -644 -786 84
6022 84 618 630 -295 -712 -533 266 978 406 -317 -807 -381 364 787 539 -429 -653 -261 441 776 -63 -740
6043 -740 -609 161 742 606 -128 -794 -659 42 739 391 -275 -858 -500 423 925 508 -328 -685 -142 423
6063 423 830 369 -618 -635 -251 544 737 118 -638 -659 166 611 568 0 -751 -578 91 731 456 -186 -688
6084 -688 -427 542 715 427 -295 -627 -307 641 956 74 -686 -764 15 427 625 -212 -663 -687 118 771 523
6105 523 -22 -642 -501 38 639 554 -206 -558 -289 305 592 308 -152 -716 -162 471 720 55 -545 -484 -210
6126 -210 450 602 -15 -513 -435 -165 599 501 -160 -364 -612 136 709 480 -150 -488 -268 175 771 363 -236
6147 -236 -596 -360 453 813 326 -353 -768 -114 572 585 147 -570 -820 -34 587 456 -20 -550 -580 126 615
6168 615 399 -106 -676 -144 329 811 210 -420 -571 -283 382 719 212 -580 -601 -99 563 605 -72 -700 -595
6189 -595 -188 483 515 15 -771 -678 208 631 390 -108 -516 -363 255 630 433 -364 -650 -237 501 596 378
6210 378 -504 -568 -200 300 697 64 -635 -716 24 470 724 -136 -481 -687 262 732 621 -20 -605 -259 71
6231 71 730 371 -410 -660 -419 405 739 227 -461 -753 -75 625 580 40 -629 -645 -67 725 371 -2 -618
6252 -618 -671 218 652 600 -459 -459 -380 281 670 482 -344 -832 -307 441 613 210 -440 -640 -21 388 715
6273 715 189 -835 -464 -36 568 691 182 -661 -464 269 419 387 -313 -523 -457 197 736 369 -276 -634
6293 -634 -228 379 723 126 -322 -437 -189 477 482 -101 -594 -593 54 657 608 54 -589 -555 180 717 848 -149
6315 -149 -664 -286 344 522 346 -230 -572 -288 425 724 288 -596 -776 -102 446 617 91 -588 -583 -37 462
6336 462 679 -80 -655 -575 141 425 348 -459 -556 -438 423 522 245 -294 -612 -360 289 503 315 -392 -762
6357 -762 -208 276 480 205 -556 -657 96 611 416 -54 -378 -455 30 527 440 -202 -529 -451 286 669 333
6378 333 -315 -623 -267 188 585 116 -426 -614 -176 505 373 50 -700 -439 -227 797 554 -11 -613 -517
6398 -517 138 456 526 -47 -597 -483 224 689 -7 -304 -465 -336 385 421 313 -285 -513 101 352 512 -78
6419 -78 -619 -336 -130 522 503 143 -555 -393 55 861 280 -199 -752 -483 256 538 311 -478 -660 -340 467
6440 467 853 258 -294 -683 -77 601 462 104 -591 -454 -151 470 361 -163 -347 -637 21 535 394 -206
6460 -206 -557 -362 240 282 151 -256 -413 -66 188 314 190 -403 -690 -186 291 402 54 -386 -314 -252 764
6481 764 615 -202 -623 -435 143 536 441 -253 -395 -172 392 651 280 -318 -485 -251 458 539 144 -371 -630
6502 -630 -211 191 507 56 -468 -385 -216 437 454 2 -637 -376 197 636 368 -472 -619 -441 233 652 191
6523 191 -356 -554 -276 347 704 118 -364 -495 -214 481 637 -96 -449 -343 -78 495 519 -81 -449 -382 84
6544 84 692 429 -151 -456 -282 289 421 222 -47 -612 -155 214 496 313 -248 -567 -48 405 599 271
6564 271 -455 -372 -202 613 630 -59 -434 -518 240 542 533 42 -539 -273 105 690 458 -198 -598 -186 380 593
6586 593 198 -282 -658 -226 428 329 41 -305 -570 -138 549 807 -80 -585 -392 110 490 438 -274 -620 -414
6607 -414 294 526 240 -229 -468 -297 203 560 323 -370 -412 -150 157 567 333 -322 -359 71 450 663 -5
6628 -5 -657 -543 -165 615 93 -46 -308 -365 57 316 372 -115 -469 -161 328 578 349 -331 -499 -412 268 714
6650 714 141 -523 -345 -150 254 501 137 -564 -641 29 481 497 55 -507 -402 69 328 371 -158 -562 -266
6671 -266 251 568 459 -297 -291 -3 268 508 287 -274 -588 -373 279 240 102 -504 -453 -133 327 586 -8
6692 -8 -235 -361 90 468 240 39 -278 -354 188 730 444 -89 -437 -323 253 592 381 -58 -307 -47 330
6713 330 574 206 -250 -376 -88 240 428 -82 -435 -233 -11 411 422 -93 -325 -406 -32 289 283 -274 -286 -308
6735 -308 264 536 431 -402 -434 47 425 342 69 -238 -233 59 261 532 -69 -637 -335 235 545 181 -109
6756 -109 -465 -342 367 655 223 -234 -378 -112 444 412 204 -355 -684 -243 384 451 -164 -413 -352 6 158
6777 158 362 410 -401 -541 -49 502 331 -125 -478 -181 85 470 582 -173 -287 -316 360 686 235 -185 -510
6798 -510 -331 230 436 329 -459 -454 -112 468 330 -40 -404 -308 -204 313 494 -110 -493 -508 246 261 153 -41
6820 -41 -250 -59 211 362 303 2 -520 -23 259 557 23 -204 -324 -155 442 452 33 -408 -474 -251 205
6841 205 210 -149 -417 -360 -219 297 330 -90 -440 -544 437 411 270 -317 -543 -116 176 423 243 -247 -570 143
6863 143 553 356 -117 -385 -518 -69 370 232 -93 -405 -267 97 310 430 -94 -522 -225 -54 431 233
6883 233 -332 -421 -123 396 415 117 -339 -402 -54 322 501 189 -392 -212 -91 364 324 37 -412 -334 143 426
6905 426 236 -220 -431 -105 180 368 209 -182 -528 -219 75 514 156 -166 -235 46 413 469 -119 -296 -530
6926 -530 10 664 302 -111 -399 -387 77 417 503 -216 -393 -323 153 370 54 -87 -498 -207 213 460 173
6947 173 -230 -460 -237 479 412 75 -111 -487 -219 363 478 -13 -278 -294 8 315 211 -3 -472 -175 -159
6968 -159 427 326 -268 -259 61 78 409 325 -272 -351 -35 41 456 180 -285 -312 57 320 331 155 -328 -334 128
6991 128 145 370 -33 -433 -201 49 210 282 -50 -390 -90 114 332 390 -174 -330 158 262 422 298 -242
7012 -242 -419 -60 159 487 110 -359 -336 50 359 326 69 -166 -458 119 437 -12 -190 -660 -270 -34 234
7033 234 41 -207 -532 -220 197 266 83 -118 -471 99 285 395 20 -199 -299 -42 206 337 -33 -168
7053 -168 -537 123 368 315 -81 -345 -241 93 582 55 -153 -341 -126 177 271 144 -139 -442 -41 446 449
7074 449 12 -57 -276 113 297 367 63 -174 -160 71 358 155 -204 -356 -307 58 440 207 -57 -205 50
7095 50 351 533 68 -159 -231 -289 137 248 -47 -412 -125 69 214 300 50 -522 -350 99 291 163 -154
7116 -154 -285 -414 -66 333 279 -205 -322 -321 161 367 121 -117 -372 -121 281 358 117 -280 9 -9 307 228
7138 228 -82 -413 -243 -151 505 345 -134 -276 -283 237 330 194 -118 -118 -200 78 424 65 -121 -453 -148 288
7160 288 197 5 -144 -324 173 289 248 -168 -399 -12 25 71 255 -118 -10 -359 16 262 126 -292 -201 -69
7182 -69 246 326 -54 -50 -274 -41 189 401 56 -164 -257 -73 228 156 56 -377 -218 180 408 254 -173 -198
7204 -198 -136 300 214 195 -69 -94 -389 162 589 56 -273 -384 -8 306 363 -360 -299 -343 80 234 287 -310 -299
7227 -299 -184 -22 -19 8 -13 -216 -144 -15 351 61 -169 -159 -22 185 454 168 -117 -395 -216 359 123 -2
7249 -2 -272 -215 212 386 353 -116 -354 -85 209 268 252 -85 -457 -119 -10 347 293 -134 -430 -12 105 430
7271 430 -113 -145 -337 -104 175 177 22 -346 -428 9 180 278 138 -382 -109 20 281 292 -54 -284 -108 132
7293 132 143 249 -108 -461 51 343 156 94 -65 -98 5 135 213 205 -165 -307 116 354 -5 -157 -145 -192 59
7316 59 87 198 -220 -156 -264 302 280 -142 -18 -326 -72 252 456 -25 -108 -251 233 161 209 75 -324 -88
7338 -88 166 324 262 -32 -240 -200 152 537 233 -88 -357 -210 14 336 107 -130 -293 -111 369 331 79
7359 79 -206 -104 2 246 250 -198 -342 -174 25 166 158 24 -242 -441 192 125 244 -33 -170 -109 246 286 226
7382 226 -336 -315 -132 283 343 243 -6 -163 -178 298 276 -174 -198 -172 -16 303 -25 -99 -332 -320 63 236 197
7405 197 -198 -330 -261 112 154 246 -241 -337 -102 146 375 -37 -380 -173 213 261 134 161 -257 -257 -120 197 267
7428 267 31 -175 -196 -36 154 191 2 -249 -274 108 215 30 -42 -372 -188 -177 217 106 -161 -427 86 372
7450 372 128 -191 -139 -339 -17 272 121 64 -231 -80 67 247 232 76 -139 -158 65 115 120 -16 -187 -83
7472 -83 75 283 121 -208 -341 -44 208 164 -66 -148 -264 61 178 265 79 -417 -241 -31 125 190 8 -213
7494 -213 -366 14 48 316 -89 -304 -85 63 196 149 -99 -300 -90 70 302 -24 -170 -240 -45 349 296
7515 296 -21 -242 -311 159 192 272 -50 -35 -254 -13 170 91 -193 -394 -264 69 179 89 -261 -373 -79 -89
7537 -89 342 84 -22 -399 -90 218 300 -52 -225 -248 227 81 237 138 -61 -288 111 230 32 -157 -297
7558 -297 -33 -149 208 202 -244 -208 51 123 254 184 -29 -195 -253 192 150 -63 -121 -318 -172 220 206 -217 -287
7581 -287 -425 162 301 293 -116 13 -77 84 123 266 -41 -193 -35 5 186 43 -230 -455 12 -8 170 30
7603 30 -299 -263 -18 75 185 49 -253 -543 123 196 386 70 -227 69 -29 204 149 -94 -126 9 37 394 90
7626 90 -273 -230 -144 47 -14 7 -62 -13 -34 175 197 -228 -207 -272 80 190 193 52 -94 -432 -28 262 200 -74 -282
7651 -282 -170 113 289 25 -189 -325 45 -18 127 -41 -10 -325 -222 76 315 -1 -152 -222 -164 103 63 57
7673 57 -88 -79 54 207 283 14 -88 -60 8 123 -63 -20 -243 -108 167 114 -62 -241 -211 -155 96 391 -77
7696 -77 -196 -253 2 289 162 -83 -387 -240 198 171 103 -88 -295 -50 123 104 307 21 -349 121 -19 259
7718 259 38 -144 -270 -8 392 158 48 -201 -64 -49 216 -69 -7 -261 -27 -25 -47 216 -329 -118 -244 65
7740 65 255 72 -188 -122 -63 61 209 49 -46 -259 -155 95 351 24 -283 -232 77 237 90 -134 -287 -24
7762 -24 91 72 197 -86 -231 -198 -144 94 119 -39 -188 -229 141 151 22 -342 -377 -13 186 212 96 -166 -110
7785 -110 -96 238 208 -19 -80 -182 196 204 153 250 -78 20 184 346 68 63 -448 111 25 249 2 -154 -318 -60
7809 -60 362 164 -8 -86 -297 -61 44 96 14 -171 -1 -165 239 -19 -110 -142 -63 57 90 46 -223 -206 65
7832 65 195 205 185 -69 -43 -132 243 337 -36 133 -99 -23 322 264 -22 -18 -282 38 177 259 38 -213 -71 285
7856 285 326 -102 -177 -240 -154 174 244 193 -270 -74 -180 239 184 -104 -246 -234 -138 41 91 -142 -27 -79 59 129
7880 129 62 -35 -181 -14 8 250 369 -107 -12 -21 113 174 336 -89 -138 76 175 159 -12 108 -286 -143 174
7903 174 127 -156 -189 98 97 174 107 -14 -131 -73 -142 261 176 22 -179 -19 292 241 205 98 -145 -16 296 41
7927 41 210 -135 -411 -65 108 82 -13 -133 -353 -29 118 416 -147 -273 -245 -59 232 166 -18 -169 -422 -120
7949 -120 -2 97 215 -153 -134 155 193 68 53 -134 -163 164 288 -25 -20 -89 -49 148 236 -55 -36 54 -112 379
7973 379 328 -207 -423 68 54 276 33 36 -206 -135 90 379 105 -139 -132 -149 65 50 -155 -111 -349 -43 131
7996 131 27 -160 -331 -103 18 181 155 -77 -270 -177 -34 67 -40 -133 -211 -35 448 157 101 -103 -172 50
8018 50 149 145 66 -330 -119 -165 298 24 -13 -271 -176 50 267 266 -227 -316 36 111 -24 111 -196 -162 -36 223
8042 223 438 57 -132 -216 -110 129 293 85 -150 -167 -189 173 387 33 -225 -221 112 241 248 -21 -184 37
8064 37 174 280 70 0 -478 -224 -67 -26 -33 -134 -203 79 142 207 153 -134 -213 89 11 160 172 -126 -156 307
8088 307 6 128 -140 -166 -113 96 327 355 105 -40 -64 74 199 94 20 -139 -304 236 145 -387 -279 -12
8110 -12 -176 -15 137 83 -36 -201 40 197 -51 69 -254 -210 181 196 231 9 -125 96 250 85 -147 -50
8132 -50 72 -33 129 4 -99 -90 -29 45 175 -19 -109 -245 -163 48 360 289 -230 -331 -157 -22 175 282 -247
8155 -247 -176 -349 155 233 84 -147 -194 -124 163 332 77 15 -108 188 255 15 -88 -307 -54 73 12 -1 55
8178 55 -129 -293 0 280 10 1 -20 -218 8 142 168 47 -135
8191a35
$$ Imaginary data points
##PAGE= N=2
##DATA TABLE= (X++(I..I)), XYDATA
0 0 0 0 0 0 0 0 0 0 0 0 2 -8 8 -8 8 -16 16 -24 24 -32 40 -46 55 -64 73 -86 99 -115 135 -153 175 -199 227
33 227 -257 292 -329 370 -412 461 -516 575 -638 708 -783 867 -958 1059 -1167 1285 -1414
50 -1414 1559 -1718 1895 -2087 2307 -2554 2832 -3153 3525 -3961 4482 -5121 5918 -6952 8348
65 8348 -10346 13457 -19012 31951 -126517 19513 194837 -25116 45313 -87306 -109632
76 -109632 54949 53614 63178 28596 -163916 -31374 101775 4719 22519 31892 -104987 -42550
88 -42550 71528 26011 18735 10422 -83229 -20521 33762 15288 84236 -23474 -133869 37315
100 37315 37460 -7694 94013 -34893 -114764 9172 23152 79462 59347 -107673 -68116 11666
112 11666 32589 117541 9517 -148257 -49355 66145 63349 43776 -27153 -95604 -37006 59430
124 59430 78649 30491 -80561 -84967 55044 40982 -10971 55579 -28125 -97992 19958 52182
136 52182 33875 12382 -59923 -27725 4330 3520 81008 20914 -96581 -30357 21325 20980 67804
149 67804 13330 -89702 -58469 32367 75209 48782 -42168 -81413 -21430 30574 73454 60749
161 60749 -80445 -106970 30649 67341 45487 11049 -81278 -58606 33305 56287 53020 -28766
173 -28766 -84161 -1336 28125 21307 51412 -15438 -76477 -17375 35914 43831 19619 -27968
185 -27968 -38555 -21016 5910 56657 49144 -45313 -73260 -3028 38197 47754 27382 -46847
197 -46847 -63804 -8049 44419 71934 7601 -79236 -49121 14002 54856 64858 -23368 -84535
209 -84535 -26245 33271 55885 36889 -35097 -67352 -21935 41826 63995 11013 -53289 -43501
221 -43501 2488 28301 44035 19759 -47832 -51461 8877 37360 36678 6968 -41548 -41098 -5098
234 -5098 40305 59460 -8871 -64508 -28258 12147 41503 48624 -13120 -64006 -39565 24977
246 24977 71457 31573 -49423 -57684 -10419 33881 57670 19420 -50927 -57670 -1602 50305
258 50305 53980 -5749 -59917 -36992 15318 44718 39303 -14360 -52612 -27767 15338 47285
270 47285 34890 -27202 -51066 -15628 21494 42651 25035 -26201 -46726 -20920 27220 54711
282 54711 14968 -41690 -42872 -8366 32430 51279 8949 -48210 -47277 2128 50373 45205 -14504
295 -14504 -51306 -31939 11054 50280 40057 -24946 -57305 -23004 29130 51891 18703 -35404
307 -35404 -45087 -12265 30382 48977 10989 -41223 -43189 -2035 39869 41555 -4652 -40801 -32375
320 -32375 1419 38908 39949 -8781 -46944 -32094 14217 47017 28045 -21345 -42868 -23535
332 -23535 17225 48615 25869 -31670 -49944 -13153 34507 45334 7253 -35725 -40423 -7664
344 -7664 38685 46720 -3646 -47199 -34953 9351 43505 32624 -14371 -43285 -28437 15165
356 15165 47184 26515 -25708 -45062 -16738 25000 42059 15858 -28476 -41637 -12341 30618
368 30618 43065 6729 -36589 -37978 -1820 36107 36754 -2671 -37318 -33886 3300 42309 34520
381 34520 -14352 -43926 -25551 16387 41308 23913 -19122 -42979 -21996 24658 46498 15465
393 15465 -33274 -41459 -6164 30557 38338 7530 -34908 -39670 -625 40095 36688 -8415 -40321
406 -40321 -27676 8695 37083 29388 -11637 -41479 -26349 18329 41630 18960 -21070 -38675
418 -38675 -17482 22816 39606 14798 -27541 -40251 -8599 30701 37262 5108 -33446 -35003
430 -35003 -295 33543 34525 -2164 -38356 -32305 7815 40802 28918 -15293 -39227 -23163 14690
443 14690 40090 22839 -20354 -43041 -17388 28392 39372 8380 -26892 -34627 -7861 27291
455 27291 35222 6898 -32739 -35141 2034 32989 29959 -3003 -33731 -28479 4930 34558 29722
468 29722 -10100 -39555 -24534 16646 37216 18611 -15615 -36732 -21620 22612 40783 12000
480 12000 -26322 -36511 -8115 26675 34386 9438 -31841 -38739 2670 34671 30278 -3017 -37132
493 -37132 -27943 10635 33664 24937 -10924 -36095 -20681 13311 34947 20408 -18314 -35803
505 -35803 -14003 20232 31535 12408 -18029 -34348 -13593 24868 35828 9209 -29825 -35742
517 -35742 68 29978 30044 1926 -34905 -30996 7353 33580 29040 -9139 -40029 -22294 16179
530 16179 35791 20622 -19725 -37568 -13709 23271 34675 9102 -24780 -31285 -6922 24890
542 24890 32126 4377 -30870 -29944 6210 27533 20637 645 -27222 -27994 7373 30062 21691
555 21691 -7148 -31762 -20383 10644 30192 22776 -15485 -36683 -12433 17264 30001 18650
567 18650 -20068 -39760 -10373 29170 35986 2199 -33612 -27597 3264 27076 28635 -2528 -34737
580 -34737 -25232 11714 32358 19326 -14301 -30882 -13657 13832 27162 15241 -16071 -29474
592 -29474 -9851 14913 27743 14353 -21196 -30916 -5672 21141 29534 4651 -26808 -24651 -2018
605 -2018 22456 30512 1193 -31212 -28017 4289 35620 25721 -13723 -33044 -20516 13630 37119
618 37119 16632 -21116 -32583 -12418 21704 34445 7832 -28717 -31584 2759 28617 20552
630 20552 -3339 -20606 -20476 -1181 23578 24748 -4573 -27385 -17896 6546 23771 18317 -6101
643 -6101 -24537 -19196 7734 28097 17021 -11489 -28260 -16291 14701 30771 13409 -19884
655 -19884 -31373 -6735 21261 26883 8301 -23973 -32065 -1420 30193 29318 -6046 -35571 -19966
668 -19966 13528 28235 16656 -13487 -28655 -11904 13777 26380 12472 -17768 -25023 -6317
680 -6317 15123 23364 6578 -17305 -20042 -5870 11896 23835 10674 -19489 -27687 -4077 23031
693 23031 26349 -262 -25688 -21824 1840 24243 24694 -5631 -29380 -20017 7777 31668 20527
706 20527 -18270 -31953 -10858 18392 30459 6926 -23156 -24285 -4725 21230 27754 -786
718 -786 -26753 -20439 4312 24819 17942 -8742 -21056 -12798 4441 19691 15938 -6027 -21695
731 -21695 -15306 7558 24334 13286 -11269 -21723 -12597 9973 25765 11420 -15105 -24392 -11087
744 -11087 17373 29152 5299 -23514 -25269 -548 24683 22023 -3363 -23298 -21275 4566 28000
757 28000 18516 -11084 -26873 -14247 13950 26350 8275 -15672 -21243 -6730 13480 20927 6823
770 6823 -14782 -21506 -5548 17639 20792 1708 -16552 -17756 -2535 16691 19817 1308 -18934
783 -18934 -20083 11 22138 20991 -4994 -25737 -17003 9511 24998 13730 -11044 -24208 -13055
796 -13055 13629 27234 8993 -19006 -24946 -3933 20369 22419 152 -20792 -19010 1902 20240
809 20240 17173 -3420 -19973 -16381 5366 21416 13364 -8406 -19151 -10606 7057 18445 11371
822 11371 -7665 -19903 -11143 9986 21095 9395 -12276 -21044 -7391 14001 20159 5594 -14936
835 -14936 -20956 -4039 17981 20720 1124 -20299 -19327 3597 21405 15616 -5900 -21298 -13766
848 -13766 8626 20420 11487 -9126 -21764 -9387 13246 19768 5893 -13070 -18544 -4154 13699
861 13699 16694 4213 -14237 -18056 -1373 15149 16223 875 -16889 -16000 2742 16821 14258
874 14258 -2984 -18316 -13651 5230 18511 13261 -7399 -21025 -9596 10688 18443 9202 -11616
887 -11616 -20281 -5320 13343 17853 5476 -15608 -18969 -44 15660 16038 470 -18105 -14681
900 -14681 3626 15675 13627 -3372 -18055 -11988 5641 16500 11677 -6892 -18197 -8841 8197
913 8197 16782 9077 -9463 -18226 -5942 10802 16607 6795 -13436 -17757 -1483 13076 15558 2932
927 2932 -16024 -15013 1447 13881 15449 -1205 -18127 -12218 4310 16041 13067 -6375 -17708
940 -17708 -9245 6778 17167 9599 -9673 -17154 -6449 10240 16891 5341 -12484 -15979 -2527
953 -2527 12081 14883 2777 -14098 -14651 473 12772 14979 -808 -17004 -11052 2766 13991
966 13991 13788 -5640 -17385 -8724 5710 16950 9206 -10199 -14648 -6495 8128 16835 5133
979 5133 -11579 -14110 -3519 10759 14883 3590 -13064 -14828 -65 12719 14013 -346 -16562
992 -16562 -11875 3572 13568 12915 -5335 -16671 -7430 5232 15151 9240 -9773 -13844 -5460 6925
1006 6925 15595 5222 -10351 -13357 -5205 9997 15347 2752 -12411 -13999 -252 12603 12281
1019 12281 -603 -14720 -11139 3803 12142 11451 -3918 -15572 -6952 4579 12680 9709 -7310
1032 -7310 -13854 -6445 5532 16081 6218 -10810 -12856 -4503 9448 15663 1751 -12881 -12750 123
1046 123 12233 10580 -826 -12093 -10445 2501 11350 10139 -2223 -13697 -8370 3616 12328
1059 12328 10545 -6661 -14174 -5742 5360 14720 7264 -10873 -12537 -3596 9007 14682 1159
1072 1159 -11576 -10090 -1186 10304 11323 -349 -10581 -10578 832 11904 10297 -2214 -13687 -8795
1086 -8795 4856 12494 8457 -6002 -13943 -4904 6383 12378 5477 -9296 -10455 -3288 6149 12937
1100 12937 2594 -9524 -9061 -3519 8263 12857 994 -10040 -11373 -1367 13196 10963 -2878
1113 -2878 -12096 -10120 4129 13349 7175 -5277 -11961 -6116 5437 11580 6718 -7848 -11727 -3050
1127 -3050 6475 11719 3400 -8834 -9593 -3530 8343 12857 -488 -10064 -9213 -896 11987 9447
1141 9447 -3616 -9015 -7997 1983 10512 7154 -2116 -10670 -8449 4692 11535 6588 -5321 -12575
1155 -12575 -5480 6965 12674 3987 -10057 -10726 -2136 8111 13051 296 -12335 -9054 932 11248
1169 11248 8733 -4328 -8790 -7249 2062 11835 5836 -4581 -9106 -6873 4679 11395 4052 -6102
1183 -6102 -9271 -3070 5421 8830 3873 -6143 -9633 -3009 7251 10455 528 -8189 -7402 -2339 8370
1198 8370 10239 -1727 -8414 -8230 -399 12071 8696 -4483 -10239 -7405 4957 12615 3150 -6223
1212 -6223 -8484 -5135 6649 11149 1660 -7551 -8506 -2128 7819 8993 -589 -8261 -6456 479 7366
1227 7366 6366 -516 -6003 -7822 -771 10157 6806 -3581 -6984 -6356 1473 10177 5221 -3755 -7707
1242 -7707 -6707 3831 11156 4544 -5930 -10769 -4086 9133 9790 -485 -7128 -8601 -1404 9876
1256 9876 9060 -2588 -9466 -7248 2673 10503 5338 -5269 -7998 -4189 4430 8852 2041 -4516 -6210
1271 -6210 -4767 4596 8936 966 -5364 -5984 -2622 5856 7359 904 -4685 -7362 -2571 7215 7747
1286 7747 299 -6605 -8758 565 10227 5783 -2868 -6837 -6802 1903 10487 5193 -4387 -9154 -5167
1301 -5167 6706 9846 928 -6212 -7407 -1850 7582 6801 -410 -5175 -6854 -1164 8038 6244 -1967
1316 -1967 -6357 -5248 1399 6545 4077 -987 -5442 -6173 1555 7947 4473 -2293 -7121 -5642 4241
1331 4241 8881 2544 -4368 -7194 -3838 5453 8658 1623 -6188 -8787 -1056 9040 7061 -1962 -7553
1346 -7553 -6648 2223 8705 4048 -3085 -6745 -5105 3827 8638 2631 -4844 -6881 -2147 5382 6036
1361 6036 340 -3283 -5550 -2700 5344 6443 371 -4527 -6164 -1065 6442 5396 -622 -4739 -5968
1376 -5968 274 6914 5372 -756 -7018 -6405 2966 8385 3377 -3314 -7165 -4093 4642 7605 1853
1391 1853 -4445 -7261 -2401 6474 7244 -343 -6124 -5723 316 6900 4578 -1626 -4994 -4915 725 6418
1407 6418 4012 -1902 -5645 -4262 2667 6275 2811 -2167 -5891 -3733 2972 6274 3276 -3311 -6976
1422 -6976 -3047 4982 7273 1054 -5350 -5898 -1143 5647 6129 -535 -5482 -5852 542 7744 4572 -2089
1438 -2089 -6371 -4573 3224 6855 2587 -2728 -6247 -3042 4269 5922 1818 -4251 -6024 -582 4498
1453 4498 5068 809 -4575 -4438 -673 4057 5553 -269 -5026 -4714 -314 6199 4731 -2238 -5276 -4533
1469 -4533 2055 6881 2906 -2544 -6125 -3572 3992 5956 1797 -3507 -6330 -1328 4730 5151 1181
1484 1181 -4855 -5517 -252 4382 5863 -457 -6154 -3880 777 5677 4390 -2856 -4514 -3075 1183
1499 1183 6108 2073 -2873 -4290 -3579 3125 5599 1546 -2222 -5518 -2559 4088 5025 1713 -4141
1514 -4141 -6101 -217 4755 4995 -233 -6043 -3943 1159 4670 4259 -1921 -4838 -3047 890 5819
1529 5819 2798 -2816 -4024 -3480 2773 6344 909 -2461 -4915 -2630 5087 4635 379 -3588 -5286
1544 -5286 243 4742 3136 68 -4328 -3646 1056 3448 4055 -1066 -4530 -2895 499 5140 3577
1559 3577 -2902 -4182 -3085 2203 6441 1197 -3130 -4638 -2485 4945 4658 -487 -2981 -4444 35
1574 35 4822 2757 364 -3948 -4188 1154 3709 3461 -265 -5137 -3085 1432 4587 3473 -2647 -4310
1590 -4310 -2597 2018 5851 880 -3331 -3232 -2147 3299 4434 -212 -2164 -3876 -1261 4093 2902
1605 2902 738 -2896 -4968 498 4408 3326 37 -4807 -3336 1559 4242 2965 -2144 -4455 -1809
1620 -1809 1796 4616 1803 -3204 -3237 -1841 2767 4572 -243 -2209 -3506 -2181 4633 3857 -292 -2633
1636 -2633 -4490 -46 4729 2369 -354 -3790 -3421 1856 3469 2287 -702 -4187 -2437 1648 3885
1651 3885 2455 -2341 -3410 -2033 1847 5202 1223 -2763 -3714 -2029 3756 4377 -453 -2791 -4287
1666 -4287 -92 5066 2166 -765 -2997 -3445 1370 3584 1913 -453 -3920 -2512 1777 3435 2411
1681 2411 -1868 -4154 -1213 1904 3781 1291 -2827 -3411 -1375 3114 4454 -457 -2565 -2886 -934
1696 -934 3770 3018 -483 -2538 -3802 478 4203 2308 -405 -3781 -3515 2245 3882 1868 -1792 -4264
1712 -4264 -1535 2589 3937 873 -2865 -3236 -386 2924 3376 -123 -3009 -2721 -213 3404 2285 -741
1728 -741 -2008 -2807 346 4028 1963 -843 -2976 -2560 1730 3114 1291 -841 -3384 -1920 2066 3226
1744 3226 1610 -1666 -4074 -998 2922 3221 329 -2638 -3362 -314 3171 3385 -334 -3469 -3117 1104
1760 1104 3818 1764 -1381 -3129 -2003 2091 3080 1146 -1501 -3253 -1298 2011 2687 1278 -1945
1775 -1945 -3398 -560 2329 2466 599 -2290 -2868 -129 2353 2526 397 -2577 -3154 314 3663 2395
1791 2395 -1074 -3318 -1963 1519 3211 1927 -1307 -3897 -1961 2907 3709 644 -2859 -3208 15
1806 15 3023 2390 99 -2425 -2974 390 3206 2352 -816 -2921 -1830 830 2428 1283 -495 -2312
1822 -2312 -1940 956 2640 1869 -875 -2984 -1604 1683 2670 1535 -1442 -3360 -1049 2055 2842 1066
1838 1066 -2229 -3310 -647 2935 3243 119 -3667 -2679 1204 3053 1961 -998 -2984 -1932 1204
1853 1204 3040 1914 -1433 -3551 -896 2407 2435 228 -1648 -1940 -722 1643 2503 1054 -2081 -3051
1869 -3051 -26 2299 1932 236 -1927 -2156 22 2259 2612 21 -2790 -2450 1017 3073 2060 -962
1885 -962 -3290 -1565 1650 3084 1243 -1959 -3116 -728 2362 2855 420 -2455 -2754 -49 2995 2265
1901 2265 -601 -2659 -1450 867 1968 1396 -139 -2568 -1802 1140 2600 1298 -1337 -1910 -790 1041
1917 1041 1838 1273 -986 -2581 -1703 1838 3010 879 -2116 -2628 61 2003 1896 644 -2227 -3185
1933 -3185 218 3089 2416 -851 -3353 -1475 1780 2312 1296 -1250 -2779 -773 1780 2262 860 -2084
1949 -2084 -2220 -295 1563 2113 106 -1989 -2167 -216 2089 1767 -243 -1720 -1689 -55 2012 1929 -148
1966 -148 -2819 -1801 1523 2369 1177 -686 -2184 -1296 887 2504 1719 -1851 -3157 -485 2114 2293
1982 2293 -77 -2028 -1740 -375 2096 2141 -48 -2388 -1977 1228 2875 826 -992 -1718 -1209 861
1998 861 2095 1183 -726 -2657 -868 1579 1652 591 -949 -1898 -648 1355 2254 678 -1928 -2097 -177
2015 -177 1786 2096 199 -1825 -2058 42 2366 1967 -565 -2391 -1343 911 2003 946 -253 -2104
2031 -2104 -1705 1374 2699 873 -1745 -2238 65 1525 1360 643 -1344 -2187 -275 1908 2060 -428
2047 -428 -2265 -1345 579 1423 1025 -97 -1421 -1732 344 2070 1299 -924 -1851 -1031 1175 2020 969
2064 969 -914 -2284 -752 2096 2167 112 -1683 -1586 -164 1618 1643 70 -1680 -2010 307 1991 1291
2081 1291 -680 -1733 -1052 510 1859 1332 -749 -2243 -1178 1845 2129 85 -1037 -1387 -495 1311
2097 1311 1469 305 -1626 -2341 133 1888 1012 -162 -1156 -1568 12 1641 1453 -141 -2297 -1499 1459
2114 1459 1990 718 -949 -1610 -818 1216 1740 692 -1109 -2185 -327 2038 1075 -98 -973 -1723 -349
2131 -349 1674 1654 161 -2201 -1715 1196 1867 859 -375 -1922 -1233 730 1855 1041 -906 -2119 -514
2148 -514 1226 1393 546 -702 -1769 -1122 1619 2042 318 -1585 -1703 566 1731 1118 145 -1476 -1885
2165 -1885 443 2177 1170 -711 -1975 -888 1068 1177 627 -367 -1823 -1145 1147 2064 688 -1318
2181 -1318 -1995 -109 1307 1100 424 -1185 -2156 -38 1942 1264 -293 -1600 -1033 480 1292 962 67
2198 67 -1841 -1412 971 1899 726 -782 -1762 -483 958 1386 953 -908 -2116 -500 1777 1658 101
2215 101 -1302 -1316 -85 1185 1541 332 -1473 -1674 176 1946 817 -674 -1310 -1198 377 1636 1059
2232 1059 -462 -2154 -931 1343 1455 410 -760 -1335 -368 838 1536 841 -1214 -1869 127 1664
2248 1664 1124 -112 -1068 -1303 -45 1449 1394 -199 -1940 -1179 947 1648 659 -435 -1325 -948 741
2265 741 1577 670 -979 -1698 -186 1287 1084 14 -911 -1198 -459 1219 1381 13 -1493 -1138 536
2282 536 1180 1044 -116 -1004 -1438 276 1943 1019 -939 -1574 -447 881 1328 702 -608 -1708 -1167
2299 -1167 1134 1875 482 -1386 -1454 219 1127 891 276 -895 -1541 -68 1676 1110 -602 -1499 -953
2316 -953 617 1164 866 -208 -1660 -856 1011 1537 450 -1134 -1207 -230 716 1256 585 -812 -1715 -304
2334 -304 1222 1064 110 -1348 -984 -33 1211 1367 111 -1533 -1319 775 1729 470 -736 -1325 -742
2351 -742 593 1230 900 -952 -1776 -454 1374 1458 -64 -899 -1175 -15 835 1125 414 -1249 -1333 286
2369 286 1406 673 -197 -1125 -909 46 1150 1063 -406 -1710 -729 777 1261 538 -534 -1304 -473 969
2387 969 1650 376 -1003 -1516 -11 1140 988 123 -1252 -1193 45 1624 1142 -345 -1499 -794 683
2404 683 794 561 -251 -1072 -1076 660 1616 559 -970 -1352 -222 744 780 263 -654 -1463 -361 1116 1393
2423 1393 -112 -1115 -969 191 1058 983 32 -1115 -1391 266 1402 886 -611 -1674 -471 701 1152
2440 1152 606 -907 -1385 -350 1015 1147 137 -1079 -867 49 837 1053 61 -1009 -1114 108 1149
2457 1149 609 -221 -843 -1004 347 991 1034 -56 -1427 -749 780 1172 393 -780 -918 -442 395 1166
2475 1166 589 -698 -1640 -339 913 1359 60 -1154 -960 -92 1240 1069 -50 -1198 -1103 409 1193
2492 1193 552 -548 -1060 -417 679 900 705 -339 -1259 -489 851 731 640 -745 -942 -259 851 1338
2510 1338 443 -1024 -968 -81 982 978 -146 -974 -1029 -64 1287 888 -367 -1064 -826 488 1044 605 -143
2529 -143 -1222 -818 705 1304 752 -851 -1467 -18 763 783 484 -597 -756 43 742 1189 -277 -1058
2547 -1058 -556 183 711 677 14 -949 -950 -153 1279 794 -313 -1071 -493 483 915 704 -460 -1513 -523
2566 -523 636 965 412 -793 -1026 -250 647 1030 147 -1020 -764 -16 1061 1110 -360 -1012 -859 320
2584 320 1189 630 -407 -1107 -589 607 1123 217 -461 -780 -514 599 996 593 -338 -1200 -92 601 1227
2603 1227 65 -1192 -664 91 667 940 114 -1000 -679 313 1091 863 -611 -825 -601 147 1075 554
2621 554 -530 -1046 -636 766 1051 337 -356 -1262 -151 669 889 164 -951 -879 152 774 990 165 -891
2640 -891 -661 -127 722 1053 -221 -1006 -591 460 1051 592 -108 -1087 -634 455 1124 628 -721 -1336 -517
2659 -517 727 717 420 -788 -1038 -124 807 1075 72 -1131 -674 142 590 876 -97 -1107 -646 246 1179
2678 1179 665 -420 -1018 -632 293 1043 522 -440 -1038 -462 721 1136 338 -632 -1125 -9 606 972 341
2697 341 -1005 -1017 -160 922 886 -13 -901 -519 33 606 890 -160 -1103 -601 376 1054 591 -463 -1052
2716 -1052 -594 471 1341 508 -427 -887 -218 872 991 124 -806 -806 -159 708 942 -90 -912 -877 42 686
2736 686 1162 -345 -1007 -496 283 1145 612 -493 -926 -601 530 993 434 -547 -1121 -349 595 1337 133
2755 133 -715 -957 168 787 867 189 -1086 -798 95 640 724 49 -1086 -822 329 1186 675 -526 -1018
2774 -1018 -564 500 1225 540 -511 -1071 -235 641 1059 379 -917 -752 -3 897 935 203 -782 -862 -227
2793 -227 848 775 -162 -700 -625 393 994 781 -499 -1126 -439 471 1070 693 -666 -1055 -441 606 1192
2812 1192 351 -842 -985 -65 769 984 89 -940 -1018 -256 792 756 -385 -814 -637 291 953 628 -340
2831 -340 -990 -746 308 941 587 -438 -989 -496 565 970 318 -570 -735 -242 835 827 37 -827 -890 -10
2851 -10 757 885 -74 -841 -711 147 802 746 -158 -890 -714 712 850 347 -365 -980 -513 631 1064 380
2871 380 -636 -777 -133 568 818 172 -603 -789 -92 1001 937 -28 -497 -980 124 907 418 -105 -835
2890 -835 -484 288 970 623 -556 -647 -457 472 1111 429 -410 -1052 -379 625 852 92 -574 -954 -192 965
2910 965 917 12 -592 -1009 86 967 766 -222 -952 -837 86 1060 369 -469 -905 -376 419 862 415 -488
2930 -488 -955 -223 469 914 125 -744 -573 -246 835 924 -133 -939 -882 -157 690 914 -275 -929 -717 177
2950 177 1151 650 -252 -1024 -565 422 1064 333 -481 -624 -225 333 947 399 -794 -705 -68 839 846 -58 -680
2971 -680 -782 111 841 719 -199 -984 -446 296 1106 697 -407 -766 -433 622 941 558 -580 -920 -345
2990 -345 666 1002 79 -717 -924 -197 597 754 30 -749 -952 -155 857 856 -127 -754 -727 116 791 657
3010 657 -297 -955 -484 629 970 420 -334 -1024 -240 341 755 351 -646 -1050 -179 689 838 133 -988
3029 -988 -613 -166 910 640 -207 -940 -608 146 863 547 -203 -912 -408 411 682 364 -351 -1062 -277 878
3049 878 661 209 -621 -595 -237 705 761 3 -749 -1032 213 948 971 -135 -990 -493 124 1017 692 -408
3069 -408 -811 -551 540 1196 378 -756 -1045 -413 709 976 189 -564 -963 -86 677 972 234 -950 -952
3088 -952 294 835 931 -221 -1074 -640 132 944 730 -248 -938 -712 489 966 382 -411 -1131 -307 619
3107 619 845 347 -643 -1051 -9 825 747 102 -752 -853 -60 680 818 -123 -1064 -504 239 862 906 -199
3127 -199 -907 -359 511 977 412 -341 -765 -459 590 1136 136 -514 -845 -195 710 736 286 -747 -848
3146 -848 95 849 621 -140 -936 -811 331 819 654 -429 -750 -415 225 799 552 -554 -942 -417 672
3165 672 1019 182 -526 -691 -345 676 936 52 -772 -977 -7 801 903 84 -871 -707 270 1013 520 -323
3185 -323 -1004 -612 314 915 533 -466 -781 -336 566 819 188 -674 -927 -487 758 913 311 -689 -790
3204 -790 85 723 799 -29 -752 -803 146 974 883 -363 -880 -569 391 853 668 -438 -895 -539 417 970
3224 970 275 -666 -755 -271 627 763 130 -414 -810 10 808 862 -54 -595 -808 225 721 683 -76 -1143
3244 -1143 -703 230 732 516 -426 -952 -444 645 896 296 -388 -829 -196 737 841 25 -677 -850 -172
3263 -172 612 471 -210 -832 -691 152 788 724 -397 -968 -612 252 991 420 -553 -717 -413 547 914 301
3283 301 -519 -880 -368 697 917 118 -579 -996 -95 691 834 97 -609 -574 268 733 849 -88 -738 -494
3303 -494 239 632 391 -93 -808 -361 538 792 494 -462 -941 -392 545 871 252 -548 -792 -22 736 583
3323 583 -101 -903 -774 244 749 628 -165 -779 -632 193 715 226 -260 -764 -384 273 737 141 -438 -1086
3343 -1086 -313 397 662 100 -499 -931 8 657 728 -101 -789 -345 57 572 738 -89 -677 -410 304 926
3363 926 461 -14 -729 -404 315 842 493 -468 -922 -172 639 923 218 -537 -729 -300 524 908 32 -658
3383 -658 -773 63 586 597 -89 -941 -495 160 1026 450 -387 -791 -357 384 971 459 -596 -1013 -299 461
3403 461 985 85 -561 -844 -175 656 991 264 -739 -688 -166 707 570 -216 -726 -376 68 804 611 -154
3423 -154 -876 -489 459 740 433 -433 -871 -322 413 749 53 -500 -723 -340 798 756 64 -444 -759 -195
3443 -195 668 851 -105 -766 -488 -28 605 466 -66 -583 -587 285 864 565 -344 -772 -687 491 924 394 -616
3464 -616 -747 -459 516 927 496 -684 -594 -182 771 687 -19 -252 -814 -63 679 605 -57 -767 -622 226 870
3485 870 672 -186 -709 -352 530 923 294 -472 -678 -207 516 723 68 -616 -808 -124 777 935 -252 -624
3505 -624 -634 137 695 757 -353 -819 -629 279 764 573 -255 -859 -604 332 820 268 -426 -844 -237 911
3525 911 660 234 -579 -662 41 656 1018 126 -737 -772 107 807 506 -107 -477 -705 76 715 553 -480
3545 -480 -939 -568 359 895 487 -499 -673 -211 622 744 211 -558 -975 -55 654 1146 -43 -488 -661 -95
3565 -95 597 809 -70 -669 -609 328 1002 503 -42 -835 -485 267 965 184 -527 -815 -407 583 836 87 -496
3586 -496 -644 -260 595 928 -114 -878 -619 221 772 774 113 -697 -608 290 696 527 -355 -900 -646 199 887
3607 887 505 -471 -784 -393 472 639 241 -626 -899 -85 641 920 53 -714 -776 -15 626 744 -15 -881
3627 -881 -637 232 841 511 -261 -710 -446 432 697 461 -568 -869 -411 445 1031 87 -625 -920 -141 738
3647 738 757 97 -728 -517 17 739 674 -149 -624 -644 80 940 710 -293 -693 -463 456 830 399 -465 -995
3668 -995 -283 516 727 235 -760 -784 -109 527 962 89 -654 -604 -62 582 748 -71 -661 -480 214 758 558
3689 558 -112 -689 -293 246 1108 315 -503 -603 -468 303 870 245 -320 -749 -270 774 917 258 -748
3708 -748 -813 -3 761 682 -300 -827 -700 308 701 603 -72 -863 -391 451 842 489 -560 -764 -293 594
3728 594 674 268 -561 -978 -202 762 757 82 -565 -903 59 646 537 -50 -685 -579 233 648 306 -403 -869
3749 -869 -504 392 714 511 -457 -717 -523 582 734 153 -536 -909 -192 743 882 264 -742 -758 302
3768 302 838 643 -140 -716 -471 94 1050 606 -324 -871 -536 426 737 472 -573 -798 -253 825 777 398
3788 398 -763 -816 -144 538 937 48 -737 -886 -22 702 860 -88 -801 -476 250 846 566 -83 -734 -634
3808 -634 301 767 258 -371 -765 -212 661 803 113 -496 -690 -274 887 919 335 -638 -910 -19 826 631
3828 631 -144 -853 -537 106 895 523 -231 -829 -580 373 797 435 -360 -869 -626 412 693 154 -473 -578
3848 -578 -169 577 741 69 -589 -762 -25 690 787 16 -913 -622 245 723 618 -338 -956 -420 491 703
3868 703 358 -421 -1029 -62 350 1018 338 -581 -769 -9 861 886 180 -689 -723 82 851 632 -178 -636 -793
3889 -793 269 771 710 -270 -663 -539 452 798 499 -375 -950 -372 532 1109 358 -414 -986 -329 436 852
3909 852 114 -725 -763 19 930 747 -97 -695 -364 238 762 626 -201 -996 -619 252 919 758 -377 -915
3929 -915 -353 495 974 478 -674 -740 -278 408 754 324 -588 -928 -293 619 797 -79 -647 -861 48 750
3949 750 645 -38 -973 -549 14 639 342 -401 -1111 -426 340 917 125 -172 -862 -333 508 979 358 -617
3969 -617 -715 -322 700 862 -54 -677 -705 -28 899 636 -115 -500 -710 284 794 645 -284 -746 -606 506
3989 506 810 428 -466 -843 -330 637 699 364 -642 -861 -276 631 707 148 -664 -389 -76 434 759 -27
4009 -27 -810 -983 317 781 554 -229 -686 -618 534 840 730 -356 -803 -309 423 915 179 -673 -707 -339
4029 -339 676 926 268 -555 -739 -123 732 807 -184 -916 -685 68 924 595 -151 -752 -812 338 934 580
4049 580 -251 -727 -492 539 980 469 -518 -984 -158 442 890 126 -757 -774 -234 670 797 -23 -760 -709
4069 -709 135 821 572 -430 -889 -637 319 757 421 -223 -977 -328 328 1066 475 -450 -943 -324 458 1139
4089 1139 348 -690 -759 -172 745 733 94 -921 -946 60 962 726 -264 -733 -575 277 893 488 -324 -808
4109 -808 -547 619 712 475 -632 -896 -289 519 968 217 -621 -857 -138 624 752 -187 -921 -863 125 941
4129 941 765 -334 -920 -843 173 1080 546 -207 -752 -728 619 779 397 -739 -854 -157 546 649 185
4148 185 -712 -729 -249 698 906 184 -594 -822 -228 842 507 -268 -672 -706 161 726 572 -297 -706 -489
4168 -489 536 1093 238 -431 -777 -365 546 848 242 -519 -941 -236 685 715 73 -697 -699 -42 555 776 -24
4189 -24 -905 -589 409 746 436 -308 -1002 -524 306 875 326 -470 -960 -223 779 802 292 -545 -763 -211
4209 -211 494 983 101 -666 -780 -135 722 535 -176 -999 -688 238 765 566 -373 -769 -574 392 894 423
4229 423 -526 -685 -351 388 867 85 -701 -806 -147 630 693 144 -439 -769 11 607 825 382 -725 -470
4249 -470 268 719 661 -217 -807 -557 473 690 603 -476 -901 -476 468 538 163 -478 -793 -233 535 705
4269 705 28 -628 -703 -67 435 661 -113 -633 -890 207 680 413 -276 -811 -540 444 974 484 -525 -840
4289 -840 -522 600 902 340 -549 -736 -243 646 858 85 -722 -754 10 766 487 -15 -815 -690 191 624
4309 624 670 -99 -773 -457 215 562 426 -425 -881 -581 206 935 329 -457 -903 -339 608 811 143 -503
4329 -503 -821 -58 836 769 258 -703 -754 151 629 567 -72 -616 -520 214 780 457 -414 -935 -572 294 784
4350 784 372 -586 -719 -476 413 1057 283 -611 -736 25 705 663 -142 -805 -876 5 969 653 -323 -663 -714
4371 -714 91 844 691 -214 -578 -453 349 895 426 -489 -838 -124 490 780 254 -452 -736 -108 570 578 160
4392 160 -776 -713 148 733 672 -57 -843 -743 173 753 579 -213 -896 -304 412 909 344 -282 -703 -452 327
4413 327 891 145 -566 -783 -132 449 805 -91 -717 -596 150 848 679 -215 -853 -639 217 918 610 -200
4433 -200 -831 -459 411 957 290 -655 -837 -429 629 736 127 -721 -783 -239 610 620 -21 -613 -853 -2
4453 -2 608 622 31 -784 -560 65 610 720 -442 -812 -626 330 977 573 -537 -907 -437 401 875 310
4473 310 -656 -797 -307 709 862 254 -687 -858 -271 559 872 -95 -835 -646 200 737 719 -269 -864 -743
4493 -743 397 782 438 -423 -819 -427 419 1210 476 -527 -922 -544 508 798 85 -799 -827 9 651
4512 651 983 -182 -811 -559 8 690 796 -157 -974 -630 481 985 373 -331 -909 -420 463 932 417
4531 417 -676 -1042 -304 914 845 178 -690 -964 -31 609 831 12 -1030 -935 243 874 742 -201 -968
4550 -968 -740 242 1053 607 -373 -868 -603 514 897 299 -650 -958 -237 753 833 270 -800 -1059 -180 966
4570 966 827 -125 -898 -932 120 999 841 -369 -1003 -620 301 1116 863 -445 -1172 -757 540 1019 416
4589 416 -800 -1037 -267 757 1129 225 -571 -836 -205 870 934 -54 -830 -917 119 921 927 -293 -1167 -780
4609 -780 346 1033 633 -348 -1075 -549 531 1002 413 -755 -993 -387 610 942 360 -891 -1100 -237 791
4628 791 808 70 -927 -906 72 1081 880 -307 -916 -509 338 929 769 -431 -1199 -697 290 1173 399 -692
4648 -692 -1224 -434 689 1046 306 -811 -1055 -286 937 1131 -40 -944 -974 291 748 919 -56 -993 -951
4667 -951 540 1129 673 -190 -1148 -653 401 1056 487 -667 -1165 -295 970 1080 278 -762 -960 -204
4685 -204 757 1087 129 -795 -1012 0 1074 852 -295 -1050 -827 379 1044 684 -453 -1140 -595 464
4703 464 939 594 -637 -973 -472 750 1032 228 -686 -1037 -266 934 839 -75 -905 -951 192 1089 982
4722 982 -249 -1096 -661 416 917 708 -427 -1044 -562 570 1332 394 -579 -806 -208 631 1015 584 -810
4741 -810 -989 -270 992 1136 92 -835 -859 271 837 765 -126 -1047 -737 330 1123 734 -456 -1052 -623
4760 -623 447 959 430 -660 -1155 -223 655 1046 277 -826 -1104 -17 954 917 101 -1074 -1032 131 995
4779 995 806 -324 -946 -642 277 1071 832 -633 -993 -404 455 1037 489 -637 -1312 -421 791 1190 136
4798 136 -839 -1155 -148 1071 956 153 -897 -1014 22 1118 1087 -176 -989 -848 301 1172 753 -451
4816 -451 -1082 -570 327 1125 598 -618 -1312 -485 842 1089 263 -817 -1195 -191 821 1063 165 -893
4834 -893 -1137 -142 979 1124 -173 -1120 -1130 314 1145 659 -399 -1141 -441 426 998 603 -640 -1106 -283
4853 -283 600 1176 329 -725 -938 -188 763 915 184 -964 -802 -440 1040 992 -272 -1253 -855 219 986
4872 986 816 -308 -1120 -532 636 1182 599 -426 -1199 -588 659 967 436 -769 -1086 -308 948 1245
4890 1245 252 -877 -1009 253 1062 1137 -117 -1013 -833 351 1027 668 -331 -1249 -549 398 1295 568 -613
4909 -613 -1137 -571 556 1058 478 -730 -1163 -387 867 1154 251 -858 -1089 -129 761 859 -210 -807 -933
4928 -933 363 1117 892 -111 -1223 -709 295 1212 650 -455 -1187 -494 589 1060 329 -739 -1334 -207
4946 -207 903 1206 244 -1035 -800 -103 874 1025 0 -899 -1104 103 1093 855 -462 -1252 -684 353
4964 353 1127 623 -557 -1247 -489 631 1258 620 -773 -1195 -523 886 1385 246 -922 -1033 -169 1201
4982 1201 1162 -17 -1399 -1225 106 1204 866 -239 -1256 -829 417 1114 498 -480 -1280 -715 618
4999 618 1300 807 -654 -1218 -339 1075 1116 511 -1057 -1100 -106 953 1222 -107 -994 -977 115 1151 888
5018 888 -325 -1014 -828 432 1224 643 -492 -1325 -649 794 1137 352 -841 -1232 -405 984 1008 -38
5036 -38 -1016 -1059 -261 949 1155 -252 -1139 -1016 175 1199 1000 -318 -1183 -777 611 1030 790 -524
5054 -524 -1008 -550 730 1189 287 -850 -1033 -566 933 1182 77 -814 -1019 -30 757 1025 36 -1224
5072 -1224 -767 73 1078 771 -313 -1121 -835 294 1158 551 -727 -1109 -661 464 1138 553 -642 -1106
5090 -1106 -412 891 935 28 -976 -930 46 903 827 -78 -989 -934 332 1068 861 -105 -1094 -811 422 1197
5110 1197 592 -489 -1077 -637 675 1067 585 -700 -1190 -364 872 1191 153 -917 -1191 -250 1020
5127 1020 1029 70 -1028 -1172 216 1038 783 -257 -747 -860 227 1029 508 -547 -1248 -548 511 960
5145 960 367 -819 -940 -501 724 1080 358 -761 -1102 -185 889 1070 102 -818 -1194 88 1064 814
5163 814 -149 -1056 -624 213 969 752 -410 -1194 -534 275 1047 673 -597 -1117 -543 931 1125 458 -735
5182 -735 -1071 -280 934 944 29 -814 -931 88 1078 826 -93 -946 -702 420 966 525 -424 -1201 -574
5201 -574 464 1301 478 -645 -1058 -534 644 1122 371 -744 -1090 -324 924 1038 215 -831 -1243 -33
5219 -33 1013 817 -243 -1107 -659 222 1007 928 -44 -906 -695 397 1173 608 -563 -862 -543 585 1077
5238 1077 214 -705 -1161 -245 706 968 -108 -1152 -935 -5 1061 1205 -104 -986 -934 -28 1137 594
5256 594 -144 -1141 -802 233 1131 676 -552 -967 -504 662 980 652 -915 -1259 -370 540 870 177 -1031
5275 -1031 -989 -109 680 1205 121 -904 -678 -5 899 799 -187 -936 -800 474 1045 462 -499 -980 -542
5294 -542 334 1156 488 -440 -1163 -372 490 918 187 -697 -1117 -205 792 933 36 -749 -810 -156 987 825
5314 825 -232 -741 -780 264 857 820 -232 -933 -765 318 832 511 -655 -1034 -379 564 1155 320 -605
5333 -605 -996 -169 948 862 103 -567 -1060 -21 881 960 -22 -917 -977 -19 824 740 -280 -1136 -500 453
5353 453 1247 609 -310 -851 -373 628 992 354 -599 -1162 -420 746 1027 192 -920 -1089 -215 935 990
5372 990 98 -1021 -858 292 1175 727 -319 -1101 -877 337 1127 620 -532 -1237 -669 548 830 617
5390 617 -562 -1179 -273 620 1180 136 -844 -1154 -394 822 853 62 -1015 -992 35 1157 658 -343
5408 -343 -1210 -742 284 1039 833 -499 -1207 -656 556 1020 430 -590 -1044 -426 899 1111 342 -910
5426 -910 -1162 -315 828 847 3 -942 -1075 83 944 918 -469 -927 -864 72 1194 757 -316 -1188 -652
5445 -652 617 1130 421 -789 -1170 -394 769 1359 249 -700 -973 -136 1044 912 150 -1048 -1253 -95
5463 -95 1259 767 -265 -1099 -801 198 960 622 -281 -879 -852 572 990 511 -561 -1169 -418 688 909
5482 909 152 -885 -1034 -155 922 1096 0 -916 -918 267 845 819 -138 -1151 -679 430 1128 778 -93
5501 -93 -1257 -531 547 1227 609 -607 -1011 -243 585 1065 298 -630 -972 -407 795 842 -16 -983 -811
5520 -811 -47 971 749 34 -1049 -980 315 996 705 -499 -1020 -702 545 1031 423 -567 -1125 -532 531
5539 531 1226 302 -723 -1163 -98 857 1093 38 -1052 -884 59 776 752 -146 -1038 -1007 73 961 684
5558 684 -285 -1144 -481 545 820 592 -418 -1037 -492 533 1184 262 -622 -1206 -155 780 895 204 -683
5577 -683 -1003 15 956 760 -96 -1117 -1007 187 844 572 -239 -1101 -517 456 1060 745 -461 -1099 -418
5596 -418 473 958 349 -788 -876 -231 627 858 -28 -802 -973 -81 907 790 172 -841 -830 247 1117 726
5616 726 -389 -1146 -503 273 1102 460 -460 -981 -709 523 826 381 -858 -868 -120 282 993 62 -751
5635 -751 -1126 -55 793 976 -160 -663 -928 221 694 910 -373 -942 -585 466 1106 533 -374 -985
5653 -985 -424 631 778 338 -499 -1086 -96 832 821 88 -705 -1032 121 756 854 -116 -1029 -799 -31 989
5673 989 906 -73 -879 -550 247 879 401 -640 -1113 -228 464 872 322 -909 -1010 -354 700 1152 178
5692 178 -708 -1057 -106 747 1021 94 -967 -805 51 963 750 -90 -917 -781 32 931 248 -445 -1061 -594
5712 -594 341 759 382 -638 -1067 -420 613 972 286 -624 -977 -125 807 896 122 -749 -999 33 792
5731 792 634 -27 -891 -635 130 1125 637 -416 -1023 -609 321 1089 667 -271 -954 -499 701 1002 602
5750 602 -608 -853 -184 599 986 165 -717 -777 -151 886 836 -234 -930 -774 110 808 893 -329 -778 -725
5770 -725 280 842 624 -502 -790 -595 475 628 281 -658 -912 -410 554 915 279 -496 -873 -117 641
5789 641 896 191 -604 -695 -19 860 684 -76 -757 -585 21 768 595 -313 -1001 -518 653 765 649 -407
5809 -407 -1148 -415 659 940 149 -745 -890 -365 654 743 113 -904 -716 -10 686 696 -93 -960 -582 125
5829 125 1084 624 -295 -1018 -542 367 885 586 -660 -798 -292 695 741 300 -595 -805 -144 737 846 72
5849 72 -680 -769 -8 655 784 -364 -958 -696 334 699 568 -477 -982 -536 516 922 366 -507 -836
5868 -836 -326 614 854 231 -749 -780 -32 720 739 10 -757 -734 -154 797 607 -146 -893 -733 328 765 521
5889 521 -417 -967 -673 194 820 340 -350 -988 -463 559 885 287 -496 -876 -265 681 752 188 -824 -827
5909 -827 -45 753 792 -165 -816 -622 77 820 774 -262 -844 -383 375 887 337 -467 -813 -454 514 772
5929 772 307 -545 -667 -153 636 794 -25 -766 -561 -35 675 711 -1 -799 -632 179 887 552 -335 -979
5949 -979 -539 331 948 203 -403 -678 -345 443 850 320 -433 -638 -220 636 706 205 -835 -1046 -64 800
5969 800 765 329 -683 -711 56 717 601 -210 -561 -398 507 715 366 -362 -858 -354 487 809 320 -622
5989 -622 -1043 -105 479 701 122 -623 -762 125 653 574 -140 -712 -732 -167 864 532 -140 -637 -628 1 805
6010 805 291 -514 -779 -387 359 877 413 -504 -743 57 545 900 187 -465 -842 -150 407 586 2 -805
6030 -805 -749 171 687 722 -266 -690 -452 363 747 460 -183 -862 -553 271 754 210 -387 -902 -183 501 880
6051 880 246 -562 -468 -54 608 830 -174 -634 -846 242 761 455 -382 -762 -556 103 438 484 -299 -890
6071 -890 -428 270 879 283 -398 -939 -183 467 687 -41 -633 -477 -99 594 702 1 -853 -784 195 644
6091 644 432 -152 -1013 -420 328 787 349 -444 -586 -322 389 645 462 -349 -941 -232 545 847 198 -664
6111 -664 -780 205 579 706 91 -909 -556 -91 524 554 -36 -515 -461 196 667 532 -559 -821 -263 399
6131 399 630 278 -317 -892 -331 537 836 205 -801 -688 -96 562 512 55 -708 -489 159 674 680 -90 -649
6152 -649 -394 181 649 497 -417 -604 -591 158 652 335 -462 -726 -233 499 735 188 -410 -766 -41 429
6172 429 746 68 -586 -639 36 520 612 -46 -673 -401 142 790 362 -321 -626 -264 334 601 247 -431 -784
6193 -784 -169 403 802 76 -518 -628 103 576 403 211 -576 -532 40 801 436 -114 -651 -653 35 537 488
6214 488 -230 -1017 -412 307 684 126 -314 -785 -53 548 714 108 -508 -593 -203 524 454 -5 -657 -488 56
6235 56 743 352 -283 -816 -372 191 654 420 -269 -549 -90 237 625 451 -475 -701 -67 336 647 306
6255 306 -523 -637 -241 579 430 -76 -635 -637 -7 791 605 -174 -596 -474 335 665 538 -311 -629 -381 330
6276 330 682 325 -425 -831 -140 284 724 164 -382 -561 144 392 450 -28 -525 -530 81 497 596 -22 -797
6297 -797 -458 90 842 412 -320 -681 -247 174 627 124 -474 -890 -132 421 639 356 -323 -567 -87 693
6317 693 672 75 -506 -494 -47 334 688 -79 -719 -496 413 483 446 -353 -691 -303 339 689 493 -416 -728
6338 -728 -176 350 617 168 -526 -562 -109 620 592 95 -699 -498 128 449 451 -90 -406 -156 207 623 413
6359 413 -132 -700 -387 388 775 364 -288 -377 -319 466 537 384 -394 -577 0 463 335 81 -617 -501 217
6380 217 637 423 -32 -682 -226 310 367 416 -65 -518 -434 257 482 276 -284 -432 -116 321 468 71 -247
6401 -247 -588 -3 364 642 38 -218 -450 87 482 214 -47 -469 -414 155 614 258 -386 -659 -297 512
6421 512 639 103 -185 -628 -314 238 436 102 -507 -326 27 485 425 -172 -446 -657 -257 369 487 -169
6441 -169 -702 -271 89 591 525 -310 -691 -445 323 593 346 -381 -454 -242 382 689 -17 -511 -652 -9 485
6462 485 548 -141 -506 -423 -49 509 692 -93 -765 -466 216 546 8 -159 -583 -268 306 781 516 -667
6482 -667 -551 -248 422 737 71 -617 -452 -101 497 377 25 -519 -402 73 567 336 31 -443 -563 202
6502 202 486 551 -209 -849 -321 216 573 488 -182 -431 -381 355 615 177 -361 -615 80 625 522 124 -733
6523 -733 -311 -226 566 552 0 -431 -342 256 495 202 -108 -412 -463 297 492 380 -297 -496 -198 237 442
6544 442 355 -86 -575 -194 317 625 74 -480 -309 173 394 507 -47 -312 -735 -2 553 619 -184 -483 -291
6565 -291 56 436 381 -286 -492 -405 427 686 258 -272 -697 53 127 585 143 -552 -864 247 464 565 145
6586 145 -322 -540 272 482 516 24 -446 -407 12 463 570 -362 -516 -201 185 574 406 -274 -641 -106 399
6607 399 487 -24 -315 -595 -187 434 602 -38 -530 -449 72 480 350 -294 -321 -435 228 528 324 -147 -520
6628 -520 -333 162 541 284 -148 -294 -206 380 548 -125 -526 -615 -104 354 355 231 -291 -509 -125 626 365
6649 365 -66 -532 -331 117 574 583 -47 -306 -291 4 732 335 -462 -350 -65 382 552 135 -471 -481 -163
6670 -163 557 473 -22 -435 -450 112 505 420 -42 -489 -472 -47 408 402 -286 -502 -403 22 377 266 -175 -679
6692 -679 -249 359 535 83 -565 -406 -14 64 434 44 -346 -704 46 451 511 -9 -278 -553 -37 342 356
6713 356 -103 -436 -313 201 531 267 -173 -406 -181 213 405 177 -201 -330 -17 297 183 -26 -421 -398
6733 -398 -182 272 424 -51 -402 -304 170 554 382 -230 -388 -518 189 345 478 -146 -653 -254 196 637
6753 637 78 -355 -429 -150 403 328 179 -403 -468 178 365 455 157 -549 -447 111 418 448 -70 -645 -598 114
6775 114 341 283 -88 -505 -341 32 456 254 -443 -496 -276 118 427 262 -381 -340 -23 518 402 -14 -434
6796 -434 -126 59 431 232 46 -377 -286 62 425 366 -369 -440 -284 147 371 9 -105 -431 -198 490 193
6817 193 229 -491 -391 -262 367 600 214 -405 -241 220 538 344 -174 -351 -236 -17 336 555 -57 -535
6837 -535 -330 216 621 329 -244 -477 -53 321 407 132 -314 -514 -85 341 351 138 -492 -425 -84 394 530
6858 530 -171 -412 -291 -16 549 263 -199 -599 -347 112 502 232 -350 -426 8 347 156 179 -207 -347 99
6879 99 313 288 110 -565 -719 113 517 383 -61 -475 -460 39 552 281 -277 -365 -272 411 308 61 -94 -571
6901 -571 -126 227 330 156 -357 -348 64 538 593 -102 -476 -310 -70 419 606 -173 -641 -183 166 399 398 -5
6923 -5 -454 -246 331 443 478 -172 -566 -243 240 324 150 -183 -389 -215 215 148 -7 -362 -197 -153 422 541
6945 541 36 -171 -294 184 357 484 48 -278 -307 96 265 235 -229 -561 -198 206 390 -42 -162 -399 -90
6966 -90 317 452 202 -129 -397 -99 368 353 -54 -197 -289 -4 331 436 -229 -484 -227 41 488 376 -92
6987 -92 -97 -295 157 275 259 -200 -628 -267 214 304 299 -180 -218 -14 487 381 -90 -199 -355 -46 218 397 -34
7010 -34 -377 -331 179 702 199 -134 -414 -208 106 489 -62 30 -453 -151 405 317 -45 -70 -380 -77 291 330
7032 330 128 -398 -148 18 492 334 -53 -529 -25 11 258 299 -227 -386 -141 31 339 138 -36 -193 -72
7053 -72 351 332 145 -247 -178 -189 84 198 -61 -388 -336 -248 312 189 -87 -267 -341 124 201 315 -212 -274 -95
7076 -95 33 584 135 -241 -431 -115 167 182 190 -156 -346 -121 363 366 135 -44 -261 71 192 261 -99 -333
7098 -333 17 115 184 394 64 -204 -175 232 338 165 -230 -228 -10 165 380 219 -456 -533 -59 377 372 -237 -301
7121 -301 -316 67 386 227 -168 -159 -293 271 515 260 28 -387 -218 153 156 195 -211 -521 -307 193 341 184
7143 184 -291 -269 -43 100 263 40 -140 -173 125 472 297 -179 -387 -175 85 636 253 -217 -376 -58 330
7164 330 403 -105 -84 -253 -103 303 13 -94 -320 -340 -155 240 244 242 -242 -224 -84 246 248 -48 -285 -406 77
7187 77 352 219 -87 -272 -194 284 401 144 -163 -295 12 191 166 133 -67 -499 117 427 183 86 -181 -282
7209 -282 -62 256 337 -147 -553 -81 107 282 126 -165 -406 -27 89 474 252 -90 -324 -157 61 352
7229 352 240 -97 -357 220 312 153 154 -201 -265 41 153 340 -205 -232 -254 37 291 333 -324 -370 -182 114 374
7252 374 93 -135 -209 -123 57 160 157 -106 -326 -102 241 381 -123 -381 -171 105 217 413 -83 -315 -205
7273 -205 -21 351 301 17 -335 -67 65 400 75 -403 -432 5 124 306 130 -185 -263 -123 171 143 -208
7294 -208 -174 -427 23 209 144 68 -313 -107 111 371 291 -97 -243 92 459 403 185 -62 -342 -60 5 288
7316 288 258 -341 -236 37 349 204 -55 -174 -133 117 253 120 174 -200 -288 55 338 319 -75 -336 -230 209
7338 209 279 311 -81 -227 -120 229 274 82 -120 -208 17 502 308 -213 -428 -191 3 385 158 122 4 -232
7360 -232 -27 216 141 249 -309 -357 117 31 279 -94 -451 -269 77 215 -80 -333 -321 -108 112 338 48
7381 48 -167 -111 -21 233 317 48 -261 -131 209 219 106 -326 -301 -131 77 241 293 -85 -216 -84 116 33 44
7404 44 -48 -324 -175 264 345 237 27 -147 -31 266 248 -98 -212 -103 170 83 75 -63 -369 -107 54 277
7426 277 195 -327 -173 -83 142 396 34 -49 -271 206 252 478 -55 -195 -358 -198 227 308 -249 -194 -93 195
7448 195 350 301 -181 -126 -284 -113 52 148 -291 -281 18 283 418 125 -80 -293 146 112 257 92 -192 -229
7470 -229 -88 42 136 33 -167 -257 -141 179 151 19 -85 -277 -83 258 170 -157 -333 -127 81 158 151 -171
7492 -171 -334 -118 130 228 -235 -288 -248 -47 30 310 357 -257 -179 50 381 146 -5 -411 94 160 396 409 39
7515 39 -366 -220 11 276 263 -293 -328 33 -39 259 176 -199 -249 -55 234 309 -177 -214 -218 182 193 221 -63 -232
7539 -232 -349 -111 155 106 -25 -185 -103 57 318 -103 -212 -418 -248 30 312 263 17 -284 -79 189 281
7560 281 -53 -375 -127 2 267 45 -124 -115 -376 -18 37 325 -231 -254 -189 275 379 108 -72 -247 -222 316
7582 316 319 219 -16 -243 7 147 225 -68 -127 -155 -48 208 310 -56 -247 -324 4 264 63 215 -300 -8
7604 -8 85 215 266 22 -213 -258 261 157 139 -106 -21 193 303 308 138 13 -220 66 305 352 -140 -312 -217 187
7628 187 85 281 8 -166 -74 -91 45 23 37 -185 -219 62 182 170 -36 -325 -281 266 394 145 -354 -312 86
7651 86 184 276 89 -237 -24 -70 173 293 77 -183 -284 -23 379 332 -118 -487 -67 -23 313 167 71 -113
7673 -113 -176 255 93 39 -263 -61 -14 165 123 -163 -217 -5 -57 340 172 -45 -155 -203 20 353 94 -127
7695 -127 24 -427 124 125 99 -115 -251 -30 108 289 139 -15 -68 6 209 349 -132 -49 -225 54 219 163
7717 163 -123 -193 -12 40 167 168 22 -231 -111 214 35 -21 -14 -266 -259 32 643 91 -118 -153 -189 242 186 63
7741 63 -123 -383 34 -34 436 -37 -340 -92 28 84 130 -93 -144 -187 220 286 101 -382 -204 96 295 250 -4
7764 -4 -88 -233 -184 187 206 -1 113 -168 47 134 179 -116 -515 -20 -39 236 149 15 -275 -81 202 244 -87
7787 -87 -203 -164 -19 151 195 167 -38 -154 -173 328 89 54 -208 -258 -249 370 194 13 -285 -164 -10 321 282
7810 282 -114 -200 -257 247 99 121 -274 -192 -88 39 261 171 -273 -338 49 129 407 -22 -109 -134 103 254 120
7833 120 -86 -118 -221 92 137 305 -200 -354 -115 -9 258 188 -73 -173 -13 191 263 135 -114 -170 -186 55
7855 55 237 102 -76 -106 0 186 398 48 -303 -153 62 349 61 -41 -27 -327 201 35 127 89 -83 -197
7877 -197 44 223 259 -66 -231 -169 1 229 -96 -41 -203 -103 155 45 83 -5 -380 -10 -29 100 67 -295
7899 -295 -203 -18 249 181 19 -288 -124 189 182 -8 -316 -142 15 98 104 17 -125 -240 -156 352 1 -66 -98 -81
7923 -81 35 272 199 49 -152 -299 86 201 218 -59 -315 13 149 34 234 -177 -200 -158 -26 309 79 -11
7945 -11 -352 104 358 320 103 -16 -211 -8 87 265 -98 -189 -470 51 144 194 18 -432 -92 88 204 188
7967 188 -99 -375 72 -21 88 -204 114 -200 14 90 84 -67 -203 -168 -71 254 132 214 -244 -269 107 293 201
7990 201 -133 -193 -36 36 285 120 -228 -262 54 8 105 297 -29 -170 -33 80 277 -166 -39 -53 63 193
8012 193 191 -173 -94 -272 -97 121 -3 -155 -138 48 -29 306 25 -348 -50 -366 -7 76 10 -263 -226 16 30
8035 30 251 162 27 -99 -131 123 279 36 -134 -58 -4 221 -1 -50 -79 45 101 184 125 -190 -201 0 132 58
8059 58 -58 -82 -216 80 31 78 -40 -76 -103 -59 -45 -22 93 -207 -260 99 209 185 67 -128 -348 116 50 -24
8083 -24 -126 -322 -226 136 332 216 -91 -328 -34 26 56 64 -69 -201 -139 213 250 -45 -62 -296 43 136 133 -144
8107 -144 -325 -133 202 339 322 76 -121 -17 264 42 30 -180 -145 168 248 194 199 -17 -83 -299 145 172 5
8130 5 -240 -36 47 -25 -20 -110 -61 33 32 104 118 -275 -74 -287 189 96 66 -48 -193 -135 114 54 94 -107 53 30
8156 30 139 53 -101 -150 -17 -20 180 324 -13 -73 -89 -80 208 -71 -4 -143 -181 216 215 122 -147 -251 -311 204 169
8181 169 -109 -159 -217 -36 -159 213 49 -169 -82 75
8191G5
##END NTUPLES=NMR FID
##END=
