##TITLE=1H_Ser A-32ON
 200.13MHz, CDCl3,
 8 sc
 
 3.9.2025
##JCAMPDX= 6.0         $$ Bruker NMR JCAMP-DX V2.0
##DATA TYPE= NMR FID
##DATA CLASS= NTUPLES
##ORIGIN= UXNMR, Bruker Analytische Messtechnik GmbH
##OWNER= pz
$$ XWIN-NMR		Version 3.5
$$ Wed Sep  3 14:38:01 2025 Russian Standard Time (UT+4h)  she@DPX200
##.OBSERVE FREQUENCY= 200.1313
##.OBSERVE NUCLEUS= ^1H
##.DELAY= (6, 6)
##.ACQUISITION MODE= SIMULTANEOUS
##.ACQUISITION SCHEME= undefined
##.AVERAGES= 8
##.DIGITISER RES= 18
##SPECTROMETER/DATA SYSTEM= spect
##.PULSE SEQUENCE= zg30
##.SOLVENT NAME= CDCl3
##.SHIFT REFERENCE= (INTERNAL, CDCl3, 0, 14.3821)
##AUDIT TRAIL= $$ (NUMBER, WHEN, WHO, WHERE, WHAT)
$$ ##TITLE= Audit trail, XWIN-NMR		Version 3.5
$$ ##JCAMPDX= 5.01
$$ ##ORIGIN= Bruker BioSpin GmbH
$$ ##OWNER= she
$$ F:/spectra/data/she/nmr/H-C/1/audita.txt
$$ ##AUDIT TRAIL=  $$ (NUMBER, WHEN, WHO, WHERE, WHAT)
(   1,<2025-09-03 14:36:40.51 +0400>,<she>,<DPX200>,
      <created by zg, POWCHK disabled, PULCHK disabled
       configuration hash MD5:
       00 E9 B6 7A A2 85 ED C7 34 08 36 98 17 FE 4E 26
       data hash MD5: 16K
       53 F8 96 85 32 A3 AB 93 58 B5 2A 95 79 54 22 2F>)
$$ ##END=
$$ 
$$ hash MD5
$$ FC A8 4D BA D5 AA 10 F1 24 B5 D6 66 DD 7D B6 3A
##$RELAX= 
##$RELAX= 
##$RELAX= 
##$RELAX= 
##$RELAX= 
##$RELAX= 
$$ Bruker specific parameters
$$ --------------------------
##$DU= <F:/spectra>
##$EXPNO= 1
##$NAME= <H-C>
##$PROCNO= 1
##$TYPE= <nmr>
##$USER= <she>
##$AMP= (0..31)
100 100 100 100 100 100 100 100 100 100 100 100 100 100 100 100 100 100 
100 100 100 100 100 100 100 100 100 100 100 100 100 100 
##$AQSEQ= 0
##$AQ_mod= 1
##$AUNM= <au_zg>
##$AUTOPOS= <>
##$BF1= 200.13
##$BF2= 200.13
##$BF3= 200.13
##$BF4= 200.13
##$BF5= 200.13
##$BF6= 200.13
##$BF7= 200.13
##$BF8= 200.13
##$BYTORDA= 1
##$CFDGTYP= 0
##$CFRGTYP= 5
##$CHEMSTR= <none>
##$CNST= (0..31)
1 1 145 1 1 1 1 1 1 1 1 1 1 1 1 1 1 1 1 1 1 1 1 1 1 1 1 1 1 1 1 1 
##$CPDPRG= <>
##$CPDPRG1= <>
##$CPDPRG2= <>
##$CPDPRG3= <>
##$CPDPRG4= <mlev>
##$CPDPRG5= <mlev>
##$CPDPRG6= <mlev>
##$CPDPRG7= <mlev>
##$CPDPRG8= <mlev>
##$CPDPRGB= <>
##$CPDPRGT= <>
##$D= (0..31)
0 0.7 0 0 0 0 0 0 0 0 0 0.03 0 0 0 0 0 0 0 0 0 0 0 0 0 0 0 0 0 0 0 0 
##$DATE= 1756895799
##$DBL= (0..7)
120 120 120 120 120 120 120 120 
##$DBP= (0..7)
150 150 150 150 150 150 150 150 
##$DBP07= 0
##$DBPNAM0= <>
##$DBPNAM1= <>
##$DBPNAM2= <>
##$DBPNAM3= <>
##$DBPNAM4= <>
##$DBPNAM5= <>
##$DBPNAM6= <>
##$DBPNAM7= <>
##$DBPOAL= (0..7)
0.5 0.5 0.5 0.5 0.5 0.5 0.5 0.5 
##$DBPOFFS= (0..7)
0 0 0 0 0 0 0 0 
##$DE= 6
##$DECBNUC= <off>
##$DECIM= 32
##$DECNUC= <off>
##$DECSTAT= 4
##$DIGMOD= 1
##$DIGTYP= 9
##$DL= (0..7)
0 120 120 120 120 120 120 120 
##$DP= (0..7)
150 150 150 150 150 150 150 150 
##$DP07= 0
##$DPNAME0= <>
##$DPNAME1= <>
##$DPNAME2= <>
##$DPNAME3= <>
##$DPNAME4= <>
##$DPNAME5= <>
##$DPNAME6= <>
##$DPNAME7= <>
##$DPOAL= (0..7)
0.5 0.5 0.5 0.5 0.5 0.5 0.5 0.5 
##$DPOFFS= (0..7)
0 0 0 0 0 0 0 0 
##$DQDMODE= 0
##$DR= 18
##$DS= 0
##$DSLIST= <SSSSSSSSSSSSSSS>
$$ [...]
##$SUBNAM0= <"">
##$SUBNAM1= <"">
##$SUBNAM2= <"">
##$SUBNAM3= <"">
##$SUBNAM4= <"">
##$SUBNAM5= <"">
##$SUBNAM6= <"">
##$SUBNAM7= <"">
##$SUBNAM8= <"">
##$SUBNAM9= <"">
##$SW= 18.0517328524113
##$SWIBOX= (0..15)
0 0 2 0 0 0 0 0 0 0 0 0 0 0 0 0 
##$SW_h= 3612.71676300578
##$TD= 16384
##$TD0= 1
##$TE= 0
##$TE2= 300
##$TE3= 300
##$TEG= 300
##$TL= (0..7)
0 120 120 120 120 120 120 120 
##$TP= (0..7)
150 150 150 150 150 150 150 150 
##$TP07= 0
##$TPNAME0= <>
##$TPNAME1= <>
##$TPNAME2= <>
##$TPNAME3= <>
##$TPNAME4= <>
##$TPNAME5= <>
##$TPNAME6= <>
##$TPNAME7= <>
##$TPOAL= (0..7)
0.5 0.5 0.5 0.5 0.5 0.5 0.5 0.5 
##$TPOFFS= (0..7)
0 0 0 0 0 0 0 0 
##$TUNHIN= 0
##$TUNHOUT= 0
##$TUNXOUT= 0
##$USERA1= <user>
##$USERA2= <user>
##$USERA3= <user>
##$USERA4= <user>
##$USERA5= <user>
##$V9= 5
##$VALIST= <valist>
##$VCLIST= <CCCCCCCCCCCCCCC>
##$VD= 0
##$VDLIST= <DDDDDDDDDDDDDDD>
##$VPLIST= <PPPPPPPPPPPPPPP>
##$VTLIST= <TTTTTTTTTTTTTTT>
##$WBST= 1024
##$WBSW= 4
##$XGAIN= (0..3)
0 0 0 0 
##$XL= 0
##$YL= 0
##$YMAX_a= 196530
##$YMIN_a= -228055
##$ZGOPTNS= <>
##$ZL1= 120
##$ZL2= 120
##$ZL3= 120
##$ZL4= 120
##$ABSF1= 10
##$ABSF2= 0
##$ABSG= 5
##$ABSL= 3
##$ALPHA= 0
##$AQORDER= 0
##$ASSFAC= 0
##$ASSFACI= 0
##$ASSFACX= 0
##$ASSWID= 0
##$AUNMP= <proc_1d>
##$AZFE= 0.1
##$AZFW= 0.1
##$BCFW= 1
##$BC_mod= 2
##$BYTORDP= 1
##$COROFFS= 0
##$CY= -3
##$DATMOD= 1
##$DC= 2
##$DFILT= <>
##$DTYPP= 0
##$F1P= 0
##$F2P= 0
##$FCOR= 0.5
##$FTSIZE= 0
##$FT_mod= 4
##$GAMMA= 1
##$GB= 0.15
##$INTBC= 1
##$INTSCL= 1
##$ISEN= 128
##$LB= 0.25
##$LEV0= 0
##$LPBIN= 0
##$MAXI= 10000
##$MC2= 0
##$MEAN= 0
##$ME_mod= 0
##$MI= 1.114404
##$NCOEF= 0
##$NC_proc= 0
##$NLEV= 6
##$NOISF1= 3.799351
##$NOISF2= 2.8
##$NSP= 1
##$NTH_PI= 0
##$NZP= 0
##$OFFSET= 14.38212
##$PC= 1
##$PHC0= -1563.348
##$PHC1= 10.79228
##$PH_mod= 1
##$PKNL= yes
##$PPARMOD= 0
##$PSCAL= 0
##$PSIGN= 0
##$REVERSE= no
##$SF= 200.129724274929
##$SI= 16384
##$SIGF1= 3
##$SIGF2= 2
##$SINO= 400
##$SIOLD= 16384
##$SREGLST= <1H.CDCl3>
##$SSB= 0
##$STSI= 0
##$STSR= 0
##$SW_p= 3205.1282051282
##$SYMM= 0
##$S_DEV= 0
##$TDeff= 0
##$TDoff= 0
##$TI= <>
##$TILT= no
##$TM1= 0
##$TM2= 0
##$TOPLEV= 0
##$USERP1= <user>
##$USERP2= <user>
##$USERP3= <user>
##$USERP4= <user>
##$USERP5= <user>
##$WDW= 1
##$XDIM= 8192
##$YMAX_p= 0
##$YMIN_p= 0
$$ End of Bruker specific parameters
$$ ---------------------------------
##NTUPLES= NMR FID
##VAR_NAME=  TIME,          FID/REAL,        FID/IMAG
##SYMBOL=    X,             R,               I
##VAR_TYPE=  INDEPENDENT,   DEPENDENT,       DEPENDENT
##VAR_FORM=  AFFN,          ASDF,            ASDF
##VAR_DIM=   8192,          8192,            8192
##UNITS=     SECONDS,       ARBITRARY UNITS, ARBITRARY UNITS
##FACTOR=    0.0002768,     1,               1
##FIRST=     0,             0,               0
##LAST=      2.2672688,     0,               0
##MIN=       0,             -228055,         0
##MAX=       2.2672688,     196530,          0
$$ Real data points
##PAGE= N=1
##DATA TABLE= (X++(R..R)), XYDATA
0@%%%%%%%%%%%%%%%qJ6j6J6j6J6k4L2l2M0m8N3o1P2q2R0j04J20j36J53j72J92
$$ 0 0 0 0 0 0 0 0 0 0 0 0 0 0 0 0 -8 8 -8 8 -8 8 -16 16 -16 24 -24 29 -32 40 -42 48 -56 64 -72 81 -91 101
37A01k15K41k69L00l32L66m05M50m97N47o04O67p33Q06q89R80j084J199j325J472
$$ 101 -114 127 -142 158 -174 192 -213 237 -260 287 -317 350 -383 423 -466 514 -570 629 -696 776
57G76j642J839k076K360k710L158l747M560n763P720j1416K0733q8568j53279
$$ 776 -866 973 -1103 1257 -1453 1705 -2042 2518 -3245 4475 -6941 13792 -74776 -228055
71b28055K15167J41791q8584p4096L8246j837r696M8184r134j14682o85J35257
$$ -228055 -12888 128903 40319 -33777 4469 2632 -7064 41120 31986 -82696 -83381 51876
83E1876N0437p5373o5242j4570K7250K7198o07K361K2422p598m0823O009N8581
$$ 51876 102313 26940 -38302 -52872 -25622 1576 969 3330 25752 18154 -22669 -16660 41921
96D1921k9596r8089L9903J29511j529q5026k5008l436j5743M8161O9923n1769
$$ 41921 12325 -85764 -45861 83650 82121 -2905 -27913 -31349 -47092 1069 70992 19223
108A9223r7799O0642J10314n7786j14178Q122P1330L9347P221j9139m4635k3463
$$ 19223 -78576 -17934 92380 34594 -79584 -71462 -132 39215 46436 27297 -17338 -40801
120d0801L6517K9471l0313j7195K9230K2095pk2110l4594n289J7913J2682J4526
$$ -40801 -4284 25187 -5126 -22321 6909 29004 28997 6887 -27707 -32996 -15083 -2401 12125
133A2125J6145n509l6747k2916K8774K0635k2234R23K6621L607m965m895k6539
$$ 12125 28270 22761 -13986 -36902 -8128 12507 -9727 -8804 17817 21424 16459 11564 -14975
146a4975k7482K0156N5735Q107m7429j1266K5007o493k1735r22J2435J6811J2042
$$ -14975 -42457 -22301 33434 41541 -5888 -17154 7853 1360 -20375 -21297 -8862 7949 19991
159A9991K523j4930l0910k824K6323Q814m879L367J0428K017k2929k1100R920
$$ 19991 22514 7584 -23326 -26150 173 8987 4108 7475 17903 19920 -3009 -24109 -14189
172a4189J1440K031J0954O171q306j5353j0041O689K467o37J6553J1775r051p641
$$ -14189 -2749 -718 10236 16407 8101 -7252 -17293 -10604 -8137 -8774 7779 19554 10503 2862
186B862o771p405j179O587J8847R273j4207r869j007n405j140n19M217J2633N549
$$ 2862 -3909 -11314 -12493 -5906 12941 22214 8007 -1862 -2869 -8274 -9414 -9933 -5716 6917 12466
201A2466j938q839j9022l313J6600J1866L589l691l853K241m615p817j769j433
$$ 12466 10528 1689 -17333 -20646 -4046 7820 11409 7718 3865 6106 1491 -6326 -8095 -9528
215i528R845J7284k114j4990j0665l267N341M011L515Q060j979n094L763m788
$$ -9528 317 17601 15487 497 -10168 -13435 -8094 -4083 -568 7492 5513 419 4182 -606
229f06r510k2Q318J3079K714p182l125p686q962P184R671n78l335K50P061l616
$$ -606 -10116 -10138 -1820 11259 13973 6791 3666 -4020 -12982 -5798 3873 3295 -40 210 7271 3655
245C655j7174p39J2274L727K928L738j629p129p178M920N896p380M031J4060m788
$$ 3655 -13519 -14258 -1984 1743 4671 8409 6780 -349 -7527 -2607 3289 -4091 -60 14000 9212
260I212j3077k450L963M15o655M145J3844k450r959r29p07l90K382L166O626q38
$$ 9212 -3865 -6315 -2352 -1937 -8592 -4447 9397 6947 -3012 -3941 -4648 -5038 -2656 510 7136 6298
276F298n940L164j162q122k46Q453O270o892q052J1005M097k0119n654J7767Q273
$$ 6298 358 3522 2360 -5762 -6008 2445 8715 1823 -6229 4776 8873 -11246 -16900 867 9140
291I140o795n584K966J68m318Q027K554j5301L202K0787q0j8795q268R832R761
$$ 9140 2345 -3239 -273 -105 -4423 3604 6158 -9143 -5941 14846 14766 -4029 -12297 -2465 7296
306G296n189n301K887l46J070J0n512J681K838k331M639L800m767j434J590j751
$$ 7296 2107 -3194 -307 -653 417 427 -5085 -3404 -566 -2897 1742 5542 775 -659 931 -820
322h20l678N993J2184r105k0338J1609K0515j1291j7588L928J0393K699j578j441
$$ -820 -4498 1495 13679 4574 -15764 -4155 16360 5069 -12519 -8591 1802 4501 2923 1482
336A482q962n263J8472J0553j9507r884J3419R507l805q231k001M346K791N33
$$ 1482 -7480 -12743 5729 16282 -3225 -13109 310 9817 6012 -2219 -4220 126 2917 3450
350C450l717l848M545M41o343N237M575p121j555K743k20K326N428j264j1737
$$ 3450 -267 -4115 430 871 -5472 -235 4340 -2781 -4336 -1593 -1813 513 5941 4677 -7060
365g060j103J9178J670k1329j957J5728M224n999n615m209J54O084Q009o892j1849
$$ -7060 -8163 11015 12685 -8644 -10601 5127 9351 3352 -2263 -6472 -6318 -234 7775 883 -10966
380a0966P881J1330n502p417n41L712O332K24l443j051N40k24l241j464P664R38
$$ -10966 -3085 8245 2743 -4674 -5215 -1503 4829 5053 1610 559 1099 875 -2366 -3830 3834 4772
396D772o721R47J605k681J92l15k631J899P575M685r146j0160P122Q662m042k868
$$ 4772 -1949 -1002 603 -2078 -1886 -2201 -4832 -2933 4642 9327 181 -9979 -2857 5805 1763 -1105
412a105J327K943K128k997m970l285R08P754K739n634j511J066j454j77j372L01
$$ -1105 222 3165 5293 2296 -2674 -5959 -5051 2703 5442 -192 -1703 -637 -2091 -2268 -3640 -3339
428c339O179J687j214k025k621O62p85j251N313K766k222j034l551l071J397N06
$$ -3339 2840 4527 3313 1288 -1333 -671 -1456 -2707 2606 5372 3150 2116 -1435 -4506 -3109 -2603
444b603J808K105l40K532j997o126n39K602L008L707m93p36K02l479k270l61j56
$$ -2603 -795 1310 970 3502 1505 -4621 -5160 -2558 450 4157 3664 2928 3130 -349 -2619 -2980 -3136
461c136M794L277j959j142l935k896R89J076J795L513L73Q46j595n398o16J624
$$ -3136 1658 4935 2976 1834 -2101 -4997 -4008 -2932 -1137 2376 2749 3595 2000 -3398 -4014 -2390
477b390J741M830J033j568j683l933j265O37p26L237L630rj246l833l886O81J410
$$ -2390 -649 4181 5214 3646 1963 -1970 -3235 -2598 -3324 -87 3543 3534 2288 -1545 -5431 -4750 -3340
494c340K738M731K7j061j405m115p39M60J435M331K107j284j176m275l975L40
$$ -3340 -602 4129 4156 3095 1690 -2425 -3164 -2704 -1269 3062 5169 3885 2709 -1566 -5541 -5201
510e201K005M522K303j770j61j766l843l75R07K618N268J666j252l078m957r08
$$ -5201 -3196 1326 3629 1859 1698 -68 -3911 -4286 -3379 -761 4507 6173 4921 1843 -3114 -4022
526d022K125Q77K654K010m43m92m429m235P96J652L628M181k43j606k944l273
$$ -4022 -1897 -1020 1634 3644 3201 2709 -1720 -5955 -5159 -3507 121 4302 4059 2453 -491 -3764
542c764M76J094J543M595J811j483k006m657k364O13J802M296K577k008j742k727
$$ -3764 -3288 -2194 -651 3944 5755 4272 2266 -2391 -4755 -4142 -2340 1956 4533 2525 783 -1944
558a944l063P99J287K744M500J09j081j462n042j371J901L136M009J44k305r28
$$ -1944 -5007 -4208 -2921 -177 4323 4432 3351 1889 -3153 -4524 -2623 513 4522 4666 2361 1433
574A433l474k731J186K15K805M830R8k204m286l293J765K464K064K953k9l31j048
$$ 1433 -2041 -4772 -3586 -3371 -566 4264 4362 2158 -2128 -5421 -3656 -1192 872 3825 3796 3465 2417
591B417m450l069J740K624L297K224j513k695l955j549J591L16L259M436r13k719
$$ 2417 -2033 -5102 -3362 -738 2559 4783 3270 575 -3380 -4929 -3338 -3022 237 4673 3760 1041
607A041j298j727j534L32L313N096oj833k616m662o09L061R44R42K057P94j426
$$ 1041 -257 -1984 -3518 -3186 127 5223 5217 3384 768 -3894 -4503 -1442 -498 444 2501 3295 1869
624A869l849l531K35K700M691L322k940j878J105l571j925K081K303K386Q78p7
$$ 1869 -1980 -5511 -5276 -2576 2115 5437 2497 619 1724 -1847 -3772 -1691 612 2998 3876 3799
640C799k956m972n78K647l17K537M371j316l409j597j246K3J302K690K660j34
$$ 3799 843 -4129 -4707 -2060 -2377 160 4531 3215 -194 -1791 -3037 -3014 -1712 978 3638 3504
656C504R1j815n684o70M144R77J245J500j093k199j921j409p5P8M523L778k736
$$ 3504 3595 1780 -3904 -4574 -430 547 1792 3292 2199 0 -1921 -3330 -3405 -3327 1196 4974 2238
673B238k023l07k266n31J914K011J856M06J69k498m268P9K034j34K087L193j908
$$ 2238 215 -92 -2358 -2889 -975 1036 2892 3298 3467 969 -3299 -3220 -1186 -1320 767 3960 2052
690B052k837j200j118L06J215L127K011j409k7j226m197R0K962J333J532M51j643
$$ 2052 -785 -1985 -3103 -2797 -1582 1545 3556 2147 2120 894 -3303 -3213 -251 1082 2614 3065 1422
707A422j771j750m44J61k86L916K254j860j874p49k250Q94J937J754J779j091
$$ 1422 -349 -2099 -2543 -2382 -2668 1248 3502 1642 -232 -981 -3231 -2337 -400 1354 3133 2042
723B042r1j104k922p42K077P95J820R98j683j277k228r39J256J319J285J599p41
$$ 2042 1951 847 -2075 -2817 -740 55 1875 2873 1190 -87 -2315 -3254 -1998 -679 606 2205 1464
740A464m52p48k904L16K139J270J774j33j707r88k046L16P77j65J836J447q11
$$ 1464 1012 264 -2640 -2324 -185 1085 2859 2726 1019 31 -2015 -1699 -922 -1087 749 2196 1385
757A385j471j709j203J456J053J083K139n86j200p08j338l3N97Q89J726L7j005
$$ 1385 -86 -1795 -2998 -1542 -489 594 2733 2147 947 239 -1099 -1132 -535 354 2080 2117 1112
774A112r76j989r45J534M76J521J061j749m49L30j290K17M88J395J958q07j067
$$ 1112 136 -1853 -2798 -1264 -788 733 1794 45 -404 -74 -1364 -1147 -659 736 2694 1887 820
791H20p23j521N2J355K17O73J6q21L82j776j259J351N23J115J129q91n43k22r81
$$ 820 97 -1424 -1372 -17 200 873 889 68 450 -1326 -2585 -1234 -711 404 1533 642 99 -123 -1104
810a104N40J023R1J054O4j063Pj738j34M73JJ340M23r78m65l47o17J024j33L93
$$ -1104 -564 459 550 1604 1668 605 612 -1126 -1260 -787 -786 554 977 -1 -466 -813 -1430 -406 -539 -146
830a46J628j54p13j49j195mJ182K63M66p71j059P45l75p96M5K77P95O30o50M29
$$ -146 1482 1328 615 466 -729 -733 449 712 1178 407 -652 93 -282 -1078 -1033 -756 39 669 19 448
850D48p55p93Q32Q25Q9L44m04j49M40j049J29J67l49L87O63j117ro47o9O97k56
$$ 448 -307 -1100 -268 557 646 990 586 437 877 -172 -43 124 -225 162 825 -292 -301 -948 -1017 -320 -576
871e76J05J387p92l64O87n34K78K74l39M18J24n60N1o57m5P56r88L42P43j037
$$ -576 -471 916 124 -240 447 -87 191 465 126 544 668 108 159 -498 -543 213 -775 -433 310 -727
891g27L79O77p34J05k65R57M96j247M79R77j069k25J066q45J3L24k73k42k79M21
$$ -727 -348 329 -405 -300 -565 392 888 -359 120 1097 28 -197 869 24 37 361 88 -154 -433 -12
911a2N25j521J41P43k49K65O25q43N14P37l91p63k04P72O94p30p9K28j569P54
$$ -12 513 -1008 -867 -124 -373 -108 517 -326 188 925 534 -229 -433 339 1033 303 224 452 -1117 -363
931c63O45q41m84J281K18m42n85M87M94j247Q14J225p70K40L93j649r2R90P01
$$ -363 282 -559 -1043 238 456 14 -571 -84 410 -837 -23 1202 432 672 1065 -584 -676 314 1015
950A015m96j094R40L56j349m42K59l68J231J227j255m14L44J68p1o05R08P88r39
$$ 1015 519 -575 365 721 -628 -1070 -811 -1179 52 1279 24 -390 -46 122 51 -554 354 1142 203
969B03J025J71k414K87R44m52l03Q21O75o12j768N31N74l63L18J030l37O98q1
$$ 203 1228 1399 -1015 -728 216 -236 -539 282 957 345 -1423 -892 -318 -681 -363 667 330 1028 947
988I47j716l08O59J110N83n49l05j84q17L65p5j492J425J451l26o78j119K17L17
$$ 947 -769 -1077 -418 692 1275 726 421 237 -580 -215 -290 -1782 -357 1094 768 90 -1029 -812 -495
1007d95k98J083J018m99l6l1j131k29J21L36J527o74j44kj165o04k8M01J589L37
$$ -495 -793 290 1308 809 773 742 -389 -618 -497 -161 1366 692 548 546 -619 -1223 -1251 -850 739 1076
1027A076j079N51l85n20m40KJ010J153k23J01o10j693n0O97L52K46K70R4K2j398
$$ 1076 -3 548 163 -357 -797 -795 215 1368 1145 1246 636 -1057 -1107 -410 -58 188 458 552 574 -824
1047h24j043P21O74Q27M84L3K78j051j129N53J47O51P31MO9n76j492l36O50R4
$$ -824 -1867 -1146 -472 355 839 872 1150 99 -1030 -477 -330 321 1052 1056 1125 549 -943 -1279 -629 -535
1067e35J061K96l18j24j382j48O64l03P66J264j25K56j111j390J93N42K24J091
$$ -535 526 822 504 380 -1002 -1150 -486 -789 -23 1241 1116 1372 261 -1129 -936 -394 -170 921
1085I21J24l02p75r22k50M3j57J609J262n68m74o32j193O03K82P45J066l13j28
$$ 921 1045 743 -32 -954 -1204 -1161 -1318 291 1553 985 511 -121 -1314 -711 -429 316 1382 1069 941
1104I41o75j354j27MP16J268Q2j71j17j491k94J86J31J517N65l48k5p61j111Q6
$$ 941 266 -1088 -1215 -1211 -495 773 855 684 567 -924 -1218 -1032 -901 616 1181 833 808 47 -1064 -978
1124i78N13Q81J203m46l88p03j184o3M17J57J243M06m85n42o01p82L22N01J335
$$ -978 -465 416 1619 1173 785 82 -1102 -1165 -748 -591 652 1058 573 31 -570 -1352 -1030 -529 806
1143H06P15k00n34r46p43L14M2K38J293L62p03n21j245l62P66L77J209M5l06l0
$$ 806 1521 1321 787 -159 -902 -588 -546 -308 985 1347 644 123 -1122 -1484 -718 -341 868 913 607 577
1163E77p99j093M52N11J014R33n22m82o17j210K87J41O12J218j2n83p01r59l3
$$ 577 -222 -1315 -863 -352 662 1595 1073 591 -26 -1236 -949 -808 -196 1022 1010 427 -274 -1233 -1266
1182a266N95K50Q81Q57l78r3r76j090M32Q85O26M14n72L5l50j034m39L38M71J324
$$ -1266 -671 -421 460 1317 939 846 -130 -1220 -788 97 723 1137 565 600 250 -784 -1223 -885 -414 910
1202I10j21n38J10j002m07J1N83J210Q51o59l44q49o01N44p4K56P56N16k48j406
$$ 910 789 251 361 -641 -1048 -1037 -454 756 1607 948 604 -245 -846 -302 -376 -120 636 1152 904 -502
1222e02j035M5J117L58N16J09l91K14q61n90K13Q25J116L55n63l78m70p63K15
$$ -502 -1537 -1492 -375 -17 499 608 217 431 -430 -1020 -807 18 1134 1489 926 548 78 -685 -470
1241d70j18J56J493j60j053l65m55L50L8j69P65J400p26j50r55p77R13O37J24
$$ -470 -588 -432 1061 901 -152 -517 -972 -622 -584 -753 12 1412 686 536 -419 -1196 -283 354 478
1260D78K74k78J27n76p90n31P70M98Q76k31j103J86j22m26L97L97Q32O02r02n19
$$ 478 752 474 601 25 -765 -1296 -526 -28 848 617 -486 -300 -422 -848 -451 -54 778 1380 478 -41
1280d1Q2p26N55K97k83R11k56m69o48o81N14N54L1N27j43j2M39j281n41N48M90
$$ -41 41 -685 -130 167 -116 795 539 70 -578 -1259 -745 -191 -160 367 224 212 651 -630 -1171 -623 -133
1301a33J057k43k70m29n2n70L6L82q9Q16j99k34n67j92M1J90KO96P51o67j85l19
$$ -133 924 681 411 -18 -70 -640 -604 -222 -311 505 306 72 -495 -687 -646 -456 -454 242 993 326 141 -178
1323a78J57q0J29J24N89k18l41l17p65K29K38O3J069p18k22K98m42l54K80O51
$$ -178 -21 -101 28 152 741 523 182 -135 -900 -671 -433 -370 699 -19 -241 57 -385 -739 -459 192
1343A92K30P22p49q2N8k86N0k32L46M42l51k15j74o39J13N62r8J82K15m65M62
$$ 192 422 1144 395 313 371 85 135 -97 249 691 340 125 -49 -688 -575 -13 -111 71 286 -179 283
1364B83o64J77L66n0L33L79p00K66k59q08M51L8P2N06k94l23K03l17l49L31J69
$$ 283 -381 -204 162 112 445 824 124 390 131 -677 -226 -188 -116 390 96 -227 -24 -341 -690 -359 -190
1385a90L63K25l63K70l37K02J67j77O6R7l48J59m8n17L02J1m35Q75m91j1Nm05
$$ -190 173 398 35 305 -32 170 337 160 226 323 -25 134 86 -431 -129 -118 -553 322 -169 -180 -175 -580
1407e80N66Q7j51L81J10k40J12j31k07J89p4l72N96l11r7J44k70N3q0J41lm3j22
$$ -580 -14 73 -78 303 413 173 285 154 -53 136 62 -310 286 -25 -122 22 -248 -195 -275 -134 -137 -180 -302
1430c02N68m61J55J27K19j17J03q3j48L10j96l6k04N5K38m37j27K98m11K23J08
$$ -302 266 -195 -40 87 306 189 292 209 61 371 175 139 -65 -10 228 -209 -336 -38 -449 -226 -118
1451a18k91M40K18l55L45Pk30L73l00l29N64j85O6j56q6k14oj0q0J78J7J49j90
$$ -118 -409 31 249 -106 239 246 16 389 89 -240 324 139 205 49 -37 -251 -257 -267 -347 -169 -152 -3 -193
1474a93J13K90j68R2M8l52M10K0J27j21l41n1K47p6j65L20l29J12l50m9K62K56
$$ -193 -80 210 42 134 182 -170 240 260 387 266 -75 -126 121 45 -120 200 -129 -17 -367 -416 -154 102
1496A02k07L54j70L38L75p64j68K72l8L82R3n58J04j83l00R8k5r7N07J09r9m36
$$ 102 -105 249 79 417 792 28 -140 132 94 476 569 11 115 -68 -368 -270 -295 -392 115 224 125 -311
1518c11J44J27J32J14J97M6K72k15q11j7M97q2M7k91K61J7k28l06j43M81L54Q7
$$ -311 -167 -40 92 206 403 449 721 506 -305 -322 175 93 140 -151 110 127 -101 -407 -550 -69 285 372
1540C72l5k09j06L6l12K20n9N44J59m95l50j50K56N7m70K03L28J11lm77l31M1
$$ 372 337 128 22 58 -254 -34 -93 451 610 115 -235 -385 -129 -72 -542 -339 -11 100 97 -380 -711 -670
1562f70J33O97l1K35Q5j19o04J87J99K45k17J79l32K19j92n11j78J26M58M76m40
$$ -670 -537 160 129 364 449 330 -274 -87 112 357 140 319 -13 206 14 -497 -675 -549 -91 385 -55
1583e5M6Q9l39j59N22k71M18l2n2N98o78k82J64N0%M14j87j91n1k87PR4J05M85
$$ -55 -9 80 -259 -418 104 -167 251 219 167 765 87 -195 -31 19 19 433 246 55 4 -283 -276 -182 -77 408
1607D08L3k30J93o20r0M62ON20o6m60p3m17J30J00j07L95n0n0j94P1m56O0M5K36
$$ 408 441 211 404 -216 -306 156 162 682 616 156 83 -334 -204 -104 -211 184 134 84 -110 -39 -495 -435 -390 -154
1631a54P06j06j93J29o73p9M16n8J35K46J6l49j74j06K6j32L38J91J1l9m8l88
$$ -154 552 446 253 382 -291 -370 46 -12 123 369 385 36 -138 -244 -218 -350 -12 179 190 151 103 -285
1653b85j56M63J89R6J75Ol41l81J12K50m36L73K14o8l33j63rk1L69j71N50k18
$$ -285 -441 22 211 307 482 488 147 -234 -122 128 -308 65 279 211 -122 -285 -294 -315 54 -117 433 215
1675B15j54j40l39j0L39O5M52j89Qm22lk65K68J58N08p1n66J52j30o05M67J6M24
$$ 215 61 -79 -418 -428 -89 -24 428 239 247 -175 -178 -443 -175 -17 491 420 -146 6 -124 -729 -262 -246 178
1698A78K69k50J62k72l22j21L11K12P7L44o83K12n29M1P6J42L02j8j60j1J05l56
$$ 178 447 197 359 87 -235 -356 -45 167 244 588 -95 117 -412 -371 -295 -153 149 131 -29 -40 65 -291
1720b91k4K24J77M92k0o42L99m43k87R5K16N39j8j00j72l3m55P0K10L8M22N3k35
$$ -291 -315 -91 86 578 558 -84 315 -128 -415 -320 -104 435 417 317 145 112 -343 -273 -63 -25 397 450 215
1743B15o4l37n0J26L15L40j75k65J11o65L1L81K60j93N2J7l61j10J34K61k15K36
$$ 215 151 -186 -236 -110 205 545 370 105 216 -449 -418 -37 223 30 82 99 -262 -372 -238 23 -192 44
1765D4N55j15l29j51l81J11M73L8J58k51l9j75l49l2K46J60p9L54k26j58k9l50
$$ 44 599 484 155 4 -377 -266 207 245 403 152 113 -62 -411 -443 -197 -37 -116 238 12 -146 -175 -525
1787e25M00L7K3N00j0n59L87o48K86K57l09N87k1j70j07n27p9M08pJ33J73k99
$$ -525 -125 -88 -65 435 425 -134 253 -395 -109 148 -161 426 405 235 128 -399 -478 -70 -77 56 229 -70
1809g0r7m9j26K14N67j26j13M6k44j97J59k15Q2J69M06k91L8m43KKK3K78J12J43
$$ -70 -167 -216 -342 -128 439 313 200 246 2 -195 -36 -251 -169 0 406 115 153 -290 -288 -286 -263 15 127 270
1833B70m37K90M3m21J88K42j47k9O5L0Jl44j13L66O2J19k43L1K4j44l18N17O3
$$ 270 -167 123 166 -255 -67 175 28 -1 64 94 95 -249 -362 4 66 185 -58 -27 -3 -147 -465 52 115
1856A15o4J80J21j58k24pN6J15m32N56k09o1Q0k32k44M45o1L16j6l0k3k2l57K50
$$ 115 51 231 352 194 -30 -37 19 134 -298 258 49 -12 68 -164 -408 37 -24 292 276 246 223 201 -156 94
1880I4K50m12M66j90pl15j40K52j3P2M80k68m10J17l4k36J19N2J9M47m11J39j13
$$ 94 344 -68 398 208 201 -114 -254 -2 -15 57 537 269 -141 -24 -58 -294 -175 -123 -104 343 -68 71 -42
1903d2k51M08pj27J16K37m91J73p5j69K30l06L26P1P6J12m74l82M98L37q9k5q0
$$ -42 -293 115 108 -19 97 334 -157 16 -59 -228 2 -304 22 93 169 281 -193 -575 -77 260 171 146 66
1926F6o2K7j66L8O7M6J26O5m04J80k87N5K28j44J1K49m1P2j53j39J93J08K5J14
$$ 66 4 31 -135 -97 -30 16 142 207 -197 -17 -304 -249 -21 -165 -154 95 54 126 -27 -166 27 135 160 274
1950B74k21p3J59l2M1Ol26J84J64j96Q6l5j20K08j22j94L38j2k87K32m27L70K05
$$ 274 53 -20 139 107 148 154 -172 12 176 -20 66 31 -89 119 -3 -197 141 129 -158 74 -353 17 222
1973B22k08K89l01NQ4j40J62k97k6K18k06j26K50K83jl42L37rR1l62L17j32l87
$$ 222 14 303 2 7 91 -49 113 -184 -210 8 -198 -324 -74 209 208 -134 203 194 285 -77 240 108 -279
1996b79L35k9j67K48J5p0j95Q9L2K72m44J35J35k07K34j19j5m1J34l00M82o5k15
$$ -279 56 27 -140 108 123 53 -142 -53 -21 251 -193 -58 77 -130 104 -15 -30 -71 63 -237 245 180 -35
2019c5K79k22J32K5m20K93k60j8K38Q5k00J15K5k00J16R2K25qm05M23r8m94L58
$$ -35 244 22 154 179 -241 52 -208 -226 12 97 -103 12 37 -163 -47 45 270 262 -143 280 182 -312 46
2042D6qj04P6J30q6k25j6j02M92l28l2Q5O1j0J01l5m8N8n1K83m7k25N6j22P1j59
$$ 46 38 -66 10 140 54 -171 -187 -289 203 -125 -157 -72 -11 -21 80 45 -3 55 4 287 240 15 71 -51 20 -139
2068a39K34K04k59j08o8M2J52l57K76j76J12n2K22R7k44ML1K14K35j44l99P0j10
$$ -139 95 299 40 -68 -136 -94 58 -299 -23 -199 -87 -139 83 180 -64 -60 -29 185 420 276 -123 -53 -163
2091a63J54l0j06L05k20qn6j69Q1L6J80P3r4o8J29k61J9L67l1j38L08n18n0L01
$$ -163 -9 -39 -145 160 -60 -68 -124 -293 -212 -176 4 77 -17 -85 44 -217 -198 169 138 0 308 -210 -260 41
2115D1l66L33p8K39J01k08j32J70j48l93L83J07J74J10l22QL43n01K42L3k79L34
$$ 41 -325 8 -70 169 270 62 -70 100 -48 -441 -58 49 223 333 11 19 362 -139 103 136 -143 191
2137A91k59M2n2r9k86M75O0J98R6m22K77j2m64K09K80K8R1m87R9oj84J2L00J2
$$ 191 -68 -26 -78 -177 -463 12 72 270 366 -56 221 209 -255 -46 234 262 353 -134 -35 -41 -225 -213 87 99
2161I9K29j91k02p5K8j22M12k56K10K0n2l9n9r1J45L48m43K46l02k00J42k28M7
$$ 99 328 137 -65 -140 -112 -234 178 -78 132 152 100 61 2 -89 56 404 -39 207 -95 -295 -153 -381 -334
2184c34K25R3L95j94j01j86N9j65J85Q8K01L8p7j50k03j37J30Q1K0J47j34j90
$$ -334 -109 -16 379 185 84 -102 -43 -208 -23 65 266 304 227 77 -126 -263 -133 -52 -32 115 -19 -209
2206b09n8J66p2J69k2o4J40l22M10j9n34N10q2j88M88n10J14j5j15m3K66J20J
$$ -209 -267 -101 -173 -4 -26 -90 50 -272 138 119 -415 95 13 -175 313 -197 -83 -98 -213 -256 10 130 131
2229A31o3l40O4L08j77P6J19N2lR1l08K31k24K0j27L81k8j95k28J09q7J63J58
$$ 131 68 -272 -208 100 -77 -1 118 170 167 258 -50 181 -43 -23 -150 231 203 8 -220 -111 -198 -35 123
2252A23j22K59k91m48M18j31l7L42K4K26j5k67j54J76j64k6K23P2J38l43j80m
$$ 123 1 260 -31 -479 -61 -192 -229 113 137 363 348 81 -73 103 -61 -87 136 208 346 3 -177 -181
2274a81j10J90r6J96K74k03m1p7p5j25N52k82L51J29l69Q9k31k76p5N15O2n1K1
$$ -181 -291 -101 -197 -1 273 70 29 -48 -123 -248 304 22 373 502 133 222 -9 -285 -360 155 217 166 187
2297A87j39k99o8K49j60K72J9J53k65R7k27K11N7r6L93j69j42j26J6q2K01k31
$$ 187 48 -251 -319 -70 -230 42 61 214 -51 46 -181 30 87 -9 384 215 73 -53 -37 -119 82 -149
2319a49L15J65l56l6o2j15J13J91J17P1l1j71l1L1k56J72J18j40K34K2j12m4k51
$$ -149 166 331 -25 -61 -123 -238 -125 66 183 254 223 52 21 52 -204 -32 86 -54 180 202 90 46 -205
2342b05J6K89k2P4K89n22l8J67q1Q8Lk72L28j75%O1k06L32j18J7L73k28k48Pm54
$$ -205 -189 100 78 152 441 -81 -119 48 -33 55 58 -214 114 -61 -61 0 -206 126 8 25 398 170 -78 -71 -525
2367e25N25L17m09M37j69j33q9m5P8n2J56j1L9j32j62Pj13j10L69k3J84k28J03
$$ -525 0 317 -92 345 176 43 -46 -91 -13 -65 91 80 119 -13 -175 -168 -281 -391 -22 -45 139 -89 14
2390A4R1j68rM1K62j17kJ2jj15j39L14J51m31L35m00J12j8k63M78k12k5K13M2
$$ 14 105 -63 -72 -31 231 114 112 124 123 8 -131 183 334 -97 238 -162 -50 -68 -331 147 -65 -90 123 165
2414A65l79K20o2J56N8k8k20J81L4p0J7k61M9K26j8r5n4J8l3J90k06K7j18N29
$$ 165 -214 6 -56 100 158 130 -90 91 125 55 72 -189 -140 86 68 -27 -81 -63 -96 94 -112 -85 -203 326
2438C26om32L50k8k77J25K49m85N27k45P1j81k98K69j73K8K57j83m2L09l73J22
$$ 326 320 -112 238 210 -67 58 307 -178 349 104 175 -6 -304 -35 -208 -180 77 -106 -148 161 -212 -90
2460i0K32O4nM7j57j56K4k6K7Q4P4j7J85k94j79J8LJ57j05J75n5O3k19j10J74
$$ -90 142 206 201 248 91 -65 -41 -67 -40 44 118 101 286 -8 -187 -169 -166 -9 -114 61 6 69 -150 -260 -86
2485h6J72q7p6L59k30N7l8k56J31p1m23N49K05m47L19K2m2q8j10L64l28j3J58
$$ -86 86 -1 -77 282 52 109 71 -185 -54 -125 -548 1 206 -241 78 100 58 -30 -140 224 -104 -117 41
2508D1K8m18N68l25K15o4Q2j26o9k1j0O6m7M3K1k6m2j98L95j33P5K3p3J19l02
$$ 41 69 -349 219 -106 109 45 127 1 -68 -89 -99 -33 -80 -37 -16 -42 -84 -282 113 -20 55 78 5 124 -178
2533a78K00r4j2J08j18O2j96J09mj10K53m1n5r4J48J04L52l91p3P4j23P6J49j08
$$ -178 22 -72 -84 24 -94 -32 -228 -119 -123 -233 20 -21 -76 -170 -22 82 434 43 -30 44 -79 -3 146 38
2557C8p1p0j31M41l68K45k12l2J83k11K9K04k91J39R5K14k24Q0Q9k70l1J07k11
$$ 38 -33 -103 -234 207 -161 84 -128 -160 23 -188 -159 45 -246 -107 -12 202 -22 58 147 -123 -154 -47 -258
2580b58N49k87pJ03P9k3l18L4j73K34n7J98j83m2NK97J08j30j70P9L8j93K06l55
$$ -258 291 4 -3 100 179 156 -162 -128 -301 -67 -124 74 -109 -151 -146 151 259 129 -41 38 76 -117 89 -266
2604b66J15R3r5J88J38l16M6K19k32K04J90k28M7l6J91k30J23k53K8j24M81k27
$$ -266 -151 -58 -153 35 173 -143 -97 122 -110 94 284 56 103 67 258 28 151 -102 -74 -198 283 56
2626E6l23K46p9j22M0L14j76L45l25J47J4N4j93P6M7j1K28k95J21l17K36M4j62
$$ 56 -267 -21 -100 -222 -182 132 -44 301 -24 123 137 191 -2 74 121 110 338 43 164 -153 83 127 -35
2649c5Q4r2J27k21L11l95L44n6k30K54m20K35K97l18J72j80P7J21k3j09p3J43
$$ -35 49 -43 84 -137 174 -221 123 67 -163 91 -329 -94 203 -115 57 -123 -46 75 52 -57 -130 13
2671A3r7K5K4p9L67k32m8M4k55J56R5j11K95q2Rl11K13n1J99p0K54m78p3J03j5
$$ 13 -84 -59 -35 -114 253 21 -27 17 -238 -82 13 -98 197 115 124 -187 26 -25 174 104 358 -120 -193 -90 -105
2696a05n3K71r4j56K48m9K4q6R4P5m3k46L72J9m50L03K0n33K79J76k93M63l86
$$ -105 -158 113 19 -137 111 62 86 0 94 169 126 -120 252 271 -179 124 144 -389 -110 66 -227 236 -150
2719a50K15nk46P2J48J28q6M2k6j34JJ33j93J73J51j59J72L4k14o7rK1q0K07j25
$$ -150 65 60 -186 -114 34 162 76 118 92 -42 -41 92 -101 72 223 64 236 270 56 -11 -20 1 -79 128 3
2744Cp5M6L1j72M45j56Q7m3j12j83L01p4l55R7J76N3m15J71P8J93m0m6K5L3%l21
$$ 3 -72 -26 5 -167 278 122 209 166 54 -129 172 98 -257 -160 16 69 -346 -175 -97 96 56 10 35 68 68 -253
2770b53K44m1o7J34O9M0P8k30j26P7j27L91r0J63k27k55J63J27n2J8k12L46J53
$$ -253 -9 -50 -117 17 86 126 204 -26 -152 -75 -202 189 99 262 35 -220 -57 70 18 36 -176 170 323
2793C23n64L79j38k75J84K14q5J0k68K58K57l87q5P0j51J25L3n6J7r3K39K92l09
$$ 323 -241 138 0 -275 -91 123 38 48 -220 38 295 -92 -177 -107 -258 -133 -100 -156 -139 -232 7 299 -10
2816a0p9J78p0n5j06j66M91j66L7p0K31j72j13l0o4K28j14m3l4J52m1j11P5J68
$$ -10 -89 89 19 -36 -142 -308 183 17 54 -16 215 43 -70 -100 -164 64 -50 -93 -127 25 -16 -127 -52 116
2840A16Nk48K44r9O8o1j67j14L07Nl44K98q2P6K6m2M3j71J55J12J35r1k81K18
$$ 116 121 -127 117 18 86 25 -142 -256 51 56 -288 10 -72 4 30 -12 31 -140 15 127 262 171 -110 108
2864A08j34K00l7p7M6j97k3rM7j96K78j59M46j61l24J06J62Qk07L56j47j2j00
$$ 108 -26 174 137 60 106 -91 -114 -123 -76 -272 6 -153 293 132 -192 -86 76 84 -123 233 86 74 -26
2887b6J72k21j3K52l80K84J42ol42M67m82N6O5j02M17l80l7O3n3J57n7J58l2k3
$$ -26 146 -75 -88 164 -216 68 210 204 -138 329 -153 -97 -32 -134 283 -97 -134 -71 -124 33 -24 134 102 79
2911G9p8K69o11M02N6pm9N2m68M07j04k34K00N1K29o9nJ3j73m4N1K16j48lk06
$$ 79 1 270 -341 61 117 110 61 113 -355 52 -52 -286 -86 -35 194 125 120 133 -40 -84 -33 183 35 32 -174
2936a74m5K10J27k42J26m7j95K80j46J23L05k72k39K82p9J69r2p7o8K97l77J88
$$ -174 -219 -9 118 -124 2 -45 -240 40 -106 17 322 50 -189 93 14 183 91 14 -54 243 -134 54
2958E4j31j5o9K18J2M2k5j08k67L37j07R3J32M3o7r6Q6m5k04K09o9J8k67J82L53
$$ 54 -77 -92 -161 57 69 111 86 -22 -289 48 -59 34 166 209 142 46 132 87 -117 92 23 41 -226 -44 309
2983C09l91K51k38j6K11k74L95l01l8J38j36J08k6R8k93J36q7J57L9j63L9J21
$$ 309 -82 169 -69 -85 126 -148 247 -54 -92 46 -90 18 -8 90 -203 -67 -154 3 42 -121 -82 39
3005C9K6k03J81k7j5j29k3P5L29l79J15M5p2J39j18K6n2K11j61R3j10j00L81l73
$$ 39 65 -138 43 16 1 -128 -151 -76 253 -126 -11 34 -38 101 -17 9 -43 168 7 100 -10 -110 271 -102
3029a02k5j46J48K2o9K43j07J00k11J66J17l03K18J72k49J06q3M0Mk2k22jJ26
$$ -102 -127 -273 -125 -103 -172 71 -36 64 -147 19 136 -167 51 223 -26 80 -3 37 41 19 -203 -204 -78
3052g8o9L13k32j2J2J02J33M77m89k16o5M32m60J6l5K36j87L73k80J9p4MJ22l68
$$ -78 -147 166 -66 -78 -66 36 169 646 157 -59 -124 308 -152 -136 -171 65 -122 251 -29 -10 -84 -80 42 -326
3076c26M62j29j50J2K59o2j44RK8K38j62N8j48K56k04lPK17l51j5m1Q8R1K04j19
$$ -326 136 7 -143 -131 128 66 -78 -69 -41 197 35 93 -55 201 -3 -6 1 218 -133 -148 -189 -101 -10 194 75
3101G5k45J61L4p2K30j35K19ql90Q5k8NJ28q7j4J79J2j65MO8j05n2J85J6p1k15
$$ 75 -170 -9 25 -47 183 48 267 259 -131 -46 -74 -69 59 -28 -42 137 149 -16 -12 56 -49 -101 84 100 29 -186
3127a86k0K49k68K93K85m01M3P7k72K52j41j01L43q8j46N0J51qO2k13J10J52k35
$$ -186 -206 43 -225 68 353 -48 -5 72 -200 52 -89 -190 153 65 -81 -31 120 112 174 -39 71 223 -12
3150a2J84k14k55J89J03K4J81k06J30j90n0L16p3n87P62k50J37j55k99J85q6M6
$$ -12 172 -42 -297 -108 -5 19 200 -6 124 -66 -116 200 127 -460 302 52 189 34 -265 -80 -166 -120
3172a20J15j02J92l6J3r7l1J41O9j5jL4j22K2l33K36P9J3j47O3j0Qj04NL71j35
$$ -120 -5 -107 85 49 62 -35 -66 75 144 129 128 162 40 62 -271 -35 44 57 -90 -27 -37 -29 -133 -128 243 108
3198A08j24Ok7Q8L1Nj16j23K71l62J83Q4j7L3l9k37L32k33J5K42q4j3j35L19l81
$$ 108 -16 -10 -37 51 82 87 -29 -152 119 -243 -60 24 7 40 1 -236 96 -137 -122 120 36 23 -112 207 -174
3223a74P9L12k53L1mj81J60j17K17o1j61J22o2L03l44J31k24K12q7j48J78j9j20
$$ -174 -95 217 -36 -5 -9 -190 -30 -147 70 9 -152 -30 -92 211 -133 -2 -226 -14 -101 -249 -71 -90 -210
3246b10J54j39K87l8k03J18j05O2j50Q3J80k51J21J62o6j67j94K31Q2j19P2J07
$$ -210 -56 -195 92 54 -149 -31 -136 -74 -224 -141 39 -212 -91 71 5 -162 -356 -125 -43 -162 -90 17
3268A7j26l3ML04j00R0m73M05m3m4m7qP0J12P5k73L6r7J48k73L54P8jj95lL3p8
$$ 17 -109 -142 -138 166 66 156 -317 88 45 1 -46 -54 16 128 203 -70 -34 -131 17 -256 98 176 175 -20 -23 10 -68
3295f8N3K43j73J12m31O1NJ33K15k40K77j89Rl1o9J22J58m64KL76j55O6N1j62
$$ -68 -15 228 55 167 -264 -203 -198 -65 150 -90 187 -2 7 -24 -93 29 187 -277 -275 101 -54 12 63 -99
3319i9K12Q3l27N8J1j40J51n8J75o9J36k81o8L77j74M0k60L2L83k30k99L87o9
$$ -99 113 196 -131 -73 -62 -202 -51 -109 66 -3 133 -148 -216 161 -13 27 -233 -201 182 -48 -347 40 -29
3342b9j96K33k81J05J26m3J47l65R2K64J75k54J56o7L21j90l51K23P6r1J10k73
$$ -29 -225 8 -273 -168 -42 -85 62 -303 -211 53 228 -26 130 63 384 194 -157 66 142 51 161 -112
3364a12L02m15K18k87R8L35k36l2J74k2l26M17l07L37n7j44j4K72l74J97K56n87
$$ -112 190 -225 -7 -294 -196 139 -97 -129 45 23 -303 114 -193 144 87 -57 -71 201 -173 24 280 -307
3386c07N19k92J6J26J66l71j82K49J43K69n13J07K2J21J56j49j40R4k06K76j28
$$ -307 212 -80 -64 62 228 -143 -325 -76 67 336 -177 -70 -48 73 229 80 -60 34 -172 104 -24
3407b4M27n69K09P9k03j32O2J59k83L35K45k57j59M3K40l56K94L1k94n8J51P8
$$ -24 403 -166 43 122 -81 -213 -151 8 -275 60 305 48 -111 -68 172 -184 110 141 -153 -211 -60 18
3429A8J65j53l12N11l07L1n3r5lP8K79j86J52l82PJ24P4L21j27l23O6J67j30P7
$$ 18 183 30 -282 229 -78 -47 -100 -195 -198 -120 159 -27 125 -257 -250 -126 -52 269 142 -181 -115 52 -78 -1
3453aq6j05J73k09L18K3r1qj68L94k85M2M6j87L0k94L48JpP7PJ18m53M73k68K0
$$ -1 -87 -192 -19 -228 90 113 22 14 -154 240 -45 -3 43 -144 -114 -408 -60 -59 -66 11 18 136 -317 156 -112 -92
3479i2K4j7pQJ52J02o5k39Q6j67L33n8p8J57k0r3L6m44J90R6q5J93j08J10N5p7
$$ -92 -68 -85 -92 -84 68 170 105 -134 -48 -215 118 60 -18 139 119 26 62 -382 -192 -96 -181 12 -96 14 69 -8
3505hj80J68L3r5J2L4J41K2k74J06K0K6M8m9j83Q5p4K28N0l4j00K8j26n5K38j17
$$ -8 -188 -20 13 -82 -70 -36 105 127 -147 -41 -21 5 53 4 -179 -94 -168 60 110 76 -24 4 -122 -177 61 -56
3531e6N0J37j25j02m8L0J08j03L55j62L8M3j54J5k83M15q5l74K96R2j21m2M07
$$ -56 -6 131 6 -96 -144 -114 -6 -109 246 84 122 165 11 26 -257 158 73 -301 -5 87 -34 -76 331
3554C31l06j96J57J66j64K86k29k59n6M33m59K85J20j21J83k46K15k29K22KK4
$$ 331 25 -171 -14 152 -12 274 45 -214 -270 163 -296 -11 109 -12 171 -75 140 -89 133 135 159
3575A59l26%j41N1K35J03k07p3pK64j00Q7O6j86m4j2M87m04J07k51J13N8J22q1
$$ 159 -167 -167 -308 -257 -22 81 -126 -199 -206 58 -42 45 111 -75 -119 -131 356 -48 59 -192 -79 -21 101 20
3599B0k50o1M00j90K03k03K18j67J08j05NN7j02L7M31j87j18J53o8k53j92J27
$$ 20 -230 -291 109 -81 122 -81 137 -30 78 -27 -22 35 -67 -30 401 214 96 249 181 -72 -264 -137
3621a37K80M4k34L1K0r1J81J47K6k43j00J43K69n46K9K24j14J60k14L21j48l27
$$ -137 143 187 -47 -16 4 -87 94 241 267 24 -76 67 336 -210 -181 43 -71 89 -125 196 48 -279
3643b79J65M29k34k21Q7Q7j46k40M51k57J28Q8j49K20k75J19N0j1M3J95l40n2
$$ -279 -114 315 81 -140 -53 34 -112 -352 99 -158 -30 58 -91 129 -146 -27 23 12 55 250 -90 -142
3665a42M3J8L8J78l36K78k64jL91m80L05q2J30J9j29P5Q0L01n72J56r0r3N12k09
$$ -142 -99 -81 -43 135 -201 77 -187 -188 203 -277 28 -54 76 95 -34 41 121 422 -150 6 -84 -177 335 126
3689A26l54J91k15J70J64J4m75N19j46k30K61j43L80j90k44OK20k13K23j99K5
$$ 126 -228 -37 -252 -82 82 96 -379 140 -6 -236 25 -118 262 72 -172 -166 54 -159 64 -135 -110
3710a10J54l3k10M81l28L9Q8J19j94J15J18k28K57k76P0j06J85j02j0K36O6n00
$$ -110 44 11 -199 282 -46 -7 81 200 6 121 239 11 268 -8 62 -44 141 39 29 265 331 -169
3732a69J74J68k10N9K4K6N2J6j3o8o0R8j90K0q2J79P8p9np4N7p3K50q6m5JJ68
$$ -169 5 173 -37 22 46 72 124 140 127 59 -1 97 -93 -73 -155 24 102 23 18 -56 1 -72 178 92 47 48 216
3759B16Oj90P4j79N0N3n0j10J08L0j94OJ49K10l3k07j61L95j94l0o5K63o7p7J78
$$ 216 222 32 106 -73 -23 30 -20 -130 -22 8 -186 -180 -31 179 146 -61 -222 173 -21 -51 -116 147 80 3 181
3784A81m5Np4j75J02N6k22K36l77J58K5K96r4o1k0qJ36r7M6o7J16j51J76p4j04
$$ 181 136 141 67 -108 -6 50 -172 64 -313 -155 -130 166 72 11 -9 -17 119 22 68 1 117 -34 142 68 -36
3809c6P7P6l48K61m8R5JJ6r6j29P0Q6p4m2k03M71k03j48L07j69r3P4j79J90R9
$$ -36 41 117 -231 30 -18 77 78 94 -2 -131 -61 25 -49 -91 -294 177 -26 -174 133 -36 -129 -55 -234 -44 55
3834E5p1j7J39n0j43m0L40k05o1l5K30j29j0l73L59J87j24q5K09l03K13j40j99
$$ 55 -16 -33 106 56 -87 -127 213 8 -53 -88 142 13 3 -370 -11 176 52 -33 176 -127 86 -54 -253
3857b53J04J23M32m49L09k68J88k97J08K34l51J26j86O2K9o1K62op0r4L8P0P8
$$ -253 -149 -26 406 -43 266 -2 186 -111 -3 231 -120 6 -180 -118 -89 -150 112 106 36 -58 -20 50 128
3880A28p4lN2K98k94j72m7j68M30j06P6k15K03l51R0J22J51j32P8J19k74q6J2
$$ 128 54 51 103 401 107 -65 -112 -280 150 44 120 -95 108 -243 -153 -31 120 -12 66 185 -89 -175 -163
3903a63K57k7Oj57NJ01pl3kK9J11j98J19Qj1j42J91m5j13J12l2K42j87J53q9j
$$ -163 94 67 73 -84 -79 22 15 -18 -20 9 120 -78 41 49 38 -104 87 42 -71 41 9 251 64 217 128 127
3929A27P8j67k4k3j34O2O7p8m7J80j31K24J01l60Q6J88r1j87Q9J45m5k5P4R2r1
$$ 127 205 38 14 -9 -143 -81 -14 -92 -139 41 -90 134 235 -125 -39 149 58 -129 -40 105 60 35 109 201 110
3954A10l06J80J0J30l05J68L04n36L4Q9J28r5j64R9J24K19m22K39K5J72k45L18
$$ 110 -196 -16 -6 124 -181 -13 291 -245 -211 -122 6 -89 -253 -154 -30 189 -233 6 31 203 -42 276
3976B76n27K28J18n73M99R9M6P0kj53j63M81k36k06j55N6P9K45r2oNK8m0k15R2
$$ 276 -251 -23 95 -478 21 120 166 236 234 81 -82 399 163 -43 -198 -142 -63 182 90 84 89 117 77 -138 -46
4001d6j36L45J09l77k7K27K5k20K05j46lJ82j23j02P3Qj65L37j70r9j5N2N2j89
$$ -46 -182 163 272 -105 -132 95 120 -100 105 -41 -44 138 15 -87 -14 -6 -171 166 -4 -103 -118 -66 -14 -203
4025b03R7J21j8M06j50l66J59o7m3k64M13O4j02J73k73J90j94J28J1j69k80M40
$$ -203 -106 15 -3 403 253 -113 46 -21 -64 -328 85 149 47 220 -53 137 -57 71 82 -87 -367 73
4047G3j98K11l16J83j70K24j5P5J23n1q1J47j27q2K89l59Q9K01l03lO0M8J20k07
$$ 73 -125 86 -230 -47 -217 7 -8 67 190 139 58 205 78 -4 285 -74 15 216 -87 -90 -30 18 138 -69
4071f9o0O4J07kK4n5o1J66J97n07J21J69J29k25J07rl15K66k12L38j29j20j23
$$ -69 -129 -65 42 40 64 9 -52 114 311 -196 -75 94 223 -2 105 96 -219 47 -165 173 44 -76 -199
4094a99Q2K29j06M3M6j26k7L7J08j7q5l6P3K06k64J31j62K33j17j08J07J62m92
$$ -199 -117 112 6 49 95 -31 -58 -21 87 70 -15 -51 22 228 -36 95 -67 166 49 -59 48 210 -282
4117b82L27P6k62K42j97L75m32L44l66L26Jr0j03p9K2m4K96k64M75m45J71p0j00
$$ -282 45 121 -141 101 -96 279 -153 191 -175 151 152 62 -41 -120 -98 -142 154 -110 365 -80 91 21 -79
4140g9R7m3j69L99l07J7J00j64L00k58M5J65j82L05p6j12J03j56L0o9K65l01L9
$$ -79 18 -25 -194 205 -102 -85 15 -149 151 -107 -62 103 -79 226 150 38 141 -15 15 -54 211 -90 -51
4163e1M3n5m8J12k8J47j32J64k00R2k87J53N8r9Q2m3J62j09m4J04r8R5p5j01K62
$$ -51 -8 -63 -111 1 -27 120 -12 152 -48 44 -243 -90 -32 -131 -49 -92 70 -39 -83 21 -77 18 -57 -158 104
4188A04j54J47r6j04Q9O3q9K41l11n3L41k60Q0j33L6j9J68J00r5j95K28j38J9
$$ 104 -50 97 1 -103 -14 49 -40 201 -110 -163 178 -82 -2 -135 -99 -118 50 150 55 -140 88 -50 -31
4211c1j1l11J01K37k00L58l42L71l63K63J13l21L96l49NN1L9j07K54k08q9P4L33
$$ -31 -42 -353 -252 -15 -215 143 -199 172 -191 72 185 -136 260 -89 -84 -33 6 -101 153 -55 -144 -70 263
4234B63j84N8j11P1j60l83N03j12K94k00J13j63J03k89J78m1J58n35L95M02n03
$$ 263 79 137 26 97 -63 -446 57 -55 239 39 152 -11 92 -197 -19 -60 98 -437 -42 360 -143
4255a43J88q1L08l29k11M58j35j93L34j10j36R3K15l48J7l08J02K52j11R8K15
$$ -143 45 -36 272 -57 -268 190 55 -138 196 86 -50 43 258 -90 -73 -381 -279 -27 -138 -40 175
4276A75k11M5p4J15j93J41O5k35J12O0M7M5k91J44j40L56l05M05k79J95k54Q9
$$ 175 -36 9 -65 50 -143 -2 63 -172 -60 0 47 92 -199 -55 -195 161 -144 261 -18 177 -77 12
4298A2j16N4o3J62P3k14Q0q8K39k23J55q3J55j67K93k14n2J13K02k30p2M5nk29
$$ 12 -104 -50 -113 49 122 -92 -12 -100 139 -84 71 -12 143 -24 269 55 3 116 318 88 16 61 56 -173
4322a73N6K95j01k59K1N1J69j99J91M4k28M56k21J03l16j37J78m4j80L60J58k89
$$ -173 -117 178 77 -182 -161 -110 59 -140 51 95 -133 323 102 205 -111 -248 -70 -114 -294 66 224 -65
4344f5J24J15q9j3J4J19k48K40k72J01j2J54n27K40R3j00K70j47J38j82j13L88
$$ -65 59 174 85 72 86 205 -43 197 -75 26 14 168 -359 -119 -26 -126 144 -3 135 -47 -160 228
4366B28k19l6L12k01k76j53K33o6L25N4j17j81J96k64J92P4k4k36K3J1K99n8k74
$$ 228 9 -27 285 84 -192 -345 -112 -178 147 201 84 -97 99 -165 27 101 77 -159 -136 -125 174 116 -158
4389a58J77j56J27r0j8l1J24J52k40L82j32k3p7k10JJ85j56o0K3K20Q5n6p3k01
$$ -158 19 -137 -10 -100 -118 -149 -25 127 -113 269 137 114 37 -173 -172 13 -143 -203 -180 40 125 69 -4 -205
4413b05R5j01K35j13j09O4L74l79j96M24r4P5J50j90j6K5rJ01k59K34jN5j19k72
$$ -205 -110 -211 24 -89 -198 -134 240 -139 -335 89 -5 70 220 30 14 39 30 131 -128 106 105 160 41 -231
4437b31J96Mq9j52m6L85k30K50N5m08L17J0J4k42J05J8J85j05j17K62l8o4j32
$$ -231 -35 -31 -120 -272 -318 67 -163 87 142 -266 51 61 75 -167 -62 -44 141 36 -81 181 143 79 -53
4460e3L9m5Pj22K63j86K62J39l10l19M58l88J6%J56nJ02Kj6K17m1o3k54J59OJ8
$$ -53 -14 -59 -52 -174 89 -97 165 304 -6 -325 133 -255 -239 -239 -83 -88 14 16 0 217 176 113 -141 18 24 42
4486D2n8n7L97m21j99L48Q3M7r5R2j83Q9k92J77m5K61l24p4Q0J08L29j69l29L69
$$ 42 -16 -73 324 -97 -296 52 135 182 87 179 -4 85 -207 -30 -75 186 -138 -212 -132 -24 305 136 -193 176
4510A76j10O0m3K26l94J05k02L57k61J9n7J51O1p1j36J52o7j01n3K69j30J65j32
$$ 176 66 126 83 309 -85 20 -182 175 -86 -67 -124 27 88 17 -119 33 -34 -135 -188 81 -49 116 -16
4533a6j98L16l3R1q8q9J66j58J56r0n2l4J31J6k82J18m7K41m00K83M7j17L2K31
$$ -16 -214 102 69 160 72 -17 149 -9 147 57 5 -29 102 118 -164 -46 -93 148 -252 31 78 -39 -7 224
4557B24k04k63K97K86l97K91j08l23J52J28n8k9j52j03K15k94K92m0K84j55k32
$$ 224 20 -243 54 340 -57 234 126 -197 -45 83 25 -4 -156 -259 -44 -338 -46 -86 198 43 -189
4578a89Q9J96p0j10Q2M39m87m2m5n4p6M05p7p6Q0p2j35J15O2p6Or6K38J45k01
$$ -189 -100 96 26 -84 -2 437 -50 -92 -137 -191 -267 138 61 -15 65 -7 -142 -27 35 -41 -35 -131 107 252 51
4603E1N9j43m1O3qK9P2l88K89j83L5K40j78M0q1R7k14J63R6l4R2N7n9k22K11k5
$$ 51 110 -33 -74 -11 -19 10 82 -306 -17 -200 -165 75 -103 -63 -144 -47 -261 -98 -2 -36 56 113 54 -168 43 18
4629A8p7J16J13k44j5K14l77K64l9L0n8L31l17q0L39R0l35K78l70J28j16K26j37
$$ 18 -59 57 170 -74 -89 125 -252 12 -27 3 -55 276 -41 -121 218 308 -27 251 -119 9 -107 119 -18
4652a8L22l89J51n8j01Q8k62M44j01lp4N0j21o2J75n8j04K03j06N5K63j02l54
$$ -18 304 -85 66 8 -93 -5 -267 177 76 73 -1 49 -72 -134 41 -17 -121 82 -24 31 294 192 -162
4675a62n4Q9K87j71J5q6j24K70J67l68J86O7k63K63l9Q2m42N44R8k74J7n3P1l01
$$ -162 -216 -127 160 -11 4 -82 -206 64 231 -137 49 116 -147 116 77 159 -283 261 359 85 102 49 120 -181
4699a81J52K6j06n2J94l4K12l89K04j43K50m6k82M49l13m7K31j76Q9J7l32M00
$$ -181 -29 -3 -109 -161 33 -1 211 -178 26 -117 133 87 -195 254 -59 -106 125 -51 38 55 -277 123
4721A23r4m1o4J12J32p5kkj01j28k1J02L90O6m91lP2O7l60M04l04J79Q2j05M9
$$ 123 29 -12 -76 36 168 93 91 89 -12 -140 -161 -59 331 397 -94 -97 -25 42 -318 86 -218 -39 43 -62 -13
4746a3o9J50j48L1K05j76J70n0L0o6j24M2J29j5M0j04J10k37K22m4j0k59L68r
$$ -13 -82 68 -80 -49 156 -20 150 100 130 64 -60 -18 111 96 136 32 142 -95 127 83 73 -186 182 173
4770A73R3l27M7q7Q5N1j14J97J06m58M10j65p6L30m44P0K81m05M80m67J17n0K51
$$ 173 266 -61 -14 -101 -16 35 -79 118 224 -234 176 11 -65 265 -179 -109 172 -233 247 -220 -103 -153 98
4793I8j94Q0n5k6j19L07J65L0l57j04q4L81J1j63K40j88j78J31j00J45J62p1M9
$$ 98 -96 -16 -71 -97 -216 91 256 286 -71 -175 -259 122 133 -30 210 22 -156 -25 -125 20 182 111 160
4816A60l74K92q5J8R2k6q0p3J7J78p7J38j58N8j8j03J73k27P5M9m01K62J44J75
$$ 160 -214 78 -7 11 103 77 -3 -76 -59 119 42 180 22 80 62 -41 132 -95 -20 29 -372 -110 34 209
4840B09j37j93J13J08L58l86J25k11oj43J92o5q4J40M6j87K68n3m4L5J11k87O8
$$ 209 72 -121 -8 100 458 72 197 -14 -20 -163 29 -36 -120 20 66 -121 147 94 50 85 196 -91 -23
4863b3p0L3K6n9J3R4K76l09k22L71k23O9M4J6j74K97j21O8k12j0K62l09K18j96
$$ -23 -93 -60 -34 -93 -80 14 290 -19 -241 130 -93 -24 20 36 -138 159 38 106 -106 -116 146 -163 55 -141
4887a41L28m68L77K9j18J38k43K7r4j97O98k26j0j32o2K99j07K3j05K61n17K37
$$ -141 187 -281 96 125 7 145 -98 -71 -165 -362 336 110 100 -32 -94 205 98 121 16 277 -240 -3
4909cJ88j95p4j9R7P5k6j15n8K14J35j87J72j44k16K09P7j93K53l85L90k05o3
$$ -3 185 -10 -84 -103 -6 69 43 -72 -130 84 219 32 204 60 -156 53 130 -63 190 -195 195 -10 -73
4932g3l1M5K26P3m14J73J35r5J0J74j54j14l0j8J22j82L36j12rp2K8n4J37k35
$$ -73 -104 -59 167 240 -174 -1 134 39 49 223 69 -45 -75 -93 29 -153 183 71 62 -10 18 -36 101 -134
4956a34J18J14M0l28L08o1j15M1L4K7M5j31p0J89j53j71L29l3J15J27l82O7L7
$$ -134 -16 98 138 -190 118 57 -58 -17 17 44 89 -42 -112 77 -76 -247 82 49 164 291 -91 -24 13
4979A3NRJ21n9J13j71K0n7j08j60M75k14J72j60J17j49K80j65O4n6l7J0m9j18
$$ 13 18 27 148 89 202 31 51 -6 -114 -274 201 -13 159 -1 116 -33 247 82 146 90 53 63 14 -104
5003a04J46k9k18L07q4L5Qj49k2n8J44j07M81m01K8M3K9Q3j71O6K11j68l7j52
$$ -104 42 13 -205 102 18 53 61 -88 -110 -168 -24 -131 350 -51 -23 20 49 132 -39 27 238 70 33 -119
5027a19M49k99q1J57j02lJ25o2j44L54l81L12l32J13k66K15K27k36L75j29k25
$$ -119 330 31 -50 107 5 2 127 65 -79 275 -106 206 -126 -13 -279 -64 163 -73 302 173 -52
5048e2J79k09J72j22R7K33j91o9j4l9L30l34j2K02j5k4l73J93J72L0j72mR5l6
$$ -52 127 -82 90 -32 65 298 107 38 24 -15 315 -19 -31 171 156 132 -241 -48 124 154 -18 -22 73 37
5072C7k68K26O5r2r1K9k32K42p2l3Q4p8K30p2J1j60J53O4j28J34N4j52J02J50
$$ 37 -231 -5 60 -32 -123 -94 -326 -84 -156 -189 -105 -183 47 -25 -14 -174 -21 43 -85 49 103 -49 53 203
5096B03o05P15m41R3Jk9J06o7k15K27J75l07J64K2j92j52L30k0q5J48k92M68j32
$$ 203 -402 313 -128 -35 -34 -63 43 -24 -239 -12 163 -144 20 42 -150 -302 28 8 -77 71 -221 247 115
5119A15l25K72m7j19J75j83j54K63k44M04j36L07m07K04k30J64L5j71K86j27J6
$$ 115 -210 62 15 -104 71 -112 -266 -3 -247 157 21 328 -79 125 -105 59 94 -77 209 82 98
5140I8k05j51Q5Q1J15K82k53M8o0R8R7m2m5j24K21l01O0n8Q2O5k33K3L1j94N21
$$ 98 -107 -258 -173 -92 23 305 52 100 40 138 235 193 148 24 245 -56 4 -54 28 93 -140 -117 -86 -280 241
5165B41k14j84N7K46k80J61J12j27O4n4j24K75k70J47P3J6k98M3oJ35p4J90O5
$$ 241 27 -157 -100 146 -134 27 139 12 76 22 -102 173 -97 50 123 139 -159 -116 -122 13 -61 129 194
5188A94q1q4J7pm27O13j25J35j30l27M56p5n9j6J6j13J74N6k32M8L9R5k75J57
$$ 194 113 29 46 39 -388 225 100 235 105 -222 234 159 100 84 100 -13 161 217 -15 33 72 167 -108 49
5212D9K0j0k2J24k30P0Pk2j36J75m8J49Oj22RK0k10L75k95q7J62j03Qn2J53Lj17
$$ 49 69 59 37 161 -69 1 8 -14 -150 25 -23 126 132 10 19 39 -171 204 -91 -178 -16 -119 -111 -163 -10 -7 -124
5239a24J54j33p1j5L82l08N8J0J2mlJ40o9k28K87l8q1p8M92m54o6J21l24L48j07
$$ -124 30 -103 -174 -189 193 -115 -57 -47 -35 -39 -42 98 29 -199 88 50 -31 -109 383 -71 -137 -16 -340 8 -99
5264i9K63k40k1K1q7J45J77J15l89J77r9N8O6k11N10m91J65L2j41j51M0J34J32
$$ -99 164 -76 -97 -76 -163 -18 159 274 -115 62 -37 21 87 -124 386 -105 60 92 -49 -200 -160 -26 106
5287A06l29L35j18K69n45K82R5lj9l57K02L9p1J58jj18J70k0J77j92J51k04Q4
$$ 106 -223 112 -6 263 -282 0 95 92 73 -284 -82 -43 -114 44 43 -75 95 75 252 60 211 7 91
5310I1Qj75J71J99l14k31J70n0j2L16j75L9L19k21n52J08J98j79J84L92k64K27
$$ 91 99 -76 95 294 -20 -251 -81 -131 -143 173 -2 37 356 135 -417 -309 -111 -290 -106 286 22 249
5332B49j18k43L06l42L08k7l42J71r5J60K24k15j45n7K39Q0j1jj08q3K45l1j99
$$ 249 131 -112 194 -148 160 133 -209 -38 -133 27 251 36 -109 -166 73 153 142 141 33 -50 195 164 -35
5355c5J86k50J8J85k2J44j74n3O7r3r0M0q2O6K46p2j78N9m9L13k22J15j51L5N7
$$ -35 151 -99 -81 104 82 226 52 -1 66 -27 -117 -77 -159 -93 153 81 -97 -38 -87 226 4 119 -32 3 60
5380F0j34J81k63K05o7j15K88j43p6J15N4k79J10K86k74j47J8l4L61j63K75k61
$$ 60 -74 107 -156 49 -18 -133 155 12 -64 51 105 -174 -64 222 -52 -199 -181 -215 146 -17 258 -3
5402cNo8J75O8j29j07M7J40k98o0J48J42m36N57j3j23j7n1j12L51j62m99K02L28
$$ -3 2 -66 109 177 48 -59 -12 128 -170 -230 -82 60 -376 181 168 45 28 -23 -135 216 54 -445 -243 85
5426H5p3JR7K18m93j8M92k51m6K1J76k85k7J17J32j39k45M40j48p9J34n4n5Mj83
$$ 85 12 13 110 328 -165 -183 309 58 12 33 209 -76 -103 14 146 7 -238 202 54 -25 109 55 0 4 -179
5451a79Q5P0J04k65L25Jm6r3m7J10q7J58l05r9L83m28K19k4R4M1Mk4j40K25R6
$$ -179 -94 -24 80 -185 140 141 95 2 -45 65 -22 136 -169 -268 115 -313 -94 -118 -24 17 21 -3 -143 82 178
5476A78m3o6k08L11j16j21N4K1j09J20K82k07j10R7R6l8m33M41j69l94M63J65
$$ 178 135 69 -139 172 56 -65 -11 10 -99 21 303 96 -14 83 179 141 -292 149 -20 -414 49 214
5498B14k03j97J71J66o5k70K49k44J78o6J71k35J58k16J22N6mJ79n7q8q2K81j54
$$ 214 11 -186 -15 151 86 -184 65 -179 -1 -67 104 -131 27 -189 -67 -11 -15 164 107 19 -63 218 64
5521F4M4j56r6K0L74j41k20m2K04N6q0k13J18L29r6k31m5K06j21J28J85l03J12
$$ 64 108 -48 -144 -124 250 109 -111 -153 51 107 27 -186 -68 261 165 -66 -111 95 -26 102 287 -16 96
5544I6j07j2j14J12q5Q5j45M50k76J29M3j82j41K87q7Q4Q9l15K25r7k16O2J39
$$ 96 -11 -23 -137 -25 -110 -25 -170 280 4 133 176 -6 -147 140 53 137 226 -89 136 39 -177 -115 24
5567B4N4p3L4n3J22k13L01l41K7K09pJ1M0N5l66M22l74K50l01k9L43n0j50L44
$$ 24 78 5 39 -14 108 -105 196 -145 -118 91 84 95 135 190 -176 246 -128 122 -179 -208 135 85 -65 279
5591B79k45LM1m1q9O0J09p9J3r6k04L15p6q5L28k22m3J35K55m72J27q8j10K30
$$ 279 34 37 78 37 -52 8 117 38 51 -45 -249 66 -10 -95 233 11 -32 103 358 -114 13 -75 -185 45
5615D5J02k04R7k22M2J12P1J66l45k7j11J31j52N84l86K96j45k2j12J71o3l25
$$ 45 147 -57 40 -182 -140 -28 43 209 -136 -163 -274 -143 -295 289 -97 199 54 32 -80 91 28 -297
5637b97J37K33k65K27L8j42K38l72K22P8k67K68m9M8N5m1n5Lj81Q7L1j11R1l09
$$ -297 -160 73 -192 35 73 -69 169 -203 19 97 -170 98 49 97 152 111 56 59 -122 -35 -4 -115 -24 -333
5661c33L73l1L55l79O8j41m2qK32k04j36J98R8K3j17m5K1J85l4l26J80K28j67
$$ -333 40 9 364 -15 53 -88 -130 -138 94 -110 -246 -48 50 73 -44 -89 -68 117 83 -243 -63 165 -2
5684bk1J58k95j0J93j05n8R9J16k77L9J59k2J87j80Or6P3K68k25k65L11j39P1
$$ -2 -23 135 -160 -170 23 -82 -140 -41 75 -202 -163 -4 -26 161 -19 -13 -109 -36 232 7 -258 53 -86 -15
5708a5p5J60J4p7N3L2j96J39J13m5m44N46k38J09k87M27l02M1j09K8K42r4j27
$$ -15 -90 70 84 7 60 92 -104 35 148 103 -341 205 -33 76 -211 216 -86 -45 -154 -126 116 22 -105
5731a05R7J6L6jM4m0O2K6k14J27j46O3pmp6j07l6L67l24j58N94k62j32L00j11
$$ -105 -8 8 44 43 87 47 109 135 -79 48 -98 -35 -42 -46 -122 -229 -265 102 -222 -380 214 -48 -180 120 9
5756IK18j56j63l6J42n6J77j02Q0J21m8k3q2l42K14L3J33J14k44O0M0l17K17k04
$$ 9 227 71 -92 -128 14 -42 135 33 113 234 186 163 81 -261 -47 -14 119 233 -11 49 89 -228 -11 -215
5780b15L54j07j06J55j98J10m6j48q5N34j67O5j54K5P9J23k05K05k18k23j68K54
$$ -215 139 32 -74 81 -117 -7 -53 -201 -286 248 81 146 -8 17 96 219 14 219 1 -222 -390 -136
5802a36L0pJ73r2N5J1j23J26l61N14j99R7k49K64K4k49L53j72L4J80o19L72R7
$$ -136 -106 -113 60 -32 23 34 -89 37 -324 190 -9 88 -161 103 127 -122 231 59 93 273 -346 26 123
5825A23m0k61QK21k25K54j68n0K34k45M10j92k41K85Lp7q9J88%m5l6m4K66j69
$$ 123 83 -178 -170 51 -174 80 -88 -138 96 -149 261 69 -172 113 116 39 -50 138 138 93 57 13 279 110
5849A10k49o1J22oq9L64r7k6l5Q0k41j1j09K14l9L28k96M3j77l66O10k31K67j63
$$ 110 -139 -200 -78 -84 -173 191 94 68 33 113 -128 -139 -248 -34 -73 255 -41 2 -175 -541 69 -162 105 -58
5873e8K49p9k50p1N3j17M02m68M9J96K2oj96L70J04j54L3L8j41o8P6Q0P3k41m6
$$ -58 191 112 -138 -209 -156 -273 129 -339 -290 -94 -72 -78 -274 96 200 46 79 117 -24 -92 -16 64 137 -104 -150
5898a50J61M2j36J47l08J80J62m8J16k50L98m45L63m02j06L73k27O4n2J46l4m72
$$ -150 11 53 -83 64 -244 -64 98 50 166 -84 314 -131 232 -170 -276 97 -130 -66 -118 28 -6 -478
5920d78N87k01K6Q4j0M8o1J68k27J84j48R5j52NP6k0J07j9j93j21L09j3J95j83
$$ -478 109 -92 -66 18 8 56 -5 163 -64 120 -28 67 -85 -80 -4 -24 83 64 -129 -250 59 46 241 58
5944E8k22J37k07J25J90J95m93J90K48j24j54J21n3r7L02o4Kj07pJ6L3r2o4J77
$$ 58 -164 -27 -234 -109 81 276 -217 -27 221 97 -57 64 11 -86 216 152 154 47 40 56 89 -3 -67 110
5968A10j87j06M2mJ38q0J24j25P6O5j79K5Q8J7k9k96N15j53P7J2k8K39q3k12P9
$$ 110 -77 -183 -141 -145 -7 -87 37 -88 -12 53 -126 -101 -13 4 -25 -321 194 41 118 130 102 341 258 46 125
5993A25j10JJ11k43L29j43o3J26j20k49O7j06L2L45j62J06L24k74n13L44M02j6
$$ 125 15 16 127 -116 213 70 7 133 13 -236 -169 -275 -243 102 -60 46 370 96 -417 -73 329 313
6015C13l12l1r3l4P4J88k47K64j47n9P0R3j94J03K2J3K63l30j17k36N00j42O7
$$ 313 1 -30 -123 -157 -83 105 -142 122 -25 -84 -14 79 -115 -12 10 23 286 -44 -161 -397 103 -39 28
6038B8j25R0j28K5K0n2J79Rj32j24M6L10%k37m0J62M7R8N0j72k77L51j31p8L74
$$ 28 -97 -7 -135 -110 -90 -142 37 46 -86 -210 -164 146 146 -91 -131 31 78 176 226 54 -223 128 -3 -81 293
6063B93r4l05J03j21K29o1K29k48K10j27j15m4J82l70J24K4j4J85n11K72M9J26
$$ 293 199 -106 -3 -124 105 44 273 25 235 108 -7 -51 131 -239 -115 -91 -105 80 -431 -159 -110 16
6085A6k05O5K56j49J19j64R8nj40J17J09j18r6J90L7j05J35k39Q0l96L51n0J73
$$ 16 -189 -124 132 -17 102 -62 36 31 -109 8 117 -1 -97 93 130 25 160 -79 1 -395 -44 -94 79
6108G9n0j88J67l24P0J05K31o3j54O4q5L1K08r3p0Q5j1k46M36j26j81L08m48J89
$$ 79 29 -159 8 -316 -246 -141 90 27 -127 -63 -148 -117 91 -2 -72 13 2 -244 192 66 -115 193 -255 -66
6132f6k26L03k3l51M59l1k6j93L45k30j01L02j73J68k67R5J27K49k87j16m8L02
$$ -66 -292 11 -12 -363 96 65 39 -154 191 -39 -140 162 -11 157 -110 -15 112 361 74 -42 -90 212
6154B12k75jj3k2K24m17L21j93o5J10L80j46K8j79M3j08P9J56q2N0j84J50j45
$$ 212 -63 -64 -77 -99 125 -292 29 -164 -229 -119 261 115 143 -36 7 -101 -22 134 52 102 -82 68 -77
6177g7O1K49k75K85l44K25j19J72r1k27K11l1J33j08J8R4j80kJ53j41J47j84N4
$$ -77 -16 233 -42 243 -101 124 5 177 86 -141 70 39 172 64 82 176 -4 -6 147 6 153 -31 23
6200B3j21M7m9O2k5n0K56j76j07K17k62L70R5n62K49k66K86J11m48K31K53K0k85
$$ 23 -98 -51 -100 -38 -63 -113 143 -33 -140 77 -185 185 280 -282 -33 -299 -13 98 -350 -119 134 154 -131
6223a31MJ06J39J36K14j85l51N4R7J17l57K09n2J73j98k80L59l20J93j5r2J06
$$ -131 -127 -21 118 254 468 283 -68 -14 83 200 -157 52 0 173 -25 -305 54 -266 -73 -88 -180 -74
6245g4j50K39M5j84M8J26m9j82K27l81M30l22K57j1k00J71k3Jj5K4K06n01L50
$$ -74 -224 15 60 -124 -76 50 1 -181 46 -335 95 -227 30 19 -181 -10 -33 -32 -47 -23 183 -318 32
6268C2j9P5J63j98k02L7n5L78l82K46l53N3R2j09L09j28J26l22L25j63J19J07
$$ 32 13 88 251 53 -149 -112 -167 211 -171 75 -278 -225 -133 -242 67 -61 65 -257 68 -95 24 131
6290A31l09J92j07P4m3J65k26J33pj56K65l9Kl7J35q8M9pk80rK01L9j19J79j10
$$ 131 -178 14 -93 -19 -62 103 -123 10 3 -153 112 73 75 38 173 85 134 127 -153 -162 39 78 -41 138 28
6315B8J67l31j72N58l86Q3NN8M7ML8o6n1m2j16L32m35L33l0j06K08j01j69K04
$$ 28 195 -136 -308 250 -136 -53 -48 10 57 61 99 33 -18 -60 -176 156 -279 54 24 -82 126 25 -144 60
6339F0K7P0j09k69L71N1j34L1j30j46p5M4J04N0M30l95R0j22L02l85j19L29j97
$$ 60 87 157 48 -221 150 201 67 98 -32 -178 -253 -209 -105 -55 375 -20 70 -52 250 -135 -254 75 -122
6362a22K82k69j98K83K4J33j74O9p8L6k01J67J33j94M4R7jp2J18L1J49j69J3j08
$$ -122 160 -109 -307 -24 0 133 -41 28 -50 -14 -215 -48 85 -109 -65 32 31 -41 77 108 257 88 101 -7
6386gl8NO3Q8Ro8K05l55k0K55j86L20k82QJ41l6j38n3l3L19L6m02K48j37J34n3
$$ -7 -45 -40 23 111 120 52 257 -98 -118 137 -49 271 -11 -3 138 102 -36 -89 -122 197 233 -169 79 -58 76 23
6412B3m7k3Q3K3l9j41K20j35k02K15J13q8m5m6K49J7M7m50J9J97KN4q6J73k80
$$ 23 -24 -47 36 59 20 -121 99 -36 -238 -23 90 2 -43 -89 160 177 224 -226 -207 -10 -8 46 -40 133 -147
6437a47L7O8R6K06k52M8j47J57J22m11M90m34K18j68J10K23p4j05K61j64j83p0
$$ -147 -110 -42 54 260 8 56 -91 66 188 -223 267 -167 51 -117 -7 216 142 37 298 134 -49 -119
6459a19J85J17k98Oj26M38j43l44J92J02k8L00k96K46p7j56L08k14j60J3j37K00
$$ -119 66 183 -115 -109 -235 203 60 -284 -92 10 -18 282 -14 232 155 -1 307 93 -67 -54 -191 9
6481IJ11j28j8K0J2K02l14p2K7m5L73l67k3L22j92J62J08j9k51l2K39lk41p8K64
$$ 9 120 -8 -26 -6 6 208 -106 -178 -151 -196 177 -190 -213 109 -83 79 187 168 -83 -115 124 121 -120 -198 66
6506F6P2j78J57o3J0j2q5K35p1L3m37R4J00J75oR3j79J24j01j56J42K85n52K60
$$ 66 138 -40 117 54 64 52 -33 202 131 164 -273 -179 -79 96 90 183 4 128 27 -129 13 298 -254 6
6530FK2J28j42J08j43N7j50J58j61jK74k05m3M01l96J51q4Q2k96J59J6q0P1Q8
$$ 6 28 156 14 122 -21 36 -114 44 -117 -118 156 -49 -92 309 -87 64 -20 62 -234 -75 -59 -139 -68 20
6554B0m8j6m3J40J7l20J15K53j11Q7%R4k10J24o6%j49J29j90O5J43jn8j16J48
$$ 20 -28 -44 -87 53 70 -250 -135 118 7 94 94 188 -22 102 36 36 -113 16 -174 -109 34 33 -25 -141 7
6579GO4l89M94q8l38L15j25L4j2L6K9j52L45k30j79K93l07L35l4j83J60K3j31
$$ 7 71 -318 176 88 -250 65 -60 -26 -38 -2 27 -125 220 -10 -189 104 -203 132 98 -85 75 98 -33
6602c3N4m1J94n29M49r6j4O0P6j85R5p2J63m8j41K94k40o8L26k66Q1r7k2r1l7
$$ -33 21 -20 174 -355 94 -2 -16 44 120 -65 30 -42 121 73 -68 226 -14 -82 244 -22 59 -38 -60 -151 -188
6627a88J60J10L77n71P9j34J66l4Nj69J99k03M72K2m92J41J89j51q0L06N3K7k00
$$ -188 -28 82 459 -112 -33 -167 -1 -35 -30 -199 0 -203 269 291 -201 -60 129 -22 -102 204 257 284 84
6650H4J53k16j33K06K1k04k2k5K67j83j0K9P7%J04J30k94q9l3J13J99l90J65l4
$$ 84 237 21 -112 94 115 -89 -111 -136 131 -52 -62 -33 44 44 148 278 -16 -105 -138 -25 174 -216 -51 -85
6674h5j7O1j28J86o7J06j82K60l13M55k52k23K9L26k30L99k05o2P9j93r3J77J86
$$ -85 -102 -41 -169 17 -50 56 -126 134 -179 276 24 -199 -170 156 -74 325 120 58 137 -56 -149 28 214
6697B14j50Q7l88N31j28m8m5j83J66j00J16Ok02J32j07J22p5K3j56L24j08j9j10
$$ 214 64 151 -237 294 166 118 73 -110 56 -44 72 78 -124 8 -99 23 -52 -29 -185 139 31 12 -98
6720i8N4K72j26J02J6m02R8k6R4k11K32L45l15K5Q6o7L3k12j71L59p8k72L46N9
$$ -98 -44 228 102 204 220 -182 -84 -110 -16 -227 5 350 35 60 146 79 112 -100 -271 88 10 -262 84 143
6744A43l5q9l10K99O4M3j97J74k01K54R0j49j33j0N1k92K64O7O2nl82L40k11J09
$$ 143 108 19 -291 8 72 115 -82 92 -109 145 235 86 -47 -57 -6 -298 -34 33 95 90 -292 48 -163 -54
6768e4K25l2r6l1P8r3k7K24j06o6Q0l0o2l0P6j38K12p9o2k51K5J86O1J34m0m45
$$ -54 171 139 43 12 90 -3 -30 194 88 22 102 72 10 -20 56 -82 130 51 -11 -262 -237 -51 10 144 104 -341
6794c41K59r2J15N9n8lp9K60q3j89L13J9l32K25j88J49l2j6k32J28k45L77k18
$$ -341 -82 -174 -59 0 -58 -61 -140 120 37 -152 161 180 -152 73 -115 34 2 -14 -246 -118 -363 14 -204
6817b04K92J7J38k39j21j94N17k13k3K54n08K11J22q5r8N15l76J42l9o4j04K10
$$ -204 88 105 243 4 -117 -311 206 -7 -30 224 -284 -73 49 -36 -134 381 5 147 108 44 -60 150
6839A50k21K1J47m9J80l44J06j80M06k3k79p3J12j3M3J96l8j85Lp2R6J01J43j63
$$ 150 -71 -50 97 48 228 -116 -10 -190 216 193 -86 -159 -47 -60 -17 179 141 -44 -41 -113 -17 84 227 64
6863F4M3p6J98l81K95k3j20q3J33J21k91J79j29j82K49O3j89P3M2nJ95j57n8j53
$$ 64 107 31 229 -152 143 120 0 -83 50 171 -120 59 -70 -252 -3 60 -129 -56 -14 -19 176 19 -39 -192
6887a92L43j64q7OL43k68m8K41p4j32K9J18j20m8J58k15K56k37M7J26J60j16j99
$$ -192 151 -13 -100 -94 249 -19 -67 174 100 -32 -3 115 -5 -53 105 -110 146 -91 -44 82 242 126 -73
6910g3J44L1j46J25l5K19j62l97K79K25k02J68k47jL7o0O6J61j84k67K94P2J86
$$ -73 71 102 -44 81 46 265 103 -294 -15 210 8 176 -71 -72 -35 -95 -29 132 -52 -319 -25 47 233
6933B33m92J21QJ22J50k96J33l8M63j45l31J39K04l9j13l65L5K93K6j3j46J4Q7
$$ 233 -259 -138 -130 -8 142 -154 -21 -59 404 259 -72 67 271 232 119 -246 -211 82 108 95 -51 -37 50
6956E0m0J2M03l68k05J26J45R4j65m8P7J44l39k4K54k9Q2k72J52J88k39k8L5J29
$$ 50 10 22 425 57 -148 -22 123 217 52 4 81 225 -114 -138 116 87 169 -103 49 237 -2 -30 5 134
6980A34j49N8P0k76K79l93K76Q5l2J51j33j20K58j1l64J55J53N7k35r9K01j02
$$ 134 -15 43 113 -163 116 -277 -1 84 52 203 70 -50 208 197 -167 -12 141 198 -37 -136 65 -37
7002c7J8k44K79m9LJ04n1K11n19L33j74J70j58K0J27J62o1m11L24J79l26j5L27
$$ -37 -19 -263 16 -33 -30 74 23 234 -285 48 -126 44 -114 -94 33 195 134 -277 47 226 -100 -115 212
7025B12k76P0J26l02Q4J47l24K85O1k81K94j29j30N1JK48l92J87l8m8lm0K41k6
$$ 212 -64 6 132 -170 -86 61 -263 22 83 -198 96 -33 -163 -112 -111 137 -255 -68 -106 -154 -157 -197 44 18
7049A8J54k21l4n4K20j01J87k9L2j45k2J7J4J74k07R8R6j34K01k50n4J6Q4r5N8
$$ 18 172 -49 -83 -137 83 -18 169 140 172 27 5 22 36 210 3 101 197 63 264 14 -40 -24 60 -35 23
7074B3P9j70K3j06N1K19j13J00j15J2J11l07J01J70j43L6J38p9j37J86j62m7L42
$$ 23 102 -68 -45 -151 -100 119 6 106 -9 3 114 -193 -92 78 -65 -29 109 30 -107 79 -83 -130 212
7097B12l5N5k43j39J02j28N2J40j09j3N2j88J49l0J38K32o0l2j56K76k77J09j46
$$ 212 177 232 -11 -150 -48 -176 -124 16 -93 -106 -54 -242 -93 -123 15 247 187 155 -1 275 -2 107 -39
7120c9J9m2q8J82k0k76L37L9K41k51J49k65J58J9j33Pl06K39M4L7j8J85j32k31
$$ -39 -20 -62 -150 32 12 -264 73 112 353 102 251 -14 144 163 30 37 -269 -30 14 51 33 218 86 -145
7144a45K94j82O9J2k10J95K69k94j5J70k83j88L09q2J26o6J68j24j74P6q8R3o5
$$ -145 149 -33 36 48 -162 33 302 8 -7 163 -120 -308 1 -81 45 -21 147 23 -151 -75 -163 -70 -135
7167a35J81m2K12m1q2q5j66j63O01lk37R4k08k05J32L00j36K07l12O2j45L80k92
$$ -135 46 4 216 175 93 8 -158 -321 280 277 40 134 -74 -279 -147 153 17 224 -88 -26 -171 209 -83
7190h3j5K44J58Lm54L79pm03P6K58K2p2j88J10o2j99O3P0q3Q4L46l10K45k15l9
$$ -83 -98 146 304 307 -147 232 225 -178 -102 156 178 106 -82 28 -34 -233 -170 -100 -183 -99 247 -63 182 -33 -72
7215g2K3j1n3N8l7K14j62J36l3m0k72J15K80j92m3J59mj27K36j48j58J26Q5q5
$$ -72 -49 -60 -113 -55 -92 122 -40 96 63 23 -249 -134 146 -46 -89 70 66 -61 175 27 -131 -5 80 -5
7239eJ13j0l34L16k3J84j33k47N3K91k63j37L85l09q1J41P9n7L42l25K03or3K12
$$ -5 108 98 -236 80 57 241 108 -139 -86 205 -58 -195 190 -119 -200 -59 20 -37 305 -20 183 177 84 296
7263B96k66J38m5k2k93K50J26k42J22j89J15l4J56k48J26o1j39K37m5p8J66N1
$$ 296 30 168 123 101 -192 58 184 -58 64 -125 -10 -44 112 -136 -10 -71 -210 27 -18 -96 70 121
7285A21Q4k88J37r7p7O0J43j98p2M50k47q6NJ99k66J88j68m5J82k4Q2K13j15j45
$$ 121 205 -83 54 -43 -120 -60 83 -115 -187 263 16 -70 -65 134 -132 56 -112 -157 25 1 83 296 181 36
7309C6mj52L34k56Qo4J97O5j98p8R2K72k12Q7j79r6K6N06n48J97N6k32k7J64J55
$$ 36 32 -120 214 -42 -34 -98 99 164 -34 -112 -20 252 40 127 -52 -148 -122 384 -164 33 89 -143 -170 -6 149
7334A49O2j84j24R8o6J93k87J52o5K21p5k05J13J8k89L68k09J11r0m4K12j66R1
$$ 149 211 27 -97 1 -65 128 -159 -7 -72 149 74 -131 -18 0 -289 79 -130 -19 -109 -153 59 -107 -16
7357a6q8K25j40N1l24Q7K8M91m38K30k07L4j64N7L30k83r1J90M0j69J92R1J01
$$ -16 -104 121 -19 32 -292 -205 -177 314 -124 106 -101 -67 -231 -174 156 -127 -218 -28 12 -157 35 126 227
7380B27k63J51k06K5J0J03J58l26O6N2J43O6l53J10r4M77n3l11M07m30P2K35J07
$$ 227 -36 115 -91 -66 -56 47 205 -121 -55 -3 140 206 -147 -37 -131 346 293 -18 389 -41 31 266 373
7403C73k02l72K2N36n14L61k22j09K6J54l9J09j27R6q9O8p0j35M1Q1J05P4j73
$$ 373 171 -201 -179 357 -157 204 -18 -127 -101 53 14 123 -4 92 3 71 1 -134 -93 -12 93 167 -6
7426fk40Q1JJ48o1K33L1p5k52K14J82k13q4q1K38k54J12P9l21L96j88J48j93K83
$$ -6 -246 -165 -164 -16 -77 156 187 112 -140 74 256 43 -41 -122 116 -138 -26 53 -268 128 -60 88 -105 178
7450A78k13n4Q7l0j84K71k26P4j45J90j05L9J25O0p5K76k25J2L5j56L00j81k18
$$ 178 -35 -89 -2 -32 -216 55 -171 -97 -242 -52 -157 -118 7 67 -8 268 43 55 90 -66 234 53 -165
7473a65L83k17K06k26J58M5k05J25jPk1J95m02l4J49J0K47k64j08k3J40J09J8
$$ -165 218 1 207 -19 139 184 -21 104 103 110 89 284 -118 -152 -3 7 254 -10 -118 -141 -1 108 126
7496A26k68Q2K94l4j09M6j29l2k32K74r1M5L76m29r2J01O4j07nK92J3l39K89j82
$$ 126 -142 -60 234 200 91 137 8 -24 -256 18 -73 -28 348 -81 -173 -72 -8 -115 -120 172 185 -154 135 -47
7520d7J77o6L3l8l20L44k00l4K27j63J49j59j78L44j12k3Q2kK8no6k3K01l34M32
$$ -47 130 64 97 59 -261 83 -117 -151 76 -87 62 -97 -275 69 -43 -66 16 14 42 37 -29 -52 149 -185 247
7545B47l90M9K81k49j66R6R0q5k0K73o4q3l6q5J61p5L9L14l67j51N53k32J34k90
$$ 247 -143 -94 187 -62 -228 -132 -42 -127 -147 126 62 -21 -57 -142 19 -56 -17 297 -70 -221 332 100 234 -56
7569e6J32J01n2j92m9M2J25L7j07K23j54M6j19q5j69L52l23L41kl25O5K81k12
$$ -56 76 177 125 -67 -116 -74 51 88 -19 204 50 96 -23 -108 -277 75 -248 93 91 -234 -169 112 -100
7592a00J52Q3j57m0r1K47k56L78l08O4LJ79j50j5k5K04l26K20N5L1l68L69k63
$$ -100 52 135 -22 -62 -153 94 -162 216 -92 -28 -25 154 4 -11 -36 168 -158 62 117 148 -220 149 -114
7615a14J24q7j04Q7j85K39j1O8j92l4P4J29J58k7l06R0j48L13K00k35p8r3J58
$$ -114 10 -77 -181 -94 -279 -40 -51 17 -175 -209 -135 -6 152 125 -181 -91 -239 74 274 39 -39 -132 26
7638B6K78l84K53j86r4J14j4l9O5j02J66j09M7k60K16r9J01J01J8j68Nk55M3N11
$$ 26 304 -80 173 -13 -107 7 -7 -46 19 -83 83 -26 21 -239 -23 -122 -21 80 98 -70 -65 -320 -277 234
7662B34n23K99o7k17J46J99q0J93k41K50o8l75M15l04J68p2K20l69R8K41l06J8
$$ 234 -289 10 -57 -274 -128 71 -9 184 -57 193 125 -250 165 -139 29 -43 177 -192 -94 147 -159 -141
7684a41j12J04L0o9k32M51j3pr9k26j1K70p8j40J45K37k30j15L14RJ37j73k16
$$ -141 -253 -149 -119 -188 -420 31 18 11 -88 -314 -325 -55 -133 -273 -128 109 -121 -236 78 87 224 51 -165
7707a65L99o23L46k24K28m5J71MR0m93M55j79R8M1l79M71R0l70N9J14J30k14K62
$$ -165 234 -389 -43 -267 -39 -84 87 91 181 -312 143 -36 62 103 -276 195 285 -85 -26 88 218 4 266
7730B66l13K00k35j01L85Oj64J38q4q6k3k6k1m01L66J15J25j22K1j96J58L6j21
$$ 266 -47 153 -82 -183 202 208 44 182 98 12 -11 -37 -58 -459 -93 22 147 25 46 -150 8 44 -77
7753g7M1N0k92K09J73j37l6K07k06r7M41j32o7L4k38K09P3q3K55n70L11n2J22
$$ -77 -36 14 -278 -69 104 -33 -69 138 -68 -165 276 144 77 111 -127 82 155 72 327 -243 68 16 138
7776A38J04l97r6Q4J46N9p6J61j56j53J35K07k83L27j73J25m9L1j27k7j08K79
$$ 138 242 -155 -251 -167 -21 38 -38 123 -33 -186 -51 156 -127 200 27 152 103 134 7 -20 -128 151
7798A51j25p6K60k94K96P7j57N4j19k69K66l62K46L0J95k52j81J97k38M44n1j46
$$ 151 26 -50 210 -84 212 289 132 186 67 -202 64 -298 -52 -22 173 -79 -260 -63 -301 143 92 -54
7820e4Nq2K51k49q1L86j76M3pJ13l87K06j72J20K62l41J3K91j77J73J3j86j5j01
$$ -54 -49 -131 120 -129 -210 176 0 43 36 149 -238 -32 -204 -84 178 -163 -150 141 -36 137 150 -36 -51 -152
7844a52K0j55K11N3K77k39kK35m60J25J84o2J90k74O9M2k35M08k24L2j96K1K30
$$ -152 -132 -287 -76 -23 254 15 13 248 -212 -87 97 35 225 -49 20 62 -173 235 11 43 -153 -132 98
7867I8k01KJ52L9l29L43l1r6Q3k1J40l75J60m6K64k31K40j43N0k99K53q6L3J31
$$ 98 -103 -101 51 90 -239 104 73 -23 60 39 179 -196 -36 -82 182 -49 191 48 98 -201 52 -34 -1 130
7891A30O3k75J66J3K82l60k5k56j23M52j02J29J25j45k29o4L85k16N5q5m2L9R5
$$ 130 193 -82 84 97 379 19 -6 -262 -385 67 -35 94 219 74 -155 -219 166 -50 5 -80 -122 -83 12
7914A2p9k81M44J53l76P4R7J63J8N5lj58q6J1k61J42K08o7j95p3J78n5K06j4L2
$$ 12 -67 -348 96 249 -127 -53 44 207 225 280 277 119 33 44 -217 -75 133 66 -129 -202 -24 -79 127 113 145
7939A45l93K60M09k90l10J26J74j01J08j77j8J66rj10N0j31k5L20j83q2k9P4j07
$$ 145 -248 12 421 131 -179 -53 121 20 128 -49 -67 99 90 -20 30 -101 -126 194 11 -71 -100 -26 -133
7962a33L75j24k06J47j12L02k76k5K09J43m90L43k69L26k04k6O0O3O1j75j64Q5
$$ -133 242 118 -88 59 -53 249 -27 -52 157 300 -190 153 -116 210 6 -20 40 103 164 -11 -175 -90
7984i0n6Q6PM5K29k69pm6L92l11j30K21j64M26m36J12m9j07L30k95%l4K51j82
$$ -90 -146 -60 -53 -8 221 -48 -55 -101 291 -20 -150 71 -93 333 -103 9 -40 -147 183 -112 -112 -146 105 -77
8008g7R3j86j4J47k24K71MQ7n7p5j3K2k9M13k62j16J68k19j31J75K68k2j73m8
$$ -77 16 -170 -184 -37 -261 10 14 101 44 -31 -44 -22 -51 362 100 -16 152 -67 -198 -23 245 223 50 2
8032BL7O1K6r3k25O8j45M14k02J24k89L56l10j18M56q3or9n8l0L72k62L35l77
$$ 2 39 100 126 33 -192 -124 -269 145 -57 67 -222 134 -176 -294 162 79 73 -26 -84 -114 258 -4 331 -46
8056d6K6j8J65l0m9J75k57J46j6J48l02N04l15k61J96m6o5k17J71J86k01K71j46
$$ -46 -20 -38 127 97 48 223 -34 112 96 244 -58 446 131 -130 66 20 -45 -262 -91 95 -106 165 19
8079A9K8k50J76j56M4J76m4r6K31l26L03m8k4J47m97J84K59k6l49K46J14J64l79
$$ 19 47 -203 -27 -183 -139 37 -7 -103 128 -198 105 57 33 180 -317 -133 126 100 -249 -3 111 275 -104
8102a04L83l14J50q7J19J5k1j48M6R4J4j50N5k48K33j65J30Q4j9nj91O5K40j79
$$ -104 279 -35 115 28 147 162 141 -7 39 133 147 -3 52 -196 37 -128 2 86 67 62 -129 -64 176 -3
8126cN7k5M9J14m36J84K01j18K02j47l84L29K69m20K97q6J58l03J11m51K04K97
$$ -3 54 29 78 192 -244 -60 141 23 225 78 -306 23 292 -128 169 83 241 -62 49 -402 -198 99
8148I9L3j73K45k38R0k9o4K5L5Q4p2q7O6L4N0j29o8P1KQ9n3K25l03k5o8J54J26
$$ 99 132 -41 204 -34 56 27 -37 -12 23 107 35 -52 14 48 98 -31 -99 -28 -26 63 10 235 -68 -93 -161 -7 119
8175A19j52N2O9o4l2J4L1K60m27m1J10O7K54k64J76l43
$$ 119 -33 19 88 24 -8 6 37 297 -130 -171 -61 6 260 -4 172 -171
8191a71
$$ Imaginary data points
##PAGE= N=2
##DATA TABLE= (X++(I..I)), XYDATA
0@%%%%%%%%%%%%Qj6J6j6J6k4L2m0M8n6O6p4Q8j04J21j45J68j92K21k51K86l24
$$ 0 0 0 0 0 0 0 0 0 0 0 0 0 8 -8 8 -8 8 -16 16 -24 24 -32 34 -40 48 -56 65 -80 88 -104 117 -134 152 -172
34a72L66m14M65n21N84o52P26q08Q97r94J102j218J345j484J635j801J984k185
$$ -172 194 -220 245 -276 308 -344 382 -426 471 -523 579 -639 706 -778 857 -944 1040 -1145
52a145K408k655K931l243L594l993M455m999N643o422P390q629J0282j2607J6144
$$ -1145 1263 -1392 1539 -1704 1890 -2103 2352 -2647 2996 -3426 3964 -4665 5617 -6990 9154
67I154k2246L5659j21111R5063K00011j71298r5016M3747M3286l0683L3217o411
$$ 9154 -13092 22567 -98544 -3481 196530 25232 -69784 -26037 17249 -13434 19783 13372
79A3372p4500O790J40147K0773j11753p0241K7452M5759L2559j1161j1270N305
$$ 13372 -61128 -54338 85809 106582 -5171 -75412 -47960 -2201 30358 19197 7927 13232
91A3232q527l5441N219M6507j3585p5435M2620J20567k2623j17756j6758M0498
$$ 13232 4705 -30736 -25517 20990 7405 -68030 -25410 95157 72534 -45222 -61980 -21482
103b1482J2103L3624M5472n2176q7837N3709J02812o5410j16779L6719R9471K1005
$$ -21482 -9379 24245 69717 17541 -70296 -16587 86225 20815 -95964 -59245 40226 61231
115F1231l1842l7520l3030l826M4249L2961l0360k0917L2946J8347j8286k5585
$$ 61231 29389 -8131 -41161 -44987 -738 32223 1863 -19054 13892 32239 13953 -11632
127a1632k1209J0039L2078J3401j23j587j7215l1322j1152L3934K6250k2819q115
$$ -11632 -32841 -22802 9276 22677 22554 20967 3752 -27570 -38722 -4788 21462 -1357 -9472
140i472K6108j176j8793o609j1984p041K9739M6103n032n5957j4690L4266P82
$$ -9472 16636 15460 -3333 -9942 -21926 -28967 772 46875 41843 -14114 -28804 5462 6244
153F244k2677N703J8760J0916j459j2116j8135j9588P032L3889J0003j3632j635
$$ 6244 -16433 -10730 8030 18946 17487 5371 -12764 -32352 -25320 8569 18572 4940 3305
166C305N506l366j7973j2182J9643K0344j521Q83r99j4613j3928k519J1658R178
$$ 3305 8811 5445 -12528 -24710 -5067 15277 13756 14639 13640 -973 -14901 -17420 -5762 3416
180C416j986Q279O176j7160j2244l60P66P066J0943J2539K271j9058j2126N361
$$ 3416 1430 9709 15885 -1275 -13519 -13879 -13113 -6047 4896 17435 19706 648 -11478 -6117
194f117K038J767M703L552P386j090j1551j0165j0855L362K1845R890n945q619
$$ -6117 -4079 -2312 2391 5943 13329 12239 688 -9477 -20332 -16970 4875 14765 8820 201
208B01n641J862p43m792M419O534P564J0489q094j9518o136M958R402N859l92
$$ 201 -5440 -3578 -4321 -9113 -4694 1840 9404 19893 11799 -7719 -13855 -8897 505 6364 5972
223E972J681m178r711J398o77o592N086J1402P706j532j2351m557l1k474R924
$$ 5972 7653 3475 -6236 -4838 -5515 -12107 -7021 4381 12087 10555 -1796 -6353 -6384 -8858 1066
238A066J1561m012o345j117K537l106j3562J545J6566K608m088p95n055o187k620
$$ 1066 12627 8615 2270 1153 3690 584 -12978 -11433 5133 7741 3653 2858 -2197 -8384 -11004
253a1004O979R328m454J62J1136n572j4936R85Q815K485m353J693J0561n072j4333
$$ -11004 -4025 5303 849 1011 12147 6575 -8361 -7376 1439 3924 -429 1264 11825 6753 -7580
268g580k96L470N00L673K106K478j846p214J246K716m901K636R762L272o871q405
$$ -7580 -7876 -4406 -3906 -233 1873 4351 2505 -4709 -3463 -747 -5648 -3012 6750 10022 3151 -5254
284e254P759N958j6314n034J9987O758j2457q645L676K638l745L845M710j1224
$$ -5254 2505 8463 -7851 -12885 7102 13860 1403 -7242 -3566 -928 -4673 -828 3882 -7342
298g342Q43J9779k691k0606l539J5084J0311o856p488L705J381j672O0m477oN187
$$ -7342 -6499 13280 10589 -10017 -13556 1528 11839 4983 -2505 1200 2581 909 969 -3508 -3514 1673
314A673k296N83L074n413k938L563l4q97M884P488o857j7288J1494K1290j2549
$$ 1673 -623 -40 3034 -2379 -5317 -1754 -1788 -2685 2199 9687 2830 -14458 -2964 18326 5777
329E777j8988P636J3971k63o884l996m272j767J4184Q487k0152j0612J7250J0321
$$ 5777 -13211 -5575 8396 8133 1249 -2747 -7019 -8786 5398 13885 -6267 -16879 371 10692
343A0692q252q279L84P143L338j654k938k920M130K671o381K512N020p407l693
$$ 10692 2440 -5839 -5455 1688 5026 3372 434 -2486 1644 4315 -2066 446 5466 -1941 -5634
358e634N279O00m60K573k131q445O98J5866K238k0829j360K0472K779j0744n460
$$ -5634 -355 245 -215 2358 227 -8218 -7520 8346 10584 -10245 -11605 8867 11646 902 -4558
373d558J72L637N570L554o989j1158O891J1719p614r617K748N560M126j239n035
$$ -4558 -4386 -749 4821 8375 1386 -9772 -2881 8838 1224 -8393 -5645 -85 4041 2802 -2233
388b233m10J862N71k11p90O189J646q170l31M472k934q25J142j762J622M497K87
$$ -2233 -2643 -781 -210 -421 -1211 4978 6624 -1546 -1877 2595 -339 -1164 -22 -1784 -162 4335 4622
405D622q546q468Q719J0552m985m937L035K379O39k872l974M31L539O323J118
$$ 4622 -3924 -12392 -3673 6879 1894 -3043 -8 2371 3010 138 -3836 -3405 134 6457 7575
420G575p632l032K234p12J1k45K54M326N89m137k810o61J420K358k11M116K972
$$ 7575 -57 -3089 -855 -1567 -1556 -1801 -1547 2779 3368 -769 -3579 -4240 -2820 -462 -673 3443 6415
437F415m474k560j440r36K722K171N41R76j643j151j888n006O38N276K523J233
$$ 6415 1941 -619 -2059 -2995 -273 1898 2439 3415 1772 621 -1267 -6273 -5635 -359 2164 3397
453C397j428l043O5j577j109K655K492L090J848l901l132j859j726L083K695M00
$$ 3397 1969 -1074 -1009 -2586 -3695 -1040 1452 4542 6390 2489 -643 -2502 -4228 -1145 1550 1950
469A950J387j538k468j912l505Q05M579K282K602J74l937j960j674J10L444J170
$$ 1950 3337 1799 -669 -2581 -6086 -5281 -702 1580 4182 4356 419 -1541 -3215 -3105 339 1509
485A509J707K787k745l915k764k493K905L495J640J997j689m149j087k052N88
$$ 1509 3216 6003 3258 -657 -3421 -5914 -3009 486 2126 4123 2434 -1715 -2802 -4854 -4266
500d266L632K033L395Q26m287k111k145j672L260L965K359J79m157k905m93k690
$$ -4266 -634 1399 4794 5620 1333 -778 -2923 -4595 -1335 2630 4989 5168 1011 -1894 -2387 -5077
516e077Q65L406K098L126l31m564k798j851J212N050K093J341M26l040j796l129
$$ -5077 -4212 -806 1292 4418 4087 -477 -3275 -5126 -3914 1136 3229 4570 4996 1956 160 -2969
532b969k279L033M020J611J480k910m628j827j330K544L217J574K561K88m260
$$ -2969 -5248 -2215 1805 3416 4896 1986 -2642 -4469 -5799 -3255 -38 1536 4097 4385 125
547A25k094j674j10L598L215K164M76m548l490j001j227K371K883J415K083j909
$$ 125 -1969 -3643 -3753 -155 3060 5224 5700 1152 -2338 -3339 -4566 -2195 688 2103 4186 2277
563B277l982j323k401P31N060L499J471j254m093j439j238o83K871K153J619K096
$$ 2277 -1705 -3028 -5429 -4698 362 3861 5332 4078 -15 -1454 -2692 -3375 -504 1649 3268 5364
579E364k313m982l303j091M084M172N69N50j572k155j089k448k64M293L852J705
$$ 5364 3051 -1931 -5234 -6325 -2241 1931 2500 3050 1478 -677 -1766 -4214 -4478 -185 3667 5372
595E372m37l885k731k157q2L658J720J414J879l424m749n15L11J26K654L396K827
$$ 5372 4935 1050 -1681 -3838 -3920 -262 1458 2872 4751 1327 -3422 -3937 -3626 -3500 -846 2550 5377
612E377j698m044k237j774J196N361J547j196Q38j110k948l030j356K431L688
$$ 5377 3679 -365 -2602 -4376 -3180 2181 3728 2532 3370 2260 -688 -3718 -5074 -2643 1045
627A045K826Q29m744l593J329q18l47L642L191O27m43k246k631l123J348M751
$$ 1045 3871 4700 -44 -3637 -2308 -3126 -3473 169 3360 3987 3544 1298 -1333 -4456 -3108 1643
643A643N26J62K400l419m795o10P89J637J992J791J428k242k173r53k869R46O168
$$ 1643 2169 2331 4731 1312 -3483 -4093 -3304 -1667 325 2116 3544 1302 -871 -1824 -4693 -3747 2421
660B421J789r87k40j940k597j011N07J482R27K455K147m769m300J449m61K81L527
$$ 2421 4210 3223 2983 1043 -1554 -2565 -2058 -576 351 2806 4953 184 -4116 -2667 -3128 -2847 680
677F80J963K9q34j635j559k266J422M003P39J57J227l027l565k06J36J540J770
$$ 680 2643 2672 1838 203 -1356 -3622 -2200 1803 2542 2699 3926 899 -2666 -2872 -2736 -1196 574
694E74J827M50k964j735O6k029Q13M397J914o03o16k212j550l98O48K166L29J651
$$ 574 2401 2851 -113 -1848 -1782 -3811 -2998 1399 3313 2710 2094 -118 -1668 -2066 -1418 748 1077 2728
712B728Q61l588l041N18l23J037K987Q03l9j370j247n01j466N73L456R88L3Q42
$$ 2728 3589 1 -3040 -2522 -2845 -1808 1179 1982 1943 573 -674 -1175 -2641 -2068 1388 2376 2409 3251
730C251k819k090p99P97J968J322j61K84j773j491j30j608J398K898J053J89q77
$$ 3251 432 -1658 -2457 -1660 308 1630 1469 1753 -20 -1511 -1641 -3249 -1851 1047 2100 2289 1412
747A412k275p62j53J024K076K50M4J014j808k562q15P0J662J595N24L54j768j730
$$ 1412 -863 -1625 -1778 -754 1322 1572 1616 2630 822 -1740 -2555 -2485 -823 772 1296 1650 -118 -1848
765a848K62j49J080J454L55Q15j69k142n60n00J82J856R22K50l05k026j007M65
$$ -1848 -1586 -1735 -655 799 1154 1969 1800 -342 -902 -1402 -1220 636 1558 1808 1503 -523 -1530 -1065
783a065n46L76J324R70O91o80k244K19k37K99K440M04n09j86r60k98r40q60J749
$$ -1065 -1611 -1235 89 1059 1750 1070 -1174 -955 -1192 -893 1547 1951 1442 1256 296 -2 -942 -1802 -53
802e3J253k53J7j169j388J41r0R06J280k9K04J10j197j21k86j80J854J27j16Q54
$$ -53 1200 947 964 -205 -1593 -1452 -1542 -636 644 615 819 929 -268 -389 -675 -855 999 1126 1010 1864
822A864k056j213L09K24Q35L87n86P52m11r85J32l48M22J535L53o4n73p31L32
$$ 1864 -192 -1405 -1096 -872 -37 350 -236 516 105 -880 -748 -1096 -674 861 1214 1150 577 -154 178
841A78J29p36L39N87K59J09j062m85k59l83O12J250n15K95n70q9N81m76o1J019
$$ 178 307 -429 -90 497 756 865 -197 -682 -941 -1324 -712 538 23 318 -252 -341 240 -236 -297 722
861G22j40J92K40o70p30M64m90O94J2n50N65o35p74J101n44j47R81n61P19M56
$$ 722 582 774 1014 344 -386 78 -412 282 294 -256 309 -326 -1100 1 -543 -690 291 -270 449 905
881I05r32K91q3J6O24o67j20O60q40j84R62j041l95Q1O61K46j127L51J335p91
$$ 905 -27 264 181 197 821 154 34 694 -146 -330 632 -409 -804 -723 -62 184 -943 -592 743 -48
901d8n88J112k69j14O58k41P3m30L31M53j543k62J202q4o09O49j051q8R54j21
$$ -48 -636 476 207 93 751 510 583 153 484 937 -606 -868 334 250 -359 290 -761 -849 105 -16
921a6q76L26R61N60q86k34R73j142K07J250j241l90J364k58j072l30L90P19j300
$$ -16 -892 -566 395 955 69 -165 808 -334 -127 1123 -118 -508 856 598 -474 -804 -414 305 -995
940i95L40J591q58o45P13r77m2J631M50n18p42N76O27j267p77J061m59P88J020
$$ -995 -655 936 78 -567 146 -831 -873 758 1208 690 -52 524 1151 -116 -893 168 -291 497 1517
959A517j990j082J059L65n70O3N80R47p81JK21j352K07J950j93m15O77l84o23
$$ 1517 -473 -1555 -496 -131 -701 -638 -58 889 108 109 330 -1022 -815 1135 942 527 1204 820 197
978A97j486N05J246n40K4P27p90L7k13j562Q64Q38Q85L05n69n50J46n66K55N53
$$ 197 -1289 -784 462 -78 -54 673 -117 -80 -293 -1855 -991 -153 732 1037 468 -82 64 -502 -247 306
998C06q00Q58J553q89j653q18K78J189l63K59R32q65m49M46j188L51J186L94N82
$$ 306 -494 364 1917 1028 -625 -1443 -1165 24 -339 -80 852 -13 -462 -16 -1204 -853 333 727 1309
1017A309J8j044j99p76n06Q05P96O18L4j558l28N75p56r1O53P57J228q02j005
$$ 1309 1327 283 84 -692 -1198 -393 403 1021 1055 -503 -831 -256 -1012 -1103 -450 307 1535 733 -272
1036b72j31o49L23J330K20L28j69r04J25j277m69J217P96J40J49p15m45l58p15
$$ -272 -403 -1052 -729 601 821 1149 980 76 201 -1076 -1545 -328 468 608 757 42 -403 -761 -1476
1055a476O50J112J69Q37k14q50k33r60J77J374N3L15N79j209j022o45l55J206
$$ -1476 -826 286 455 1292 1078 228 -5 -965 -788 586 639 954 1533 324 -698 -1343 -1698 -492
1073d92N61L87O62o06j132j88n94P16P77N11R06k89r71m33q74L03Q45R5P64L65
$$ -492 69 456 1118 512 -620 -808 -1402 -686 91 602 1508 1219 248 -185 -1059 -756 89 184 948 1313
1093A313j009j221m70j81Q41P64N35O59m67r14j18r97M25J078R16N44l47j222
$$ 1313 304 -917 -1387 -1568 -727 37 572 1231 764 -150 -268 -1265 -840 238 1154 1698 1351 129
1111A29o94m48J4P83M94M68N31j340m82n74k92N64J217O87K69n92q55l11n04M57
$$ 129 -565 -1013 -999 -216 278 746 1277 -63 -545 -1119 -1411 -847 370 1057 1326 734 -121 -432 -936 -479
1131d79J118L16J65J3j112o67n48k57Q18R28K65Q46j402o65l66k42R99P37oR30
$$ -479 639 955 1120 1133 21 -646 -1194 -1451 -633 295 560 1406 4 -661 -1027 -1269 -270 467 461 1391
1151A391j11j184o81n35M58Q49L24O25k07j091p54j30n88P12R58O56N54n85j054
$$ 1391 1280 96 -585 -1120 -662 187 511 1136 929 -162 -916 -1046 -1634 -922 36 692 1246 661 -393
1170c93k44j48N76R64j56P92k80j544m14L0k34J164K87J43K84o29j044l24m17
$$ -393 -637 -785 -209 755 599 1391 1111 -433 -847 -817 -1051 113 400 543 827 198 -846 -1170 -1587
1189a587J195J163K54j3p06j97j46r01J15J288M03N26l75j459l93l62j8R42M15
$$ -1587 -392 771 1025 1012 306 109 -37 -938 -823 465 868 1394 1019 -440 -833 -1195 -1213 -271 144
1208A44O70J83j088n60l24k57R86J104k65M25K36r41p59q98O61J605k85n2Lq48
$$ 144 814 997 -91 -651 -975 -1232 -246 858 593 1018 1254 313 -446 -1344 -683 922 637 585 588 -260
1228b60k67l42n97Q75R02N91J11p66o01j71O2N39N40J21O77k6j905l55K70N94
$$ -260 -527 -869 -1466 -591 311 902 1013 247 -354 -525 -463 76 616 737 1414 1388 -517 -872 -602 -8
1248hj2j4O61J43n63j054k99j5J241J059l56k10l25k65k5o12Q8J241O90k32p07
$$ -8 -20 -34 627 770 207 -847 -1146 -1161 80 1139 783 573 248 -17 -42 -654 -566 675 1365 1133 426
1269D26j089J73J7k91N79M74J99L61j072m31J83k94P28N35O2K16r4q30l64k79
$$ 426 -663 -490 -473 -764 -185 289 488 849 -223 -654 -471 -765 -37 498 560 776 682 -148 -512 -791
1289g91N57P89j63k28J38o83n0l89l26P34J013j30J72n11o75L90o72Q08N27p4
$$ -791 -234 555 392 164 302 -381 -431 -820 -1146 -412 601 471 643 132 -543 -153 -825 -17 510 436
1309D36L74m9j086K80o45K60O74k18K61K37r69l99l5K03Q02L52l1L21m67m58k5
$$ 436 810 761 -325 -45 -690 -430 244 26 287 524 -445 -844 -879 -676 126 478 447 768 301 -157 -182
1330a82l41L55R45j76N0m40p29K55M2m55M85R1J98K88q65M8J47j71N04O68j36
$$ -182 -523 -168 777 601 651 211 -518 -263 -221 -676 -191 -100 98 386 -479 -431 -284 -455 49 717 581
1351E81l6j84p51K70j57K04M86k38r1J36o28P7q0j91M54L03K39n6l75k36K64k72
$$ 581 545 361 -390 -120 -277 -73 413 175 84 220 -408 -331 -411 -602 -148 155 394 338 -37 -273 -9 -281
1373b81M21K62k58J48jn12k2k74K01L68p1k36J92j70j83L64l15O08ROL00m43j38
$$ -281 140 402 144 292 291 -221 -243 -517 -316 52 -19 -255 -63 -233 -416 -52 -367 241 250 256 556 113 -25
1396b5J67k2J4J18p7k64L34n54l7K21k58L78%k12M51l01k61O2K13J44J31l22N83
$$ -25 142 120 134 252 175 -89 245 -309 -346 -125 -383 -5 -5 -217 234 -67 -328 -266 -53 91 222 -100 483
1419D83j98m59O42m38l6K86k32j08O6m07J54L0j68K74j7lL98m38J43L20l30P5
$$ 483 285 -174 468 30 -6 280 48 -60 6 -401 -247 -217 -385 -111 -128 -131 267 -171 -28 292 -38 37
1441C7M36l79L59k48l68M25k51k93R9k25K95o2J1j70L86o6K25l20j44P20k50N2
$$ 37 473 94 453 205 -163 262 11 -282 -183 -408 -113 -175 -164 -334 52 -14 211 -109 -253 467 217 269
1463B69p7r7K11j26k50j45M53m48O83m89l49J79j81j38L68l7m6M34l07P1J24J05
$$ 269 192 95 306 180 -70 -215 238 -210 473 -16 -365 -186 -367 -505 -137 -174 -220 214 -93 -22 102 207
1485B07j25K07R7N4j50l01j2l50K43K07n48O11l16m4J97l14k79N83K52j8J24l24
$$ 207 82 289 386 440 290 -11 -23 -373 -130 77 -471 140 -176 -220 -23 -337 -616 -33 219 201 325 1
1507AJ21l1M0l26J64J18L36k63n49J55q7N1L33k5j95L68l30K74l62n7L99K87j82
$$ 1 122 91 131 -195 -31 87 423 160 -389 -234 -321 -270 63 38 -157 211 -119 155 -207 -264 135 422 240
1530B40j90j1P2j08r5m7N17l3Q6o73k26L57k26J7R7J11M15q7l69O6RO4L86j71
$$ 240 50 39 111 3 -92 -139 378 345 431 -242 -468 -111 -337 -320 -223 -112 303 216 -153 -87 -78 -14 372 201
1554B01k31N39Qm81k35l97K26M27L2K47k02k32P1m87j8P05Q5J50p5m20J37nm64
$$ 201 -30 509 517 36 -199 -596 -370 57 89 336 134 -98 -27 -514 -532 173 258 408 333 -87 50 45 -419
1577d19M16P8K78J58n58l49r8J53n0M3J89M31p3m89K15n10L77N18j4p7K11j17
$$ -419 -3 75 353 511 -47 -396 -494 -341 -391 -348 -159 272 199 -290 -75 -585 -208 310 296 219 430 313
1599C13n67q1j15K95J81j20M35j1m41k79r6p7M50L04L2N8j71j86j45k80Q60J6
$$ 313 -254 -335 -450 -155 26 -94 341 330 -111 -390 -486 -563 -113 191 223 281 110 -76 -221 -501 359 375
1621C75r8L38n96k32j12j64j20N96K85J60m36k21J57m33M3P37MJ79P3n17J09j29
$$ 375 277 615 19 -213 -325 -489 -609 -13 272 432 -4 -225 -68 -501 -458 279 283 462 535 18 127 -2
1643bm45M00M19O1j14k41o83L83l30J93K56J95O0J47l74k49j72M88K79J88O3O0
$$ -2 -447 -47 372 433 319 78 -605 -222 -552 -359 -103 92 152 299 -75 -324 -496 -8 271 459 522 582
1665E82l00n07J00m45N26K27K48o7l12l47N8m18J58M97J16L8O5k43j76j34J72
$$ 582 282 -225 -125 -570 -44 183 431 364 52 -295 -237 -655 -497 0 116 154 219 -24 -200 -334 -162
1686a62L42J88J0n6l44j84J15m80N83K54j51J56l2p20M27p8j87N55M5P8j0j87
$$ -162 180 368 378 322 -22 -206 -91 -571 12 266 115 271 239 -481 -54 -132 -319 236 281 359 349 162
1708A62l78K4j12L46M62l33K83m78m08k4OJ27L11J24J26l01R6k96P8m9O66j41
$$ 162 -216 -192 -304 42 504 171 454 -24 -432 -456 -450 -323 -12 112 238 -63 33 -263 -185 -234 432 291
1730B91J80n9l81j82j14K54o2N33k59l1j93l19K55k07N4O02l42L07k46O5l06k11
$$ 291 471 412 31 -151 -265 -11 -73 460 201 170 -23 -342 -87 -294 -240 362 20 327 81 146 -160 -371
1752c71K22K16K40K23N3o36l94N25n76K97N01l37M71k51m18P5l8Q1M52R4K74l98
$$ -371 -149 67 307 530 583 -53 -447 78 -498 -201 300 -37 434 183 -235 -160 -198 -117 335 429 703 305
1774C05k13j68j91j0O53p8k39K18k40K2k80L0j0J80K09j0j98j71M6j60J34M92
$$ 305 92 -76 -267 -277 376 298 59 277 37 59 -221 -191 -201 -21 188 178 -20 -191 -145 -305 -171 321
1796C21J11p6J75o35j27K45j04R7O9j4J34j61l82P7j90K85L14J12K85m44j09p9
$$ 321 432 356 531 -104 -231 14 -90 7 76 62 196 35 -347 -270 -460 -175 139 251 536 92 -17 -96
1818i6N0K44j1j4J68Kn09j16M5J92P0L59m25J80k32j18J08l49L90K52j19P1P8
$$ -96 -46 198 187 173 341 343 -166 -282 -237 -45 25 384 -41 139 -93 -211 -103 -452 -62 190 71 142 220
1841B20l84M05l8l62M63N7l25J49l70L93m70J32K42R9r3K1k9O0j98J90l08J67
$$ 220 -164 241 203 -159 304 361 36 185 -185 208 -262 -130 112 211 118 139 110 170 -28 162 -146 21
1863B1J44j80j5j18J81k42J79R0L9l89M93j06k00O7j93J82J76N5p3M5j49j79N1
$$ 21 165 -15 -30 -148 33 -209 -30 60 99 -290 203 97 -103 -36 -229 -47 129 184 111 156 7 -172 -121
1886a21M03R9j69J97l17j51j74L21k17K37J23l65K31l13k27M07p2q1M41m76M39
$$ -121 282 381 212 409 92 -59 -233 88 -129 108 231 -134 97 -216 -443 -36 -108 -189 252 -224 215
1907B15m0j87J17K3j58K85O7j10J33n09O8O5j61L86l6m1o4K08m97K44J91l52L93
$$ 215 175 -12 105 128 -30 255 322 212 345 -164 -96 -31 -192 194 158 117 53 261 -236 8 199 -153 240
1930B40%j73J36k47J50j98l8K69n3K49n15L07j28j63K54l91J46n8J43L5j40K97
$$ 240 240 67 203 -44 106 -92 -130 139 86 335 -180 127 -1 -164 90 -301 -155 -213 -70 -35 -175 122
1952A22J9j41j5k09M0L18k41Q1q0MJ34N7k08R8J26k51j00M4J66L4oQ0J69J3k54
$$ 122 141 0 -15 -224 -184 134 -107 -26 -106 -102 32 89 -119 -21 105 -146 -246 -202 -36 -2 -8 72 241 254 0
1977@J63k89M02k45j40K07k25R6L49n58J18L2P3K55k40l56L40j07P3J46j70L03
$$ 0 163 -126 276 31 -109 98 -127 -31 318 -240 -122 -90 -17 238 -2 -358 -18 -125 -52 94 -76 227
1999B27j43j36j55L05j45j1j9M0O7j42m5J11K0K29k80k55L31J12J63o6qm91R40
$$ 227 84 -52 -207 98 -47 -58 -77 -37 30 -112 -157 -46 -26 203 -77 -332 -1 111 274 208 200 -291 649
2022F49n85k4J27m4j48J72m0j67j10K46P1J22l09j86K38m0K06M9l10K94j35J31
$$ 649 64 40 167 123 -25 147 107 -60 -170 76 147 269 -40 -226 12 -28 178 227 -83 211 76 207
2044B07o0m9l9j17o5P5K61j19m5k99p5L13q8K10k84J90o4M1K18k31J7J31j23R
$$ 207 147 98 59 -58 -123 -48 213 94 49 -250 -325 -12 -100 110 -174 16 -48 -7 211 -20 -3 128 5 14
2068A4K70r4k48k26K46Jj72j05N49l93O1k20L08j96K91n2o4J11o8k93K43p9J73
$$ 14 284 190 -58 -284 -38 -37 -209 -314 235 -158 -97 -317 -9 -205 86 34 -30 81 13 -280 -37 -116 57
2091E7k3j13K26q2l81J31L10K3j28j0k08K54K9k80K60j05n3K60l4m8Nl3J70j87
$$ 57 34 -79 147 65 -316 -185 125 148 20 10 -198 56 85 -195 65 -40 -93 167 133 85 90 57 227 40
2115D0M4K26j76k79J71l35o4N3R3K47p5Q1j8j96L8P8K29p7L98m18K76l35m77P34
$$ 40 84 310 134 -145 26 -309 -373 -320 -227 20 -55 26 8 -188 -150 -72 157 80 478 60 336 1 -476 258
2139B58j99j81L45l66M15n62J31L2p5m5L06q7p6K46j31O3O0j09l43M56pk5J12
$$ 258 59 -122 223 -143 272 -290 -159 -127 -202 -247 59 -28 -104 142 11 74 134 25 -318 138 131 106 218
2162B18p6m5O3l40L12k5q0L5l15K34Q7l13J49J22n5Q1j64o9MP6O1M7j50K78j30
$$ 218 142 97 160 -180 132 107 27 62 -253 -19 68 -245 -96 26 -29 52 -112 -181 -177 -101 -40 7 -143 135 5
2187Ej80J28R3l7O5J42rj10l16J91r1k10L21R8R3L4j08p6j55j2o2L70k6q6k33
$$ 5 -175 -47 46 9 74 216 207 97 -219 -28 -119 -329 -8 90 183 217 109 33 -122 -134 -196 174 148 62 -171
2212a71p2K8J58n9K31k94M01J83n34J36k32M31j03j11J07lj59j30mK2K82j33j35
$$ -171 -243 -215 -57 -116 115 -179 222 405 -129 7 -225 206 103 -8 99 96 -63 -193 -197 -175 107 -26 -161
2235a61Q0J62k95l1R5k7K13J57j06L67m21j25J08m8%K22Q6j29l01j16L4M9K51
$$ -161 -81 81 -214 -245 -150 -177 36 193 87 454 33 -92 16 -32 -32 190 276 147 -154 -270 -236 -187 64
2258F4%O2k36J73r9k45K25K46j6J52N7j75j70q6J16k91R4L15k10K78m31l0L0k36
$$ 64 64 126 -110 63 -36 -281 -56 190 174 326 383 208 38 -48 68 -223 -129 186 -24 254 -177 -207 -177 -413
2282d13N3L13O9j06J21o0R0j85K87k08O1K93m02J7k00J95j25K60n7n7L39k47k44
$$ -413 -360 -47 22 -84 37 -23 67 -118 169 -39 22 315 -87 -70 -270 -75 -200 60 3 -54 285 38 -206
2305b06jj38J33L48M8m2K53l41j24L2L6j58P71m50kj77Kp2j02K44k90M07k54L48
$$ -206 -207 -345 -212 136 184 142 395 54 -70 -38 -2 -160 611 161 159 -18 -16 -88 -190 54 -236 171 -83 265
2329B65k89k31K44n4J54K11j71j64K29k49J02k7J10J10k17k9K1j87J80j15j32
$$ 265 -24 -255 -11 -65 89 300 129 -35 194 -55 47 20 130 240 23 -6 15 -172 8 -107 -239
2350b39Q1L60k85Pk1J9J07k12R8K18k3J76k48k98K40m1M7Nj5J00k3k91K27k56
$$ -239 -158 202 -83 -76 -97 -78 29 -183 -85 133 110 286 38 -260 -20 -61 -14 -9 -24 76 53 -238 -11 -267
2374b67RK9L38l1j42K10l23r0J40O7K84j24j70k9R5n3O1M1J8k28J96R1l95L8M38
$$ -267 -258 -229 109 78 -64 146 -177 -267 -127 -60 224 100 -70 -99 -4 -57 4 45 63 -165 31 122 -273 -235 203
2399B03k24J94J40l55L61l07K25m86J3L99j35j40J39Nq4o3j98L50j47L97m21K19
$$ 203 -21 173 313 -42 319 12 237 -249 -236 163 28 -112 27 32 -52 -115 -313 37 -110 287 -134 85
2421H5Q4k86M94m40K69k07J48k4j5k27K8K9j31M97m10r7J30k4l9Q8j20L37N4j93
$$ 85 169 -117 377 -63 206 -1 147 123 108 -119 -91 -62 -193 304 -106 -203 -73 -97 -136 -48 -168 169 223 30
2445C0K60r6l18l4M55l62J97m8k36q0J09j80K64j52P8K91r0r0J87j64j33L31k91
$$ 30 290 194 -124 -158 297 -65 132 84 -152 -232 -123 -303 -39 -191 -113 178 88 -2 185 21 -112 219 -72
2468g2K69l65M92l71J37nj0j47K32j52J5r2o5J75n2j00J90m2j71m9J13J8L83m99
$$ -72 197 -168 324 -47 90 85 75 -72 160 8 23 -69 -134 41 -11 -111 79 37 -134 -183 -70 -52 331 -168
2492a68K16N1r4J02rk98J79N0l19K20J18j47L45k11l37K45o8L84P1l80J40J8j69
$$ -168 48 99 5 107 98 -200 -21 29 -290 -70 48 -99 246 35 -302 -57 -125 259 330 -50 90 108 -61
2515f1K10j73K02k00K6j50K64m28K40k54J09L55j66J32p8J56j47O9k36K94R1l22
$$ -61 149 -24 178 -22 4 -146 118 -310 -70 -324 -215 140 -26 106 28 184 37 106 -130 164 255 -67
2537f7K15k69J86K30k32j20l1N5J08j01mq0L2j70K22j36M08J21m85L26k58m2K90
$$ -67 148 -121 65 295 63 -57 -88 -33 75 -26 -30 -110 -78 -248 -26 -162 246 367 -118 208 -50 -92 198
2560A98k8m5J53m1k67qO1J27k01l9N0n3Q4K8j79k92L50M76l83P0j29K70j52Ll1
$$ 198 170 125 278 237 -30 -38 23 150 -51 -90 -40 -93 -9 19 -160 -452 -102 374 -9 61 -68 202 50 53 22
2585B2ol93M22P1Qp7j28r7K30r7r0K17j04K20l42J94o8J98r9j44K16j85J12q4
$$ 22 16 -377 45 116 124 47 -81 -178 52 -45 -135 82 -22 198 -144 50 -18 180 81 -63 153 -32 80 -4
2609dJ19k07J60j17j01N4k10K19N7J4P2j10J4J60j18m6K14q8K5r9p9L88j19n30
$$ -4 115 -92 68 -49 -150 -96 -306 -87 -30 -16 56 -54 -40 120 2 -44 170 82 107 8 -71 317 198 -332
2633c32K70q4J46q6j85L11j66J74o9K8r1r2L15j8k4j64o6n0L19k0k38Q7O4k56
$$ -332 -62 -146 0 -86 -271 40 -126 48 -21 7 -84 -176 139 121 97 -67 -133 -183 136 116 -122 -35 29 -227
2657b27J97K47l02l6J67m4K91l85J59l43J85K18k01o4J34N8Ok43P5RK9r7J15L6
$$ -227 -30 217 -85 -121 46 2 293 -92 67 -276 -91 127 -74 -138 -4 54 60 -183 -108 -99 -70 -167 -52 -16
2681a6J09k39L32m55R0J8K8M11m7m3j27J1O2m63N57j37j58J03J42j56k0k02K79
$$ -16 93 -146 186 -269 -179 -161 -133 278 231 188 61 72 134 -329 228 91 -67 36 178 22 2 -200 79
2704G9j62n5J56j72M01n40L61n7ON9j67K54L2k62K8J33k71L5L17l38L05j32j85
$$ 79 -83 -138 18 -154 247 -293 68 11 17 76 -91 163 195 -67 -39 94 -177 -142 175 -163 142 10 -175
2727a75J77J26K18l9m41R4o2r9J57K10r8O0J26l37J65j22j08L77k61m9K22m8n0
$$ -175 2 128 346 307 -134 -40 -102 -201 -44 166 68 128 254 -83 82 -40 -148 229 -32 -81 141 93 43
2750D3j41K6Q7l0P8m8j18J41N1j26k20L35j43J95L4r4Q2r8k06J93J9K02m38K00
$$ 43 -98 -72 15 -15 63 15 -103 38 89 -37 -257 78 -65 130 164 70 152 54 -152 41 60 262 -176 24
2774B4o7L19k36k08k7K06K10l35N34j88l50J45J76j53p1L11l79J63j11m90M50
$$ 24 -43 276 40 -168 -195 11 221 -114 420 232 -118 27 203 50 -21 290 -89 74 -37 -527 -77
2795g7J16J37Oj44P2K2k1K1l40j54M55qL18k74l03m1K46k34K07k58J07N1j7M3
$$ -77 39 176 182 38 110 132 111 132 -208 -362 93 85 403 129 -174 -215 31 -203 4 -254 -147 -96 -113 -70
2819g0j88J5L6J07J38j30K54p9j60J54k38k19N04l03J96M0j90J92j73j10K02L0
$$ -70 -258 -243 -207 -100 38 -92 162 83 -77 77 -161 -380 124 -179 17 57 -133 59 -114 -224 -22 8
2841HJ34j59O5j29K22k27J77p4p6L8J1K27k82J81k4k36j21K75j30N9O6k1J18l4
$$ 8 142 -17 48 -81 141 -86 91 17 -59 -21 -10 217 -65 116 92 -144 -265 10 -120 -61 5 -16 102 68
2865F8k07K80m52K71k21K36K2R6K4j95L6k87M8K84M7m3nn9n3J48j16M39k84k64
$$ 68 -139 141 -311 -40 -261 -25 -3 93 117 -78 -42 -329 -281 3 50 7 2 -57 -110 38 -78 361 77 -187
2889a87j46J97K94k49kK4K83k18j46K93l6J6l15K50m04L88O9L6j30k83M43p3J0
$$ -187 -333 -136 158 -91 -93 -69 214 -4 -150 143 107 123 -192 58 -346 42 111 147 17 -266 177 104 114
2912A14l3k04ML82k93J81k23k86L35r8N9l8M31q9o18K35L0L30j62j06p3J05J18
$$ 114 81 -123 -119 263 -30 151 -72 -358 -23 -121 -62 -100 331 242 -376 -141 -111 219 57 -49 -122 -17 101
2935A01L4k68J87q2J79k85n3J52L1l79N15kk57LK24p5L7j82J77o8m3K53j39O8
$$ 101 135 -133 54 -28 151 -134 -187 -35 -4 -383 132 130 -127 -124 100 25 62 -120 57 -11 -54 199 60 128
2959A28l1o9n1J11j02K91l50J20nj3j3l8m7J3N9J65r2N4k49M28k52l30M59j88
$$ 128 97 28 -23 88 -14 277 -73 47 42 29 16 -22 -69 -56 3 168 76 130 -119 309 57 -273 186 -2
2983bj75L77l08J54m3j29L17q0k54Q2n6K8J29l4j76j9%q9K38O2O8j49k47P2K78
$$ -2 -177 200 -108 46 3 -126 191 111 -143 -61 -117 -89 40 6 -170 -189 -189 -278 -40 22 90 -59 -306 -234 44
3008D4k76L95j49l71L49rj22k1M16k48M3k05K41k8l36P3K28J14l41K30N3q6m6
$$ 44 -232 163 14 -357 -8 -17 -139 -160 256 8 51 -154 87 59 -277 -204 24 138 -203 27 80 -6 -52
3031e2J23m0l4m8N1M8j49O4M7q9j24Q7J57m7j6J41p4K7P7O7k03J8k09K63j27j56
$$ -52 71 31 -3 -51 0 48 -101 -37 10 -79 -203 -116 41 -6 -22 119 45 72 149 216 13 31 -178 85 -42 -198
3057a98L59k13j39J55Ol1P9j5K08k88J31p0j28q8M9J50K68l46k09L14J31m04L24
$$ -198 161 -52 -191 -36 -30 -61 18 3 211 -77 54 -16 -144 -232 -183 -33 235 -111 -320 -6 125 -279 45
3080D5k95n8L17j18J35l23N1L94k58J04r1L7L2p7K01J42k42Q6J56k30j27j20K20
$$ 45 -250 -308 9 -109 26 -297 -246 148 -110 -6 -97 -60 -28 -105 96 238 -4 82 238 8 -119 -239 -19
3103a9L1J36q2J32k00o8N16l79k30O9J82Q0o2j04K0J1q4K02n44M29l36K73kM9
$$ -19 12 148 66 198 -2 -70 446 67 -163 -94 88 168 106 2 22 33 -51 151 -393 36 -300 -27 -29 20
3127B0Nq8J53j83M3j89K2L23J15j20n1K1Jj26M35o12J28K10m48J55L87l69J11
$$ 20 25 -63 90 -93 -50 -239 -217 106 221 101 50 71 72 -54 381 -231 -103 107 -341 -186 201 -168 -57
3150e7L91l62n3K16j17N6N6l46K11l45L14j54K96j34N4l7J34n3J6j05M7k1j19
$$ -57 334 -28 -81 135 18 74 130 -216 -5 -350 -36 -190 106 -28 26 -11 123 70 86 -19 28 7 -112
3173a12K74J8k54L74l52L2K76l4J7k31N8o1R0k43K12q8J63k03Pj00J20J96j03
$$ -112 162 180 -74 300 -52 -20 256 222 239 8 66 5 95 -148 64 -24 139 -64 -57 -157 -37 159 56
3196E6Q1l28L36j31J28N6j81j21P9l3J57k87P2oK85j8n1o6K3P8j63j51J39p0J88
$$ 56 137 -191 145 14 142 198 17 -104 -25 -58 99 -188 -116 -122 163 145 94 28 51 129 -34 -185 -46 -116 72
3221G2p7L9k45M63r0j73M63m16K44j67r2j4J9k18L35k95q2q2L90k47R9k02J09
$$ 72 -5 34 -211 252 162 -11 452 36 280 113 21 7 26 -192 143 -152 -234 -316 74 -173 -74 -276 -167
3244a67L39j72J09r4q0K67j33j95L48j55j13q2j10K57j57j5J53l07PM28j05l6
$$ -167 172 0 109 15 -65 202 69 -126 222 67 -46 -128 -238 19 -138 -153 0 -307 -300 128 23 -13
3266a3k31L8K37j52J40K2R9N2j60j24J5J22K58j90J24k53j39N2K66j07n7j90R9
$$ -13 -244 -206 31 -121 19 41 140 192 32 -92 -77 45 303 113 237 -16 -155 -103 163 56 -1 -191 -92
3289i2J27K7J16K42n31K91n4j3j62l1L40k06L03l59K9L3Q6j00j98K15k99L10k1
$$ -92 35 62 178 420 -111 180 126 113 -49 -80 260 54 357 -2 27 60 146 46 -152 63 -236 74 53
3312E3K72k17Ql53L3J46K49l35J74p3R7k07N8K81k63j00K50J0N1k76j28K37j20
$$ 53 325 108 116 -237 -204 -58 191 -144 30 -43 54 -153 -95 186 -77 -177 73 83 134 -142 -270 -33 -153
3335a53K24k64J47J30Q0r6K23l59j03L12k81N2J91j41K78l69k57N51m4j47j16
$$ -153 71 -193 -46 84 164 68 291 -68 -171 141 -140 -88 103 -38 240 -129 -386 165 121 -26 -142
3356a42K69k41L72k19r5J98j35P0J68k50N4j29J33j30O1P9L2j41P4j02J56l3j42
$$ -142 127 -114 258 39 -56 142 7 77 245 -5 49 -80 53 -77 -16 63 95 -46 28 -74 82 49 -93
3379i3J42K89l14j78K62L0k46K12j53J64l4j54J86j13Q9JO0k72K22l7j73J84k67
$$ -93 49 338 24 -154 108 138 -108 104 -49 115 81 -73 113 0 89 90 150 -122 100 63 -110 74 -193
3402a93K92Rj77J47j20L1O2j97J54J41K4l73K88k81R6lJ80q2K2O5l1M6l13Q0J56
$$ -193 99 108 -69 78 -42 -11 51 -146 8 149 173 -200 88 -193 -97 -100 80 -2 20 85 54 100 -213 -133 23
3427B3q0J5j2L26l31r5L54l07j6m0k4J81J61k38J2J25k63O02k16k57L04j79m1
$$ 23 -57 -42 -54 272 -59 -154 200 -107 -123 -163 -187 -6 155 -83 -71 54 -209 393 177 -80 224 45 4
3450Dj19K75q6j63n9K48M8r6j75J38l4o9j15L38j24j34j9JK55k3j88n2M0j89L34
$$ 4 -115 160 74 -89 -148 100 148 52 -123 15 -19 -88 -203 135 11 -123 -142 -141 114 91 -97 -149 -109 -298 36
3475C6j75L42k03j68j6L70l59K65j3R4k16J10N0N0j76l21L48j95L76n6J08l11
$$ 36 -139 203 0 -168 -184 186 -173 92 79 173 -43 67 117 167 -9 -330 18 -177 199 143 251 -60
3497f0j39Q3Jk2K61j60k5o3L65o20K60K58l12M34l03M9p0M55n03K57o77O20k69
$$ -60 -199 -116 -115 -137 124 -36 -61 -124 241 -379 -119 139 -173 261 -42 7 -63 392 -111 146 -531 89 -180
3520a80M39k47N4L15l92J23r6QM0k22Q1J71k76K39j98K02J58m97K15RR5k33K54
$$ -180 259 12 66 381 -11 112 16 24 64 -158 -77 94 -182 57 -141 61 219 -278 -63 -54 41 -192 62
3543F2j21n4K55J7l25K5Q5o1O4J54k68Q3k4J66r4L14k35j74L97j76J52k42N3k75
$$ 62 -59 -113 142 159 -166 -141 -56 -117 -53 101 -167 -84 -108 58 -36 278 43 -131 266 90 242 0 53 -222
3567b22M0N8K44J3m27L74K30l57J33k37J07r9K29j75j2j11L67K4J44l08K33j34
$$ -222 -182 -124 120 133 -294 80 310 -47 86 -151 -44 -143 86 -89 -101 -212 155 179 323 15 248 114
3589A14l53J93N1j85J62J27j61J38K4Q0o0J3k09m0K08qj17O9j42J10M6%M1J42
$$ 114 -239 -46 5 -180 -18 109 -52 86 110 190 130 143 -66 -106 102 94 -23 46 -96 14 60 60 101 243
3613B43l54q8J45N0J50m2l09M0k8J23L8q1J22N9l0J54k11K3M7J47j50j30J39L1
$$ 243 -111 -199 -54 -4 146 104 -205 -165 -193 -70 -32 -113 9 68 38 192 -19 4 51 198 48 -82 57 88
3637H8k30k9j71K55J76j23r6J28l6K08j97R5k33K17k96K08m8K28k68j9R4KK22
$$ 88 -142 -171 -342 -87 89 -34 -130 -2 -38 170 -27 68 -165 52 -244 -36 -84 144 -124 -143 -49 -47 175
3660A75q3nk81K65j33m5Q7L5J21J54m95J64K07n2q0j38J24J70n33J63n6K95k77
$$ 175 92 87 -194 71 -62 -107 -20 15 136 290 -205 -41 166 114 34 -104 20 190 -343 -180 -236 59 -218
3683b18p9J72J36K77k30j52J41o9j03J13j51p0K04K28m5k57J3L0k5O8o8N1j83
$$ -218 -297 -125 11 288 58 -94 47 -22 -125 -12 -163 -233 -29 199 154 -103 -90 -60 -85 -17 -85 -34 -217
3706b17J81K15M4l66J92j88K41j83K04K21k60j00P2J21r4QJ73k52l3N7o8J19k63
$$ -217 -36 179 223 -143 49 -139 102 -81 123 344 84 -16 56 177 83 91 264 12 -21 36 -32 87 -176
3729a76L20k89J23Q5K03l61O4K62l32J59m5j80J38k3m0j1MJ17j48M21l35j09p2
$$ -176 144 -145 -22 63 266 -95 -31 231 -101 58 13 -167 -29 -52 -92 -103 -99 18 -130 291 -44 -153 -225
3752b25N2K9N3N5Q5k19l5K22k26J7K15J87l30Q6L8j7K6j47P5L43k72j0j78J28
$$ -225 -173 -144 -91 -36 49 -170 -205 17 -209 -192 23 210 -120 -34 4 -13 13 -134 -59 284 12 2 -176 -48
3776d8L08m28K37K3l07L29q7k85L85r9R1l30K52j29k9P1L4k49L77k29J32M1k47
$$ -48 260 -168 69 92 -215 114 27 -258 127 28 119 -211 41 -88 -117 -46 -12 -261 116 -113 19 60 -187
3799a87K80k82O4M10l78L31l52K73k10j16N45n40O9r4K25m4j42Q8J38J9J46n8
$$ -187 93 -189 -125 285 -93 238 -114 159 -51 -167 378 -162 -93 -187 38 -6 -148 -60 78 97 243 185
3821A85k58k5L11j74J45l09J21n2P6K28j74PRn1P5k49K19j29pr4K4K21j72j9J86
$$ 185 -73 -98 213 39 184 -125 -4 -56 20 248 74 81 90 39 114 -135 84 -45 -52 -146 -122 99 -73 -92 94
3846I4n8r1O1o0j04J99K15l03q0o1q5K48J59k42N7J72j07J08k02K3J32J8o9N0
$$ 94 36 -55 6 -54 -158 41 256 -47 -127 -188 -273 -25 134 -108 -51 121 14 122 -80 -57 75 93 24 74
$$ [...]
8191b55
##END NTUPLES=NMR FID
##END=
