##TITLE=1H_Serkov 8-4-V
 CDCl3,8 sc, 
 4.03.2021
##JCAMPDX= 6.0         $$ Bruker NMR JCAMP-DX V2.0
##DATA TYPE= NMR FID
##DATA CLASS= NTUPLES
##ORIGIN= UXNMR, Bruker Analytische Messtechnik GmbH
##OWNER= root
$$ XWIN-NMR		Version 3.5
$$ Thu Mar  4 11:25:26 2021 Russian Standard Time (UT+4h)  she@DPX200
##.OBSERVE FREQUENCY= 200.1315066352
##.OBSERVE NUCLEUS= ^1H
##.DELAY= (6, 6)
##.ACQUISITION MODE= SIMULTANEOUS
##.ACQUISITION SCHEME= undefined
##.AVERAGES= 8
##.DIGITISER RES= 18
##SPECTROMETER/DATA SYSTEM= spect
##.PULSE SEQUENCE= zg30
##.SOLVENT NAME= CDCl3
##.SHIFT REFERENCE= (INTERNAL, CDCl3, 0, 15.7039)
##AUDIT TRAIL= $$ (NUMBER, WHEN, WHO, WHERE, WHAT)
$$ ##TITLE= Audit trail, XWIN-NMR		Version 3.5
$$ ##JCAMPDX= 5.01
$$ ##ORIGIN= Bruker BioSpin GmbH
$$ ##OWNER= she
$$ F:/spectra/data/she/nmr/H-F/1/audita.txt
$$ ##AUDIT TRAIL=  $$ (NUMBER, WHEN, WHO, WHERE, WHAT)
(   1,<2021-03-04 11:24:08.10 +0400>,<she>,<DPX200>,
      <created by zg, POWCHK disabled, PULCHK disabled
       configuration hash MD5:
       00 E9 B6 7A A2 85 ED C7 34 08 36 98 17 FE 4E 26
       data hash MD5: 16K
       5A 32 54 B0 DA 65 CE 5C AC 64 EA 91 D8 DE 77 A2>)
$$ ##END=
$$ 
$$ hash MD5
$$ D5 AC 1D BE 81 BB F3 20 4C 4E 78 B4 0F F6 62 A8
##$RELAX= 
##$RELAX= 
##$RELAX= 
##$RELAX= 
##$RELAX= 
##$RELAX= 
$$ Bruker specific parameters
$$ --------------------------
##$DU= <F:/spectra>
##$EXPNO= 1
##$NAME= <H-F>
##$PROCNO= 1
##$TYPE= <nmr>
##$USER= <she>
##$AMP= (0..31)
100 100 100 100 100 100 100 100 100 100 100 100 100 100 100 100 100 100 
100 100 100 100 100 100 100 100 100 100 100 100 100 100 
##$AQSEQ= 0
##$AQ_mod= 1
##$AUNM= <au_zg>
##$AUTOPOS= <>
##$BF1= 200.13
##$BF2= 200.13
##$BF3= 200.13
##$BF4= 200.13
##$BF5= 200.13
##$BF6= 200.13
##$BF7= 200.13
##$BF8= 200.13
##$BYTORDA= 1
##$CFDGTYP= 0
##$CFRGTYP= 5
##$CHEMSTR= <none>
##$CNST= (0..31)
1 1 145 1 1 1 1 1 1 1 1 1 1 1 1 1 1 1 1 1 1 1 1 1 1 1 1 1 1 1 1 1 
##$CPDPRG= <>
##$CPDPRG1= <>
##$CPDPRG2= <>
##$CPDPRG3= <>
##$CPDPRG4= <mlev>
##$CPDPRG5= <mlev>
##$CPDPRG6= <mlev>
##$CPDPRG7= <mlev>
##$CPDPRG8= <mlev>
##$CPDPRGB= <>
##$CPDPRGT= <>
##$D= (0..31)
0 1.2 0 0 0 0 0 0 0 0.06 0 0.03 0 0 0 0 0.0002 0 0 0 0 0 0 0 0 0 0 0 0 
0 0 0 
##$DATE= 1614842647
##$DBL= (0..7)
120 120 120 120 120 120 120 120 
##$DBP= (0..7)
150 150 150 150 150 150 150 150 
##$DBP07= 0
##$DBPNAM0= <>
##$DBPNAM1= <>
##$DBPNAM2= <>
##$DBPNAM3= <>
##$DBPNAM4= <>
##$DBPNAM5= <>
##$DBPNAM6= <>
##$DBPNAM7= <>
##$DBPOAL= (0..7)
0.5 0.5 0.5 0.5 0.5 0.5 0.5 0.5 
##$DBPOFFS= (0..7)
0 0 0 0 0 0 0 0 
##$DE= 6
##$DECBNUC= <off>
##$DECIM= 32
##$DECNUC= <off>
##$DECSTAT= 4
##$DIGMOD= 1
##$DIGTYP= 9
##$DL= (0..7)
0 120 120 120 120 120 120 120 
##$DP= (0..7)
150 150 150 150 150 150 150 150 
##$DP07= 0
##$DPNAME0= <>
##$DPNAME1= <>
##$DPNAME2= <>
##$DPNAME3= <>
##$DPNAME4= <>
##$DPNAME5= <>
##$DPNAME6= <>
##$DPNAME7= <>
##$DPOAL= (0..7)
0.5 0.5 0.5 0.5 0.5 0.5 0.5 0.5 
##$DPOFFS= (0..7)
0 0 0 0 0 0 0 0 
##$DQDMODE= 0
##$DR= 18
##$DS= 0
##$DSLIST= <SSSSSSSSSSSSSSS>
$$ [...]
##$SUBNAM2= <"">
##$SUBNAM3= <"">
##$SUBNAM4= <"">
##$SUBNAM5= <"">
##$SUBNAM6= <"">
##$SUBNAM7= <"">
##$SUBNAM8= <"">
##$SUBNAM9= <"">
##$SW= 16.9725356469052
##$SWIBOX= (0..15)
0 0 2 0 0 0 0 0 0 0 0 0 0 0 0 0 
##$SW_h= 3396.73913043478
##$TD= 16384
##$TD0= 1
##$TE= 0
##$TE2= 300
##$TE3= 300
##$TEG= 300
##$TL= (0..7)
0 120 120 120 120 120 120 120 
##$TP= (0..7)
150 150 150 150 150 150 150 150 
##$TP07= 0
##$TPNAME0= <>
##$TPNAME1= <>
##$TPNAME2= <>
##$TPNAME3= <>
##$TPNAME4= <>
##$TPNAME5= <>
##$TPNAME6= <>
##$TPNAME7= <>
##$TPOAL= (0..7)
0.5 0.5 0.5 0.5 0.5 0.5 0.5 0.5 
##$TPOFFS= (0..7)
0 0 0 0 0 0 0 0 
##$TUNHIN= 0
##$TUNHOUT= 0
##$TUNXOUT= 0
##$USERA1= <user>
##$USERA2= <user>
##$USERA3= <user>
##$USERA4= <user>
##$USERA5= <user>
##$V9= 5
##$VALIST= <valist>
##$VCLIST= <CCCCCCCCCCCCCCC>
##$VD= 0
##$VDLIST= <DDDDDDDDDDDDDDD>
##$VPLIST= <PPPPPPPPPPPPPPP>
##$VTLIST= <TTTTTTTTTTTTTTT>
##$WBST= 1024
##$WBSW= 4
##$XGAIN= (0..3)
0 0 0 0 
##$XL= 0
##$YL= 0
##$YMAX_a= 171989
##$YMIN_a= -56015
##$ZGOPTNS= <>
##$ZL1= 120
##$ZL2= 120
##$ZL3= 120
##$ZL4= 120
##$ABSF1= 10
##$ABSF2= 0
##$ABSG= 5
##$ABSL= 3
##$ALPHA= 0
##$AQORDER= 0
##$ASSFAC= 0
##$ASSFACI= 0
##$ASSFACX= 0
##$ASSWID= 0
##$AUNMP= <proc_1d>
##$AZFE= 0.1
##$AZFW= 0.1
##$BCFW= 1
##$BC_mod= 2
##$BYTORDP= 1
##$COROFFS= 0
##$CY= 11.3945322036743
##$DATMOD= 1
##$DC= 2
##$DFILT= <>
##$DTYPP= 0
##$F1P= 15.9154993809931
##$F2P= -4.1035820241983
##$FCOR= 0.5
##$FTSIZE= 0
##$FT_mod= 4
##$GAMMA= 1
##$GB= 0.15
##$INTBC= 1
##$INTSCL= 1
##$ISEN= 128
##$LB= 0.24
##$LEV0= 0
##$LPBIN= 0
##$MAXI= 10000
##$MC2= 0
##$MEAN= 0
##$ME_mod= 0
##$MI= 1.114404
##$NCOEF= 0
##$NC_proc= 0
##$NLEV= 6
##$NOISF1= 3.799351
##$NOISF2= 2.8
##$NSP= 1
##$NTH_PI= 0
##$NZP= 0
##$OFFSET= 15.70392
##$PC= 1
##$PHC0= -10761.96
##$PHC1= 10.80094
##$PH_mod= 1
##$PKNL= yes
##$PPARMOD= 0
##$PSCAL= 0
##$PSIGN= 0
##$REVERSE= no
##$SF= 200.130013532006
##$SI= 16384
##$SIGF1= 3
##$SIGF2= 2
##$SINO= 400
##$SIOLD= 16384
##$SREGLST= <1H.CDCl3>
##$SSB= 0
##$STSI= 0
##$STSR= 0
##$SW_p= 3612.71676300578
##$SYMM= 0
##$S_DEV= 0
##$TDeff= 0
##$TDoff= 0
##$TI= <>
##$TILT= no
##$TM1= 0
##$TM2= 0
##$TOPLEV= 0
##$USERP1= <user>
##$USERP2= <user>
##$USERP3= <user>
##$USERP4= <user>
##$USERP5= <user>
##$WDW= 1
##$XDIM= 8192
##$YMAX_p= 0
##$YMIN_p= 0
$$ End of Bruker specific parameters
$$ ---------------------------------
##NTUPLES= NMR FID
##VAR_NAME=  TIME,          FID/REAL,        FID/IMAG
##SYMBOL=    X,             R,               I
##VAR_TYPE=  INDEPENDENT,   DEPENDENT,       DEPENDENT
##VAR_FORM=  AFFN,          ASDF,            ASDF
##VAR_DIM=   8192,          8192,            8192
##UNITS=     SECONDS,       ARBITRARY UNITS, ARBITRARY UNITS
##FACTOR=    0.0002944,     1,               1
##FIRST=     0,             0,               0
##LAST=      2.4114304,     0,               0
##MIN=       0,             -56015,          0
##MAX=       2.4114304,     171989,          0
$$ Real data points
##PAGE= N=1
##DATA TABLE= (X++(R..R)), XYDATA
0@%%%%%%%%%%%%qJ6j6J6j6K4l2L2m0M8n6P0p8Q8j04J20j41J65j88K12k40K74l11
35a65L51l92M39m93N49o10O78p52Q33r20J017j125J238j363J503j656J823k008
53a053K216k449K710l007L349l746M216m779N465o328P450q975J1172j4616K0801
68A2426l5221J28085O6699k28004J07107K2244m1679M5192o5194l2187J04402
79H3870m4790l4456K9375j7248J4612K0109m4037r968K1402J6015m509j9082j3844
92b551K1030K3095l0304l5574M7090r31m2763M1395j6060n1459O2275R37n9112
105d2932M0292K988l5280L8497m074l4000J9627K0773k077j1850j8549J7185L1321
118B1921j5360k5091P387K4175O369k3046j9833K4312K7201k7272j5356J9009
$$ plain form
0 0 0 0 0 0 0 0 0 0 0 0 0 0 -8 8 -8 8 -8 16 -16 16 -24 24 -32 38 -40 48 -56 64 -77 88 -100 112 -128 146 -165
35 -165 186 -206 233 -260 289 -321 357 -395 438 -482 535 -590 648 -715 788 -868 955 -1053
53 -1053 1163 -1286 1424 -1583 1766 -1980 2236 -2543 2922 -3406 4044 -4931 6241 -8375 12426
68 12426 -22795 105290 171989 -56015 51092 73336 31657 76849 11655 -20532 83870
79 83870 39080 4624 33999 16751 31363 51472 7435 -2533 18869 34884 30375 11293 -2551
92 -2551 18479 41574 11270 -24304 22786 21855 -20908 20487 4427 -47032 15243 16180 -42932
105 -42932 -2640 348 -34932 3565 -509 -34509 -14882 5891 3814 -8036 -26585 -9400 21921
118 21921 6561 -18530 -11143 13032 19401 -3645 -23478 834 28035 763 -14593 4416
130D416n699j965K3379k0884k7972M1880K0810m5703j2268L4230O944j1000o731
143e63j3203J6800K1544l0483j7266L3000M10j9133O128p322k849J3041l014o475
157i385m618M19J7611j1028k1863K6673N076k1999J6069k58k2811K4032Q546l0689
171b4225J4618J4808k2983M772J2712j5231M70J5243o429n383L232j80K342P163
185I29k404q531Q790J1140p991j3855J0739J9385j3816j6118J7060L888j8368
198i152J0650K637j7210J4303M485k2582O289J2112j2586M666N293j1514O031
211f578R542q163o258J2939Q942j0802o500J3441L652j1203N852M708o436M042
225G178L782j3433N89J7485q433j3561J1332L827j1252M706L949j0173R244P516
$$ plain form
130 4416 -1283 -3248 20131 -753 -28725 13155 33965 -11738 -24006 10224 17168 6168 -563
143 -563 -13766 3034 24578 -5905 -23171 9829 10239 -8894 -2766 -10088 -12937 104 -2910 -9385
157 -9385 -14003 -13584 4027 -7001 -28864 -2191 2885 -19114 -3045 -3303 -26114 -2082 6464 -24225
171 -24225 -9607 5201 -17782 -13010 -298 -15529 -15059 184 -6245 -11628 -8396 -8576 -6234 929
185 929 -1475 -10006 -1216 9924 1933 -11922 -1183 18202 4386 -11732 5328 9216 -9152
198 -9152 1498 4135 -13075 1228 5713 -16869 -10580 1532 -11054 -6388 -1095 -12609 -6578
211 -6578 2964 -5199 -11457 1482 10424 -378 -6878 6563 10215 -988 4864 9572 3136 7178
225 7178 10960 -2473 -1884 15601 7168 -6393 4939 8766 -2486 2220 6169 -4004 5240 12756
239A2756j5338k036J4453k338p187N696n93l446M436J129r919K85J2944l535j3616
254f309M422O668q492K490M771r921L97J2576p442j2433J2049O383q504K824J310
269G89r537Q157R605j4226k990J3548j688q216J607j76j485P539J500j1935k655
284a0163J4685J352j4123L034Q896q68L25q32r186O639J6341r408j4229J0411
298B874R945r917j570J818m307Q125N323j5911o663J5837K860j0552j288L383
312d3l26L240M65j0645J752J5191j882j3815K029Q011k171N04m29p719L561J1667
328I390q658j4690J0567R005p148l219N20m027O288O864j0972m992J2598M976
342F502j0169k336M480J033N555J392j1578j313J5363j206j3631J666R364q49
$$ plain form
239 12756 -2582 -4618 9835 7497 310 6006 5413 1967 6403 7532 -2387 -2102 10842 7307 -6309
254 -6309 -1887 4781 -3711 -1221 3550 -6371 -5974 6602 -840 -13273 -1224 5159 -3345 -521 789
269 789 -8748 -591 9014 -5212 -8202 5346 3658 -4558 -2951 -3127 -4612 2927 4427 -7508 -10163
284 -10163 4522 5874 -8249 -5215 3681 2813 3138 2306 -6880 -241 16100 6692 -7537 2874
298 2874 12819 2902 1332 3150 -1157 6968 12291 -3620 -10283 5554 8414 -2138 -3426 -43
312 -43 -369 2871 3336 -7309 -5557 9634 7752 -6063 -4034 3977 1806 2310 1881 -5838 -2277 9390
328 9390 732 -13958 -3391 5614 -1534 -4753 -4233 -8260 -1972 4892 -6080 -11072 1526 6502
342 6502 -3667 -6003 -1523 -490 5065 6457 -5121 -6434 8929 7723 -5908 -4242 5122 4273
356D273k938j838o168M337J1780p031j2198R184P794p625j237J587j580N762M949
371I051r818o444J1562N760q753k871M446o54K051R19j0046J083J2686k157j2846
386f031J647P986k009k383J517m031K00R904n767j1029Q415P298o200k037J381
401a139l569L225N114p047n665R337M585j0357j253N427q57K558K427p043j112
416e369J0340l68q584K734P633k632k772K441n048O65Q604m493r228N638M093
431C654o374k193K559j185l28M828n646o512R128L960p680J220O252k469J17K606
447A937k480J6O783J108q458K631O647o213j004N685m192k648N757l289n618M425
463A087L473m882j164M779l991j722O543k100m494O747J595o493J823L373j628
$$ plain form
356 4273 1335 -503 -6671 -2334 9446 2415 -9783 -599 7195 -430 -1667 -80 -1660 4102 9051
371 9051 -767 -7211 4351 10111 1358 -1513 2933 2279 4330 5249 -4797 -3714 8972 6815 -6031
386 -6031 -4384 3602 1593 -790 727 -3304 -3104 6800 1033 -9996 -1581 5717 -483 -2520 -1139
401 -1139 -4708 -1483 3631 -3416 -9081 256 4841 -5516 -6769 -1342 -2199 359 2786 -4257 -5369
416 -5369 4971 4603 -3981 -1247 6386 3754 982 3423 -1625 -960 7644 3151 -6077 -439 3654
431 3654 -2720 -4913 -2354 -3539 -3867 961 -4685 -11197 -2069 1891 -5789 -4569 1683 -786 -669 1937
447 1937 -543 -527 6256 7364 -1094 1537 8184 1971 967 6652 2460 -188 5569 2280 -3338 1087
463 1087 4560 -322 -1486 3293 -698 -2420 4123 2023 -2471 4276 5871 -622 1201 4574 2946
478B946j226K879j165m297L583J81p163L524M853p715j762M608k998k882L706
493b928N58m649L338L387o665K22Q432l492l220N806j539k436M180Q2l252K071
509a05M464m272l881N013M30l873M104m04n384N518K178o398k36P397R5n211K247
526A682K341k856L509L015o709J393O924m445l903K512J642j584J074j932n356
541b693K804N107o763m826P045O3n404K54kj299K876K234n786k296P041l50o572
558h567M209K695m623M223J028o146J521O608r15m055Q77K398J48R77o51l676
574c949N014N842p000m163N837L001k905o69R53j274J708L101n795l513R822O48
590F658p295J114J729r56K522j86m974K112N577l098n942K950L598k269R43j157
$$ plain form
478 2946 1720 4599 3434 -863 2720 2901 -4262 -738 4115 -3600 -5362 -754 -3752 -6634 -2928
493 -2928 -2370 -7019 -3681 -294 -6959 -6737 1695 -1797 -5017 789 -750 -3186 994 1076 -2176 -105
509 -105 4359 87 -3794 1219 1649 -2224 1880 1476 -3908 1610 3788 -2610 -2846 4551 4646 -565 1682
526 1682 4023 1167 4676 7691 982 2375 9299 4854 951 3463 5105 3521 4595 2663 -2693
541 -2693 111 5218 -1545 -6371 674 737 -4667 -4413 -4415 -5714 -2838 -604 -6390 -8686 -1645 -1995 -8567
558 -8567 -4358 -1663 -6286 -2063 -1035 -7181 -5660 948 33 -4022 -3145 -747 -599 378 -273 -3949
574 -3949 1065 6907 -93 -4256 1581 4582 1677 1008 1961 687 2395 5496 -299 -3812 6010 6658
590 6658 -637 477 2206 1250 3772 3586 -1388 724 6301 3203 -2739 211 3809 1540 2483 1326
606A326m576L216M187n160l996M961K380m206j720J243j588K529L688o166k918
621f800P124J228n797J106L142o32J341K81m467N29P322j854n611K834K149j549
637C46M53l65l221K896M592m456n581N155L377m284L08J380j845J715K533m018
653a015k436N847K035m923q42K225j348J865J485n583P23O231k854n977K873L250
669A556j634j88r1j832L67M506k464l808M568J874l535k17K342k151J503L081
685C877k959l533L849J955m356J216J703j732R77J324m102l80N478j452l702J954
701A17K172k942K89K153k442M90L309j989l457K575J701k513N43J506k439q63
717a790L274k233k612M275M54l512Q18J766k624R85K783k318j115L134m40l311
$$ plain form
606 1326 -3250 -34 4153 -1007 -5003 -42 2338 -1868 -3588 -2345 -3933 -1404 2284 -3882 -6800
621 -6800 324 1552 -4245 -3139 3 -629 712 993 -3474 -2945 4377 2523 -3088 -254 1895 346
637 346 799 434 -2787 109 4701 245 -5336 -181 3196 -1088 -780 600 -1245 470 3003 -1015
653 -1015 -3451 2396 4431 -492 -1334 891 -457 1408 2893 -2690 -1967 4264 1410 -4567 -1694 1556
669 1556 -78 -266 -357 -2189 -1822 2684 220 -3588 980 2854 -681 -898 1444 -707 796 3877
685 3877 918 -2615 1234 3189 -1167 49 1752 20 997 2321 -1781 -2161 3317 1865 -1837 117
701 117 2289 -653 -364 1789 -653 -163 3146 1157 -2300 275 1976 -537 6 1512 -927 -1790
717 -1790 1484 -749 -3361 914 1368 -2144 -1326 440 -2184 -1199 1584 -734 -1849 1285 845 -2466
733b466K367K225k624N07K079k229j768L285p26j994K297Q16l237M90K634k514
749h58k19L066q07k162K124L37k659K284K122k768r98L361j215k225K531k49j830
766a65J823L00l610L01L685j826k198J870M62k793J525P92k792J360K979k574
782h61k617L351l5j552K062J37k740J568K157l516n77L600j63k080O65j19j374
799b094K607O08l168P02L230j429l018K329R68r09J084J55k987J292L108k500
815b2j910K760Q54j887Q00k52k009K351K704l261k212L862k6k010Q90K06o06K157
833B389J2m010M27L871m52l418J484Q24k017J456R8k838J129L558k574k870K052
850h79J133q37O42r8j861J937K113l651r63L808P67k473K25k9p08J488Q12k667
$$ plain form
733 -2466 -99 2126 -498 9 2088 -141 -1909 1376 650 -1344 953 1769 -1468 -978 1656 -858
749 -858 -1077 1989 1182 -980 1144 1481 -1178 1106 3228 460 -538 2823 1608 -617 1914 1665 -165
766 -165 1658 1958 -1652 -1351 2334 508 -1690 180 642 -2151 -626 166 -2626 -1266 1713 -861
782 -861 -3478 -127 -162 -1714 348 485 -2255 -687 1470 -2046 -2623 977 814 -1266 -601 -720 -2094
799 -2094 513 1121 -2047 -1345 1885 456 -2562 -233 735 -174 910 1065 -1922 -630 2478 -22
815 -22 -1932 828 1682 -205 595 343 -1666 685 3389 128 -2084 1778 1752 -258 632 838 232 2389
833 2389 2401 -1609 -1182 2689 2237 -1181 303 1127 -890 566 664 -2174 -1045 2513 -61 -2931 -879
850 -879 254 -583 59 -39 -1900 37 2150 -1501 -2464 1344 2111 -362 -137 -166 -874 614 1426 -1241
868a241n18L526q02l227J011J148p17J210K07l216O76L547j172k877K283J800
884A638k031P32o13j557K122K335l059j731K866J05j723L45O32j012J438R85l416
901a944m5L263K1k010P30P28o42P99M21j333k69L429r71l229J745J306j360Q09
919A448L1k083J021J597k347j715K581N74k500O95N42k198J426J449k072m41J914
936g8k85j134M57R63j014P80J585l008o11L151o64k184J747K47j467N49J38j289
954b117K86K454j409j812K275k43j321J441J212j597P73J282r52o16J489J284
970B429j657J036O33k005O83K022j663o84K184q94j370L67M11j494J037J539k536
987C8o90J744r68j061J836o20j298J226j08j270k44J911l04j421J060j53j394
$$ plain form
868 -1241 -1759 1767 965 -2262 -1251 -103 -820 390 597 -2619 -1943 1604 432 -2445 -162 1638
884 1638 -393 339 -274 -1831 291 2626 -433 -2164 702 807 -916 -571 61 -951 487 1472 -1944
901 -1944 -1989 1274 1295 -715 15 743 101 900 1321 -12 -281 3148 2177 -1052 693 1999 639 1448
919 1448 1479 -604 417 2014 -333 -2048 533 1107 -1393 -698 -156 -2354 -928 521 -1551 -1992 -78
936 -78 -363 -1497 -1040 -77 -1091 -311 1274 -1734 -2345 806 142 -2042 -295 -48 -1515 -966 -828 -2117
954 -2117 -1831 623 -786 -2598 -323 -566 -1887 -446 766 -831 -58 1224 272 -344 1145 2429
970 2429 772 1808 2441 436 1119 3141 1478 794 2978 2084 714 1081 1492 -2 1035 2574 38
987 38 -652 1092 124 -937 899 279 -1019 207 99 -1171 -1415 496 192 -1229 -169 -322 -1716
1004a716J222P90j990M95J840j054j340Q30M90p92J313J71k422J279J779k083
1020a188o34K433m64j71R1j062r4J392J374j727r49K422k89j659J256J02q70J495
1038A458O9j753l65K338m44j595J193k33r25J653n48k402J855K320k177j309M47
1055d18J070j13j61n24q37J681Q40k446r71K724K10j188l20p3j36R72N09k202
1073a383k02K631m34k356R22L87j03J610r91j953J248J747r37j522J027R06K8
1090F25j64r98r34K180J392k544n71J306Q14j404j04J15J08P78O31k398p82L236
1108A286n11j822Q02J66j94J021p00j862J420K192j202j886J341P06o16R68q79
1125B30r29J205R16j457j203J256J130n56o15p7p74J459Q41k109j39K039N9j793
$$ plain form
1004 -1716 -494 296 -1694 -1199 641 -413 -1753 -923 -433 -1225 88 259 -2163 -884 895 -1188
1020 -1188 -1822 611 147 -24 67 -995 -1089 303 1677 -50 -999 1423 1134 -525 731 833 -37 1458
1038 1458 1527 -226 -591 1747 1303 -292 901 668 -257 1396 848 -1554 301 2621 444 -865 -418
1055 -418 652 539 378 -146 -983 698 1538 -908 -1879 845 1055 -133 -453 -526 -662 310 819 -1383
1073 -1383 -1585 1046 612 -1744 -822 -435 -538 1072 81 -1872 -624 1123 186 -1336 -309 597 625
1090 625 461 -537 -1471 709 2101 -443 -1014 292 1106 -298 -402 -287 -179 599 1230 -1168 -1950 1286
1108 1286 775 -1047 -245 -79 -273 748 48 -1814 -394 1798 596 -1290 51 757 141 1109 230
1125 230 -699 506 1422 -35 -1238 18 1148 592 -23 -100 -874 585 1426 -683 -822 1217 1276 -517
1143e17j36J108j91Q56n24j685N53K049j414j260J196L64m77K91l95r92J111J096
1161A033n79j606R46P91j082K78J08n40R48N84j820n06J865N3j160M39L08p45
1179f85M76N22j553P29J592r93j112P46J22l31N76J76p07N42Q37q76q70J355J31
1198F77l65r5L37p65K34R48q44m23J323r5j530R70N19j134O92M85j053l78J254
1217G57n41l86Q31j52q69O07M03j119Q0Q68l15n44N76m08n47M96M12l88l74Q51
1237B38p13l96P07R3r09J159K05j480M01Q83k53l07L27j64r9O32m12p42N23J161
1257H54p22p33N52j16j67N10Qq26O78P86j263n86J091L17k24K38l20o52J233L32
1277I90j246j74J586l18j064K96N0L54Q88l53j407M96J465j043o27N61K99j26
$$ plain form
1143 -517 -653 455 264 1120 596 -1089 -536 1513 99 -1161 35 399 -78 213 -182 -1174 -63 1033
1161 1033 454 -1152 -206 585 -497 -219 -111 -651 297 881 -939 -1445 420 473 -687 -248 60 -685
1179 -685 -209 313 -1240 -511 1081 88 -1024 -278 -156 -487 89 265 -442 100 937 61 -809 546 677
1198 677 312 217 554 -211 23 971 127 -296 1027 932 -598 372 891 -243 449 934 -119 -497 757
1217 757 216 -170 661 509 -360 247 650 -469 -389 479 164 -380 196 -212 -759 -263 149 -239 -613 238
1237 238 -475 -871 -164 -71 -980 179 384 -1096 -695 188 -65 -372 -45 -209 -308 324 -88 -830 -307 854
1257 854 132 -601 -49 -165 -332 178 186 -640 38 824 -439 -1025 66 383 159 397 77 -575 658 990
1277 990 -256 -430 1156 838 -226 70 120 474 1362 1009 -398 98 1563 520 -107 454 753 627
1295F27M16j099r24J021J276j381j156J124J75j20l70n07K21J371O5j836o7J769
1313F05kq49O2M2k2R59o54j003N39J332j51j412J16J32L20N21p30q90J003J077
1333I95j275j084P77R07j85l47q81L2J419O74j590k01J967j87j040j62K2M64P94
1352A099l21j236L52J343m91j091N96L77J91J32j023o00R16J101r38j196P45Q70
1370H26m66l43m22q3J269L28j913k41J133N53o85m22J25k13Q67m16j055O2J603
1389E07k49j161l03J36O22N35m92q03O21J242r27j143J032O52l43M2n51j07P64
1408G4L92p86j55O47N87p20l39L8k7R48J65j522J77J198j49o30r6P15K11Q2o54
1429A56m46N13J149j009p26R11M61o56j3m1J69O7N6o24l87M83M28o83L99k16o11
$$ plain form
1295 627 1043 -56 -980 41 1317 -64 -1220 -96 79 -41 -411 -918 -697 674 739 -1097 -1164 605
1313 605 603 -246 -184 -142 -164 795 141 -862 -323 1009 858 -554 -438 -306 14 535 -195 -1085 -82 995
1333 995 -280 -1364 -587 320 135 -212 -1093 -1061 358 1032 -558 -759 1208 1021 -19 -181 -159 305 1099
1352 1099 778 -458 -106 1237 746 -345 251 628 819 951 -72 -672 244 1345 407 -789 -44 826
1370 826 360 17 -405 -488 781 1109 -804 -1045 88 641 -44 -466 -341 -554 313 -103 -1158 -1096 507
1389 507 258 -903 -1206 -1070 -448 87 -405 -1208 -587 655 -272 -1415 -383 269 -74 -32 -583 -690 74
1408 74 466 -320 -475 172 759 39 -300 -262 -289 659 824 -698 -521 677 528 -102 -198 517 728 810 156
1429 156 -290 223 1372 363 -363 548 1009 353 340 299 468 535 591 -33 -420 63 491 -192 207 -9 -620
1450f20L73K38p51m3Q00j83j44l13K71N9QM81o34K46O53o74p25Q52M1o5J03j77
1472b04J02l95P09l56k62Q68m12p31O72L19m41L0J43M8j9L2p2k72O64J20n56Q3
1494G0N44n23RM13j74K04k5j40k48J00N54l75k44L58l94kK14m09q4P81j91k86
1516A52o77N64j7J39R1l93k05O33k9r31L77M36L94l94p79K68L86K97k43r41P92
1537h0P39r83l21L60J15L50Q5p45k25O07M62n77o20Q30L86m45K02r63L55J149
1557F81m69n36l22Q85M53q89k77L66L19O99q10j095R35R40n74k69l10M58L71l19
1577B37m70j46Q97O63j094q94R77K33K98m93l23J72N59j85j047K80Q09O04j049
1596B8j77k60L86P13p45q27N39Q39m14r33j6Q11L67k01p24o38J248N22r36m95
$$ plain form
1450 -620 -247 -9 -760 -803 -3 -186 -330 -643 -372 -313 -305 176 -458 -212 441 -233 -958 -106 -65 -130 -27 -204
1472 -204 -102 -497 212 -144 -406 462 50 -681 -9 310 -131 -101 42 90 71 103 31 -241 423 543 -13 70
1494 70 614 91 100 513 339 543 518 378 130 230 784 409 165 523 129 127 341 -68 -152 629 438 152
1516 152 -525 39 22 161 252 -141 -346 287 258 -673 -296 140 534 140 -639 -371 15 312 69 -872 -80
1537 -80 659 -324 -645 -285 -170 180 265 -480 -705 -98 364 -213 -833 -3 383 -62 140 -823 -468 681
1557 681 212 -324 -646 239 692 -197 -474 -108 211 910 100 -995 -60 880 306 37 -273 185 556 237
1577 237 -233 -379 518 1181 87 -807 170 403 701 208 -115 57 616 431 -616 -336 473 1077 28
1596 28 -149 -409 -23 690 -55 -882 -343 496 82 -851 -867 -56 311 110 -614 -1252 -4 518 -418 -913
1616i13N27P85K0j035l24Q36P02m1j309J29R04n7m02j65Q6N59M33q03n76M36R23
1637G15l95n88m3P23k77J84n50k96R36M13o93r03N53R93j34n71n0J7N11J28q97
1658b24J22J098k8p97j89J09L85K06m77m67L66O89m35q19K34L23L20j40n81m03
1678g08M27N00l25p17L30O03l91j36l23K71N60Q9p47J63O45j20q18L12K51J6J59
1699D1j47o10L58N38lp17J98L66L8j44P4n41Q66J86q65m8J61L72j48j39J15o0
1721a09O0J64k66K66J98Q9m90L50l01K91L6O4j30j55L74N1n06J13L83p2k59j5
1743A36k11L03O5k67k02M34j27l96J96J64m4k70L94k65J76r9j12l20L45K20l97
1764b77K31k15K46j61J80k37j14L01R9k77j99N38K77m68o3J04l24O42l25j1oM04
$$ plain form
1616 -913 -386 399 419 -616 -940 -104 598 557 -752 -623 281 224 -178 -343 -257 302 735 -68 -644 -208 715
1637 715 320 -268 -311 412 135 319 -231 -527 409 822 129 -774 -221 772 638 67 17 34 545 673 -224
1658 -224 -102 996 968 171 -18 91 476 682 205 -262 104 793 358 -461 -227 96 416 276 -305 -708
1678 -708 -281 219 -106 -823 -493 110 -281 -417 -740 -469 91 180 -567 -404 241 121 -697 -385 -134 -118 41
1699 41 -106 -716 -358 180 177 -540 -342 24 62 -82 -8 -549 317 503 -362 -410 -249 123 -25 -164 -49 -109
1721 -109 -49 115 -151 115 313 402 -88 262 -39 252 288 352 222 67 441 492 -14 99 482 410 151 136
1743 136 -75 228 293 26 -176 258 131 -265 -69 95 51 -219 175 -90 86 -13 -125 -445 -100 120 -277
1764 -277 -46 -261 -15 -176 4 -233 -347 -46 53 -224 -423 115 392 -76 -139 -35 -359 283 -42 -53 -59 345
1786C45k50o6l51L41J34R0k79k25M19L49m40l55N54o7r4j11j92L00L29m6l09J10
1808A86L46P2l01m94N97P9J74j33o63K43M53j30m87K55j30M28l13n35j20P38R
1829B74n73Kj5L01j14k56j24P9Q37n53n16J14L60L91k05l64O0L76m5k56n41N82
1851a86M31l9n81k44N72k4K46l96l6K61Q6l23l86M07M95r9n09l68N12N67j4m34
1873f2P3M51M06r43k05L64K77N50j041j84K87O62l17n70j48N51P2l17j21m49P42
1894G8O96p19m56K54O41l17m40m66O93L98j57p35l60J167K64n85l75J36L98k4
1914I1On80K19O18l1r23j1O22M6J41p55p6O00M11m65m74N02O72k68m08k89L08
1936d4L16J64p91M30L7J77l93KJ58M66k49r2k69j99O99n4l55Q1L2K61j41l54J44
$$ plain form
1786 345 95 29 -322 19 153 243 -36 -261 158 507 67 -288 266 199 105 -6 -198 102 431 385 76 186
1808 186 532 604 303 -191 406 485 659 526 -137 106 559 429 -58 197 67 495 182 -353 -473 265 274
1829 274 -299 -297 -312 -11 -125 -381 -505 -426 411 -142 -658 -544 -184 207 2 -362 -302 74 29 -227 -768 -186
1851 -186 245 206 -375 -619 -47 -71 175 -221 -257 4 90 -233 -619 -212 283 184 -325 -693 -181 386 372 -62
1873 -62 11 462 868 -75 -280 84 361 911 -130 -314 -27 635 318 -252 -400 151 223 -94 -215 -664 78
1894 78 774 55 -401 -147 494 177 -263 -729 -36 362 205 -530 -890 277 541 -44 -419 -283 115 91
1914 91 97 -483 -264 354 323 -600 -611 11 57 198 -557 -633 -33 378 -87 -561 -59 613 345 -63 -352 -44
1936 -44 272 436 -355 75 112 289 -104 -102 56 522 273 181 -88 -287 412 358 3 84 116 377 236 -118 26
1959B6K65J7k05k85Q4N28k12l44N3j7M63k32l84K03J04M01l74m32K74J63j34P6
1981C8k67J61L09m58O2n8k26N24j54j53R1o0N7k82L6K94K89k04l10J79K5J93j71
2004h5K26k77p5N7j03J90l3J8J76J31l94K62R2k79M32m43M39k80p8J23R8m8q3
2027F6M2r6K00o1j72K39P4J7k85q6K17j59K02j82o1L02q0k68J13J29J70r8m58
2050b35K54p2n1J73j23q1P9P6l7O9m12K29J88k46j38n8K96q9m5p9J10Q9o3n76
2074g42L57P25l24p3k69K07K20j67j12K03O5J78R2p98K41K86J02K0l90K62J11
2095A94M6k57r1n5P17l67m01J25R3L76k39l11M5P5K12j24m49R1N09J7l91j50J92
2118a43J84n2l18R6M77L10n71m13M76m0M83m28l25M85K9O5m76l66O06n9p6k95
$$ plain form
1959 26 291 308 103 -182 -98 430 218 -126 -73 -90 373 141 -243 -40 64 465 91 -341 -67 96 -38 38
1981 38 -229 -68 241 -217 -155 -213 -439 85 -69 -222 -131 -191 -134 -416 -380 -86 203 -1 -311 -132 -107 86 -85
2004 -85 141 -136 -211 -154 -257 -67 -100 -82 94 225 -169 93 185 -94 338 -105 334 54 -24 99 197 149 66
2027 66 108 12 212 151 -21 218 292 309 24 -62 155 -4 198 16 -45 257 177 -91 22 151 321 223 -235
2050 -235 19 -53 -104 69 -54 -135 -56 20 -17 52 -360 -131 57 -189 -327 -385 -89 -178 -223 -302 -192 -103 -166 -742
2074 -742 -385 340 16 -57 -326 -119 101 -66 -178 25 90 268 360 -438 -197 89 191 211 -179 83 194
2095 194 240 -17 -108 -163 554 187 -214 -89 4 380 141 -170 -125 -50 162 38 -411 -320 189 206 -185 -335 -143
2118 -143 41 -11 -329 -233 244 554 -17 -430 46 6 489 61 -264 221 250 315 -161 -527 79 20 -56 -351
2140c51k1K31J57k13j63N2L58r1m23j9N81L94k92m76OO80L57q54NJ46J00K55n83
2163a64PL57N04k29n08p7K96p3J07n30M25K88O1m03l32L98K34m9j80j15q5P69
2185G01o20j6k59N57K54m93k45R7N53q6k96l90N46r2l6l06K00K4K68m23k21N3
2207b30K11J75q4k02P5R7J16k91k6J74K71j57n36K23L13j39l33Q6L8J27M25m69
2229a36l01K44K81Jl72O1o7L89l37P3jJ32R9l5m34K08M34o2k66r9J90J6L2p7J25
2254I8J48o8l09K51k23J59J2l03Q8L58k05J69k83l0J03K85k0m73K48k53L51j68
2276f5M4L3K68k44m95L23k49M13j2J95n20p4K49k63L93j89k3m1J63j07N0mj00
2299b55P2oJ13j05p5L02k83K09qj15K10K7j47p1p2R2L41j58j27K32o3P2j72q0
$$ plain form
2140 -351 -372 -141 16 -197 -360 -308 50 -41 -464 -483 98 492 200 -276 -270 410 767 -87 -82 64 164 419 -164
2163 -164 -157 200 704 475 -33 -110 186 113 220 -310 115 403 464 61 -271 127 361 312 132 17 -68 701
2185 701 81 65 -194 363 617 124 -121 -24 529 443 147 -243 303 211 175 -131 69 93 361 -62 -283 -230
2207 -230 -19 156 72 -130 -55 42 158 -133 -159 15 286 129 -407 -184 129 -10 -343 -257 -219 -92 333 -136
2229 -136 -437 -193 88 89 -283 -222 -289 100 -237 -164 -165 -33 66 31 -403 -195 239 177 -89 -188 2 18 50 -27 98
2254 98 246 178 -131 120 -103 56 68 -235 -147 211 6 175 -108 -138 -35 250 230 -243 5 -248 103 -65
2276 -65 -21 12 280 36 -459 -136 -385 28 16 211 -309 -383 -134 -397 -4 -193 -216 -257 -94 -201 -151 -155 -255
2299 -255 -183 -189 -76 -181 -256 46 -237 -28 -36 -151 59 86 -61 -132 -204 -112 229 71 -56 176 113 185 13 -67
2323f7Q8p9J55k02J96L68j29k39J06k25K96m0j44K99j30q3j47J7L36J09l02k47
2345f4j03J50L16j17j08Qo5J43k61l13N06J71l31L0K5j05K49j65l8n2L52n7L1
2368B02m93K43K35j34Jk31J65L9K93o95m1K84N27l94m39L68j82O46l59r9p1J86
2390E1k61K17j81K62J81j92k48r4L78J84l4j27j28J40K41m48p7K21K72k62k5k46
2412a76L80O5l4n55L87L21p5l11M7j26K61J21l47k61L9K36k5Qk01J84J28P0m17
2435b81Q1Q1L70l88j54O1L72j80m7k8K1K81o26J06J50K22K2m45L19j67L60Ql94
2458b56J81m1K37K3m30L1L68K36j26l28J53L6k8j61r4L54J76j38o6j92k06L93
2480A22J0Kk19K33l8j01p7j09J87L03j93j71j7J84o1j64L36m19K15nk4l77M95
$$ plain form
2323 -67 21 -58 97 -105 91 459 330 91 197 -28 268 228 84 383 253 170 23 40 376 485 183 -64
2345 -64 -167 -17 299 182 74 82 17 160 -101 -414 92 263 -68 -38 -13 -118 131 -34 -72 -124 228 171 202
2368 202 -291 -48 187 53 54 -177 -12 27 320 -375 -416 -132 395 1 -438 -70 -252 394 35 -64 -135 51
2390 51 -210 7 -174 88 269 77 -171 -265 113 297 263 136 8 148 389 -59 -136 85 357 95 70 -176
2412 -176 204 269 235 -320 67 388 313 2 49 -77 184 305 -42 -303 -264 -28 -53 -45 -246 -62 66 136 -281
2435 -281 -200 -119 251 -137 -291 -230 142 -38 -85 -113 -92 189 -437 -331 -181 41 63 -382 -63 -230 130 138 -256
2458 -256 -75 -116 121 144 -286 -255 113 349 223 -105 48 84 56 -105 -199 155 331 193 127 -65 -271 122
2480 122 132 134 -85 148 110 9 -68 -177 10 313 120 -51 -68 116 55 -109 227 -192 23 18 -6 -383 112
2503A12P4k97L1j86J89r0L13J9n65M39k26j37J4K05j9J09R7k11r1R6Q7m8J04L3
2527E2n3j6k37L44l48Q15m32j93M0N8J25k79N48k86kJ7k87JK3J76j7K46q4o5M2
2552A88p8p3J95K18k20k07J84j70J47k0j82P8K11j52R0K4j20J25k2j88l0P7j04
2575b9q2J66P7j17n4J94l82K82l6k2P0j36j3N2k6K12l3l65K37J24j09j37J69j62
2599a20P2P7j55o5Q3j4J97j87j5N2M6Mj4K78k21J77m1l89J70m3K74m42J83K82
2623A89j13pk22Q7J58K91k23l61K23J32J5j65J15k1N8l53Nj8J40J35K6q4n6J91
2647A42R9l14q4o4M75l81j16mL39N6j38n6q8J1J3k02J32R1J27L25m94j22J07J47
2671Aj41j04J27J29K51j51k88L43j41q8J00k53q5K78J19j72QJ22J47l77O8LL35
$$ plain form
2503 112 186 -111 -80 -266 -77 -167 146 165 -400 39 -187 -324 -310 -105 -124 -15 82 -129 -220 -124 -37 -85 19 52
2527 52 -1 -17 -254 90 -258 557 125 -68 -28 30 155 -124 424 138 136 153 -134 -133 -110 66 49 295 211 146 188
2552 188 110 37 232 450 230 23 207 37 184 164 -18 60 271 119 209 233 113 238 216 28 -2 75 -29
2575 -29 -111 55 132 15 -39 155 -227 55 19 -3 67 -69 -82 -30 -56 156 123 -242 -5 119 10 -127 42 -120
2599 -120 -48 29 -126 -191 -108 -122 75 -112 -127 -75 -29 -25 -39 239 18 195 154 -235 -65 -108 166 -276 -93 189
2623 189 76 69 -153 -66 92 383 160 -201 22 154 169 4 119 98 156 -197 -192 -210 -70 65 91 7 -49 142
2647 142 241 -73 -157 -221 254 -127 -243 -247 92 148 10 -46 -134 -123 -110 -312 -180 -89 38 363 -131 -253 -146 1
2671 1 -140 -244 -117 12 263 112 -176 167 26 -62 38 -215 -300 -22 97 -75 -67 55 202 -175 -107 -104 231
2694B31q8j63J64j24J89j39j88N3P5M9J14k23R6l0J45k44J67J49j90J29j40L00
2716C32k61j03J32Q4n04N78pk20J47j10n4L4p2j19j7J85l2k7j90L35q8n9j01j62
2740b99Q4L02j28m1j47J13K17j19j54J06L67r5k17j5M3J49k62n9K8J91J00l03
2762a39J41k11L20K9O2j07k69K94J76k97o8R7R3O1k74j6K43j62K54j41J4j00L5
2785C5J46k10j3Q5J41j44M5L1r9J14j27J54J76o1l90J40KL6p7q9K50l84l2l0N09
2810B08k02qPj76J3rJ06k2P8k01J43l7N4j72K44j43K88l11qPk09K33K55j47j90
2835a99j18L17J19j43p4R7K39r5m5l68J97L57j70L2j68J21K19k06j11p4K10j04
2857C3J75k62K46j58O6o5J00j62J81m2j18q8K64j69M9j87J78kk64K92j32J23Q9
$$ plain form
2694 231 143 -20 144 20 209 70 -118 -65 10 59 173 -50 46 16 161 -83 84 233 43 172 32 332
2716 332 71 -32 100 184 -320 258 251 31 178 68 14 48 -24 -143 -160 25 -7 -34 -224 111 23 -36 -137 -299
2740 -299 -215 87 -41 -82 -229 -116 101 -18 -172 -66 301 206 -11 -26 17 166 -96 -155 -127 64 164 -139
2762 -139 2 -209 111 140 202 95 -174 120 296 -1 -69 28 121 182 -92 -108 135 -27 227 86 100 0 35
2785 35 181 -29 -42 43 184 40 85 116 17 131 4 158 334 273 -117 23 25 61 -16 -105 145 -239 -271 -301 208
2810 208 6 -2 5 -171 -158 -167 -61 -83 -5 -206 -63 -100 -46 -218 26 -117 171 -140 -148 -141 -350 -117 138 -9 -199
2835 -199 -317 0 119 -24 -98 -1 238 143 98 -270 -73 284 114 146 -22 99 318 112 1 -73 137 33
2857 33 208 -54 192 34 100 35 135 -27 154 112 -6 -94 170 1 50 -137 41 39 -225 67 -65 58 147
2880A47J0l16l8j02K47L82m84Q2QJ56j71J08j79j26J66l2M5J01l9j0j95K68p3
2903d5K6k6j36j01K86J75K7k55Lj56L62J37l05j52O9J97j88Q5n3L01K0n52L57
2926G6j2Q1R9j99lL57l44nJ23l31K05K99l99J90L6j99J30k35K21K8k2j06M6k16
2950a80J58K7Lo8k90M84l4j11n8J15M6J67k57k0J25K9k63k6J65j3M9j65j37J76
2974g8j2J97k36K6K06j20J68Jk25j6k9J12k15J10L04k18m2k61L38J49j07Q5o1
2997G6o2j07K72j48rJ55%M8k82p6M0O2J01l8J76k3m57K50l8J08p6mP3Q3j33j59
3023a68K36l33L90j93P7l4R0k10K78j02J9q4O2J24Q9j69j88J04j95J0K94n69L70
3046a02P1J31k42J88J05l60L05n9k26n5J31P3K45l6l48K26j54O8j28K21n7lq7
$$ plain form
2880 147 157 -159 -197 -299 -52 330 -154 -72 -64 92 -79 29 -150 -276 -110 -142 -97 4 -35 -45 -240 28 -45
2903 -45 -19 -45 -181 -282 4 179 206 -49 -46 -202 160 297 -8 -160 -91 106 -82 3 -50 251 271 -281 76
2926 76 64 145 244 45 42 399 55 50 173 -158 47 346 -53 137 173 -26 104 -131 90 118 96 -10 36 -180
2950 -180 -22 5 8 -60 -350 134 100 -11 -69 46 92 259 2 -18 107 136 -127 -153 12 -1 48 -117 -254 -78
2974 -78 -90 107 -129 -103 103 -17 151 152 -73 -89 -118 -6 -221 -111 193 -25 -67 -328 10 159 52 137 76
2997 76 14 -93 179 31 22 177 177 225 -57 -133 -93 -31 70 32 208 185 -272 -22 -60 48 -28 -32 41 124 -9 -168
3023 -168 68 -265 125 -68 9 -25 65 -145 133 31 50 -34 28 152 241 72 -116 -12 -207 -197 97 -472 -102
3046 -102 -31 100 -142 46 151 -209 96 37 -189 -244 -113 -40 205 169 -179 47 -107 -39 -167 54 -3 -6 -93
3069i3J02K7nj23k28K61L09j75J1j42K2R2l1k23M00k30J90n3J41k90J20Q7l9J41
3093B71k57K83l82Q2L2j14J15O1k72m3P8J58J05j17k21K91j30j52k30L60K28q4
3115F2p4r4j3J78P5p3k61L75k08j05J42n0J39j76J42j84p3J97J30k23R5K5j95
3138a69M30m94J8L58P0lk40j46K71j10K22k62L0L93l97J2R7j81M44k12j44J44
3160A31J15j42j85J13k28L20k2k72L2J12Q6K31m19K48J0l5j89O9K31j98Q8k00
3182a04J63N2nn6m6P2q6M5M6l53L2N20j40j33k46K40pL04l76o2K8M8L44m41Q1
3207h0p9K67q5M4PK12m42J32L4L3n6J7l1l0J80Q7m7l11mM1Q0K91l65j65L34n6
3233HQ7k20K90N5r9j70J96QJ0j25O8k17L72m37J42j01J76M8k39K9J97j61J27k5
$$ plain form
3069 -93 9 36 31 -92 -320 -59 250 75 86 -56 -34 58 27 -196 204 -26 164 111 252 -38 82 169 130 271
3093 271 14 297 -85 -3 29 -85 30 91 -181 -224 -146 12 117 0 -221 70 -60 -212 -442 -82 146 62
3115 62 -12 -106 -119 59 134 61 -200 175 -33 -138 4 -46 93 -83 59 -125 -198 -1 129 -94 1 26 -169
3138 -169 261 -233 -215 143 213 210 -30 -176 95 -15 207 -55 -25 368 -29 -17 80 -101 343 131 -13 131
3160 131 246 104 -81 32 -196 124 102 -170 -138 -26 60 291 -128 120 130 95 -94 -25 206 8 96 -104
3182 -104 59 111 106 50 4 76 -10 35 81 -272 -240 280 140 7 -239 1 -6 298 -78 -140 -112 -64 280 -161 -80
3207 -80 -159 108 23 67 74 286 -156 -24 10 43 -13 4 -27 -57 123 210 163 -148 -152 -111 -31 260 -105 -270 64 8
3233 8 95 -125 165 220 121 -49 147 155 165 40 108 -109 263 -174 -32 -133 43 91 -148 -119 78 -83 44 19
3257A9N4j18J6p8l1l2j5J72o4l1J03L30m21j25J43Q6k0m7R8n7RJ33rj74K35j78
3283bl1K4r0L1j86K24j64J64Q5j27J07O7L3R5k42K44j59N1r6j28J35L9K7q7k82
3308b68K73J80n0j01P8n2J91Oj92K45j22k61j65O7K06m2q4Q4k3k76N83m05J81
3331E3%J92k80J72j80J5j7n3J78l05J78l5K01k47Q7J69j64K09n15M90p7j68K88
3354A91k72j58J73J0j03J83%R3l0j8q3k17L28R1q1Q1k30J99m24NM58j67L48l13
3378F4j42K32Q5j8j98K7L00j05k25l60M61JlJ29k46J0K98j78j2k0mo5R2m47J81
3403a43K8J84J37k71J43k40L3J16n5J12M4m2k10kN9j05K31j36o3R1l1J86k58N4
3427a38J3J43J9j00J33J32j26k69Q5K04l13J18l1l0R6K47l06J19P5J29o9l23J29
$$ plain form
3257 19 73 -45 -29 -107 -138 -170 -185 -13 -77 -108 -5 325 -96 -221 -78 8 -12 -59 39 -18 -9 124 115 -59 176 -2
3283 -2 -33 -9 -99 -68 -254 -30 -194 -30 55 -72 35 102 135 230 -12 232 73 124 28 -100 35 74 101 14 -268
3308 -268 5 185 135 34 112 60 251 257 65 310 188 -73 -238 -171 35 -7 -91 -7 -30 -306 277 -128 53
3331 53 53 245 -35 137 -43 -28 -45 -98 80 -225 -47 -82 119 -128 -41 128 -36 173 -342 148 71 -97 191
3354 191 -81 -239 -66 -56 -159 24 24 117 87 69 -14 -231 97 188 107 188 -42 157 -267 -262 196 29 377 64
3378 64 -78 154 239 221 23 50 350 245 20 -340 121 122 119 248 2 12 310 132 120 100 96 31 123 -324 -143
3403 -143 -115 69 206 -65 78 -162 -129 -13 -68 44 88 46 -164 -166 -107 -212 19 -117 -180 -89 -120 66 -192 -138
3427 -138 -125 18 37 -63 70 202 76 -193 -108 96 -217 -99 -130 -160 -64 183 -123 -4 71 200 131 -192 -63
3450f3R8j40J34l4j99N34k5j0k68j84L19j89n9J39j64J94N0J14l39n0L51q2j08
3473A9j71J47K95l55K7j02K88J7k84K97j75N1Jl7p9J24k11J29k29r1L85J0k56
3496b00K2J09j12K30M3p1L0L2J89m43J42R2Lo3k0n0O4L6j16j9J83K4O7k66K15
3521A21l8k48K12M7j46j82M63L2j18j05L51k74r2n3Q1K03j94j64J77q8m4K22l26
3544a63j04M02nj45j0J3J11l09K03J59j36O8m8j74J77P6q8O5q0Q4l23J07K54l22
3568a88J55J44l99J98nJ49j36k0J79p0p1lL12j48K06m35K04M4k08J27j12Q1o3
3591e9L0k69L22l8l5M6J68k33k3K59M3j11k55M01l41O5J37p0J71o6l50M86k34
3614D4r1J10k45J69J47n3J39m02O9K06O3k41o8M05q6k85l5R7J09j09K86k54J39
$$ plain form
3450 -63 35 -105 29 -5 -204 330 305 295 27 -157 162 -27 -86 53 -111 83 133 247 -92 -142 209 127 19
3473 19 -152 -5 290 -65 -38 -140 148 165 -119 178 3 54 55 18 -61 63 -148 -19 -248 -339 46 56 -200
3496 -200 -178 -69 -181 49 92 21 51 83 272 -171 -29 63 66 3 -17 -67 -3 33 -83 -102 81 105 172 -94 121
3521 121 83 -165 47 94 -52 -234 229 261 143 38 389 115 23 -30 51 254 60 -104 73 -15 -59 163 -163
3544 -163 -267 135 130 -15 -25 -12 99 -210 -7 152 16 84 36 -138 39 115 27 92 12 96 -227 -120 134 -188
3568 -188 -33 111 -288 -90 -95 54 -82 -102 77 7 -64 -67 245 97 303 -132 72 116 -92 35 -77 4 -59
3591 -59 -29 -298 24 -14 -49 -3 165 -68 -91 168 211 100 -155 246 -95 -30 107 37 208 142 -208 278 44
3614 44 -47 63 -182 -13 134 81 220 -182 -113 93 156 -85 -153 252 166 -119 -154 -57 52 -57 229 -25 114
3637A14j79R9k39K16J5j8l6J29k22L0J99J1o0l00K96l1o7m9m5J27K01j92J11p7
3661C3j5j51pJ7j06J99oL3j45K11J16K8k29J73o8Q9m3l53M84j56J24k50J34lk50
3686a41J30j37K30O6L7r7l94M60m67K99j32n5L34o2k85J86k47M87k15n7j75L82
3708A47r1n7p8q2k2K63o1Q3l59J03O2L4M7j04L60j15l27l4P0K12k3L0q1p2O7L3
3734Ej06k3J16J45j45o6r2J47M47m64j64J76oJ0oK3k7K26j54j50J96R5j49M37
3758D71m79K39j71r6l9K43j17R7M0l7j87q1K94o7j67L04j27j52rL2k5L15j88n0
3782D3J39l50R7k11L02r5J62j93q7P1K1J50j97M7o5N3L2L9j54K11jr1j27J32R9
3807B7m44N84j87O1j53R0L0j91K31RQ7l0l54J33r9L0M06k59K16l35L25k75L08
$$ plain form
3637 114 -65 34 -205 11 26 8 -28 101 -121 -91 108 119 59 -241 55 24 -43 -92 -137 -10 191 -1 110 33
3661 33 18 -133 -140 -123 -229 -30 -36 -3 -148 63 179 207 -22 151 83 172 129 -224 260 104 228 -22 112 109 -141
3686 -141 -11 -148 82 148 185 88 -306 154 -313 -14 -146 -201 133 71 -214 -28 -275 212 -3 -60 -235 147
3708 147 56 -1 -79 -161 -183 80 19 102 -257 -154 -92 -58 -11 -115 245 130 -197 -231 -161 51 28 58 -23 -95 -28 5
3734 5 -101 -124 -8 137 -8 -74 -166 -19 428 -36 -200 -24 -30 -20 -26 -3 -30 196 42 -108 88 183 34 471
3758 471 -8 231 60 -36 -75 168 51 148 188 151 -36 -117 177 110 -57 247 120 -32 -41 -9 -34 281 93 43
3782 43 182 -168 -71 -282 20 -75 87 -106 -193 -122 -101 49 -148 -101 -166 -113 -81 -42 -196 15 14 -77 -204 -72 27
3807 27 -417 167 -20 41 -112 -22 8 -183 48 57 144 114 -240 -107 -206 -176 230 -29 187 -148 177 -98 210
3830B10k06M1m3J9K98l01q3J70k34q0L90j72R0PL4K7j00J94n22J38O4K11m21J71
3854i8L51j89k52N2k6J22j18j75K81J24Qj61J68k0p5j28n3J53P1r1J27l0M2M9
3878A32j34N8k92K52k14L31r6K4l9j61J18J7rN9k6L9K2J9M3k51l4K36J57j55N3
3903A49j51J03Rj23o2JJ00L4r0j00J90N5J75k00j1j9l3k75K51J12j97J56p1O7
3927G0k59J96k56K97j10J75k09p3K2K71j3k80Nn3K59J38o04M38l34L86q6J18N4
3950A52k4k76J39j32PM85l75m0o5J12oj02j5K52j53N2K3o0j46J06r7K65q2O8O7
3975A55J09l38J83k86K21P7m1m9j56j7K02m5m9J60j71L99l24j33J58j5q1L78q6
3998B51k37r3j62J08L22J8m26J21N6l4j49L43l75K41N9r7L4K03k53Q2k27M6J05
$$ plain form
3830 210 4 45 2 21 319 18 -65 105 -129 -209 181 9 99 106 140 167 67 261 -261 -123 -59 152 -269 -98
3854 -98 253 64 -188 -136 -162 -40 -158 -333 -52 72 80 -81 87 67 -8 -136 -189 -36 35 -56 71 41 83 132
3878 132 -2 56 -236 16 -198 133 37 61 22 -139 -21 -4 -13 46 20 59 81 100 143 -108 -142 94 251 96 149
3903 149 -2 101 110 -13 -75 -74 26 60 -30 -130 60 115 290 90 79 60 27 -248 3 115 -82 74 3 70
3927 70 -189 7 -249 48 -62 113 -96 -169 -147 124 111 -169 -164 -217 42 180 -424 14 -320 66 -20 98 152
3950 152 128 -148 -9 -141 -134 351 -24 -64 -129 -17 -23 -125 -140 112 -41 11 34 -26 -172 -66 -163 102 20 88 155
3975 155 264 -74 109 -177 44 121 80 31 -125 -142 60 15 -34 126 -45 354 30 -103 55 40 -41 337 251
3998 251 14 -79 -241 -133 189 207 -219 -98 -42 -76 -225 118 -257 -16 43 -54 -20 183 -70 12 -215 -169 -64
4021f4j33J39K88m7k95K35p9R5l37K53K06k95j1J0K08k53J69j84K7j29J29L6K1
4044a1J09n9q3j17Q3J68L4r7K3JQ8k79K45j15rM6k1n0K60k31K07K3k88J97k93
4069a69J62j44J16LM6m6K15r1n6K28l23Q8k45K50Km7J37l03K3J71K04l25P5K8
4093aj8p9k28K96Jj30N3L5n6j19N18l56j8N8o2J17J59j44j01R5k7k47M26J29j96
4118A05j37J76k84N3J53lO4l02J04J00J44q0nJ15r3K03l81mL9K11k57J82j17M1
4142B7j9q0J10q2K36r8J43m08J78J08J82k43j31j3J59k43j00K05Q6jk09K21j17
4165h9J6j17K18L1O2j26J08k97J1K4K23j81J55n3q1o9L05m24K35J76k66K54j26
4188a1o6O3O2m2P0P2o8l2MPR9J90n08J19N3Q1j8J10l05O7L28k86O4k07o7J66J23
$$ plain form
4021 -64 -197 -58 230 183 -112 123 44 139 -198 55 261 -34 -45 -35 173 -80 89 -95 -68 -197 -68 -32 -11
4044 -11 98 39 -44 -161 -78 90 124 27 50 51 139 -140 105 -10 -19 27 6 -44 216 -15 192 215 -73 124 -169
4069 -169 -7 -151 -35 -32 14 -32 183 92 36 264 -59 29 -216 34 36 -11 126 -177 -154 17 221 -104 -29 -1
4093 -1 -19 -98 -326 -30 -29 -159 -106 -71 -127 -246 272 -84 -102 -44 -106 11 170 26 -75 20 -7 -254 172 301 105
4118 105 -32 144 -140 -87 66 63 127 -175 -71 29 173 93 88 203 110 313 -68 -72 -33 178 -79 103 -14 27
4142 27 8 -72 38 -44 192 94 237 -171 7 115 297 54 -77 -90 69 -174 -274 -69 17 16 -193 28 -89
4165 -89 -73 -190 28 59 121 -5 103 -194 -183 -159 64 -117 38 -15 -96 -165 140 -284 -49 127 -139 115 -11
4188 -11 -77 -14 48 6 76 148 80 48 52 59 158 348 -160 -41 12 93 75 185 -120 -53 275 -11 53 -154 -221 -55 68
4215F8j40L6R8j66K85j85k3J61kpJ4j52j55M0J3O8K62k73Q6p9J80r0j98K6m5J47
4241c1P2k10L81l21J07j39j0p2K25r7KJ62j18J76j88K05m34J67K72j63J96l11
4263a29J93k56M0J40j42J15%L80m12J36J82l02mR2l2K3J95k56Q4L4K45k91l2O5
4287F8k00K00J95n09OK0L27m5n0K7O6j12k7p8J2J33O3j05M8j25l6N1J60l44J48
4312a07J12j72J15J17nj14j1Ok40K55m7P4N3K4k08O8l6J54Jp4J49j24J44j05Q3
4337A12K6j67%n4L31l72J47J62k34qq4J60n7J14k27J24J75k0O4j78K21j70J17
4360A82j6k91l7K21j9j50J64j41O1n5N9N5nM0K14m02P3J89l34o5J08J32k24K28
4384a3j01K73L4j59k3r1K72n88L32J67k44K15l07K00k0o9L09m44L13P0k30J35
$$ plain form
4215 68 -72 -36 62 -104 181 -4 -27 134 132 125 139 -13 -168 -128 -115 -47 215 -58 28 -51 129 39 -159 -133 -178 -31
4241 -31 41 -169 212 -109 -2 -141 -151 -223 2 -95 -93 69 -49 127 -61 144 -290 -123 149 -14 182 -129
4263 -129 64 -192 -152 -12 -154 -39 -39 341 -71 65 247 -55 -59 33 1 24 219 -37 47 81 326 35 3 68
4287 68 -132 68 263 -246 -240 -220 107 62 12 39 105 -7 -34 -112 -100 33 96 -9 39 -86 -122 -71 89 -255 -107
4312 -107 5 -167 -52 65 60 -54 -65 -59 -299 -44 -91 -17 36 60 -148 -80 -116 38 39 -35 114 -10 134 29 112
4337 112 138 -29 -29 -83 248 -124 23 185 -49 -57 -141 19 -38 76 -151 -27 148 128 192 14 235 65 182
4360 182 166 -125 -162 59 40 -110 54 -87 -26 -81 -22 33 28 68 282 -120 -47 142 -192 -257 -149 -17 -241 -13
4384 -13 -114 159 193 34 11 -80 192 -396 -64 103 -141 74 -233 -33 -53 -122 187 -257 56 126 -104 31
4406C1j14L97k50J24k88j58Q6L43k30j66K73j12J26o6O5q3k4J35J0k99J44P7K19
4429B40k60N2j74K05K0j6o5J42P6q5j11j17L23m10K12k9k8J36r4k31K26J19j82
4452e1K80k00j09jK06lk28j55K20J58Pk92K4j87M23j56m6O7K5r0j3K52l53J82
4476d0M6N3j12k58K11J5J35Q0o6j32J2R3k25J30K14j95Q9O6j92J66o2O1J77j29
4500A37l6k8j13l3j94R3K32j83K38p3L9L1j0j42m3K15J06j53l9j0k98Q4L14L7
4524A71j52K55k86n6J24P5k29m6m7N2K49j40J80k38J60p9n1J8K4j38K23K2R3k20
4548c6j41K28j7k2K28k54P0k05J79N4j43J9l9K44q6k46o9J31Pn4L41k02R5k22
4572a40M9q8M93k67n9J74K1j86M19m27J06k3l6l1k77K41J15j4q3QL94m04L4O8
$$ plain form
4406 31 -83 314 64 188 -100 -258 -172 171 -59 -225 48 -64 62 -4 61 -22 -46 89 99 -200 -56 21 240
4429 240 -20 32 -142 63 83 67 2 144 220 135 24 -93 230 -180 32 3 -25 111 17 -214 12 131 -51
4452 -51 229 29 -80 -81 125 122 -106 -261 -41 117 124 -168 -144 -331 92 -64 -110 -43 -18 -108 -121 131 -222 -40
4476 -40 6 59 -53 -311 -100 -85 50 130 64 -68 -56 37 -188 -58 156 -39 50 116 -76 90 28 89 266 137
4500 137 101 73 -40 -73 -267 -174 58 -125 113 40 79 110 100 -42 -85 130 236 83 44 34 -264 -180 134 171
4524 171 19 274 -12 -68 56 131 -98 -144 -191 -139 110 -30 150 -88 72 -7 -58 -40 -16 -154 69 91 184 -36
4548 -36 -177 51 34 12 240 -14 56 -149 30 84 -59 -40 -79 165 79 -167 -236 -105 -98 -152 189 -13 82 -140
4572 -140 -91 -179 314 47 -12 162 183 -3 416 -11 95 72 36 5 -272 -31 84 70 -13 -5 389 -15 19 87
4596H7mK8Jj36j19R4m1J96J41j61o7l59J50K17j9m7J32N4%o7k70L22L0Rm01L03
4622G3m43J05K00n4R3j3k6J5j6J52N5j71J78o0k10J63o0r6K23k2j44L02j05k3
4646A16k05J10l3J98J18k68K29j61j87J54J2J64j9j89MK09j51k4N3o4j54O1M4
4669A7j64O1K56j49j65J22J13j77J89r3k04J44j8o3M08k09j72J45l37K20o8QL1
4692a05L16j32j41j07K33j98J73r8J5P3J20j24j62nk4J70J53k35J28L7j05R0J03
4715A75j55J87k11j99M00l86J79k60J94K91m9n9j15J80k09J05j74N4J23J2r8N2
4737C7Q3j12m7j45L33l52K21J47l59J20J28j17L6J10n2l0K48k02j57K24k3j41
4759e0J22o9m7n9K8k0M1L77n26J88k1j20J17j24K80k61K42k13J82j36K76n4j01
$$ plain form
4596 87 83 111 112 -24 -143 -49 -90 106 247 86 19 -340 -190 27 8 -39 93 147 147 80 -190 132 162 171 -230 73
4622 73 -370 -265 -65 -119 -26 -39 -65 -50 -66 86 141 -30 148 88 -122 41 -19 -115 108 86 -58 244 139 116
4646 116 -89 21 -12 186 304 36 265 104 -83 71 83 247 228 39 43 252 101 77 130 66 -88 -27 17
4669 17 -147 -86 170 21 -144 -22 91 -86 103 10 -194 -50 -68 -131 277 68 -104 41 -296 -76 -144 -136 -105
4692 -105 211 79 -62 -169 64 -134 39 -59 -44 29 149 25 -137 -142 -166 4 157 -78 50 87 -18 72 175
4715 175 20 207 -4 -203 197 -189 -10 -270 -76 215 166 107 -8 172 -37 68 -106 -52 71 83 -15 37
4737 37 120 8 -39 -184 149 -203 18 165 -194 -74 54 -63 -27 83 31 1 249 47 -110 114 91 -50
4759 -50 72 3 -44 -103 -75 -95 -54 323 -203 -15 -36 -156 -39 -163 117 -144 98 -115 67 -69 207 153 52
4782E2o4j0j23P6R4l8j45L00k31J10j42K68n7j51J40o1J51k82K4K46q0j5N2l4
4806H0k11L52j66j86J26o3O6k24L70j99J03o9O0J5j99k8J66j43o9K18J23j9j80
4829g7j41J99j02K27R3k88Q4J89j45k28J66J26j75J54j27mJ98j87K48l00L29l08
4851f9J81k54K37j49o9J97q7j10K4K55k82J46Q7k82J6K81q9j26k8J66k54J96J02
4874H9J06k34J9o2J15M7l98M20J55m14J95l9MJ68k21r0J7N3K5J04l7k32K34R2
4898A16j07j06q6R4K0J71j31L73m20N9Q2j66K26k85L50k12q0K13k90M09l28J33
4920C5j28O0o0L9j75L00l06J79K16k83K94k83k8K07j36J12j63O3j88L66m0j80
4942i9J04J34j4j35O5P1lR3l77K25Qo4J14o0k3o4n8J16j3j56R3J7K34l35R1R0
$$ plain form
4782 52 -12 -22 -145 -69 25 -13 -158 142 -89 21 -121 147 90 -61 79 18 169 -113 -89 157 77 62 114 80
4806 80 -131 221 55 -131 -5 -68 -2 -226 144 -55 48 -21 39 54 -145 -173 -7 -150 -219 -1 122 103 -77
4829 -77 -218 -19 -121 106 199 -89 -5 184 39 -189 -23 103 -72 82 -45 -49 149 -38 210 -90 239 -69
4851 -69 112 -142 95 -54 -123 74 -13 -123 -99 156 -126 20 107 -175 -159 122 33 -93 -121 45 -209 -13 89
4874 89 195 -39 -20 -82 33 80 -318 102 257 -157 38 -1 3 171 -50 -140 -123 -70 -45 59 22 -210 24 116
4898 116 9 -97 -183 -89 -69 102 -29 344 -76 -17 65 -101 125 -160 190 -22 -102 111 -179 230 -98 35
4920 35 -93 -33 -93 -54 -229 71 -235 -56 160 -123 171 -112 -140 67 -69 43 -120 -57 -245 121 81 -99
4942 -99 5 139 125 -10 55 126 123 216 -161 64 72 8 122 62 39 -25 -83 33 20 -136 -43 -26 208 -127 -36 54
4968E4P0q7r9j9R1K23l42r6L59j65j28L81k64j06J08k28J12J74q6M5%L3j55K09
4992H4J6k40K6J39k9Q0rk44L29nk91J30j10J35k20M03R1q0l26K61j68N4Pm7l6
5017e0j0o5K10NJ14m46L02j26J85j10j08j43J90P6m1J04o0n2J8Q9o1j46J8K07
5041A00k39N2K23k32K04k37J39m4J33k3j20K2L5R8n9J38l65o7K81K3k25L38j64
5064A1j02j0J48j71K06q2j2L1Q0N7j56K45l96k5P2L16k89J46j32O6M8k82M89m2
5088B16k40ll72N22M8j97j9K60k90n0J58J09k51J61J22r6M5k28J31j41K14l5O2
5111A26j32kJ7m6K6J04%J9j13K5L0j47J84j74J92k24J12p3L1K36p0m6j41N0O8
5136E2j49L9J34k67m6R6K41l72M00J57l56P3J7j23m1R0m1Kn9N1m2J81j2J4k39
$$ plain form
4968 54 124 37 -62 -81 10 233 -109 -205 154 -11 -139 242 -22 -128 -20 -248 -136 38 -48 -3 -3 30 -125 84
4992 84 100 -140 -114 25 -4 76 67 -177 152 147 -144 -14 -124 11 -209 194 285 205 -121 140 -28 26 33 -14 -50
5017 -50 -60 -125 85 90 204 -242 60 -66 119 9 -99 -242 -52 24 -17 87 27 -25 -7 82 21 -125 -107 100
5041 100 -139 -87 136 -96 108 -129 10 -34 99 76 -44 -22 13 111 52 190 -175 -242 39 62 -163 175 11
5064 11 -91 -101 47 -124 82 0 -12 19 99 156 0 245 -151 -176 -104 212 -77 69 -63 3 51 -231 258 216
5088 216 -24 -27 -399 123 171 -26 -45 215 -75 -125 33 142 -109 52 174 78 123 -105 26 -115 99 64 126
5111 126 -6 -8 9 -37 -11 93 93 112 -1 24 54 -93 91 -83 109 -115 -3 -76 -45 191 121 75 -66 -16 52
5136 52 -97 -58 76 -191 -237 -141 100 -272 128 285 -71 2 19 -104 -145 -55 -96 -94 -153 -102 -144 37 25 39 -200
5161b00J95J72k96J31R1k5k53J78O4j57n9J93J27O1n0k55P8m3o3K39k26K10O3
5184A75j75J29L6n7J04k62o3J8J85j91L05o5O7j84k03K92q1k14pK99j58q2PJ3
5208a12L12m01J75O0l75M29J8r6K3m6J31j06mj04J0J43J60j69N8J58j98j03k8
5231f5M10k32j5l5k01K64l86K07K56J6l06J7J22R1m40N11m21L11j98J54L1R0L6
5254B17l04j31J69k3L0J72j99K16m5l18L47j32L09m81J67Kk3K2j42r6L80k03K9
5277c7k20L34j48l3J9j89J79Pm30O17k30q9K77k24K91k06J34j81J29K9O0k72O
5300a77P8K01J9K5l54L09R2j89o5L10k92K15l24M5l6M9L87m9Jk16K24k47M8l32
5324b78L63l7j65M9K13k98J79Q7j59K28l36K08j3J75J52k90k54K03o1R0kq0K7
$$ plain form
5161 -200 -5 167 -129 2 93 68 -185 -7 57 -100 -159 34 161 222 172 -83 -5 -48 -111 128 -98 112 175
5184 175 0 129 165 108 212 -50 -113 -95 90 -101 204 139 206 22 -181 111 30 -184 -191 108 -50 -132 -125 -112
5208 -112 200 -201 -26 34 -341 88 106 10 33 -13 118 12 8 -96 -86 57 217 48 106 264 66 -37 -65
5231 -65 345 113 98 63 -138 126 -260 -53 203 219 -87 -70 52 143 -297 214 -207 104 -94 60 91 181 217
5254 217 -87 -218 -49 -72 -42 130 -69 147 102 -216 131 -1 308 -173 -6 -4 -27 -5 -147 -243 137 -66 -37
5277 -37 -257 77 -71 -104 -85 -274 -95 -88 -518 99 -131 -220 57 -167 124 -82 52 -129 0 29 89 -183 -177
5300 -177 -99 102 121 146 -208 101 193 4 -61 249 -43 172 -152 -107 -143 -94 293 244 245 29 253 6 54 -278
5324 -278 85 48 -117 -68 145 -153 26 113 -46 182 -154 54 41 216 368 78 -176 27 -34 56 54 -26 1
5347Aj88K88k36l7K44%Pj45O1J39rk12P6K24j38L3p6k73J99J47j87k11J99Q8J0
5372Dl1J15J95l23Q6J4l9K6j79j54K7K73n6j57O2K20M1q3J19j68j20J9J20J61
5396A72k04o4J45PJ33m7j05J55j30J79k62p3N2J19j6m3n7N8R%pr2j10K30m2N0
5422E7j05L42j83j64j15j9L90o7J33n66R0L23l48J12o1J53M4O3rl04J10L10j51
5445C5j56L36j30k16PL9J5l1J98J33r1p6j82J28n6J4K2n4K1M1j01N0R7O4j38j3
5471d4M1J66k41J82l56K49Q1n6o9M0K33k26K6j58J50k5J12l13J2K21l9q4N9Q1
5495D2q3J05R5k48J10J10k39r8J01j87J09k3K86K3n24K37k4M00n3p8R6m05J92
5518e6K69L1k48J39j98O4r5O1P0j78M7J91j26J11qm7J00j02J2O3k50k9J88n2k8
$$ plain form
5347 1 -187 101 -135 -172 72 72 79 -66 -5 134 125 -87 -11 213 75 108 32 -241 -42 105 -82 -293 -94 -6 4
5372 4 -27 88 283 -40 46 60 21 47 -132 -286 -259 14 -42 -199 -137 83 124 41 160 -8 -128 -109 11 172
5396 172 -32 -96 49 56 189 142 37 192 62 241 -21 -94 -42 77 61 18 -39 19 28 28 21 -71 -181 49 7 57
5422 57 -48 294 111 -53 -168 -187 203 136 269 -297 -207 116 -232 -120 -181 -28 16 79 70 -234 -124 186 35
5445 35 -121 215 85 -131 -124 -85 -70 -101 97 230 139 63 -119 9 -47 -33 -11 -65 -44 -3 -104 -54 43 107 -31 -44
5471 -44 -3 163 -78 104 -252 -3 78 22 -47 -7 226 0 26 -132 18 -7 105 -208 -196 25 -14 -98 -39 42
5495 42 -41 64 159 -89 21 131 -108 -206 -105 -292 -183 -206 80 103 -421 -184 -208 192 139 61 157 -248 -56
5518 -56 213 244 -4 135 -63 1 -94 -33 37 -141 -94 97 -29 82 74 27 127 25 37 100 -150 -179 9 -43 -71
5543g1m8K35n5j15M08k21nMm6r5R6k0K4m2j93kK29k95J62L3l2J36k57R4k3K5k38
5570c12L16J45m4j01q8m7J90j34j72L26K0j7j65J39k9k1j26P8J55l05J64r2K1
5593i9K55j93J88k7l40K39q1J4J07r5N9j58oO2J44L0q2j41J26M6r6J36rm2J54
5618A91k67J30Q0p1j46K12k7j47L28k90j23M3J84k2k67L8P7J86m28N8L19pk68
5641b17l8K37j18R8k3r7L10j86k04M2J87q3N1N3j37K37o4k31J13%K68j94r0Q6
5665@K17k53M8n6pPJ34j08J55l4l26M1L02j86L6J2N1o4k3J47k38j2M3pQ0m1J94
5692A12n01N04M1l21J57R4K0o2k48J76K4K33k28q8J30k5o5K0L88n31K13m2J73
5715A74j45N8N1M9q3k63J7K38r0J53J9n25J45J83m1j48K32l0j71K08m4J15q4l2
$$ plain form
5543 -71 -119 116 61 -54 354 133 128 132 86 -9 87 67 91 49 -144 -146 83 -212 -50 -17 -49 87 -170 -76 -99 -74 -312
5570 -312 4 149 105 4 -84 -131 59 -75 -247 79 99 82 -83 56 27 6 -120 -42 113 -192 -28 -120 -99
5593 -99 156 -37 151 124 -216 23 -58 -44 63 -32 27 -131 -137 -75 69 99 17 -124 2 48 -48 88 79 37 191
5618 191 -76 54 134 63 -83 129 102 -45 283 -7 -130 -87 97 75 -192 -154 -77 109 -319 -261 58 51 -217
5641 -217 -255 -18 -136 -38 -61 -158 152 -34 -238 -196 -9 -92 -41 12 -125 112 48 -183 -70 -70 198 4 -86 0
5665 0 217 -36 12 -44 -51 -44 90 -18 137 103 -223 -182 120 -66 -30 -18 33 -31 -54 93 -145 -157 -114 -121 -41 -82 112
5692 112 -389 115 156 -165 -8 86 106 44 -204 -28 -4 229 1 -87 43 18 -47 -27 361 -170 43 1 174
5715 174 29 87 138 187 104 -159 -142 96 6 159 178 -347 -202 -19 -60 -208 24 -6 -177 31 -13 102 18 -14
5739a4Q4l4q3J41J55m7j20K9o1N0j03j5J18k91K68j83J74q3Q9j08J07j45j26M25
5763B27l44k8l2M8m6J22j6J09O5l34K55J37l33J40J1qk9j43K64k09K57q9k21J9
5787a78K63j34p6J87k20K5K00j74k9PK53l7k4j26O4r9K35j24j21K5l4K14k37P4
5811f6j37L25n8k30J18J36j24J52j11o0p1K04k26K35j27J60ll99M90m2j14k3J80
5834B09k04J66J6l06J01j03K78k88K00m2o7K05j3k00j00L13r9k94L65O6j67l5
5856AJ08k8l8L1j31J69o8k2N6q6k7l8J24p1KkJ63j10k02K6K99k55J49J49m04J33
5882g2O4K04l98K19m7L0J21j23j2j78L54k14K22k10R1J6j43K73m83O6J39K00l4
5905H5j78K12j80J19N7q7k05M1M1J68j22n1R2Q5J9r9R0k39K04p5J17n6n6j24K15
$$ plain form
5739 -14 70 36 -47 94 249 202 82 111 50 100 -3 -18 100 -191 77 -106 68 -15 74 -34 73 -72 -198 227
5763 227 -117 -145 -177 -129 -175 -53 -69 40 105 -229 26 163 -170 -30 -19 -27 -56 -199 65 -144 113 24 -197 -178
5787 -178 85 -49 -125 62 -158 -133 67 -107 -136 -129 124 87 63 -63 1 -98 137 13 -108 -83 -117 97 -140 -66
5811 -66 -203 122 64 -166 -48 88 -36 116 5 -55 -126 78 -148 87 -40 120 117 -282 208 166 52 29 209
5834 209 5 171 187 -119 -18 -121 157 -131 69 27 -40 165 152 -48 -148 165 66 -228 137 203 36 1
5856 1 109 81 43 74 -57 112 44 22 78 -8 -35 -73 51 -20 -18 -20 143 33 -169 -143 156 -99 50 199 -205 -72
5882 -72 -8 196 -202 17 -30 0 121 -2 -14 -192 162 -52 170 -40 51 67 -76 197 -286 -220 -81 119 85
5905 85 -93 119 -61 58 115 28 -177 -136 -95 73 -49 -100 -8 77 96 -3 87 -152 52 -23 94 38 -18 -142 73
5930G3L0j71j10K41l95L18M7k28L38k10J96j42K25k31J14ql39M46j96Q4k06N0
5952g4P7J27o1l10K45l4N5N0J32k49N2J71j49k41J90J13l44K13K8n8rJ32j09j64
5976b17K09k3O0k17K80p9M8Q4k00J82J30k60j28K02Q3k31O2j59K35j86R4n7L17
5999B29l89j13J85J47K70l77K7J52j88j1j8J54j13lr7M7L3QM16m99J36M8J7j31
6023g0J33R5m6Q6l78K6J84j67K69k09J19j63J48l33K06p3L19j50k46L99j31oj96
6046a84R2K04j23j9M6q4K80l70K38j56J17j40K03j88k7J61l00K30ok73M69J5j3
6069A72Nj81qj47L01k54M5R0j12JJ79l35K78j91K18J90j27j34j18J30j17J34j58
6092a39n2J96j38K99j59j34M3O8r7R3J63k93J97j20Oo0J60o6J04L2m4j0M4j96
$$ plain form
5930 73 103 -68 -178 63 -332 -14 33 -195 143 -67 129 -13 212 -19 95 87 -252 194 -2 82 -124 -74
5952 -74 3 130 69 -241 4 -30 25 75 207 -42 10 181 32 -209 -19 94 -250 -37 -9 -67 -76 56 -53 -217
5976 -217 -8 -31 29 -188 92 13 61 145 -55 127 257 -3 -131 71 154 -77 -15 -174 61 -125 -31 -88 229
5999 229 -160 -273 -88 59 329 -48 -21 131 -57 -68 -86 68 -45 -48 -145 -98 -65 -57 359 -140 -4 44 61 -70
6023 -70 63 158 112 198 -180 -154 30 -137 132 -77 42 -121 27 -306 -100 -173 146 -4 -250 149 18 12 -184
6046 -184 -92 112 -11 -30 16 -68 212 -158 80 -76 41 -99 104 -84 -111 50 -250 -20 -26 -299 170 185 172
6069 172 177 -4 -12 -159 142 -112 -67 23 -89 -88 91 -244 34 -157 61 251 124 -10 -128 2 -115 19 -139
6092 -139 -191 5 -133 166 7 -127 -84 -16 -113 -20 143 -150 47 -73 -67 -127 33 -33 71 103 59 49 93 -103
6116a03N5L7L80n32J91l0j97K01J8J72k73Q6j53L57k25M0M4k5m5N3J56k38L0J42
6140A41j53R6N5j0p9j30J45J2k11J41J6K8j53R9N9j98R1n1J17L3k91J67Q6J22
6164A32k78L17p6k61P1M4J0K4K60k83K07k84N5J88k66K51K22l71j02J83K8P7O8
6187B16j35J8N0J14l87oK3J63rm3J87q5P1k28l0J4pq1K61j19Q5j62Ll1O4j9J47
6214G4k22M9J01j39J32J7r0p2K67k78K72j95K6RL05r7k65k4K5J84K12j40k15R3
6238B9m4O5j92J26J10j11N2k33N0L6K27m6j9j76P2N7O6l07L11M4j22o4n2N2J24
6263E5j54L5J67K28l11k0k4J07kj60L00k52K12Jj74J75l21J46J1L3n4j48L8R1
6287b1Jq5mJ96j48j89K13m2N3L7nO0j10L3j25K11k47J92m2J34K30l18MJ12o7j00
$$ plain form
6116 -103 -48 -11 369 -163 28 -2 -199 2 20 192 -81 5 -148 209 -16 24 68 43 -2 51 207 -31 -1 141
6140 141 -12 84 139 129 50 -80 65 77 -134 7 23 51 -102 -3 56 -142 -51 -102 15 48 -243 -76 10 132
6164 132 -146 171 95 -166 -95 -51 -41 -17 243 -40 167 -117 -62 126 -140 111 333 -38 -140 43 71 148 216
6187 216 81 99 149 263 -124 -130 -107 56 47 4 191 106 177 -51 -81 -67 -74 -155 106 -13 72 -90 -87 -118 -54 -73 74
6214 74 -148 -99 2 -137 -5 12 -78 -150 117 -161 111 -84 -58 -49 256 159 -106 -130 -105 79 291 151 -64 29
6238 29 -15 50 -142 -16 94 -17 35 -198 -148 -112 115 69 50 -126 -54 3 69 -238 73 117 -5 -69 -121 -69 55
6263 55 -99 -64 103 331 20 0 -24 83 81 -79 221 -31 181 182 8 183 -138 8 19 52 -2 -150 -112 -21
6287 -21 -20 -105 -109 87 -61 -250 -37 -79 -26 11 6 66 -44 -11 -136 75 -172 20 -22 112 342 24 28 140 73 -27
6313b7K07j99K7OL9JP5k08R7q6K7K7J47m3P4k50J7K61k49K8J33Q1k38O1p4O6K0
6340B0K65j50j47n3q5K5P8K1o7m3L65j60N2q4J6r2J08J07l47Q1P4k1j22K11J54
6365B06j95J36k54J16l3K3q7J44r3o9J66j68J18j15K66r7k0j79J29K67m08R3K48
6388A94j10k10K52l07K0L23P3k24l8K82k39r7J38k07J34j15Q4K00r8k18J18K52
6410B07n8r2op2P6J35k01K7Ljj28P7O6J79k19o3K91j18l3j91J41r8L17j92k44
6435a97J69pj02L39k47J46l65K52Rr9Q5r4K50j56J21r4M8O2r6k00J13k8m0J09
6459b2j34L78k61k02L85l7J21l97J0O6J33j68K99l10P0J40j69M3J11m4q4k2J67
6482G3j50L8j30O4J75J09m36K21k24M86k51m6J19n6J74j91r5J93j33K39o3j17
$$ plain form
6313 -27 180 -19 8 14 53 54 129 -79 18 -68 -41 -14 133 90 164 -86 -69 192 -57 -29 104 185 -53 8 -66 0 20
6340 20 285 135 -12 -65 -150 -125 -47 -26 -93 -136 229 69 121 37 53 -39 69 176 -171 -90 -16 -37 -159 52 206
6365 206 11 147 -107 9 -24 -1 -88 56 -37 -106 60 -108 10 -105 161 64 44 -135 -6 261 -147 -54 194
6388 194 84 -126 126 -181 -161 162 235 11 -27 255 16 -81 57 -150 -16 -131 -47 153 55 -163 -45 207
6410 207 149 57 51 -21 55 190 -11 16 19 18 -110 -33 33 212 -7 -70 221 103 70 -121 20 -78 239 47 -197
6435 -197 -28 -35 -137 202 -45 101 -264 -12 -3 -102 -17 -111 139 -17 104 10 58 120 24 -176 -63 -91 -131 -22
6459 -22 -156 222 -39 -241 144 107 228 -169 -159 -93 40 -128 171 -139 -69 71 -98 -55 56 12 -72 -94 73
6482 73 -77 -39 -169 -105 70 179 -257 -36 -260 226 -25 -71 48 -8 166 -25 -120 73 -60 179 116 -1
6504aL11k19k6N3J7j67K43k02j92J69R5r5K26j39j32L02j49j7j30K27k12m9J07
6527B0P7k54J15J8j54L34j36J66k83O1rJ72j17l9P6r8K36n9j3r2M6P6r2J42k41
6552d8J43k38J20j3j7Lk6K46j69K0J31r0j83J2L33k37J8J10m3j13N2J81j85O5
6576G2j47J47m1k24P2K07n1OL1R5k45k1N26n61J61o7J19l9j35K39j61K0j12K29
6600A20k04K18j50P2M8k3j65j49J51J24j17L48j26k19K75r1k52L04j60P5n5k53
6622b29L92n81N49L0j59J52j27o9j45J72Q0J79m42K52j88J68J39m3k05P8n9M7
6644iN9l50J67K73r1l4K3j45J90k2j08K04j16P4j26j61K08r2K06N1l26K90k30
6667f5l6KJ65j86J44N9N9l7l52J69J82k22M7j00K05J70k83K49kj2k46j7M6Q9L8
$$ plain form
6504 -1 310 91 65 118 135 -32 211 9 -183 -14 81 -14 212 73 -59 243 94 77 -53 174 -38 -87 20
6527 20 97 -157 -42 -24 -178 156 20 186 -97 -36 -45 127 10 -29 47 -51 185 126 113 21 67 143 51 193 -48
6552 -48 95 -143 -23 -36 -53 -50 -76 170 1 21 152 62 -121 -109 224 -13 5 115 72 -41 11 192 7 72
6576 72 -75 72 31 -193 -121 86 35 41 72 167 -78 -99 427 -134 27 -40 79 40 -95 144 -17 3 -109 120
6600 120 -84 134 -16 56 104 81 -84 -233 -82 42 -75 273 147 -72 203 112 -140 164 4 79 24 -229
6622 -229 163 -418 131 161 2 154 27 -42 -187 -15 65 244 -198 54 -134 34 173 130 -75 3 -56 -9
6644 -9 50 -300 -133 140 49 15 38 -107 83 61 -47 157 41 115 -11 -172 36 -56 150 201 -125 165 -65
6667 -65 -101 -99 66 -120 24 83 142 105 -247 -78 104 -118 -71 -171 34 204 -79 170 168 156 -90 -107 -61 28 66
6692F6j71M34k69J3j22k15L93p4j82K70j13n3j24J75j59J49j77Q2L2P8J09j23
6714A9L3j31M9J90n2j88J84k18N5m3J89k86M4L5L01Qj47K0J1R7k83J89J07k40
6738e7n1J57k07J92j19J6N7j19J54L3r5j15K13j38K8n7P8Q9j71q2L10k33K71k07
6762e3Q5o2No4J58q6L1K10j89j14J16k2J27k39R1M3o8M1l2J81k15J38j53K00k74
6787a45J20j8N2l30J69J24k5J76m5R8o9j63K94l08K03j50J00m3j9ml1j86L14j66
6811e2J29k8j69P7J11J00j02K5m9j30R9J63j31o2J75l41L27oj74K36k11j01J18
6834DQ2K7j24n2L8p7J3m0K14m1r2Rj64K76q6K85k72k17J76Q9j75L3J55k3K5l7
6860B6J10j42j90J16K36j10k0m3J14j69P4j3j38K02K6n4j09O6Pn4j07J49o2o6
$$ plain form
6692 66 -105 329 60 73 -49 -264 129 55 -127 143 30 -23 -147 28 -131 18 -159 -77 -45 33 142 19
6714 19 52 -79 -30 160 108 -80 104 -114 -59 -102 87 -199 -155 -120 181 189 42 62 73 170 -113 76 183 -57
6738 -57 -108 49 -158 34 -85 -69 -12 -131 23 56 -39 -154 59 -79 -51 -108 -30 59 -112 -194 116 -117 154 -53
6762 -53 32 -30 -25 -89 69 -17 14 224 35 -79 37 15 142 -97 -6 37 -31 10 -22 159 -56 82 -71 129 -145
6787 -145 -25 -43 9 -321 -152 -28 -53 123 78 176 107 -56 238 -70 133 -17 83 40 21 17 -14 -200 114 -52
6811 -52 77 49 -120 -43 68 168 66 91 42 -88 11 174 43 -19 156 -185 142 136 -38 198 -13 -114 4
6834 4 86 113 -11 -63 -25 -102 -89 -129 85 44 -48 -39 -203 73 -13 272 0 -217 -41 48 -127 -94 61 38 63 26
6860 26 136 -6 -196 -80 156 46 26 -17 97 -72 2 -11 -149 53 79 25 -84 -18 -11 -65 -172 -23 -85 -151
6884a51O5p9J74K1r0P4L8Jk1q9J08L2j09j78M23M0k20j23l6K08j98L1J56l17Q9
6909a51J70k56L23k11R5O9k71K37M6l42K57O0k71J28K32k58K11KL9l9k0kk7J34
6933A55k65q1K92m2m1J39j61J05j84J49p1N0j33KR8o4J38k24N4K44l17M2J39j03
6957g9m5J26k01M67j50k28J53Q1j27P7nL4k15K0K58p0k01J18K5r6J64k01K9K40
6981A74kj74q7L5JR2j69O4K5j13K29l6o3Q9j09J16j79K02j24R0o3j49J05N2j26
7006a20J27m4q2P5o2J13M1j61j14L33J85m46o8J35J34k32K67L0k48K54k99J03
7028g9J85Rk12K5J47m0J3K4J1k15n9J39K3j43Q1L4K66k84K7k4J49mj16r5K06l24
7054b56J00QJ89p1Q6r5J87j32m6J0m4o5O7R1m5K69k03j62NQ1K35l59k3K68j25
$$ plain form
6884 -151 -86 -165 9 30 -60 14 52 53 32 -57 51 83 -26 -204 219 259 39 -84 -120 88 -110 -79 77 -240 -151
6909 -151 19 -237 86 -125 -30 39 -232 5 51 -291 -34 26 -245 -117 115 -143 68 70 109 70 50 48 21 155
6933 155 -110 -191 101 59 18 157 -4 101 -83 66 -5 45 -88 -86 12 -52 86 -138 -84 160 -157 -115 24 -79
6957 -79 -124 2 -199 268 118 -110 43 124 -3 74 69 103 -112 -92 166 96 -105 13 38 -58 106 -95 -66 174
6981 174 172 -2 -89 -54 -53 39 -130 -66 -41 -154 75 39 -24 65 -44 72 -107 95 -29 61 -2 -151 -46 6 -120
7006 -120 7 -37 -119 -44 -106 7 48 -113 -227 106 291 -155 -223 -88 46 -186 81 111 -137 117 -182 -79
7028 -79 106 115 -97 -72 75 35 48 72 83 -132 -191 -52 -29 -172 -91 -57 209 -75 -48 -72 77 73 -43 -138 68 -256
7054 -256 -156 -148 41 -30 56 -39 148 16 -30 -20 -64 -129 -62 29 -16 253 50 -112 -107 -26 209 -150 -173 95 -30
7079c0M4%%r9lK00J8j72M0l0J55l15J83J4N6K9k60J89j05O7J25k62J80o2N7P5
7105I4k14J02J3K96m45J51L8j27qJ57q8lM8j50Kl1J08m5l6q4l8K25lO7jk25L08
7132A11j70j70M12O3m88L12j66J28j58K01j14K02k97J55P2p7J88j65n7j64k5M09
7154B02m08K76M5k71L63l21M11k01k96J19j2Q3j61J85M5k9k20k1K54q7J9r4J46
7177B7P4l43J04K42m6j22l4q5N9J78jj36l9J10L3m7J07j05J33k20rJ95p0j33o2
7202a90J99j7j88K6J65K93l50K7N4j69J3J01J47J53k83O4p8O8o6J31k2k57P1L36
7226B28k82K93k62j31R0l5J88k8j82k8K24j28J61o8J89j52j96J56l02L91K7j28
7248B5j05K09r0r4l0K2k15L20q5J90n0j46K18J4p6l01j23L55J62l54J43j53J60
$$ plain form
7079 -30 14 14 14 -85 -88 112 130 -42 -2 -32 123 -192 -9 5 61 90 -170 19 -86 -19 106 -156 24 -38 19 94
7105 94 -120 -18 -5 291 -154 -3 35 -92 -100 57 -31 -34 14 -136 -134 -165 -57 -102 -138 -222 -260 -35 -38 29 28 -197 111
7132 111 -59 -229 183 246 -242 70 -96 32 -126 75 -39 163 -134 21 93 16 204 39 -18 -182 -207 202
7154 202 -206 70 115 -156 207 -114 297 96 -200 -81 -93 -10 -171 14 59 30 -190 -211 43 -44 -25 -119 27
7177 27 101 -242 -138 104 58 -64 -98 -183 -124 54 53 -83 -122 -12 21 -26 81 -24 109 -111 -120 75 5 -128 -190
7202 -190 9 -8 -196 -170 -5 288 -62 -35 19 -150 -137 -36 111 264 -19 45 -33 35 -31 100 78 -179 -108 228
7226 228 -54 239 -23 -154 -64 -99 89 61 -121 -149 75 -53 108 40 229 77 -119 37 -265 126 153 25
7248 25 -80 129 39 -55 -85 -63 -278 42 -43 147 97 -49 169 183 107 -194 -317 38 200 -154 -11 -164 -4
7271dj32J31j12J09j62J16J27k64J34N5J59k16k98L60j42K50k01L48o8j43k7o6
7293d6J3jj96J73p7J35%K22j28j83K36k90K47k36N2J96l09K81j08l7k16L02%j77
7317a47K97l95M4K35j21K42j63R6J6j1l12O8L11j87J23k90M7K27m2j26J47k9%
7340C0M6q4J26k31K24J30j30O6k65J88L7n0r8M4j63L61m4p1k8p1J70k21l5J93
7364A24k68J02j56j01J40L5J29M4j24L3K88j74JP1k05J01j70M20k14k24J5K96
7386A63j71MM0j80K45j35N4k46J91o6J56j4j19J11n7k77L57J65k06k37L20Oj69
7409f5K51j44J60k12k59L12J84k2k83j88n1K00J88K1j38k21N09j23L7j48j47L7
7431a02P9P1Q6j80J6M4q6j89K11J43l1J07k4j4j86K46l12K6j10J68J20k26K49
$$ plain form
7271 -4 -136 -5 -117 -8 -170 -54 73 -191 -57 -2 157 -59 -357 3 -139 111 -90 258 190 47 20 -46
7293 -46 -33 -34 -230 -57 -134 1 1 223 95 -88 148 -142 105 -131 -79 117 -192 89 -19 -56 -272 30 30 -147
7317 -147 150 -245 -201 34 -87 155 -8 88 104 93 -219 -151 160 -27 96 -194 -147 80 38 -88 59 30 30
7340 30 76 -8 118 -113 111 241 111 177 -88 100 137 87 -11 33 -130 231 187 116 88 17 187 -34 -69 124
7364 124 -144 -42 -198 -299 -159 -124 5 49 -75 -42 246 72 73 144 -61 40 -130 290 76 -148 -133 163
7386 163 -8 -4 36 -144 101 -34 20 -226 -35 -101 55 41 -78 33 -24 -301 56 221 15 -222 98 104 -65
7409 -65 186 42 202 -10 -269 43 227 205 -78 -266 -317 -117 71 92 -46 -267 242 119 156 8 -139 -102
7431 -102 -23 48 134 -46 -30 14 -72 -261 -50 93 62 169 145 131 -55 191 -121 -95 -205 -37 83 -143 106
7454A06j00M2n3J06J70p8k46L27j51O0L4j66Q0l02K81j69M8JJ0l4J50l41L81j72
7478a6k0j66J72P5k44K05n2m9K41l8Kj4l18K28n8J21l29L45j34o4J18l8j14k8
7502a75J28p0L48l28K08k20M46k45n4L8k53J33O6p9R6P3j81r4K70l7j72J18P0
7525H6n8r8J68jkJ2j25j37j15M13k48K81m00J40K04k9L0k91M10j27J43l45Q2k77
7549b84K35r4K78j20m9K9P3m1k17M02k47l7K8P3l8j10J74j27K85k46P5J09j74
7572b3N3j11N1L01l42rN0k34K47k9J73j67R4k43K75nj48J81K6J6nr3j03m8P8K9
7598A4j45J09J85j81N2N4j38J37J21l40rK60j34J53k44j24K48J57k52K31q1o2
7620A1k9j65L31k07n1j2j26M10j67k46M47m42J54R2m6P7n7M18m03Q1J35j04k09
$$ plain form
7454 106 6 48 -5 101 271 193 -53 274 123 183 217 51 131 -171 110 -59 -11 -10 0 -34 116 -225 156 -16
7478 -16 -36 -202 -30 45 -199 6 -46 -95 146 108 110 96 -222 6 -52 69 -260 85 -49 -113 5 -33 -147 -175
7502 -175 -47 -117 231 -97 111 -109 337 92 38 76 -177 -44 22 -57 39 112 -69 -163 107 70 -102 16 86
7525 86 28 -70 98 97 95 107 -18 -155 -270 143 -105 176 -224 -84 120 91 121 -170 240 113 256 -89 -7 -284
7549 -284 -49 -143 135 15 -34 -5 68 27 -190 212 -35 -72 -44 29 -9 -119 55 -72 213 -33 42 151 -23
7572 -23 30 -81 -30 271 -71 -80 -30 -264 -17 -46 127 -40 54 -189 86 81 -67 114 140 156 151 58 -45 -93 -15 14
7598 14 -131 -22 163 -18 34 88 -50 87 208 -132 -141 119 -15 138 -106 -230 18 175 -77 154 73 11
7620 11 -18 -183 148 -59 -110 -122 -248 162 -5 -251 196 -246 -92 0 -46 31 -26 392 -11 70 205 101 -108
7643a08O9O9n1J26j22j28K09j04k3J20J17k57J67J3j75o7J40P7j6K4L8j87NJ72
7667A08Q0k4l35K62o8n7k56K21K82j95K29l20Q0j8R1k91M45l39J10J05Lj6o1j38
7691a02J97l69K99q3m1J21K2k49K1J85P7j13p2J27m2J53k37j7M14k07m2j69K49
7714A22r3K9k64O8N3K01r6l34M11j66L06l61J76N7j05J88n4J22j83j82L26m51
7736b30J60J6K4j63L7L29j48L5P4k59Q8J26n8L11m66K26j83q3K87k5q0J22rj40
7760iK99k76j7O5ln4j49K65j88l4O2k7Pl8qL4L26k11j7lK32r7j01j03Q9r7J72
7787A19j47m9kp6L83q9j09K8jk90K87p1K21l35J23m4o9N7L4k0l6J28p5k60L34
7812D1r2J00q3q3J49m3L43l87J59j72K68k32q9R9k31M88k31M2j07PK81j55r9J56
$$ plain form
7643 -108 -39 30 -21 105 -17 -145 64 -40 -63 57 174 -83 84 97 -78 -145 -5 72 56 80 118 -69 -64 108
7667 108 188 164 -171 91 23 -34 -290 -69 213 18 247 -73 7 -11 80 -211 234 -105 5 110 113 97 36 -102
7691 -102 95 -274 25 -58 -99 22 44 -205 -184 1 78 -35 -107 20 -22 131 -106 -123 291 84 42 -127 122
7714 122 29 58 -206 -138 -85 116 20 -314 97 -69 237 -124 52 109 4 192 138 260 77 -105 221 -230
7736 -230 -70 -54 -30 -193 -156 173 25 60 134 -125 -37 89 31 342 -124 102 -81 -164 123 98 18 140 131 -9
7760 -9 290 14 -3 62 59 5 -144 121 -67 -101 -39 -66 -59 -97 -105 -71 255 44 27 24 256 159 58 -45 44 -53 119
7787 119 -28 -77 -79 -155 228 139 30 58 57 -233 54 -17 204 -131 -8 -52 -121 -64 -30 -50 -86 42 -33 -293 41
7812 41 -51 49 -34 -117 32 -11 332 -55 104 -68 200 -32 -121 -22 -253 235 4 46 -61 -54 227 72 -27 129
7836A29k75K01k26J62rn7J01J42j87P9k23K69l03L64k86J02J82k68J82m2j49M34
7858C22k88J32r9J72l23rk5J34p1K46r6m6L6j32j35K00J06j54J46r9k3j50J48
7881hK36l53J43j35R1Q7r6K6j44n3K75q8J05J64l08P1k15L16j06l9J26Jk15O6
7905e3J23J95l09O9j2J75l9J4j47J25k04jK36k04m9N0M3j09J42l32K18P0O0k06
7929a45L28j35k68L18j96P1R3J36j87j22K41k88K21q4o5k0K08j32R7j27L2K7k56
7952b53K68r0L17k33p1O7JO3j15M7J61j84J22k3n4NKo5P4J46O2l26J31J82j48
7977H6q1j65J58J47k3J2k5l13L27j24J05q8J17pk7m9j32k9N2J43j90j02K79K08
8001B79k77QJ75j48j14L21k89K49j54l74L72J15k20J41O1p3j39J86K20l06j65
$$ plain form
7836 129 -146 55 -171 -9 -18 -75 26 168 -19 60 -163 106 -197 167 -119 -17 165 -103 79 37 -112 322
7858 322 34 166 67 239 -84 -93 -118 16 -55 191 95 49 85 -47 -182 18 124 -30 116 17 -6 -156 -8
7881 -8 228 -125 18 -117 -26 61 -35 -9 -153 -206 69 -19 86 250 -58 13 -202 114 8 -31 95 96 -119 -53
7905 -53 70 265 -44 25 13 188 149 163 16 141 -63 -64 172 -32 -81 -31 12 -97 45 -287 -69 1 61 -145
7929 -145 183 48 -220 98 -98 -27 66 202 15 -107 134 -154 67 -17 -82 -102 106 -26 71 -56 -24 3 -253
7952 -253 15 -75 242 9 -62 5 6 69 -46 1 162 -22 100 77 23 28 30 -35 39 185 247 -79 52 234 86
7977 86 5 -160 -2 145 122 134 109 -204 123 -1 104 16 133 126 99 50 -82 -111 -59 84 -106 -208 71 279
8001 279 2 10 185 37 -77 244 -45 204 50 -324 48 163 -57 84 145 72 -67 119 339 33 -132
8022a32K5o0K30j15j27K9J59R0k10J83k06QkK2K26N1l93L35m95M46k30K08J21
8045A63r3k08K14j47P6j51K08j26L3o4Q4PK5K0j33J49j76J36k6J79j19k05Q0N7
8069a7j73J13PK41j89R9mk13K52p0mk05K09J69l08j34J02J62JP0j06j11O7J03
8093F1j4%r7J64j40J2L1l96N49l07K37j04J4K8o8k4j30K40j1J93k16J59k83M71
8117C69m38J39j47J41K67n41J30MK00K2p1l1N1k44J46k32J95r4M2l4L25m08J86
8140b3qJ2j78J44k37K76L5j41J69jj94J6mK10Qmj04J99l04J9m3J78j14K08j90
8165g1j11K21R4m4J28j36MJ00j46j58L12k00O1N1q4K23k51k41J76Q5p4r6K40j73
8189i0p0R3
$$ plain form
8022 -132 -107 -167 63 -52 -179 -150 9 99 -111 72 -134 -126 -128 -106 120 171 -222 113 -382 64 -166 42 163
8045 163 70 -138 76 -71 5 -146 62 -64 -31 -95 -11 -4 21 41 -92 57 -119 17 -9 170 51 -154 -74 -17
8069 -17 -190 -77 -70 171 -18 81 77 -136 116 46 42 -163 46 215 -93 -227 -125 37 38 108 2 -109 -42 61
8093 61 47 47 -50 114 -26 -14 17 -379 170 -137 100 -4 10 38 -30 -54 -184 56 45 238 22 181 -102 369
8117 369 -69 70 -77 64 331 -210 -80 -76 124 146 75 44 95 -149 -3 -235 -40 -134 -92 -126 199 -209 -23
8140 -23 -31 -19 -197 -53 -290 -14 21 -120 49 48 -146 -130 -134 76 84 80 -24 175 -129 -110 -153 25 -89 119 -71
8165 -71 -182 39 133 89 217 81 85 185 39 -119 193 -7 54 105 21 244 -7 -248 -72 13 -61 -157 83 -90
8189 -90 -160 -67
8191f7
$$ Imaginary data points
##PAGE= N=2
##DATA TABLE= (X++(I..I)), XYDATA
0@%%%%%%%%%%%%%Qj6J6j6K3l1L2m0M8n6P2q2R1j07J28j50J70j94K24k56K90l28
35a74L68m14M67n24N86o53P28q09Q95r90J095j209J333j470J623j788J968k168
53a136K390k638K915l229L585l993M469n034N713o544P598q984J0894j3725J8429
68A0710k8208Q8885j03100J7666J36434j13187L3723k6248m6062Q9054j2710r1259
80d4302M2032j0362q070J8752l4232j8411L4706O789j0554j6382J606K4818K3762
93A0152k2490l1364L9370K6334m7600K8886J8788n2894M0775K7253p1276K4456
105i610L4396m4629K1187J2485m5277J4340K6915j1101j2156p301J3708K6277
117A9234j7490k7221J5957K8700K354k2504j3954K1145K5802k5585k1650K5832
$$ plain form
0 0 0 0 0 0 0 0 0 0 0 0 0 0 0 8 -8 8 -8 15 -16 16 -24 24 -32 40 -42 49 -58 70 -80 90 -104 120 -136 154 -174
35 -174 194 -220 247 -277 309 -344 384 -425 470 -520 575 -634 699 -771 852 -936 1032 -1136
53 -1136 1254 -1384 1531 -1698 1887 -2106 2363 -2671 3042 -3502 4096 -4888 6006 -7719 10710
68 10710 -17498 71387 -31713 -14047 122387 9200 42923 16675 -29387 59667 46957 -44302
80 -44302 -2270 -12632 -20702 -1950 -36182 -54593 -19887 -13098 -23652 -40034 -38428 -13610 10152
93 10152 -12338 -43702 -4332 22002 -25598 3288 22076 -30818 9957 37210 -34066 -9610
105 -9610 24786 -19843 1344 13829 -31448 -17108 9807 -1294 -13450 -20751 -7043 19234
117 19234 1744 -25477 -9520 19180 21534 -970 -14924 6221 32023 6438 -15212 10620
129A0620M065j4356J1504j1747k9038L3069K5887m6887j8575L8203O936k4711
141a5030l350j98J2279J8994k5561k2382L3213J0837k5867O757N383p169J0886
154a208k794j0597J630M099J1197n140k4472J8391J5971k6089R302J4248k1039
167a6501J2362J7251k9248N721K8186j9368l088J8950j2766o746J6777k863r493
180h26N910L48k616J409k876p981O620J0834r722j3585P176J6507j0316j6556
194a5674J7363J1960j9437K477J2076j5701Q414J4168j9708N50J7036j2435m220
207c131J1290q704J946J0552r607q874R918Q378r705o227J2514M932j3942J043
221C83R401n172J719N950r253l959J4778n195j5525J1330Q859j3175j930O296
$$ plain form
129 10620 14685 329 11833 86 -28952 4117 30004 -16883 -35458 2745 9681 -15030
141 -15030 -18380 -18578 -6299 12695 -12866 -35248 -2035 8802 -17065 -10308 -4925 -12094 -1208
154 -1208 -4002 -14599 -12969 -8870 2327 -2813 -27285 -8894 7077 -19012 -9710 4538 -16501
167 -16501 -4139 13112 -16136 -10415 17771 -1597 -4685 14265 1499 -5247 11530 8667 -826
180 -826 5084 5432 2816 4225 1349 -6632 -12 10822 1100 -12485 -5309 11198 882 -15674
194 -15674 1689 13649 -5788 -3311 8765 -6936 1478 15646 -4062 -3512 13524 1089 -3131
207 -3131 8159 -545 1401 11953 2346 -6528 3390 11768 2063 -4164 8350 13282 -660 383
221 383 9784 4612 6331 12281 3028 -931 13847 8652 -6873 4457 13316 141 -1789 4507
235D507j0004K892J0433j2428n663J4739k000j2618N821M035k963L850J459p822
249e762j567J2350j122j2074M655J0154q020m175O735o783r86J2416m297j4570
263a3046Q858Q912j0673Q8O582n403L135R704j2612o503J7304K112r608J334L693
278C877k674L495J962q791j054J3327Q90j7002l55J1856j267l697N53n474K163
293b191J2875q126j5080J1979J3613j0787o661N316k434M327O024j1778o303J5024
307E798K835j5179j882P445O32k83l97q595j107J3723j192j3271K765J1786k940
322A38m382J520l323M115J1392n882j4272R272J1493r034n211M659n63K132M747
337F801j0755o489J2911O133j1094m501P172P38L14R91o827k67J4776n7j6314
$$ plain form
235 4507 -5497 -2605 7828 -4600 -10263 4476 2476 -10142 -4321 -286 -3249 601 2060 -5762
249 -5762 -7329 5021 3899 -8175 -3520 6634 -1386 -5561 1174 -5609 -6595 5821 1524 -13046
263 -13046 -4188 4724 -5949 -5861 721 -4682 -1547 8157 -4455 -10958 6346 8458 -1150 184 3877
278 3877 1203 4698 6660 -2131 -3185 10142 11032 -5970 -6325 5531 4264 567 1120 -4354 -2191
293 -2191 10684 2558 -12522 -543 13070 2283 -4378 938 -1496 2831 8855 -2923 -9226 5798
307 5798 8633 -6546 -8428 -983 -351 -634 -1031 -9626 -10733 2990 1798 -11473 -8708 3078 138
322 138 -4244 -2724 -6047 -1932 9460 3578 -10694 -1422 10071 1037 -4174 485 -78 2054 6801
337 6801 -3954 -10443 2468 8601 -2493 -6994 178 916 1230 2221 -4606 -4873 9903 9846 -6468
352f468J758J1918k45n246K34k585J162Q516o727j2092R024J0862r501o178L492
367b076j043K858M061o943n838J0747N310j0711l985Q006K577j282Q56p564q02
382e829J1446j346j2132J937J0083l416o786J151m80k58P399k485j1915O857R065
397C291p222l113N294L20J279M310n400n237R083P088r538l297P814j490k206
412I76K281m519j833Q922q19j1214O46Q263j710n277L511j133k151O816k232q256
428g729O187Q039o105l431L703O80j101M089j812o256P507M424r812j300Q066
443E149j087k916K566k356j602M877J194o491J369Q425n257m884O158j316l834
458eO384j147o489K977K961m505k343N460j769m297M198j085o179N333L777p069
$$ plain form
352 -6468 -4710 7208 6963 1717 1951 -634 528 9044 2317 -9775 -751 10111 610 -5568 -2076
367 -2076 -3119 -261 3800 -3143 -8981 1766 7076 -3635 -7620 386 2963 1681 2537 -5027 -5829
382 -5829 5617 4271 -7861 -5924 4159 743 -6043 -4892 -5372 -5630 1769 -716 -12631 -5774 3291
397 3291 -3931 -7044 -1750 -1430 -151 4159 -1241 -6478 2605 9693 155 -3142 4672 3182 976
412 976 3257 -1262 -3095 5827 5008 -6206 -5560 2703 993 -4284 -773 -1906 -4057 2759 527 -7729
428 -7729 -1542 6497 392 -3039 664 1344 243 4332 2520 -3736 3771 8195 -1617 -2917 5149
443 5149 4062 1146 3712 1356 -246 4631 5825 -666 703 9128 3871 -1013 5145 3829 -5
458 -5 6379 5232 -1257 1720 4681 176 -2167 3293 1524 -2773 1425 340 -5839 -506 3271 -3798
474c798P58M118k253k491K870J293l270L353J581n957J121O498n160k765O898
489B796j344m520K219J714l769J658N191n230k392P741k577n658O761J589m210
504c1L260O92l768J383N121k408m003M631J815n488J549K187m643L441L289o758
520B69k461O129M57o424J675L667l391r46L293n557r02Q259l347o117K574J688
536a134k118n20R6k676J687M125n652o139P755L242o056P05J819j022J384K397
552b107k966j621P683J629p211K125N512l710K423L534n476L27N792j376n542
567i84J686L797n68j632j127k731K287O098n775m846O203L023n011k068K921N40
583A813R04K032m348m510P961K410r191J038M773k130q34k99m163P71O123k287
$$ plain form
474 -3798 -3040 1078 -1175 -3666 -796 497 -2773 580 2161 -3796 -2675 3823 -1337 -4102 2796
489 2796 1452 -3068 -849 865 -2904 -1246 3945 -1285 -3677 4064 1487 -4171 2590 4179 -31
504 -31 3229 3921 153 1536 6657 4249 246 4877 6692 1204 2753 4940 297 3738 7027 269
520 269 -2192 3937 4394 -2030 -355 3312 -79 -1025 2268 -3289 -4191 4068 721 -5396 -2822 -1134
536 -1134 -3252 -3772 -3676 -6352 -4665 -540 -6192 -12331 -4576 -1334 -7390 -6685 -4866 -5888 -4504 -2107
552 -2107 -5073 -6694 989 2618 -4593 -2468 3044 -666 1757 5291 -185 142 5934 4558 -984
567 -984 702 4499 3931 2299 1172 -1559 728 6826 1051 -3795 2408 5431 420 -1648 1273 1813
583 1813 2717 4749 401 -4109 3852 6262 -2929 -1891 2882 752 -82 -381 -4544 -3773 2350 63
599F3o830K232M471l268m62J201k444K758M181m642m528N785M374l829j724K757
615I5p72L02L193m018k681P317J303p051n53M379l76l00P58k698m80N625j155
632B888o765L511M611k301q63l0k008J435M269l042m885M443M109n709j665L170
648A168j115O72K103l602l103M811K343m742j004M024l27j114J198l612k67O912
664D345j408o410K432L891k607j109J301n96p6K980k080m666M008L477l811o90
680a019K654j721n65K971j778k770L966K498n134r60L394j186j13J767k987j536
696b519M283r42m549K162L260k315j417K009j550j131L461o53k915K000K571k999
712a244q71K717p06r03L015j187l660K954J969l625M44K695k320j006K713k027
$$ plain form
599 63 -6767 -4535 -64 -3332 -3794 -2593 -5037 -2279 1902 -2740 -7268 -1483 2891 -938 -2662 95
615 95 -677 -375 2818 -1200 -3881 3436 4739 -2312 -2865 1514 1138 838 1596 -1102 -1582 4043 2888
632 2888 -3877 -366 4245 1944 1081 1051 -957 478 4747 1705 -3180 1263 5372 -337 -2002 1168
648 1168 53 725 2828 -774 -3877 934 3277 -1465 -2469 1555 1228 114 1312 -2300 -2567 4345
664 4345 2937 -3473 -1041 2850 243 -866 435 -161 -237 2743 663 -4003 5 3482 -329 -1019
680 -1019 1635 -86 -651 2320 542 -2228 1738 4236 -898 -1858 1536 350 237 2004 -983 -2519
696 -2519 1764 822 -3727 -1565 1695 -620 -2037 -28 -1578 -2709 752 99 -2816 -816 1755 -1244
712 -1244 -2115 602 -104 -1007 2008 821 -2839 115 2084 -1541 -1097 1598 -722 -1728 985 -1042
728a042j356L439P04l536R97K715k936k09L496r86k091K550K40k973J909J797
744B718k335k79L145k558k297L124k47k455K152J148l598O21K376k389j082L518
760A562l61l486J530P61k014J804J453k749m80L294k077k357K340J576k077J09
776a172J372k774N07L199j618k265L420O83k983J298J020j651J193K959k999k057
792a868L560K23k856J165J318j641J333J72l222K96M080p33l757J646J809j779
808b54J89J128j764R60L059k337k856K535K192k167K46Q67k124J019J690k652
824b69j994L672J137l866o8P09m39J166Q10k959k34M025j177l607J514L020j402
841C8J65N51k230O08L250j489l124K611J695k112q12P13j292J616K220l457k175
$$ plain form
728 -1042 -2398 1041 1745 -1791 -794 1921 -1015 -1224 2272 1286 -805 1745 1985 -988 921 2718
744 2718 383 104 3249 691 -1606 1518 1271 -1184 968 2116 -1482 -861 1515 -874 -1956 1562
760 1562 1201 -2285 -755 6 -2008 -204 1249 -1500 -1980 1314 -763 -3120 -780 796 -1281 -1172
776 -1172 200 -2574 -2067 1132 -486 -2751 669 1352 -1631 -333 687 -964 229 3188 189 -1868
792 -1868 1692 1915 -941 224 1542 -99 1234 1406 -1816 -1520 2560 1827 -1930 -284 1525 -254
808 -254 -65 1063 -701 259 3318 981 -1875 660 2852 685 931 1798 -326 693 2383 -269
824 -269 -2263 1409 2546 -1320 -1388 -679 -1118 48 858 -2101 -2335 1690 513 -3094 -1580 1440 38
841 38 203 754 -1476 -868 2382 893 -2231 380 2075 -37 -849 -136 -1428 188 2408 -1049 -3224
858c224L515R67k767M52J415q32O51N83j986o69M008K40l799J178J603r60K39
875F14P54j769j73L338j540l852J820K701k014l34P21j584J043J952k379j676
891b378L550R43k551k8J096m05L63J935k158r58L116m01k758O39J862q93j27J56
909A003j902m31K686m28l122J310J801k015m09O30j235J023K027k309j946K305
925a012J256k096K69K101j726J89J418j577j067K602N24j875K43Q97r24m1J918
942A099j681r64K615k77l049J576J580j586N68O15j194K18J866n35j583K301P02
959B271k048O36J344j709O46J657q36j088O51P17j692L29J548j924l20J638j950
976a30j369J958k88j550P99M16j924Q7J742j418r29K438l39j835J249M42j481
$$ plain form
858 -3224 291 1258 -1509 -1057 358 -474 177 760 -1226 -1895 2113 2353 -1446 -268 1335 375 614
875 614 1368 -401 -574 2764 1224 -2628 -808 1893 -121 -455 266 -1318 -275 1677 -702 -2378
891 -2378 1172 2115 -436 -464 632 227 590 2525 367 -591 2525 2124 -634 5 1867 974 847 1003
909 1003 -899 -1330 1356 928 -2194 -884 917 -1098 -1507 -877 -2112 -1089 938 -1371 -3317 -1012
925 -1012 244 -1852 -1583 518 -1208 -1019 399 -1178 -2245 357 881 -994 -751 146 -778 -819 1099
942 1099 -582 -1546 1069 792 -2257 -681 899 -687 -119 496 -698 -480 1386 851 -732 1569 2271
959 2271 223 859 2203 494 1140 2797 1961 873 1524 2241 549 878 2426 502 182 1820 -130
976 -130 -1499 459 171 -1379 -580 -164 -2088 -2001 -259 -1677 -2606 -168 -507 -2342 -1093 -651 -2132
993b132J493R51j651j90J508J71j708R66J107j323N20O91j887K26K342q63j272
1010a051Q06Q66j058K26R78j319N05K970k176j952K300L41o54M15m48k67J022
1027A504L27j699n71K439J07k298Q4Q56j278J123L37j311j43J543m25j992O63
1044g34J394p51M69J52k287R88K647k000j508J336Q27o12o88k21k24J318J063
1061A169j974j463K456M85k007K29Q02J22J92K19j460m52K828O8k291O60J079
1078F62j027Q06J35k000J611J911j747j837J133J471n91k94j37q46J227J180k749
1095a092m26K290N93r98j280M44L46L39R73j525j108K465K92k810N38J365p2M33
1113G67m40j770Q37K328j174k017J301J482j060j61k1r07J317J339j472j594J267
$$ plain form
993 -2132 -639 312 -1339 -1529 -21 150 -1558 -592 515 -808 -288 403 -1484 -1258 1084 221 -1051
1010 -1051 -245 621 -437 -211 767 -552 -47 2923 747 -1205 1095 1436 782 1197 749 482 1504
1027 1504 1831 132 -439 2000 2107 -191 -107 749 -529 594 931 -380 -523 1020 595 -1397 -734
1044 -734 660 -91 378 530 -1757 -769 1878 -122 -1630 -294 533 -79 -767 -988 -1212 106 1169
1061 1169 -805 -2268 188 673 -1334 -1105 -303 -181 11 230 -1230 -1682 1146 1214 -1077 -417 662
1078 662 -365 441 576 -1424 187 2098 351 -1486 -353 1118 527 233 96 -750 477 1657 -1092
1095 -1092 -1518 772 1365 367 -913 -469 -123 216 1189 -336 -1444 1021 1313 -1497 -959 406 334 767
1113 767 327 -1443 -606 1722 548 -1469 -168 1314 254 93 72 -835 482 1821 349 -1245 22
1130B2R94r43n58P08k26J50R35k070n21K339K87j686n14J011j0j5Q4q96N02J960
1150A553j154k066J473Q68p63J19J19q63M73R99q55j102J058J425j507n75N56
1167b42m29N21J043j223o33J521K66j654N6J498p85L41M49j377k2J821o20j111
1185e80R24N43q07J19j8m03L52J055l97j442R03N85q01pP82m38k55M41q38n74
1205h56J270O13j648O05N87j236j03J177p69l70R87n28q05P80K71p70M43Q78j155
1224f29n10Q83K49n00L92M14q85K4P34q47J7R28j17q30O60J43j012Q62P99j242
1244d67J16J186p67n51L99L99l11O74j24j112N95R19n12r27J046L5l97L07m24
1263H4m52N30J028q10r65J313o7o42K01L33q48J266P3j259k59J488k3j020K65
$$ plain form
1130 22 1016 73 -485 223 -3 147 1082 -988 -1509 830 1117 -569 -1083 -72 -82 -97 -13 -909 -407 1553
1150 1553 399 -1667 -194 674 -89 30 149 -714 -241 758 -97 -1199 -141 1284 -223 -798 -242
1167 -242 -671 -150 893 -330 -963 558 824 -830 -774 724 -61 280 729 -648 -670 1151 531 -580
1185 -580 344 887 80 199 181 -222 130 1185 788 -654 249 834 33 26 808 370 115 556 -282 -856
1205 -856 414 1027 -621 -16 571 -665 -768 409 -360 -730 257 -271 -1076 -296 -25 -795 -352 526 -629
1224 -629 -1139 -256 -7 -507 -115 299 -586 -562 172 -675 -658 270 153 -677 -17 126 -886 -24 775 -467
1244 -467 -351 835 68 -483 -84 315 4 678 554 -558 37 956 444 -483 563 598 201 508 84
1263 84 -368 162 1190 380 -585 728 661 19 220 553 -295 971 1044 -215 -474 1014 991 -29 236
1282B36K06k97N83k46r75L88J247j086j038J86R31m46J42j59r42P96Q60q07j467
1301a888J372J241n73n71j59j77J280L30j620l1J814L7j441k40O48L45N27o74
1319B20j427P92J440o49j199M75L72J55j59n71l13R26J389j448j192J016J099
1336I26m82n03j25L53J079n9j501n20J926N32j207l87J73K78Q7j29j315P55J325
1355A206n79j486k4J264k11m8m47q60R87P14q31j259R78J160n31p50j1J19O37
1374B8N29j619k42J537K75j334q6M40L41L74m47r96J40J692k20j501M68R21R6
1393C96j62p85l7R72Q84r58r82R49R60o46m79J06K01M92L30j476k57R20N80o84
1413C24n67N49j29R6N05j326M37J228m26r79P8N17K67j47j98k77K64N97o07r07
$$ plain form
1282 236 442 145 728 482 -493 -105 1142 56 -982 -796 135 -311 -169 -328 -1270 -474 386 -421 -1888
1301 -1888 -516 725 152 -419 -578 -755 525 855 -765 -796 1018 1055 -386 -626 22 367 894 220
1319 220 -1207 -415 1025 376 -823 -348 24 179 20 -551 -864 62 1451 3 -1189 -173 926
1336 926 444 -59 -184 169 1248 1189 -312 -832 1094 1626 419 32 205 483 570 441 -874 -119 1206
1355 1206 627 -859 -883 381 170 122 -325 -1185 -198 516 -315 -1574 -596 564 33 -717 -728 -609 28
1374 28 557 -1062 -1304 233 508 -826 -912 -472 -131 243 -204 -1200 -1060 632 412 -1089 -621 300 396
1393 396 234 -551 -588 384 1268 310 -672 277 1237 591 112 218 419 911 1241 -235 -492 428 1008 324
1413 324 -243 306 177 273 778 -548 -111 1117 691 -288 -210 307 574 427 229 -48 216 813 206 -701
1433g01J207J67o17k63j41j97P7L36n18l52P13J40p77j42O66m14O17J76o83l09
1453a015P66J63l37K54M56l4m05K43m11L33O30m07o53P08K45o63J14M62j19L4
1473C64J56m21j70N57j06m15K02M56n82j89N09l16K95M7Nm12K21L28q12M86M72
1494F75m24n14K84j97K90K06K7l92k9K04k41p38P31J12l29N82l35m75L72K78k43
1515a56l36K04L12m00O0l35K82Q13kj390L1J040M1l01m04N41K93m07m6p81R05
1536c6P21q17n87M82N23r7k9o30N49J72J94n28o81J025L07l96q0k20k19Q51L0
1557E34j071J41R32O78j427k98N18M67L24n54j133Q74R27j082m84O17L95L52n42
1576A68p52J88O31N08p60o43R63J33m66j94l99N50N25m98o49k21J025M19j209
$$ plain form
1433 -701 506 673 56 -207 -348 -545 -468 -132 -650 -1002 -289 -149 -926 -1068 -402 -816 -199 -23 -706 -1015
1453 -1015 -249 -86 -423 -169 287 253 -152 91 -320 13 643 236 -417 291 536 -127 -13 449 330 364
1473 364 520 99 -71 486 380 -35 167 623 41 -148 361 45 340 387 392 -20 201 529 -283 203 675
1494 675 251 -263 21 -176 114 320 347 -45 -74 130 -111 -849 -118 -6 -335 247 -88 -563 -191 87 -156
1515 -156 -492 -288 24 -376 -316 -651 -369 444 442 -948 -917 123 164 -137 -541 0 293 -114 -160 -941 -36
1536 -36 685 -132 -719 -237 286 189 160 -470 79 251 445 -83 -764 261 568 172 92 -128 -347 504 534
1557 534 -537 -396 536 1214 -213 -511 7 474 798 244 -889 -15 912 -170 -654 -37 358 710 168
1576 168 -584 -396 235 743 -17 -660 303 436 -30 -224 -623 -73 452 -46 -695 -916 109 528 -681
1595f81n7M62K50K72o92q83J018P52k00r91J05N86R1q4o17O8J048M67j125n86
1615g97Q48O73k31p20k19P27M42j79j034L06J150J43j280J11K5O55j5m45l71L63
1635A52N41j66q87l4R61j63k01o29j30J076L21p38n22N34R94o82p45J89M77J94
1655E42K17j054N0O18J88p06l29N70K33k76m05m05L88Q46m71n53J06N1K01n8l26
1676e73l6P01J9n75m40N33P14k35n38K12J74K98k29m57o9J035J13m99l00L37J83
1697C68O6r6o28L40L87l83m50K31M86J39l94l28j14N76R6k10l63M74N4m2n05M54
1719A58K1J64K55n85o0L06J80j20l45L15Rk05k6l07Q1M77m4l97k27L28k33o9Q3
1742b41K53J53j22r5l68M61Q6m40J91J2q8k9k15K22J9M16l80p4J94p9K4j61L08
$$ plain form
1595 -681 -738 -276 -26 246 -446 -1329 -311 441 241 -750 -645 -59 32 -52 -669 -601 447 914 -211 -797
1615 -797 51 724 493 -227 -446 281 723 544 -490 -184 966 1109 -171 -60 -35 620 605 160 -211 152
1635 152 693 527 -360 -394 567 404 203 -426 -556 520 841 103 -419 115 1109 427 -318 -129 348 542
1655 542 759 -295 -245 373 561 -145 -474 96 329 53 -352 -757 -369 477 6 -547 -441 -390 -189 -247 -573
1676 -573 -609 92 111 -464 -904 -371 343 108 -430 -218 -44 254 25 -432 -501 534 647 148 -152 185 368
1697 368 434 338 -290 50 437 54 -396 -165 321 460 66 -262 -376 200 296 86 -277 197 251 209 -296 158
1719 158 179 343 598 13 -47 259 439 319 -26 289 298 93 67 -240 -159 318 274 -123 -350 -22 -255 -324 -241
1742 -241 12 165 43 -52 -420 41 127 -313 -122 -110 -198 -227 -442 -220 -201 215 -165 -239 -45 -124 -100 -261 47
1765D7N7k81K05q4pK54j9%j35K65n2l02J61J09j5N32l17p11L52N13k3o30j18K97
1789I8K83m00l6j10K17L43o98l2L38M37j82j46k38K22L45k12m34q9N37L80r42
1810c19j6M5K80K23n59m4J15M77m22m55P0L69K09o54P4K8N39j25l24k03M12M79
1832A99l33k56j48L11O26j45n22M2N42Q5n98k30K61M84J01n09j55N7N83l34l50
1853b89r0O94j99k45l2J99K98K00n18l22N34L56J2l72k98N35K22m38o13K14O05
1874D53L88p72k20J90L26Q8q06j32M98L86l36n46J03M05N08o18k73R4K50M79p79
1895c14k94N20P26n21m82j19M35N41l57l97k33J017l49m59J10Q3K86J42m58k19
1915c42L10N57l88j78o6N33r1m20M5m45Q83n8l42m15L84L06J34n13J87L96o4j45
$$ plain form
1765 47 104 -177 28 -56 -63 191 172 172 37 302 250 -52 109 218 203 735 418 -293 59 572 549 -81 -199 98
1789 98 381 -19 -55 -165 52 395 -303 -335 3 440 258 112 -126 96 441 229 -205 -294 243 623 -319
1810 -319 -335 -290 -10 213 -346 -390 -275 202 -220 -675 -605 -236 -27 -681 -607 -579 -40 -165 -489 -692 -280 199
1832 199 -134 -390 -538 -227 399 254 -268 -226 316 401 -197 -427 -166 318 419 -90 -245 -188 395 61 -289
1853 -289 -379 315 116 -129 -161 38 336 536 18 -304 230 586 598 226 -72 463 685 247 -366 -152 453
1874 453 841 69 -151 39 365 453 -353 -485 13 399 63 -483 -380 25 533 -85 -358 -264 -14 465 -314
1895 -314 -608 -88 638 117 -365 -484 -49 492 135 -262 -495 522 173 -286 -176 -93 193 335 -123 -342
1915 -342 -32 525 137 -41 -107 426 335 -85 -40 -485 398 340 -2 -417 -33 273 407 -106 81 477 413 268
1937B68n63J96N38m0k26n50L27M06k89p2n9J74K58k04n00O5M97k38K1l38K34n7
1959a52J5p9L0K3J95J4n06K45r2M16l63l3K7RJ52M5l37J08N04k67k50j79K34K30
1983a1Q0o34L90Q3j0k02n1N32k46M01k99m20O25j04l09L26J23o3R3k88n5J42O1
2006A64L82k81p4p5N7M5J54J59l46P5k40rl7L86j03q1j17J54m52L22k18N0L18
2029B33k28j74J24K27p0j85n0N04l37l8L6m35N11J4l42O4J59n1m0l43J49O7K70
2052F5k95k1p6J68J15qm3r0K14o7K9k84K16K02j34l63L22o9K41o1mq8L36n4l53
2077a02k7L32K47j97j28l82M21Q1L3m22K36Q9j17k72k08M46K64k34j63k17J91
2098a29L38l10l32K94K29J64l41j72o0L98Ll04j20J08N33m00k22k10P53J38j61
$$ plain form
1937 268 -295 -99 439 399 173 -377 -50 356 67 -5 -64 110 368 164 -336 -271 226 -12 9 -329 -95 -152
1959 -152 -137 -216 -186 -163 32 46 -460 -215 -307 109 -254 -287 -260 -251 -99 -54 -391 -283 221 -46 -296 -475 -241 -11
1983 -11 69 -565 -175 -92 -102 -304 -355 177 -69 332 33 -387 238 134 -175 151 274 211 304 16 -39 103 164
2006 164 546 265 191 116 173 218 372 531 185 260 20 11 -26 360 257 176 59 213 -239 83 -135 -85 233
2029 233 5 -169 -45 182 112 -73 -123 381 44 6 42 -393 118 132 -210 -146 13 -38 -78 -421 -272 -205 65
2052 65 -230 -251 -327 -159 -44 -52 -95 -185 29 -38 -9 -293 -77 125 -9 -372 -50 -119 122 61 57 -31 305 251 -102
2077 -102 -129 203 450 253 125 -257 164 245 278 -144 92 181 64 -208 -416 30 294 60 -103 -320 -129
2098 -129 209 -101 -433 -139 90 254 -87 -259 -319 79 82 -222 -342 -234 299 -101 -323 -533 220 358 197
2119A97n54l0P18J18l13l68oL00L2n15K42J14K95k28l48M6K51M64n63k23K94Q1
2141DJ16k64l65N76M59j26m26j38K95K14K0o46J83N69P3n44o9L69J80lm00k91
2163b14N11N2l62j05J38K30O6j94l64M9N06j17l43k1J44J33L6k31j73O16L8k02
2185A93m56l5K99ml7l17J82L50j02m93P0J88J36n3n54K7O11j08k90M7P1J94J09
2208B8k78l37M83K51N5o55J03K10M00j30l06p6L27j06r8j88J49K88k8j99k41K30
2230a18K02Mk54J12J65J71k06j04kL20N2O5k71r8J63j49l3j19K27J98l31j89j2
2253b07M17P3m71K3K28R6l83N2L3J85R8j05j35k72J58J18K00j81p2J72j9j8l57
2276c67L77K09j09j69p0K57j77ol37M94m6J0j81k10J15L9Q3M9J3N4j06l6J82n
$$ plain form
2119 197 -357 -387 331 449 136 -232 -238 62 94 -421 -179 -65 230 2 -346 -300 -49 415 -148 -371 -77 4
2141 4 120 -144 -509 67 526 400 -26 -164 131 345 365 -281 -98 471 544 0 -69 300 480 477 77 -214
2163 -214 297 349 -13 -118 20 250 316 122 -242 -193 313 196 -147 -168 -24 109 145 -86 -259 357 395 193
2185 193 -263 -298 1 -3 -40 -357 -175 175 73 -420 -350 -162 -26 -79 -633 -606 5 -103 -393 -346 -275 -81 28
2208 28 -250 -587 -104 147 202 -453 -350 -140 260 130 -176 -252 75 -31 -129 -317 -168 120 92 -107 -348 -118
2230 -118 84 88 -166 -54 111 282 76 -28 -30 290 342 407 136 38 201 52 19 -100 127 325 -6 -195 -207
2253 -207 210 283 -188 -165 63 159 -224 -172 -139 46 144 39 -96 -368 -210 -92 108 -73 -145 27 8 -10 -367
2276 -367 10 219 110 -59 -129 128 -49 -55 -392 102 56 66 -115 -325 -210 -171 -88 -39 -26 28 -78 -114 68 63
2300F3k7J43Q2Po9l60N28n1j44O4j46nJ39j51r0j66K44m9m5J98r1qR8p3m8J2j41
2327h6K97RK9r9N1p8l05R0rK01NK9l50k96Q05k07l30M01q6j78L71m53K97l0M3
2352A21l52J2q2K85k14rrPK08j61j74J21P9L73l75k71P3N86m6q4l44K57K37j35
2376A03j31k11K27J22j48k27K96J69j25k58p4K78J99j35J92m48L19P7m8j92K53
2397B38j93K61j22k91pL89m2l07K8r7K77j5j66j50M53j50j41k70M01j39Ok32J77
2420i2j0J97j95k1q3J41K47j63k11j99K27K55j50k66J02K94K34l02k55N29n7r4
2442A28j84j78K62k8J7k18J21K17K77m27j79K75M08j36m65M5L1K44P4m11P4L36
2464B83N0j18j78K99nL4j08n58J12J87J78q0j96J55Q7k92J48k58N55j56k65l8
$$ plain form
2300 63 36 179 261 268 199 -161 367 316 172 236 90 85 224 73 -17 -183 61 12 -33 165 74 66 164 91 43 55 -86
2327 -86 211 220 249 150 201 123 -182 -92 -101 100 105 134 -216 -512 293 86 -244 157 71 -107 264 -189 108 78 121
2352 121 -231 -219 -301 -16 -230 -239 -248 -241 -33 -194 -368 -247 -168 205 -170 -441 -368 218 172 88 -256 1 238 103
2376 103 -28 -239 -12 110 -38 -265 31 200 75 -183 -257 21 220 85 277 -171 148 225 177 -15 238
2397 238 45 306 184 -107 -114 275 233 -74 -46 -143 134 119 -47 -197 256 106 -35 -305 96 -43 -37 -269 -92
2420 -92 -102 95 -100 -121 -204 -63 184 21 -190 -389 -162 93 -57 -323 -221 73 307 5 -250 279 222 128
2442 128 -56 -234 28 0 17 -201 -80 137 414 -13 -192 83 491 355 -110 -65 -34 210 284 -127 -53 283
2464 283 333 215 37 336 331 365 257 -301 -189 -2 176 96 -100 55 142 -150 -2 -260 295 139 -126 -164
2486a64K9M4R9l13J44j38K49P3l43Q1K12L5K4l59J00K91j90o9J72J56l06L23l30
2509a80jK20K0K15k95N9j92J65L2o1q0M08k74J04j88j59L68O1l09R8J4J89k48
2532c4JP2J82j73j27J45MJ46R8l00j25L50o7j44K67k18J27o6M9p5l8j87j4M04
2556B77l38L12k41L32m65RQ9j1K16k12j99M0J00j52R8O0j30J69M4j43PL1j19J60
2580f6L8j34M2m5L36j07j87K69k12QO0j99J51M8J17p7r7N3J86j66Q4L7Qj46J36
2605A37m72K60M30j36k74N2r0R8j98K06j78K63j18J1J1k03J53K69o9j34k4L17
2627C11o4k73J2K19j98p7PR7q4L9P4k19K7L2J87j20k09L24o6j99J43OM7o2J4k7
2653e9l2R4j5o1k44J95p9J34q7L31m17K18J40l51R0L27j07k98m9J51K29K6j11
$$ plain form
2486 -164 -135 -91 8 -305 -161 -299 -50 23 -320 -239 -27 8 32 -327 -227 64 -126 -195 -23 133 -173 150 -180
2509 -180 -181 39 59 274 -21 38 -154 11 43 -18 -98 310 36 140 -48 -207 161 222 -87 11 25 214 -34
2532 -34 -33 39 221 48 -79 66 70 216 314 14 -111 239 172 28 295 77 204 138 187 112 74 -113 -127 277
2556 277 -61 251 10 342 -123 -114 -25 -36 180 -32 -231 -191 -91 -243 -145 -85 -215 -46 -2 -145 -138 -107 -226 -66
2580 -66 -28 -162 -120 -165 171 64 -123 146 -66 -58 2 -197 -46 2 119 42 -55 -2 184 18 102 139 147 1 137
2605 137 -335 -75 355 219 -55 -3 -93 5 -193 13 -165 98 -20 -9 2 -201 -48 221 152 18 -6 311
2627 311 247 -26 -14 205 7 -70 -63 34 -50 -11 63 -156 -129 -97 90 -30 -239 85 19 -180 -37 -31 16 -46 -32 -59
2653 -59 -91 3 -12 -73 -317 -122 -201 -67 -154 177 -240 -22 118 -233 -143 184 77 -221 -270 -119 110 136 25
2676B5n7J03m1K09j83j59L03N6k35j25R8J51J00p4o1k70K56K08k69j29J22j02
2698g4K53l59m3L68L9j19q9p3P5J70J0m5j19K76j56J67m44R7L02m05J8j71L65
2721D3j67Q9k95J16J34K08j05j20n5J16k8Ol1M0j83K63o2o9nl2oL5L4j31L70k30
2747f5l2n4K67r5j16Q8j34K10j83J52j27pJ8K61p0j26R7N2j79K1J65m5KP1k07
2772c6l8R5j14J52M4J17O8l24k44K23J64L9mj26j63J99n2K0j15J26j13J9j14m0
2796b17J5O2L3Jj3RO6j14K11o1n2j40J28J06l4OP0J6j43J42k71K69k71r9K20k6
2822h7J70j83j68J45K64n0q6q5J58J13k15j9J03K9k0l5n8j12L43k31K82l11L4
2845a9R7p5J35j12l9mK73j23l23J57K68p0J22l29K0jo1j6J86L0N0j32j20J71k6
$$ plain form
2676 25 -32 71 30 239 56 -103 200 256 21 -104 -6 145 245 171 110 -160 96 304 35 -94 28 -74
2698 -74 179 -180 -223 145 184 65 -24 -97 -22 148 158 113 -6 270 114 281 -163 -66 236 -169 -151 -322 43
2721 43 -124 -35 -330 -214 -80 128 23 -97 -152 -36 -64 -58 -89 -49 -232 31 -31 -100 -105 -137 -143 -108 -74 -205 165 -65
2747 -65 -97 -151 116 21 -95 -7 -141 69 -114 38 -89 -96 -78 183 113 -13 84 136 -43 -22 143 98 100 171 -36
2772 -36 -74 21 -93 59 103 220 288 -36 -280 -57 107 146 142 16 -147 52 0 20 -95 31 -82 -63 -177 -217
2796 -217 -202 -140 -107 -106 -119 -110 -44 -158 53 -8 -60 -200 -72 34 0 6 76 92 -51 91 -180 89 -182 -281 -61 -87
2822 -87 83 -100 -268 -123 141 91 5 -80 78 191 -24 -43 60 89 69 34 -24 -136 207 -24 258 -53 -19
2845 -19 78 3 138 26 -13 -17 256 133 -190 -33 235 165 287 -42 -22 -23 -84 -100 86 116 166 34 -86 85 59
2870E9O3m43K07k0K08k50j10J90J02K29l92r5J36J17j05J45k08L00j94M9k79K8
2892b63M25O6q9j42r6K93l14P5n5K31N5k62L50l97J11O0r4J0K50jq3j43K51k35
2916CJ32q8k70R4K47p1J11o9k12J67J51j21n7j06K17L53m72J27n9k08K32l8j37
2939g4K56r3mj31N0j05j33J65K29k21o6K96l25J22p5L18r6j01L0r0j10J98j99
2962a59L4K63j2j7k6r6j11M06J2l97N6J80pk69K58j36J53o3j76K06M9j04K17j57
2986A04j93J56K56l33J29k70K57k5j19j7J72q2K67j17j98j11J1K77p1J7n8k19
3008a67K88k22J35K65k60j92KK20n7j04J8j1J95j69p4M29l91K64j37j52Pl3j33
3031b79J12K77j4j84J26m1O3j34J51j52L25k88l14K65Q3j74J47r0K84l14O4L12
$$ plain form
2870 59 122 -321 -114 -134 74 -176 -286 -96 6 235 -157 -252 -116 1 -104 41 -167 133 -61 -12 -291 -263
2892 -263 162 228 139 -3 -99 194 -120 -45 -100 131 186 -76 274 -123 -12 48 -46 -36 214 213 130 -13 238 3
2916 3 135 47 -223 -129 118 47 158 89 -123 44 195 74 17 -89 128 481 9 136 77 -131 101 63 -74
2939 -74 182 89 85 -46 4 -101 -234 -69 160 -61 -127 169 -156 -34 -109 209 113 12 42 -48 -158 40 -159
2962 -159 -125 138 126 109 83 -13 -124 282 294 -103 -47 133 126 -143 115 -21 132 69 -107 99 148 44 261 104
2986 104 -89 67 323 -10 119 -151 106 81 -38 -55 117 35 302 185 -13 -124 -113 164 93 110 52 -167
3008 -167 121 -101 34 299 39 -153 -151 69 12 -92 -74 -85 110 -59 -133 296 -95 169 32 -120 -113 -146 -279
3031 -279 -167 110 96 -88 38 -3 60 -74 77 -75 250 -38 -352 -87 -4 -178 -31 -121 163 -151 -87 225
3053B25k14Q1K59l25P3k06o0K15J37N6j87M2k3nL2j9M3j52L29l18r4J83l41M78
3077B09l85K95O4k48M0k9K07q5J35l84J79J02L6m5n5N8j71J15j53K5n3P7J17j81
3101a30k3R0QL5j80Ll5K66j9l31L38L4j7k07J3L19k47J01j29m9J24J43j09k2K6
3126BJ07j20J2J0m1J99j45j78J38rJ48k36l9K52k9j54J93Q6K0P0j26k95K1P6q4
3151a22J60M9j07J55j61l6J3k1nL46k90j76J11N5P1o9r4p7K63M2k13J58j50N2
3175d6j2J0o2K30m6n7K5K1n9j6R5l40K90K2n5m5j66N1M16j39j38L18k54j2K9J1
3201G1k45J22k83K47K97j37k11J34q6l74O88p3j29J00k2n4MNl3Jq7j40J63J88
3225A46j01K8m2l29K39L07k11k4k26P0L65l02m1J47k3M1R3j70q8J76M6K2m50L80
$$ plain form
3053 225 11 92 351 26 99 -107 -167 48 185 241 54 96 73 68 100 81 124 -28 301 -17 -111 72 -269 209
3077 209 -176 119 183 -65 -25 -54 153 68 203 -181 -2 100 136 91 36 94 -77 38 -115 -90 -143 -66 51 -130
3101 -130 -153 -63 -55 -20 -200 -197 -232 34 15 -316 22 56 39 -168 -155 164 -83 18 -111 -160 -36 107 -2 -24 2
3126 2 109 -11 1 11 -30 169 24 -154 -16 -25 123 -113 -152 100 71 -83 110 196 216 286 160 -135 -114 -38 -122
3151 -122 38 87 -20 135 -26 -62 -49 -70 -75 271 -19 -195 -84 -29 42 -27 -121 -198 65 107 -106 52 -98 -46
3175 -46 -58 -48 -110 120 74 17 42 63 4 -12 83 -257 33 55 0 -45 -211 -160 256 117 -21 297 43 31 60 71
3201 71 -174 -52 -335 -88 209 72 -139 -5 -91 -465 223 150 21 121 99 45 49 54 21 22 -65 -205 -42 146
3225 146 45 73 31 -298 -59 248 37 13 -213 -143 222 -80 -121 26 3 44 137 -33 -121 55 101 123 -327 53
3249E3J9l24L40k05J07J37k67p0J26J58j20Q7j13J26k51J90J48l14M4J8j7J48
3271B0M7l2l2j25q4K7M07k95O3K14j46L58k88N3p4j70K12l57L08J6j64J64J2l23
3295a89J35O2R3j00r3J19j15L2R3J3N7k38O7J80q3j09L8K6j18L70l17J72j13K26
3319B08k18j47k19L51L2k40K33k23R5P8J38m0J15j2m3Rn6k9j21j62J84k0N9J84
3343A56j13r7J30l3J00OLmj75j0O5J43M7l26L19l03P4N1q9Mj02L83j09O2j29j57
3369a04J32J40r4j61R2l3k8J62j93K91l2p8J1k62K61L1J4k23j08K79j3k72p1K13
3393d6J67q6j96j8PM1J69J57l96K29o6j13R4J61J38j60r5j19J87J83l01r2J54
3416ar1J85n1j04K71l23L25q9k60JM18O4m36J2K86j33j4k19o6L90p4k53J72J14
$$ plain form
3249 53 72 -252 88 -117 -10 127 -140 -210 -84 74 -46 41 -72 54 -197 -7 141 -173 -129 -111 -128 20
3271 20 67 35 3 -122 -206 -179 228 -67 -4 210 64 422 134 187 113 -57 155 -202 106 122 -42 122 134 -189
3295 -189 -54 8 101 1 -92 27 -88 -56 37 50 107 -131 -64 116 33 -76 -38 -12 -130 240 -77 95 -18 208
3319 208 -10 -157 -376 -25 7 -233 0 -223 -128 -50 88 48 163 151 108 117 61 32 -89 -251 -67 -87 -28 156
3343 156 43 -54 76 43 143 149 152 148 -27 -37 28 171 218 -108 211 -92 -18 33 -56 -52 -154 229 120 182 53 -104
3369 -104 28 168 74 -87 5 -28 -56 106 -87 204 172 94 105 -157 104 135 149 -74 -182 97 84 -188 -259 -46
3393 -46 121 35 -161 -179 -172 -131 38 195 -201 28 -38 -151 -57 104 242 82 -13 -132 55 238 -63 -155 -1
3416 -1 -92 93 42 -62 209 -114 211 122 -138 -137 281 345 -91 -79 207 74 60 -159 -225 165 91 -162 10 124
3440A24R5n7k96J02J81k79O9k18K06NJ15O0Q0k57N5J98m31J3M72j95J86l78j8
3463a68l0K86J6q7p9q1J58j19M8M6j18K58r9l78M24Mnk02j08L95j79J70j72r4
3487a14Q7N2k7k07K5K77j8k6k01J69j50L54j43k24J23J35l16L13j27R7j47j13
3509a81M04j63m2J49l68M2L08j5j81R5q5k05M88j26l42K8K05m7k6K2Q9r6K97l74
3533a24rR6j92K51r6J80j50j2m3J54k39J51j06J40P8K9J44l54n5K00K01m46L37
3556A35k55MK20j38K93j63j87J25j80L53j61j15Q2J7k43K37L9j4m20N44l5l7j80
3579g9n1J38P4lj27K47j31j9J8J60l3q4r1m3J06p5j36K58k88J73p7Kk5n1L41j96
3605HO1j17N2j8J53o6l58L73N6k28K37o06N93n2J07k06j22K55j72J08k20M01k29
$$ plain form
3440 124 219 162 -134 -32 149 -130 -61 -279 -73 -68 47 107 187 -70 -15 183 -248 -235 237 42 228 -150 -168
3463 -168 -198 88 104 17 -62 -143 15 -104 -56 -10 -128 130 31 -347 77 81 76 -126 -234 161 -18 152 -20 -114
3487 -114 -27 25 -2 -209 -184 93 75 49 -152 17 -133 221 78 -146 -23 112 -204 109 -18 79 -68 -181
3509 -181 223 60 18 167 -201 -159 149 134 -47 48 -37 -242 246 120 -222 -194 11 -36 -62 -40 49 -47 250 -124
3533 -124 -133 -37 -229 22 -74 106 -44 -56 -99 55 -184 -33 -139 1 79 108 252 -102 -157 43 244 -202 135
3556 135 -120 -116 104 -34 259 96 -91 34 -146 207 46 -69 13 30 -213 24 63 49 -371 173 138 101 -79
3579 -79 -130 8 82 79 -48 199 68 49 67 227 194 110 19 -24 82 7 -129 129 -159 14 -63 -61 -86 -137 204 8
3605 8 69 -48 4 -14 139 73 -285 88 144 -84 153 -453 140 88 195 -11 -133 122 -50 58 -162 239 10
3628A0k8Nj83K93l1j25k2J71P6k06r0J72l7N6Oq3J87l59J97lj26QJ37K3J5n7j30
3655a24J79J09k81J26j14L41k69m7j23J90K45k11J9m1J41j74N9j6K7K55k01j67
3677g7J69j8M6l21J01J74k46J71r0R6j05L44l25Qj4K30l9k82Q6j54K81J38l55
3700a82L6K47m4k12J1P6m9K14n0j13j00J87k54L56k19J15NJ0j09J62p8n0J06o1
3724Dj20J15J22p3j5k46J46L8p9P5j4rK60k83K01k17J20J56k51K30K33n7k01k32
$$ plain form
3628 10 -18 -13 -196 97 66 -59 -81 90 166 -40 -130 42 5 61 67 -16 171 -188 9 6 -120 -112 25 48 63 6 -124
3655 -124 55 164 -117 9 -105 236 -33 -80 -203 -13 232 21 40 -1 140 -34 25 9 36 291 90 -77
3677 -77 92 74 120 -201 -100 74 -172 -1 -91 5 -100 244 -81 -73 -87 143 104 -178 -92 -246 35 173 -182
3700 -182 -146 101 57 -155 -144 -68 -117 97 47 -66 -166 21 -233 123 -96 19 24 34 -75 87 9 -41 65 4
3724 4 -116 -1 121 48 33 -213 -67 -29 -108 -33 -47 -56 204 -79 122 -95 25 181 -70 160 393 336 135 -97
$$ [...]
8191h9
##END NTUPLES=NMR FID
##END=
