##TITLE=1H_Ser 8-2-k-1
 CDCl3
 8 sc, 
 1.09.2022
##JCAMPDX= 6.0         $$ Bruker NMR JCAMP-DX V2.0
##DATA TYPE= NMR FID
##DATA CLASS= NTUPLES
##ORIGIN= UXNMR, Bruker Analytische Messtechnik GmbH
##OWNER= root
$$ XWIN-NMR		Version 3.5
$$ Thu Sep  1 14:04:26 2022 Russian Standard Time (UT+4h)  she@DPX200
##.OBSERVE FREQUENCY= 200.1313499994
##.OBSERVE NUCLEUS= ^1H
##.DELAY= (6, 6)
##.ACQUISITION MODE= SIMULTANEOUS
##.ACQUISITION SCHEME= undefined
##.AVERAGES= 108
##.DIGITISER RES= 18
##SPECTROMETER/DATA SYSTEM= spect
##.PULSE SEQUENCE= zg30
##.SOLVENT NAME= CDCl3
##.SHIFT REFERENCE= (INTERNAL, CDCl3, 0, 15.7039)
##AUDIT TRAIL= $$ (NUMBER, WHEN, WHO, WHERE, WHAT)
$$ ##TITLE= Audit trail, XWIN-NMR		Version 3.5
$$ ##JCAMPDX= 5.01
$$ ##ORIGIN= Bruker BioSpin GmbH
$$ ##OWNER= she
$$ F:/spectra/data/she/nmr/H-F/1/audita.txt
$$ ##AUDIT TRAIL=  $$ (NUMBER, WHEN, WHO, WHERE, WHAT)
(   1,<2022-09-01 14:00:59.42 +0400>,<she>,<DPX200>,
      <continue with go, POWCHK disabled, PULCHK disabled
       configuration hash MD5:
       00 E9 B6 7A A2 85 ED C7 34 08 36 98 17 FE 4E 26
       data hash MD5: 16K
       97 46 4C A9 ED 73 3D DD 46 D2 61 64 35 2F 03 EF>)
$$ ##END=
$$ 
$$ hash MD5
$$ A7 94 97 DB 5B 5A AB 3A C3 B2 7E 6E E5 85 30 4C
##$RELAX= 
##$RELAX= 
##$RELAX= 
##$RELAX= 
##$RELAX= 
##$RELAX= 
$$ Bruker specific parameters
$$ --------------------------
##$DU= <F:/spectra>
##$EXPNO= 1
##$NAME= <H-F>
##$PROCNO= 1
##$TYPE= <nmr>
##$USER= <she>
##$AMP= (0..31)
100 100 100 100 100 100 100 100 100 100 100 100 100 100 100 100 100 100 
100 100 100 100 100 100 100 100 100 100 100 100 100 100 
##$AQSEQ= 0
##$AQ_mod= 1
##$AUNM= <au_zg>
##$AUTOPOS= <>
##$BF1= 200.13
##$BF2= 200.13
##$BF3= 200.13
##$BF4= 200.13
##$BF5= 200.13
##$BF6= 200.13
##$BF7= 200.13
##$BF8= 200.13
##$BYTORDA= 1
##$CFDGTYP= 0
##$CFRGTYP= 5
##$CHEMSTR= <none>
##$CNST= (0..31)
1 1 145 1 1 1 1 1 1 1 1 1 1 1 1 1 1 1 1 1 1 1 1 1 1 1 1 1 1 1 1 1 
##$CPDPRG= <>
##$CPDPRG1= <>
##$CPDPRG2= <>
##$CPDPRG3= <>
##$CPDPRG4= <mlev>
##$CPDPRG5= <mlev>
##$CPDPRG6= <mlev>
##$CPDPRG7= <mlev>
##$CPDPRG8= <mlev>
##$CPDPRGB= <>
##$CPDPRGT= <>
##$D= (0..31)
0 1.2 0 0 0 0 0 0 0 0.06 0 0.03 0 0 0 0 0.0002 0 0 0 0 0 0 0 0 0 0 0 0 
0 0 0 
##$DATE= 1662026063
##$DBL= (0..7)
120 120 120 120 120 120 120 120 
##$DBP= (0..7)
150 150 150 150 150 150 150 150 
##$DBP07= 0
##$DBPNAM0= <>
##$DBPNAM1= <>
##$DBPNAM2= <>
##$DBPNAM3= <>
##$DBPNAM4= <>
##$DBPNAM5= <>
##$DBPNAM6= <>
##$DBPNAM7= <>
##$DBPOAL= (0..7)
0.5 0.5 0.5 0.5 0.5 0.5 0.5 0.5 
##$DBPOFFS= (0..7)
0 0 0 0 0 0 0 0 
##$DE= 6
##$DECBNUC= <off>
##$DECIM= 32
##$DECNUC= <off>
##$DECSTAT= 4
##$DIGMOD= 1
##$DIGTYP= 9
##$DL= (0..7)
0 120 120 120 120 120 120 120 
##$DP= (0..7)
150 150 150 150 150 150 150 150 
##$DP07= 0
##$DPNAME0= <>
##$DPNAME1= <>
##$DPNAME2= <>
##$DPNAME3= <>
##$DPNAME4= <>
##$DPNAME5= <>
##$DPNAME6= <>
##$DPNAME7= <>
##$DPOAL= (0..7)
0.5 0.5 0.5 0.5 0.5 0.5 0.5 0.5 
##$DPOFFS= (0..7)
0 0 0 0 0 0 0 0 
##$DQDMODE= 0
##$DR= 18
##$DS= 0
$$ [...]
##$SUBNAM2= <"">
##$SUBNAM3= <"">
##$SUBNAM4= <"">
##$SUBNAM5= <"">
##$SUBNAM6= <"">
##$SUBNAM7= <"">
##$SUBNAM8= <"">
##$SUBNAM9= <"">
##$SW= 18.0517283424941
##$SWIBOX= (0..15)
0 0 2 0 0 0 0 0 0 0 0 0 0 0 0 0 
##$SW_h= 3612.71676300578
##$TD= 16384
##$TD0= 1
##$TE= 0
##$TE2= 300
##$TE3= 300
##$TEG= 300
##$TL= (0..7)
0 120 120 120 120 120 120 120 
##$TP= (0..7)
150 150 150 150 150 150 150 150 
##$TP07= 0
##$TPNAME0= <>
##$TPNAME1= <>
##$TPNAME2= <>
##$TPNAME3= <>
##$TPNAME4= <>
##$TPNAME5= <>
##$TPNAME6= <>
##$TPNAME7= <>
##$TPOAL= (0..7)
0.5 0.5 0.5 0.5 0.5 0.5 0.5 0.5 
##$TPOFFS= (0..7)
0 0 0 0 0 0 0 0 
##$TUNHIN= 0
##$TUNHOUT= 0
##$TUNXOUT= 0
##$USERA1= <user>
##$USERA2= <user>
##$USERA3= <user>
##$USERA4= <user>
##$USERA5= <user>
##$V9= 5
##$VALIST= <valist>
##$VCLIST= <CCCCCCCCCCCCCCC>
##$VD= 0
##$VDLIST= <DDDDDDDDDDDDDDD>
##$VPLIST= <PPPPPPPPPPPPPPP>
##$VTLIST= <TTTTTTTTTTTTTTT>
##$WBST= 1024
##$WBSW= 4
##$XGAIN= (0..3)
0 0 0 0 
##$XL= 0
##$YL= 0
##$YMAX_a= 405491
##$YMIN_a= -584192
##$ZGOPTNS= <>
##$ZL1= 120
##$ZL2= 120
##$ZL3= 120
##$ZL4= 120
##$ABSF1= 10
##$ABSF2= 0
##$ABSG= 5
##$ABSL= 3
##$ALPHA= 0
##$AQORDER= 0
##$ASSFAC= 0
##$ASSFACI= 0
##$ASSFACX= 0
##$ASSWID= 0
##$AUNMP= <proc_1d>
##$AZFE= 0.1
##$AZFW= 0.1
##$BCFW= 1
##$BC_mod= 2
##$BYTORDP= 1
##$COROFFS= 0
##$CY= 11.3945322036743
##$DATMOD= 1
##$DC= 2
##$DFILT= <>
##$DTYPP= 0
##$F1P= 2.36226072786647
##$F2P= -0.459571619588291
##$FCOR= 0.5
##$FTSIZE= 0
##$FT_mod= 4
##$GAMMA= 1
##$GB= 0.15
##$INTBC= 1
##$INTSCL= 1
##$ISEN= 128
##$LB= 0.24
##$LEV0= 0
##$LPBIN= 0
##$MAXI= 10000
##$MC2= 0
##$MEAN= 0
##$ME_mod= 0
##$MI= 1.114404
##$NCOEF= 0
##$NC_proc= 0
##$NLEV= 6
##$NOISF1= 3.799351
##$NOISF2= 2.8
##$NSP= 1
##$NTH_PI= 0
##$NZP= 0
##$OFFSET= 15.70392
##$PC= 1
##$PHC0= -18033.54
##$PHC1= 6.400692
##$PH_mod= 1
##$PKNL= yes
##$PPARMOD= 0
##$PSCAL= 0
##$PSIGN= 0
##$REVERSE= no
##$SF= 200.130013532006
##$SI= 16384
##$SIGF1= 3
##$SIGF2= 2
##$SINO= 400
##$SIOLD= 16384
##$SREGLST= <1H.CDCl3>
##$SSB= 0
##$STSI= 0
##$STSR= 0
##$SW_p= 3612.71676300578
##$SYMM= 0
##$S_DEV= 0
##$TDeff= 0
##$TDoff= 0
##$TI= <>
##$TILT= no
##$TM1= 0
##$TM2= 0
##$TOPLEV= 0
##$USERP1= <user>
##$USERP2= <user>
##$USERP3= <user>
##$USERP4= <user>
##$USERP5= <user>
##$WDW= 1
##$XDIM= 8192
##$YMAX_p= 0
##$YMIN_p= 0
$$ End of Bruker specific parameters
$$ ---------------------------------
##NTUPLES= NMR FID
##VAR_NAME=  TIME,          FID/REAL,        FID/IMAG
##SYMBOL=    X,             R,               I
##VAR_TYPE=  INDEPENDENT,   DEPENDENT,       DEPENDENT
##VAR_FORM=  AFFN,          ASDF,            ASDF
##VAR_DIM=   8192,          8192,            8192
##UNITS=     SECONDS,       ARBITRARY UNITS, ARBITRARY UNITS
##FACTOR=    0.0002768,     1,               1
##FIRST=     0,             0,               0
##LAST=      2.2672688,     0,               0
##MIN=       0,             -584192,         0
##MAX=       2.2672688,     405491,          0
$$ Real data points
##PAGE= N=1
##DATA TABLE= (X++(R..R)), XYDATA
$$ plain form
0 0 0 0 0 0 0 0 0 0 0 0 0 0 0 0 0 0 0 21 -108 108 -108 108 -108 121 -216 216 -216 323 -324 388 -432 522 -546
33 -546 648 -743 820 -917 1028 -1154 1289 -1427 1591 -1755 1957 -2166 2393 -2637 2907 -3212
49 -3212 3536 -3889 4283 -4724 5210 -5758 6370 -7071 7867 -8796 9881 -11185 12788
62 12788 -14782 17377 -20885 25949 -33859 48267 -83080 405491 45243 -307076 346065
73 346065 170482 -92487 142623 189983 -206833 -29705 185374 -78473 -158033 151352
83 151352 12285 -223174 -30780 87102 -134996 -92524 36980 -102341 -138262 79640
93 79640 31547 -130632 -8809 93070 -39640 -3738 125712 19492 -61097 89597 98470
104 98470 -29249 35299 105284 -26237 -37646 88393 28113 -75366 22273 55251 -64656
$$ packed form
0@%%%%%%%%%%%%%%%%%K1j29K16k16K16k16K29l37M32m32N39o47P12q20R54j068
33e46J194j391J563j737J945k182K443k716L018l346L712m123M559n030N544o119
49c212O748p425Q172r007R934j0968J2128j3441J4938j6663J8677k1066K3973
62A2788k7570L2159l8262M6834n9808Q2126j31347M88571l60248l52319O53141
73C46065j75583k62969K35110M7360l96816J77128K15079k63847p9560L09385
83A51352j39067k35459J92394J17882k22098M2472J29504j39321l5921K17902
93G9640m8093j62179J21823J01879j32710L5902J29450j06220q0589J50694Q873
104I8470j27719O4548O9985j31521j1409J26039o0280j03479R7639L2978j19907
$$ plain form
115 -64656 -43756 47904 -37582 -105372 -3888 15749 -78133 -52441 17419 -38899 -58849 29059
127 29059 31011 -30488 9396 53111 -3787 -7265 64409 45662 -6812 36489 59123 7934
139 7934 21986 64133 8217 -29383 32018 30823 -48779 -42536 6023 -33615 -60618 -8605 -14355
152 -14355 -68935 -37400 7776 -33193 -44376 12813 3212 -39872 3002 36626 -8596 356
164 356 54226 22454 -5372 53171 55234 -4138 24005 67408 9984 -9872 44519 17661 -40021
177 -40021 5185 28960 -35819 -35613 10106 -29695 -56846 1927 164 -60774 -27777 15191 -33792
190 -33792 -39856 22346 -398 -44314 16333 45552 -12416 930 56428 19581 -7009 51495
202 51495 47111 -13913 10329 43954 -4788 -14026 31456 3015 -38097 -266 7876 -38577 -22481
$$ packed form
115f4656K0900R1660q5486o7790J01484J9637r3882K5692O9860n6318j9950Q7908
127B9059J952o1499L9884M3715n6898l478P1674j8747n2474M3301K2634n1189
139G934J4052M2147n5916l7600O1401j195p9602O243M8559l9638k7003N2013n750
152a4355n4580L1535M5176m0969j1183N7189r601m3084M2874L3624m5222Q952
164C56N3870l1772k7826N8543K063n9372K8143M3403n7424j9856N4391k6858n7682
177d0021M5206K3775o4779K06M5719l9801k7151N8773j763o0938L2997M2968m8983
190c3792o064O2202k2744m3916O0647K9219n7968J3346N5498l6847k6590N8504
202E1495m384o1024K4242L3625m8742r238M5482k8441m1112L7831Q142m6453J6096
$$ plain form
215 -22481 6600 -37600 -52022 1833 -2953 -45006 -16797 12348 -19248 -11403 33600 12954
227 12954 -15297 24712 40036 4486 16342 45280 15673 -320 35211 31219 -3314 11258
239 11258 23183 -14121 -18074 13179 -6792 -40245 -15439 -5621 -39354 -33638 -3362 -24465 -44337
252 -44337 -11656 -1206 -26648 -12467 12689 -6317 -10900 27797 27587 19 20046 38845 12936
265 12936 13309 42280 25541 -1306 23913 32513 -3243 -472 23429 -8179 -30968 2258 -1067
278 -1067 -38687 -24862 -342 -32200 -37336 -738 -12039 -39098 -7758 8473 -22239 -9068
290 -9068 26421 -348 -12965 29552 30271 -5689 17555 41838 6066 1963 40312 19250 -15360
303 -15360 16464 23651 -18003 -11113 18337 -16028 -35077 222 -5382 -40576 -18924 1073 -32864
$$ packed form
215b2481K9081m4200j4422N3855m786m2053K8209K9145l1596P845M5003k0646
227A2954k8251M0009J5324l5550J1856K8938k9607j5993L5531l992l4533J4572
239A1258J1925l7304l953L1253j9971l3453K4806R818l3733N716L0276k1103j9872
252d4337L2681J0450k5442J4181K5156j9006m583L8697k10k7568K0027J8799k5909
265A2936L73K8971j6739k6847K5219Q600l5756K771K3901l1608k2789L3226l325
278a067l7620J3825K4520l1858n136L6598j1301k7059L1340J6231l0712J3171
290i068L5489k6769j2617M2517P19l5960K3244K4283l5772m103L8349k1062l4610
303a5360L1824P187m1654O890K9450l4365j9049L5299n604l5194K1652J9997l3937
$$ plain form
316 -32864 -28534 11392 -7928 -30689 7104 18300 -15620 2041 35130 5805 -4249 34055
328 34055 29564 -597 21783 36915 3173 1595 32226 9565 -16223 8169 8265 -25391 -13777
341 -13777 5606 -24863 -35419 -5102 -13160 -38382 -14318 -1665 -29322 -23796 10761 -2699
353 -2699 -20418 8515 17091 -5126 10379 30965 12566 4466 30994 26163 4230 19927 28579
366 28579 2199 705 21681 6041 -13993 1732 2881 -22540 -15513 2278 -18207 -31399 -8489
379 -8489 -9243 -28127 -14550 683 -18104 -18339 7519 4303 -9083 9066 19106 1575 8439
392 8439 29800 14149 359 21977 20426 -470 8700 22006 -1368 -10409 11013 2817 -19633
405 -19633 -6480 -111 -24293 -22600 428 -14036 -29896 -8311 -3460 -22100 -8486 10687 -7458
$$ packed form
316c2864M330L9926j9320k2761L7793J1196l3920J7661L3089k9325j0054L8304
328C4055m491l0161K2380J5132l3742j578L0631k2661k5788K4392R6l3656J1614
341a3777J9383l0469j0556L0317q058k5222K4064J2653k7657N526L4557j3460
353b699j7719K8933Q576k2217J5505K0586j8399q100K6528m831k1933J5697Q652
366B8579k6380j494K0976j5640k0034J5725J149k5421P027J7791k0485j3192K2910
379h489p54j8884J3577J5233j8787k35K5858l216j3386J8149J0040j7531O864
392H439K1361j5651j3790K1618j551k0896R170J3306k3374r041K1422q196k2450
405a9633J3153O369k4182J693K3028j4464j5860K1585M851j8640J3614J9173j8145
$$ plain form
418 -7458 -9422 17524 12955 -4968 17585 26024 2884 8056 31988 16557 1722 20548 19901
431 19901 -4327 5548 16504 -7949 -15871 3410 -6116 -25785 -10269 -4374 -28337 -24299 -2865
444 -2865 -15615 -26561 -4910 -2606 -19921 -4572 13791 -4151 -4990 19719 14665 870 19018
457 19018 27460 5132 9798 27310 13868 2271 17999 13537 -8263 2420 11973 -10203 -16209
470 -16209 -400 -9245 -22879 -8222 -4281 -22888 -18367 -3548 -12461 -19581 -1105 549 -14116
483 -14116 -2046 14031 2433 829 18924 14313 4274 18120 23152 6880 5821 18335 7115
496 7115 -2615 9705 6771 -10306 -6556 3284 -9080 -17526 -6863 -10825 -22439 -13629 -4872 -17225
510 -17225 -17656 -1072 -4799 -12302 2084 10263 -1341 2416 18884 11334 5644 19463 19505 4559
$$ packed form
418g458j964K6946m569j7923K2553Q439k3140N172K3932j5431j4835J8826o47
431A9901k4228R875J0956k4453p922J9281r526j9669J5516N895k3963M038K1434
444b865j2750j0946K1651K304j7315J5349J8363j7942q39K4709n054j3795J8148
457A9018Q442k2328M666J7512j3442j1597J5728m462k1800J0683R553k2176o006
470a6209J5809q845j3634J4657L941j8607M521J4819q913p120J8476J654j4665
483a4116J2070J6077j1598j604J8095m611j0039J3846N032j6272j059J2514j1220
496G115r730J2320k934j7077L750R840j2364q446J0663l962j1614Q810Q757j2353
510a7225m31J6584l727p503J4386Q179j1604L757J6468p550n690J3819M2j4946
$$ plain form
524 4559 13038 24466 7357 -409 14762 7225 -9025 1341 5616 -14914 -15541 -1113 -12648
537 -12648 -22733 -7748 -9090 -24406 -13993 -933 -14095 -16635 3333 806 -10697 5964 14324
550 14324 -920 3341 21309 11491 3418 21672 21237 1284 11437 22641 4497 -2172 13804
563 13804 3537 -11289 530 2247 -18232 -14318 -1992 -13381 -22018 -4826 -6613 -22220 -9397
576 -9397 2137 -11132 -11069 7437 2006 -5504 10064 16411 3094 8484 21708 11820 4400 18578
590 18578 14485 239 6377 13102 -783 -5444 4408 -5362 -15186 -4911 -2324 -17964 -15515 -3401
604 -3401 -12171 -17989 -3979 -3299 -13147 -4732 4493 -2816 -2146 11569 8611 1751 12915 19526 8406
619 8406 8502 19369 11139 4188 14105 11798 -1799 573 7120 -4099 -10507 -1085 -4282 -17989 -10550
$$ packed form
524D559Q479J1428j7109p766J5171p537j6250J0366M275k0530o27J4428j1535
537a2648j0085J4985j342j5316J0413J3060j3162k540J9968k527j1503J6661Q360
550A4324j5244M261J7968r818q073J8254m35j9953J0153J1204j8144o669J5976
563A3804j0267j4826J1819J717k0479L914J2326j1389q637J7192j787j5607J2823
576i397J1534j3269O3J8506n431p510J5568O347j3317N390J3224r888p420J4178
590A8578m093j4246O138O725j3885m661R852r770r824J0275K587j5640K449J2114
604c401q770n818J4010O80r848Q415R225p309O70J3715k958o860J1164O611j1120
619H406R6J0867q230o951R917k307j3597K372O547j1219o408R422l197j3707P439
$$ plain form
634 -10550 -4174 -16390 -17146 -7254 -11962 -16806 -4862 68 -10974 -4178 8546 1863 4 13020
648 13020 12737 1080 10811 18841 7960 8417 17681 9997 436 10911 11610 -4788 -4027 5126 -6401
663 -6401 -13920 -2235 -4364 -18742 -9785 -3552 -15243 -13503 -535 -7827 -13140 922 5429 -7595
677 -7595 625 12411 2877 1624 15936 12915 3126 10244 16370 3924 5164 14935 4109 -3930
691 -3930 5494 4430 -9472 -5392 75 -11735 -14067 -3249 -8808 -17760 -8282 -3798 -13936 -8435
705 -8435 1870 -4109 -6755 4066 6744 -410 6718 13311 6492 6923 16538 12813 5485 9382 12745
720 12745 4109 3843 7840 2008 -4338 318 -1424 -9510 -7608 -5493 -11734 -14374 -7439 -8481 -14813
735 -14813 -9926 -4186 -9413 -7497 677 -491 -2462 3398 7766 4375 7042 12916 8697 6241 13029
$$ packed form
634a0550O376j2216p56R892m708m844J1944M930j1042O796J2724o683j859J3016
648A3020k83j1657R731Q030j0881M57R264p684r561J0475O99j6398P61R153j1527
663f401p519J1685k129j4378Q957O233j1691J740J2968p292n313J4062M507j3024
677g595Q220J1786r534j253J4312l021r789P118O126j2446J240R771j0826q039
691c930R424j064j3902M080N467j1810k332J0818n559q952R478M484j0138N501
705h435J0305n979k646J0821K678p154P128O593o819M31R615l725p328L897L363
720A2745q636k66L997n832o346M656j742q086J902K115o241k640O935j042o332
735a4813M887N740n227J916Q174j168j971N860M368l391K667N874m219k456O788
$$ plain form
750 13029 14382 5596 6530 9910 3904 -286 5055 1235 -7290 -5221 -1026 -10202 -10536 -3798 -9014
765 -9014 -14658 -7690 -4465 -11353 -8189 -610 -3420 -5081 4394 5269 -1173 5181 12363 5013 5831 13604
781 13604 10072 2607 9203 12298 2067 1797 7609 -1283 -6572 1256 -2521 -12921 -8164 -2908 -11658
796 -11658 -12677 -2996 -7339 -13661 -4649 -1350 -8065 -3732 4523 -809 -2495 9054 8757 2214 9091
811 9091 13180 5351 6017 15001 9096 2011 8721 9009 -1685 1028 5483 -4796 -9194 -2219 -3983
826 -3983 -13062 -8185 -4946 -12350 -12765 -4252 -6486 -11273 -2936 -151 -6716 -851 7374 1630 -682
841 -682 9310 10262 5037 9589 13357 5942 6403 12503 6468 116 5301 5807 -3702 -2250 2728 -3558
857 -3558 -10077 -3641 -6252 -11701 -6836 -4609 -10860 -10621 -2214 -3614 -8724 -697 3200 -3060 1370
$$ packed form
750A3029J353q786R34L380o006m190N341l820q525K069M195r176l34O738n216
765i014n644O968L225o888L164P579k810j661R475Q75o442O354P182p350Q18P773
781A3604l532p465O596L095j0231k70N812q892n289P828l777j0400M757N256q750
796a1658j019R681m343o322R012L299o715M333Q255n332j686J1549k97o543O877
811I091M089p829O66Q984n905p085O710K88j0694K713M455j0279m398O975j764
826c983r079M877L239p404m15Q513k234m787Q337K785o565N865Q225n744k312
841f82R992R52n225M552L768p415M61O100o035o352N185N06r509J452M978o286
857c558o519O436k611n449M865K227o251K39Q407j400n110Q027L897o260M430
$$ plain form
872 1370 9275 5401 2836 9622 10060 3857 7152 11825 4552 2063 9285 4341 -3069 134 2135
887 2135 -6052 -6145 -1636 -6893 -12011 -5498 -6474 -11942 -8450 -2224 -7641 -8822 82 -1028 -4719 2176
903 2176 6200 1708 3900 10777 7825 4136 11866 10885 4132 7224 10305 3505 395 5312 2289
918 2289 -4421 -1689 -823 -8589 -9518 -1858 -8231 -12682 -6445 -5908 -11314 -6900 -1100 -6692 -7164 1783
934 1783 994 -1933 4699 6854 2076 4487 11243 7619 3696 10312 10740 2590 5234 8206 1510 -639
950 -639 2858 -445 -5561 -3120 -1822 -8518 -8857 -3835 -6410 -10991 -5133 -4856 -8923 -4422 -71 -2814
966 -2814 -2119 4554 3176 714 7288 9414 4098 4529 10294 7420 3506 7323 5900 976 1579 4595
982 4595 -1531 -3936 -517 -2737 -7908 -5383 -3485 -8615 -9046 -4506 -6929 -8609 -3526 -2037 -5519
$$ packed form
872A370P905l874k565O786M38o203L295M673p273k489P222m944p410L203K001
887B135q187r3M509n257n118O513r76n468L492O226n417j181Q904j110l691O895
903B176M024m492K192O877k952l689P730r81o753L092L081o800l110M917l023
918B289o710K732Q66p766r29P660o373m451O237N37n406M414N800n592m72Q947
934A783p89k927O632K155m778K411O756l624l923O616M28q150K644K972o696k149
950f39L497l303n116K441J298o696l39N022k575m581N858K77m067M501M351k743
966b814O95O673j378k462O574K126n316M31N765k874l914L817j423m924O03L016
982D595o126k405L419k220n171K525J898n130m31M540k423j680N083J489l482
$$ plain form
997 -5519 -2648 3724 292 380 6649 6715 3297 6201 9575 6094 5085 9477 6326 2830 5194 5864
1013 5864 -1237 -578 3523 -2500 -6388 -3255 -3738 -9379 -7790 -4797 -8939 -10070 -4380 -5262 -7533 -3231
1029 -3231 625 -2761 -1615 4977 3113 802 6929 7512 2521 5966 9925 4755 4606 8432 5681
1044 5681 -226 3676 4022 -1856 -3945 932 -4065 -7520 -3641 -4649 -10249 -5726 -2373 -7591 -8126
1059 -8126 -2058 -2449 -5494 -382 4204 -135 1296 6873 5351 2463 7473 8400 2996 5662 8744
1074 8744 3955 936 5625 4137 -2752 287 1455 -5234 -4562 -2826 -6808 -8795 -4199 -4857 -10054
1089 -10054 -6443 -2154 -5317 -5317 -397 -91 -2616 3092 4708 1113 3463 8110 5760 4063 8144 9543
1105 9543 3444 5317 7941 2916 138 2820 1497 -4257 -1860 -659 -5929 -6759 -2918 -5788 -9638
$$ packed form
997e519K871O372l432Q8O269O6l418K904L374l481j009M392l151l496K364O70
1013E864p101O59M101o023l888L133m83n641J589K993m142j131N690q82k271M302
1029c231L856l386J146O592j864k311O127N83m991L445L959n170j49L826k751
1044E681n907L902L46n878k089M877m997l455L879j008n600M523L353n218n35
1059h126O068l91l045N112M586m339J431N577j522k888N010R27n404K666L082
1074H744m789l019M689j488o889L039J168o689O72J736l982j987M596o58n197
1089a0054L611M289l163%M920L06k525N708J616l595K350M647k350j697M081J399
1105I543o099J873K624n025k778K682j323n754K397J201n270q30L841k870l850
$$ plain form
1120 -9638 -4699 -3752 -7793 -6407 519 -3088 -4060 1937 2121 -30 2670 6196 2870 2220 8326 7599
1136 7599 2465 6905 7876 2778 1973 5508 474 -2331 1554 418 -6821 -4019 -562 -6066 -8747
1151 -8747 -2962 -5362 -9104 -3365 -870 -6733 -3280 3117 -1188 -1448 4041 3960 -101 4325 8837 4516
1167 4516 3379 9314 6212 1383 5458 6345 -381 984 3422 -1536 -5194 460 -1546 -8949 -5043
1182 -5043 -1845 -6842 -7355 -3256 -5482 -7029 -2297 -206 -4125 -703 3075 458 -252 5715 6339 3104
1198 3104 5324 8720 4982 3959 7462 5115 564 4648 3771 -1468 -1100 1404 -2616 -5363 -2486
1213 -2486 -3051 -7181 -6416 -3064 -6797 -6765 -1929 -3613 -5209 -1019 454 -1651 -15 4653 2282 626
1229 626 5931 6777 3472 4719 7183 4071 3006 6185 4028 -1148 2096 2900 -3114 -3226 -671 -3480
$$ packed form
1120i638M939R47m041J386O926l607r72N997J84k151K700L526l326o50O106p27
1136G599n134M440R71n098q05L535n034k805L885j136p239K802L457n504k681
1151h747N785k400l742N739K495n863L453O397m305k60N489q1m061M426M512m321
1167D516j137N935l102m829M075Q87o726J365K438m958l658N654k006p403L906
1182e043L198m997n13M099k226j547M732K091l919L422L778k617p10N967O24l235
1198C104K220L396l738j023L503k347m551M084q77n239L68K504m020k747K877
1213b486n65m130P65L352l733L2M836j684j596M190J473k105J636M668k371j656
1229F26N305Q46l305J247K464l112j065L179k157n176L244Q04o014j12K555k809
$$ plain form
1245 -3480 -6440 -3495 -2947 -8072 -5389 -2107 -5858 -5767 -1256 -1076 -2979 1030 3992 901 2431 5833
1261 5833 4632 1869 8057 7258 2402 4714 7281 2748 572 5121 1756 -3041 -45 275 -4847
1276 -4847 -5185 -1854 -4509 -8386 -3125 -3255 -7153 -5961 -1593 -3405 -4677 1381 302 -1531 3209
1291 3209 4462 875 2959 7747 4055 2241 6710 7483 2119 3187 5253 1159 -353 2520 1038
1306 1038 -3206 -459 -913 -5718 -5976 -1695 -4520 -7985 -2584 -2699 -5536 -4062 -1189 -3542 -2970 1958
1322 1958 2630 -487 2676 5245 2063 1874 6499 4920 1658 4993 4851 1180 1892 4007 -631 -1556
1338 -1556 1198 -818 -4390 -4295 -1873 -5588 -6297 -2766 -3975 -5406 -3001 -1384 -4251 -2767 2158 80
1354 80 -1528 3005 4422 885 4127 6825 3166 2699 5595 4700 1755 4283 3491 257 346 2691 -1887
$$ packed form
1245c480k960K945N48n125K683L282l751R1M511J80j903M009K962l091J530L402
1261E833j201k763O188p99m856K312K567m533k176M549l365m797K996L20n122
1276d847l38L331k655l877N261j30l898J192M368j812j272O058j079j833M740
1291C209J253l587K084M788l692j814M469P73n364J068K066m094j512K873j482
1306A038m244K747m54m805k58M281k825l465N401j15k837J474K873k353N72M928
1322A958O72l117L163K569l182j89M625j579l262L335j42l671P12K115m638r25
1338a556K754k016l572R5K422l715p09L531j209j431K405J617k867J484M925k078
1354H0j608M533J417l537L242K698l659m67K896q95k945K528p92l234Q9K345m578
$$ plain form
1371 -1887 -4473 -784 -2513 -7024 -4405 -2692 -6223 -6961 -2508 -3613 -4624 -1339 294 -3415 -1197
1386 -1197 2658 1271 -143 3693 4712 1996 4846 6593 2555 2655 6162 3920 346 2902 2609
1401 2609 -1473 -1016 441 -2340 -5120 -1814 -3471 -6448 -3628 -1307 -5052 -5646 -1679 -2137 -4980 -315
1417 -315 1787 -966 549 4900 1749 731 5714 4898 815 4330 5877 2160 1031 5403 2515
1432 2515 -1129 881 1345 -2060 -3165 -974 -4560 -4812 -1962 -3070 -6677 -3310 -1594 -3841 -4397 177
1448 177 -207 -2059 299 3257 -231 1909 5145 2898 2772 5795 4888 1886 4941 5689 1304 -451
1464 -451 3206 208 -2743 273 -1021 -4621 -3972 -2303 -3633 -5973 -3599 -3385 -5209 -2714 -229 -2897
1480 -2897 -2202 1298 124 -907 2356 3682 1368 2428 5030 3878 2998 5722 4969 2251 3066 2973
$$ packed form
1371a887k586L689j729m511K619J713l531p38M453j105j011L285J633l709K218
1386a197L855j387j414L836J019k716K850J747m038J00L507k242l574K556k93
1401B609m082M57J457k781k780L306j657k977K820K321l745n94L967m58k843M665
1417c15K102k753J515M351l151j018M983q16m083L515J547l717j129M372k888
1432B515l644K010M64l405j105K191l586k52K850j108l607L367J716k247n56M574
1448A77l84j852K358K958l488K140L236k247j26L023r07l002L055P48m385j755
1464d51L657k998k951L016j294l600O49J669j330k340K374K14j824K495K485k668
1480b897O95L500j174j031L263J326k314J060K602j152q80K724p53k718Q15r3
$$ plain form
1496 2973 1298 468 1115 -1549 -3065 -647 -1960 -4148 -4290 -1734 -3484 -4939 -2053 -1203 -4996 -2720
1512 -2720 831 -840 -1018 1815 2053 -719 3566 5232 2090 2243 5625 3647 1614 3652 3387 1612
1528 1612 1804 2414 -1122 -1863 -749 -1243 -4398 -1844 -615 -4005 -4410 -2618 -4227 -4060 -1048 -1117 -3214
1545 -3214 -925 1686 867 118 4199 3187 1456 3878 5237 2779 3086 4320 3480 829 3390 3159
1561 3159 -1471 -1325 1299 -1519 -3981 -364 -1813 -5219 -3509 -2191 -5067 -3944 -626 -2550 -4481
1576 -4481 -268 -206 -2615 -641 3084 843 1254 3567 3016 1356 4173 5204 2076 2926 4448 2489
1592 2489 804 2063 1923 -1120 -1168 875 -3044 -2983 -1561 -2139 -4966 -3707 -1649 -4995 -5249 -1688 -491
1609 -491 -2393 -539 1474 -41 1324 3103 1626 1683 4264 4355 1086 3459 4396 2452 972 3999
$$ packed form
1496B973j675q30O47k664j516K418j313k188j42K556j750j455K886Q50l793K276
1512b720L551j671j78K833K38k772M285J666l142J53L382j978k033K038k65j775
1528A612J92O10l536p41J114m94l155K554J229l390m05J792j609J67L012o9k097
1545c214K289K611q19p49M081j012j731K422J359k458L07J234q40k651K561k31
1561C159m630J46K624k818k462L617j449l406J710J318k876J123L318j924j931
1576d481M213O2k409J974L725k241M11K313n51j660K817J031l128Q50J522j959
1592B489j685J259j40l043m8K043l919O1J422n78k827J259K058l346k54L561J197
1609d91j902J854K013j515J365J779j477N7K581R1l269K373R37j944j480L027
$$ plain form
1625 3999 1102 -1632 998 1147 -2028 -2990 -1485 -3471 -4917 -2244 -2237 -5221 -3025 -1890 -2628 -2527 809
1642 809 -293 -781 1334 2769 212 1646 4015 2611 1280 4782 3530 1536 1848 3422 995 -185
1658 -185 2239 22 -2025 -504 -393 -3652 -2964 -1501 -3596 -4677 -1498 -2868 -4027 -2101 -219 -1521
1674 -1521 -633 1223 549 -903 2504 2522 1011 2452 4813 3129 1719 4097 3335 682 2553 1971
1690 1971 -594 -369 1306 -743 -3745 -1823 -1307 -3961 -2854 -1518 -3862 -5699 -859 -1089 -2965 -1743
1706 -1743 -159 -914 -1476 1602 1925 745 1487 3635 1485 2130 4465 1806 1687 2773 2709 65 1341
1723 1341 1383 -1047 -1061 9 -1285 -3539 -2192 -1119 -2845 -3893 -1624 -2038 -2494 -1940 -477 -1877 -606
1740 -606 1261 -330 141 2388 2511 1489 2823 3427 1735 2113 4016 2390 127 2115 1629 -1574
$$ packed form
1625C999k897k734K630J49l175r62J505j986j446K673Pk984K196J135p38J01L336
1642H09j102m88K115J435k557J434K369j404j331L502j252j994L12J574k427j180
1658a85K424k217k047J521J11l259O88J463k095j081L179j370j159J926J882j302
1674a521Q88J856o74j452L407J8j511J441K361j684j410K378p62k653J871n82
1690A971k565K25J675k049l002J922N16k654J107J336k344j837M840k30j876J222
1706a743J584p55n62L078L23j180P42K148k150O45K335k659j19J086o4k644J276
1723A341M2k430j4J070j294k254J347J073j726j048K269m14m56N54J463j400J271
1740f06J867j591M71K247J23j022J334O04j692L78J903j626k263J988m86l203
$$ plain form
1756 -1574 -600 145 -2344 -2693 -800 -1237 -3438 -2664 -1143 -3780 -3623 -551 -2289 -2945 -119 963 -774
1773 -774 -588 2415 1747 1599 2683 1766 2054 3156 4343 1179 2318 3432 1273 695 802 675 -2287
1790 -2287 -1098 -137 -2416 -2755 -749 -2472 -4537 -3125 -1520 -2676 -3146 -229 -882 -1341 457 990
1806 990 307 1285 2409 1184 1273 3323 3668 1645 2734 3267 1472 606 1772 789 -1178 267 -1425
1823 -1425 -1757 -1852 -652 -2312 -2909 -1800 -1424 -3899 -2795 -1137 -2658 -1625 706 722 -525 632 1612
1840 1612 2043 1233 3275 2509 1974 2741 3650 1362 2118 2499 1275 -207 1618 17 -1650 -928 -624
1857 -624 -2770 -2964 -1022 -2674 -2601 -2591 -1980 -3471 -1943 -974 -1062 -800 982 1294 -1071 1443 3461 1553
1875 1553 2330 2635 2617 2286 2519 2432 746 940 1926 -817 -1242 -414 -1291 -2165 -1832 -1159 -3260 -2766 -1114
$$ packed form
1756a574R74P45k489l49J893m37k201P74J521k637J57L072j738o56K826J082j737
1773g74J86L003o68j48J084r17K88J102J187l164J139J114k159n78J07j27k962
1790b287J189R61k279l39K006j723k065J412J605j156m70K917o53m59J798N33
1806I90o83R78J124j225Q9K050L45k023J089N33j795q66J166r83j967J445j692
1823a425l32r5J200j660n97J109L76k475J104J658j521J033K331J6j247J157R80
1840A612M31q10K042p66n35P67R09k288P56L81j224j482J825j601j667P22L04
1857f24k146j94J942j652P3J0O11j491J528R69q8K62J782L12k365K514K018j908
1875A553P77L05j8l31K33q7j686J94R86k743m25Q28q77q74L33O73k101M94J652
$$ plain form
1894 -1114 -2314 -3309 -2168 -1719 -2713 -256 748 -347 -94 2447 1893 1190 1495 3743 2202 1486 3374
1911 3374 2540 1253 2377 1365 35 292 1628 -1415 -2050 -1141 -2003 -3210 -2279 -909 -2801 -2253 -1384
1928 -1384 -1896 -2084 -1228 -1185 -889 66 768 -17 1203 2376 2114 1371 2704 3248 1119 2184 2821 1326
1946 1326 889 1741 614 -1319 371 152 -1163 -2723 -1553 -1408 -3138 -1863 -943 -2406 -2393 -958 -1646
1963 -1646 -1694 -90 -100 279 591 2232 1579 1454 2404 2039 1756 2934 2179 1943 1128 2010 708 75 497
1982 497 749 -1035 -1193 67 -1753 -3142 -1822 -2462 -3256 -2437 -850 -2163 -1996 -622 -111 -267 610
1999 610 1203 868 747 1247 1984 924 3266 2136 691 1738 2386 478 376 1473 1008 -429 -792
2016 -792 -1045 -2655 -1868 -1060 -1785 -1889 -903 -283 -2379 -1479 -1427 -1490 -748 490 -260 -674 669 2173 1003
$$ packed form
1894a114j200r95J141M49r94K457J004j095K53K541n54p03L05K248j541p16J888
1911C374q34j287J124j012j330K57J336l043o35R09q62j207R31J370j892N48Q69
1928a384n12j88Q56M3K96R55P02p85J220J173k62p43J333N44k129J065O37j495
1946A326m37Q52j127j933J690k19j315j560J170J45j730J275R20j463J3J435o88
1963a646m8J604j0L79L12J641o53j25R50l65k83J178p55k36q15Q82j302o33M22
1982D97K52j784j58J260j820j389J320o40p94Q19J587j313J67J374N11j56Q77
1999F10N93l35j21N00P37j060K342j130j445J047O48j908j02J097m65j437l63
2016g92k53j610P87Q08p25j04R86O20k096R00N2o3P42J238p50m14J343J504j170
$$ plain form
2035 1003 1638 3313 1276 1463 2657 2031 1029 723 725 55 413 437 333 -1626 -2413 -1343 -2734 -3281
2053 -3281 -1989 -2184 -2150 -289 -319 -2092 -600 -973 -1064 -996 1789 1099 1086 1421 2158 1501 1767 1598 1858 1849
2073 1849 2145 2127 704 1130 1176 77 -864 660 -554 -1363 -786 -1482 -2557 -1828 -1413 -1410 -2062 -1711 -1822
2092 -1822 -1600 -557 381 -567 502 1332 2051 1086 684 3550 1202 2062 2418 -53 1518 1085 1152 258
2110 258 -484 -23 -349 -1607 -2121 -1828 -2573 -1925 -1692 -1444 -1849 -1763 -1417 -1632 -63 -304 -1067 23 583
2129 583 632 1037 1769 1956 1267 2325 2328 895 1879 1638 1665 888 247 1057 -164 -602 -1064 -1247 -1580 -1238
2149 -1238 -1441 -1686 -1103 -867 -1436 -2043 -1216 -546 -572 -107 1231 487 682 1704 1315 1091 2398 1473 1419
2168 1419 2075 2764 67 1300 2272 994 -645 -235 -471 -523 -1244 -659 -2963 -2165 -1210 -1400 -1238 -2750
$$ packed form
2035A003O35J675k037J87J194o26j002l06Ko70L58K4j04j959p87J070j391n47
2053c281J292j95L4J861l0j773J492l73r1O8K785o90j3L35P37o57K66j69K60r
2073A849K96j8j423M26M6j099r41J524j214q09N77o96j075P29M15Lo52L51j11
2092a822K22J043R38r48J069Q30P19r65m02K866k348Q60L56k471J571m33O7q94
2110B58p42M61l26j258n14K93p45O48K33K48m05Q6L46k15J569k41p63J090N60
2129E83M9M05P32J87o89J058Lj433R84k41K7p77o41Q10j221m38m62j83l33L42
2149a238k03k45N83K36n69o07Q27O70k6M65J338p44J95J022l89k24J307r25n4
2168A419O56O89k697J233R72j278j639M10k36n2p21N85k304P98R55j90J62j512
$$ plain form
2186 -2750 -1234 -473 -934 73 391 989 855 425 191 737 2644 1701 1284 2114 1679 898 1783 1589 292
2205 292 408 1038 212 -337 2 -175 -1701 -1527 -1219 -1581 -2407 -1603 -770 -1253 -649 -59 -107 -938 1316 474
2225 474 150 1293 2111 941 1596 2289 1716 785 1973 1650 780 371 766 101 -627 -295 -1126 -1614 -731
2244 -731 -1042 -2358 -1699 -1280 -1880 -1984 -989 -250 -1037 -675 -71 -1257 -985 1115 683 -83 461 1776 1751
2263 1751 962 1922 2767 894 1357 1179 -282 62 638 -447 -659 -465 -873 -2387 -1076 -1689 -2888 -1523
2281 -1523 -829 -1497 -1687 -670 11 -487 -944 1331 164 630 1579 1670 1812 1877 2655 1614 1514 2038 862
2300 862 324 0 761 -230 -440 -506 -966 -1941 -582 -786 -1726 -1465 -792 -958 -2694 -2000 -345 -947 329
2319 329 -198 2 543 1388 1619 1579 2445 1422 826 1267 2335 313 496 1587 925 788 -235 1147
$$ packed form
2186b750J516P61m61J007L18N98j34m30k34N46J907r43m17Q30m35p81Q85j94j297
2205B92J16O30q26n49L39j77j526J74L08l62q26Q04Q33m83O04N90m8q31K254q42
2225D74l24J143Q18j170O55O93n73r31J188l23q70m09L95o65p28L32q31m88Q83
2244g31l11j316O59M19o00j04R95P39p87L62O04j186K72K100m32p66N44J315k5
2263A751p89R60Q45j873M63j78j461L44N76j085k12J94m08j514J311o13j199J365
2281a523O94o68j90J017O81m98m57K275j167M66R49R1J42O5P78j041j00N24j176
2300H62n38l24P61r91k10o6m60r75J359k04r40K61O73j66j736O94J655o02J276
2319C29n27K00N41Q45K31m0Q66j023n96M41J068k022J83J091o62j37j023J382
$$ plain form
2337 1147 85 80 -331 -1172 -2046 -1927 -2451 -1571 -1630 -594 -994 -714 -943 -299 -77 650 1035 148 337 1311
2357 1311 1819 1196 1211 1631 788 1835 2053 94 653 212 770 -791 -2 -54 -559 -1074 -892 -1072 -1076 -990
2377 -990 -876 -1360 -849 -777 -1347 -48 1050 -193 -102 881 741 -173 1112 410 1409 526 1552 1564 -129
2396 -129 303 841 129 -388 374 284 -1247 -346 -719 -1738 -1318 -455 -1043 -2072 -811 -540 -1264 -1035 328
2415 328 -55 -477 71 267 694 1213 1370 285 -43 1363 1629 922 1100 970 -257 133 1130 -743 49
2434 49 -98 -783 -1030 -1470 -484 -1844 -1859 -1041 -1409 -773 -1230 -480 -1505 148 988 80 692 611 1289 132
2454 132 874 1534 1585 524 2086 1373 74 830 580 -159 -241 -708 -1100 -1291 -304 -522 -2032 -1594 -1136
2473 -1136 -1227 -1369 -784 -510 -987 -593 -601 303 -275 685 270 715 1160 1483 1403 777 1901 1635 283 1177
$$ packed form
2337A147j062nm11q41q74J19n24Q80n9J036m00K80k29O44K22P27L85q87J89R74
2357A311N08o23J5M20q43J047K18j959N59m41N58j561P89n2n05n15J82j80mQ6
2377i90J14m84N11P2n70J299J098j243R1R83j40r14J285p02R99q83J026J2j693
2396a29M32N38p12n17P62r0j531R01l73j019M20Q63n88j029J261K71p24K29J363
2415C28l83m22N48J96M27N19J57j085l28J406K66p07J78j30j227L90R97j873P92
2434D9j47o85k47m40R86j360j5Q18l68O36m57P50j025J653Q40r08O12q1O78j157
2454A32P42O60N1j061J562p13j299P56k50p39q2m67l92j91R87k18j510M38M58
2473a136r1j42N85K74m77L94qR04n78R60m15M45M45L23q0o26J124k66j352Q94
$$ plain form
2493 1177 1067 174 793 -223 -882 -553 62 -664 -1309 -1505 -1339 -1432 -774 533 -1337 -1530 192 -301 -426
2512 -426 284 1583 43 503 1702 421 930 1666 864 1117 1338 1575 1466 441 743 631 957 -835
2530 -835 -610 -1195 -416 -34 -1836 -1013 -1118 -122 -1320 -750 -1097 -439 -1192 34 335 -344 412 775 301
2549 301 519 1267 1316 856 1535 1087 1084 849 1626 531 -570 849 -886 -153 -548 -825 -950 -1209 -286 -635
2569 -635 -1026 -493 -1405 -362 -871 -561 -260 -7 160 1157 -193 438 1191 1247 1136 1443 730 676 1519 1112
2589 1112 169 199 -18 523 -254 -414 -55 -1415 -806 -808 -1127 -1358 -1125 -1556 -1299 -2223 -359 -371 -431 417 9
2610 9 22 736 1211 1523 379 1735 1161 1319 1245 323 1693 877 -41 1031 -15 594 -616 -576 -118 -1241
2630 -1241 -969 -1829 -689 -349 -1190 -1064 -845 -1318 -819 100 -390 -330 1427 655 106 872 1589 129 526
$$ packed form
2493A177j10q93O19j016o59L29O15p26o45j96J66r3O58J307j870j93J722m93j25
2512d26P10J299j540M60J199j281N09P36q02K53K21K37j09j025L02j12L26j792
2530h35K25n85P79L82j802Q23j05R96j198N70l47O58p53J226L01o79P56L63m74
2549C01K18P48M9m60O79m48lk35P77j095j101J419j735P33l95k77j25k59R23l49
2569f35l91N33r12J043n09L10L01K53J67R97j350O31P53N6j11L07p13n4Q43m07
2589A112r43L0k17N41p77j60L59j360O09kl19k31K33m31K57r24J864j2o0Q48m08
2610IJ3P14M75L12j144J356n74J58p4r22J370q16r18J072j046O09j210M0M58j123
2630a241K72q60J140L40q41J26K19m73M99R19m90O0J757p72n49P66P17j460L97
$$ plain form
2649 526 1345 -316 724 1123 1468 933 185 245 -119 -282 -867 -640 -1609 -962 -274 -1016 -709 -387 -1085 -1354
2669 -1354 -400 107 129 409 -92 -62 185 979 1439 629 1196 1531 473 842 1384 895 662 1060 758 -213
2689 -213 871 336 -370 -1592 -314 249 -568 -857 -1215 -1122 -809 -622 -1665 -812 -488 -650 -207 93 1136
2708 1136 576 382 494 1113 616 1670 606 1308 551 1150 875 293 1738 -1228 107 43 -544 -757
2726 -757 -748 -1122 -1719 -299 -440 -267 -1149 -1442 -92 -648 545 230 623 -398 1283 1568 227 -76 1262
2745 1262 1039 856 620 515 81 163 488 170 -193 9 27 -786 -524 312 -91 -1191 -443 87 -1687 -1311
2765 -1311 -714 -91 -311 337 -295 -183 541 1078 -373 714 1900 652 1869 826 1203 -21 652
2782 652 1405 673 672 3 38 174 -162 107 -814 -895 -1512 -1399 -1189 -1441 -1666 -1122 -436 227 -417 -314 -45
$$ packed form
2649E26Q19j661J040L99L45n35p48O0l64j63n85K27r69O47O88p42L07L22o98k69
2669a354R54N07K2K80n01L0K47P94M60q10N67L35j058L69N42m89k33L98l02r71
2689b13J084n35p06j222J278N63q17k89l58R3L13J87j043Q53L24j62M43L00J043
2708A136n60j94J12O19m97J054j064P02p57N99k75n82J445k966J335o4n87k13
2726g57Rl74n97J420j41J73q82k93J350n56J193l15L93j021J681K85j341l03J338
2745A262k23j83k36j05m34Q2L25l18l63K02J8q13K62Q36m03j100P48N30j774L76
2765a311N97O23k20O48o32J12P24N37j451J087J186j248J217j043L77j224O73
2782F52P53p32jo69L5J36l36K69r21q1o17J13K10k52k25N44O86O63o44J03K69
$$ plain form
2803 -45 371 -22 898 779 -661 598 947 1581 410 572 387 337 437 826 318 -713 -284 12 -828
2822 -828 -1162 -1052 -997 -25 -1132 -455 -797 -65 -328 -186 -133 -105 -893 -328 1504 408 199 1029 296 541
2842 541 466 1519 696 195 -65 30 65 75 626 -34 -244 -855 -827 -1205 -942 -842 65 -1059 -988 -283 -1572
2863 -1572 -475 -88 -121 -929 105 -12 769 1077 767 1100 360 921 134 699 1306 778 37 1631 -24
2882 -24 285 21 -920 -651 -900 -436 -1203 -541 -349 -320 -1692 -407 345 -724 22 -94 421 -344 -71 245
2902 245 40 -265 731 1378 262 180 186 372 -289 834 1284 381 -513 226 -1097 264 89 -451 -303 -774
2922 -774 -371 -889 -868 -299 102 -33 315 -636 -498 -371 131 -103 1066 143 539 455 1496 736 -160 621
2942 621 604 355 -331 1061 -357 -758 512 -556 -903 -634 -808 -645 -1344 -414 -516 -1578 -295 35
$$ packed form
2803d5M16l93R20j19j440J259L49O34j171J62j85n0J00L89n08j031M29K96q40
2822h28l34J10N5R72j107O77l42P32k63J42N3K8p88N65J832j096k09Q30p33K45
2842E41p5J053q23n01k60R5L5J0N51o60k10o11K8l78K63J00R07j124P1P05j289
2863a572J097L87l3q08J034j17P81L08l10L33p40N61p87N65O07n28p41J594j655
2882b4L09k64r41K69k49M64p67O62J92K9j372J285P52j069P46j16N15p65K73L16
2902B45k05l05R96O47j116q2OJ86o61J123M50r03q94P39j323J361j75n40J48m71
2922g74M03n18K1N69M01j35L48r51J38J27N02k34J169r23L96q4J041p60q96P81
2942F21j7k49o86J392j418m01J270j068l47K69j74J63o99R30j02j062J283L30
$$ plain form
2960 35 -970 -320 683 73 -410 684 23 441 121 438 993 -42 -63 775 237 682 879 941 -602
2979 -602 -305 -123 44 -106 250 -441 -1260 -680 -1492 -868 -1325 -415 -1347 108 -390 255 -351 1545 -66
2998 -66 119 -327 825 243 806 476 518 275 -46 1280 481 880 118 -1068 -998 -141 -315 -527 -1334 -556
3018 -556 -494 -1398 -1146 -206 -309 -68 -352 463 -479 262 -380 384 1179 140 837 1532 702 730 469 293
3038 293 1756 474 824 340 -40 187 690 -555 -648 7 -969 -1038 113 -490 -494 -650 -1093 -554 -349 -1083
3058 -1083 672 -964 -376 -133 1029 1121 1030 157 1284 802 631 418 841 1461 392 712 624 -634 -526
3077 -526 -556 300 -685 -814 -681 -1138 -1240 -607 -780 -1420 110 41 -873 -198 -224 202 199 -959 995 -76
3097 -76 453 888 1003 963 147 361 -246 1227 142 -313 596 568 -446 -726 63 -53 -772 -996 239 -1970
$$ packed form
2960C5j005O50J003o10m83J094o61M18l20L17N55j035k1Q38n38M45J97O2j543
2979f02K97J82J67j50L56o91q19N80q12O24m57R10r32J455m98O45o06J896j611
2998f6J85m46J152n82N63l30M2k43l21J326p99L99p62j186P0Q57j74k12q07P78
3018e56O2r04K52R40j03K41k84Q15r42P41o42P64P95j039O97O95q30K8k61j76
3038B93J463j282L50m84l80K27N03j245r3O55r76o9J151o03mj56m43N39K05p34
3058a083J755j636N88K43J162R2r1q73J127m82j71k13M23O20j069L20q8j258J08
3077e26l0Q56r85j29J33m57j02O33j73o40J530o9r14O75k6M26lj158J954j071
3097g6N29M35J15m0q16K14o07J473j085m55R09k8j014k80P89j16p19k24J235k209
$$ plain form
3117 -1970 -724 590 -779 -793 -380 -53 -153 261 -52 630 -349 538 672 1507 365 1332 188 832
3135 832 839 760 -301 -39 -734 -966 -835 -283 43 -769 775 -386 -332 -747 -438 330 -716 -60 -631 484
3155 484 -36 -872 906 665 746 900 75 89 618 539 599 -370 -4 681 357 1058 689 -132 -288 458 -1015
3176 -1015 -354 -423 495 -1186 -1012 -1419 -894 -469 382 -497 -29 80 -350 -477 777 861 -628 469 746
3195 746 25 326 1660 157 1016 260 298 -758 1100 109 -114 79 481 -1356 -1204 -305 -350 -125 -892
3214 -892 -897 -488 -494 -938 -317 -1213 21 -385 -60 10 -302 86 1194 740 415 562 1561 528 623 250 286
3235 286 -146 666 419 -249 809 -199 -110 -527 -843 397 -235 -608 -191 -650 -447 -44 270 949 -1033
3254 -1033 70 406 646 379 716 1772 -308 1463 575 813 851 469 201 -65 746 679 144 7 -206
$$ packed form
3117a970J246J314j369j4M13L27j00M14l13O82r79Q87J34Q35j142R67j144O44
3135H32Pp9j061K62o95k32J31N52L26q12J544j161N4m15L09P68j046O56n71J115
3155D84n20q36J778k41Q1J54q25J4N29p9O0r69L66O85l24P01l69q21j56P46j473
3176a015O61o9R18j681J74m07N25M25Q51q79M68J09m30j27J254Q4j489J097K77
3195G46p21L01J334j503Q59p56L8j056J858r91k23J93M02j837J52Q99m5K25p67
3214h92nM09om44O21q96J234m06L25P0l12L88J108m54l25J47R99j033R5l73L6
3235B86m32Q12k47o68J058j008Q9m17l16J240o32l73M17m59K03M03L14O79j982
3254a033J103L36K40k67L37J056k080J771q88K38L8l82k68k66Q11o7n35j37k13
$$ plain form
3273 -206 192 -989 184 -737 -892 -871 -154 -932 -1117 271 15 -515 283 728 -121 265 1315 -909 43
3292 43 871 1014 1272 1114 -186 621 -14 105 1112 -594 -343 -429 -489 -912 -795 -646 -151 -612 -1031 527
3312 527 -548 -585 -1043 -812 596 466 -968 307 317 625 246 27 801 1015 751 773 449 446 955 -704
3332 -704 -425 -464 -172 -939 -247 250 327 -337 -408 -238 -910 -1069 -474 -911 -1218 1365 -707 -236 1259 -375
3352 -375 334 647 1074 -237 -262 1228 773 1916 -18 670 767 359 613 -98 -391 631 1061 -1394 -666
3371 -666 -805 -1209 -620 -307 -840 -308 -138 245 -1092 -192 105 -684 597 1089 75 351 716 344 1152
3390 1152 -32 359 1680 537 637 -98 -55 564 632 -51 -27 -269 -362 237 285 -689 -411 -718 -277 -671
3410 -671 309 -32 -222 -44 -148 139 191 716 -354 656 -32 1078 -107 981 1651 203 878 335
$$ packed form
3273b06L98j181J173r21j55K1P17p78j85J388k56n30P98M45q49L86J050k224R52
3292D3Q28J43K58j58j300Q07o35J19J007j706K51q6o0m23J17J49M95m61m19J558
3312E27j075l7m58K31J408j30j434J275J0L08l79k19P74K14k64K2l24lN09j659
3332g04K79l9K92p67O92M97P7o64p1J70o72j59N95m37l07K583k072M71J495j634
3352c75P09L13M27j311k5J490m55J143j934O88R7m08K54p11k93J022M30k455P28
3371f66j39m04N89L13n33N32J70L83j337R00K97p89J281M92j014K76L65l72Q08
3390A152j184L91J321j143J00p35M3O19O8o83K4k42r3N99M8r74K78l07M41l94
3410f71R80l41j90J78j04K87N2N25j070J010o88J110j185J088O70j448O75n43
$$ plain form
3428 335 14 -382 207 664 69 -630 -90 -371 -1244 -944 -720 -740 -518 -288 -1191 -119 -329 290 242 -348
3448 -348 245 -767 223 815 924 1303 536 1212 1364 14 1512 -3 -581 390 -211 465 369 -286 -1339
3467 -1339 -592 -955 -419 -571 -485 -699 -682 -607 748 13 -1258 -588 47 189 194 359 197 -161 814 -257
3487 -257 381 1106 401 641 -464 -957 -494 1055 280 276 -55 -509 -128 -811 -1076 -132 -179 -971 -301 -141
3507 -141 -987 -1987 -793 -739 88 -731 -298 -71 -79 12 930 281 -68 1264 189 1971 825 1037 403
3526 403 239 -77 156 -221 446 231 -782 -429 -232 -650 -774 -800 -580 807 -623 161 466 132 315
3545 315 -490 45 921 557 8 1020 1418 376 651 90 802 343 342 405 -938 178 153 -214 -149 186
3565 186 -732 -522 -1281 344 -471 -856 448 -165 -406 -541 51 -29 411 293 483 319 -75 436 -74 542
$$ packed form
3428C35l21l96N89M57n95o99N40k81q73L00K24k0K22K30r03J072k10O19m8n90
3448c48N93j012R90N92J09L79p67O76J52j350J498j515n78R71o01O76r6o55j053
3467a339P47l63N36j52Q6k14J7P5J355p35j271O70O35J42NJ65j62l58R75j071
3487b57O38P25p05K40j105m93M63J549p75ml31m54L81o83k65R44m7p92O70J60
3507a41q46j000J194N4Q27q19M33K27qR1R18o49l49J332j075J782j146K12o34
3526D03j64l16K33l77O67k15j013L53J97m18j24k6K20J387j430P84L05l34J83
3545C15q05N35Q76l64n49J012L98j042K75n61P12m59jO3j343J116k5l67O5L35
3565A86r18K10p59J625q15l85J304o13k41j35N92q0M40j18J90j64l94N11n10O16
$$ plain form
3585 542 544 903 -78 -62 -937 290 375 -1380 45 -290 -272 -468 -1227 382 -116 -802 -899 -637 -759 -289 -23
3606 -23 -668 163 -492 364 396 615 -380 320 969 254 1167 337 760 157 -419 910 -464 441 417 735
3626 735 919 -332 -258 -279 254 -437 -273 -737 -1041 9 513 147 222 -218 -9 753 -90 92 1049 1763
3646 1763 851 -569 462 292 -1 1882 582 -687 221 -917 -17 187 269 -794 -454 -824 -613 -586
3664 -586 -425 -886 -458 -1367 -648 -570 491 450 -1064 265 -443 -592 -269 787 596 562 1265 818 -109 57
3684 57 510 -162 -1034 687 -502 -206 -316 310 -856 -677 -256 -816 -191 -807 -483 -685 -899 -5 144
3703 144 580 -586 105 437 -107 108 1110 102 -190 310 -57 770 -72 557 607 356 -324 -482 -851
3722 -851 642 -179 -291 125 -725 -731 -108 -103 -277 -783 -145 -207 167 30 575 -388 -125 -196 -13 18 698 877
$$ packed form
3585E42KL59r81J6q75J227Q5j755J425l35J8j96p59J609m98o86r7K62j22M70K66
3606b3o45Q31o55Q56L2K19r95P00O49p15R13q30M23o03n76J329j374R05k4L18
3626G35J84j251P4k1N33o91J64m64l04J050N04l66P5m40K09P62q43J82R57P14
3646A763r12j420J031j70k93J883j300j269R08j138R00K04Q2j063L40l70K11K7
3664e86J61m61M28r09P19P8J061m1j514J329p08j49L23J056j91l4P03m47r27J66
3684E7M53o72q72J721j189K96j10O26j166J79M21n60O25o16L24k02k14Q94J49
3703A44M36j166O91L32n44K15J002j008k92N00l67Q27q42O29N0k51o80j58l69
3722h51J493q21j12M16q50oO23Nj74n06O38o2L74j37N45r63K63p1J83L1O80J79
$$ plain form
3744 877 192 1190 1186 871 780 448 -318 -541 -75 158 46 103 305 -522 456 -710 -372 -800 -196 -327 -713
3765 -713 9 407 -854 -702 349 -733 835 1079 902 413 210 707 781 -17 881 584 665 -385 290
3784 290 943 -485 -635 -145 -593 -523 -590 -115 61 -739 -554 -576 214 -399 1287 1042 -830 64 145 -465
3804 -465 170 496 530 936 541 -828 457 -548 946 1190 1468 249 77 -342 157 -192 682 -510
3822 -510 -844 -303 -228 -533 37 -1146 83 458 -321 -1095 223 -369 -118 672 -254 -505 -339 1013 -45
3841 -45 801 451 616 453 369 -179 -43 -508 -35 742 43 -578 285 137 -196 -728 -1191 -972 -285 97 -625
3862 -625 464 -27 -924 -128 182 25 86 332 526 719 407 -247 307 662 -40 937 -483 758 489
3881 489 66 537 177 786 -801 -1047 241 266 -323 -1234 -891 -162 -448 -1164 23 214 -341 461 -394
$$ packed form
3744H77o85R98ml15r1l32p66k23M66K33j12N7K02q27R78j166L38m28O04j31l86
3765g13P22L98j261J52J051j082J568K44j77m89k03M97P4p98Q98k97Q1j050O75
3784B90O53j428j50M90m48P0o7M75J76q00J85k2P90o13J686k45j872Q94Q1o10
3804d65O35L26L4M06l95j369J285j005J494K44K78j219j72m19M99l49Q74j192
3822e10l34N41P5l05N70j183J229L75p79p74J318n92K51P90r26k51J66J352j058
3841d5Q46l50J65j63q4n48J36m65M73P77o99o21Q63j48l33n32m63K19O87L82p22
3862f25J089m91q97P96L10j57O1K46J94J93l12o54N54L55p02R77j420J241k69
3881D89m23M71l60O09j587k46J288K5n89r11L43P29k86p16J187J91n55Q02q55
$$ plain form
3900 -394 1059 -400 719 1276 413 437 -169 485 289 512 504 359 538 -1302 501 517 -147 283 -734
3919 -734 187 63 -748 -187 -584 -265 131 -360 455 -200 437 243 883 266 277 -399 527 839 183 -296
3939 -296 -438 102 1122 498 622 172 -124 -191 -2 116 345 27 507 -195 0 -751 66 352 -227 -160
3959 -160 -801 -201 -64 233 -714 190 1051 -67 1599 -197 311 1344 529 -799 487 -201 556 -401
3977 -401 44 -555 -147 -197 -229 -367 161 -303 118 -82 -311 -460 -82 -1039 -1323 -303 -650 32 -54 -42 478
3998 478 -164 736 673 1363 367 489 559 -42 929 863 -414 332 892 -210 -45 876 -272 921 -782
4017 -782 257 -660 138 -187 70 11 -622 -301 -593 -689 511 762 -109 771 441 -349 1274 515 174 1239
4037 1239 916 469 360 676 246 -657 -314 55 -300 127 467 -240 -1003 -598 -340 -1119 -177 112 -568 54
$$ packed form
3900c94J453j459J119N57q63K4o06O54j96K23qj45J79j840J803J6o64M30j017
3919g34R21j24q11N61l97L19L96m91Q15o55O37j94O40o17J1o76R26L12o56m79
3939b96j42N40J020o24J24m50k96o7J89J18K29l18M80p02J95p51Q17K86n79O7
3959a60o41O00J37K97r47R04Q61j118J666j796N08J033q15j328J286o88P57r57
3977d01M45n99M08n0l2j38N28m64M21k00k29j49L78r57k84J020l47O82q6J2N20
3998D78o42R00o3O90r96J22P0o01R71o6j277P46N60j102J65R21j148J193j703
4017g82J039r17P98l25K57n9o33L21k92r6J200K51q71Q80l30p90J623p59l41J065
4037A239l23m47j09L16m30r03L43L69l55M27L40p07p63M05K58p79R42K89o80O22
$$ plain form
4057 54 -45 -688 -362 1891 -236 135 161 -21 119 417 243 140 799 394 -754 830 320 501 -207 502
4077 502 305 193 -470 -643 -329 -133 47 -161 697 -15 -801 -925 110 104 -83 675 -199 519 133 425
4097 425 628 819 494 225 1047 203 378 609 806 1152 755 -10 427 -348 -1272 346 184 -876 -386
4116 -386 -717 -566 -502 118 389 -913 13 -139 258 123 -228 -438 880 962 805 241 -114 26 54 1518
4136 1518 1035 -494 440 199 -182 345 -86 -644 153 -260 -40 -1025 -3 512 -912 -817 -1006 -713 -977
4155 -977 -103 -738 274 1400 -376 -204 572 516 463 671 775 615 783 383 742 1226 -174 781 -94
4174 -94 272 -1083 -85 -475 239 -13 -996 -485 -987 -238 -356 51 -4 -961 -198 276 373 -266 -47 -330 361
4195 361 872 67 121 1859 888 307 251 86 339 -248 141 29 231 -46 -79 -153 -97 -560 -300 -82 41
$$ packed form
4057E4r9o43L26K253k127L71K6j82J40K98j74j03O59m05j148J584n10J81p08P09
4077E02j97j12o63j73L14J96J80k08Q58p12p86j24J035oj87P58q74P18l86K92
4097D25K03J91l25k69Q22q44J75K31J97L46l97p65M37p75r24J618j62j060M90
4116c86l31J51O4O20K71j302R26j52L97j35l51k10J318Q2j57n64l55J40K8J464
4136A518m83j529R34k41l81N27m31n58P97m13K20r85J022N15j424R5j89K93k64
4155i77Q74o35J012J126j776J72P76n6n3K08J04j60J68m00L59M84j400R55q75
4174i4L66j355R98l90P14k52r83N11n02P49j18M07n5r57P63M74R7o39K19k83O91
4195C61N11q05N4J738r71n81n6j65K53n87L89j12K02k77l3p4N6m63K60K18J23
$$ plain form
4216 41 -1051 -737 82 -106 -214 328 31 341 996 -112 776 509 -516 206 206 407 1018 889 149 378
4236 378 -183 229 146 -1158 -492 -577 229 -1068 -184 -308 -222 221 -424 357 -294 -608 -140 -32 -172 10
4256 10 -459 511 727 409 509 240 977 700 418 858 -572 -398 -181 -5 529 -346 -224 -112 102 -358
4276 -358 -617 -542 -899 -54 -121 -1125 -458 -524 -505 -1459 1107 -198 -100 110 1169 762 196 246 310 568 521
4297 521 691 473 535 585 -256 -114 535 -276 543 -737 108 290 -173 -82 699 -745 -647 568 -389 223
4317 223 -493 -175 -320 -179 97 209 1022 512 201 611 897 203 383 50 -108 233 -215 226 484 484 -616
4338 -616 -1361 -155 406 161 -472 -279 252 -531 -464 -329 -513 266 -83 -433 -348 176 -273 293 -485 -309
4358 -309 595 230 970 -452 -273 -222 -444 582 -25 531 531 292 86 -610 -312 362 -47 -1135 -529 861
$$ packed form
4216D1j092L14Q19j88j08N42k97L10O55j108Q88k67j025P22%K01O11j29p40K29
4236C78n61M12q3j304O66q5Q06j297Q84j24Q6M43o45P81o51l14M68J08j40J82
4256A0m69R70K16l18J00k69P37k77k82M40j430J74K17J76N34q75J22J12K14m60
4276c58k59P5l57Q45o7j004O67o6J9r54K566j305R8K10J059m07n66N0O4K58m7
4297E21J70k18O2N0q41J42O49q11Q19j280Q45J82m63R1P81j444R8J215r57O12
4317B23p16L18j45J41K76J12Q13n10l11M10K86o94J80l33j58L41m48M41K58%j100
4338f16p45J206N61k45o33J93N31p83O7J35j84P79l49l50Q5N24m49N66p78J76
4358c09R04l65P40j422J79N1k22J026o07N56%k39k06o96K98O74m09j088O06J390
$$ plain form
4378 861 -272 330 -142 -717 -188 -357 214 -126 -224 -193 -88 582 373 800 -90 251 146 659 -23 856
4398 856 13 -255 -19 -1158 -503 -150 -195 -245 -528 -275 -1510 -326 287 -747 19 -277 -278 163 -974 -383
4418 -383 -333 -711 -165 5 219 836 742 163 565 308 -217 192 -231 534 714 -6 -571 305 -389 -1075 -434
4439 -434 358 368 -643 -181 -478 -640 60 -133 -380 543 -122 145 474 391 -99 651 -436 318 1441 467
4459 467 404 571 26 -101 388 -170 -8 478 516 1059 -627 -873 -147 -600 150 259 -187 -289 -5 -290
4479 -290 -200 -152 -109 -393 132 418 -1159 -206 53 783 50 675 -531 -167 1265 -489 -292 -552 95 198
4499 198 -216 178 171 -435 483 183 -1783 -719 -612 -915 -432 -566 -139 -141 -248 249 708 -515 171 331
4519 331 366 405 1262 897 514 19 209 -735 503 -25 823 -358 -626 -558 89 264 -1050 -148 -486 -115
$$ packed form
4378H61j133O02m72n75N29j69N71l40r8L1J05O70k09M27q90L41j05N13o82Q79
4398H56q43k68K36j139O55L53m5n0k83K53j235J184O13j034P66k96jM41j137N91
4418c83N0l78N46J70K14O17r4n79M02k57n25M09m23P65J80p20n65Q76o94o86O41
4439d34P92J0j011M62k97j62P00j93k47R23o65K67L29q3m90P50j087P54J123r74
4459D67o3J67n45j27M89n58J62M86L8N43j686k46P26m53P50J09m46j02K84k85
4479b90R0M8M3k84N25K86j577R53K59P30p33O25j206L64J432j754J97k60O47J03
4499A98m14L94po06R18l00j966J064J07l03M83j34M27kj07M97M59j223O86J60
4519C31L5L9Q57l65l83m95J90r44J238n28Q48j181k68O8O47J75j314R02l38L71
$$ plain form
4539 -115 199 52 -537 -966 -73 696 -4 -588 -651 936 -312 659 28 30 825 -321 531 221 -6 -109
4559 -109 -76 -163 -11 -365 208 737 -1189 356 -851 -110 17 -194 139 -672 -41 -292 -706 -289 -278 393
4579 393 -415 -221 395 348 595 1315 902 -349 -425 -459 -80 857 262 781 -402 334 192 -788 -75 -133 514
4600 514 -608 196 -968 162 144 -418 -965 39 -152 -316 688 591 -576 441 403 83 96 800 175
4619 175 523 -475 241 82 -323 712 -250 146 -6 -243 -288 -308 54 -763 754 -251 -284 -288 -536 -664 -626
4640 -626 -301 -308 -376 746 -304 -21 138 141 733 1060 709 353 387 250 -443 -335 188 666 -282 -267 -370 -208
4662 -208 -936 472 -389 -148 -104 372 229 -334 306 619 201 16 568 214 -67 234 -353 -21 1131 1160
4682 1160 884 355 -609 -492 -274 30 341 751 462 -563 634 -293 -101 4 273 -79 -768 -1018 360
$$ packed form
4539a15L14j47n89m29Q93P69p00n84o3J587j248R71o31KP95j146Q52l10k27j03
4559a09L3q7J52l54N73N29j926J545j207P41J27k11L33q11O31k51m14M17J1O71
4579C93q08J94O16m7K47P20m13j251p6l4L79R37n95N19j183P36j42r80P13n8O47
4600E14j122Q04j164J130j8n62n47J004j91j64J004r7j167J017l8l20J3P04o25
4619A75L48r98P16j59m05J035r62L96j52k37m5k0L62q17J517j005l3mk48j28L8
4640f26L25po8J122j050K83J59LN92L27l51l56L4j37o93J08N23M78r48J5j03J62
4662b08p28J408q61K41M4M76j43n63O40L13m18j85N52l54k81L01n87L32J152K9
4682A160k76n29r64J17K18L04L11M10k89j025J197r27J92J05K69l52o89k50J378
$$ plain form
4701 360 -490 -636 -543 120 -266 -245 528 -664 -360 690 623 -342 67 178 22 105 1027 -443 -599 -474
4721 -474 414 815 -70 226 -359 -86 -469 -674 -407 -404 -268 -466 102 -355 -460 -480 55 48 15 -210 1064 64
4743 64 245 -60 -166 576 438 716 691 242 149 -612 450 1120 -580 1182 -266 -577 102 249 212 -8
4763 -8 -122 -25 -1027 492 -13 -347 -471 -322 91 -440 -15 261 149 1250 289 753 151 82 340 1034
4783 1034 512 447 497 371 -51 -642 -691 96 144 -680 -643 -404 -1011 222 -15 -738 -371 -492 -222 -285 235
4804 235 -70 1121 -26 299 466 -116 254 -598 412 -283 242 182 7 -432 260 139 585 172 181 -143
4824 -143 170 -324 -293 -1207 -93 -566 -242 -805 306 -768 -18 -251 539 334 -897 427 942 278 63
4843 63 34 324 248 853 411 -449 -124 353 -115 614 -89 -808 -473 -615 251 -490 -198 -51 -376 -318 -983
$$ packed form
4701C60q50j46R3O63l86K1P73j192L04J050o7r65M09J11j56Q3R22j470j56J25
4721d74Q88M01q85K96n85K73l83k05K67LJ36j98N68m57j05k0N35pl3k25J274j000
4743F4J81l05j06P42j38K78k5m49r3p61J062O70j700J762j448l11O79J47l7k20
4763hj14R7j002J519n05l34j24J49M13n31M25K76j12J101r61M64o02o9K58O94
4783A034n22o5N0j26m22n91m9P87M8q24L7K39o07J233k37p23L67j21K70o3N20
4804B35l05J191j147L25J67n82L70q52J010o95N25o0j75m39O92j21M46m13Rl24
4824a43L13m94L1r14J114m73L24n63J111j074P50k33P90k05j231J324N15o64k15
4843F3k9K90p6O05m42q60L25M77m68P29p03p19L35j42Q66p41K92J47l25N8o65
$$ plain form
4864 -983 392 -443 -654 -578 114 -30 -356 -29 -52 721 742 571 302 480 1120 981 585 134 758 62 639
4885 639 -558 -899 -410 -423 613 -484 703 -928 -974 -961 -305 -2059 -747 61 -396 -92 -157 -847 -15
4904 -15 910 67 12 -259 270 435 -160 111 245 50 431 -843 -685 723 -233 -275 -120 -556 -466 223 -19
4925 -19 -889 -496 -128 -728 575 343 -208 -1089 -767 -251 13 225 291 198 531 657 478 331 211 178 515
4946 515 1108 863 148 706 -328 -863 -799 -195 -30 -539 -89 -440 -767 278 -24 -284 381 -372 -299 -12
4966 -12 588 438 215 553 -341 -189 1029 503 -392 170 320 101 -2 971 338 -32 -160 -64 -273 -629
4986 -629 -41 -30 -351 -523 -166 -907 -602 -176 -735 -363 2 -525 -285 -775 22 105 496 261 925 -337
5006 -337 -43 593 -293 -1340 689 84 -21 270 -163 363 758 1152 -220 319 -368 -357 -1024 -1099 -524 -142
$$ packed form
4864i83J375q35k11P6O92j44l26L27k3P73K1j71k69J78O40j39l96m51O24o96N77
4885F39j197l41M89j3J036j097J187j631m6J3O56j754J312Q08m57L04o5o90Q32
4904a5R25q43n5k71N29J65n95K71J34j95L81j274J58J408r56m2J55m36R0O89k42
4925a9q70L93L68o00J303k32n51q81L22N16K64K12O6r3L33J26j79j47j20l3L37
4946E15N93k45p15N58j034n35O4O04J65n09M50l51l27J045l02k60O65p53P3K87
4966a2O00j50k23L38q94J52J218n26q95N62J50k19j03R73o33l70j28R6k09l56
4986f29N88J1l21j72L57p41L05M26n59L72L65n27K40m90P97Q3L91k35O64j262
5006c37K94O36q86j047K029o05j05K91m33N26L95L94j372N39o87J1o67p5N75L82
$$ plain form
5026 -142 -829 28 229 963 -174 -621 138 -78 -113 4 -59 563 1139 437 894 216 937 194 562 269
5046 269 -133 268 1014 12 -974 853 -1033 90 -572 -794 -112 103 940 1039 -596 -588 -252 559 -355
5065 -355 111 -160 339 621 -337 -215 -543 356 646 576 -54 999 64 466 108 -152 -322 -737 -65 -687
5085 -687 -597 -314 -844 -542 325 -318 -978 802 203 114 -266 -262 215 827 -135 906 -286 210 363 146
5105 146 564 704 649 -372 -505 -223 432 636 118 399 -938 1060 -9 -27 404 262 35 529 -368
5124 -368 -75 415 -362 337 -207 188 33 407 736 424 293 -87 -266 137 -115 1086 1226 254 462 618
5144 618 -535 420 17 -602 -296 376 -537 -910 -645 -145 -282 -248 816 -109 -809 -378 -750 -706 -59 -78
5164 -78 241 885 181 378 1001 -165 1009 218 -772 -620 19 97 620 -205 253 -110 -10 -232 -21 -44
$$ packed form
5026a42o87Q57K01P34j137m47P59k16l5J17o3O22N76p02M57o78P21p43L68k93
5046B69m02M01P46j002r86J827j886J123o62k22O82K15Q37R9j635QL36Q11r14
5065c55M66k71M99K82r58J22l28Q99K90p0o30J053r35M02l58k60j70m15O72o22
5085f87R0K83n30L02Q67o43o60J780n99q9l80MM77O12r62J041j192M96J53k17
5105A46M18J40n5j021j33K82O55K04n18K81j337J998j069j8M31j42k27M94q97
5124c68K93M90p77O99n44L95j55L74L29l12j31l80j79M03k52J201J40r72K08J56
5144F18j153R55m03o19L06O72r13l73K65N00j37L4J064r25p00M31l72M4O47j9
5164g8L19O44p04J97O23j166J174p91r90J52O39P8N23q25M58l63J00k22K11k3
$$ plain form
5184 -44 -726 -192 -885 -640 -826 -996 -1324 75 653 40 -522 -25 -335 274 53 535 364 -37 120 110
5204 110 351 509 228 736 929 -374 661 -466 -363 -373 227 -262 308 -1081 -815 -204 -188 -210 383 -248
5224 -248 428 -360 972 518 -485 -184 640 378 -225 384 620 449 53 178 -57 92 -155 1024 116
5243 116 -54 -1097 -462 -1460 -224 -54 -117 -426 49 189 -901 91 327 501 227 -284 294 -395 82
5262 82 -474 -54 -413 1135 743 1229 672 332 615 1279 -438 -205 103 -59 1019 93 -642 586 -426
5281 -426 83 -408 586 -445 502 1303 -1006 -151 633 -802 -876 226 -307 399 839 474 1453 98 -9
5300 -9 19 77 251 433 353 118 199 383 334 -745 -1023 -1040 -1248 -32 -745 259 179 -211 96 490 -217 28
5322 28 -629 530 447 546 -458 17 243 5 -412 -448 467 188 411 821 542 -1926 100 35 -648 -235
$$ packed form
5184d4o82N34o93K45j86j70l28J399N78o13n62M97l10O09k21M82j71m01J57j0
5204A10K41J58k81N08J93j303J035j127J03j0O00m89N70j389K66O11J6k2N93o31
5224b48O76p88J332m54j003L01Q24k62o03O09K36j71l96J25k35J49k47J179r08
5243A16j70j043O35r98J236J70o3l09M75J40j090R92K36J74k74n11N78o89M77
5262H2n56M20l59J548l92M86n57l40K83O64j717K33L08j62J078r26p35J228j012
5281d26N09m91R94j031R47Q01k309Q55P84j435p4J102n33P06M40l65R79j355j07
5300iK8N8J74J82q0k35Q1J84m9j079k78j7k08J216p13J004q0l90L07L94p07K45
5322B8o57J159q3R9j004M75K26k38m17l6R15k79K23M10k79k468K026o5o83M13
$$ plain form
5342 -235 526 -297 -500 238 136 113 691 -965 -1018 753 665 -216 -591 575 -199 866 210 -376 1066
5361 1066 -173 560 -75 137 1329 264 -507 188 -247 -204 -436 25 230 102 -52 -768 -1091 -105 -125
5380 -125 -542 -439 -130 -600 323 -313 -88 590 451 -1052 681 289 557 -1127 27 356 32 513 28
5399 28 626 685 -453 257 -384 -386 700 933 -337 -970 -377 -286 98 -809 312 -114 369 -359 -313 250 369
5420 369 -61 -372 -327 -256 145 803 -374 592 -169 1099 -170 202 546 524 -136 6 -308 -308 909 430
5440 430 -234 247 -1360 731 -585 295 -112 26 -336 -465 46 -149 -180 -26 -430 238 336 -31 50 578
5460 578 -97 -200 -723 703 16 1293 1316 -172 757 -482 -125 154 -976 -474 -441 -359 -251 -1062 -796
5479 -796 -30 -188 -161 769 -198 470 -1074 562 118 326 329 67 923 334 -583 406 -1028 318 681 308
$$ packed form
5342b35P61q23k03P38j02k3N78j656n3J771q8q81l75J166p74J065o56n86J442
5361A066j239P33o35K12J192j065p71O95m35M3k32M61K05j28j54p16l23R86k0
5380a25m17J03L09m70R23o36K25O78j39j503J733l92K68j684J154L29l24M81m85
5399B8N98N9j138P10o41kJ086K33j270o33N93R1L84r07J121m26M83p28M6N63J19
5420C69m30l11M5P1M01O58j177R66p61J268j269L72L44k2o60J42l14%J217m79
5440D30o64M81j607K091j316Q80m07J38l62j29N11j95l1J54m04O68R8l67Q1N28
5460E78o75j03n23J426o87J277K3j488R29j239L57K79j130N02L3Q2J08q11K66
5479g96P66j58K7R30r67O68j544J636m44K08Lk62Q56n89r17R89j434J346L63l73
$$ plain form
5499 308 160 -309 157 68 -280 403 -353 -305 -746 -858 813 185 -561 -546 15 -218 -1124 570 -113 -376
5519 -376 274 235 261 590 298 -669 37 572 -782 470 662 298 -403 -909 525 -363 -1013 -522 806
5538 806 249 -194 -413 -66 40 112 -32 -233 531 594 -58 -1277 912 337 169 515 257 426 91 -191
5558 -191 923 402 203 448 779 381 -105 507 -149 -534 752 490 -90 489 -96 524 -577 -470 -584
5577 -584 90 -478 -187 -150 61 568 -520 465 372 840 469 261 1044 298 222 432 825 -612 90 -229
5597 -229 -375 266 186 343 282 -766 -419 -609 35 775 -166 -810 628 607 -241 -177 -429 490 860 799 66
5618 66 -680 267 394 888 1104 -259 456 467 89 1323 -780 -457 320 -638 -892 405 -29 -129 -737
5637 -737 140 588 -108 -95 -677 -40 -869 933 -149 -1256 546 222 -37 -38 -807 445 -88 209 373
$$ packed form
5499C08j48m69M66q9l48O83p56M8m41j12J671o28p46J5N61k33r06J694o83k63
5519c76O50l9K6L29k92r67P06N35j354J252J92l64p01n06J434q88o50M91J328
5538H06n57m43k19L47J06P2j44k01P64O3o52j219K189n75j68L46k58J69l35k82
5558a91J114n21j99K45L31l98m86O12o56l85J286k62n80N79n85O20j101J07j14
5577e84O74n68K91L7K11N07j088R85r3M68l71k08P83p46p6K10L93j437P02l19
5597b29j46O41q0J57o1j048L47j90O44P40r41o44J438k1q48O4k52R19L70o1p33
5618F6p46R47J27M94K16j363P15J1l78J234k103L23P77r58k54J297m34j00o08
5637g37Q77M48o96J3n82O37q29J802j082j107J802l24k59jp69J252n33K97J64
$$ plain form
5656 373 510 -318 157 397 -593 -371 -534 -88 312 -433 241 -240 225 405 -82 -664 515 -537 -1232
5675 -1232 -310 140 348 331 -68 121 -62 545 964 1208 -478 518 2 -546 180 66 857 -568 63
5694 63 -338 -137 -992 281 -1108 -63 -162 -636 314 -255 -635 -178 186 -313 -319 -706 995 -382 -907 -585
5714 -585 324 1180 1065 -6 1340 183 271 140 178 103 482 -303 -525 177 343 467 451 -748 -155 -242
5734 -242 262 575 -780 358 28 293 88 -26 -328 311 95 -99 -183 806 301 -20 406 -84 -78 1199
5754 1199 -210 -68 617 -138 849 -397 456 -476 -387 -164 -362 -1089 -1016 58 751 -283 453 -270 -791
5773 -791 -317 9 -574 -114 439 -291 332 -406 42 1110 4 -16 -210 112 -199 675 656 353 -239 128
5793 128 -3 -494 -281 -457 -585 109 105 265 -655 -327 -385 881 271 849 -159 -266 -359 484 390 -673 -493
$$ packed form
5656C73J37q28M75K40r90K22j63M46M00p45O74m81M65J80m87n82J179j052o95
5675a232R22M50K08j7l99J89j83O07M19K44j686R96n16n48P26j14P91j425O31
5694F3m01K01q55J273j389J045r9m74R50n69l80M57L64m99ol87J701j377n25L22
5714e85R09Q56j15j071J346j157Q8j31L8p5L79p85k22P02J66J24j6j199N93q7
5734b42N04L13j355J138l30K65k05j14l02O39k16j94q4R89n05l21M26m90OJ277
5754A199j409J42O85p55R87j246Q53r32Q9K23j98p27P3J074O93j034P36p23n21
5773g91M74L26n83M60N53p30O23p38M48J068j106k0j94L22l11Q74j9l03n92L67
5793A28j31m91K13j76j28O94mJ60r20L28n8J266o10N78j008j07r3Q43r4j063J80
$$ plain form
5814 -493 413 -96 385 862 -302 786 295 207 518 -889 1307 14 -150 -662 -753 -663 65 -236 -694
5833 -694 -304 -873 -408 -200 684 -812 382 -492 403 1091 78 604 230 41 63 326 256 10 534 531
5853 531 -479 -332 170 10 -16 -487 -692 427 -456 -489 -545 273 -585 -365 -94 -1397 -594 296 169 -96
5873 -96 433 -107 51 226 768 822 198 110 684 0 768 335 -238 -52 205 129 -353 -18 -170 -891 -635
5894 -635 -737 923 33 -20 -19 -346 -699 -337 393 -410 426 -83 -186 602 319 -101 103 -36 798 38 460
5915 460 -166 -819 1210 545 529 -974 743 160 -1068 -486 237 -459 166 -164 -275 -683 -914 -508 680
5934 680 -203 440 574 -462 1199 561 832 573 104 -155 544 -120 855 215 648 -96 -189 545 -75 -518
5954 -518 270 150 -898 -365 75 -378 -56 -265 -455 -515 -182 74 -269 124 -440 -292 -178 31 769 978
$$ packed form
5814d93R06n09M81M77j164J088m91q8L11j407K196j293j64n12r1R0P28l01m58
5833f94L90n69M65K08Q84j496J194q74Q95O88j013N26l74j89K2K63p0k46N24l
5853E31j010J47N02j60k6m71k05J119q83l3n6Q18q58K20K71j303Q03Q90j27k65
5873i6N29n40J58J75N42N4o24q8N74o84P68m33n73J86K57p6m82L35j52p21K56
5894f35j02J660q90n3Jl27l53L62P30q03Q36n09j03P88k83m20K04j39Q34p60M22
5915D60o26o53K029o65j6j503J717n83j228N82P23o96O25l30j11m08k31M06J188
5934F80q83O43J34j036J661o38K71k59m69k59O99o64R75o40M33p44r3P34o20m43
5954e18P88j20j048N33M40m53L22k09j90o0L33K56l43L93n64J48J14K09P38K09
$$ plain form
5974 978 521 313 419 264 23 282 609 -171 233 -635 997 -350 61 -802 -825 74 414 -69 -1398
5993 -1398 -200 -833 18 -664 695 123 -976 209 48 244 55 438 77 1294 928 -443 335 -460
6011 -460 296 591 280 -105 200 -352 -92 -555 -291 208 -434 -412 -335 -95 -1062 -300 -686 -385 364 50 -814
6032 -814 -477 495 -55 361 38 272 678 987 427 391 -54 109 -124 -528 -799 -275 165 -273 -738 -302
6052 -302 -39 -1136 679 -298 -586 -411 -6 -333 -603 795 53 -297 766 -469 309 364 985 545 305
6071 305 -131 579 441 -403 546 -65 596 4 -746 -665 -27 -1309 386 103 -16 -529 344 -432 -560 -606
6091 -606 -311 -188 596 -571 -697 33 74 -95 34 308 -358 82 36 1234 624 -256 631 372 1097 -941
6111 -941 -324 -209 -864 -625 -574 -559 -319 585 -319 -675 224 24 -364 170 542 -258 -288 526 646 23 1016
$$ packed form
5974I78m57k08J06j55k41K59L27p80M04q68J632j347M11q63k3Q99L40m83j329
5993a398J198o33Q51o82J359n72j099J185j61J96j89L83l61J217l66j371P78p95
6011d60P56K95l11l85L05n52K60m63K64M99o42K2P7K40r67P62l86L01P49l14q64
6032h14L37R72n50M16l23K34M06L09n60l6m45J63k33m04k71N24M40m38m65M36
6052c02K63j097J815r77k88J75M05l27k70J398p42l50J063j235P78N5O21m40k40
6071C05m36P10j38q44R49o11O61n92p50Q1O38j282J695k83j19n13Q73p76j28m6
6091f06K95J23P84j167j26P30M1j69J29K74o66M40m6J198o10q80Q87k59P25k038
6111i41O17J15o55K39N1J5K40R04r04l56Q99k00l88N34L72q00l0Q14J20o23R93
$$ plain form
6132 1016 -394 492 485 13 369 710 671 14 -151 -380 464 342 -308 -760 563 -563 -686 965 -429
6151 -429 -221 471 93 -151 -1233 -497 250 -1237 457 -993 1246 8 -110 -52 354 110 129 166 1007
6170 1007 862 -39 -180 157 -557 -774 -39 -1374 45 -488 234 -580 -988 -13 -69 -511 585 77 -744
6189 -744 -75 -292 -652 -603 68 17 -54 1045 330 -194 -443 -75 -1132 -105 77 289 128 -1210 292
6208 292 -56 -329 -594 -568 238 -134 -392 -434 -335 269 94 41 237 320 -167 -1045 92 -828 -322 501 -579
6229 -579 -434 -548 496 -220 -225 98 -437 872 -178 -170 64 1199 290 -704 -267 -142 -1217 -738 -238 43
6249 43 -748 -233 -964 298 326 -939 -352 -195 36 -437 -266 792 106 -40 67 713 878 -454 137
6268 137 31 217 147 59 115 499 301 106 274 403 -1 134 189 -213 -1014 -162 315 -584 -198 142 94 -557
$$ packed form
6132A016j410Q86pm72L56L41l9o57j65k29Q44j22o50m52J323j126j23J651j394
6151d29K08O92l78k44j082P36P47j487J694j450K239j238j18N8M06k44J9L7Q41
6170A007j45r01j41L37p14k17P35j335J419n33P22q14m08R75n6m42J096n08q21
6189g44O69k17l60M9O71n1p1J099p15n24k49L68j057J027J82K12j61j338J502
6208B92l48k73k65K6Q06l72k58m2R9O04j75n3J96Q3m87q78J137r20N06Q23j080
6229e79J45j14J044p16nL23n35J309j050QK34J135r09r94M37J25j075M79N00K81
6249D3p91N15p31J262K8j265N87J57K31m73J71J058o86j46J07O46J65j332N91
6268A37j06J86p0q8N6L84j98j95J68J29m04J35N5m02q01Q52M77q99L86L40m8o51
$$ plain form
6290 -557 -385 1005 234 340 -176 -231 -279 530 -232 653 -30 -56 1065 809 -592 -498 -639 -668 99 -663 551
6311 551 -555 -322 -83 32 -82 -769 614 -68 -664 -92 -431 571 76 626 1079 -1021 -721 693
6329 693 840 -497 687 -338 833 -667 -693 217 64 1 62 -122 -1286 -491 -533 -55 -605 -685 -470 -489
6349 -489 247 -1390 -13 546 592 -532 -407 -68 898 345 -58 100 -318 -222 -363 194 147 -845 -76 111
6369 111 375 -204 -53 -1270 -136 -1369 -1331 343 468 -998 -732 -201 -104 720 221 424 -251 -153 254
6388 254 -14 -234 643 -550 523 -63 -634 -175 -483 324 56 51 184 -310 395 -206 -218 -690 -892 -118
6408 -118 -612 93 -432 -291 40 -277 -40 842 70 -110 -944 -119 146 -432 -15 -120 -133 -80 599 934 80
6429 80 -462 -242 -134 1495 957 49 778 688 321 -351 67 -256 -51 -740 -240 -234 -256 -773 -10 26 -681 822
$$ packed form
6290e57J72J390p71J06n16n5m8Q09p62Q85o83k6J121k56j401R4j41k9P67p62J214
6311E51j106K33K39J15j14o87J383o82n96N72l39J002m95N50M53k100L00J414
6329F93J47j337J184j025J171j500k6R10j53o3O1j84j164P95m2M78n50q0K15j9
6349d89P36j637J377N59M6j124J25L39R66n53m03J58m18R6j41N57m7r92P69J87
6369A11K64n79J51j217J134j233L8J674J25j466K66N31R7Q24m99K03o75R8M07
6388B54k68k20Q77j193J073n86n71M59l08Q07k68nJ33m94P05o01j2m72k02P74
6408a18m94P05n25J41L31l17K37Q82p72j80q34Q25K65n78M17j05j3N3O79L35q54
6429H0n42K20J08J629n38r08P29r0l67o72M18l23K05o89N00Ok2n17P63L6p07J503
$$ plain form
6451 822 -71 581 613 -49 -124 407 -274 533 -1049 618 308 -455 954 -26 -226 -640 -389 -237 211 -408
6471 -408 531 -103 232 -1108 119 -422 586 810 338 -221 -293 -215 -435 539 -679 -97 1132 85 -540
6490 -540 1007 -288 168 263 902 117 333 -9 -134 169 579 -389 -439 40 359 -747 -513 -507 610 -316
6510 -316 -1019 -388 278 -273 737 -1119 275 -980 180 -686 -896 373 265 -378 -363 821 65 17
6528 17 -3 257 417 -569 1146 -442 -750 -1005 459 -26 -942 -72 -846 -130 400 -492 160 -172 -497 394
6548 394 903 -418 -969 1586 133 698 519 264 112 -516 -48 363 -584 38 -652 136 -756 -977 -62
6567 -62 502 -709 -936 -1055 314 258 133 202 -759 -21 -77 8 741 139 302 -473 503 264 437 139 -208
6588 -208 161 469 810 -202 -1104 477 82 -640 -458 -409 -364 -683 464 -151 705 -547 550 209 417
$$ packed form
6451H22q93O52L2o62p5N31o81Q07j582J667l10p63J409r80k00m14K51J52M48o19
6471d08R39o34L35j340J227n41J008K24m72n59p2P8k20R74j218N82J229j047o25
6490e40J547j295M56R5O39p85K16l42j25L03M10r68n0M79L19j106K34OJ117r26
6510c16p03O31O66n51J010j856J394j255J160q66k10J269j08o43J5J184p56m8
6528A7k0K60J60r86J715j588l08k55J464m85r16Q70p74P16N30q92O52l32l25Q91
6548C94N09j321n51K555j453N65j79k55j52o28M68M11r47O22o90P88q92k21R15
6567f2N64j211k27j19J369n6j25O9r61P38n6Q5P33o02J63p75R76k39J73k98l47
6588b08L69L08L41j012r02J581l95p22J82M9M5l19J147o15Q56j252J097l41K08
$$ plain form
6607 417 1170 581 -260 797 609 -242 910 646 -294 23 365 -609 633 -122 382 343 373 541 195 -300
6627 -300 -80 -135 -393 342 381 -250 -1375 -422 -463 445 -180 -298 -693 -836 997 -484 82 491 -859 -307
6647 -307 -36 185 -396 -256 641 -419 68 347 -17 157 -238 67 -158 -1253 408 115 -197 636 -229
6666 -229 -390 108 336 -56 -345 -788 -572 116 -107 -267 -73 -331 -262 750 16 398 68 4 782 116
6686 116 743 -105 -630 -625 -580 738 -627 -276 -308 109 76 385 450 -515 -464 359 -337 -177 35 220 -922
6707 -922 97 446 484 -95 -247 46 967 1001 221 509 278 1136 242 -669 700 259 -391 654 -273 -698
6727 -698 -719 -355 -136 -55 662 336 237 -512 444 -452 -239 -229 -210 -28 -69 234 353 -621 833 1161 -433
6748 -433 7 123 227 500 -593 -108 552 30 290 -443 -250 -268 -173 -1035 179 -21 295 399 473 305
$$ packed form
6607D17P53n89q41J057j88q51J152k64r40L17L42r74J242p55N04l9L0J68l46m95
6627c00K20n5k58P35L9o31j125R53m1R08o25j18l95j43J833j481N66M09j350N52
6647c07K71K21n81J40Q97j060M87K79l64J74l95L05k25j095J661k93l12Q33q65
6666b29j61M98K28l92k89m43K16O88k23j60J94k58O9J012p34L82l30o4P78o66
6686A16O27q48n25NM5J318j365L51l2M17l3L09O5r65N1Q23o96J60K12J85j142
6707i22J019L49L8n79j52K93R21L4p80K88k31Q58q94r11J369m41o50J045r27m25
6727f98k1L64K19Q1P17l26r9p49R56q96K13J0J9J82m1L03J19r74J454L28j594
6748d33M40J16J04K73j093M85O60n22K60p33J93j8R5q62J214k00L16J04P4j68
$$ plain form
6768 305 145 295 -483 511 -211 678 1100 436 66 -27 403 -369 752 207 146 1093 -850 -699 -675 -733 75
6789 75 -1013 79 17 -405 -1089 -258 531 -373 -586 -614 539 925 -475 -442 -968 141 538 493 93 563
6809 563 592 244 772 168 -432 -394 -106 796 -220 -334 329 199 56 227 -955 1104 3 3 -228 -718
6829 -718 -415 -979 -176 -541 -96 53 -526 80 -316 95 231 487 591 7 422 267 -310 380 830 214
6849 214 -468 155 785 1013 -53 443 799 15 -481 -16 173 -99 -220 185 102 -348 -493 -173 -815 124
6869 124 388 314 480 48 311 458 997 -294 -222 30 -854 325 -73 301 78 281 -214 -67 520 -979
6889 -979 92 565 -108 -238 -606 -10 -73 -475 483 1051 -35 -3 679 150 301 120 539 674 343 -126
6909 -126 204 -135 384 -180 -51 209 -585 855 -551 -30 -122 -956 -240 1055 438 169 338 -40 -81 -150
$$ packed form
6768C05j60J50p78R94p22Q89M22o64l70r3M30p72J121n45o1R47j943J51K4n8Q08
6789G5j088J092o2m22o84Q31P89r04k13k8J153L86j400L3n26J109L97m5m00M70
6809E63K9l48N28o04o00L8K88R02j016j14O63j30j43J71j182K059j101%k31m90
6829g18L03n64Q03l65M45J49n79O06l96M11J36K56J04n84M15j55n77O90M50o16
6849B14o82O23O30K28j066M96L56p84m96M65J89k72j21M05q3m50j45L20o42R39
6869A24K64p4J66m32K63J47N39j291P2K52q84J179l98L74k23K03m95J47N87j499
6889i79J071M73o73j30l68N96o3m02R58N68j086L2O82n29J51j81M19J35l31m69
6909a26L30l39N19n64J29K60p94J440j406N21r2q34P16J295o17k69J69l78m1o9
$$ plain form
6929 -150 152 -342 282 -20 61 60 453 -232 -17 -52 -407 830 -200 852 -82 -15 158 824 -358 162
6949 162 -2 102 -325 866 -85 -918 -49 -102 624 -244 833 204 1103 -179 169 337 -285 1 549
6968 549 -35 744 449 405 -316 80 667 122 661 362 -21 -292 -858 -249 141 -194 93 -6 738 -242 4
6989 4 -546 52 -235 182 183 543 158 -628 -1058 -162 127 483 240 55 13 -212 584 345 -197 -97 944
7010 944 1760 593 259 -373 626 -215 -726 204 -503 83 -667 1173 -94 141 302 -264 -230 -232 76 134
7030 134 235 395 -141 358 -26 -288 706 -53 343 882 -463 119 450 336 -756 205 566 1206 -802
7049 -802 177 -369 -112 -139 515 209 696 972 -461 169 43 1062 352 -181 10 369 1019 -432 -814
7068 -814 46 590 -231 262 287 238 813 105 737 -743 16 -363 186 -157 -732 -350 -80 -640 211 -880
$$ packed form
6929a50L02m94O24l02Q1jL93o85K15l5l55J237j030J052r34O7J73O66j182N20
6949A62j64J04m27J191r51q33Q69n3P26q68J077o29Q99j282L48J68o22K86N48
6968E49n84P79k95m4p21L96N87n45N39k99l83k71n66O09L90l35K87r9P44r80K46
6989Dn50N98k87M17JL60l85p86m30Q96K89L56k43j85m2k25P96k39n42J00J041
7010I44Q16j167l34o32R99q41n11R30p07N86p50J840j267K35J61n66L4kL08N8
7030A34J01J60n36M99l84k62R94p59L96N39j345N82L31j14j092R61L61O40k008
7049h02R79n46K57k7O54l06M87K76j433O30j26J019p10n33J91L59O50j451l82
7068h14Q60N44q21M93K5m9N75p08O32j480P59l79N49l43n75L82K70n60Q51j091
$$ plain form
7088 -880 -664 -433 -667 621 979 -148 -487 518 -494 567 940 246 1241 173 289 338 230 585
7106 585 -396 -455 468 -338 -1411 391 -96 -504 -171 700 40 -747 -459 -468 178 72 -223 -326 217 223 22
7127 22 -499 -296 -398 703 1125 -44 137 -205 -15 822 988 -1128 489 -91 -331 387 -123 -615 -998
7146 -998 -540 785 370 -995 147 -343 -1102 -209 790 1147 173 -358 124 72 741 317 -551 38 1327
7165 1327 -651 623 411 155 27 360 810 613 -102 618 -37 -74 103 -1042 -701 -962 -268 -13 -717
7184 -717 602 -66 391 -156 462 453 -1196 -841 884 158 388 101 842 1316 426 -326 57 17 -857 -156
7204 -156 38 552 -18 -1179 864 360 -43 63 1064 -396 -1404 446 -224 -236 -115 334 89 -717
7222 -717 444 418 -807 -868 154 -481 205 -621 -187 -121 149 224 788 359 271 274 -332 134 554 -177 -338
$$ packed form
7088h80K16K31k34J288L58j127l39J005j012J061L73o94R95j068J16M9j08L55
7106E85r81n9R23q06j073J802m87m08L33Q71o60p87K88rO46j06k95j03N43Ok01
7127B2n21K03j02J101M22j169J81l42J90Q37J66k116J617n80k40P18n10m92l83
7146i98M58J325m15j365J142m90p59Q93R99L57r74n31M82n2O69m24q68N89J289
7165A327j978J274k12k56j28L33M50j97p15P20o55l7J77j145L41k61O94K55p04
7184g17J319o68M57n47O18rj649L55J725p26K30k87P41M74q90p52L83m0q74P01
7204a56J94N14n70j161K043n04m03J06J001j460j008J850o70j2J21M49k45q06
7222g17J161k6j225o1J022o35O86q26M34O6K70P5N64m29q8Lo06M66M20p31j61
$$ plain form
7243 -338 -63 -196 221 -253 -685 -278 -207 -654 236 -739 234 861 691 270 -419 285 -118 -1078 658 -239
7263 -239 -506 81 69 -37 -802 -326 -201 208 37 709 -600 -767 259 -206 -155 -604 -74 454 29 -80
7283 -80 -192 272 -672 761 160 975 779 204 221 -834 15 156 3 -253 -972 643 119 -744 -210 -700
7303 -700 -42 -263 -413 101 -317 -205 -146 347 258 -312 -475 376 -592 -442 128 713 312 -511 365 -355 -727
7324 -727 -59 557 15 -536 -359 159 134 192 -415 868 -418 -368 418 -818 180 -732 -273 601 374 -1023
7344 -1023 -1145 -47 -628 25 342 -427 -70 337 245 687 -41 543 434 -128 -421 208 -55 520 -273 -272
7364 -272 768 -27 -78 30 -255 -407 162 -575 -268 514 -1317 -200 -711 588 676 50 633 1232 724
7383 724 -699 -309 -275 -180 310 -240 138 694 -492 144 71 -730 260 567 18 -594 1230 121 -591 49
$$ packed form
7243c38K75j33M17m74m32M07P1m47Q90r75R73O27j70m21o89P04m03r60J736q97
7263b39k67N87j2j06p65M76J25M09j71O72j309j67J026m65N1m49N30N28m25j09
7283h0j12M64r44J433o01Q15j96n75J7j055Q49J41j53k56p19J615n24q63N34m90
7303g00O58k21j50N14m18J12N9M93q9n70j63Q51r68J50N70N85m01q23Q76p20l72
7324g27O68O16n42n51J77N18k5N8o07J283j286N0P86j236R98r12M59Q74k27j397
7344a023j22J098n81O53L17p69L57M07r2M42p28N84j09n62k93O29k63N75p93J
7364b72J040p95n1J08k85j52N69p37L07P82j831J117n11J299Q8o26N83N99n08
7383G24j423L90L4R5M90n50L78N56j186O36p3q01R90L07n49o12J824j109p12O40
$$ plain form
7403 49 -287 34 -311 -993 -367 -894 -713 -482 -884 -381 166 781 -436 370 266 -116 -146 207 301 353 -245
7424 -245 185 -299 599 -176 -392 109 -46 -89 191 -80 479 -88 -599 18 745 -133 -339 -1190 308 5
7444 5 -14 -807 -593 -189 24 -903 -541 901 -294 679 599 -641 -232 759 -483 480 273 133 -93 399
7464 399 -284 -614 304 578 -214 673 -280 385 -567 -791 -590 -556 -287 17 -901 -176 -211 298 -216 610 498
7485 498 210 705 512 64 -797 531 812 262 487 -477 -151 -231 -542 -529 715 831 -521 -433 -779 56
7505 56 -478 -29 266 -282 -37 -1337 344 -620 79 -89 860 404 84 586 -638 -820 303 544 -10
7524 -10 -106 -246 -409 -481 -552 -916 -371 -541 26 -1165 -230 206 -978 73 570 -529 -462 -1005 -515 -1354
7544 -1354 174 -5 -203 1425 697 83 61 -173 -228 731 -769 -109 -590 -452 -668 -35 104 -857 359
$$ packed form
7403D9l36L21l45o82O26n27J81K31m02N03N47O15j217Q06j04l82l0L53R4N2n98
7424b45M30m84Q98p75k16N01j55m3K80k71N59n67n11O17P27q78k06q51J498l03
7444Ej9p93K14M04K13r27L62J442j195R73q0j240M09R91j242R63k07j40k26M92
7464C99o83l30R18K74p92Q87r53O65r52k24K01L4K69L04r18P25l5N09n14Q26j12
7485D98k88M95j93m48q61J328K81n50K25r64L26q0l11J3J244J16j352Q8l46Q35
7505E6n34M49K95n48K45j300J681r64O99j68R49m56l20N02j224j82J123K41n54
7524a0r6j40j63p2p1l64N45j70N67j191R35M36j184J051M97j099O7n43M90q39
7544a354J528j79j98J628p28o14k2k34n5R59j500O60m81J38k16O33J39r61J216
$$ plain form
7563 359 36 -108 1139 -691 -492 520 -328 319 460 -445 -225 -15 90 180 -10 -790 770 -317 456
7582 456 1557 453 1027 -195 -124 -93 663 20 28 -197 -352 -50 265 -105 -171 -255 -65 -75 -764 -729 -272 -872
7604 -872 -479 -365 416 -998 -190 22 -423 1003 -787 -523 344 619 -169 -274 978 163 448 342 1202
7623 1202 41 152 -76 54 533 217 -110 -392 739 -604 145 93 -95 -647 -351 -290 98 -913 696
7642 696 522 510 219 666 -108 -115 223 134 -578 203 48 -226 -246 350 -327 518 284 434 256 -778 -741 -507
7664 -507 958 -1271 476 478 347 -5 201 -266 698 548 348 12 -398 -590 -310 505 301 28 1303
7683 1303 532 106 -127 586 1410 387 -715 -207 600 -563 246 261 537 -508 648 861 209 -19
7701 -19 -56 -218 -1095 395 -87 -839 -105 385 -393 566 514 -629 1097 1042 -504 823 331 -277 1083
$$ packed form
7563C59l23j44J247j830J99J012q48O47J41r05K20K10J05R0j90p80J560j087P73
7582D56J101j104N74j222P1L1P56o43Qk25j55L02L15l70o6q4J90j0o89L5M57o00
7604h72L93J14P81j414Q08K12m45J426j790K64Q67K75p88j05J252q15K85j06Q60
7623A202j161J11k28J30M79l16l27k82J131j343P49n2j88n52K96O1L88j011J609
7642F96j74j2k91M47p74pL38q9p12P81j55k74k0N96o77Q45k34J50j78j034L7K34
7664e07J465k229J747Kj31l52K06m67R64j50k00l36m10j92K80Q15k04k73J275
7683A303p71m26k33P13Q24j023j102N08Q07j163Q09J5K76j045J156K13o52k28
7701a9l7j62q77J490m82p52P34M90p78R59n2j143J726n5j546J327m92o08J360
$$ plain form
7720 1083 483 -49 -310 -349 -589 -824 -1226 550 -313 -756 -648 379 -294 173 -192 -388 -100 -74 99 -530
7740 -530 -462 -944 391 614 9 -21 534 447 1299 1418 -406 -315 136 120 316 320 -1052 -653 -95 -255 -36
7761 -36 -8 -399 -701 434 -137 -777 211 31 297 436 109 848 -337 735 725 284 -519 -33 367 763
7781 763 -37 -102 -631 -197 57 -348 173 -573 -233 -411 780 -506 994 -564 955 188 -436 426 -95
7800 -95 333 448 -205 -307 590 1040 -655 486 463 85 30 -656 419 665 815 319 -299 -42 229 455
7820 455 365 -347 244 -772 -867 -321 69 1129 771 -677 -36 175 161 -17 -792 -1 232 -544 -35 -281
7840 -281 -889 -254 -98 463 1077 -352 1054 239 827 -1297 -561 572 -413 -98 -690 604 -1453 14
7858 14 -133 -612 103 109 188 25 58 -92 214 243 -362 -824 36 133 812 -207 271 734 25 14 472 547 -253
$$ packed form
7720A083o00n32k61l9k40k35m02J776q63m43J08J027o73M67l65j96K88K6J73o29
7740e30O8m82J335K23o05l0N55q7Q52J19j824R1M51j6J96Mj372L99N58j60K19
7761c6K8l91l02J135n71o40R88j80K66J39l27P39j185J072j0m41q03M86M00L96
7781G63q00o5n29M34K54m05N21p46L40j78J191j286J500j558J519p67o24Q62n21
7800i5M28J15o53j02Q97M50j695J141k3l78n5o86J075K46J50m96o18K57K71K26
7820D55r0p12N91j016r5N46L90J060l58j448O41K11j4j78p75P91K33p76N09k46
7840b81o08O35J56N61O14j429J406q15N88k124P36J133r85L15n92J294k057J467
7858A4j47m79P15OP9j63L3j50L06K9o05m62Q60R7O79j019M78M63p09j1M58P5q00
$$ plain form
7881 -253 -408 -122 602 -437 -641 -589 -335 -113 -435 355 -508 -331 -842 89 -328 162 22 565 134 505
7901 505 857 114 -212 -514 602 422 1171 167 -67 401 -167 821 330 112 -545 -105 434 -305 -523
7920 -523 170 7 321 -64 -90 -286 -40 364 -1380 -809 -1025 -1061 -482 -182 292 -13 76 -102 -196 584 115
7941 115 -210 154 -266 96 -161 172 391 -542 -114 -857 -628 -560 -396 454 -382 -135 1041 916 601 -500
7961 -500 576 -649 -90 -254 -808 546 -415 641 -493 185 -15 40 -546 -276 -696 703 145 704
7979 704 61 -371 -265 769 642 -606 -279 -942 -752 -269 -161 -203 -300 -29 326 117 497 -31 -497 -254
7999 -254 605 1508 351 96 741 586 517 -22 452 377 942 605 202 -377 -147 -675 -155 -692 -638 128 215
8020 215 -360 -239 177 480 -807 -305 -5 247 -523 409 55 228 -1258 -124 148 111 491 -192 539
$$ packed form
7881b53j55K86P24j039k04N2K54K22l22P90q63J77n11R31m17M90j40N43m31L71
7901E05L52p43l26l02J116j80P49j004k34M68n68R88m91k18o57M40N39p39k18
7920e23O93j63L14l85k6j96K46M04j744N71k16l6N79L00M74l05Q9j78r4P80m69
7941A15l25L64m20L62k57L33K19r33M28p43K29O8J64Q50q36K47J176j25l15j101
7961e00J076j225N59j64n54J354r61J056j134O78k00N5n86K70m20J399n58N59
7979G04o43m32J06J034j27j248L27o63J90M83J08m2r7K71L55k09L80n28m66K43
7999b54Q59R03j157k55O45j55o9n39M74p5N65l37m03n79K30n28N20n37N4P66Q7
8020B15n75J21M16L03j287N02L00K52p70R32l54J73j486J134K72l7L80o83P31
$$ plain form
8039 539 427 810 -302 72 -119 -552 -641 429 206 -425 840 847 539 -874 25 236 -167 -640 172 550
8059 550 -452 -149 -647 172 -968 -610 372 -100 1487 451 479 -244 240 -405 -1056 357 -609 -32 564
8078 564 241 -309 -48 343 -524 276 230 -325 24 -503 -100 379 221 166 -652 669 169 145 425 734 -448
8099 -448 428 603 183 -63 -459 -203 83 340 161 809 349 -1072 -5 -1092 808 186 -576 323 9
8118 9 213 -601 579 216 -220 1376 -476 793 -536 96 298 -795 237 123 294 -193 295 49
8136 49 463 778 -267 465 387 -467 352 1134 -859 -72 218 -282 -279 -296 -783 -183 -163 -372 -415 402 -822
8157 -822 385 1201 -330 1065 -449 -120 -602 -15 -805 -962 38 -180 -314 -111 129 165 -606 -335 -1185
8176 -1185 -330 355 -134 228 -355 -334 -369 -422 800 -453 -1021 1203 -291 337 -349
$$ packed form
8039E39j12L83j112L74j91m33q9J070k23o31J265Pl08j413Q99K11m03m73Q12L78
8059E50j002L03m98Q19j140L58R82m72J587j036K8p23M84o45o51J413r66N77N96
8078E64l23n50K61L91q67Q00m6n55L49n27M03M79j58n5q18J321n00k4K80L09j182
8099d48Q76J75m20k46l96K56K86K57j79O48m60j421J067j087J900o22p62Q99l14
8118IK04q14J180l63m36J596j852J269j329O32K02j093J032j14J71m87M88k46
8136D9M14L15j045P32p8q54Q19P82j993P87K90n00Lj7m87O00K0k09m3Q17j224
8157h22J207Q16j531J395j514L29m82N87p90j57J000k18j34K03K40L6p71K71q50
8176a185Q55O85m89L62n83K1l5n3J222j253n68K224j494O28o86
8191c49
$$ Imaginary data points
##PAGE= N=2
##DATA TABLE= (X++(I..I)), XYDATA
$$ plain form
0 0 0 0 0 0 0 0 0 0 0 0 0 0 0 0 0 0 0 0 0 0 16 -105 108 -108 108 -108 108 -125 200 -216 216 -235 312 -327 360
35 360 -425 461 -533 576 -658 733 -802 893 -989 1095 -1212 1334 -1467 1615 -1780 1962
51 1962 -2164 2388 -2627 2913 -3228 3582 -4011 4495 -5081 5781 -6659 7771 -9254 11324
65 11324 -14427 19536 -29505 55906 -260450 -584192 214476 260783 -128105 71845 253734
76 253734 -103637 -16722 286190 57410 -116899 180797 125255 -157826 8470 194984
86 194984 -29526 -68285 96873 -12000 -118600 55217 29199 -178862 -97280 45858 -80920
97 -80920 -103410 38179 -26570 -125455 23627 78776 -57220 -23024 82887 -15463 -53228
108 -53228 85834 64636 -51737 37421 109634 -2150 -10592 93169 31344 -58260 31098
$$ packed form
0@%%%%%%%%%%%%%%%%%%%%J6j21K13k16K16k16K16k33L25m16M32m51N47o39O87
35C60p85Q86r94J109j234J391j535J695j882K084k307K546k801L082l395L742
51A962m126M552n015N540o141O810p593Q506r576J0862j2440J4430j7025K0578
65A1324k5751L3963m9041Q5411l16356l23742P98668M6307l88888J99950J81889
76B53734l57371Q6915L02912k28780j74309K97696n5542k83081J66296J86514
86A94984k24510l8759J65158j08873j06600J73817k6018k08061Q1582J43138j26778
97h0920k2490J41589o4749r8885J49082N5149j35996L4196J05911r8350l7765
108e3228J39062k1198j16373Q9158P2213j11784q442J03761o1825q9604Q9358
$$ plain form
119 31098 66904 -44342 -49329 26770 -21728 -70074 -180 7648 -71387 -50669 6069 -39311
131 -39311 -60535 12011 8695 -49598 -9438 36430 -4479 -1197 54822 25961 -10198 53970
143 53970 75553 3670 6792 69172 41188 -4706 32308 32517 -32137 -22440 22956 -18750 -52930
156 -52930 -6378 -7513 -61627 -33594 6587 -40454 -50620 2345 -16400 -55026 -3479 19057
168 19057 -33202 -12176 50338 15573 -12014 49921 50108 -7250 29407 68984 9567 -8060
180 -8060 46207 20943 -20931 27144 35442 -34110 -19887 30213 -17104 -47999 4544 -9206
192 -9206 -65565 -23456 16028 -45235 -50482 15502 -5342 -41451 14663 32864 -24743 -4832
204 -4832 49278 13168 -4134 45472 35224 -10130 23556 47198 1754 2093 36520 -261 -28663
$$ packed form
119C1098L5806j11246m987P6099m8498m8346O9894P828p9035K0718N6738m5380
131c9311k1224P2546l316n8293M0160M5868m0909L282N6019k8861l6159O4168
143E3970K1583p1883L122O2380k7984m5894L7014K09o4654R697M5396m1706l4180
156e2930M6552j135n4114K8033M0181m7041j0166N2965j8745l8626N1547K2536
168A9057n2259K1026O2514l4765k7587O1935J87n7358L6657L9577n9417j7627
180h060N4267k5264m1874M8075Q298o9552J4223N0100m7317l0895N2543j3750
192i206n6359M2109L9484o1263n247O5984k0844l6109N6114J8201n7607J9911
204d832N4110l6110j7302M9606j0248m5354L3686K3642m5444L39L4427l6781k8402
$$ plain form
217 -28663 17902 16249 -38776 -27459 5541 -28337 -39405 -681 -15988 -53249 -18032 8856
229 8856 -24172 -21197 16879 394 -17742 21931 33311 292 13911 39298 14123 9901 44850
242 44850 33174 -968 19679 36461 2517 -5456 21923 18 -32011 -8606 1978 -31735
254 -31735 -33505 -8492 -26001 -41756 -10645 -7149 -37662 -25159 4379 -13696 -19913 15212 11663
267 11663 -12240 14950 38690 9951 9752 43358 24371 454 32123 39969 -919 3774 32512
280 32512 2929 -17231 13704 5123 -33993 -15080 4474 -31369 -33167 103 -20366 -42526
292 -42526 -5808 5523 -31917 -16761 18610 -7658 -18408 24798 18774 -13543 17149 40897
304 40897 5885 5014 40850 20020 -7699 24555 29242 -12704 -3316 21150 -11430 -24088 9957
$$ packed form
217b8663M6565j653n5025J1317L3000l3878j1068L8724j5307l7261L5217K6888
229H856l3028K975L8076j6485j8136L9673J1380l3019J3619K5387k5175m222L4949
242D4850j1676l4142K0647J6782l3944p973K7379k1905l2029K3405J0584l3713
254c1735j770K5013j7509j5755L1111L496l0513J2503K9538j8075o217L5125l549
267A1663k3903K7190K3740k8739j99L3606j8987k3917L1669P846m0888M693K8738
280C2512k9583k0160L0935q581l9116J8913J9554l5843j798L3270k0469k2160
292d2526L6718J1331l7440J5156L5371k6268j0750M3206o024l2317L0692K3748
304D0897l5012q71L5836k0830k7719L2254M687m1946R388K4466l2580j2658L4045
$$ plain form
317 9957 -5718 -41653 -13935 3285 -35072 -30777 4689 -17018 -35538 2699 10598 -22890 -4467
330 -4467 23857 -430 -5025 33522 24673 -2413 23353 38448 7183 11522 37481 12069 -7188
343 -7188 18882 16310 -16145 -4859 10750 -20016 -27913 1368 -10065 -38927 -18898 -6006 -30678
356 -30678 -25656 185 -16264 -26842 3008 8342 -11819 2996 23103 4436 1863 28011 23381
369 23381 2884 19588 29170 6544 8736 27781 10808 -8185 10666 13237 -12487 -9702 3946
382 3946 -16443 -28109 -6035 -8184 -28437 -17080 -3182 -19843 -18638 5886 -3612 -17178 5137
395 5137 14433 -4270 3391 25645 9454 -760 22889 23616 954 12268 24739 1879 -2057
408 -2057 19002 6306 -16685 -1859 4826 -19804 -18462 -702 -17880 -30064 -6091 -6943 -27836
$$ packed form
317I957j5675l5935K7718J7220l8357M295L5466k1707j8520L8237P899l3488J8423
330d467K8324k4287m595L8547q849k7086K5766J5095l1265M339K5959k5412j9257
343g188K6070k572l2455J1286J5609l0766p897K9281j1433k8862K0029J2892k4672
356c0678N022K5841j6449j0578K9850N334k0161J4815K0107j8667k573K6148m630
369B3381k0497J6704R582k2626K192J9045j6973j8993J8851K571k5724K785J3648
382C946k0389j1666K2074k149k0253J1357J3898j6661J205K4524r498j3566K2315
395E137R296j8703P661K2254j6191j0214K3649P27k2662J1314J2471k2860l936
408b057K1059j2696k2991J4826O685k4630J342J7760j7178j2184K3973q52k0893
$$ plain form
421 -27836 -12063 3578 -16355 -15264 12839 5058 -10495 10409 21391 2378 9713 31287 13174
434 13174 4031 25407 24290 1917 12497 21824 -2284 -6897 11981 -295 -21365 -5790 -2945
447 -2945 -24837 -17863 -923 -19667 -29472 -6273 -7768 -25505 -10237 5859 -12940 -11012 13244
460 13244 8181 -2564 14857 20227 2984 11814 28349 11552 2027 19585 16463 -1029 9788
473 9788 15019 -5371 -9112 8040 -4094 -17840 -5858 -4876 -23548 -17236 -2621 -16087 -23081
486 -23081 -6098 -4368 -15448 -3476 6974 -4226 -3504 13861 10529 2925 15863 19988 5666
499 5666 8933 22242 12666 2329 11258 10830 -3173 42 7974 -7902 -14001 -2878 -8178 -19977
513 -19977 -13406 -7169 -21186 -21688 -5034 -7896 -17012 -3923 3283 -9235 -423 14888 5781 -419
$$ packed form
421b7836J5773J5641j9933J091K8103p781j5553K0904J0982j9013P335K1574j8113
434A3174r143K1376j117k2373J0580R327k4108m613J8878j2276k1070J5575K845
447b945k1892O974J6940j8744r805K3199j495j7737J5268J6096j8799J928K4256
460A3244n063j0745J7421N370j7243Q830J6535j6797r525J7558l122j7492J0817
473I788N231k0390l741J7152j2134j3746J1982R82j8672O312J4615j3466o994
486b3081J6983J730j1080J1972J0450j1200P22J7365l332p604J2938M125j4322
499E666L267J3309r576j0337Q929m28j4003L215P932j5876o099J1123n300j1799
513a9977O571O237j4017n02J6654k862r116J3089P206j2518Q812J5311r107o200
$$ plain form
527 -419 17556 19336 4681 13896 25119 9443 5200 19905 12848 -2444 7791 9806 -9503
540 -9503 -6994 4863 -9974 -22400 -4679 -6069 -23551 -13261 -3122 -20150 -20939 -1248 -6569
553 -6569 -17640 1020 7442 -8723 892 19304 7096 607 18750 17989 3662 15393 22951
566 22951 4565 2530 18371 8450 -5287 6344 5853 -12932 -8442 2863 -12761 -19932 -5522
579 -5522 -8092 -22164 -10549 -2414 -15454 -13935 2674 -2533 -10019 6192 10810 -1746 5816 19801
593 19801 9764 5845 18681 13911 2162 11647 16374 -472 -1592 9269 1088 -9994 -1882
606 -1882 -1296 -15844 -12761 -3733 -13028 -18582 -7247 -8599 -17962 -8375 1369 -7825 -7807 5340 4518
621 4518 -1773 9426 14380 4315 8546 19710 13263 5952 15815 15262 1222 5781 14092 1149
$$ packed form
527d19J7975J780j4655R215J1223j5676m243J4705p057j5292J0235K015j9309
540i503K509J1857j4837j2426J7721j390j7482J0290J0139j7028p89J9691n321
553f569j1071J8660O422j6165R615J8412j2208o489J8143p61j4327J1731P558
566B2951j8386k035J5841r921j3737J1631m91j8785M490J1305j5624p171J4410
579e522k570j4072J1615Q135j3040J519J6609n207p486J6211M618j2556P562J3985
593A9801j0037l919J2836m770j1749R485M727j6846j120J0861q181j1082Q112
606a882N86j4548L083R028r295n554J1335j352r363R587R744r194J8J3147q22
621D518o291J1199M954j0065M231J1164o447p311R863n53j4040M559Q311j2943
$$ plain form
635 1149 -4839 2629 -1745 -12964 -4890 -2649 -15786 -16413 -5496 -13078 -19447 -6490 -4916 -15986
649 -15986 -8070 3890 -3584 -5424 7918 7512 -721 11327 17397 5370 6616 18696 11155 2897
663 2897 13901 14406 -1901 2548 9593 -3666 -7605 1689 -5270 -16066 -6913 -2236 -16095 -14838
677 -14838 -1469 -10801 -15391 -1127 140 -10904 -2561 8433 -502 163 12986 9640 806 14004
691 14004 16969 4563 7421 15894 6986 458 9989 6190 -5919 -337 3700 -9074 -11355 -1286
705 -1286 -8006 -17782 -8562 -5606 -14863 -10861 -3777 -9324 -9447 1682 1761 -5500 2072 9460 4918 5796
721 5796 14113 11389 6614 12820 13918 7784 6440 11687 4388 506 5032 3591 -5368 -5005 -1544
736 -1544 -8041 -12580 -7090 -9177 -14383 -10573 -7805 -10660 -10596 -2818 -5117 -7453 55 4338 -469 1401
$$ packed form
635A149n988P468m374j1219Q074K241j3137o27J0917p582o369J2957J574j1070
649a5986P916J1960p474j840J3342m06q233J2048O070j2027J246J2080p541q258
663B897J1004N05j6307M449P045j3259l939R294o959j0796R153M677j3859J257
677a4838J3369r332m590J4264J267j1044Q343J0994q935O65J2823l346q834J3198
691A4004K965j2406K858Q473q908o528R531l799j2109N582M037j2774k281J0069
705a286o720r776R220K956r257M002P084n547j23J1129P9p261P572P388m542Q78
721E796Q317k724m775O206J098o134j344N247p299l882M526j441q959L63L461
736a544o497m539N490k087n206L810K768k855O4P778k299k336P508M283m807J870
$$ plain form
752 1401 9567 8192 5519 11622 12532 5460 8291 13993 7137 3089 8405 4018 -3674 -723 2656
767 2656 -6965 -9171 -3179 -7321 -12369 -7490 -6115 -12731 -9629 -2517 -6519 -8841 1447 1956 -4804
782 -4804 2616 11126 2719 4814 12441 8713 3925 11553 13577 2394 5244 12201 4399 -2985 4349
797 4349 931 -9931 -5199 -910 -10601 -11513 -4326 -9967 -15132 -5347 -5115 -12196 -7635 1521 -4612
812 -4612 -5505 5332 4772 -1110 6059 12348 5830 6429 15154 9149 4345 11312 11898 2031 3759 8058
828 8058 -113 -3852 2573 -1800 -10360 -5851 -4101 -12635 -11409 -4927 -10007 -15317 -5126 -4187 -8798
843 -8798 -5677 1858 -3136 -2014 7161 5945 1594 7340 11733 5166 6452 13175 9857 1989 7116
858 7116 8298 557 832 4297 -2603 -5848 -572 -2978 -11993 -7372 -3543 -10579 -10768 -3408 -6678 -10589
$$ packed form
752A401Q166j375k673O103R10p072K831N702o856m048N316m387p692K951L379
767B656r621k206N992m142n048M879J375o616L102P112m002k322J0288N09o760
782d804P420Q510q407K095P627l728m788P628K024j1183K850O957p802p384P334
797D349l418j0862M732M289r691r12P187n641n165R785K32p081M561R156o133
812d612q93J0837n60n882P169O289o518N99Q725o005m804O967N86r867J728M299
828H058q171l739O425m373q560M509J750q534J226O482n080n310J0191R39m611
843h798L121P535m994J122R175j216m351N746M393o567J286O723l318p868N127
858G116J182p741K75L465o900l245N276k406r015M621L829p036j89P360l270l911
$$ plain form
874 -10589 -3098 599 -4259 -1173 4987 1817 897 9732 8510 3295 8136 12289 6652 3760 10310
889 10310 7399 -518 3809 4724 -3489 -3160 1128 -4875 -10578 -3937 -4284 -11853 -10317 -5088 -8729 -9483
905 -9483 -2556 -4009 -8696 -971 2127 -2331 1890 8935 5387 1977 10372 11045 4135 8068 11369
920 11369 5490 3772 10013 5519 -2482 3347 3873 -4897 -4858 -499 -6320 -11870 -5481 -5519 -11068 -7638
936 -7638 -3696 -9602 -8414 -1771 -2484 -5478 442 4723 -484 2489 9011 4948 2935 9295 9531 4097
952 4097 7426 9987 2631 1827 7152 2879 -3160 -1213 803 -5887 -5654 -2439 -7239 -10371 -4302 -5375
968 -5375 -9595 -5062 -2026 -5424 -5373 1089 473 -2783 3817 6943 2763 4472 10136 7270 4345 8263
984 8263 7344 2001 4074 7488 1868 -1144 3087 128 -5846 -4603 -2483 -8615 -8725 -3602 -7150 -10803
$$ packed form
874a0589P491L697m858L086O160l170r20Q835j222n215M841M153n637k892O550
889A0310k911p917M327R15q213L29M288o003n703O641l47p569J536N229l641p54
905i483O927j453m687P725L098m458M221P045l548l410Q395O73o910L933L301
920A1369n879j718O241m494q001N829N26q770L9M359n821n550O389l8n549L430
936g638L942n906J188O643p13k994N920M281n207K973O522m063k013O360K36n434
952D097L329K561p356q04N325m273o039J947K016o690K33L215m800l132O069j073
968e375m220M533L036l398N1O462o16l256O600L126m180J709N664k866k925L918
984H263r19n343K073L414n620l012M231k959n974J243K120o132j10N123l548l653
$$ plain form
1000 -10803 -6148 -4172 -8018 -5528 83 -3249 -2722 3771 4892 1029 4589 8473 5072 4413 11036
1015 11036 8190 3917 7596 8351 2556 2265 5433 989 -4173 -318 -1014 -7751 -6020 -3004 -8262
1030 -8262 -9608 -3356 -5303 -9258 -4497 -1642 -6791 -3602 1876 -621 -1288 4950 5760 1071 6064
1045 6064 10774 3507 3344 10747 6873 1747 5385 5481 -67 -593 3299 -2960 -5655 -1481 -3504 -8476
1061 -8476 -5626 -3598 -7858 -8254 -3375 -5418 -8266 -1641 -539 -4082 -848 6611 2619 189 6365
1076 6365 7686 1774 6289 9815 3829 3388 8124 4967 191 3119 2967 -3446 -3767 -185 -5008 -7127
1092 -7127 -3976 -3931 -9268 -7088 -2516 -6513 -8277 -3015 -2984 -5858 -421 1668 -1401 1259 6346 4860
1108 4860 3220 8170 8607 3826 6144 8782 4906 2265 6333 3603 -1167 53 2291 -4728 -5207
$$ packed form
1000a0803M655J976l846K490N611l332N27O493J121l863L560L884l401o59O623
1015A1036k846m273L679P55n795k91L168m444n162L855o96o737J731L016n258
1030h262j346O252j947l955M761K855n149L189N478k497o67O238Q10m689M993
1045F064M710p267j63P403l874n126L638R6n548n26L892o259k695M174k023m972
1061h476K850K028m260l96M879k043k848O625J102l543L234P459l992k430O176
1076F365J321n912M515L526n986m41M736l157m776K928j52o413l21L582m823k119
1092g127L151M5n337K180M572l997j764N262L1k874N437K089l069K660N087j486
1108D860j640M950M37m781K318K638l876k641M068k730m770J220K238p019m79
$$ plain form
1123 -5207 -147 -4344 -7536 -5842 -4598 -9612 -6090 -2183 -5778 -7444 -532 123 -5050 1363 5114
1138 5114 591 2019 6653 6077 2306 7673 7372 2528 5469 8944 3113 -378 3820 2004 -4185
1153 -4185 -1071 574 -5541 -6342 -1849 -5394 -9444 -4125 -2894 -7791 -4710 -142 -2961 -4125 1496
1168 1496 1829 -1722 2832 6220 2456 3284 9586 5930 2095 8515 7281 1397 2625 5910 1033
1183 1033 -2012 2349 -560 -5695 -3130 -3083 -7070 -6547 -2945 -5746 -8039 -3541 -1922 -6810 -4375 884
1199 884 -1390 -2012 3574 2529 -313 5425 7713 3727 3490 8864 5531 2270 6207 5454 395 1070
1215 1070 3562 -221 -3424 -764 -1794 -6644 -4590 -3550 -6836 -7302 -3338 -4442 -7001 -2711 -2004
1230 -2004 -3958 -1873 1725 -323 269 4264 4446 1157 4220 7742 4222 2797 7102 5058 741
$$ packed form
1123e207N060m197l192J694J244n014L522L907l595j666O912O55n173O413L751
1138E114m523J428M634n76l771N367l01m844K941L475n831l491M198j816o189
1153d185L114J645o115q01M493l545m050N319J231m897L081M568k819j164N621
1168A496L33l551M554L388l764Q28O302l656l835O420j234n884J228L285m877
1183A033l045M361k909n135K565M7l987N23L602k801k293M498J619m888K435N259
1199H84k274o22N586j045k842N738K288l986k37N374l333l261L937p53n059O75
1215A070K492l783l203K660j030m850K054J040l286m66L964j104k559M290P07
1230b004j954K085L598k048N92L995J82l289L063L522l520j425M305k044m317
$$ plain form
1245 741 3400 4549 -11 -1691 2120 -1390 -5116 -1788 -3203 -6323 -4484 -2042 -5880 -6048 -1913
1260 -1913 -3628 -5113 -139 1330 -1140 358 5523 2923 1030 5039 6272 1894 3862 8133 3791
1275 3791 1926 6491 3080 -1469 2147 2028 -3309 -2713 316 -2790 -6517 -2786 -3735 -8411 -4956 -3037
1291 -3037 -5805 -5658 -866 -2042 -5483 779 2694 47 936 5044 3460 2189 6706 6855 2594 5109
1307 5109 6674 1930 1345 5357 1808 -2372 1308 1108 -2460 -3646 -2211 -4543 -7161 -2679 -3277 -6607
1323 -6607 -4972 -1373 -3699 -4264 -8 280 -2516 1569 3405 1026 3094 5968 4726 3568 6643
1338 6643 5861 2407 3195 5350 1888 -523 2798 1181 -3160 -1239 180 -4264 -4689 -1833 -5840 -6734
1354 -6734 -2746 -2580 -5351 -4883 -211 -1352 -3463 1814 1966 -345 3107 5637 1639 2638 6853 4964
$$ packed form
1245G41K659J149m560j680L811l510l726L328j415l120J839K442l838j68M135
1260a913j715j485M974J469k470J498N165k600j893M009J233m378J968M271m342
1275C791j865M565l411m549L616j19n337N96L029l106l727L731r49m676L455J919
1291c037k768J47M792j176l441O262J915k647Q89M108j584j271M517J49m261K515
1307E109J565m744n85M012l549m180L680k00l568j186J435k332k618M482n98l330
1323f607J635L599k326n65M256K88k796M085J836k379K068K874j242j158L075
1338F643p82l454P88K155l462k411L321j617m341J921J419m444m25K856m007q94
1354f734L988J66k771M68M672j141k111N277J52k311L452K530l998R99M215j889
$$ plain form
1370 4964 2078 5529 5556 1980 1611 4199 1125 -3349 301 -638 -5305 -3405 -1592 -6502 -6047 -2334
1386 -2334 -3982 -7049 -3045 -1514 -4656 -3241 875 -486 -624 3664 3604 219 3614 6121 2962 2357
1402 2357 6341 4551 2474 3642 5139 -350 451 2950 -540 -3793 -669 -1136 -5653 -3678 -2154
1417 -2154 -5911 -5233 -2359 -4337 -5412 -1255 -597 -3391 -539 3323 259 -337 4223 3782 861 3334
1433 3334 5016 2592 2799 5685 3354 383 2789 1697 -1620 -1123 965 -3153 -4363 -849 -2412
1448 -2412 -5143 -4110 -2138 -5321 -4966 -465 -1951 -3498 -753 2223 -1437 184 5199 1731 1382
1463 1382 4495 5031 2709 4493 5464 2115 1982 4146 3029 -925 1337 446 -3165 -1922 -351 -2710
1479 -2710 -5437 -2345 -3355 -4736 -4240 -1590 -4140 -4089 -925 -836 -2273 666 2486 581 2279 4449
$$ packed form
1370D964k886L451K7l576l69K588l074m474L650r39m667J900J813m910M55L713
1386b334j648l067M004J531l142J415M116j361j38M288o0l385L395K507l159o05
1402B357L984j790k077J168J497n489Q01K499l490l253L124m67m517J975J524
1417b154l757O78K874j978j075M157O58k794K852L862l064n96M560m41k921K473
1433C334J682k424K07K886k331k971K406j092l317M97K088m118j210L514j563
1448b412k731J033J972l183L55M501j486j547K745K976l660J621N015l468l49
1463A382L113N36k322J784R71l349j33K164j117l954K262q91l611J243J571k359
1479b710k727L092j010j381M96K650k550N1L164Q9j437K939J820j905J698K170
$$ plain form
1495 4449 3261 1882 4866 5211 2225 3849 4796 1574 274 3196 1569 -1479 -688 369 -3473 -3279
1511 -3279 -1071 -3411 -5713 -3830 -2823 -4925 -3410 -985 -2164 -3249 855 1208 -1099 1340 3324
1526 3324 1471 2128 5902 2087 1959 4987 4891 2469 2824 4364 -290 -654 1683 -30 -3156 -1767
1542 -1767 -474 -4309 -3896 -1285 -4238 -5734 -2520 -1994 -4667 -2198 -339 -1673 -2077 2164 1841 147
1558 147 2997 4421 735 2530 6086 3362 2070 4200 4285 1404 1522 3083 -923 -981 13 -745 -3886
1575 -3886 -1704 -1821 -4798 -4202 -2090 -3654 -4555 -1400 -941 -2304 -1381 1336 -629 52 3404 2489 1011
1592 1011 3902 4944 2138 1907 5284 2012 1349 2526 2938 -608 714 1587 -2921 -3398 -458 -1845
1608 -1845 -5501 -3365 -2106 -4137 -4521 -1516 -2559 -3483 -147 -502 -1876 -610 3036 1557 742 2982
$$ packed form
1495D449j188j379K984L45k986J624R47l222j300K922j627l048P91J057l842J94
1511c279K208k340k302J883J007k102J515K425j179j085M104L53k307K439J984
1526C324j853O57L774l815j28L028r6k422L55J540m654l64K337j713l126J389
1542a767J293l835M13K611k953j496L214N26k673K469J859j334m04M241l23j694
1558A47K850J424l686J795L556k724j292K130Q5k881J18J561m006n8R94p58l141
1575c886K182j17k977N96K112j564r01L155M59j363R23K717j965O81L352r15j478
1592A011K891J042k806k31L377l272o63J177M12l546J322Q73m508m77K940j387
1608a845l656K136J259k031l84L005j043r24L336l55j374J266L646j479q15K240
$$ plain form
1624 2982 3131 2355 3683 4582 2504 1880 4697 2518 216 1920 1773 -1229 -1110 931 -3129 -3910 -1929
1641 -1929 -1627 -5758 -3688 -1856 -3688 -3764 -762 -2021 -3346 223 1749 -68 747 3510 2262 1675
1657 1675 4257 3147 606 3264 5538 1104 2057 3111 1453 -778 1037 1766 -2580 -2083 -887 -2354
1673 -2354 -4488 -2141 -3013 -5306 -2695 -672 -4313 -3554 679 -312 -2732 1328 3064 201 781 3573
1689 3573 2973 1655 4777 3486 1669 2153 3445 897 823 2518 636 -1028 -898 7 -2816 -2828 -738
1706 -738 -4071 -3266 -1850 -1657 -3448 -1911 -2 -2223 -2195 335 650 -744 2620 2434 1647 2630 4111
1723 4111 3604 2472 4107 4148 608 2227 2459 701 -542 1069 -509 -3045 -1806 -1807 -3477 -3786 -2208
1740 -2208 -3268 -4265 -1464 -501 -2941 -1887 -86 -885 -627 1955 1481 -39 2269 3520 1469 2054
$$ packed form
1624B982J49p76J328Q99k078o24K817k179k302J704j47l002J19K041m060p81J981
1641a929L02m131K070J832j832p6L002j259j325L569J526j817Q15K763j248n87
1657A675K582j110k541K658K274m434R53J054j658k231J815P29m346M97J196j467
1673b354k134K347q72k293K611K023l641P59M233r91k420M060J736k863N80K792
1689C573o00j318L122j291j817M84J292k548p4J695j882j664J30R05k823j2K090
1706g38l333Q05J416J93j791J537J909k221K8K530L15j394L364j86p87R83J481
1723D111n07j132J635M1l540J619K32j758j243J611j578k536J239jj670l09J578
1740b208j060r97K801R63k440J054J801p99K58K582m74j520K308J251k051N85
$$ plain form
1756 2054 4478 3044 494 3648 3362 337 597 1552 -1085 -806 332 -316 -3174 -1444 -1867 -3873
1772 -3873 -3395 -2049 -3909 -3636 -1706 -196 -2451 -519 545 -274 -72 2753 1290 1299 3417 3905 1511
1789 1511 2079 3242 2281 190 2154 2878 -428 382 819 -1075 -1710 -1256 -1239 -4039 -1545 -1911 -2753 -3470
1807 -3470 -1700 -1905 -3572 -302 377 -1756 238 2820 1623 879 2690 2809 2380 2751 2977 1213 1769
1824 1769 2388 2246 173 473 542 -1661 -1327 -709 -2356 -2923 -1221 -1923 -4488 -2216 -1211 -3298 -3689
1841 -3689 -160 -712 -2397 179 1413 311 1011 2653 3166 2331 3049 3405 870 2079 3087 947
1857 947 1148 2290 334 -845 339 47 -2192 -1520 -1034 -1826 -2889 -1317 -2367 -4625 -2021 -731
$$ packed form
1756B054K424j434k550L154k86l025K60R55k637K79J138o48k858J730m23k006
1772c873M78J346j860K73J930J510k255J932J064q19K02K825j463RK118M88k394
1789A511N68J163r61k091J964P24l306Q10M37j894o35M54J7k800K494l66q42p17
1807c470J770k05j667L270O79k133J994K582j197p44J811J19m29L71K26j764N56
1824A769O19j42k073L00O9k203L34O18j647n67J702p02k565K272J005k087l91
1841c689L529n52j685K576J234j102P00J642N13q35P18L56k535J209J008k140
1857I47K01J142j956j179J184k92k239O72M86p92j063J572j050k258K604J290
$$ [...]
8191c98
##END NTUPLES=NMR FID
##END=
