##TITLE=1H_Ser 78-V
 CDCl3
 8 sc, 
 8.04.2022
##JCAMPDX= 6.0         $$ Bruker NMR JCAMP-DX V2.0
##DATA TYPE= NMR FID
##DATA CLASS= NTUPLES
##ORIGIN= UXNMR, Bruker Analytische Messtechnik GmbH
##OWNER= root
$$ XWIN-NMR		Version 3.5
$$ Fri Apr  8 15:20:04 2022 Russian Standard Time (UT+4h)  she@DPX200
##.OBSERVE FREQUENCY= 200.13135
##.OBSERVE NUCLEUS= ^1H
##.DELAY= (6, 6)
##.ACQUISITION MODE= SIMULTANEOUS
##.ACQUISITION SCHEME= undefined
##.AVERAGES= 8
##.DIGITISER RES= 18
##SPECTROMETER/DATA SYSTEM= spect
##.PULSE SEQUENCE= zg30
##.SOLVENT NAME= CDCl3
##.SHIFT REFERENCE= (INTERNAL, CDCl3, 0, 15.7039)
##AUDIT TRAIL= $$ (NUMBER, WHEN, WHO, WHERE, WHAT)
$$ ##TITLE= Audit trail, XWIN-NMR		Version 3.5
$$ ##JCAMPDX= 5.01
$$ ##ORIGIN= Bruker BioSpin GmbH
$$ ##OWNER= she
$$ F:/spectra/data/she/nmr/H-F/1/audita.txt
$$ ##AUDIT TRAIL=  $$ (NUMBER, WHEN, WHO, WHERE, WHAT)
(   1,<2022-04-08 15:18:46.03 +0400>,<she>,<DPX200>,
      <created by zg, POWCHK disabled, PULCHK disabled
       configuration hash MD5:
       00 E9 B6 7A A2 85 ED C7 34 08 36 98 17 FE 4E 26
       data hash MD5: 16K
       99 5A 0D 96 AE EE 5C 20 BE 3B B8 62 85 B8 FE 4A>)
$$ ##END=
$$ 
$$ hash MD5
$$ A6 19 D4 9B 84 78 9D 64 48 4F 01 F1 62 BA 83 34
##$RELAX= 
##$RELAX= 
##$RELAX= 
##$RELAX= 
##$RELAX= 
##$RELAX= 
$$ Bruker specific parameters
$$ --------------------------
##$DU= <F:/spectra>
##$EXPNO= 1
##$NAME= <H-F>
##$PROCNO= 1
##$TYPE= <nmr>
##$USER= <she>
##$AMP= (0..31)
100 100 100 100 100 100 100 100 100 100 100 100 100 100 100 100 100 100 
100 100 100 100 100 100 100 100 100 100 100 100 100 100 
##$AQSEQ= 0
##$AQ_mod= 1
##$AUNM= <au_zg>
##$AUTOPOS= <>
##$BF1= 200.13
##$BF2= 200.13
##$BF3= 200.13
##$BF4= 200.13
##$BF5= 200.13
##$BF6= 200.13
##$BF7= 200.13
##$BF8= 200.13
##$BYTORDA= 1
##$CFDGTYP= 0
##$CFRGTYP= 5
##$CHEMSTR= <none>
##$CNST= (0..31)
1 1 145 1 1 1 1 1 1 1 1 1 1 1 1 1 1 1 1 1 1 1 1 1 1 1 1 1 1 1 1 1 
##$CPDPRG= <>
##$CPDPRG1= <>
##$CPDPRG2= <>
##$CPDPRG3= <>
##$CPDPRG4= <mlev>
##$CPDPRG5= <mlev>
##$CPDPRG6= <mlev>
##$CPDPRG7= <mlev>
##$CPDPRG8= <mlev>
##$CPDPRGB= <>
##$CPDPRGT= <>
##$D= (0..31)
0 1.2 0 0 0 0 0 0 0 0.06 0 0.03 0 0 0 0 0.0002 0 0 0 0 0 0 0 0 0 0 0 0 
0 0 0 
##$DATE= 1649416725
##$DBL= (0..7)
120 120 120 120 120 120 120 120 
##$DBP= (0..7)
150 150 150 150 150 150 150 150 
##$DBP07= 0
##$DBPNAM0= <>
##$DBPNAM1= <>
##$DBPNAM2= <>
##$DBPNAM3= <>
##$DBPNAM4= <>
##$DBPNAM5= <>
##$DBPNAM6= <>
##$DBPNAM7= <>
##$DBPOAL= (0..7)
0.5 0.5 0.5 0.5 0.5 0.5 0.5 0.5 
##$DBPOFFS= (0..7)
0 0 0 0 0 0 0 0 
##$DE= 6
##$DECBNUC= <off>
##$DECIM= 32
##$DECNUC= <off>
##$DECSTAT= 4
##$DIGMOD= 1
##$DIGTYP= 9
##$DL= (0..7)
0 120 120 120 120 120 120 120 
##$DP= (0..7)
150 150 150 150 150 150 150 150 
##$DP07= 0
##$DPNAME0= <>
##$DPNAME1= <>
##$DPNAME2= <>
##$DPNAME3= <>
##$DPNAME4= <>
##$DPNAME5= <>
##$DPNAME6= <>
##$DPNAME7= <>
##$DPOAL= (0..7)
0.5 0.5 0.5 0.5 0.5 0.5 0.5 0.5 
##$DPOFFS= (0..7)
0 0 0 0 0 0 0 0 
##$DQDMODE= 0
##$DR= 18
##$DS= 0
##$DSLIST= <SSSSSSSSSSSSSSS>
$$ [...]
##$SUBNAM2= <"">
##$SUBNAM3= <"">
##$SUBNAM4= <"">
##$SUBNAM5= <"">
##$SUBNAM6= <"">
##$SUBNAM7= <"">
##$SUBNAM8= <"">
##$SUBNAM9= <"">
##$SW= 18.05172834244
##$SWIBOX= (0..15)
0 0 2 0 0 0 0 0 0 0 0 0 0 0 0 0 
##$SW_h= 3612.71676300578
##$TD= 16384
##$TD0= 1
##$TE= 0
##$TE2= 300
##$TE3= 300
##$TEG= 300
##$TL= (0..7)
0 120 120 120 120 120 120 120 
##$TP= (0..7)
150 150 150 150 150 150 150 150 
##$TP07= 0
##$TPNAME0= <>
##$TPNAME1= <>
##$TPNAME2= <>
##$TPNAME3= <>
##$TPNAME4= <>
##$TPNAME5= <>
##$TPNAME6= <>
##$TPNAME7= <>
##$TPOAL= (0..7)
0.5 0.5 0.5 0.5 0.5 0.5 0.5 0.5 
##$TPOFFS= (0..7)
0 0 0 0 0 0 0 0 
##$TUNHIN= 0
##$TUNHOUT= 0
##$TUNXOUT= 0
##$USERA1= <user>
##$USERA2= <user>
##$USERA3= <user>
##$USERA4= <user>
##$USERA5= <user>
##$V9= 5
##$VALIST= <valist>
##$VCLIST= <CCCCCCCCCCCCCCC>
##$VD= 0
##$VDLIST= <DDDDDDDDDDDDDDD>
##$VPLIST= <PPPPPPPPPPPPPPP>
##$VTLIST= <TTTTTTTTTTTTTTT>
##$WBST= 1024
##$WBSW= 4
##$XGAIN= (0..3)
0 0 0 0 
##$XL= 0
##$YL= 0
##$YMAX_a= 155929
##$YMIN_a= -263437
##$ZGOPTNS= <>
##$ZL1= 120
##$ZL2= 120
##$ZL3= 120
##$ZL4= 120
##$ABSF1= 10
##$ABSF2= 0
##$ABSG= 5
##$ABSL= 3
##$ALPHA= 0
##$AQORDER= 0
##$ASSFAC= 0
##$ASSFACI= 0
##$ASSFACX= 0
##$ASSWID= 0
##$AUNMP= <proc_1d>
##$AZFE= 0.1
##$AZFW= 0.1
##$BCFW= 1
##$BC_mod= 2
##$BYTORDP= 1
##$COROFFS= 0
##$CY= 11.3945322036743
##$DATMOD= 1
##$DC= 2
##$DFILT= <>
##$DTYPP= 0
##$F1P= 2.36226072786647
##$F2P= -0.459571619588291
##$FCOR= 0.5
##$FTSIZE= 0
##$FT_mod= 4
##$GAMMA= 1
##$GB= 0.15
##$INTBC= 1
##$INTSCL= 1
##$ISEN= 128
##$LB= 0.24
##$LEV0= 0
##$LPBIN= 0
##$MAXI= 10000
##$MC2= 0
##$MEAN= 0
##$ME_mod= 0
##$MI= 1.114404
##$NCOEF= 0
##$NC_proc= 0
##$NLEV= 6
##$NOISF1= 3.799351
##$NOISF2= 2.8
##$NSP= 1
##$NTH_PI= 0
##$NZP= 0
##$OFFSET= 15.70392
##$PC= 1
##$PHC0= -18395.71
##$PHC1= 21.00078
##$PH_mod= 1
##$PKNL= yes
##$PPARMOD= 0
##$PSCAL= 0
##$PSIGN= 0
##$REVERSE= no
##$SF= 200.130013532006
##$SI= 16384
##$SIGF1= 3
##$SIGF2= 2
##$SINO= 400
##$SIOLD= 16384
##$SREGLST= <1H.CDCl3>
##$SSB= 0
##$STSI= 0
##$STSR= 0
##$SW_p= 3612.71676300578
##$SYMM= 0
##$S_DEV= 0
##$TDeff= 0
##$TDoff= 0
##$TI= <>
##$TILT= no
##$TM1= 0
##$TM2= 0
##$TOPLEV= 0
##$USERP1= <user>
##$USERP2= <user>
##$USERP3= <user>
##$USERP4= <user>
##$USERP5= <user>
##$WDW= 1
##$XDIM= 8192
##$YMAX_p= 0
##$YMIN_p= 0
$$ End of Bruker specific parameters
$$ ---------------------------------
##NTUPLES= NMR FID
##VAR_NAME=  TIME,          FID/REAL,        FID/IMAG
##SYMBOL=    X,             R,               I
##VAR_TYPE=  INDEPENDENT,   DEPENDENT,       DEPENDENT
##VAR_FORM=  AFFN,          ASDF,            ASDF
##VAR_DIM=   8192,          8192,            8192
##UNITS=     SECONDS,       ARBITRARY UNITS, ARBITRARY UNITS
##FACTOR=    0.0002768,     1,               1
##FIRST=     0,             0,               0
##LAST=      2.2672688,     0,               0
##MIN=       0,             -263437,         0
##MAX=       2.2672688,     155929,          0
$$ Real data points
##PAGE= N=1
##DATA TABLE= (X++(R..R)), XYDATA
$$ [...]
1820A471j32k71r77j24p9M16P41p93o44q38j7N31R46L56m72l85n11P08N01L17
$$ 1471 1339 1068 91 -33 -112 304 1045 252 -392 -1230 -1247 -716 230 586 114 -271 -782 -74 427 744
1840G44K16r18n30L44M31P23j58l95m41m58N33L81R5o4r87n23L85L22L28j48k12
$$ 744 960 42 -488 -144 287 1010 852 457 16 -442 91 472 567 503 -484 -1007 -622 -300 28 -120 -332
1861c32n35m54Q50O32O45n64m22o63K08Q35N02k1n70o52J41L90L75M42l08j056
$$ -332 -867 -1321 -471 161 806 242 -180 -843 -635 200 702 681 111 -541 -400 -10 365 807 499 -557
1881e57j08L27N37M88k94o89q29K67N30N64K47p24n86j73M78Q20J31k61o60m41
$$ -557 -665 -338 199 687 393 -296 -1125 -858 -328 236 483 -241 -827 -1000 -522 298 429 168 -492 -933
1901i33K30Q06J56j43j57p17N36L42O57K69l11o74j64L60P38L1N9q55m71Q0K20
$$ -933 -703 103 259 116 -41 -758 -222 120 777 1046 735 61 -103 257 995 1026 1085 230 -241 -161 59
1922E9N30M13n56r33J41j32O15L53k11m51m12L0M39Q75M5n52m32l38L82N08N67
$$ 59 589 1002 446 -487 -346 -478 137 490 279 -172 -584 -554 -115 760 805 253 -179 -517 -135 373 940
1943I40o51j32l44k78P72L88l62k68p32p4M92K79n6m37k87o41M34O21N95k61l90
$$ 940 289 157 -187 -465 307 695 333 65 -667 -741 -249 30 -26 -463 -750 -1391 -957 -336 259 -2 -392
1964c92n71K39P22M07L30o91o27pM95R27jk10m56l25o0P67K63j26m92q80J32K18
$$ -392 -963 -724 -2 405 735 44 -583 -590 -95 832 831 621 165 -160 -220 547 810 684 192 -688 -556 -338
1986c38O94K38n76o46j48L95K72K64J60n97l41J69N98M22J2j46o26j18M36J26
$$ -338 356 594 18 -628 -776 -381 -109 155 315 -282 -623 -454 144 566 578 432 -194 -312 124 250
2006B50M74l90l11n78L24L52L16l6j11o25k34N73K24K31k85q89Q0J35M60N17K32
$$ 250 724 334 23 -555 -231 121 437 401 290 -335 -569 4 228 459 174 -715 -635 -500 -40 477 709
2027G09o91n84J15K78O16Kk33p14J07O36mM27O9r11K55r6K60K22J45n80l49k19
$$ 709 18 -566 -451 -173 443 445 212 -502 -395 241 237 664 733 -178 77 -19 241 463 608 28 -321 -540
2049e40O48L22j01j72l79m88L56J93J46J50o56j93N5K64M96J07k05m34l32O98
$$ -540 108 430 329 157 -222 -710 -354 -161 -15 135 -521 -714 -659 -395 101 208 3 -431 -763 -65
2069f5K61K67M9k44j68J68K03N24k30j27n83q75L51P43K18n11n27o34N30N31N38
$$ -65 196 463 512 268 100 268 471 995 765 638 55 -820 -469 274 492 -19 -546 -1180 -650 -119 419
2090D19k25m78m19J81J11N89J91n09r3k27N26N30P18q33l49q0j04K12Q2K37o60
$$ 419 194 -284 -703 -522 -411 178 369 -140 -233 -460 66 596 1314 481 132 52 -52 160 242 479 -181
2111a81k30j95K1O84k6m25R4o8l10L23N98k61n30j25K67K20K16J29nm86L1J06
$$ -181 -411 -606 -585 99 73 -352 -258 -326 -636 -313 285 24 -506 -631 -364 -144 72 201 196 -290 -259 -153
2133a53O07J3K00n07l31K4J64K33K36k71l63l29p5P42L03k64k01o20n0R73L08
$$ -153 454 467 667 160 -171 -147 17 250 486 215 -148 -477 -552 190 493 229 28 -592 -642 331 639
2154F39L9n44n48K63M59%L19m52n08j08J92O39K82j0n70n75R1O05K03j85K49o15
$$ 639 678 134 -414 -151 308 308 627 175 -333 -441 -249 390 672 662 92 -483 -392 213 416 231 480 -135
2176a35J07K87J93K47j64n85l50n9M71J10l67k76l93j41N25J80L91J38p19j78
$$ -135 -28 259 452 699 535 -50 -400 -459 12 122 -245 -521 -914 -1055 -530 -350 41 179 -540 -718
2196g18K72N21M39Q4l27k51q6L99M24M9j5r75k04O5K60J91j45o32j77l9P04O4
$$ -718 -446 75 514 598 271 20 -66 333 757 806 791 -184 -388 -323 -63 128 -17 -649 -826 -865 -161 -97
2218i7j11k8j97j68L69L18J13K2n59L69J58Q2N66k28m45k04j87K12L49l4j16m60
$$ -97 -208 -236 -433 -601 -232 86 199 221 -338 31 189 271 837 609 164 -40 -227 -15 334 300 184 -276
2240b76l06K43L72M20m0o73n10L32j39P12J02Q4n62l45N36K17J90J59m59r5R4
$$ -276 -582 -339 33 453 413 -260 -770 -438 -577 135 237 321 -241 -586 -50 167 357 516 57 -38 56
2261E6M39M17j17m87k74P9p8O53j66k32o43l34J75L80N26k34k08l35k1K39M55
$$ 56 495 912 795 308 34 113 35 688 522 290 -353 -687 -512 -132 394 160 -48 -383 -404 -165 290
2282B90K32n79l55j10J66M60J30Km66m28L03J76K96Mm9k12m51K56L45L75K3l42
$$ 290 522 -57 -412 -522 -356 104 234 236 -230 -658 -355 -179 117 121 72 -140 -591 -335 10 385 408 66
2304F6l51L36K60J71K69o78l55k98K42M22l5q9n50J85J06L75j32J06j72n80M75
$$ 66 -285 51 311 482 751 73 -282 -580 -338 84 49 -40 -590 -405 -299 76 -56 50 -122 -702 -227
2325b27L35K57L45k17l40l08O07K16r0Q1l19n26J64Q2N61j72n69l52j36J55M77
$$ -227 108 365 710 493 153 -155 452 668 578 659 340 -186 -22 60 621 449 -120 -472 -608 -453 24
2346B4M37n42j61j20l25P99m0M20o02k14k6N53O6P34o14n14J54j09N28K02m9m14
$$ 24 461 -81 -242 -362 -687 112 72 492 -110 -324 -350 203 269 1003 389 -125 29 -80 448 650 601 187
2368A87m23P0L91J99l70l66l23j88K64O62rl8j68k42j91L26J06K31k32m29J30
$$ 187 -236 -166 225 424 54 -312 -635 -823 -559 103 94 56 -112 -354 -545 -219 -113 118 -114 -543 -413
2389d13K71M28L48m42k50q1j1K59N43l32j82k27j47k3O96j06l59j94M9K5K00N27
$$ -413 -142 286 634 192 -58 -139 -150 109 652 320 138 -89 -236 -259 437 331 -28 -222 -173 -148 52 579
2411E79m72k73l24M5K52M65j2p4j41l27M18K31J41j54o05K7K39K02J93R1k73j13
$$ 579 107 -166 -490 -445 -193 272 260 186 45 -282 136 367 508 354 -251 -224 15 217 410 501 228 115
2433A15k27J54M85M0l17k28m30Q9j38O23k07j10j08K24K0j65L42k42k44k81O89
$$ 115 -112 42 527 567 250 22 -408 -319 -457 166 -41 -151 -259 -35 -15 -180 162 -80 -324 -605 84
2454H4k29N54l7k93n42M17K52M2K28j04n80j98M53L46l2k9p78J5L3L07L17l1p00
$$ 84 -145 409 372 79 -463 -46 206 248 476 372 -208 -406 47 393 361 332 -446 -431 -398 -91 226 195 -505
2477e05O0R8J3N82j71j6k90L7K9L51P1J10l33r5j03K49M96P2m63K3q8j27L44o2
$$ -505 -445 -347 -334 248 77 61 -229 -192 -163 188 259 369 36 -59 -162 87 583 655 192 215 127 0 344 282
2501B82k21k86k32j37O84P3j05j90J2l50J72L36N3m4o3k5k98L13K48J51k46r7
$$ 282 61 -225 -457 -594 90 163 58 -132 -120 -470 -298 38 91 47 -16 -41 -339 -26 222 373 127 30
2523C0L3n0Q6J49j35l82L9J04L1N16k09k01l52J01K17J90j52j91L8k56K48L3K24
$$ 30 63 13 99 248 113 -269 -230 -126 -95 421 212 11 -341 -240 -23 167 15 -176 -138 -394 -146 -113 111
2546A11j5M4l22j51L57O5j23N9j04m04N93j0J66K96l88j81j66L91J08l51o4j2
$$ 111 96 140 -182 -333 24 89 -34 25 -79 -483 110 100 266 562 174 -7 -173 218 326 -25 -89 -101
2568a01k66M63R1j06N1o40M0K52K01J86l48O2k3O2J31J72k36K1J36q2J54P7j05
$$ -101 -367 96 187 81 132 -508 -468 -216 -15 171 -177 -115 -138 -76 55 227 -9 12 148 66 220 297 192
2591A92J67k74j73K10K79k14K9k41l34K08J69o8L4N4n51K7K98j42K45M41q35L01
$$ 192 359 85 -88 122 401 187 216 -25 -359 -151 18 -50 -16 38 -513 -486 -188 -330 -85 356 -479 -178
2613a78m2L24J3L26k73j87n32O25L53r0J3l56j8n7J31j33K03l06r8r2J22J3J35
$$ -178 -220 104 117 443 170 -17 -549 76 429 339 352 -4 -22 -79 52 -81 122 -184 -282 -374 -252 -239 -104
2636a04J97n21r3M09J42M17n57O8q8Q5K08m8Q0L1j07l45K09n6L54o4k11l42L05
$$ -104 93 -428 -521 -112 30 447 -110 -42 -130 -45 163 115 195 226 119 -226 -17 -73 281 217 6 -336 -31
2659c1L63K0Q8m19o2J61j31L35m6k19q5l98L81Q5j23K7l82r0M04q7K67P0o0k5
$$ -31 332 352 440 21 -41 120 -11 324 278 59 -26 -424 -43 42 -81 -54 -436 -526 -122 -209 58 128 68 43
2683D3k86M68n1j61M47m29p5K96J18j80l1j37l86j43M59J72j33k67q8J83k47L63
$$ 43 -243 225 174 13 460 31 -44 252 370 190 159 22 -364 -507 -48 124 -9 -276 -364 -181 -428 -65
2705f5k00L10m31r2M42k94K06K88k09J37k13k24L36L11q6j73j92K30J19K5j09
$$ -65 -265 45 -386 -478 -36 -330 -124 164 -45 92 -121 -345 -9 302 216 43 -149 81 200 225 116
2726A16j1j69k90K22L69ol13j84k86K45M63j6K4n16K40k45K83M12M0k19p1k60
$$ 116 105 -64 -354 -132 237 231 -82 -266 -552 -307 156 140 164 -352 -112 -357 -74 338 378 159 88 -172
2748a72K99J57q5J59p1k73M6R2K79l32m6M6l90K50q5J83L8j81KN0K45q5k37J64
$$ -172 127 284 199 358 287 14 60 152 431 99 53 99 -291 -41 -126 57 95 -86 -84 -34 211 126 -111 53
2772E3j55O9O3o9L13m08n1PJ50K00j59R9k05Jr3J61J72l3J85k94k3o8J79K62n58
$$ 53 -102 -33 30 -39 274 -134 -185 -178 -28 172 13 112 -93 -92 -185 -24 148 115 300 6 -17 -85 94 356 -202
2797b02J23j70P7N7K01p6j42j01J03J05J24j4R6k52j94J77J83K49o8l27P0l63
$$ -202 -79 -249 -172 -115 86 10 -132 -233 -130 -25 99 85 181 -71 -265 -88 95 344 276 -51 19 -344
2819c44N17O4P4k98m3l49L92J12j21L20m37l0k04K23J26o3k28K99n53K02K73M05
$$ -344 173 237 311 13 -30 -379 13 125 4 324 -113 -143 -347 -124 2 -61 -289 10 -543 -341 -68 337
2841C37l45j5K1j13L43J01p6k28J23j45q8M17K54j75m68k50J3N05m4j55k56J65
$$ 337 -8 -23 -2 -115 228 329 253 25 148 3 -85 332 586 411 -57 -307 -294 211 167 12 -244 -79
2863g9j2R7K56l70L9j12K10m6pJ55j05k93M3J06K72L18k27k12Nj84N13k14%n3
$$ -79 -91 6 262 -108 -69 -181 29 -17 -24 131 26 -267 -224 -118 154 472 245 33 38 -146 367 153 153 100
2887A00k17j64J23J86m5J93m58J44j28ML00J23j65k21j29J95J75J69k02l1L8Q3
$$ 100 -117 -281 -158 28 -17 176 -282 -138 -266 -262 38 161 -4 -225 -354 -159 16 185 -17 -48 -10 73
2909G3j41J45K02k36o4O5K56j95j25L48m59j41J13K36q1P4L9k67o7r2L68N7r0
$$ 73 -68 77 279 43 -21 44 300 105 -20 328 -131 -272 -159 77 -4 70 109 -158 -225 -317 51 108 18
2932A8k51k77L73L78R0q9l50q5N9K22J30%N5j23j44J03K7Q5j02j63k67K49J16
$$ 18 -233 -510 -137 241 331 242 -108 -193 -134 88 218 218 273 150 6 109 136 221 119 -44 -311 -62 54
2955E4j4k0M6m24J70K22j01N4q6M5j07l2K2M55j94R8j79Oj72K71j41J53o7k35
$$ 54 40 20 66 -358 -188 34 -67 -13 -99 -54 -161 -193 -171 284 90 188 9 15 -157 114 -27 126 59 -176
2979a76K90j61M56k91j95M0J26o3O1k1j88j97QK72M5pk13j7J49m7K72m3OK56o20
$$ -176 114 -47 409 118 -77 -37 89 26 87 66 -122 -319 -311 -39 6 -1 -214 -231 -82 -129 143 100 106 362 -258
3004b58K5L18Q7J85j16K6m44L25j7J30q6q4k06J24J50O8k8o7l01j04K13J77l1
$$ -258 -233 85 172 357 241 267 -177 148 131 261 175 91 -115 9 159 227 199 132 -169 -273 -60 117 86
3027H6Q0j85l57K94l33M00J75j24P9l24J52l6J75Q8o2j76L87j15o9O2j48k02Q8
$$ 86 166 -19 -376 -82 -415 -15 160 36 115 -209 -57 -93 82 170 108 -68 319 204 135 197 49 -153 -65
3050f5m8j39M83j41j44m13K36p1N06m0k70l4o5R1J17J20k20p7n3n3M21J89k31
$$ -65 -113 -252 231 90 -54 -467 -231 -302 204 164 -106 -140 -205 -114 3 123 -97 -174 -227 -280 141 330 99
3073I9J03oK0Q0k03J32o6j65J39l4K45k37m5l27R0J67Mj0n6J01q1j95K85k09J43
$$ 99 202 196 216 296 93 225 159 -6 133 99 344 107 62 -265 -175 -8 -4 -14 -70 31 -50 -245 40 -169 -26
3098b6N0J1k0k1L01o5j58J66l20j1j2J65K04m6k16n7J12j33JP3j24k80J19K63
$$ -26 24 35 15 -6 295 230 72 238 -82 -93 -105 60 264 218 2 -55 57 -76 -75 -2 -126 -406 -287 -24
3122b4K0J71l38k17K4K62J70J88k77n5o5J50J95j2m4L5l02J33N4J08J6k52k3K57
$$ -24 -4 167 -171 -388 -364 -102 68 256 -21 -76 -141 9 204 192 148 183 -119 14 68 176 192 -60 -83 174
3146A74k76J04l8o7k36M22k03N7K49l67J40O2N4j53J77L2J3m50J35K64p1J24j64
$$ 174 -102 2 -36 -103 -339 83 -120 -63 186 -181 -41 21 75 -78 99 131 144 -306 -171 93 22 146 -18
3169a8L87l02j20L27P2j29qk53J09Nj19L7M0j81M0n4k2J73j18p6J15K77k91J14
$$ -18 369 67 -53 274 346 217 209 -44 65 70 -49 -12 28 -153 -113 -167 -189 -16 -134 -210 -95 182 -109 5
3193Ej17J78j24q5J77p6J79k56L27k26M6O6m4P8j48K6m01M91L5q8j18m4N6j8j54
$$ 5 -112 66 -58 -143 34 -42 137 -119 208 -18 28 94 50 128 -20 6 -395 96 131 43 -75 -119 -63 -81 -235
3218b35M69k05k47K06l7N2j66J24J00j04o8J60J26J92m30J71j20N7j25J61K8o4
$$ -235 234 29 -218 -12 -49 3 -163 -39 61 -43 -111 49 175 367 -63 108 -12 45 -80 81 109 45
3240D5r1j51p0K5M46j36o15L54K03j51L67l27N7j00J08J85K7q8n0p0n0L3J29K23
$$ 45 -46 -197 -267 -242 204 68 -547 -193 10 -141 226 -101 -44 -144 -36 149 176 88 38 -32 -82 -49 80 303
3264C03j58r0J04n3N3O8j63j69L09k66J24r0n9j48J11p7K73k05J36j77j14J64
$$ 303 145 55 159 106 159 227 64 -105 204 -62 62 -28 -87 -235 -124 -201 72 -133 3 -174 -288 -124
3286a24J28K4m2n7K51j93kkJ5p0J1P9K84m30K68k22J27J5J55k86J89O0l63J88
$$ -124 4 28 -14 -71 180 -13 -15 -17 -2 -72 -61 18 302 -128 140 -82 45 60 215 -71 118 178 -185 3
3310Cj2l42K55J56L8n9j31j23N4J06l5n3J15Pl63M05J3K39j55k81l5L44r0QK32
$$ 3 -9 -351 -96 60 98 39 -92 -215 -161 -55 -90 -143 -28 -21 -384 21 34 273 118 -163 -198 146 56 64 296
3335B96k07m8k80K06m8K0K55k85Q0O1l5K09j86r9L2l8J9Q9K03j72o9k5j25J95
$$ 296 89 41 -239 -33 -81 -61 194 -91 -11 50 15 224 38 -61 -29 -67 -48 41 244 72 3 -22 -147 48
3359D8r1j91L38l6M7k97J56J85j04Q3m7o1K11k09k5K3k95J91l0K9O6n9j82M6J08
$$ 48 -43 -234 104 68 115 -182 -26 159 55 138 91 30 241 32 7 30 -265 -74 -104 -75 -9 -68 -250 -204 -96
3384i6K90m0o1K0j42J2K4K54p4j76rJ95k8k27L02k25m8j36L02r2lNk00J06j1J10
$$ -96 194 154 93 113 -29 -17 7 261 187 11 2 197 169 -58 244 19 -29 -165 137 45 42 47 -153 -47 -58 52
3410E2j46J79k22J43q7K40k70J40o3j39K17j19j88M22J12Jj11k09K25j7K81m02
$$ 52 -94 85 -137 6 -81 159 -111 29 -34 -173 44 -75 -263 159 271 272 161 -48 177 160 441 39
3432C9J7N7j76J35l9j2K3k18P0j63K42nK25l56n3J58P2j16K28k61L9J0L62j98
$$ 39 56 113 -63 72 33 21 44 -174 -104 -267 -25 -30 195 -161 -214 -56 16 -100 128 -133 -94 -84 278 80
3456H0J17j8k61l3L47m1j38j4P3J17j10n8Q7L4j44o2q0J07j57J06J20k34K90m35
$$ 80 197 179 -82 -115 232 191 53 39 112 229 119 61 148 182 38 -24 -104 3 -154 -48 72 -162 128 -307
3480c07pK36J10l2K8o0O6J99m04J55J18k15K1MJ32K2J01j92J1j49J97J20O7m01
$$ -307 -314 -78 32 0 28 -32 34 233 -171 -16 102 -113 -92 -88 44 66 167 -25 -14 -163 34 154 221 -180
3504a80K60N5j14J30j74q1Lk6J40K73k46Q1k13M5Q6L02l27q4K13j13K03j66q5
$$ -180 80 135 21 151 -23 -104 -101 -127 13 286 40 121 -92 -47 39 341 14 -70 143 30 233 67 -18
3527a8J58j78K6L6r4J54m4j24j76J60r5J76K13j92l44K53j00R5lK85j15j34J97
$$ -18 140 -38 -12 24 -70 84 40 -84 -260 -100 -195 -19 194 2 -342 -89 -189 -94 -97 188 73 -61 136
3550A36k14r6K01O5o2n6L7L4o5J12J00m17J51J79q5K83k48j17J31k00J49l0M7
$$ 136 -78 -174 27 92 30 -26 11 45 -20 92 192 -225 -74 105 20 303 55 -62 69 -131 18 -12 35
3573C5k79l4J53J45o3j93J91J09m13L37J74k2j2k51o4K86N3o2K7R7j92K05j74
$$ 35 -244 -278 -125 20 -43 -236 -45 64 -349 -12 162 140 128 -123 -187 99 152 90 117 214 22 227 53
3596E3m0J95k29rk62M26k12j25j2K41k16Qj05K41J02r5J48l22M3N8Pj09P7K17
$$ 53 13 208 -21 -30 -292 134 -78 -203 -215 26 -190 -182 -287 -46 56 -39 109 -213 -170 -112 -105 -214 -137 80
3620H0k56P0J76K21m52M6m7P2J56j85K16q6k4k60L77n3l0k33K55k48K20k71K92
$$ 80 -176 -106 70 291 -161 -115 -162 -90 66 -119 97 11 -13 -273 104 51 21 -212 43 -205 15 -256 36
3643C6j36L22j18k84K08k60K07l6K73m6m11L43P1n0l3J9j51m4L71l63J93j62J17
$$ 36 -100 222 104 -180 28 -232 -25 -61 212 166 -245 98 169 119 86 105 -46 -90 281 -82 111 -51 66
3666F6j48L7p3J13Lk6J98k55j03K13R2o5J1j30J44j30j25L31m64N40nj61j43J27
$$ 66 -82 -45 -118 -5 -2 -28 170 -85 -188 25 117 52 63 -67 77 -53 -178 153 -311 229 224 63 -80 47
3690D7Nm9j81J26K50k86L8j13k6L7L26l83L32l18K53j58K67k98L61m23J81j14
$$ 47 52 3 -178 -52 198 -88 -50 -163 -189 -152 174 -209 123 -195 58 -100 167 -131 230 -193 -12 -126
3712a26K70j0k22N4R3J46l7j09J38k84n9K25j6J48m5j59j73M01j29j6k6j32j82
$$ -126 144 134 -88 -34 59 205 168 59 197 -87 -146 79 63 211 166 7 -166 235 106 90 64 -68 -250
3735b50J25l4M4J87k2j04j30o5K14j40Q4J00J50j55k8K61j41j34N5n4J20q5L13
$$ -250 -125 -159 -115 72 50 -54 -184 -249 -35 -175 -91 9 159 4 -24 237 96 -38 17 -37 83 -2 311
3758C11l00O1L5j84J96j40o8N2k10J46j40K41L89m45J71j05j1j50L41o3j11Jj2
$$ 311 11 72 107 -77 119 -21 -89 -37 -247 -101 -241 0 389 -56 115 10 -1 -151 190 127 16 17 5
3781Ej65P5J79m0J68k22j94K62J00n7k81j0O4R4n1j35K52km3k22L26Kl74M6R3
$$ 5 -160 -85 94 54 222 0 -194 68 168 111 -170 -180 -116 -22 -73 -208 44 42 -1 -223 103 105 -269 -223 -130
3806a30J4K60j32J77l3l07J36K5j44K12R4K8o2q7J04k07K68n3l68L82j35J01j91
$$ -130 -116 144 12 189 156 -151 -15 10 -134 78 172 200 138 51 155 -52 216 163 -205 177 42 143 -48
3829d8L8j88K22n0K44J3k95R5r6j47K24O7K2k67O0M4J81j17O9J64l78K06n8Mk9
$$ -48 -10 -198 24 -26 218 231 -64 31 -65 -212 12 79 101 -166 -106 -62 119 2 71 235 -143 63 5 9 -20
3854b0l02M58j98O6K8O7l07M32k27k49J82k05L43m8k9j91R5qJ31J94k55q2J07
$$ -20 -322 136 -62 4 32 99 -208 224 -3 -252 -70 -275 68 20 -9 -200 -105 -113 18 212 -43 -125 -18
3877a8P5J21k13j19J60L2j93K31j36j2K01l05J13M8rkO9p3K4L4N6k45P3K54j95
$$ -18 57 178 -35 -154 6 38 -155 76 -60 -72 129 -176 -63 -15 -24 -26 43 -30 -6 28 84 -161 -88 166 -29
3902b9j22K34j37J32k38K92k04J54J06k30L86k67n8P8l4j23QJ29j22J63j07k42
$$ -29 -151 83 -54 78 -160 132 -72 82 188 -42 344 77 19 97 63 -60 -52 77 -45 118 11 -231
3924b31L03k01j93L47o4n8K1P1n4o7J33l2K14j94j7r6R9J41J3o7j47N3j07J99
$$ -231 72 -129 -322 25 -39 -97 -76 -5 -59 -126 7 -25 189 -5 -22 -118 -19 122 135 68 -79 -26 -133 66
3948F6j57J37Q9Q0l59K78O5o9k32Q3j83R7n0M55l24j86J19K05j83J02J06K7k6
$$ 66 -91 46 135 215 -144 134 199 130 -102 -19 -202 -105 -155 300 -24 -210 -91 114 -69 33 139 166 140
3971A40k4k50l6j54N67l08J47J69l60K44k13N9m5q3P6L37k96K54j40n0r8k51K41
$$ 140 116 -134 -170 -324 243 -65 82 251 -109 135 -78 -19 -64 -147 -71 266 -30 224 84 34 -64 -315 -74
3994g4J53j10L0N2j30l9K05n2Q0l1l11K41J22p2J13j00j36j22J10L90k99k7R9
$$ -74 79 -31 -1 51 -79 -118 87 35 115 84 -227 14 136 64 177 77 -59 -181 -71 319 20 -7 92
4017I2l6J4j11J58k72J37N4r5p7M41j39j55k31J70M2j41J3L11l93J02j6o0K17
$$ 92 56 70 -41 117 -155 -18 36 -59 -136 305 166 11 -220 -50 -8 -149 -136 175 -218 -116 -132 -192 25
4040B5j51P4r4L57l23K11j16J67j58N1l94L80j5P4L8m2j14pJ1k63J97P4J8j67
$$ 25 -126 -52 -146 211 -112 99 -17 150 -8 43 -351 29 14 88 126 84 -30 -37 -26 -289 -92 -18 0 -167
4064a67K45KQ2k3k28J06m5r2K87k14P8J8J20n5j15l7J44o6o5k44M54J17l39J01
$$ -167 78 80 162 139 -89 17 -28 -120 167 -47 31 49 169 114 -1 -38 106 40 -25 -269 185 302 -37 64
4088F4k42K80M3j31j40J23k4j06P6J47J60k92J00J77p4k9k25M24l47lR8m8J15
$$ 64 -178 102 145 14 -126 -3 -27 -133 -57 90 250 -42 58 235 161 132 -93 331 -16 -19 79 31 146
4111A46q3j02j0m2Q4JN9L5kj39J66k05l4J86Q3k78K89qj62n9L7K18Ok01K95k22
$$ 146 63 -39 -49 -91 -7 -6 53 88 86 -53 113 -92 -126 60 143 -135 154 146 -16 -75 -38 180 186 -15 280 58
4137E8j92K20j40L5Mp7P5p7K29j30j64J00N9O0l0j68L9j1k21L60J9J02k82J52
$$ 58 -134 86 -54 -19 -15 -92 -17 -94 135 5 -159 -59 0 60 30 -138 -99 -110 -331 29 48 150 -132 20
4161B0j17J61k26r9O3k9L84o7j73J81j32O4N1R2r4j2J60m64K18M9j55J90Pk32
$$ 20 -97 64 -162 -261 -198 -227 157 90 -83 98 -34 30 81 173 79 67 227 -237 -19 30 -125 65 72 -160
4185a60N1R3O8J74m18J51j25J36J2J14k04J35M1RM6q8Qk4J20k38On2J55j33J52
$$ -160 -109 -16 52 226 -192 -41 -166 -30 -18 96 -108 27 68 77 123 35 43 19 139 -99 -93 -145 10 -123 29
4210B9j48J73n5j58Q8K0k67N19k15j07J72o9q4J5M2R4j92j0K18j71L02j05j10
$$ 29 -119 54 -1 -159 -71 -51 -318 201 -14 -121 51 -18 -102 -87 -45 49 -143 -153 65 -106 196 91 -19
4233a9K08k95k3J38j18P6j0n9o3J64J15l00K31Lk33M7K97o6j42L24l41l0L00k40
$$ -19 189 -106 -129 9 -109 -33 -43 -102 -165 -1 114 -186 45 48 -185 -138 159 93 -49 275 -66 -96 204 -36
4257c6K04j58N4M5%m4J69j71M2Pl53M57k91K32l79M46q0k20J56j89K07N8j3k05
$$ -36 168 10 64 109 109 65 234 63 105 112 -241 216 -75 157 -222 224 144 -76 80 -109 98 156 143 -62
4281f2n3J80J40k87Nn5J23J81k62N5l7K10m96K08J22o0P4J25J2J17l43L2M8L30
$$ -62 -115 65 205 -82 -77 -132 -9 172 -90 -35 -72 138 -358 -150 -28 -88 -14 111 123 240 -103 -71 -23 307
4305C07l27p7J96j5M5j05K78l39J09r7k78L89j42K01l47J52L3L5O8j40K05n6L
$$ 307 -20 -97 99 84 129 24 302 -37 72 -25 -303 86 -56 145 -202 -50 -17 18 86 -54 151 95 98
4328I8j35J3J19l3J19m04K98j81J95r8q1j75K20l8J80q9j71K38k58K57k3n6J07
$$ 98 -37 -24 95 62 181 -223 75 -106 89 -9 -90 -265 -45 -83 97 8 -163 75 -183 74 51 -5 102
4351A02j7O4r4ON1N3r9O7omJ29m8l32J88j84K23Kl20L04j9n0q8J34Q6O1k98R9
$$ 102 85 149 55 61 112 165 66 133 127 123 252 204 -128 60 -124 99 101 -219 85 66 16 -72 62 148 209 -89 10
4378A0l01L72L4L4j05J8K55l14j37L11j56K5J80m5j11l3l8J08j29j1om2L66m55
$$ 10 -291 81 115 149 44 62 317 3 -134 177 21 46 226 181 70 37 -1 107 -22 -33 -39 -81 285 -170
4402a70L42k18Q0n2Q1Q4k72L03k58J97lj31o1J52l9k98K63J42l1k99N20l02o3
$$ -170 172 -46 34 -18 63 147 -125 178 -80 117 114 -17 -78 74 35 -263 0 142 111 -188 332 30 -33
4425c3Q5k55J44J36j78K64k9k10J32kj49O1J83k99O9Lk7J84o9R6j47N1j06J22
$$ -33 52 -203 -59 77 -101 163 134 -76 56 54 -95 -34 149 -150 -81 -78 -105 79 10 106 -41 10 -96 26
4449B6Mj17O2K5j54J68M6j04J71j23p8J02k25J13J98l6r7Q7j0q6R8k34j93K51
$$ 26 30 -87 -25 0 -154 14 60 -44 127 4 -74 28 -197 -84 114 78 -19 68 58 -28 70 -164 -357 -106
4473a06J5J14k4o4j99M24j43k08P9K7J61j08N0j32N8J2J75j82L43l68J82p0r6
$$ -106 -91 23 -1 -65 -264 160 17 -191 -112 -85 76 -32 18 -114 -56 -44 131 -51 292 -76 106 36 -60
4496f0Q4K22l36J14J64M7k34k78K88j68J69J63k23o2q3K11K9j42K60k03J69o7
$$ -60 24 246 -90 24 188 235 1 -277 11 -157 12 175 -48 -110 -193 18 47 -95 165 -38 131 64
4518F4J7j71K41J16k73K39k56J99l6J05k20J2p8J74k78O9K14j61j03O7J35q9Q9
$$ 64 81 -90 151 267 -6 233 -23 176 140 245 25 37 -41 133 -145 -76 138 -23 -126 -59 76 -13 76
4541G6k40m8K53j00K9m2k9k39L12J27r7q7n1M56k96K0q4j85J93M2J38j72j24J01
$$ 76 -164 -212 41 -59 -30 -72 -101 -340 -28 99 2 -85 -136 320 24 44 -40 -225 -32 10 148 -24 -148 -47
4565d7r0J74J02m3L8k50Q1JO1r2j3R9r0O0P5k21J25pJ58l08R1N42k69j1j5k02
$$ -47 -137 37 139 96 134 -116 -35 -34 27 -65 -78 21 -69 -9 66 -155 -30 -37 121 -187 -96 446 177 166 151 -51
4591e1P6J76l23L29j86k19K87k26K62Rl20L60q8j25J37J9l97J83P9J90k99K56
$$ -51 25 201 -122 207 21 -198 89 -137 125 134 -186 174 86 -39 98 117 -280 -97 -18 172 -127 129
4613A29o8r8Q4N7j57k2o3J04j37Q0j11J10L6R3k57P1L00K5n4l42K44j8LJ45p2
$$ 129 61 -37 47 104 -53 -75 -138 -34 -171 -91 -202 -92 -56 37 -220 -149 151 176 122 -220 24 6 9 154 82
4638H2j58M2O2oo3K34k30L04n23M38k58K78J86m44J04j3j97M32k65l07J43Q9K03
$$ 82 -76 -34 28 22 -41 193 -37 267 -256 182 -76 202 388 -56 48 35 -162 270 5 -302 -159 -70 133
4661A33j15p0K03p5k95K41o8%k25L82j13m1q1L11L5l74J60j7m9m2M97m53k2p9
$$ 133 18 -52 151 76 -219 22 -46 -46 -271 111 -2 -43 -124 187 222 -152 8 -9 -58 -100 397 -56 -78 -157
4685a57J6J03O5Q3j2Q0j32q6J9j84K82j34l17L43K8j32q5K33n4j27m9L78P1k63
$$ -157 -141 -38 27 110 98 178 46 -40 -21 -205 77 -57 -374 -31 -3 -135 -220 13 -41 -168 -217 161 232 -31
4709c1l6L01n61M11j64J29qk36K54k47L10l9j5J9k52K83k91J24j71K57o5N3j21
$$ -31 -67 234 -327 84 -80 49 41 -195 59 -188 122 83 68 87 -165 118 -173 -49 -220 37 -28 25 -96
4732i6R6o8j78J63L0J52o7Q2k73J88j10K05K2j52J84l17K52j07R1Q2j40Q4J06
$$ -96 0 -68 -246 -83 -53 99 32 114 -159 29 -81 124 146 -6 178 -139 113 6 97 179 39 123 229
4755B29l80J61J36o1o8J53l13J34j50J39P3j65M5J41P7K7Kl29n3K8J9R9J44J57
$$ 229 -151 10 146 85 17 170 -143 -9 -159 -20 53 -112 -67 74 151 178 180 -149 -202 -174 -155 -56 88 245
4779B45j34q1k6j15J18j32L26l39M7L4J36N2j84J70j47j11J85l5oLJ9j22J22J28
$$ 245 111 30 4 -111 7 -125 201 -138 -91 -57 79 131 -53 117 -30 -141 44 9 3 6 25 -97 25 153
4803A53n8j40J18k59J14J13O4Q6k54j38J00J71Rj29l3K01j54mM9l20M66k01Q6
$$ 153 95 -45 73 -186 -72 41 105 191 -63 -201 -101 70 79 -50 -83 118 -36 -40 9 -311 155 -46 40
4826D0o9o4Q9K6K91n15K15K6J15l12J02j86J23j97J74K74j75J18K6J1k17K8N2
$$ 40 -29 -93 -4 22 313 -202 13 39 154 -158 -56 -242 -119 -316 -142 132 -43 75 101 112 -105 -77 -25
4849b5j3o3R2p0j82J68L35k48m5R4J14j94L8q1j44J59j81L51j89p9K57M0R1N5
$$ -25 -38 -101 -9 -79 -261 -93 242 -6 -51 43 157 -37 1 -80 -224 -65 -246 105 -84 -163 94 134 225 280
4873B80j39L16m01l3K17j64j99J47j2L6j4j54P9J14j19J43P0l10R3K13j89j64
$$ 280 141 457 56 23 240 76 -123 24 12 48 34 -120 -41 73 -46 97 167 -143 -50 163 -26 -190
4895a90M2L5j23J25Q1M6M7q6O3JM3J2P5k18L23l62J8K84m27nM47l79k0L93j92
$$ -190 -148 -113 -236 -111 -30 16 63 -23 40 41 84 96 171 -47 276 -86 -68 216 -211 -216 231 -148 -168 225 33
4920C3j48J59j68j19K33p4l0N9j72L48k20j5j86K33K15l15L88l06K03L6K0j58
$$ 33 -115 44 -124 -243 -10 -84 -114 -55 -227 121 -99 -114 -300 -67 148 -167 221 -85 118 154 174 16
4942A6M6p7l32L39j4J83j50j31J08M7jj52j50j71M61K9j19J7J18r0j82K68J32
$$ 16 62 -15 -347 -8 -22 161 11 -120 -12 35 34 -118 -268 -439 22 51 -68 -51 67 -23 -205 63 195
4965A95k34N1M0j91j03J04R0r0J73q0r8P6L05k99Q6j30J18k6J59l9l85K50lL3
$$ 195 -39 12 52 -139 -242 -138 -48 -138 35 -45 -143 -67 238 -61 25 -105 13 -13 146 107 -278 -28 -31 2
4989BPk34R5J82l42K04K30q1O7j8l73R5K86Pj24k0m01P31m93J90J36k01J63m70
$$ 2 9 -225 -130 52 -290 -86 144 63 130 112 -261 -166 120 127 3 -17 -418 313 -180 10 146 -55 108 -362
5013c62M71j58J56j59L49o8l56K20k92L6M9J0k3J14J16j81N5P3J17nr1Lj06J43
$$ -362 109 -49 107 -52 297 229 -127 93 -199 -163 -114 -104 -127 -13 103 -78 -23 50 167 162 71 74 -32 111
5037A11m34M50j20j02K33OL5J81j40j4k37Q0j36J75k19J21J33k04Q7pKL8k3KJ33
$$ 111 -323 127 7 -95 138 144 179 360 220 206 -31 49 -87 88 -131 -10 123 -81 6 -1 1 39 16 18 151
5062A51o2r6l37L42P7N4j87j59K48K30j10J30j84k6o3Q0J2O9K3k14J44k82Q9J52
$$ 151 89 -7 -344 -2 75 129 -58 -217 31 261 151 281 97 71 8 88 100 169 192 -22 122 -160 -71 81
5086H1k0j30k31M96j99J03j7R1j07J06k59k5l9K59Kj88O9N4n5J47j9k77J9Q8M9
$$ 81 61 -69 -300 196 -3 100 83 174 67 173 -86 -111 -150 109 111 -77 -8 46 -9 138 119 -158 -139 -51 -2
5111bK94k65k62K84J11j36N6k03J46m9p1o2L8L15q5L5L4k13J59Rj66k5M3L2or1
$$ -2 292 27 -235 49 160 24 80 -123 23 -26 -97 -159 -121 194 109 144 178 -35 124 133 -33 -58 -15 17 11 -80
5137h0J84O3p7j3n0k6J2q1m8J88r7j21J94j86r7J15J31K38m86N09j94M7oL0l14
$$ -80 104 167 90 77 27 1 13 -68 -116 72 -25 -146 48 -138 -235 -120 11 249 -237 272 78 125 119 149 -165
5162a65J93j01K30k55J26K3Q9j95j62J91l9K29j7q6l2p9j29J73j53L00j76Q5L5
$$ -165 28 -73 157 -98 28 51 140 -55 -217 -26 -65 164 147 61 29 -50 -179 -6 -159 141 -35 50 85
5185H5j41k8J94j4Qm0j83J76k28K46j03o8R7j47K62k0k6MJ11K2k26J7P6m9k59
$$ 85 -56 -84 110 96 104 64 -119 57 -171 75 -28 -96 1 -146 116 96 70 74 185 207 -19 -2 74 25 -234
5210b34L37j09J22M5r3q8j75K87j21k59M16k30R5L3k4J92q3lj99J95j37j74K50
$$ -234 103 -6 116 161 68 -20 -195 92 -29 -288 128 -102 -7 26 2 194 111 108 -91 104 -33 -207 43
5233D3Rm0j08p7Q8J44j70J10J06R0k28J92l95L70L7j00o4K47k78N8j42L4J36k20
$$ 43 52 12 -96 -173 -85 59 -111 -1 105 195 -33 159 -236 134 171 71 7 254 -24 34 -108 -74 62 -158
5257a58J59k1l34K43J46k64J94J03j89J2L5p5o3j8J66J97k07j6P8K0O6j01p5J09
$$ -158 1 -20 -354 -111 35 -229 -35 68 -121 -109 -74 -149 -212 -230 -64 133 -74 -90 -12 8 74 -27 -102 7
5281GJk46J62J33Qk74K10Q6J62M1j61j96L01k26okj02O3Q1J82l22J39l4k77L54
$$ 7 8 -238 -76 57 65 -209 1 87 249 290 129 -67 234 8 2 0 -102 -39 42 224 -98 41 7 -270 84
5306H4j33j47J86j08O6K34k40J3Q3k5j59K42L6l88K97O4l5k6Jl2k17K79j37J94
$$ 84 -49 -196 -10 -118 -52 182 -58 -45 38 13 -146 96 132 -256 41 105 70 44 45 13 -204 75 -62 132
5330A32k68K41k01J60Q2j89J15l7q2N4J0J55l01J11JJ02O3k11rO6j97L9J85J26
$$ 132 -136 105 -96 64 146 -43 72 35 -47 7 17 172 -129 -18 -17 85 148 -63 -72 -6 -203 -164 21 147
5354A47j76noK3j0N1L74n11l7J56j06N2NMJ2K44l69K3J8L0J91L5L6j7j01K1j87
$$ 147 -29 -34 -40 -17 -27 24 398 -113 -150 6 -100 -48 -43 -39 -27 217 -152 -129 -111 -81 110 145 181 164 63 84 -103
5381a03L1J40jj15J06K3l07K63l3K0j12Q2P0j65K43j85L6k25L34k19O1O6j32J72
$$ -103 -72 68 67 -48 58 81 -226 37 4 24 -88 -6 64 -101 142 -43 -7 -232 102 -117 -56 10 -122 50
5405E0j6O6K17k14k25K24j31J37j33J3m0L1KJ28j3p0n3K54j65l11L66j8j22K12
$$ 50 34 100 317 103 -122 102 -29 108 -25 -12 -52 -21 -19 109 96 26 -27 227 62 -249 117 99 -23 189
5429A89j71l6q7J63k61L92m99J52N18k53k05K1L02j61k3J03n8k3Nj15o2J10p0
$$ 189 18 -18 -105 58 -203 189 -310 -158 360 107 -98 -77 225 64 41 144 86 63 68 -47 -109 1 -69
5452f9L0J23pMj65K23j65J31j6l36M21j37p5l7L70k99j13j91L91P1j89O3j31R2
$$ -69 -39 84 77 81 -84 139 -26 105 89 -247 174 37 -38 -75 295 -4 -117 -308 83 154 -35 28 -103 -11
5476a1j56J37j06kL76l05J29N4K7J93k08j19j26M0JK37j93K36k31j17J50p4P7
$$ -11 -167 -30 -136 -138 238 -67 62 116 143 336 128 9 -117 -77 -76 161 -32 204 -27 -144 6 -68 9
5499IL2M2k07RL33j73j15j64K61r9N0k4l1K7J96j67J68q9R1p0j01j59J57J11Q6
$$ 9 41 83 -124 -115 218 45 -70 -234 27 -72 -22 -46 -77 -50 146 -21 147 58 149 79 -22 -181 -24 87 173
5524A73k17J77j41R9r2Jk8l69K76Q6k91K94P4r8J62p7O4q2j62K57j0j86K41k84
$$ 173 -44 133 -8 91 -1 0 -28 -397 -121 -35 -326 -32 42 -56 106 29 93 11 -151 106 96 -90 151 -133
5548a33K05j43k21J62K03j87J49Q3o6l21K45J34n7l2j3Qj47J66n5J46j48K04k70
$$ -133 72 -71 -292 -130 73 -114 35 118 52 -269 -24 110 53 21 8 16 -131 35 -20 126 -22 182 -88
5571h8n2L37l83R1R5J0qJ37r6J33J16m47M05j67l53K51J55qj2p7K8k17j3K72m0
$$ -88 -140 197 -186 -95 0 10 2 139 43 176 292 -155 250 83 -270 -19 136 128 116 39 67 -150 -163 109 69
5596F9L42o55j59K30J66k24P0K33j36R2j43J38r2M9J25R1j09j89J69j27j5p1k40
$$ 69 411 -244 -403 -173 -7 -231 -161 72 -64 28 -115 23 -69 -20 105 196 87 -102 67 -60 -75 -146 -386
5619c86N06k09j5L01j20L4j25l68K46QJ65J93q6j80k59M65j33K1j50N9K10m82
$$ -386 120 -89 -104 197 77 111 -14 -382 -136 -128 37 230 144 -36 -295 170 37 58 -92 -33 177 -305
5641c05N57k20o8N0J58k00K77l12n2Q3L7K7r4K45l7N3k47n8J74k26J37k26K55
$$ -305 252 32 -36 14 172 -28 249 -63 -115 -32 5 32 -62 183 146 199 -48 -106 68 -158 -21 -247 8
5664HlJ37j6L7kl06J74K28r8n2o4J8j33K94j54N2n6l48P3J71K45k47K17k07O6
$$ 8 5 142 126 163 161 -145 29 257 159 107 43 61 -72 222 68 120 64 -284 -211 -40 205 -42 175 -32 34
5689C4l7J35k01r4j37J33K23j13R4p9Kj8o9L12k41k18L45l50K11o5J05M6j39R8
$$ 34 -3 132 -69 -163 -300 -167 56 -57 37 -42 -40 -58 -127 185 -56 -274 71 -279 -68 -133 -28 18 -121 -23
5713b3j99R8J73p9P3j36J91Q6Rj12kj98J52J56j81Q2p3lJ49k71m5J06L9p1K63
$$ -23 -222 -124 49 -30 43 -93 98 184 193 81 79 -119 33 189 8 90 17 14 163 -108 -153 -47 -8 -79 184
5738A84k48J54j1k32K27r9j16L71j05r5J4J27L5j94k68L43q6M5k00J8O4r5K82
$$ 184 -64 90 79 -153 74 -25 -141 230 125 30 44 171 206 12 -256 87 1 46 -154 -136 -72 -167 115
5761A15j34M2J14j62j23L6R0J28k70J36K41k0j2p0l04K44j02J4JK86j95jJ04l67
$$ 115 -19 23 137 -25 -148 -112 -22 106 -164 -28 213 193 181 111 -193 51 -51 -37 -36 250 55 54 158 -209
5785b09K36k69M77k53M6j53j02K83m6N7k11J37j67J18K7P6j66j31M43l70K33K28
$$ -209 27 -242 235 -18 28 -125 -227 56 10 67 -144 -7 -174 -56 -29 47 -119 -250 193 -177 56 284
5807B84m03o8L12j86K18j83J74l82j5K23j53L3J38M6l3R7m5k58L5PK76j30J3j49
$$ 284 -119 -187 125 -61 157 -26 148 -234 -249 -26 -179 -146 -8 38 5 102 57 -201 -166 -159 117 -13 0 -149
5831a49J46J24k55J60p5J54j79K1K2m2J88k61P4j47M46j96j5r2J38j07J45p6l
$$ -149 -3 121 -134 26 -49 105 -74 -53 -31 -73 115 -146 -72 -219 227 31 16 -76 62 -45 100 24 21
5854B1J17k46K6l27M36P9k3j65p7L92j65j65M10l90pJ14n2MP2q9J28j79kR5J85
$$ 21 138 -108 -82 -409 27 106 83 -82 -159 233 68 -97 313 -77 -84 30 -22 -18 54 -35 93 -86 -88 7 192
5879A92j53k16K48k69M21k00k04M03j39l8q7l9J70j84l4Q8L70k54Nk98M65k06
$$ 192 39 -177 71 -198 223 23 -181 222 83 45 -42 -81 89 -95 -129 -41 329 75 80 -218 247 41
5901D1j09J64k05K05K41m18L58k57l0P3j71Q1L2P8K9L3m2n0j55j03O7N0J35r3
$$ 41 -68 96 -109 96 337 -81 277 20 -10 63 -108 -27 5 83 112 145 103 53 -102 -205 -138 -88 47 -46
5925d6j69J13K17k30M2J47M8j75lQ0k7L6j47J76j15K40r4N3k15K43J3n45N21j3
$$ -46 -215 -102 115 -115 -73 74 122 -53 -56 24 -3 33 -114 62 -53 187 93 146 -69 174 187 -358 163 150
5949A50o8L7j27qL5r3p4J64p3j71K89j71j3L32l22J06K0q1K16r5r6K0N7J32j53
$$ 150 82 119 -8 -16 19 -74 -148 16 -57 -228 61 -110 -123 209 -113 -7 13 -68 148 53 -43 -23 34 166 13
5974A3r8J24J23k79J53j04J12j34m3j6J12p9K31p7m3j5L7j57J25J69l97R1J28
$$ 13 -85 39 162 -117 36 -68 44 -90 -133 -149 -37 -116 115 38 -5 -20 17 -140 -15 154 -243 -152 -24
5997b4M1j7Q0J08k18KK12N4j49K2k2j01p2L69j11m3R9k73K49k97K10k21L29k17
$$ -24 17 0 80 188 -30 -28 184 238 89 111 89 -12 -84 285 174 131 230 -43 206 -91 119 -102 227 10
6021A0Ll9n0K27M3k72K23k67K01j55P8q3K6L0K64j55J6K61k86j36j37K25p5J35
$$ 10 13 -26 -76 151 194 -78 145 -122 79 -76 2 -81 -55 -25 239 84 100 361 75 -61 -198 27 -48 87
6045H7J7k77J5J63J96j29j79O2J05j62R9J92j97j41N1J01j56K74j91J76KLm78
$$ 87 104 -173 -158 5 201 72 -107 -45 60 -102 -3 189 -8 -149 -98 3 -153 121 -70 106 108 111 -367
6068c67N20r6Rj03P5K20k63J28j41j87R3K0J13j79K98j25K61k37k21K38j33O1
$$ -367 153 57 66 -37 38 258 -5 123 -18 -205 -112 -92 21 -158 140 15 276 39 -182 56 -77 -16
6090a6p8K02j19l9l6Q6l0J11m9r7J75j83O0n5k52O80n30J09Q1L1p3O1l1j31K49
$$ -16 -94 108 -11 -50 -86 0 -30 81 32 -65 110 -73 -13 -68 -320 360 -170 -61 20 51 -22 39 8 -123 126
6115A26L1k52J12N0O1K5j92l8K41p9K2j38m8K35k37J81j19O2J04k84J66L18n61
$$ 126 157 -95 17 67 128 153 -39 -77 164 85 107 -31 -79 156 -81 100 -19 43 147 -137 29 347 -214
6138b14L26k30p5J59j25J87r5Q5j27J76o5r0J5J41k71K34m9NJ00j11R1k9r3J30
$$ -214 112 -118 -193 -34 -159 28 -67 18 -109 67 2 -88 -73 68 -203 31 -18 -13 87 -24 67 38 -55 75
6162G5j61K74k31K38k42K24j44q9p9J37o8M9k06J93j9j06J62l40K37J2L6j06J26
$$ 75 -86 188 -43 195 -47 177 33 -56 -135 2 -66 -17 -223 -30 -49 -155 7 -333 -96 -84 -48 -154 -28
6185b8J0p9k75N70k7m24L21P8j67J27o9k1r7j06J77J52m3R4k43j40L48l9j49p3
$$ -28 -18 -97 -372 198 171 -253 68 146 -21 106 37 16 -81 -187 -10 142 99 193 -50 -190 158 119 -30 -103
6209a03J03k23J17J08k03J90j39K40l73N29j71j38m9J49K2Ml3m7%J17j56M3L5
$$ -103 0 -223 -106 2 -201 -11 -150 90 -283 246 75 -63 -112 37 59 63 30 -17 -17 100 -56 -13 22
6232B2k96K18j74K31Q8p3K69l19j7M9j09j6K7j4J84r9J68q0Lr3r0L19l81K28q0
$$ 22 -274 -56 -230 1 89 16 285 -34 -51 -2 -111 -127 -100 -114 70 -29 139 59 62 -31 -121 198 -183 45 -35
6257c5q7k5R9J35Kl3k42L75m35L92j57n8KP1m1J31k27J51p7j08J43R0L8k27j40
$$ -35 -122 -147 -48 87 89 56 -186 189 -246 146 -11 -69 -67 4 -37 94 -133 18 -59 -167 -24 66 104 -123 -263
6282b63L50l30J57J97j92K0L27j20k64jL9k4R8P4k31N0J44j86J08j32oK26k5j45
$$ -263 87 -243 -86 111 -81 -61 266 146 -118 -119 -80 -104 -6 68 -163 -113 31 -155 -47 -179 -185 41 16 -129
6306a29J35j8q6J44j52j0J02J33Q1j58l28K90r2J69j96J36j26K00n4o3J12j18
$$ -129 6 -12 -98 46 -106 -116 -14 119 200 42 -286 4 -88 81 -115 21 -105 95 41 -22 90 -28
6328b8K90k32j45J91j25N5J16j57j22J90qq8k10J93K7J61j22P6k93M92p9k35J7
$$ -28 262 30 -115 76 -49 6 122 -35 -157 33 25 -63 -273 -80 -53 108 -14 62 -231 261 182 -53 -36
6351c6L2j23K05l03K72OM1n3m9K0M5k98K66m1J8J14k24J69L4m4l0l5n4Q2l64L24
$$ -36 -4 -127 78 -225 47 53 94 41 -8 12 57 -241 25 -16 2 116 -108 61 95 51 21 -14 -68 14 -350 -26
6377b6J27M2k93K15P8j08o1JR8j80M6M28m22n8M32j11l03M6pK84k16J33oJ81k32
$$ -26 101 143 -150 65 143 35 -26 -25 73 -107 -61 367 -55 -113 319 208 -95 -49 -56 228 12 145 139 320 88
6402H8k2o4J26p3L16l47L13k02j85Q9k13k7K47m2j03m0L5J10J41m7k38L05k01
$$ 88 66 2 128 55 371 24 337 135 -50 39 -174 -201 46 4 -99 -139 -104 6 147 100 -138 167 -34
6425c4K36j0p9k66L19k31j77K16J95N8j07j56j46J04N5L87r6l12o0j49K54L1j31
$$ -34 202 192 113 -153 166 -65 -242 -26 169 227 120 -36 -182 -78 -23 364 268 -44 -104 -253 1 32 -99
6448i9L39k48M2J61j74k26L67k41J3K23k35O4P1o8l34M01p5Qj6J34j13J38j31
$$ -99 240 -8 34 195 21 -205 162 -79 -66 157 -78 -14 57 -11 -345 56 -19 -11 -27 107 -6 132 1
6471Ak51J99K22k02k71L67L7l7j63K67j17Q0o4P5k87J93k9J24j43mM3pj15K67
$$ 1 -250 -51 171 -31 -302 65 102 65 -98 169 52 132 68 143 -144 49 20 144 1 -3 40 33 -82 185
6495A85o2j44j46j0L12j30L3p5q3J49O6J3j1j26j67K07k02J6J86K7k0N2k26J16
$$ 185 123 -21 -167 -177 135 5 38 -37 -120 29 95 108 97 -29 -196 11 -191 -175 11 38 18 70 -156 -40
6519d0J12J21j55M9o4k6j66J66K6k0Q4L4j11j57K22N9k02K39j35q9j1JJ02r4J0
$$ -40 72 193 38 87 23 -3 -169 -3 23 3 87 121 10 -147 75 134 -68 171 36 -53 -64 -63 39 -55 -45
6544d5J38j86J48o8j80J82J7Rj79K43M6k3J04k15J69k6j55K88k39r6J38n9kk28
$$ -45 93 -93 55 -13 -193 -11 6 15 -164 79 125 102 206 -9 160 134 -21 267 28 -68 70 11 9 -219
6568b19L54k33l4j67M74k83pL51k09l2J07m4J50l35M15k16j36R7j59O6K3k3J18
$$ -219 135 -98 -132 -299 175 -108 -115 236 27 -5 102 58 208 -127 288 72 -64 33 -126 -60 -37 -60 58
6591E8J12n3Nj44J11J20o2k02K47l51O6N4q1J19K8l46J82L75j26Pq4K63l62J60
$$ 58 170 117 122 -22 89 209 147 -55 192 -159 -93 -39 -120 -1 27 -319 -137 238 112 119 35 298 -64 96
6615I6k8P1P2m04j6K73m6j25j35j40L27J07J46j58k79N5K68j61J88J03l48K92
$$ 96 68 139 211 -193 -209 64 18 -107 -242 -382 -55 52 198 40 -239 -184 84 -77 111 214 -134 158
6637A58j88k85M47k21QJ68q6m2p9J74J4j03n9K68j91K04k82j6P4M4K30k13O3j44
$$ 158 -30 -315 132 -89 -81 87 1 -41 -120 54 68 -35 -94 174 -17 187 -95 -111 -37 7 237 24 87 -57
6661e7K07j60J82m2k51N8J36N1r3j26O4O1L6l44K99L5O6j66K81l61Q7l06K30J38
$$ -57 150 -10 172 130 -121 -63 73 124 31 -95 -31 30 66 -278 21 56 122 -44 237 -124 -37 -343 -113 25
6685B5r5K3J45J30k27j19O6R0J8p1r7l0L19k13k4L66m66K23k7J50M8J54k79j56
$$ 25 -70 -47 98 228 1 -118 -52 38 56 -15 -112 -142 177 -36 -60 306 -160 63 36 186 234 388 109 -47
6709d7J35J46j72k74O37m25J39m68J11K64k10K5J61K39k51R2q8N9r2j74N1J42
$$ -47 88 234 62 -212 425 0 139 -329 -218 46 -164 -139 22 261 10 102 14 73 -19 -193 -142 0
6731@j04J51j03j32J67m2K3J38m35L26l3R2j72K6J63k18L14j65J17R2j46qO6j13
$$ 0 -104 47 -56 -188 -21 -63 -40 98 -337 -11 -44 48 -124 -98 65 -153 161 -4 113 205 59 51 117 4
6755DQ8l35J22K42j93m6L04j11qL7k33K09l9m1J1o8K38j42K9k07J03J99n3k01
$$ 4 92 -243 -121 121 -72 -118 186 75 67 104 -129 80 41 0 11 -57 181 39 68 -139 -36 163 110 -91
6779i1J03o5o5J18M6L5l29M63q3j19RQ5l02j06L20j55K35l7L0j56k2M2P8K36j25
$$ -91 12 -53 -118 0 46 81 -248 215 132 13 22 107 -195 -301 19 -136 99 62 92 -64 -86 -44 34 270 145
6804A45l13R9L39k39j46L8J15q5J69n5J41n12M02J73k83P6j61P0M1K90J5m74q3
$$ 145 -168 -69 270 31 -115 -77 38 -47 122 67 208 -304 98 271 -12 64 -97 -27 14 304 319 -155 -238
6827b38L33j95j05K18j49J14m0L29l22K33k57J85Mj55n3J06R9j93N9K7l0k1j3
$$ -238 95 -100 -205 13 -136 -22 -62 267 -55 178 -79 106 110 -45 -98 8 107 -86 -27 0 -30 -51 -64
6850f4J11j2K42k08j47j42J16J56n7k55L71k51J94J0j49p4K41k08L01q6R8l44
$$ -64 47 35 277 69 -78 -220 -104 52 -5 -260 111 -140 54 64 -85 -159 82 -126 175 89 187 -157
6872a57J86L61m26K04j90J68j45l3j56L10k0l08L57jl10L74j80j70j75M92k76
$$ -157 29 390 -36 168 -22 146 1 -32 -188 122 102 -206 151 150 -160 214 34 -136 -311 181 -95
6893i5o1K25n2o8Q6l18K53J61k35J60j53J91l49M0K54N7j00j03K71j8p9k23L53
$$ -95 -156 69 17 -51 35 -283 -30 131 -104 56 -97 94 -255 -215 39 96 -4 -107 164 146 67 -156 197
6916A97j9p1j1k50J29j23K01k18J68O5l17N8K39Po8O9P2k29J7K07Q4n4k8o6q8
$$ 197 178 107 96 -154 -25 -148 53 -165 3 68 -249 -191 48 55 -13 56 128 -101 -84 123 207 153 125 59 -29
6941b9J0jk32L45j14J73r4K11j35L5k40J66n4p2J74l92M53j21J42k57O6J64k98
$$ -29 -19 -20 -252 93 -21 152 58 269 134 169 -71 95 41 -31 143 -249 204 83 225 -32 34 198 -100
6964a00PL31j48QP0l47K29k37J31j01J83M3m0M7m2j45J56j51RJ86m1j34Q8L5J66
$$ -100 -93 238 90 98 168 -179 50 -187 -56 -157 26 69 29 76 34 -111 45 -106 -97 89 48 -86 2 37 203
6989B03l34K23j89J37q0n8K79j88j99P7K1J44j58K27j07M7p9K4O9J25L5k28K38
$$ 203 -131 92 -97 40 -40 -98 181 -7 -206 -129 -108 36 -122 105 -2 45 -34 -10 59 184 219 -9 229
7012B29R7l99J33Q1j63M0J3j15o5Q5J9J7M8k07J96k22N5K29P0r7k8n0J62l7m24
$$ 229 326 -73 60 141 -22 18 31 -84 -149 -64 -45 -28 20 -187 9 -213 -158 71 141 44 16 -34 128 91 -333
7037c33L72k8j29p8L22kk1j08K9j37J51J17k47J84j59q9p1L79J93k81j11j69J31
$$ -333 39 11 -118 -196 126 124 103 -5 24 -113 38 155 -92 92 -67 -156 -227 152 345 64 -47 -216 -85
7060h5K42q1o0P6J1rj8n3k0R8Pq8R4j01l56N83j67l8Pn2K77m23J58r4K48k6k34
$$ -85 157 76 16 92 103 94 76 23 3 101 108 20 114 13 -343 240 73 35 42 -10 267 -156 2 -92 156 130 -104
7087a04K27j44M3j6m2J15K75k53j33n0K85l36K30k88K80j35jJ24p9R5j65m1K56
$$ -104 123 -21 22 6 -36 79 354 101 -32 -82 203 -133 97 -191 89 -46 -47 77 -2 93 -72 -113 143
7110A43j85J8j05K23k34J63J64j06j43o3L21k20r9K97l07J08K0Q6j10r3L61l37
$$ 143 -42 -24 -129 94 -140 23 187 81 -62 -125 196 -24 -123 174 -133 -25 -5 81 -29 -122 239 -98
7132i8J10j39J62k93L60k4m5J34p0J31j87j60N3j1k02M56j80j9J83k24L4J67j72
$$ -98 12 -127 35 -258 102 78 33 167 97 228 41 -119 -66 -77 -279 177 -3 -22 161 -63 -29 138 -34
7155c4J13N1n3k2p1R6J45j69K09m14L13o6j9j87J40r2L78m09R7K7j64L94l07j45
$$ -34 79 130 77 55 -16 80 225 56 265 -149 164 98 79 -108 32 -60 318 -91 6 33 -131 263 -44 -189
7179a89L24j24n7K90k95R0j55L0j7J55o3p9J97K8J08j95N7K4k39lK04q8k3M5m0
$$ -189 135 11 -46 244 -51 39 -116 -86 -103 52 -11 -90 107 135 243 48 105 129 -110 -113 91 3 -20 25 -15
7204a5K04j04r5L09l02j21QP1J24N8Q8r7O1k82K24J04r9Rj47J45l03p8J84K19
$$ -15 189 85 -10 299 -3 -124 -116 -45 79 137 225 128 189 -93 131 235 136 145 -2 143 -160 -238 -54 165
7228A65l94L37r0p9K40k41P5J5j63L23k51J40j17j67L84n00K16K02l5Nk83J87
$$ 165 -229 108 18 -61 179 -62 13 28 -135 188 -63 77 -40 -207 177 -323 -107 95 60 65 -218 -31
7250c1j34K34K3l10J16m6O7J40j92l2K67J49l51j00L36K9k60L53k74j57J74J47
$$ -31 -165 69 92 -218 -102 -148 -81 59 -133 -165 102 251 -100 -200 136 165 -95 258 -16 -173 1 148
7272A48j53K48j63o2O4p5L9N5k33M18m29Q9J27k20J78Q7j20j56L37j17j00Q8o
$$ 148 -5 243 80 18 82 7 46 101 -132 286 -143 -54 73 -147 31 118 -2 -158 179 62 -38 50 44
7295D4j71L8J91k1m0l4l3J54L0k39Q7j34K49j27k0K01k54Q3q2L75j79k95o0J25
$$ 44 -127 -89 102 81 41 7 -26 128 158 -81 6 -128 121 -6 -26 175 -79 4 -78 297 118 -177 -237 -112
7319a12K74k57K89p3l50j22M83j31M0j19n8J60j37Q4L07k06l9qJ15j83j25K58
$$ -112 162 -95 194 121 -229 -351 132 1 41 -78 -136 24 -113 -29 278 72 33 25 140 -43 -168 90
7341I0O9j67J64R0k24j76K60j10l17L47p1mr2K09O0k16p6J79R5j45J30M1k2l6
$$ 90 159 -8 156 246 22 -154 106 -4 -321 26 -45 -49 -141 68 128 -88 -164 15 110 -35 95 136 114 78
7365G8j3N9o5J41l71N5M7J91q9q1Q6n0J22n5n6j04J68qL7l07N7J10%R2k54L47
$$ 78 65 124 59 200 -171 -116 -69 122 33 -48 38 -12 110 55 -1 -105 63 55 92 -215 -158 -48 -48 44 -210 137
7391A37k50r6J01J64Ok26J19rpk0J46n2r7J58m5k00J82l7j91J05J74l70K76l05
$$ 137 -113 -209 -108 56 62 -164 -45 -54 -61 -81 65 13 -84 74 29 -171 11 -26 -217 -112 62 -308 -32 -337
7415c37L72k42J90J12r6J8K7j64J16p8K00p3n7M6R8j33K34j22o4j21L07j22m11
$$ -337 35 -207 -17 95 -1 17 44 -120 -4 -82 118 45 -12 34 132 -1 233 111 47 -74 233 111 -300
7438c00K02L1J9J3j84QJ64j68J71O7j24M2J07m5OJ34k83J54J8O6N2r0J78j12j81
$$ -300 -98 -67 -48 -35 -219 -211 -47 -215 -44 23 -101 -59 48 3 9 143 -140 14 32 98 150 60 238 126 -55
7463e5J38Rk01Q5R7j40j11K56J11l8j41R9l13K40j98K55j49j52K69L3j20J73R7
$$ -55 83 92 -109 -24 73 -67 -178 78 189 151 10 109 -204 36 -162 93 -56 -208 61 94 -26 147 244
7486B44j33k23K84m09K76L8q8Q4j34k8L7N7L18m86L87k88qJ01o0N4J07k09J10
$$ 244 111 -112 172 -237 39 77 -11 73 -61 -89 -52 5 323 -163 224 -64 -72 29 -31 23 130 -79 31
7509C1J37j98J05m8J95k73J19J7nk41K8Q3K2R1q4j32L96K7l92K36K56k56j2p4
$$ 31 168 -30 75 27 222 -51 68 85 80 -161 -133 -50 -28 63 -21 -153 243 270 -122 114 370 114 102 28
7533B8J09J95l25o6O6M1o2J49k55L11l23K32j12j16K20K40k67l5P9J6j09k4j65
$$ 28 137 332 7 -59 7 48 -14 135 -120 191 -132 100 -12 -128 92 332 65 30 109 125 16 -8 -173
7556a73m5M62n01R0L37l79K62k61K72j87J82O2O6m6M6l43M9q2L38j16J59l40k
$$ -173 -218 244 -257 -167 170 -209 53 -208 64 -123 59 121 187 141 187 -156 -107 -189 149 33 192 -148 -150
7579a50K17k06J34o8J29%L9j13K27k08P3k84O2j47L65k07J6J33j06RK47k39j51
$$ -150 67 -139 -5 -73 56 56 95 -18 209 1 74 -210 -148 -295 70 -137 -121 12 -94 -85 162 -77 -228
7602b28L45q5J7n8J39o7p0Q5qL8ok2n0j35r3J46kL1P6r8K60l50J59J28j99J7J01
$$ -228 117 32 49 -9 130 63 -7 78 70 108 102 80 30 -105 -198 -52 -54 -23 53 -45 215 -135 24 152 -47 -30 71
7629G1m1Q1Kk53Q7M2J00J4o5P4L3k77j03J87N5j22K82J6k59L6j06R7L10l26J39
$$ 71 30 111 113 -140 -53 -11 89 103 38 112 145 -132 -235 -48 7 -115 167 183 -76 -40 -146 -49 261 -65 74
7654G4j04L92l27P0k20Q4j9k24K49L5K83l13l5k8K05P7l48K11j67K8P2j04K21
$$ 74 -30 362 35 105 -115 -31 -50 -274 -25 10 293 -20 -55 -83 122 199 -149 62 -105 -77 -5 -109 112
7677A12j30N8l09K82J93l92J86l3j21K95O4j37n2J55kP4j08Q4l57J95J15j41j87
$$ 112 -18 40 -269 13 206 -186 0 -33 -154 141 205 68 16 171 169 243 135 219 -138 57 172 31 -156
7700a56L47l29J65m4N1r0q6J60J40o8q1K28l51L5o1PJ72R3j37J1J05K7Lj05J02
$$ -156 191 -138 27 -17 34 -56 -142 18 158 90 9 237 -114 -79 -140 -133 39 132 -5 6 111 138 141 36 138
7725A38N2m37K47k3p1K1J22j32J30J11m77M75j6n6j08Q4o6N2N1j92K16j11j20
$$ 138 190 -247 0 -23 -94 -73 49 -83 47 158 -319 156 140 84 -24 60 -6 46 97 -95 121 10 -110
7748a10K41N3k62K10j86Q8PJ19j09r6j4M8j39J31p1K66n2k25R0J1J38n5l82K39
$$ -110 131 184 -78 132 -54 34 41 160 51 -45 -59 -11 -150 -19 -90 176 124 -101 -11 0 138 83 -299 -60
7772f0N7K09m74L10k40L05p3l5N6J27l71J62r6Q5K4K65k41K37k64j34J98k31K14
$$ -60 -3 206 -268 42 -198 107 34 -1 55 182 -189 -27 -123 -38 -14 251 10 247 -17 -151 47 -184 30
7795C0r5K05l53L24j95J06J89j63j48L73j32p5k20J86k63K36K31k22R7j47o2Q2
$$ 30 -65 140 -213 111 -84 22 211 48 -100 273 141 66 -154 32 -231 5 236 14 111 -36 -98 -16
7817a6K15l61n8L8J54j7qP3J54J14l46R2k1J10q0k9k4Q0l18K86j02J79k39KK1
$$ -16 199 -162 -220 -182 -28 -45 -53 20 174 288 -58 34 13 123 43 14 -10 70 -248 38 -64 115 -124 -122 -101
7842a01M6J40j86n4N05l57L5l44L25j77K9lP6L09N5l17m5%O1K2j53K61J60j52
$$ -101 -55 85 -101 -155 350 -7 28 -316 9 -168 -139 -142 -66 243 298 -19 -64 -64 -3 19 -134 127 287 135
7866A35k48l8J32Lk8R2m4l7j7j85O1R2J45j95J62l5O8j56J04j79K48l9j75j28
$$ 135 -113 -151 -19 -16 -44 48 4 -33 -50 -235 -174 -82 63 -132 30 -5 63 -93 11 -168 80 41 -134 -262
7890b62M33k87J61n1J42k02l6Q7J64k64J7J00K0j31j65M44j97k9j92J48P5j49
$$ -262 171 -116 45 -6 136 -66 -102 -15 149 -115 -98 2 22 -109 -274 170 -27 -56 -248 -100 -25 -174
7912a74M4J88k94L46j16p7J76j28J3r2M3j9K25k46k8K71k8j52K02m9k22K6q7K50
$$ -174 -130 58 -236 110 -6 -83 93 -35 -22 -114 -71 -90 135 -111 -139 132 104 -48 154 105 -117 -91 -178 72
7936G2M2k1kJ5J75k00p6N4l5N5j41J07m8j80J69r2M57j80p6k78J09J6K95j20j06
$$ 72 114 93 91 106 281 81 5 59 24 79 -62 45 -3 -183 -14 -106 351 171 95 -183 -74 -58 237 117 11
7961A1P0k2j00J31k73K47j55M4j2q0L16p2M7kn6l54L84r4k2k00J00J39rl7R0j41
$$ 11 81 59 -41 90 -183 64 -91 -47 -59 -139 177 105 152 150 94 -260 124 30 8 -192 -92 47 38 1 91 -50
7987e0K50j70j47J29K08l81L27k97J30j02K3l5Q5K15j98n6J78J37j12l7k52j1
$$ -50 200 30 -117 12 220 -161 166 -131 -1 -103 -80 -115 -30 185 -13 -69 109 246 134 97 -155 -166
8009a66M4J78l66K01J33j55M3L7O2J88j7j00N9j63P8j18p6M41k30l55L85R9k25
$$ -166 -122 56 -310 -109 24 -131 -88 -51 11 199 182 82 141 -22 56 -62 -138 303 73 -282 103 202 -23
8032b3J75o5j83J23m1k30L00j72N0L18l53K62m9K37j22p6mJ3r9j06N7q5K05r3
$$ -23 152 87 -96 27 -14 -244 56 -116 -66 252 -101 161 112 349 227 151 147 160 61 -45 12 -73 132 39
8056C9j3L5Ol7J49l89P2Q0J70k21J54k08K77j28O3q9j09K92j53M0J03k02K80L8
$$ 39 26 61 67 30 179 -210 -138 -58 112 -109 45 -163 114 -14 49 -40 -149 143 -10 30 133 -69 211 249
8080B49k62k5J86p1l93K66nK3k9J44O0r4j11K1k31K95k43K77M5n2j3J2J30k96
$$ 249 -13 -38 148 77 -316 -50 -55 -32 -61 83 143 49 -62 -41 -272 23 -220 57 102 50 37 49 179 -117
8104a17M4l2J25j35L66K6l25J01j24j17L99k49P7k0o0J14l13J28J38l9J80q8k74
$$ -117 -73 -105 20 -115 251 277 -48 53 -71 -188 211 -38 39 19 -41 73 -240 -112 26 -13 167 79 -195
8127a95L14l66K94J7n5j37K83p6j59M8l1M3k7K23j79m2Oo2L03j40j25j82L69j25
$$ -195 119 -247 47 64 9 -128 155 79 -80 -32 -63 -20 -47 176 -3 -45 -39 -101 202 62 -63 -245 124 -1
8151aJ49j69j82K15n6j42J03J02k71J70J23j10j4J56N4J2j60m0O0j22K08km53
$$ -1 148 -21 -203 12 -44 -186 -83 19 -252 -82 41 -69 -83 73 127 139 -21 -61 -1 -123 85 83 -370
8174c70L71j64M06l96J44K6n1J47j82K11j33k80J61mM4K41k36
$$ -370 1 -163 243 -153 -9 17 -34 113 -69 142 9 -271 -110 -114 -70 171 -65
8191f5
$$ Imaginary data points
##PAGE= N=2
##DATA TABLE= (X++(I..I)), XYDATA
0@%%%%%%%%%%%%%%Qj6J6j6J6k2L0l2L8m6N3o1P2q4R3j06J22j38J58j79K02k29
$$ 0 0 0 0 0 0 0 0 0 0 0 0 0 0 0 8 -8 8 -8 8 -14 16 -16 22 -24 29 -32 40 -44 49 -57 65 -73 85 -94 108 -121
36a21K55k84L16l55L95m36M85n37N95o56P23p97Q77r68J065j172J294j429J580
$$ -121 134 -150 166 -189 206 -230 255 -282 313 -343 380 -417 460 -508 557 -615 679 -750 830
55H30j751J948k174K436k749L128l596M192m979O069p683J0304j5245K7571j08922
$$ 830 -921 1027 -1147 1289 -1460 1668 -1928 2264 -2715 3354 -4329 5975 -9270 18301 -90621
70i0621j72816L34434Q4932j87757O4564J01749j80815j7714K00023m6139j81559
$$ -90621 -263437 70997 155929 -31828 32736 134485 -46330 -64044 135979 89840 -91719
81i1719P5197R4572q7706l0371P2160j0616k6208K8703j2247m6776J5475K7846
$$ -91719 -16522 78050 -9656 -40027 32133 21517 -4691 24012 11765 -35011 -19536 8310
93H310n670M395j2435m0289L7514O0256l8499k0982N8252k9278p0589O8569N9273
$$ 8310 2640 7035 -5400 -45689 -8175 52081 13582 -7400 50852 21574 -49015 19554 78827
106G8827r8643k9671R1674l5670p7847P6063L3540q2027L0149O3290q5811l4895
$$ 78827 -19816 -49487 42187 6517 -71330 4733 38273 -43754 -13605 49685 -36126 -71021
118g1021J14928K0359q4238M879J6343m2694M4506O9130p1744p2420N2815L9812
$$ -71021 43907 64266 -19972 -15093 1250 -41444 3062 72192 448 -71972 -19157 20655
130B0655k0308J2208Q151m1119M988M9209k3038l9056L7318J5049n4028p805L9199
$$ 20655 347 12555 20706 -20413 -15425 33784 10746 -28310 9008 24057 -29971 -37776 1423
143A423n637j0385L0463n618l6835K4633L2125k7586o017K3415k2927j9430K4214
$$ 1423 -4214 -14599 15864 10246 -26589 -1956 30169 2583 -3434 19981 -2946 -22376 1838
156A838n79j0733K9032J308m5986M633L8631j2860j2340J4155k8201k5841L8234
$$ 1838 1259 -9474 19558 20866 -25120 -20487 18144 5284 -7056 7099 -21102 -46943 -8709
169h709J7633k6426J1489K1910k8994j2176M5419J6456k8288k196L820j9275R016
$$ -8709 8924 -17502 -6013 15897 -13097 -25273 20146 36602 8314 6118 9938 -9337 -321
182c21L3363p119k9277J411P319j0337Q011J6450k1131j9340J4565k636j0143
$$ -321 33042 25923 -3354 -1943 5376 -4961 3050 19500 -1631 -20971 -6406 -9042 -19185
195a9185K7952J5017l2203r285K9863K704j0717J4261n748k3440J5412J2873k5491
$$ -19185 8767 23784 -8419 -17704 12159 14863 4146 18407 12659 -10781 4631 17504 -7987
208g987N59K8247p098k3545K248L271m314J4650N625l0028j3679J9353J0263K466
$$ -7987 -7428 20819 13721 -9824 -7576 -4305 -8619 6031 11656 -18372 -32051 -12698 -2435 31
222C1M849j1135j3115J2869J6002p417m866J1439o361j8753J0638J8381m646k859
$$ 31 4880 -6255 -19370 -6501 9501 2084 -2782 8657 2296 -16457 -5819 12562 7916 5057
236E057L378j3656q604J9023R593j5344k309L038j6257M606K7703m208j8473N699
$$ 5057 8435 -5221 -13825 5198 14791 -553 -2862 176 -16081 -11475 16228 12020 -6453 -754
250g54J182j1017J1220J4713j4596j1865J0602j149m182J5671L948j3804J213
$$ -754 428 -10589 631 15344 748 -11117 -515 -1664 -5846 9825 13773 -31 1182
263A182L847j0969o85J5760J07j7892l691O548J497R704R221j1634j0816P331
$$ 1182 5029 -5940 -6625 9135 9242 -8650 -12341 -5793 -4296 5408 14629 2995 -7821 -490
277d90M140l373O503L590j6020q307J5806K584o768J0327J146j9150j618J2765
$$ -490 3650 277 6780 10370 -5650 -13957 1849 4433 -2335 7992 9138 -10012 -11630 1135
291A135j30k795L981q615j1198J2593J1882o909K193N413j3094m578J4710M606
$$ 1135 1005 -1790 2191 -6424 -17622 -5029 6853 -56 2137 7550 -5544 -10122 4588 9194
305I194o930M10n25p521M674J2983j786o125J845q012q894R907Q016r732o880
$$ 9194 2264 2674 2149 -5372 -698 12285 10499 4374 6219 -1793 -10687 -780 7236 -2496 -9376
320i376L372j025k370J2247P164r985l305L367n134J746J0733k272j0211J223
$$ -9376 -6004 -7029 -9399 2848 10012 27 -3278 89 -5045 -3299 7434 5162 -5049 -3826
334c826M356k453Q035J1827q653j2584L657L291j996K578k268r252k215M323n10
$$ -3826 530 -1923 6112 17939 9286 -3298 359 3650 1654 4232 1964 -7288 -9503 -5180 -5690
349e690K515R838l613j2839K983Q011j256L253M467q817r134P586J0238j073j337
$$ -5690 -3175 6663 3050 -9789 -6806 1205 -51 3202 7669 -1148 -10282 -2696 7542 6469 5132
364E132l47q065j450R869J542m666J186j910q041J048R258J436o325k585l023
$$ 5132 4785 -3280 -4730 5139 6681 2015 3201 1291 -6750 -5702 3556 4992 -1333 -3918 -6941
379f941l464O638O010j850p0o57n332J540J1225L497r366n710j14l798L066R392
$$ -6941 -10405 -3767 2243 393 323 -334 -5666 -4126 7099 10596 1230 -4480 -4594 -8392 -5326 4066
395D066l494q860J436M060J013M226L653n842m883L067j491l292J0082N899r849
$$ 4066 572 -8288 -6852 -2792 -1779 2447 6100 258 -4625 -1558 -3049 -6341 3741 9640 -209
410b09m901O591N756K698J592m256r117m41L685j373O39J851n824l132M479L231
$$ -209 -5110 1481 7237 9935 11527 7271 -1846 -2287 1398 25 664 2515 -3309 -6441 -1962 1269
426A269J258M196P18q111m787O724N276m80Q86l506o929L832Q118q05l728J99
$$ 1269 2527 6723 7441 -670 -5457 1267 6543 6063 6949 3443 -3486 346 8464 7659 3931 4130
442D130n807j0240M762J1020l507o457r17l506J920J0450L009o434l369j132j932
$$ 4130 -1677 -11917 -7155 3865 358 -6099 -7016 -10522 -8602 1848 4857 -1577 -4946 -6078 -8010
457h010N912Q624m978o988M272J007j062P331L399o825n267J305K81j47L067q09
$$ -8010 -2098 6526 1548 -5440 -1168 -161 -1223 6108 9507 2682 -2585 -1280 -999 -1146 1921 1112
473A112n672O29K193l715J832Q215q48q599l648M499K348L192M430p079p489O761
$$ 1112 -4560 -3931 -1738 -5453 -3621 4594 3746 -4853 -8501 -4002 -1654 1538 5968 -1111 -8600 -1839
489a839N573o84L462o51q346p48P865l42k631N997k141j2172N6O925R20J346l156
$$ -1839 3734 3050 6512 5861 -2485 -3233 4632 4290 1659 7656 5515 -6657 -6601 324 1244 2590 -566
506e66j0389r10J1393O701j322p54k178m543M955R156k559p453l451p77Q12K730
$$ -566 -10955 -11865 -472 6229 4907 4153 1975 -2568 2387 11543 8984 1531 -1920 -2697 -1885 845
522H45J470j85j156J568l83k281K768K305l088j947j056n159Q0R809O001n213
$$ 845 2315 2130 974 2542 2159 -122 2646 4951 1863 -84 -1140 -6299 -6219 3590 9591 4378
538D378l476O60l28N776N595r885r830P04j560k123N418K145o738k844M775K608
$$ 4378 902 1562 1234 7010 12605 2720 -7110 -6406 -7966 -10089 -4671 -2526 -9264 -12108 -7333 -4725
554d725L095N413n74o327k811R91N365O089j082o698m958K710Q716L668l170m422
$$ -4725 -1630 3783 3209 -3118 -5929 -4938 427 6516 5434 -1264 -6222 -3512 5204 8872 5702 1280
570A280m132j359M215N428k655o500j452J030R32L802q46l163L641R33m365K247
$$ 1280 -2852 -4211 4 5432 2777 -3723 -5175 -4145 -3213 589 -257 -3420 221 1154 -3211 -964
586i64N030n86N85J591n609m748N431M908j969q16l902n704O031R986q45n278
$$ -964 4066 3480 4065 5656 47 -4701 730 5638 3669 2853 -1049 -6753 -722 9264 8419 3141
602C141k652j954r89L231L320l561o757j402K127L296M316K605j913l510q7J959
$$ 3141 489 -1465 -2454 777 4097 536 -6221 -7623 -5496 -2200 2116 4721 2808 -702 -789 1170
618A170J590L958m54j0110m233O287L800R47J743l896n589L073N059n20j738j104
$$ 1170 2760 6718 6264 -3846 -8079 -1792 2008 2955 4698 802 -4787 -1714 3345 2825 1087 -17
634a7m871n75N230m94j182M886K12m064j83J052J121K853oo318m805K616L580
$$ -17 -4888 -5463 -233 -727 -1909 2977 3189 -875 -1058 -6 1115 3968 3962 -2356 -7161 -4545 -965
651i65K246J732l750o218J17N569N744j668o046j862P90K423N490J517l863k006
$$ -965 1281 3013 -737 -6955 -6838 -1269 4475 2807 -3239 -5101 -4311 -1888 3602 5119 1256 -750
667g50p11j99K873L536k628m504P43j093j651P126L919o454l658J344Q59K503
$$ -750 -1461 -1660 1213 4749 2121 -2383 -1640 -2733 -4384 2742 6661 207 -3451 -2107 -1248 1255
683A255K951k550m474J054K056l69L196K843k724k417k64j07J611J486n77k296
$$ 1255 4206 1656 -2818 -1764 292 -77 3119 5962 3238 821 557 450 2061 3547 2970 674
699F74l592r16L282L899P13l302m117q97K103K035P80j95k557m581J765O393J679
$$ 674 -2918 -3834 -552 3347 4060 758 -3359 -4256 -2153 -118 662 467 -2090 -6671 -4906 1487 3166
716C166m57o99m750m88N207J693k171K52j690m562J703O820K97l696l50k141k200
$$ 3166 2709 2010 -2740 -3228 1979 3672 1501 1753 63 -4499 -2796 4024 4321 625 275 -1866 -4066
733d066K859K899j058k470k358k43K476K865R73l39j411j568j109K007L241P03
$$ -4066 -1207 1692 634 -1836 -4194 -4437 -1961 904 1877 1538 127 -1441 -2550 -543 2698 3401
749C401k137l604MK744L420K051l324m143P58J151j99L023M93m947j880K657J218
$$ 3401 1264 -2340 -2336 408 3828 5879 2555 -1588 -830 321 122 3145 3638 -1309 -3189 -532 686
766F86l47K815q28n476j199J896J453K899k07m770j001L547K063P05O61j283l361
$$ 686 339 3154 2326 -3150 -4349 -2453 -1000 1899 1692 -3078 -4079 -532 1531 2236 2897 1614 -1747
783a747o23J957J027Q09j007k680M3J369J388J959M84j591k418k144K112K272
$$ -1747 -2370 -413 614 1423 416 -2264 -2221 -852 536 2495 2979 1388 -1030 -3174 -1062 1210
799A210j030j161j025j439K12L513L035r80k602j399j305K204L364k132k768L29
$$ 1210 180 -981 -2006 -3445 -3233 280 3315 2335 -267 -1666 -2971 -767 2597 465 -2303 -1974
815a974m77J53L208K613p31k250q72k30K039K957q25l323r20j397Q33L506P28
$$ -1974 -2451 -2298 910 3523 2792 542 -330 -560 1479 4436 3611 288 -632 -2029 -1196 2310 3038
832C038k573l041RJ968R89J44O69j098k154o64K137K508L93j512k339m69K292
$$ 3038 465 -2576 -2567 -599 390 534 1203 105 -2049 -2713 -576 1932 2325 813 -1526 -1995 297
849B97K296k42J108j372k695J577K303Q8r64j507k336j255J544J391k30J82m33
$$ 297 2593 2351 3459 2087 -608 969 3272 3360 2396 889 -1447 -2702 -1158 233 3 185 -248
866b48k574J020L273L96j283j491j471r27R21K169J226j409j356p13J727L153
$$ -248 -2822 -1802 1471 1867 584 -907 -2378 -3305 -2384 -215 1011 -398 -1754 -2467 -740 2413
882B413M44j638j850q77q81Q03J625O98k503j391J119P43J559J497j189j832q57
$$ 2413 2857 1219 -631 -1508 -2389 -1586 39 737 -1766 -3157 -2038 -1295 264 1761 572 -1260 -2117
899b117J6J018J607Q04l062j641K246J472J31J512j03k120n46R27J182R24K34
$$ -2117 -2101 -1083 524 1328 -1734 -3375 -1129 343 474 1986 1883 -237 -783 144 1326 2250 2484
916B484j896j758J443J728L59N20r3k843j307J778J792L47j440j256j488N67J967
$$ 2484 588 -1170 273 2001 2360 2880 2787 -56 -1363 415 2207 2554 1114 -142 -1630 -1063 904
933I04L23j44o42j937j091K464K014k46j512p66m46l46K859J533j374j525j037
$$ 904 1227 1083 441 -1496 -2587 -123 1891 1645 133 -633 -1079 -1425 1434 2967 1593 68 -969
950i69j21K225J593j027j768m12K16k86Q16J222j603k111j08J41Q99P78L2r11
$$ -969 -1090 1135 2728 1701 -67 -479 -263 -549 267 1489 -114 -2225 -2333 -2192 -1293 -515 -483 -1394
968a394q36j56M75J232J816q81k570K21J361J074J471L29j272j619R0J696O41
$$ -1394 -2230 -2386 -1911 -679 1137 256 -2314 -2093 -732 342 1813 2142 870 -749 -659 1037 1678
985A678L20j488l126L45J853J05K10M89j127j397M20J809J210p01j392j088n17
$$ 1678 1998 510 -2616 -2271 -418 -313 -103 386 -741 -2138 -1718 91 1301 600 -792 -1880 -2397
1002b397J544J671L19n60q78n42Q54K074J135j788j348K49q62N36K186l41p77
$$ -2397 -853 818 1137 577 -301 -843 11 2085 3220 1432 84 333 -529 7 2193 1852 1075
1019A075r77m01P81J656R20j418j189m99j031M79K440J64k211j656l29J277K392
$$ 1075 98 -303 478 2134 3054 1636 447 -52 -1083 -604 1836 2000 -211 -1867 -2196 -919 1473
1036A473L71j339j915m27J136J521J464o88k900o72J377J754J66p43Pj021q68
$$ 1473 1844 505 -1410 -1837 -701 820 2284 1596 -1304 -1976 -599 1155 1321 578 585 -436 -1304
1053a304J277P86o6K80j542j966N72J522N31j98k46j835j223K310K104p03l63
$$ -1304 -27 759 693 973 -569 -2535 -1963 -441 90 -108 -354 -2189 -3412 -1102 1002 299 -64
1070f4q68j111J488J095k91L08m46j347k66J441J738l05l96o03j016o5R70J434
$$ -64 -932 -2043 -555 540 249 557 111 -1236 -1502 -61 1677 1372 976 373 -643 -708 262 1696
1088A696J63j804k647M64J669K224nk317j197K62J040J876Q12j198k379j89J884
$$ 1696 1859 55 -2592 -2128 -459 1765 1760 -557 -1754 -1492 -452 1424 2236 1038 -1341 -1530 354
1105C54P30K43M24j327o19K63K2J365J552j645k146m46J105J088M57p7j659j660
$$ 354 1084 1327 1751 424 -195 68 90 1455 3007 1362 -784 -1230 -125 963 1420 1343 -316 -1976
1123a976N49J232J458Nk030q29m3O48J290O83p29q99r61N1J375J548q7j316o26
$$ -1976 -1427 -195 1263 1268 -762 -1591 -1634 -986 304 987 258 -641 -1602 -1551 -176 1372 1285 -31 -657
1142f57m25M32K067Q08j401q48j457m59K876J593k349j863l31K13J089J843N7
$$ -657 -1082 -650 1417 2225 824 -24 -1481 -1940 936 2529 180 -1683 -2014 -1801 -712 1131 1188
1159A188k510n35K85O05J483O94j220p48J63l66J207J595j85q92j465K15J192
$$ 1188 -1322 -1857 -1572 -967 516 1210 -10 -758 -595 -961 246 1841 1656 764 -701 -486 706
1176G06P05O43j094r00o94P7R07R53K5p35k220P4J725k60O03L73k205j226J452
$$ 706 1411 2054 960 60 -634 -557 350 1303 1328 593 -1627 -1553 172 -88 515 888 -1317 -2543 -1091
1195a091J042J151J42j261j897P86J953L66K78K65k539j123J910J421N18p41j486
$$ -1091 -49 1102 1244 -17 -1914 -1128 825 1191 1469 1734 -805 -1928 -18 1403 1921 1180 -306
1212c06j339P80J505M49k37p25j948m7J434J088L0p19j373l94O05Q55J200j58
$$ -306 -1645 -865 640 1089 852 127 -1821 -1868 -434 654 684 -35 -1408 -1802 -1197 -342 858 700
1230G00j364o57l5J241J397J87j115j026LM52Q58J438m3k377m09N55M72J331r3
$$ 700 -664 -1321 -1356 -115 1282 1469 354 -672 -669 -217 641 2079 2036 -341 -750 -195 277 1608 1515
1249A515j280r40k80J68J235R27r72j789m06R76N81J073rq55n23n52P55K003R5
$$ 1515 235 -705 -985 -817 418 1345 373 -1416 -1822 -846 -265 808 799 -56 -579 -1131 -376 1627 1722
1268A722p93p31o61L53J337N68l18r92r07m53J009J845n47j154q00j150L77J824
$$ 1722 929 198 -463 -110 1227 1795 1477 485 -422 -875 134 1979 1432 278 -522 -1672 -1295 529
1286E29L62r38r86j149J36J757J077n54j238R2o14M68J924K37o42r34r02M75J702
$$ 529 891 -47 -1033 -2182 -2046 -289 788 234 -1004 -912 -1526 -1058 866 1103 461 -473 -1375 -900 802
1305H02N10l08p77j138k45R64J002L78j361j340j42O45J216L6m0p78j132M20J100
$$ 802 1312 1004 227 -911 -1156 -192 810 1188 -173 -1513 -1655 -1010 206 242 202 -576 -1708 -1288 -188
1324a88O51N96r76j485N19Q80Q89P43l61o10j600R78J223N97J72j123j458l0J298
$$ -188 463 1059 83 -1402 -883 -3 886 1629 1268 658 -942 36 1259 1856 2028 905 -553 -583 715
1343G15K83N99o22j281n45L42J028K58k70p40q28J15R62K87O91o50j196mK79J108
$$ 715 998 1597 975 -306 -851 -509 519 777 507 -233 -1061 -946 16 303 994 344 -852 -856 -577 531
1363E31Q29q89p97k43KR05J065j22q39j057J41M67O64O61j213p75j60l66P98J321
$$ 531 1360 471 -326 -569 -567 338 1403 1281 442 -615 -474 -7 657 1318 105 -670 -830 -1196 -398 923
1383I23o11j254m51m4M42J042L03o78p75r4J93P41J406l06j422j40j71J237Q46
$$ 923 312 -942 -1393 -1437 -995 47 350 -328 -1103 -1197 -1004 -263 1143 837 -585 -725 -896 341 1187
1402A187k00o27r63m13Q26J097L37p34j091m09K49O99O17l73n90r80k75J058J116
$$ 1187 987 360 -603 -1016 -190 907 1244 510 -581 -990 -741 -42 575 202 -388 -1368 -1643 -585 531
1421E31l36o17n37l8L29R40R28l89o79l33J67J168O98Q7q15m71o46P23R08Q3o58
$$ 531 195 -422 -959 -997 -668 272 1200 811 132 -201 -34 1134 1832 1919 1104 633 -13 710 1618 1701 1043
1442A043j367k22M96N22K49k34o41l93k26J96Q29L63k95j055o16J035P57L14J61
$$ 1043 -324 -546 -50 472 721 487 -154 -547 -773 -577 252 615 320 -735 -1351 -316 441 755 916
1461I16j079o63K22N70P70J35p50r96j3P39L81R0k56o56j164N12R04O84k7j156
$$ 916 -163 -826 -604 -34 736 871 121 -875 -888 -149 232 322 66 -590 -1754 -1242 -338 346 319 -837
1481h37m87L0M43R34L38o06m98q62O04J494k5k84o23l97K47R86Q88k56o70n71
$$ -837 -1324 -1294 -851 83 421 -185 -683 -1545 -941 553 528 244 -379 -776 -529 457 1345 1089 419 -152
1501a52o35N77J201M6p21p43m34L87O44P43j76r70o28L85P9P93oo14k07m10J12
$$ -152 -787 -210 991 1037 316 -427 -861 -474 170 913 737 -233 -861 -476 -397 396 390 -224 -431 -841 -729
1522g29O64O41L43j012o88M46N00Q43L98j103m01l26P34P36M05n67j019l36K31
$$ -729 -65 576 919 -93 -781 -335 165 1008 1406 303 -98 -424 310 1046 1451 884 -135 -471 -240
1541b40R71k02J48q96o91K21L73P76j57m64n11l06K86N38K43J40k51p79K70P20
$$ -240 731 529 677 -219 -910 -689 -316 460 303 -161 -672 -978 -692 -154 89 229 -22 -801 -531 189
1561A89R07J65r46n94k54K12R66L73p99n38o00K78N96M83j38r18n96L07l7L49
$$ 189 1096 1261 315 -279 -533 -321 645 1018 219 -319 -919 -641 -45 438 300 -618 -1214 -907 -944 -595
1581e95J130o21p80k62O3J043Q35P5p63p41K45M97P92P06r42j510L27R01N24L75
$$ -595 535 -86 -866 -1128 -1065 -22 813 888 125 -616 -371 126 918 1624 682 -828 -501 400 924 1299
1601A299p24o09p72o2J009L10P7n50j127k6P31J024L45n57p96o92M16J306M11
$$ 1299 575 -34 -806 -868 141 451 528 -22 -1149 -1175 -444 580 925 368 -428 -1120 -704 602 1013
1620A013m01m66p94j3J303O55j97m00j232m60O35J124op78r2m86k03J109j0J2
$$ 1013 612 146 -648 -661 642 1297 1100 700 -532 -992 -357 767 761 -17 -109 -595 -798 311 301 313
1640C13j12r06m42N86M50M50m26m04n50J20O59Q49k38m31o93k40R87O05K60o96
$$ 313 201 -705 -1147 -561 -111 339 -87 -491 -1041 -921 -262 587 349 -82 -775 -1015 -28 577 837 141
1660A41m17m73N73M46J156l02q34p02o8P80M51K6l40j008p46J021N45O24l27j447
$$ 141 -276 -749 -176 270 1426 1124 290 -412 -480 300 751 777 437 -571 -1317 -296 249 873 546 -901
1680i01k28M08N55Q46l02n34o14k58J292L31Q11n53q63k01L58M63N21J01j106
$$ -901 -1129 -721 -166 680 378 -156 -770 -1028 264 595 1406 853 -10 -211 147 610 1131 1232 126
1699A26m65j15M35Q01J26j165p75l30QJ195L42n02p83k04M45M56J122L0r37j67
$$ 126 -339 -454 -19 782 908 -257 -1032 -1362 -1354 -159 183 -319 -1102 -1306 -861 -405 717 747 -190 -357
1719c57K6L45R06O86n73r60n46M53N69K90l3q35p68k14N53Q17J10o38l35n28M18
$$ -357 -331 14 920 1606 1033 73 -473 -20 549 839 806 -29 -797 -1011 -458 359 469 -169 -504 -1032 -614
1740f14R36K21o6n42r38J61Q91K85M08m77n00m09M47J047m4k08m55j041L55R44
$$ -614 322 543 477 -65 -1003 -842 49 334 742 265 -235 -644 -197 850 806 598 143 -898 -543 401
1760D01K78L18p38n52l68O88Q51j02j14o89r54L16P18O22j14l40r83j49J014N89
$$ 401 679 997 259 -293 -661 27 878 776 662 -27 -981 -665 53 675 561 221 -762 -911 103 692
1780F92M03p00o75l42L30P60L30j47q40n92L49P06M73M24p83q93l7J39P63N98
$$ 692 1095 395 -280 -622 -292 468 798 651 -189 -781 -432 274 747 1171 388 -505 -542 -403 360 958
1800I58m21j002m83k2M93O74P5r77q56L57K90N77O23l55j099K74J7P83M14J06
$$ 958 537 -465 -948 -970 -477 197 272 -705 -1561 -1204 -914 -337 286 -69 -1168 -894 -877 -94 320 426
1820D26m22j003P97O45N76L51n44p27o16M20M59O16m05j108k04k80O84O31J64
$$ 426 4 -999 -202 443 1019 1370 826 99 -517 -97 362 978 573 -535 -739 -1019 -335 296 460
1839D60m14o49M6K93Q37M58l73q52k83R8O95J139n18k88m86l64M12Q03R9m50r50
$$ 460 46 -603 -557 -264 573 1031 658 -194 -477 -379 316 1455 937 649 163 -201 211 1014 1113 663 -287
1860b87m69R8N78N51J39r00n25j77Q30Q57j32m36p74m31R10N97L40k19p69m49
$$ -287 -756 -658 -80 471 610 -290 -815 -992 -162 695 563 127 -647 -1078 -168 429 769 550 -219 -668
1880f68J95O01O88j02k27q50k12N92L55M1m1l89p65K79P24J06K04p60m83j61M74
$$ -668 -473 128 816 714 487 -363 -575 17 372 413 372 -17 -782 -503 221 327 531 -229 -712 -873 -399
1901c99P11p4n07o76p9M64M20J38K34p44n55M8Q36O27n5k01j93k96J30N76M22
$$ -399 312 238 -269 -945 -1024 -560 -140 -2 232 -512 -1067 -1019 -183 444 389 188 -5 -301 -171 405 827
1922H27k01o20m99J34M64Q33o9n63p32N1J33L98L30k78n13m41J95R54K16l6j78
$$ 827 626 6 -493 -359 105 938 869 306 -426 -375 -242 156 486 208 -305 -746 -551 403 619 583 405
1943D05r77L78K18R00K05p10l18k22J72P91J34l97k60l19QJ99K89Nk42r00j40
$$ 405 -572 -194 24 924 1129 419 101 -121 51 842 976 579 319 0 8 207 496 501 259 -641 -781
1964g81r5P21M64m46l05p68K20P52N16j58m25m57K54M18L50L87j09m57m01J29
$$ -781 -876 -155 309 -137 -442 -1210 -990 -238 278 120 -305 -762 -508 -90 260 647 538 81 -320 -191
1984a91P70K80l86l74n68j62M64N05J09k54q04r0J69N30K63l40m56j72J05O68
$$ -191 579 859 473 99 -469 -631 -167 338 447 193 -611 -701 -532 -2 261 -79 -535 -707 -602 66
2004F6M94m3n61m12P9L03P03K7n11l94o3N1N63M02j89l82l90r5L31L21J43j94
$$ 66 560 517 -44 -456 -377 -74 629 656 145 -249 -312 -261 302 704 515 133 -257 -352 -21 300 443 249
2026B49o01k32L68L41K22K33o43n08Q8P46J58k83j33n55l7N18M28J06j8l11o03
$$ 249 -352 -584 -216 125 347 580 -63 -571 -483 263 421 138 5 -550 -587 -69 359 465 447 136 -467
2047d67L90L89M41j26k67p87j1L16P74n8j09n39o99N16K87L30l11o46j3j76M31
$$ -467 -77 312 753 627 360 -427 -438 -122 652 594 485 -54 -753 -237 50 380 69 -577 -590 -766 -335
2068c35L72R4m50l82K1L18O69j6J70n46M4k16O93M27Qp28j77m39L45O03j67k42
$$ -335 37 131 -319 -701 -680 -362 307 291 461 -85 -41 -257 436 863 871 143 -34 -473 -128 475 308 66
2090F6o21J28J43J13K76n2m94l77L71m0O26J6k29k90K8O38J43L24j36k76m20Q8
$$ 66 -555 -427 -284 -171 105 53 -441 -818 -447 -487 139 155 -74 -364 -336 302 445 769 633 357 -63 25
2112B5J24N83o2l25o90oL36L59K07j84p02l06K95M80m2q1l24m69J53J82N89mP5
$$ 25 149 732 670 345 -345 -351 -15 344 551 367 -335 -641 -346 134 92 11 -313 -782 -629 -447 142 138 213
2135B13n41k23N88J53K84j00m05k84NM77R7J82n19l94k91L13O07K06r5m39n44
$$ 213 -328 -551 37 190 474 374 -31 -315 -310 167 264 446 -73 -467 -758 -445 162 368 273 -166 -710
2156g10K31O59K69k77m10k13K80J83M89K57p31l81j31J41Q82k03j15m41l07J17
$$ -710 -479 180 449 172 -238 -451 -171 12 501 758 27 -354 -485 -344 538 335 220 -221 -528 -411
2176d11P65J60M0l01l76J65J49L94M22n97m42k47K63K49K7k21l66m40k87O77M04
$$ -411 354 514 554 253 -123 42 191 585 1007 410 -32 -279 -16 233 260 39 -327 -767 -1054 -377 27
2197B7K7m07l09k31L24P44M83l18k65k52K69L94K32j91J75p54j40K68M38j60m68
$$ 27 54 -353 -662 -893 -569 175 658 340 75 -177 92 486 718 527 702 -52 -192 76 514 354 -114
2218a14l0j44n32P21J05j57l55j55J11K71K48J77k02l95J65q6O29M98k03l35k98
$$ -114 -144 -288 -820 -99 6 -151 -506 -661 -550 -279 -31 146 -56 -451 -286 -372 257 755 552 217 -81
2239h1m10N92K89J13l77o59j22L28N37K84m4q40pJ4l7N19J57n44o10K77N0Q67
$$ -81 -491 101 390 503 126 -533 -655 -327 210 494 450 -390 -397 -383 -420 99 256 -288 -898 -621 -571 296
2261B96L58l33n17R7J93R5N97j99n95L7j93K99N01j98J0m37j69L78J90J92j26
$$ 296 654 321 -196 -99 94 189 786 587 -8 29 -164 135 636 438 448 11 -158 220 410 602 476
2282D76m63j29j32J18N57q9k00j94l61L90K71K07k35o17pk5j8N21j27k02l40j73
$$ 476 13 -116 -248 -130 427 338 138 -56 -417 -27 244 451 216 -401 -408 -433 -451 70 -57 -259 -599 -772
2304g72K69P24J08j27l13j21KM45L71J8n62m72k88N90K64O0m20k64l08K10O61
$$ -772 -503 221 329 202 -111 -232 -230 215 586 604 42 -430 -718 -128 136 196 -224 -488 -796 -586 75
2325G5P1m48j88j52k4P09J82K45k06l29l24O09L98M7Q7l90o53J58L74O1M05q32
$$ 75 146 -302 -490 -642 -666 43 225 470 264 -65 -389 220 618 665 752 362 -291 -133 241 302 707 -125
2347a25m03K64K93K00j14k87r1m85M09J88J95M5l03l71K70M16K73J24j64k80j23
$$ -125 -528 -264 29 229 115 -172 -263 -748 -339 -151 44 89 -214 -585 -315 101 374 498 334 54 -69
2368f9R5M13P23n38l81m34J96J94M51n3n58l21J46rL06J24k85l95k4J38O56j62
$$ -69 26 439 1162 624 243 -191 5 199 650 597 39 -282 -136 -145 161 285 0 -395 -419 -281 375 213
2390B13m2k35n13J80J58O45q0l08m77P7K37L31K60l21l03R8j63O3M97K6j84n52
$$ 213 171 -64 -577 -397 -239 406 326 18 -459 -382 -145 186 446 125 -178 -80 -243 -180 317 343 159 -393
2412c93o3M30p2L84m40j27j87r0O63J60m16j32l72lN42K40K54j87m09M7j1N39
$$ -393 -456 -26 -98 286 -154 -281 -468 -558 105 265 -151 -283 -655 -658 -116 124 378 191 -218 -171 -182 357
2434C57J67M2n73k6j95M13J26K35k28l96l28M61J14J64j72m68k4k65L60L10q9
$$ 357 524 566 -7 -33 -228 185 311 546 318 -78 -406 55 169 333 161 -307 -331 -596 -236 74 -15
2455a5j75k26j7L13L76J54j09m55k28M08L6K96r7m4l9m57N20K92r6K8m55j48J43
$$ -15 -190 -416 -433 -120 256 410 301 -154 -382 26 62 358 261 217 178 -279 241 533 437 465 10 -138 5
2478Ej92N76k21n01j16r0M20J36J54m42Mj39q3P01m4j05r1r8K38k4K32J25k72
$$ 5 -187 389 168 -333 -449 -539 -119 17 171 -271 -267 -406 -489 212 168 63 -28 -126 112 88 320 445 173
2501A73kl87Q7M94q9n5m33j26j6J28N41j80m60K1l68L69K38L39j27m34P5qK35
$$ 173 171 -216 -129 365 276 221 -212 -338 -354 -226 315 135 -325 -304 -672 -303 -65 274 147 -287 -212 -220 15
2524A5R1J90k10n94M81K60K39k2n35Q7J6J3J22K60m57p7m9J37K8J17L06l67l16
$$ 15 106 296 86 -508 -27 233 472 450 -85 2 18 31 153 413 -44 -121 -170 -33 -5 112 418 51 -265
2547b65M19j84k1J83j55o6k59j49K85K59j3J57j31J12k62M95J40l29m57P7M9J97
$$ -265 154 -30 -51 132 -23 -89 -348 -497 -212 47 34 191 60 172 -90 405 545 216 -241 -164 -115 82
2569H2L11m13K80o92J64M79k59K84k57m56K76M7j9J82k25J45l54L54K77J7l52
$$ 82 393 -20 260 -432 -268 211 -48 236 -21 -477 -201 -154 -173 9 -216 -71 -425 -71 206 223 -129
2590a29L57l05J82K43j90m9M6k22j3J09K18Rk32J21n2k36L36j45L3J5j36j76L66
$$ -129 228 -77 105 348 158 109 155 -67 -80 29 247 256 24 145 93 -143 193 48 81 96 -40 -216 150
2613A50m03K07n9m4k27m4L76J96M54m53J06k40O2N20k29o0m80R5j2J59M80l60
$$ 150 -253 -46 -105 -149 -376 -420 -44 152 606 153 259 19 81 601 372 312 -168 -73 -85 74 554 194
2635A94m39j78O1k9K42j55p6k87L94J3J91J78j55l36N0R5L5M29j49k8l21J33P9
$$ 194 -245 -423 -362 -391 -149 -304 -380 -667 -273 -260 -69 109 -46 -382 -332 -237 -202 227 78 50 -271 -138 -59
2658e9L32k63K85m42J01l6M31m1j3k96R7j64o1N00j54J19m14j99L41Nq3J69n35
$$ -59 273 10 295 -147 -46 -82 349 308 295 -1 96 -68 -129 371 217 336 -78 -277 64 69 -14 155 -380
2681c80m6J39K08kL72m13J82k19J80J34L47k25J15k90K30k4Q4J01l99j73j39K15
$$ -380 -426 -287 -79 -81 291 -122 60 -159 21 155 502 277 392 102 332 308 392 493 94 -79 -218 -3
2703cJ31K9l64k6l3J85j5J3K8Pk56O6J99R2K8j53k31J25p3N00j02K20k78j50M19
$$ -3 128 157 -207 -233 -266 -81 -96 -83 -55 -48 -304 -238 -39 53 81 -72 -303 -178 -251 249 147 367 89 -61 358
2728C58k33K36R8n69k79K06O9J63m9k12Q4m18M63N4k00M0j86r1K22K21M0K65l69
$$ 358 125 361 459 -110 -389 -183 -114 49 0 -212 -128 -546 -83 -29 -229 -189 -375 -466 -244 -23 17 282 -87
2751h7q5J36R9K15o0k37J62l69K54L14L4r5k62N5n1J19N8j05k01M7k59K8K27J21
$$ -87 -172 -36 63 278 218 -19 143 -226 28 342 376 281 19 74 23 142 200 95 -106 -59 -318 -290 -63 58
2775E8J52N5m39r8K56K41o4k26J15j24k56N72L6K8k10o0J00J60k58J16o0r2jr
$$ 58 210 265 -174 -272 -16 225 161 -65 50 -74 -330 242 278 306 96 36 136 296 38 154 94 2 1 -8
2799hK50%j68j72M8j26N5j8J00r2j55O7n4K70R7l01Q2q6K48J41j5P3m30J46RJ91
$$ -8 242 242 74 -98 -50 -176 -121 -139 -39 -131 -286 -219 -273 -3 94 -207 -125 -211 37 178 163 236 -194 -48 -39 152
2825A52K26K3j66m71L50j85R7K49l20m50J07J42J69L18m05mk77K29N5J15j19r6
$$ 152 378 401 235 -236 114 -71 26 275 -45 -495 -388 -246 -77 241 -164 -168 -445 -216 -161 -46 -165 -261
2847b61L9k12M26J80J49l45kJ16q1J28Q2L2Jn23J28N3N21j25j84l17p1O5mN60
$$ -261 -222 -434 -8 172 321 -24 -26 90 9 137 219 251 252 -271 -143 -90 431 306 122 -195 -266 -201 -205 355
2871C55m49J84l15r9K01L01ql5k08p3N5J68J15M8k31q2j8M81J0k06Q8k66m05K61
$$ 355 -94 90 -225 -324 -123 178 170 135 -73 -146 -91 77 192 240 9 -73 -91 390 400 194 282 16 -389 -128
2895a28L06j14J00j78j96N1Q2L0m2J38m16J90p5K17N8J21l27j06Q1J04L30m3k19
$$ -128 178 64 164 -14 -210 -159 -77 -47 -89 49 -367 -177 -252 -35 23 144 -183 -289 -208 -104 226 183 -36
2918c6J9N4K56j30J01l02pR6j24qK13P5m80Q3n3oJ83J71j06l08J30J72N8j7K39
$$ -36 -17 37 293 163 264 -38 -45 51 -73 -81 132 207 -273 -190 -243 -249 -66 105 -1 -309 -179 -7 51 34 273
2943B73k82k8j95M79j03L7%j35Q0J2K73k36p8k03J86L3K26j96j37jl02J92O1J54
$$ 273 -9 -37 -232 247 144 181 181 46 126 138 411 175 97 -106 80 113 339 143 6 5 -297 -105 -44 110
2967A10j38Q3j35n18N64l9J41j0k6j89j17K66J71K7j19k11K46m11N17LN1m83J75
$$ 110 -28 55 -80 -598 -34 -73 68 58 32 -157 -274 -8 163 190 71 -140 106 -305 212 215 266 -217 -42
2990d2J73J30J06k14r0p1k57j26L87K5K1k29l9o5L07K20m73M49n62J12L51o3J57
$$ -42 131 261 367 153 63 -8 -265 -391 -4 21 42 -187 -226 -291 16 236 -237 212 -350 -238 113 50 207
3013B07j19j56J6L24j14k32M02l25j64R6K39R2j09j20k12P3J59R3l74K41j85J55
$$ 207 88 -68 -52 272 158 -74 328 3 -161 -65 174 266 157 37 -175 -102 57 150 -224 17 -168 -13
3035a3J8p0L81m27pq9M0J56Q3K7O2j38j74L37k82M92k53k27J16O0m6K50j95qo2
$$ -13 5 -65 316 -111 -118 -207 -167 -11 72 99 161 23 -151 186 -96 396 143 -84 32 92 46 296 101 93 31
3060C1j36m7J52Q4mk39M3L06m61n7M41k01mJ22n9k40L82r9K85j44k96K81J19j51
$$ 31 -105 -152 0 84 80 -159 -116 190 -271 -328 113 -88 -92 30 -29 -269 113 14 299 155 -141 140 259 108
3084A08P4j71J39l8p8L02q7k01k00j93L03k8K85m70r6K02j39K87J25m07M32k43
$$ 108 182 11 150 112 34 336 249 48 -152 -345 -42 -70 215 -255 -351 -149 -288 -1 124 -283 149 -94
3106i4k4J07M25k89R0q4R9M5j18Ol39L66p9J63p4O4l90J87k0j66L5J84j87q7p
$$ -94 -118 -11 414 125 215 131 230 275 157 163 -176 190 111 274 200 264 -126 61 41 -125 -90 94 -93 -180 -187
3131a87k9M02k32J40q6m5m0n7K15N1L7l68J89j1L53j33k54p2N3J87l79L76j94
$$ -187 -216 186 -46 94 8 -37 -77 -134 81 132 169 -199 -10 -21 332 199 -55 -127 -74 113 -266 110 -84
3154h4j57M35l07L71q7k08J33j51j53l22K01K68M9Q9j09j28p3J69N9j91M25m92
$$ -84 -241 194 -113 258 171 -37 96 -55 -208 -530 -329 -61 -12 77 -32 -160 -233 -64 -5 -196 229 -263
3176b63M04k74J14P0J41j04J86k10P8J11k79J60k39J11j05J75j79K32k73k46L61
$$ -263 141 -133 -19 51 192 88 274 64 142 253 -26 134 -105 6 -99 76 -103 129 -144 -390 -29
3197b9J36J58p8l67J98o3n4L52j99j76%K25j92K14O8N3j83p1O0K0L5k8j01P9l2
$$ -29 107 265 187 -180 18 -45 -99 253 54 -122 -122 103 -89 125 193 246 63 -8 52 72 107 79 -22 57 25
3222B5k64K00J17l13k3l0R4oM42l28j93M9K73l48QK70J16k69J48K91j77r1k86
$$ 25 -239 -39 78 -235 -258 -288 -194 -200 242 -86 -279 -230 43 -305 -297 -27 89 -180 -32 259 82 -9 -295
3245b95J56J25l0L3J3j64JJ10n5Q1J33k71J04j73o5M22l08K48r3j25J61J03p0
$$ -295 -139 -14 -44 -11 2 -162 -161 -51 -106 -25 108 -163 -59 -232 -297 125 -183 65 -28 -153 8 111 41
3268D1O3k66K15k69K34J05K2l9m7M6j28J36N1J81k33j64J33Rl41L70l33K06l2
$$ 41 104 -162 53 -216 18 123 145 106 59 105 -23 113 164 345 112 -52 81 90 -251 119 -214 -8 -40
3291d0j3no0p2L64m03J25j14K50Q1j57k0J07k19J84K27l17P5R3K8J53j39N9j81
$$ -40 -53 -58 -118 -190 174 -229 -104 -218 32 113 -44 -64 43 -176 8 235 -82 -7 86 114 267 128 187 6
3315Fk91J36J61l0J9J00k19q1K53Nk91L78j58k14J62RK90j95M8p7q9j01L61Q6
$$ 6 -285 -149 12 -18 1 101 -118 -199 54 59 -232 146 -12 -226 -64 -55 235 40 88 11 -78 -179 182 268
3339B68j11j32r3JK26J5m1o1k8j92J46J33l3J03k22j1j08l5L50k12J74k78J89
$$ 268 157 25 -68 -67 159 174 133 72 44 -148 -2 131 98 201 -21 -32 -140 -175 175 -37 137 -141 48
3362D8J45o3m34N37l39J92K8J39l1k00N0J98l00o6M47k46L7k76Q1R7O8k82L57
$$ 48 193 130 -304 233 -106 86 114 253 222 22 72 270 -30 -96 351 105 142 -134 -53 44 112 -170 187
3385A87k51j23J47J2K10k94J89l9j51K5Q1K7k2j43J23p0o5J1L32o5j92K38jr5
$$ 187 -64 -187 -40 -28 182 -112 77 38 -113 -88 -7 20 -2 -145 -22 -92 -157 -146 186 121 -71 167 166 71
3409G1P9j37M7L7j70P0k1Q7J03k69J31j67J15J77M7k94J87j62k3K35l03M27n56
$$ 71 150 13 60 97 -73 -3 -24 63 166 -103 28 -139 -24 153 200 -94 93 -69 -92 143 -160 267 -289
3432b89J83K84Q3k75J4j02J77Qn3J17k36jN6J13r7Q2r3J37l12J3j11K32J53j46
$$ -289 -106 178 261 -14 0 -102 75 83 30 147 -89 -90 -34 79 -18 64 -29 108 -204 -191 -302 -70 83 -63
3456f3j6K09l10qJ19qj38J57J84k8J52j8k50K1R8l13K70k3M7o9m8r4n2Q9oK4m5
$$ -63 -79 130 -180 -188 -69 -77 -215 -58 126 98 250 232 -18 3 101 -212 58 35 82 13 -35 -129 -181 -92 -98 -74 -119
3483a19J75k21m0O9m8j39J72K61j21J02j94QK16p7j07L8Q1j2k84J93K9K88J20
$$ -119 56 -165 -205 -136 -184 -323 -151 110 -11 91 -103 -95 121 44 -63 -25 56 44 -240 -47 -18 270 390
3506C90j11K3l12j34K10k60L71k10k06R7m8K35M4r6m2Q3l31J20RJ52Q3k10J19
$$ 390 279 302 -10 -144 66 -194 177 -33 -239 -142 -190 45 89 -7 -49 34 -297 -177 -168 -16 67 -143 -24
3529b4N7p3L09l15L32q5o2J28p8L9m2k76M8K09m3j91J87k82J11J09k2j01l4k02
$$ -24 33 -40 269 -46 286 201 139 267 189 228 186 -90 -42 167 124 -67 120 -162 -51 58 36 -65 -99 -301
3553c01q3M20j8k83N23j35Lr1jJ21k5j12P4m2j91n5K7L56n3k8k78P4J6M2n5mj61
$$ -301 -384 36 18 -265 258 123 126 35 34 155 130 18 92 50 -141 -196 -169 187 134 106 -172 -98 -82 -40 -95 -99 -260
3580b60K3L72j56j7j35R5J12R5m4j84Q8j02j37K12j66N87m45K76%l62L20J8k47
$$ -260 -237 135 -21 -38 -173 -78 34 129 85 -99 -11 -113 -250 -38 -204 383 -62 214 214 -148 172 190 -57
3603e7K55l15J11Rj56K87k66J03m1PN9k02K08j02k29J33L4J03J67p3o8K29l28
$$ -57 198 -117 -6 3 -153 134 -132 -29 -70 -63 -4 -206 2 -100 -329 -196 -162 -59 108 35 -33 196 -132
3626a32R9K72k20J06L7l42J46J00n5M6R1J7k62L12o5j09L8j20Q7k74J86M0j15
$$ -132 -33 239 19 125 162 -180 -34 66 11 57 148 165 -97 215 150 41 79 -41 46 -228 -42 -2 -117
3649a17p5L36j61K9j02j15J83J37r1j82L32J00k87j78J25J99j16K86k00P4o8m9
$$ -117 -192 144 -17 12 -90 -205 -22 115 24 -158 174 274 -13 -191 -66 133 17 303 103 177 109 60
3671F0k60K38k32J47L64l63R7j10L25k99p3K6L4pL5K2p7M2J12M1R5j26M6K26l32
$$ 60 -200 38 -194 -47 317 -46 51 -59 266 -33 -106 -80 -46 -53 -18 4 -73 -31 81 122 217 91 137 363 31
3696C1L7O3O7J10l29J34j33J19J52l94kq0J44MO4J8P0j64J31l20K72j13J49L4
$$ 31 68 131 198 308 -21 113 -20 99 251 -143 -145 -225 -81 -77 -13 5 75 -89 42 -278 -6 -119 30 64
3720F4J40k51M8K26q0k88J67L6r9k6J58P6j6k43J04J67j96J10k74K32J68k19K36
$$ 64 204 -47 1 227 147 -141 26 62 -37 -63 95 171 155 -88 16 183 -13 97 -177 55 223 4 240
3743B40j2k95J99j21k6p1L99m10M7N3M4j07J32L7k29k36M28j66K76j87j29O1j73
$$ 240 228 -67 132 11 -15 -86 313 -97 -50 3 47 -60 72 109 -120 -356 72 -94 182 -5 -134 -73 -246
3766b46L28J5n2K12m31M4j51J69J74r7J21l37NK55Nn6Q0j17J18l36K11J91J86
$$ -246 82 97 45 257 -174 -130 -281 -112 62 -35 86 -251 -246 9 14 -42 38 -79 39 -297 -86 105 291
3789B91m43J46J87k88K16J75o3l5l64J85J59j5p8k5k76P4LR9J25k3k38J7K19J38
$$ 291 -152 -6 181 -107 109 284 221 186 -178 7 166 151 73 48 -228 -154 -151 -52 73 50 -188 -171 48 186
3813A86m0J10j12j25j41K88M3m14J26N5J31j94J78J9N2j25j37r3K36j43J72k03
$$ 186 146 256 144 19 -122 166 209 -205 -79 -24 107 -87 91 110 162 37 -100 -193 43 -100 72 -131
3835a31J47J56kl16J07R3p7o6J16k72K35L15m08J72OL5j11N9k7k02J42K04q3O1
$$ -131 16 172 170 -146 -39 54 -23 -89 27 -245 -10 305 -103 69 75 110 -1 58 31 -171 -29 175 92 153
3859A53N6k59Q8jj21L07p3j93j22R8j36J04K23j14n0r6K06q0j5r0j8J44J22k37
$$ 153 209 -50 38 37 -84 223 150 -43 -165 -67 -203 -99 124 10 -40 -136 70 -10 -25 -115 -133 11 133 -104
3883a04J59o3K13k19o5J7J76o4j41L88k27l9k2N3M1l09J91q0J78N9j62j29N5P9
$$ -104 55 -8 205 -14 -79 -62 114 50 -91 297 70 31 9 62 103 -206 -15 -95 83 142 -20 -149 -94 -15
3907a5r6j39J73m4J10p4L4j5K26l4o3r1K25j27k02K17J21p2k67J11j64L23j08
$$ -15 -111 -250 -77 -121 -11 -85 -51 -66 160 126 63 -28 197 70 -132 85 206 134 -133 -22 -186 137 29
3930B9J92k82Q1J26l75K19J05Q8k85nK27l2j35m9l5J22r5J26J5Q4J78k67j17P6
$$ 29 221 -61 20 146 -229 -10 95 183 -102 -107 120 88 -47 -96 -131 -9 -104 22 37 121 299 32 -85 -9
3954iR4K11k49j37j50J87K74m64J66R2k19K44k89l3L34j60o4K57J11k22j01RN4
$$ -9 85 296 47 -90 -240 -53 221 -243 -77 15 -204 40 -249 -282 52 -108 -172 85 196 -26 -127 -118 -64
3977f4L24k14N9q9j1K35n31J40L4K17J44k70K7j5J2J4k6L7m5j07P0j14L05m92
$$ -64 260 46 105 16 5 240 -291 -151 -117 100 244 -26 1 -14 -2 12 -14 23 -22 -129 -59 -173 132 -360
4001c60K09J60k9J13q8P7Q9j35K4j21J52p4l8P9M3J91k60j74L12j7l36L65l49
$$ -360 -151 9 -20 93 5 82 171 36 60 -61 91 17 -21 58 101 292 32 -142 170 153 -183 182 -167
4024a67K74k17O3q3J0K2J91j06Q1p4N3P1j74l9M5j29p1N0J65J76N6j79o9k73K14
$$ -167 107 -110 -47 -130 -120 -98 93 -13 68 -6 47 118 -56 -95 -50 -179 -250 -200 -35 141 197 18 -51 -324 -110
4049a10J19K67k80R0k0o0Q6j09K98m08M9k1J10l2J51kj63m9J09k68J25M2K14l14
$$ -110 9 276 -4 86 66 6 92 -17 281 -127 -78 -99 11 -21 130 128 -35 -84 25 -243 -118 -76 138 -176
4073a76P9k26L54K83J5l32j71J92J28n9M8j98k8M8k50K33q8K39k0L6L9o6J93n44
$$ -176 -97 -323 31 314 329 -3 -174 18 146 87 135 -63 -91 -43 -293 -60 -148 91 71 107 146 80 273 -271
4097b71L30j36O8Jk52K33L7k07J9K94k09Q7J81l40L43Kl99J78K64k89k4J97k52
$$ -271 59 -77 -9 -8 -260 -27 10 -197 -178 116 -93 -6 175 -165 178 180 -219 -41 223 -66 -90 107 -145
4120a45J36P3k44k94N84l10j2K86J81m09n0K35r4J00P2k7K9j94m3N3K07j21l3
$$ -145 -9 64 -180 -474 110 -200 -212 74 255 -154 -204 31 -63 37 109 82 111 -83 -126 -73 134 13 -20
4143b0O8p4j75M20k98N7L0O4k46L00n1j8j96j79K84O8j49J10j07K92l62P7l1K01
$$ -20 48 -26 -201 219 -79 -22 8 72 -174 126 75 57 -139 -318 -34 34 -115 -5 -112 180 -182 -105 -136 65
4167F5kj38J98j87n3J49j03j31L90l84l7M90l02n4j96L86l07J14j08K52%k63J66
$$ 65 63 -75 123 -64 -117 32 -71 -202 188 -196 -233 257 -45 -99 -295 91 -216 -102 -210 42 42 -221 -55
4190e5k20L93j40n0j07N5J92J25j26j46J14P4j78O3j66J64r4P5J03q3j01K13j86
$$ -55 -275 118 -22 -72 -179 -124 68 193 67 -79 35 109 -69 -6 -172 -8 -102 -27 76 -7 -108 105 -81
4213h1j01J64n7K24k00J67J40j32j89qJ51q3P6L3l14J53j8k3R9Q7j64k06L72l10
$$ -81 -182 -18 -75 149 -51 116 256 124 -65 -73 78 -5 71 104 -210 -57 -75 -98 1 88 -76 -282 90 -220
4237b20K32J2q8J02q9qJ40J69l34J34j24K09L3j02j43J15k27K45l61L90P0j82
$$ -220 12 24 -64 38 -51 -59 81 250 -84 50 -74 135 168 66 -77 38 -189 56 -305 85 155 -27
4259b7k40M61k99j91M97k16J54r4J04j06qPk00L80l28O0J06j49N9o5J45j7J05
$$ -27 -267 194 -105 -296 201 -15 139 45 149 43 35 42 -158 222 -106 -46 60 -89 -30 -95 50 33 138
4282A38l18J88m1Km57M54J98k32o6M20k30j39p7L86k01j68M9k0J67Qj74N8j17
$$ 138 -180 8 -33 -31 -488 -34 164 -68 -134 286 56 -83 -160 226 25 -143 -94 -114 53 61 -113 -55 -172
4305a72K92j41R7J57j74J16p9j63l8K21l3k5J02j87k96K95q9J54J0j31R8l8j84
$$ -172 120 -21 76 233 59 175 96 -67 -105 116 83 58 160 -27 -323 -28 -117 37 47 -84 14 -24 -208
4328b08K98J06Q2l13P2j46PK06k3j60%nL5K3K04k56P2J1J26L5n0j60J07j6j42
$$ -208 90 196 278 -35 37 -109 -102 104 81 -79 -79 -84 -49 -26 178 -78 -6 5 131 166 116 -44 63 47 -95
4353i5J21j21Oj94M04j16j14K35k83oK68j96J00J52j29j24N7K52m14j4NJ47K02
$$ -95 26 -95 -89 -283 121 5 -109 126 -157 -163 105 -91 9 161 32 -92 -35 217 -197 -211 -206 -59 143
4376A43l08O6J69k33K10J92l86J79l52K10kR2j1k23L88l02J57j9J68k01k1O2l1
$$ 143 -165 -99 70 -163 47 239 -147 32 -320 -110 -112 -20 -31 -254 134 -168 -11 -30 138 -63 -84 -22 -53
4399e3n6J65p8k4Q6o2J41j03j8N3l70K69m3K07J4l44K22J41k09R3j10J75j86J49
$$ -53 -109 56 -22 -46 40 -22 119 16 -2 51 -319 -50 -93 114 128 -216 6 147 -62 31 -79 96 -90 59
4423E9j02K66j96k23J95m5J22j29J44k79J05K73k02K51k04m1Q9p8p3K84j05k3
$$ 59 -43 223 27 -196 -1 -46 76 -53 91 -188 -83 190 -12 239 35 -6 83 5 -68 216 111 88
4445H8k65kJ18J5J76O9j97K9j25rj52L07o8j56j15K94lO0N6J19l51%J23K09k21
$$ 88 -177 -179 -61 -46 130 199 2 31 -94 -103 -255 52 -16 -172 -287 7 4 64 120 239 -112 -112 11 220 -1
4470aJ82j00J95j27j50pM4K8j46j24K93J3qk95j7L17k04J41R3j16j82J09K20k5
$$ -1 181 81 276 149 -1 -8 36 64 -82 -206 87 100 92 -203 -220 97 -107 34 127 11 -171 -62 158 133
4494A33r9p8M5J29k30R5r6L26m2Rm05J99K61m43K33n6k00J66Nk9j0J14l7j6j42
$$ 133 34 -44 1 130 -100 -5 -101 225 183 192 -213 -14 247 -196 37 -19 -219 -53 -48 -77 -87 27 -10 -26 -168
4519a68K23J63k52M8j51O6j54M21k72R5L08k26o8K3K55n20L09j67J55n8M1k84
$$ -168 55 218 -34 14 -137 -71 -225 196 -76 19 327 101 33 56 311 -209 100 -67 88 30 71 -213
4541b13K90m5q6M0J64p5l5K07k56l5j2K23l47J60K9m6P7R3j26N5j19K65k17j24
$$ -213 77 32 -54 -14 150 75 40 247 -9 -44 -56 167 -180 -20 9 -37 40 133 7 62 -57 208 -9 -133
4565a33L21j60K9r8J8J43k26J36k73K02r8K36j23P2l0j40Q6j2J18l2o2k32L29
$$ -133 188 28 57 -41 -23 120 -106 30 -243 -41 -139 97 -26 46 16 -124 -38 -50 68 36 -26 -258 71
4588G1p5R6J06j49L8P3j30J94j90lJ98o3l3m1k18K43l01Q7L88l72K50k92K33j88
$$ 71 -4 92 198 49 87 160 30 224 34 31 229 166 133 92 -126 117 -184 -97 291 -81 169 -123 110 -78
4612g8L3K87l29r5L66k19j82L30l83M04j24J36j5k18K3m7m8R7K57j49J58q7m41
$$ -78 -45 242 -87 -182 184 -35 -217 113 -270 134 10 146 131 -87 -64 -111 -159 -62 195 46 204 117 -324
4635c24N62j98J6k08J01m6Q7m1O6K5l1k86K90R1oj22m3M9j25M03o2l3L6m58M36
$$ -324 238 40 56 -152 -51 -97 -10 -51 15 40 9 -277 13 104 98 -24 -67 -18 -143 260 198 165 201 -257 179
4660A79j45L6k13J51l7k3J01p7J73j11l17m2L22K53l46n5J38j32M57j92p7n9M
$$ 179 34 70 -143 8 -29 -52 49 -28 145 34 -283 -325 -3 250 -96 -151 -13 -145 312 120 43 -16 -12
4683a2p6O1J64k04J4K1P7Q1j95m2O7L49k50p8K77j60j05j03M8j8J43q1rJ27j01
$$ -12 -88 -27 137 -67 -53 -32 45 126 -69 -111 -44 305 55 -23 254 94 -11 -114 -66 -84 59 -22 -31 96 -5
4708ek8p6k6J72M3j68J84l37L29Jr3m7J14k87J8P4J32N6P5j74k05J29K96j21n4
$$ -5 -33 -109 -135 37 80 -88 96 -241 88 89 -4 -51 63 -224 -206 -132 0 56 131 -43 -248 -119 177 56 2
4733Bo6J31j0j64Q9J55j71j8l23L92j34L24l08J24m1L6K6j29R4j52M41l58L17
$$ 2 -64 67 57 -107 -18 137 -34 -52 -375 17 -117 207 -101 23 -18 18 44 -85 9 -143 298 -60 257
4756B57l87J38M9j56K2M3R9j3rL2o7j65J73j16N5j25J59j3j53K24L1j97J84p3
$$ 257 -130 8 57 -99 -77 -34 65 52 43 75 8 -157 16 -100 -45 -170 -11 -24 -177 47 78 -119 65 -8
4780hR0j98k09K94o3K60j40k28N58m80K92j92O9k2j23M1J06k5K4q8r2L2M1%k15
$$ -8 82 -116 -325 -31 -94 166 26 -202 356 -124 168 -24 45 23 -100 -59 47 22 46 -42 -134 -102 -61 -61 -276
4805b76J16J89k80K53j79K5o6K55k6N4mO5q8L5RJ40k22j02K91j64K6lqO7J12n96
$$ -276 -160 29 -251 2 -177 -152 -218 37 11 65 61 126 38 73 82 222 0 -102 189 25 51 48 40 107 219 -377
4831c77K79KO7O7K0l36J96j5R3N9K5J14k45J76j48J94O1k84K96j24j20J03j76
$$ -377 -98 -96 -29 38 58 -278 -82 -97 -4 55 80 194 -51 125 -23 171 232 -52 244 120 0 103 -73
4854g3K07j09q1R9p3j7J26l0k99K83r2M25l03j56J85j1l36K12Q3j87J62j47K11
$$ -73 134 25 -56 43 -30 -47 79 49 -250 33 -59 366 63 -93 92 81 -255 -43 40 -147 15 -132 79
4877G9m6m5p1m8J56L4j16J41r8J3R3j02j5J08j48J47j28NO8q2J27j94nO0J02m
$$ 79 33 -12 -83 -131 25 59 -57 84 -14 -1 92 -10 -25 83 -65 82 -46 -41 27 -55 72 -122 -127 -67 35 31
4903C1J2k84K27j05J20l8p4k61K88K71j46j9l0J47j09j04K55j14R4n7j86L45k50
$$ 31 43 -241 -14 -119 1 -37 -111 -372 -84 187 41 22 -8 139 30 -74 181 67 161 104 -82 263 13
4926A3J85n6n1j85j14J18K94k72j72K18j23J70J7J2O7l17K13k00L96k68L2n2J15
$$ 13 198 142 91 -94 -208 -90 204 -68 -240 -22 -145 25 42 54 121 -196 17 -183 213 -55 -23 -75 40
4949D0J7j53N4P1l08L67k21p1L01k8j35J31q9j44j13K54K74k61K6k2j39J0L02
$$ 40 57 -96 -42 29 -279 88 -133 -204 97 69 -66 65 -24 -168 -281 -27 247 -14 12 -10 -149 -139 163
4972A63l38K25r8Rp9K73r0n3O5J70k66J2J26j90rq8K84j53o3n3J84j2j60N6R5
$$ 163 -175 50 -48 -39 -118 155 65 12 77 247 -19 -7 119 -71 -80 -168 116 -37 -100 -153 31 19 -141 -85 10
4997A0K36k49j5J3J38k93rL11k10j47PK94l6J48k69m8K55q1j91K27j34N3Nm10
$$ 10 246 -3 -18 -5 133 -160 -169 142 -68 -215 -208 86 50 198 -71 -119 136 55 -136 91 -43 10 15 -395
5021c95K97J55j98o1J82j63K79j00K0j73L07O9j85o1J44k33J12j9N9L19m79J40
$$ -395 -98 57 -141 -202 -20 -183 96 -4 16 -157 150 219 34 -27 117 -116 -4 -23 36 355 -124 16
5043A6o5K02l33L05j00o1K01k68Lr8L33j29q1j34N7J53J20l15N7Q3M9Q2l35N21
$$ 16 -49 153 -180 125 25 -36 165 -103 -100 -198 135 6 -75 -209 -152 1 121 -194 -137 -54 -5 77 -258 263
5067B63k48j68K46j14p8K9J58k28P1J49k4j88L36k04k38K91j7m4r3K56k91K25
$$ 263 15 -153 93 -21 -99 -70 88 -140 -69 80 56 -132 204 0 -238 53 36 -8 -101 155 -136 89
5089H9k68r1L48k89L04n09L86o1K09l27L90j54j36K28k09P7K20k48l3j22PL50
$$ 89 -179 -270 78 -211 93 -416 -30 -91 118 -209 181 27 -109 119 -90 -13 207 -41 -74 -196 -189 161
5111A61l7j59O0q5J89k95J29K03k0j30k0N4o6J82k85K3j17L15k51K16k11N1J33
$$ 161 124 -35 25 -60 129 -166 -37 166 146 16 -4 50 -16 166 -119 -96 -213 102 -149 67 -144 -93 40
5134D0o2j37K24q1J18Pk79J13J44k05l9K08J21k21j60K73rk4j3o3k5J45k48j89
$$ 40 -22 -159 65 -16 102 109 -170 -57 87 -118 -157 51 172 -49 -209 64 55 31 18 -45 -70 75 -173 -362
5158c62K82K58n9p2J20k75k32N07l4l08L99n37L76j17j14L74K38l38j89L3o6K36
$$ -362 -80 178 119 47 167 -108 -340 167 133 -175 224 -313 63 -54 -168 206 444 106 -83 -50 -116 120
5180A20m25N20j86pj31O4L3Q2m0K3O8P3k20pr4J20j1K90m14L58k03J96j65l62
$$ 120 -305 215 29 22 -109 -45 -12 70 30 53 121 194 -26 -33 -127 -7 -18 272 -142 216 13 209 44 -318
5204c18L26l4L68k94J35k29K0N9K58k39J28j53j66QK36l67L47l6k13J99j82Q5
$$ -318 8 -26 342 48 183 -46 -26 33 291 52 180 27 -139 -131 105 -262 85 49 -164 35 -147 -62
5226f2J00L19k85k85K55M6k28L29j92n9P0J50k08N4r0j3J58k11K33J29k48K38
$$ -62 38 357 72 -213 42 88 -140 189 -3 -62 8 158 -50 4 -86 -99 59 -152 81 210 -38 200
5248B00k01r5L55l12J97j55q4r4K13r5j37L28j41l7p6J5J88O2m45L31J94j84p2
$$ 200 -1 -96 259 -53 144 -11 -95 -189 24 -71 -208 120 -21 -58 -134 -119 69 131 -314 17 211 27 -45
5271d5j84K06j31J44o6J96k12J16J32k63k49L54p2Kj00Q3Q0j80K3J9J33j38L23
$$ -45 -229 -23 -154 -10 -76 120 -92 24 156 -107 -356 -2 -74 -72 -172 -89 -9 -189 -166 -147 -14 -152 171
5294A71j63o3J78n6j11J64k58K75j5j55K05o6p2m7m2r2P7k6J43J9j18K47n4l52
$$ 171 8 -55 123 67 -44 120 -138 137 122 -33 172 106 34 -13 -55 -147 -70 -96 47 66 -52 195 141 -211
5318b11K67j55r9J45K79k38J7lp6N2j5K16l98K66J21k37O6O0q1J08j06k85L42
$$ -211 56 -99 -198 -53 226 -12 5 2 -74 -22 -37 179 -219 47 168 -69 -3 57 -24 84 -22 -307 35
5341C5k8J28o0o3k25L25j94K97j73q3J03K7K0N3k34J08j45o2L92j00l63K74J29
$$ 35 7 135 75 12 -213 112 -82 215 42 -41 62 89 109 162 -72 36 -109 -171 221 121 -242 32 161
5364A61L1k64K33j28k56J66N6p0M2J01j11K8q9K18k09P5j04j3R6J20N3l5k56J31
$$ 161 192 -72 161 33 -223 -57 -1 -71 -29 72 -39 -11 -100 118 -91 -16 -120 -133 -37 83 136 101 -155 -24
5388b4J27l58J38J42J92k03j6k15K03n2J4J23k20K33k0P8k54j60L64q4K26l74
$$ -24 103 -255 -117 25 217 14 -2 -217 -14 -66 -52 71 -149 84 64 142 -112 -272 92 8 234 -140
5410a40O2J46J27q0L9k24p1J68J47k46J7J14k0K07k35L1P6k40N2l6Q1n8K26j60
$$ -140 -78 68 195 115 154 -70 -141 27 174 -72 -55 59 39 246 11 42 118 -122 -70 -106 -25 -83 143 -17
5434a7Q3j9O3l15L05Q3k42J30M4j59J56J8j81r5k27M76k12K67Mj07m3J25j39M61
$$ -17 66 47 110 -205 100 183 -59 71 115 -44 112 130 -51 -146 -373 103 -109 158 162 55 12 137 -2 459
5458D59l83p3k70K58m4J35j68N3K09j13q1J46m8n3j82J93j75R0L2j20Q9J09k90
$$ 459 76 3 -267 -9 -53 82 -86 -33 176 63 -18 128 80 27 -155 38 -137 -47 -15 -135 -46 63 -227
5481b27K56N4M2r0o6Q6j16Q7O5j08K83j40k06o1J05K9q1r6R9J75l7o5k3L33l82
$$ -227 29 83 125 35 -31 55 -61 26 91 -17 266 126 -80 -141 -36 -7 -88 -184 -85 90 53 -12 -35 298 -84
5506h4L20l93J05P6k27K3R8K7j76K05qk60J66J20J26l2j52j14K67o1n0k7J09k34
$$ -84 236 -157 -52 24 -203 -180 -82 -55 -231 -26 -34 -294 -128 -8 118 86 -66 -180 87 26 -24 -51 58 -176
5530a76J51o2Q4J86q1k33l2J65P6j1j48L24m04K73m3j27L84k47j6p5o9J09j56
$$ -176 -25 -87 -3 183 102 -131 -163 2 78 67 -81 243 -161 112 69 -58 326 79 63 -12 -81 28 -128
5553a28O5Q3j25K77k0J32m01O9k2o1K24j16p3J57j5p6nK2mr4L4jM1K31j94JM9
$$ -128 -63 20 -105 172 152 284 -117 -48 -70 -131 93 -23 -96 61 46 -30 -35 -13 -17 -111 -77 -78 -37 194 0 1 50
5580E0j97J2R8j01J85j02L9k2M5J30j79j51K98k18N1J5O3K38k55J84j14r6m4K1
$$ 50 -147 -135 -37 -138 47 -55 -16 -38 7 137 -42 -193 105 -113 -62 -47 16 254 -1 183 69 -27 -71 -50
5604e0J48k20L11l02j1J3n0J67N9J65m06K1J70L0m5L03n41J44J39j3j6L3k0R1
$$ -50 98 -122 189 -113 -124 -111 -161 6 65 230 -176 -155 15 45 0 303 -238 -94 45 32 16 49 29 120
5628A20L1j28l5k4J92j53L4O6j9j70M9k20J73L19j06j46Qj88K29j72mK15n7N3
$$ 120 151 23 -12 -36 156 3 37 103 84 -86 -37 -257 -84 235 129 -17 -9 -197 32 -140 -144 71 14 67
5652F7L2j91L3j21K84j49J36r2M4j29J03J89k13o3o3j15J42K81j00k00L7Rn2p9
$$ 67 99 -92 -59 -180 104 -45 91 -1 43 -86 17 206 -7 -70 -133 -248 -106 175 75 -125 -88 -79 -131 -210
5676b10J39MJ49k25J32j40P8J45O6q3n0j9j15Q3O5J37j44J95l4j0j66qL80n15
$$ -210 -71 -67 82 -143 -11 -151 -73 72 138 55 5 -14 -129 -46 19 156 12 207 173 163 -3 -11 369 -146
5700a46k7L10j78K17j33k73M41k36n4J14j83R2j16O4J05j51R4J18j71R3%J05o6
$$ -146 -173 137 -41 176 43 -230 211 -25 -79 35 -148 -56 -172 -108 -3 -154 -60 58 -113 -20 -20 85 19
5723A9L4r5P3j07J70n0J04m04K28J45Nl63qK93j72N0K19j79j0k0K2L9n4J59k27
$$ 19 53 -42 31 -76 94 44 148 -256 -28 117 122 -241 -249 44 -128 -78 141 -38 -48 -68 -46 -7 -61 98 -129
5748a29J13K77k32j13P8K5j97M32l13j45K96J20j07j45L4Q9j66P7O2j93K23Lm29
$$ -129 -16 261 29 -84 -6 19 -178 254 -59 -204 92 212 105 -40 -6 83 -83 -6 56 -137 86 89 -340
5771c40K03o5M26l44K03m8J0p1J91k83J8J44j4J45l25J03J47mr2M6oJ09n2j06
$$ -340 -137 -202 224 -120 83 35 45 -26 165 -118 -100 44 30 175 -150 -47 100 96 4 50 44 153 101 -5
5795eM7j72J59k40L94j82p9K26m6k59J99j07M2J54p1j81M6K50l72L35j68J16j48
$$ -5 42 -130 29 -211 183 1 -78 148 102 -157 42 -65 -23 131 60 -121 -75 175 -197 138 -30 86 -62
5818f2J58p5O0j09jJ06j38J76j02M7L7k43M30k33k55K01R9q5J83J3k08M19n27
$$ -62 96 21 81 -28 -29 77 -61 115 13 60 97 -146 284 51 -204 -3 96 11 194 207 -1 418 -109
5841a09l2J90m22K98K59k39J8M0m6KJ30k89J65RJ47p3j48Q2N8P3q5R1j32j34J53
$$ -109 -141 49 -373 -75 184 -55 -37 3 -43 -41 89 -200 -35 -26 121 48 -100 -18 40 113 28 119 -13 -147 6
5866Fp1n6K37J0k51J62o2%L34q3j54q4j67J29J48J07k50q1J02l0J29L3j45nP8
$$ 6 -65 -121 116 126 -125 37 -25 -25 309 226 72 -12 -179 -50 98 205 -45 -126 -24 -54 75 108 -37 -42 36
5891C6rj26L05j38j28j03j7M0r2L78m64J68p0L34J20k81K65j47k93K20N3QJ52
$$ 36 27 -99 206 68 -60 -163 -180 -140 -232 146 -318 -150 -220 114 234 -47 218 71 -222 -2 51 59 211
5914B11k95j58K96p8J80r8j21k2J78j5k57L68oq5k34K46M4j27O8r9J40k51RK13
$$ 211 -84 -242 54 -24 156 58 -63 -85 93 78 -179 189 183 98 -136 110 154 27 95 -4 136 -115 -106 107
5938A07j59J20j43K58K4j86j13J62OR1k48K36l07J97P4j2l57K26J19j97L0J21
$$ 107 -52 68 -75 183 207 21 -92 70 76 167 -81 155 -152 45 119 107 -250 -24 95 -102 -72 49
$$ [...]
8191A65
##END NTUPLES=NMR FID
##END=
