##TITLE=1H_AM_Ser 78-V-H
 CDCl3
 8 sc, 
 14.04.2022
##JCAMPDX= 6.0         $$ Bruker NMR JCAMP-DX V2.0
##DATA TYPE= NMR FID
##DATA CLASS= NTUPLES
##ORIGIN= UXNMR, Bruker Analytische Messtechnik GmbH
##OWNER= root
$$ XWIN-NMR		Version 3.5
$$ Thu Apr 14 15:36:50 2022 Russian Standard Time (UT+4h)  she@DPX200
##.OBSERVE FREQUENCY= 200.13135
##.OBSERVE NUCLEUS= ^1H
##.DELAY= (6, 6)
##.ACQUISITION MODE= SIMULTANEOUS
##.ACQUISITION SCHEME= undefined
##.AVERAGES= 8
##.DIGITISER RES= 18
##SPECTROMETER/DATA SYSTEM= spect
##.PULSE SEQUENCE= zg30
##.SOLVENT NAME= CDCl3
##.SHIFT REFERENCE= (INTERNAL, CDCl3, 0, 15.7039)
##AUDIT TRAIL= $$ (NUMBER, WHEN, WHO, WHERE, WHAT)
$$ ##TITLE= Audit trail, XWIN-NMR		Version 3.5
$$ ##JCAMPDX= 5.01
$$ ##ORIGIN= Bruker BioSpin GmbH
$$ ##OWNER= she
$$ F:/spectra/data/she/nmr/H-F/1/audita.txt
$$ ##AUDIT TRAIL=  $$ (NUMBER, WHEN, WHO, WHERE, WHAT)
(   1,<2022-04-14 15:35:26.51 +0400>,<she>,<DPX200>,
      <created by zg, POWCHK disabled, PULCHK disabled
       configuration hash MD5:
       00 E9 B6 7A A2 85 ED C7 34 08 36 98 17 FE 4E 26
       data hash MD5: 16K
       85 BA 09 2C 95 2C F7 D6 78 F6 9E BB 42 CE 1D 16>)
$$ ##END=
$$ 
$$ hash MD5
$$ 28 2D FC 08 7E A2 CF 5F 4A 70 50 70 0C 4C 44 11
##$RELAX= 
##$RELAX= 
##$RELAX= 
##$RELAX= 
##$RELAX= 
##$RELAX= 
$$ Bruker specific parameters
$$ --------------------------
##$DU= <F:/spectra>
##$EXPNO= 1
##$NAME= <H-F>
##$PROCNO= 1
##$TYPE= <nmr>
##$USER= <she>
##$AMP= (0..31)
100 100 100 100 100 100 100 100 100 100 100 100 100 100 100 100 100 100 
100 100 100 100 100 100 100 100 100 100 100 100 100 100 
##$AQSEQ= 0
##$AQ_mod= 1
##$AUNM= <au_zg>
##$AUTOPOS= <>
##$BF1= 200.13
##$BF2= 200.13
##$BF3= 200.13
##$BF4= 200.13
##$BF5= 200.13
##$BF6= 200.13
##$BF7= 200.13
##$BF8= 200.13
##$BYTORDA= 1
##$CFDGTYP= 0
##$CFRGTYP= 5
##$CHEMSTR= <none>
##$CNST= (0..31)
1 1 145 1 1 1 1 1 1 1 1 1 1 1 1 1 1 1 1 1 1 1 1 1 1 1 1 1 1 1 1 1 
##$CPDPRG= <>
##$CPDPRG1= <>
##$CPDPRG2= <>
##$CPDPRG3= <>
##$CPDPRG4= <mlev>
##$CPDPRG5= <mlev>
##$CPDPRG6= <mlev>
##$CPDPRG7= <mlev>
##$CPDPRG8= <mlev>
##$CPDPRGB= <>
##$CPDPRGT= <>
##$D= (0..31)
0 1.2 0 0 0 0 0 0 0 0.06 0 0.03 0 0 0 0 0.0002 0 0 0 0 0 0 0 0 0 0 0 0 
0 0 0 
##$DATE= 1649936125
##$DBL= (0..7)
120 120 120 120 120 120 120 120 
##$DBP= (0..7)
150 150 150 150 150 150 150 150 
##$DBP07= 0
##$DBPNAM0= <>
##$DBPNAM1= <>
##$DBPNAM2= <>
##$DBPNAM3= <>
##$DBPNAM4= <>
##$DBPNAM5= <>
##$DBPNAM6= <>
##$DBPNAM7= <>
##$DBPOAL= (0..7)
0.5 0.5 0.5 0.5 0.5 0.5 0.5 0.5 
##$DBPOFFS= (0..7)
0 0 0 0 0 0 0 0 
##$DE= 6
##$DECBNUC= <off>
##$DECIM= 32
##$DECNUC= <off>
##$DECSTAT= 4
##$DIGMOD= 1
##$DIGTYP= 9
##$DL= (0..7)
0 120 120 120 120 120 120 120 
##$DP= (0..7)
150 150 150 150 150 150 150 150 
##$DP07= 0
##$DPNAME0= <>
##$DPNAME1= <>
##$DPNAME2= <>
##$DPNAME3= <>
##$DPNAME4= <>
##$DPNAME5= <>
##$DPNAME6= <>
##$DPNAME7= <>
##$DPOAL= (0..7)
0.5 0.5 0.5 0.5 0.5 0.5 0.5 0.5 
##$DPOFFS= (0..7)
0 0 0 0 0 0 0 0 
##$DQDMODE= 0
##$DR= 18
##$DS= 0
##$DSLIST= <SSSSSSSSSSSSSSS>
$$ [...]
##$SUBNAM2= <"">
##$SUBNAM3= <"">
##$SUBNAM4= <"">
##$SUBNAM5= <"">
##$SUBNAM6= <"">
##$SUBNAM7= <"">
##$SUBNAM8= <"">
##$SUBNAM9= <"">
##$SW= 18.05172834244
##$SWIBOX= (0..15)
0 0 2 0 0 0 0 0 0 0 0 0 0 0 0 0 
##$SW_h= 3612.71676300578
##$TD= 16384
##$TD0= 1
##$TE= 0
##$TE2= 300
##$TE3= 300
##$TEG= 300
##$TL= (0..7)
0 120 120 120 120 120 120 120 
##$TP= (0..7)
150 150 150 150 150 150 150 150 
##$TP07= 0
##$TPNAME0= <>
##$TPNAME1= <>
##$TPNAME2= <>
##$TPNAME3= <>
##$TPNAME4= <>
##$TPNAME5= <>
##$TPNAME6= <>
##$TPNAME7= <>
##$TPOAL= (0..7)
0.5 0.5 0.5 0.5 0.5 0.5 0.5 0.5 
##$TPOFFS= (0..7)
0 0 0 0 0 0 0 0 
##$TUNHIN= 0
##$TUNHOUT= 0
##$TUNXOUT= 0
##$USERA1= <user>
##$USERA2= <user>
##$USERA3= <user>
##$USERA4= <user>
##$USERA5= <user>
##$V9= 5
##$VALIST= <valist>
##$VCLIST= <CCCCCCCCCCCCCCC>
##$VD= 0
##$VDLIST= <DDDDDDDDDDDDDDD>
##$VPLIST= <PPPPPPPPPPPPPPP>
##$VTLIST= <TTTTTTTTTTTTTTT>
##$WBST= 1024
##$WBSW= 4
##$XGAIN= (0..3)
0 0 0 0 
##$XL= 0
##$YL= 0
##$YMAX_a= 410860
##$YMIN_a= -719837
##$ZGOPTNS= <>
##$ZL1= 120
##$ZL2= 120
##$ZL3= 120
##$ZL4= 120
##$ABSF1= 10
##$ABSF2= 0
##$ABSG= 5
##$ABSL= 3
##$ALPHA= 0
##$AQORDER= 0
##$ASSFAC= 0
##$ASSFACI= 0
##$ASSFACX= 0
##$ASSWID= 0
##$AUNMP= <proc_1d>
##$AZFE= 0.1
##$AZFW= 0.1
##$BCFW= 1
##$BC_mod= 2
##$BYTORDP= 1
##$COROFFS= 0
##$CY= 11.3945322036743
##$DATMOD= 1
##$DC= 2
##$DFILT= <>
##$DTYPP= 0
##$F1P= 2.36226072786647
##$F2P= -0.459571619588291
##$FCOR= 0.5
##$FTSIZE= 0
##$FT_mod= 4
##$GAMMA= 1
##$GB= 0.15
##$INTBC= 1
##$INTSCL= 1
##$ISEN= 128
##$LB= 0.24
##$LEV0= 0
##$LPBIN= 0
##$MAXI= 10000
##$MC2= 0
##$MEAN= 0
##$ME_mod= 0
##$MI= 1.114404
##$NCOEF= 0
##$NC_proc= 0
##$NLEV= 6
##$NOISF1= 3.799351
##$NOISF2= 2.8
##$NSP= 1
##$NTH_PI= 0
##$NZP= 0
##$OFFSET= 15.70392
##$PC= 1
##$PHC0= -18388.34
##$PHC1= 9.200737
##$PH_mod= 1
##$PKNL= yes
##$PPARMOD= 0
##$PSCAL= 0
##$PSIGN= 0
##$REVERSE= no
##$SF= 200.130013532006
##$SI= 16384
##$SIGF1= 3
##$SIGF2= 2
##$SINO= 400
##$SIOLD= 16384
##$SREGLST= <1H.CDCl3>
##$SSB= 0
##$STSI= 0
##$STSR= 0
##$SW_p= 3612.71676300578
##$SYMM= 0
##$S_DEV= 0
##$TDeff= 0
##$TDoff= 0
##$TI= <>
##$TILT= no
##$TM1= 0
##$TM2= 0
##$TOPLEV= 0
##$USERP1= <user>
##$USERP2= <user>
##$USERP3= <user>
##$USERP4= <user>
##$USERP5= <user>
##$WDW= 1
##$XDIM= 8192
##$YMAX_p= 0
##$YMIN_p= 0
$$ End of Bruker specific parameters
$$ ---------------------------------
##NTUPLES= NMR FID
##VAR_NAME=  TIME,          FID/REAL,        FID/IMAG
##SYMBOL=    X,             R,               I
##VAR_TYPE=  INDEPENDENT,   DEPENDENT,       DEPENDENT
##VAR_FORM=  AFFN,          ASDF,            ASDF
##VAR_DIM=   8192,          8192,            8192
##UNITS=     SECONDS,       ARBITRARY UNITS, ARBITRARY UNITS
##FACTOR=    0.0002768,     1,               1
##FIRST=     0,             0,               0
##LAST=      2.2672688,     0,               0
##MIN=       0,             -719837,         0
##MAX=       2.2672688,     410860,          0
$$ Real data points
##PAGE= N=1
##DATA TABLE= (X++(R..R)), XYDATA
$$ plain form
0 0 0 0 0 0 0 0 0 8 -8 8 -8 9 -16 24 -24 32 -40 49 -64 73 -88 110 -128 152 -177 208 -241 281 -325 372
30 372 -425 486 -551 623 -703 792 -894 999 -1118 1247 -1389 1543 -1711 1898 -2098 2319
46 2319 -2558 2822 -3110 3426 -3774 4157 -4584 5055 -5587 6182 -6861 7640 -8541 9605
60 9605 -10876 12430 -14387 16921 -20360 25316 -33109 47215 -80875 336121 35608 -503504
72 -503504 234312 234394 -46687 185609 224240 -342116 -211151 260272 110213 -166984 70756
83 70756 100165 -94056 -2511 162365 45819 12587 60995 -5479 -33479 63421 29738 12193
95 12193 115585 54638 -105931 40002 195717 43276 -27631 90502 -13396 -116432 80180
106 80180 117473 -116187 -75154 85734 -41998 -71022 139598 85290 -86871 31710 109762
$$ packed form
0@%%%%%%%Qj6J6j6J7k5M0m8N6p2Q9j13J37j61J98k38K80l29L85m49N22o06O97
30C72p97R11j037J174j326J495j686J893k117K365k636K932l254L609l996M417
46B319m877N380n932O536p200P931q741R639j0642J1769j3043J4501j6181J8146
60I605k0481K3306k6817L1308l7281M5676n8425Q0324j28090M16996l00513n39112
72e03504P37816Q2k81081K32296L8631n66356J30965M71423j50059k77197K37740
83G0756K9409j94221R1545J64876j16546l3232M8408o6474k8000R6900l3683j7545
95A2193J03392o0947j60569J45933J55715j52441p0907J18133j03898j03036J96612
106H0180L7293k33660M1033J60888j27732k9024K10620n4308j72161J18581P8052
$$ plain form
117 109762 -24261 -4908 81141 -10086 -41258 18993 -59371 -67283 98427 73206 -96788
128 -96788 -56934 53794 44323 59982 45672 -86258 -72864 95740 64380 -95160 -59418
139 -59418 31481 -14202 -20990 32237 -20537 -49981 47962 56857 -42666 -28333 24729 -23755
151 -23755 -16867 50826 -12265 -81623 -2236 35101 -10411 24719 29955 -69086 -47747 60192
163 60192 21722 -36728 4168 -35988 -94089 18383 90908 -16859 -59411 312 -2822 13368
175 13368 76884 24060 -58151 -4661 36582 -14026 -2698 35085 -21359 -54923 -4992 4242
187 4242 -13514 17809 10215 -46433 -21946 38257 8550 -21369 26429 33628 -20791 -18002 23206
200 23206 27179 31426 32286 -22424 -47897 18833 59039 21559 -10727 -29902 -41451 7515 53746
$$ packed form
117A09762j34023J9353Q6049r1227l1172O0251p8364p912J65710k5221j69994
128i6788L9854J10728r471J5659j4310j31930J3394J68604l1360j59540L5742
139e9418R0899m5683o788N3227n2774k9444R7943Q895r9523J4333N3062m8484
151b3755O888O7693o3091o9358P9387L7337m5512L5130N236r9041K1339J07939
163F0192l8470n8450M0896m0156n8101J12472P2525j07767m2552N9723l134J6190
175A3368O3516n2824q2211N3490M1243n0608J1328L7783n6444l3564M9931R234
187D242j7756L1323p594n6648K4487O0203k9707k9919M7798P199n4419K789M1208
200B3206L973M247Q60n4710k5473O6730M0206l7480l2286j9175j1549M8966M6231
$$ plain form
213 53746 16444 -23466 -16016 -21218 -9429 49322 46443 -20347 -25933 1947 -4369 21784 59399
226 59399 10027 -48276 -20129 19332 26593 36138 12261 -46050 -34878 31506 39070 1323 -11066
239 -11066 -14883 -14399 13240 26824 61 -14703 2957 3823 -8994 1500 8050 -8618 -6784
252 -6784 7086 -6569 -18861 -471 11173 5601 5753 -6258 -26776 -4782 31340 15325 -15027
265 -15027 -16887 -17160 -6466 25494 19679 -21826 -28150 -3535 4968 9182 11482 -11685 -28414 -8046
279 -8046 7494 1330 -2217 -8731 -18146 -9332 3567 -95 -7200 -5484 -3503 -3527 1523 561 -8399
294 -8399 -3806 10784 9062 -6430 -13155 -7469 2849 12535 10415 -12890 -28774 -8694 16829
307 16829 18804 6011 -14933 -27624 -8786 23405 25646 -1235 -23713 -26349 -7361 23109 28219
$$ packed form
213E3746l7302l9910P450n202J1789N8751k879o6790n586K7880o316K6153L7615
226E9399m9372n8303K8147L9461P261R545k3877n8311J1172O6384P564l7747j2389
239a1066l817M84K7639J3584k6763j4764J7660Q66j2817J0494O550j6668J834
252f784J3870j3655j2292J8390J1644n572J52j2011k0518K1994L6122j6015l0352
265a5027j860k73J0694L1960n815m1505o324K4615Q503M214K300k3167j6729K0368
279h046J5540o164l547o514r415Q814J2899l662p105J716J981k4N050r62q960
294h399M593J4590j722j5492o725N686J0318R686k120k3305j5884K0080K5523
307A6829J975j2793k0944j2691J8838L2191K241k6881k2478k636J8988L0470N110
$$ plain form
320 28219 -810 -23386 -17388 5031 27863 28829 3691 -18733 -14805 4557 18080 16785 1309
333 1309 -16519 -15535 4408 17721 15282 8226 -742 -5014 2122 13481 13004 1583 -1562 -2069 -8948
348 -8948 -9542 3137 12400 10145 1300 -9133 -8343 11515 30202 22595 -4000 -21439 -14531 11232
362 11232 27634 12658 -15221 -23447 -8392 15493 31131 20568 -9633 -22816 -4254 15597
374 15597 16135 4449 -16267 -32562 -20242 8086 15767 538 -12998 -14171 -1703 16847 21891
387 21891 4419 -10495 -8958 -2373 1874 158 -8416 -12884 -8059 -3158 -2411 -735 19 -2562 -1861
402 -1861 795 -4901 -13783 -12811 -6118 -2533 -4867 -14562 -21339 -9559 13117 16672 -2926 -16519
416 -16519 -11123 1910 11404 6083 -16218 -31483 -19600 -385 1643 -5572 -13346 -16497 -5724
$$ packed form
320B8219k9029k2576N998K2419K2832R66k5138k2424L928J9362J3523j295j5476
333A309j7828R84J9943J3313k439p056q968m272P136J1359m77j1421l145n07o879
348h948n94J2679R263k255q845j0433P90J9858J8687p607k6595j7439O908K5763
362A1232J6402j4976k7879q226J5055K3885J5638j0563l0201j3183J8562J9851
374A5597N38j1686k0716j6295J2320K8328P681j5229j3536j173J2468J8550N044
387B1891j7472j4914J537O585M247j716q574m468M825M901P47J676P54k581P01
402a861K656n696q882R72O693L585k334r695o777J1780K2676L555j9598j3593
416a6519N396J3033R494n321k2301j5265J1883J9215K028p215p774l151J0773
$$ plain form
429 -5724 9450 8896 -53 -3073 -3771 -3502 -738 -4339 -9678 -5494 -3405 -10923 -11238 -2755 -3005 -3860
445 -3860 3261 2103 -9757 -13553 -6289 2735 7010 -561 -16983 -20740 -796 20627 18848 -1054
459 -1054 -15146 -8090 9557 20887 15109 -4367 -20217 -16332 1159 16116 15100 -5680 -23960
472 -23960 -13175 12545 23383 13976 -5465 -17012 -7650 11341 15132 5111 -3997 -11183 -8138
485 -8138 8635 15694 8058 3088 111 -698 8267 14440 8222 5543 7803 1185 -4082 5800 13540
500 13540 8833 2228 -4838 -7717 1363 7782 4058 399 -3083 -7713 -6071 6091 19498 16874
514 16874 -290 -10216 953 20927 27699 13867 -7115 -14171 2788 19936 14855 798 -9236
527 -9236 -13311 -1938 14435 12995 -1962 -13145 -11381 4297 16661 6697 -8473 -3551 7916
$$ packed form
429e724J5174n54q949l020o98K69K764l601n339M184K089p518l15Q483k50q55
445c860P121j158j1860l796P264R024M275p571j6422l757J9944K1423j779j9902
459a054j4092P056J7647J1330n778j9476j5850L885J7491J4957j016k0780j8280
472b3960J0785K5720J0838r407j9441j1547R362J8991L791j0021r108p186L045
485h138J6773P059p636m970k977q09Q965O173o218k679K260o618n267R882P740
500A3540m707o605p066k879R080O419l724l659l482m630J642J2162J3407k624
514A6874j7164r926J1169J9974O772j3832k0982p056J6959J7148n081j4057j0034
527i236m075J1373J6373j440j4957j1183J764J5678J2364r964j5170M922J1467
$$ plain form
540 7916 10544 10833 6712 -96 6532 13314 3838 -3096 -1182 -3258 -2835 3326 -578 -10619 -9682 516
556 516 10390 12909 3087 -7799 -575 14317 15851 6997 -3473 -7329 -1402 4105 4958 4958 209 -8438
572 -8438 -6888 4394 10998 7571 -3675 -11898 -6153 5259 5383 -919 -3067 -4281 -979 5784 6520
587 6520 6767 9580 3030 -2645 4507 6946 -1295 -1015 1800 -3794 -6256 -4016 -2696 5860 13516 1460
603 1460 -11769 -3655 9600 13222 8121 -6192 -16547 -9757 4793 11363 6433 -6756 -15196 -6599
617 -6599 13116 23195 14012 -7349 -16821 -32 18706 14551 -911 -12098 -13357 -1707 10634
630 10634 8860 -1245 -7504 -7886 -1012 7548 5753 -2593 -6612 -6481 -2689 2821 107 -2764 3020
645 3020 3900 -1841 -616 5586 7832 7448 1474 -7756 -5320 3045 1796 -1438 -1178 -6444 -10828 -2433
$$ packed form
540G916K628K89m121o808O628O782r476o934J914k076M23O161l904j0041R37J0198
556E16R874K519r822j0886P224J4892J534q854j0470l856N927N507Q53%m749q647
572h438J550J1282O604l427j1246q223N745J1412J24o302k148j214L302O763P36
587F520K47K813o550n675P152K439q241K80K815n594k462K240J320Q556P656j2056
603A460j3229Q114J3255L622n101j4313j0355O790J4550O570m930j3189q440Q597
617f599J9715J0079r183k1361r472J6789J8738m155j5462j1187j259J1650J2341
630A0634j774j0105o259l82O874Q560j795q346m019J31L792N510k714k871N784
645C020Q80n741J225O202K246l84n974r230K436Q365j249l234K60n266m384Q395
$$ plain form
661 -2433 6081 6324 1787 -5708 -9375 -527 9209 7327 -1534 -10096 -10280 -423 7060 3937 -1846 -6132
677 -6132 -8194 -1116 9262 7420 -2859 -8646 -5539 3059 7033 684 -5533 -4523 -583 3449 4313
692 4313 -2163 -5853 868 4991 224 -2825 -5007 -5151 2436 6881 -1938 -10073 -6813 1756 8140
707 8140 6492 -4272 -10681 -2921 7285 9039 4492 -4725 -8639 -961 6580 7147 4224 -2953 -8974
722 -8974 -3470 7502 9004 2122 -4535 -6557 -1943 5323 6961 1296 -4861 -5747 -273 4396 2086
737 2086 -149 547 -964 -1424 2392 3233 1797 3964 4028 -604 -2648 627 5022 7067 3393 -3898
753 -3898 -5620 -681 4946 9129 5535 -6892 -10667 313 9674 10194 3178 -8356 -11503 789
767 789 12494 9788 -1246 -9535 -8305 2887 11532 7361 -1688 -6795 -5778 2492 9461 6047 -1629
$$ packed form
661b433Q514K43m537p495l667Q848R736j882q861q562j84R857P483l123n783m286
677f132k062P078J0378j842j0279n787L107Q598L974o349o217J010L940M032Q64
692D313o476l690O721M123m767l049k182j44P587M445q819q135L260Q569O384
707H140j648j0764o409P760J0206J754m547r217l914P678P541N67k923p177o021
722h974N504J0972J502o882o657k022M614P266J638n665o157q86N474M669k310
737B086k235O96j511m60L816Q41j436K167O4m632k044L275M395K045l674p291
753c898j722M939N627M183l594j2427l775J0980R361N20p016j1534l147J2292
767G89J1705k706j1034q289J230J1192Q645m171r049n107J017Q270O969l414p676
$$ plain form
782 -1629 -4677 -3379 2265 7542 5916 -151 -3376 -1791 1392 4590 2806 -2080 -3139 -1541 -332
797 -332 184 -1254 -2334 1000 1320 -2468 -3616 -938 2471 4530 1726 -4161 -5391 1046 6340 5583
813 5583 811 -4886 -5510 1824 6623 4741 -1444 -7550 -7519 710 6087 2060 -4923 -7457 -4127 2239
829 2239 5388 1081 -4119 -4403 -1448 1943 2265 -2041 -4471 -1579 445 41 -276 -1640 -621 2247
845 2247 2971 -833 -3726 -2654 450 2725 821 -4341 -6433 -3250 1334 4202 2983 -4171 -7668
860 -7668 -2820 4254 6122 545 -7811 -10098 -3487 4475 5499 -1372 -8249 -7648 822 7260 5750
875 5750 184 -5498 -5299 1127 5185 2388 -3082 -5727 -4716 -475 2788 1228 -936 -1351 -1229 -1064
891 -1064 348 95 -1298 -1224 -2977 -5205 -4771 -1630 1277 1960 -134 -3890 -3618 2093 6599 4831 -860
$$ packed form
782a629l048J298N644N277j626o067l225J585L183L198j784m886j059J598J209
797c32N16j438j080L334L20l788j148K678L409K059k804n887j230O437N294p57
813E583m772n697o24P334M799j882o185o106L1Q229N377m027o983k534L330O366
829B239L149m307n200k84K955L391L22m306k430K892K024m04l17j364J019K868
845B247P24l804k893J072L104K275j904n162k092L183M584K868j219p154l497
860g668M848P074J868n577q356k287O611P962J024o871o877O01Q470O438j510
875E750n566n682J99O426M058k797n470k645J011M241L263j560k164m15J22J65
891a064J412k53j393P4j753k228M34L141K907O83k094l756K72N711M506j768n691
$$ plain form
908 -860 -6125 -6114 560 5594 3433 -4090 -8315 -5156 2760 8007 5510 -2289 -7563 -4121 3354 6568
924 6568 1840 -6297 -9408 -4782 2496 4979 926 -3686 -4579 -790 5128 5618 1233 -2870 -2627 17
940 17 1709 1207 -974 -2567 -153 1892 1032 342 1335 1683 2357 1604 -1230 -2804 -875 1021 1267 -955
958 -955 -3926 -4206 176 5532 5172 78 -2921 -1233 3315 5973 3936 -2055 -5314 -2011 2541 4161
974 4161 2787 -1802 -4121 314 5187 5424 2159 -1060 -1733 1252 4042 1888 -1510 -1319 1320 1799
990 1799 808 173 345 1871 3186 1785 -903 -1754 -411 2411 2727 860 -3148 -4075 1103 5945 5802
1007 5802 1808 -2591 -2168 3570 8055 5446 -860 -4455 -3110 1158 5983 4663 -2896 -6475 -3349
1022 -3349 2485 6282 3766 -3090 -6096 -1771 3334 4514 1584 -2022 -3539 -719 3591 3565 2218
$$ packed form
908h60n265J1O674N034k161p523m225L159P916N247k497p799n274L442P475L214
924F568m728q137l111M626P278K483m053m612q93L789N918M90m385m103K43K644
940A7J692n02k181j593K414K045q60o90R93L48O74p53k834j574J929J896K46k222
958i55k971k80M382N356l60n094k999J688M548K658k037n991l259L303M552J620
974D161j374m589k319M435M873K37l265l219o73K985K790k154l398J91K639M79
990A799r91o35J72J526J315j401k688q51J343K822L16j867m008r27N178M842j43
1007E802l994m399M23N738M485k609o306l595J345M268M825j320p559l579L126
1022c349N834L797k516o856l006M325N105J180k930l606j517K820M310k6j347
$$ plain form
1037 2218 442 -1647 -138 2182 2328 672 -769 -305 -60 -867 -1863 -158 1868 1583 -1528 -3719
1053 -3719 -2131 1715 3762 867 -3236 -4477 -2358 1939 4222 982 -3986 -4858 -2059 3067 5824
1068 5824 1789 -4890 -5331 -207 3991 4229 428 -4780 -4930 477 3265 2367 -345 -4493 -4881 277
1084 277 3355 799 -2762 -4093 -2414 983 1381 -1386 -2727 -1007 562 440 -522 -1826 -1044 932
1100 932 984 -169 -2033 -2384 -280 2004 1921 -485 -3620 -3016 819 4312 1340 -3435 -4088 -1829 1372
1117 1372 3351 341 -3741 -3625 -1101 821 2438 799 -3634 -3851 -244 1740 1946 384 -2474 -2567
1133 -2567 795 1970 488 312 -116 -543 670 713 -225 226 489 43 -192 -823 -2286 -890 1952 1920
1151 1920 -1408 -3600 -3099 1104 4293 1824 -2756 -4292 -2363 2859 5191 1384 -3117 -4105 -1188
$$ packed form
1037B218j776k089J509K320J46j656j441M64K45q07r96J705K026k85l111k191
1053c719J588L846K047k895m103j241K119M297K283l240m968q72K799N126K757
1068E824m035o679m41N124M198K38l801n208j50N407K788q98k712m148l88N158
1084B77L078k556l561j331J679L397L98k767j341J720J569j22r62j304P82J976
1100I32N2j153j864l51K104K284q3k406l135O04L835L493k972m775o53K259L201
1117A372J979l010m082J16K524J922J617j639m433k17L607J984K06j562k858r3
1133b567L362J175j482j76m28m27J213M3r38M51K63m46k35o31j463J396K842l2
1151A920l328k192N01M203L189k469m580j536J929N222K332l807m501r88K917
$$ plain form
1166 -1188 3249 5693 1704 -3972 -4331 -35 4026 4938 682 -4209 -3463 959 2913 2754 -319 -3600
1182 -3600 -3250 813 2046 1514 -61 -1875 -1948 562 1928 271 410 193 -566 352 577 -109 1166
1199 1166 1947 745 -729 -540 178 2208 2612 1033 -1718 -2092 -341 2499 3395 119 -3156 -2930 130
1216 130 3221 3544 -491 -3864 -2334 947 3507 3088 -722 -3821 -1657 2290 3174 2072 -426 -2313
1232 -2313 -583 3559 2946 1027 -381 -892 248 2234 1225 -745 -872 121 489 684 229 -1898 -391
1249 -391 1886 1343 -285 -1657 -1411 770 2905 1387 -945 -2247 -570 2407 3879 1520 -2086 -2265
1265 -2265 34 2751 3762 827 -2697 -2744 182 2707 2572 -299 -2898 -1782 587 1759 1556 -93
1281 -93 -2418 -1589 594 1396 262 -280 -1323 -828 709 373 -634 457 840 445 463 -885 -924 1468
$$ packed form
1166a188M437K444l989n676l59M296M061R12m256m891P46M422J954j59l073l281
1182c600L50M063J233n32j575j814p3K510J366j657J39k17p59R18K25o86J275
1199A166P81j202j474J89P18K030M04j579k751l74J751K840Q96l276l275K26L060
1216A30L091L23m035l373J530L281K560m19l810l099K164L947Q84j102k498j887
1232b313J730M142o13j919j408n11J140J986j009j970j27R93L68J95m55k127J507
1249c91K277n43j628j372K46K181K135j518k332j302J677K977J472k359l606j79
1265b265K299K717J011k935l524m7K926K525j35k871k599J116K369J172k03j649
1281i3k325Q29K183Q02j134n42j043M95J537l36j007J091L83l95J8j348l9K392
$$ plain form
1299 1468 2240 522 -1386 -1897 -650 1774 3196 93 -2962 -3051 -677 2301 3057 -680 -4370 -3768
1315 -3768 11 2747 2605 -1242 -3970 -2990 1306 3487 2363 -1161 -3634 -2216 1387 3158 1764
1330 1764 -1444 -3173 -1391 1637 1995 533 -1197 -1825 -696 828 571 -325 -633 -1121 -1206 -384 -443 -727
1348 -727 -150 -114 -330 -856 -957 -686 985 1476 -120 -1598 -1402 75 1999 2273 -177 -2466 -1319 1149
1366 1149 2299 1949 -585 -2839 -1662 1193 2657 1191 -2001 -3187 -1040 1674 1671 -101 -1631 -1958
1382 -1958 -254 1562 1427 -185 -1099 -842 507 1436 586 -593 30 760 1475 988 -661 -772 805
1399 805 1924 835 -667 -1527 -764 1638 1998 126 -1710 -1888 -243 2206 2359 -257 -2348 -1831 364
1416 364 2465 2547 -150 -2795 -1703 1413 3028 2473 -221 -2180 -766 1863 3065 1790 -397 -1468
$$ packed form
1299A468P72j718j908n11J247K424J422l103l055q9K374K978P56l737l690O02
1315c768L779K736j42l847k728R80M296K181j124l524k473J418L603J771j394
1330A764l208j729J782L028L58j462j730o28J129J524k57q96l08m88q5Q22n9k84
1348g27N77L6k16n26j01K71J671M91j596j478J96J477J924K74k450k289J147K468
1366A149J150l50k534k254J177K855J464j466l192j186K147K714lj772j530l27
1382a958J704J816j35j612r14K57J349R29q50j179O23P30P15m87j649j11J577
1399H05J119j089j502q60P63K402L60j872j836j78J645K449J53k616k091N17K195
1416C64K101Q2k697k645J092L116J615n55k694j959J414K629J202j275k187j071
$$ plain form
1432 -1468 -151 1660 1905 367 -576 -461 67 662 168 55 38 330 53 -445 -416 69 1075 1292 139
1451 139 -831 -986 441 2490 2232 352 -1699 -668 1241 3165 2540 -739 -2327 -828 1743 2968
1467 2968 1807 -1043 -2706 -958 2057 2776 1238 -1506 -2566 -517 1912 2318 261 -1535 -2015 -252
1483 -252 1824 1893 359 -717 -1044 530 1916 1367 192 -544 221 1287 521 56 65 88 691 333 -807
1502 -807 -1015 61 1071 958 -490 -1485 -1359 247 1623 1006 -906 -2097 -969 828 2368 1191
1518 1191 -1123 -1986 -370 1676 1903 479 -1302 -1824 -148 1700 1457 -199 -1399 -1463 -463 953
1534 953 629 -1065 -1495 -645 176 191 -776 -1092 -662 -10 -136 -1056 -1101 -378 256 673 187 -1153 -1262 83
1554 83 1347 1340 -160 -1844 -1751 629 2198 866 -1281 -2304 -1616 657 1871 480 -1974 -2629 -1339
$$ packed form
1432a468J317J811K45j538r43J15N28N95m94j13j7K92k77m98K9M85J006K17j153
1451A39r70j55J427K049k58j880k051J031J909J924o25l279j588J499K571J225
1467B968j161k850j663J748L015P19j538k744j060K049K429M06k057j796m80J763
1483b52K076O9j534j076l27J574J386n49j175p36P65J066p66m65RK3O03l58j140
1502h07k08J076J010j13j448r95J26J606J376o17j912j191J128J797J540j177
1518A191k314q63J616K046K27j424j781n22J676J848k43j656j200o4J000J416
1534I53l24j694m30Q50Q21J5r67l16M30O52j26r20m5P23O34M17m86j340j09J345
1554H3J264pj500j684R3K380J569j332k147j023O88K273J214j391k454o55J290
$$ plain form
1571 -1339 767 1662 218 -2075 -2743 -914 926 1357 -40 -1684 -1557 -74 1191 781 0 -961 -567
1588 -567 -116 430 647 -226 -201 -332 -477 -200 -400 -95 144 369 -555 -1389 -1271 330 938 307 -934 -1807
1608 -1807 -1107 1179 1563 334 -1155 -2087 -572 1923 2126 372 -1391 -1819 124 2293 2399 -70
1624 -70 -1947 -1474 557 1632 1355 -368 -1649 -1243 258 1301 758 -712 -1336 -699 719 859 187
1641 187 -533 -548 92 768 197 -157 55 404 755 457 -692 -187 804 1286 827 -45 -856 -499 1071 1538
1661 1538 693 -956 -1220 -581 1129 1646 -32 -1328 -1352 -38 1383 1733 -497 -1419 -957 341 1400
1678 1400 1195 -19 -1303 -470 717 1261 719 -280 -584 156 540 723 516 -151 235 241 42 -512 -319
1697 -319 20 536 591 -247 -1146 -1032 644 1112 643 -990 -1788 -883 1238 1414 569 -870 -1676 -230 1867
$$ packed form
1571a339K106Q95j444k293o68J829J840M31j397j644J27J483J265m10p81r61L94
1588e67M51N46K17q73K5j31j45K77k00L05K39K25r24q34J18J601O08o31j241q73
1608a807P00K286L84j229j489r32J515K495K03j754j763m28J943K169J06k469
1624g0j877M73K031J075k77j723j281M06J501J043n43j470o24O37J418J40o72
1641A87p20j5O40O76n71l54K12L49L51k98j149N05R91M82m59q72q11L57J570M67
1661A538q45j649k64O39J710N17j678j296k4J314J421L50k230r22M62J298J059
1678A400k05j214j284Q33J187N44n42r99l04P40L84J83k07o67L86Oj99n54J93
1697c19L39N16N5q38q99J14J676M68m69j633p98R05K121J76q45j439q06J446K097
$$ plain form
1716 1867 2047 770 -1053 -1209 142 1849 1882 -257 -1638 -1300 -81 1228 1202 -696 -1618 -943 -101
1733 -101 845 647 -524 -948 -446 249 624 190 -148 55 386 695 416 294 549 542 617 -264 -727 -191 547
1754 547 649 115 -665 -1153 -164 1356 1396 1 -1062 -1239 -202 1533 920 -459 -1372 -1314 160 1376
1772 1376 1394 -609 -1028 -688 790 1931 1239 -717 -1205 -236 603 907 273 -616 -847 -52 559 748 40
1791 40 -363 -336 -120 51 -390 -591 -206 -149 -26 -263 -1073 -199 522 877 444 -426 -934 -208 882 812 28
1812 28 -815 -1397 -257 1230 1087 -97 -1001 -873 290 1412 1125 -319 -1127 -877 108 1015 -136 -991
1830 -991 -1109 -957 141 464 379 -682 -762 65 304 310 75 -149 -355 285 155 -179 66 450 819 521 -12
1851 -12 -575 20 1134 1070 -60 -1167 -1083 -351 933 754 -383 -1217 -1351 147 1438 969 -190 -1213
$$ packed form
1716A867J80j277j823j56J351J707L3k139j381L38J219J309k6j898r22O75Q42
1733a01R46j98j171m24N02O95L75m34l38K03L31L09k79j22K55pP5q81m63N36P38
1754E47J02n34p80m88R89J520M0j395j063j77J037J735o13j379r13N8J474J216
1772A376J8k003m19L40J478J141o92j956m88R69Q39L04o34q89k31P95O11J89p08
1791D0m03K7K16J71m41k01L85N7J23k37q10Q74P21L55m33q70n08P26J090p0p84
1812B8q43n82J140J487j43j184r04J28J163J122k87j444q08K50R85R07j151q55
1830i91j18J52J098L23q5j061q0Q27K39Ok35k24k06O40j30l34K45L84L69k98n33
1851a2n63N95J114o4j130j107Q4P32J284j79j137q34j34J498J291m69j159j023
$$ plain form
1869 -1213 -924 738 1387 1073 -375 -1163 -582 902 1528 832 -343 -807 -76 784 1312 447 -528 -377
1887 -377 42 340 470 139 -72 -193 381 399 244 157 428 123 230 -30 -335 176 507 838 63 -299 -6
1908 -6 373 1426 1239 308 -379 -173 818 1423 1175 -111 -840 -596 732 1497 870 -383 -845 -223 939
1927 939 1127 90 -598 -939 100 1015 807 293 -586 -281 703 767 575 139 -109 159 528 474 81 32
1947 32 9 405 566 -250 -191 -156 383 548 12 -661 -974 -359 467 732 -171 -945 -791 313 1029 610 -200
1968 -200 -1123 -691 327 1028 573 -698 -667 -381 586 1149 235 -741 -759 -179 352 694 -219 -596 -713 -319
1988 -319 238 -325 -93 -731 9 -46 -396 -319 -100 -22 -190 111 -560 -499 -102 530 541 -97 -696 -655 290 830
2010 830 657 -425 -832 -669 284 1122 269 -622 -871 -357 407 791 209 -958 -1173 -250 511 629 -17
$$ packed form
1869a213K89J662O49l14j448p88N81J484O26o96j175m64P31Q60N28q65r75J51
1887c77M19K98J30l31k11j21N74J8j55q7K71l05J07k60l05N11L31L31p75l62K93
1908fL79J053j87r31o87K06R91O05k48j286p29K44J328P65o27j253m62O22J162
1927I39J88j037o88l41J039R15k08n14q79L05R84O4j92m36k48K68L69n4l93m9
1947C2k3L96J61q16N9L5N39J65n36o73l13O15Q26K65r03p74J54J104P16m19q10
1968b00r23M32J018P01m55j271L1K86R67N63r14r76j8N80N31L42r13l77j17L94
1988c19N57n63K32o38P40n5l50P7K19P8j68L01o71O1L97O32J1o38n99M1R45N40
2010H30j73j082m07J63R53Q38q53q91k49N14P64L84n82j167k15R23P61J18o46
$$ plain form
2029 -17 -441 -1000 -3 624 556 56 -406 -174 246 332 561 -32 -518 -106 249 414 72 -208 390 153 254
2050 254 -382 -520 0 63 302 -384 -700 -463 280 667 653 -270 -513 -280 489 959 291 -331 -759 -139 684
2071 684 987 150 -936 -793 312 1090 740 -18 -422 -759 119 498 205 -301 -440 -111 105 260 -112
2090 -112 -492 -52 88 446 -48 -205 -183 103 301 -197 -305 -348 246 419 730 83 -265 -323 471 681 345
2111 345 -244 -943 -179 314 715 213 -999 -808 -148 455 687 23 -730 -706 -165 411 410 -230 -712 -513 -78
2132 -78 572 385 -94 -186 -173 437 510 265 -198 190 -7 -12 -66 -203 -168 105 -42 -192 -595 -326 22 187 -20
2155 -20 -354 -803 -433 203 385 153 -388 -740 315 707 854 498 -173 -471 103 917 756 -21 -801 -807 89
2176 89 424 269 -27 -769 -444 183 635 194 -119 -349 -200 64 627 27 -99 -84 251 292 16 -13 -92 49
$$ packed form
2029a7m24n59R97O27o8n00m62K32M20Q6K29n93m86M12L55J65l42k80N98k37J01
2050B54o36j38N20O3K39o86l16K37P43L87j4r23k43K33P69M70o68o22m28O20Q23
2071F84L03q37j086J43J105P78l50p58m04l37Q78L79k93n06j39L29K16J55l72
2090a12l80M40J40L58m94j57K2K86J98m98j08m3N94J73L11o47l48n8P94K10l36
2111C45n89o99P64M93M01n02j212J91O60O03K32o64p53K4N41N76jo40m82J99M35
2132g8O50j87m79r2J3O10P3k45m63L88j97nn4j37L5K73j47j50m03K69L48J65k07
2155b0l34m49L70O36J82k32n41l52J055L92J47l56o71k98N74Q14j61p77p80oQ96
2176H9L35j55k96p42L25O27M52m41l13k30J49K64N63o00j26J5L35M1k76k9p9J41
$$ plain form
2198 49 345 -192 -186 -80 104 366 -57 -301 -424 -120 655 796 143 -203 -375 -206 772 544 39 -669 -425
2219 -425 46 503 283 -357 -613 -397 61 497 7 -335 -538 -280 223 443 241 -367 -362 203 327 301 253
2240 253 -126 74 125 -4 28 -157 -121 123 12 -246 -295 -355 -14 503 -157 -503 -575 -303 319 507 68 -453
2262 -453 -596 58 360 519 134 -515 -557 135 797 439 -180 -683 -493 7 491 86 -162 -563 -387 14
2282 14 212 53 -469 -624 -383 221 -79 -102 -194 -177 -50 106 352 171 235 175 128 -125 211 5 34 293 88
2305 88 -671 -495 -22 495 240 -264 -668 -536 258 558 394 211 -661 -453 388 605 495 -157 -631 1
2325 1 584 638 85 -69 -233 29 307 559 114 -270 74 29 336 260 144 -218 279 230 340 389 124 58 163
2348 163 194 -146 -190 -135 34 334 19 -169 -207 390 218 332 332 -523 -155 142 545 518 -226 -355 -145 340
$$ packed form
2198D9K96n37OJ06J84K62m23k44j23L04P75J41o53l46j72J69R78k28n05p08K44
2219d25M71M57k20o40k56K16M58M36m90l42k03K58N03K20k02o08NN65J24k6m8
2240B53l79K00N1j29L2j85L6K44j11k58m9o0L41N17o60l46p2K72O22J88m39n21
2262d53j43O54L02J59l85o49m2O92O62l58o19n03J90N00M84m05k48m01J76M01
2282A4J98j59n22j55K41O04l00k3r2J7J27J56K46j81O4o0m7k53L36k06K9K59k05
2305H8p59J76M73N17k55n04m04J32P94L00j64j83q72K08Q41K17j10o52m74O32
2325AN83N4n53j54j64K62K78K52m45l84L44m5L07p6j16l62M97m9J10M9k65o6J05
2348A63L1l40m4N5J69L00l15j88l8N97j72J14%q55L68K97M03k7p44j29K10M85
$$ plain form
2370 340 858 437 129 -310 -130 361 545 73 -491 -458 -217 217 136 22 -231 -341 50 323 315 32 24 -3
2392 -3 177 268 56 67 29 224 315 -184 49 -164 246 260 229 -434 -287 -65 465 241 -155 -606 -217 215 567
2415 567 551 -35 -535 -333 256 423 82 -206 -448 -149 499 525 138 -343 -54 -200 463 527 189 -36 -294
2436 -294 28 392 50 -83 -69 -262 258 44 -28 -150 -105 75 -7 19 -307 -293 344 375 -237 -345 -502 189
2458 189 209 214 96 -561 -219 223 374 129 -137 -341 -321 354 293 -48 -384 -528 -278 371 310 -114 -427 -307
2480 -307 -168 275 131 -198 -243 -127 -83 229 56 15 -49 -61 275 97 -40 -10 50 95 -82 -170 -148 -127 53 62
2504 62 -65 -412 -187 82 173 341 -223 -423 -88 49 329 194 -242 -335 94 361 248 4 -171 -304 244
2525 244 224 349 89 -493 -476 203 617 301 -59 -406 -85 73 60 41 -281 -99 -60 -44 -240 -73 -45 -81 -91
$$ packed form
2370C40N18m21l08m39J80M91J84m72n64L3K41M34q1j14k53j10L91K73qk83qk7
2392cJ80R1k12J1l8J95R1m99K33k13M10J4l1o63J47K22N30k24l96m51L89M32L52
2415E67j6n86n00K02N89J67l41k88k42K99O48K6l87m81K89j46O63O4l38k25k58
2436b94L22L64l42j33J4j93N20k14p2j22M5J80q2K6l26J4O37L1o12j08j57O91
2458A89K0Nj18o57L42M42J51k45k66k04K0O75o1l41l36j44K50O49o1m24l13J20
2480c07J39M43j44l29m5J16M4L12j73m1o4j2L36j78j37L0O0M5j77q8K2K1J80R
2504F2j27l47K25K69R1J68n64k00L35J37K80j35m36r3M29K67j13k44j75j33N48
2525B44k0J25k60n82J7O79M14l16l60l47L21J58j3j9l22J82L9J6j96J67K8l6j0
$$ plain form
2548 -91 87 -106 -71 -263 156 128 -190 -191 -135 197 354 292 -198 -184 -168 72 428 259 -384 -394 -152 327 72
2571 72 298 -440 -412 113 190 177 -158 -436 -117 -12 342 366 -85 -263 -307 58 330 74 -115 -113 11 93 195
2594 195 33 12 45 100 178 5 -113 133 127 -208 -138 -559 -127 157 107 -75 -100 -202 169 166 294 292 -65 -370
2618 -370 -213 393 -8 -54 -132 -305 77 305 -22 -111 -220 -117 -34 119 145 -392 -270 -231 197 96 -17 218
2640 218 -193 -123 32 -140 -156 -272 -64 145 -23 -143 -177 37 219 113 -161 24 263 300 419 156 68 -38
2662 -38 -436 399 170 -86 -329 -171 -115 172 81 -387 -651 -416 108 34 81 -325 -350 -137 151 439 271 88
2684 88 -110 -120 401 273 -18 1 -104 -94 -111 86 -86 75 -92 89 -67 -200 -153 87 122 -53 2 -341 -5
2707 -5 218 318 -50 -193 -275 -147 237 149 -57 -84 -189 133 326 204 -186 -622 -271 9 64 123 -52 -513
$$ packed form
2548i1J78j93L5j92M19k8l18jN6L32J57o2m90J4J6K40L56j69o43j0K42M79k55
2571G2K26p38K8N25P7j3l35k78L19J05L54K4m51j78m4L65K72k56j89KJ24Q2J02
2594A95j62k1L3N5P8j73j18K46ol35P0m21M32K84n0j82k5j02L71lJ28kl57l05
2618c70J57O06m01m6p8j73L82K28l27q9j09J03Q3J53K6n37J22L9M28j01j13K35
2640B18m11P0J55j72j6j16K08K09j68j20l4K14J82j06k74J85K39L7J19k63q8j06
2662c8l98Q35k29k56k43J58N6K87r1m68k64K35N24p4M7m06k5K13K88K88j68j83
2684H8j98j0N21j28k91J9j05J0j7J97j72J61j67J81j56j33M7K40L5j75N5l43L36
2707eK23J00l68j43q2J28L84q8k06k7j05L22J93j22l90m36L51K80N5N9j75m61
$$ plain form
2729 -513 -245 19 234 -28 -145 -133 -79 -16 90 -80 -117 -37 -115 173 372 12 31 57 290 164 56 -214 142
2752 142 154 156 -239 -210 9 276 219 -156 -116 -141 52 313 218 51 -292 -255 157 5 -60 -288 -235 -204 149 206
2776 206 212 -83 -234 -219 267 275 178 -260 24 -29 70 212 168 87 41 -14 13 -49 -41 -116 -342 -116 -99 -106 81 -18 360
2803 360 -120 -75 112 53 239 370 28 -89 -127 106 220 223 2 -7 146 192 359 175 146 -455 -152 251 43
2826 43 347 68 -77 41 191 205 248 -209 -60 -46 -54 -65 46 52 32 7 7 -89 90 7 199 5 12 218 -10 200
2852 200 113 -43 -131 -223 -102 354 -13 -204 -272 -207 124 119 328 53 -172 110 -205 105 252 45 -174 -246 193
2875 193 570 147 19 -114 30 -146 55 122 -227 -188 289 214 301 -85 25 -30 -261 -112 30 -25 66 -82
2897 -82 -107 167 8 -81 134 134 -160 -216 -186 -183 125 168 -95 -39 -445 76 121 216 -168 -311 53 227 193 -52 -119
$$ packed form
2729e13K68K64K15k62j17J2N4O3J06j70l7Q0p8K88J99l60J9K6K33j26j08k70L56
2752A42J2Kl95K9K19K67n7l75M0k5J93K61r5j67l43L7M12j52o5k28N3L1L53N7
2776B06Ok95j51J5M86Qr7m38K84n3R9J42m4q1m6n5K7o2Qp5k26K26J7pJ87r9L78
2803C60m80M5J87n9J86J31l42j17l8K33J14Lk21rJ53M6J67j84k9o01L03M03k08
2826D3L04k79j45J18J50J4M3m57J49J4qj1J11Ok0k5%r6J79q3J92j94PK06k28K10
2852B00q7j56q8r2J21M56l67j91o8O5L31nK09k75k25K82l15L10J47k07k19p2M39
2875A93L77m23j28j33J44j76K01O7l49L9M77p5Q7l86J10n5k31J49J42n5R1j48
2897h2k5K74j59q9K15%k94n6L0LL08M3k63N6m06N21M5R5l84j43L64J74l4k45o7
$$ plain form
2922 -119 -382 -266 33 106 36 -354 -277 147 214 85 -87 138 -4 -26 213 -61 -54 -63 93 21 157 52 -187
2945 -187 216 34 14 79 -195 -20 29 -27 -219 -147 -1 70 233 184 -10 -369 -32 56 154 62 100 -259 -45 29
2969 29 173 29 2 -186 -125 168 296 343 -230 -29 -62 129 -215 100 -42 -359 -18 23 3 99 -130 -451 -5
2992 -5 -103 12 -131 68 -11 -12 59 2 -187 330 171 -86 124 -74 117 306 153 -192 -155 74 184 340 102
3015 102 -264 -139 -67 247 227 208 -276 -324 -11 264 283 155 -204 -152 -5 27 230 -15 -406 -92 31 287
3037 287 -43 258 56 24 52 373 74 -111 129 -38 401 13 169 -148 183 -57 22 -71 -166 -24 219 -94
3059 -94 -49 -196 -194 115 129 -21 -119 32 86 227 286 68 -201 -37 123 219 -64 -396 -115 -211 44 205 486
3082 486 -10 -219 -19 -62 197 -38 91 -181 -43 -63 -169 -234 -174 23 -128 36 -99 126 280 146 21
$$ packed form
2922a19k63J16K99P3p0l90P7M24O7j29j72K25j42k2K39k74PrJ56p2J36j05k39
2945a87M03j82k0O5k74J75M9n6j92P2J46P1J63m9j94l59L37Q8R8r2L8l59K14P4
2969B9J44j44k7j88O1K93J28M7n73K01l3J91l44L15j42l17L41M1k0R6k29l21M46
2992er8J15j43J99p9jP1n7j89N17j59k57K10j98J91J89j53l45L7K29J10J56k38
3015A02l66J25P2L14k0j9m84m8L13K75J9j28l59N2J47L2K03k45l91L14J23K56
3037B87l30L01k02l2K8L21k99j85K40j67M39l88J56l17L31k40P9r3r5J42K43l13
3059i4M5j47KL09J4j50r8J51N4J41N9k18k69J64J60R6k83l32K81r6K55J61K81
3082D86m96k09K00m3K59k35J29k72J38k0j06o5O0J97j51J64j35K25J54j34j25
$$ plain form
3103 21 -226 67 243 130 247 78 -13 -256 124 111 182 163 -309 -159 -94 98 217 -193 -279 -451 -299 343
3125 343 -40 -56 -369 28 185 274 229 198 -196 -201 148 149 -14 -42 104 -56 -264 -34 -225 -86 -40 54 181 -63
3149 -63 -199 -90 232 50 -195 -108 137 -63 156 -7 -296 -203 -106 282 150 113 -168 -202 -327 252 192 -187
3171 -187 -54 31 -17 95 225 86 -115 -177 -29 119 -57 -6 -343 -111 85 100 -71 103 53 -225 44 -10
3193 -10 26 135 -39 -12 233 -133 275 77 249 181 -31 36 -93 54 273 272 22 -340 -108 92 302 -96
3215 -96 -137 -224 -170 81 -16 26 -373 -258 -97 112 -92 146 -70 -99 227 206 51 17 -201 171 114 -17 -42 -7
3239 -7 8 -219 -131 12 121 188 -241 151 -124 -14 -385 -209 83 -163 -106 -101 59 -24 128 -18 -42 -263 98
3262 98 112 118 348 -67 -56 -33 389 289 216 -354 -191 16 132 36 69 -417 -155 -16 -110 146 -32 6 -129 149
$$ packed form
3103B1k47K93J76j13J17j69r1k43L80j3P1j9m72J50O5J92J19m10q6j72J52O42
3125C43l83j6l13L97J57Q9m5l1l94nL49Jj63k8J46j60k08K30j91J39M6R4J27k44
3149f3j36J09L22j82k45Q7K45k00K19j63k89R3R7L88j32l7k81l4j25N79o0l79
3171a87J33Q5m8J12J30j39k01o2J48J48j76N1l37K32J96J5j71J74n0k78K69n4
3193a0L6J09j74K7K45l66M08j98J72o8k12O7j29J47K19jk50l62K32K00K10l98
3215i6m1q7N4K51r7M2l99J15J61K09k04K38k16k9L26k1j55l4k18L72n7j31k5L5
3239gJ5k27Q8J43J09O7m29L92k75J10l71J76K92k46N7NJ60q3J52j46k4k21L61
3262I8J4OK30m15J1K3M22j00p3n70J63K07J16r6L3m86K62J39r4K56j78L8j35K78
$$ plain form
3286 149 157 191 7 -190 -153 -4 66 -21 187 133 53 -54 -103 -73 203 -92 344 47 -138 166 -161 67 160 -170
3310 -170 -352 120 42 68 -289 -124 -318 -7 358 113 -231 -275 -162 -3 133 136 -70 -36 65 181 152 161 -13
3333 -13 -134 -188 69 223 202 -183 -26 -207 203 -24 95 -31 -151 -280 -127 -102 -281 -47 -61 207 -194 -249
3355 -249 -53 -81 138 48 -57 -132 51 -37 158 -116 -311 49 -132 86 5 -75 -215 -271 18 114 216 -17 -373
3378 -373 -33 3 80 -47 -233 -154 -244 35 -294 108 -165 -133 -107 131 152 -265 -67 402 308 146 -246 63 177
3401 177 224 105 -59 -154 -173 213 153 -61 -86 0 143 181 104 -208 84 -89 -1 293 -94 40 -121 -280 152
3424 152 172 152 123 -234 32 10 268 74 -92 -270 70 201 -18 146 -156 135 66 -114 -161 -31 -93 -151 -98
3447 -98 -143 44 -142 -11 0 161 -197 -209 113 79 195 -24 19 -67 265 270 210 -143 -117 -164 170 115 116 -112 -131
$$ packed form
3286A49QL4j84j97L7J49P0q7K08n4q0j07m9L0K76k95M36k97j85L04l27K28R3l30
3310a70j82M72p8K6l57J65j94L11L65k45l44m4J13J59J36Lk06L4J01J16k9Rj74
3333a3j21n4K57J54k1l85J57j81M10k27J19j26j20j29J53K5j79K34j4K68m01n5
3355b49J96k8K19r0j05p5J83q8J95k74j95L60j81K18q1q0j40n6K89R6J02k33l56
3378c73L40L6P7j27j86P9r0K79l29M02k73L2K6K38K1m17J98M69r4j62l92L09J14
3401A77M7j19j64r5j9L86o0k14k5Q6J43L8p7l12K92j73Q8K94l87J34j61j59M32
3424A52K0k0k9l57K66k2K58j94j66j78L40J31k19J64l02K91o9j80m7J30o2n8N3
3447i8m5J87j86J31J1J61l58j2L22l4J16k19M3q6L32No0l53K6m7L34n5Jk28j9
$$ plain form
3472 -131 -78 -72 47 -4 -45 -70 -80 80 79 -11 -18 -207 -8 -20 -99 25 -277 51 -241 -134 147 -140 -33 284 226
3497 226 33 -68 -74 3 139 -76 -183 55 62 -124 -42 -115 -48 -269 28 93 -65 -10 -184 107 -136 374 24
3520 24 20 -119 -76 -33 405 263 -185 -96 27 398 197 157 -83 -79 123 -125 326 1 -33 112 -280 -110 39
3543 39 147 -8 151 -141 -8 -250 -46 251 309 201 110 17 -201 245 51 -28 46 -102 9 337 203 50
3565 50 -281 87 -110 171 111 -137 -37 -58 66 30 182 13 -339 -18 413 234 -50 -264 -14 -208 188
3586 188 -69 62 -219 93 140 -17 -125 11 -13 35 141 39 66 112 241 153 -30 -262 19 -28 94 59 -148
3609 -148 -40 -162 -62 48 289 -172 121 -34 38 228 -37 -147 -497 -88 331 206 -98 -240 -176 -30 -22
3630 -22 434 -179 -33 162 -155 89 350 249 -30 -159 -187 144 335 112 70 -9 -28 -265 66 -296 -52 96
$$ packed form
3472a31N3OJ19n1m1k5j0J60jr0pj89J99j2p9J24l02L28k92J07K81k87J07L17n8
3497B26j93j01oP7J36k15j07K38Pj86Q2p3O7k21K97O5j58N5j74K91k43N10l50
3520B4mj39M3M3M38j42m48Q9J23L71k01m0k40MK02k48M51l25l4J45l92J70J49
3543C9J08j55J59k92J33k42K04K97N8j08r1r3k18M46j94p9P4j48J11L28j34j53
3565E0l31L68j97K81o0k48J00k1J24l6J52j69l52L21M31j79k84k14K50j94L96
3586A88k57J31k81L12M7j57j08J36k4M8J06j02K7M6J29q8j83k32K81m7J22l5k07
3609a48J08j22J00J10K41m61K93j55P2J90k65j10l50M09M19j25l04j42O4J46Q
3630b2M56o13J46J95l17K44K61j01k79j29k8L31J91k23m2p9j9k37L31l62K44J48
$$ plain form
3652 96 106 28 -66 -76 -20 -117 -265 -42 -156 -84 47 190 -54 -195 -197 -64 147 -149 -258 -178 -99 165 -79 99
3676 99 87 86 -67 170 -27 -105 88 -306 87 -28 332 -88 22 -99 364 -68 28 61 -30 -112 -74 -21 -38 -51
3700 -51 -124 -85 45 -288 -55 -37 79 44 221 -75 -62 82 93 219 -125 68 69 103 145 47 -105 -95 -61 178 -202
3725 -202 160 -174 -428 -5 132 226 -92 16 -232 -83 -41 -32 88 -70 25 104 -52 147 10 77 211 -98
3747 -98 -41 48 101 -136 286 223 -291 138 148 -78 176 181 -146 -170 132 -2 166 -22 -143 -208 307 142 -174
3770 -174 -332 117 -163 256 315 -57 -68 -165 -100 245 127 134 50 -134 141 129 26 -51 -134 -89 187 123 -7 -81
3794 -81 -60 5 47 -241 -132 -206 -482 95 166 145 -64 128 -83 -131 -31 -79 -105 120 182 -83 79 -97 41 3
3818 3 208 -107 -230 -275 -189 67 161 -6 -155 -37 -54 338 88 175 -12 0 -214 -58 128 12 -114 86 -31
$$ packed form
3652I6J0p8r4j0N6r7j48K23j14P2J31J43k44j41kJ33K11k96j09Q0P9K64k44J78
3676I9j2jj53K37j97p8J93l94L93j15L60m20J10j21M63m32R6L3r1q2L8N3j7j3
3700e1p3L9J30l33K33J8J16l5J77k96J3J44J1J26l44J93JL4M2r8j52J0L4K39l80
3725b02L62l34k54M23J37R4l18J08k48J49M2RJ20j58R5P9j56J99j37O7J34l09
3747i8N7Q9N3k37M22o3n14M29J0k26K54Nl27k4L02j34J68j88j21o5N15j65l16
3770a74j58M49k80M19N9l72j1r7O5L45j18Pq4j84K75j2j03p7q3M5K76o4j30p4
3794h1K1O5M2k88J09p4k76N77P1k1k09J92k11m8J00m8k6K25O2k65J62j76J38l8
3818CK05l15j23m5Q6K56R4j67j49J18j7L92k50Q7j87J2k14J56J86j16j26K00j17
$$ plain form
3841 -31 82 79 -224 -145 -245 166 -335 -114 308 -151 45 -280 -48 -83 64 171 106 -64 2 -184 118 85 -78
3864 -78 -51 -96 -85 164 39 -13 -35 -19 -116 64 112 -99 23 -21 -70 309 18 -165 -19 -225 -164 120 127 -184 -470
3889 -470 -233 -62 -67 39 -164 -59 -46 -199 305 -16 34 141 -17 -134 -119 9 10 214 -23 -57 -6 96 125
3912 125 414 31 -175 18 -48 -176 32 -179 -183 -378 -24 247 209 42 146 -124 188 317 -53 -127 -41 156
3934 156 24 117 -9 -134 -96 90 -104 216 -70 47 -185 134 -19 131 107 -30 106 -27 133 102 -46
3955 -46 178 -2 346 -163 -76 -7 12 206 53 -77 -170 -138 64 272 -2 120 139 -68 226 31 125 -158 -97
3978 -97 28 16 268 102 134 79 16 50 98 -229 35 -5 112 -233 -289 -205 10 55 -162 25 -91 209 23 171
4002 171 12 216 -147 202 -118 -54 -204 -41 -77 -20 90 60 93 -76 -67 171 106 -100 -299 -313 -108 85 -110
$$ packed form
3841c1J13ll03P9j00M11n01K21M22m59J96l25K32l5J47J07o5j70O6j86L02l3j63
3864g8K7m5J1K49j25n2k2J6r7J80M8k11J22m4m9L79k91j83J46k06O1K84Pl11k86
3889d70K37J71nJ06k03J05J3j53N04l21N0J07j58j17J5J28JK04k37l4N1J02K9
3912A25K89l83k06J93o6j28K08k11mj95L54K71l8j67J04k70L12J29l70p4Q6J97
3934A56j32R3j26j25L8J86j94L20k86J17k32L19j53J50k4j37J36j33J60l1j48
3955d6K24j80L48n09Q7O9J9J94j53j30r3L2K02K08k74J22J9k07K94j95R4k83O1
3978i7J25j2K52j66L2n5o3L4M8l27K64m0J17l45n6Q4K15M5k17J87j16L00j86J48
4002A71j59K04l63L49l20O4j50J63l6N7J10l0L3j69RK38o5k06j99j4K05J93j95
$$ plain form
4025 -110 8 -217 -132 178 106 40 -19 -59 -129 80 -18 20 -104 -24 86 -196 3 113 51 132 -5 -67 -245 -8
4049 -8 33 79 -61 -214 -109 -185 2 197 -62 -24 -302 -116 -8 -135 -200 37 97 204 -70 14 -44 -49 -115 -143 91
4074 91 69 101 -88 -265 112 -52 99 29 -341 -108 -65 200 146 -213 -115 -42 -52 -43 -235 52 -101 -202 85 19
4098 19 -237 -6 -17 403 -170 3 -58 -45 219 90 -55 42 -219 -110 -71 -237 -280 -236 5 159 231 72 -68
4121 -68 -114 -248 91 163 -136 -203 31 -67 66 31 -25 10 -186 197 131 15 -82 201 -172 -83 141 75 19 -124
4145 -124 69 -58 -82 -255 84 136 -288 -42 -21 -3 -12 -262 65 -195 -69 116 46 125 -27 -228 -212 -124 303
4168 303 45 -273 -209 -44 42 -4 153 110 -68 169 -1 156 181 -131 -207 -75 70 25 -152 -299 -168 258
4190 258 203 257 -227 -78 187 361 51 170 8 99 -132 35 -39 -196 -93 73 27 -150 -53 -111 -36 -14 24
$$ packed form
4025a10J18k25Q5L10p2o6n9m0p0K09r8L8j24Q0J10k82J99J10o2Q1j37o2j78K37
4049hM1M6j40j53J05p6J87J95k59L8k78J86J08j27o5K37O0J07k74Q4n8no6k8K34
4074I1k2L2j89j77L77j64J51p0l70K33M3K65n4l59R8P3j0Rj92K87j53j01K87o6
4098A9k56K31j1M20n73J73o1J3K64j29j45R7k61J09L9j66m3M4K41J54P2j59j40
4121f8m6j34L39P2k99o7K34r8J33l5n6L5j96L83o6j16r7K83l73Q9K24o6n6j43
4145a24J93j27k4j73L39N2m24K46K1J8rk50L27k60J26J85p0P9j52k01J6Q8M27
4168C03k58l18O4J65Q6m6J57m3j78K37j70J57K5l12p6J32J45m5j77j47J31M26
4190B58n5N4m84J49K65J74l10J19j62R1k31J67p4j57J03J66m6j77R7n8P5K2L8
$$ plain form
4213 24 -259 -119 -218 150 117 -2 -223 -158 112 47 174 -24 -115 -178 -15 -64 -6 16 -85 4 -84 25 46 2 7
4238 7 -121 120 -216 -176 42 8 -54 -320 -75 -245 70 -216 145 -94 196 -142 98 42 149 -33 40 -284
4260 -284 -137 153 37 -166 100 208 -185 38 -171 12 -279 74 67 193 118 81 66 -25 150 109 -145 -43
4282 -43 -191 10 -35 -14 2 -95 74 -22 10 -119 71 60 162 111 -14 -164 317 35 -130 -95 190 -135 -359
4305 -359 134 108 -25 -188 -63 137 25 -89 -290 -151 -32 11 162 163 -49 3 104 169 233 -59 -448 -83
4327 -83 133 303 -43 -273 -17 11 -119 29 -30 -28 34 84 242 83 23 -151 -52 -54 101 -89 -173 60 76 -53
4351 -53 -433 13 -202 -300 150 54 16 92 99 95 151 -40 9 -63 88 311 301 264 188 -145 93 32 164 -27 0 -220
4377 -220 -241 74 -146 -186 -2 147 106 -102 -2 -43 -37 314 -16 141 130 -107 134 -64 -58 1 90 137 -111 -156
$$ packed form
4213B4k83J40r9L68l3j19k21O5K70o5J27j98r1o3J63m9N8K2j01Q9q8J09K1m4N
4238Gj28K41l36M0K18l4o2k66K45j70L15k86L61k39K90l38K40n6J07j82P3l24
4260b84J47K90j16k03K66J08l93K23k09J83k91L53pJ26p5l7j5r1J75m1k54J02
4282d3j48K01m5K1J6r7J69r6L2j29J90j1J02n1j25j50M81k82j65L5K85l25k24
4305c59M93k6j33j63J25K00j12j14k01J39J19M3J51Jk12N2J01O5O4k92l89L65
4327h3K16J70l46k30K56K8j30J48n9KO2N0J58j59o0j74R9kJ55j90q4K33J6j29
4351e3l80M46k15r8M50r6l8P6PmN6j91M9p2J51K23j0l7p6l33K38o1J32j91K7k20
4377b20k1L15k20m0J84J49m1k08J00m1OL51l30J57j1k37K41j98ON9Q9M7k48m5
$$ plain form
4401 -156 -72 40 10 -159 149 -75 -159 -180 97 276 101 -31 224 -392 -188 278 167 56 -56 -264 -262 -17
4423 -17 -35 -58 90 27 -4 -14 155 -133 21 89 58 -224 87 -11 0 -18 -98 -213 -223 30 -280 46 359 134
4447 134 -79 92 108 156 78 88 -190 49 -132 -140 -103 -294 -359 -20 343 100 -269 -117 232 171 141 155 -140 -228
4471 -228 218 361 102 -90 -88 -80 -89 134 253 -38 -36 189 -63 213 205 64 -51 192 51 25 -108 -125 58 143
4495 143 39 143 -134 -65 92 -34 -191 -196 -173 195 104 118 78 -174 186 0 -99 -20 -61 -131 -147 -126 1 -97 83
4520 83 20 -39 71 261 -60 -19 4 -205 172 180 -90 -114 220 -19 -2 7 21 135 47 79 -72 -170 -183 145 33
4545 33 235 -20 166 -196 -172 206 54 -70 9 65 54 179 -95 -235 67 -77 169 -147 76 -19 112 -90
4567 -90 -22 198 -94 -12 -112 143 -56 -105 -43 -78 177 331 44 2 -21 67 -112 -144 96 50 50 127 287 59 1
$$ packed form
4401a56Q4J12l0j69L08k24q4k1K77J79j75j32K55o16K04M66j11j11j12k08KK45
4423a7j8k3J48o3l1j0J69k88J54O8l1k82L11r8J1j8q0j15j0K53l10L26L13k25
4447A34k13J71J6M8p8J0k78K39j81qL7j91o5L39L63k43l69J52L49o1l0J4k95q8
4471b28M46J43k59j92KQrK23J19k91KK25k52K76qj41j15K43j41k6j33j7J83Q5
4495A43j04J04k77O9J57j26j57nK3L68r1J4m0k52L60j86r9P9m1p0j6K1J27r8J80
4520H3o3n9J10J90l21M1K3k09L77Qk70k4L34k39J7RJ4J14q8L2j51r8j3L28j12
4545C3K02k55J86l62K4L78j52j24P9N6j1J25k74j40L02j44K46l16K23r5J31k02
4567i0O8K20k92Q2j00K55j99m9O2l5K55J54k87m2k3Q8j79l2K40m6%P7J60k28n8
$$ plain form
4592 1 -9 -25 -93 -42 -43 72 -120 13 -97 42 -68 -88 315 194 50 -244 14 40 116 57 51 207 96 164 308
4617 308 -40 121 -184 -254 -125 23 325 -169 -41 34 190 46 -71 99 -129 -175 311 153 -5 -15 -70 244
4639 244 2 72 76 -97 -40 299 -61 -42 269 37 -38 103 -14 -293 -106 134 134 69 -141 -187 251 -171 331
4662 331 82 44 -204 -164 -49 123 311 -312 53 -73 184 -36 141 84 -149 112 -99 65 -171 -133 8
4683 8 123 1 208 -168 -80 -38 126 87 -278 217 -108 -122 55 -16 -91 -71 -166 22 -108 22 -36 -59 -69 -55 88
4708 88 -3 107 -256 -100 47 -206 126 67 -25 166 124 -192 -276 221 258 78 43 -72 21 -236 -113 -129 110
4731 110 -140 11 41 58 -218 -91 -166 17 -87 219 120 41 106 94 -160 -23 227 -134 107 145 -216 50 -173
4754 -173 -133 63 -354 260 -172 -137 60 5 188 53 -229 91 85 34 -185 123 15 -94 114 95 -199 -48
$$ packed form
4592Aj0j6o8N1jJ15j92J33j10J39j10k0M03j21j44k94K58K6P6n9oJ56j11O8J44
4617C08l48J61l05p0J29J48L02m94J28P5J56j44j17J70k28m6M86j58j58j0n5L14
4639B44k42P0Mj73N7L39l60J9L11k32p5J41j17k79J87K40%o5k10m6M38m22N02
4662C31k49l8k48M0J15J72J88o23L65j26K57k20J77n7k33K61k11J64k36L8J41
4683HJ15j22K07l76Q8M2J64l9l65M95l25j4J77p1p5K0r5J88j30J30n8k3j0J4J43
4708H8r1J10l63J56J47k53L32n9r2J91m2l16q4M97L7j80l5j15R3k57J23j6K39
4731A10k50J51L0J7k76J27p5J83j04L06r9p9O5j2k54J37K50l61K41L8l61K66k23
4754a73M0J96m17O14m32L5J97n5J83j35k82L20on1k19L08j08j09K08j9k94J51
$$ plain form
4776 -48 281 153 25 24 -41 -121 71 140 114 -87 -146 104 -118 77 144 -68 216 -62 15 7 67 -40 -69 5 31
4801 31 108 -59 79 -107 102 98 116 78 -207 -36 -85 -136 -124 2 -138 -54 -17 -99 -10 -20 218 -124 -131 -37 -66 -198
4827 -198 19 -75 -52 -31 -104 61 -55 -141 -193 87 83 64 -44 -53 13 -54 -17 193 29 -23 94 -78 38 125 -57
4852 -57 119 -124 -38 10 -9 122 -63 140 2 -49 -139 8 -61 172 34 -2 -63 2 -107 56 29 195 21 125
4876 125 107 138 94 42 9 29 172 38 -228 -51 133 -230 -30 -55 116 -123 -164 -130 -97 -53 39 52 -155 -115 165
4901 165 -163 -214 -77 189 1 -19 185 170 146 -302 128 -4 12 61 98 65 107 63 -89 -296 13 150 108 -108
4925 -108 -93 196 -20 24 -98 35 -52 83 109 55 -142 75 10 35 97 4 -169 109 -95 -119 155 -123 1
4948 1 -236 96 -24 37 15 -80 212 134 23 -44 -66 -210 162 -39 -252 -132 75 65 71 -69 -139 110 -80 180
$$ packed form
4776d8L29j28j28jo5q0J92O9k6k01n9K50k22J95O7k12K84k78P7qO0j07k9P4K6
4801C1P7j67J38j86K09mJ8l8k85J71m9n1J2J26j40Q4L7q2Q9j0K38l42pR4k9j32
4827a98K17r4K3K1p3J65j16q6n2K80mj9j08rO6o7L7K10j64n2J17j72J16Q7j82
4852e7J76k43Q6M8j9J31j85K03j38n1r0J47o9K33j38l6o1O5j09J63k7J66j74J04
4876A25j8L1m4n2l3K0J43j34k66J77J84l63K00k5J71k39m1L4L3M4R2J3k07M0K80
4901A65l28n1J37K66j88k0K04j5k4m48M30j32J6M9L7l3M2m4j52k07L09J37m2k16
4925a08J5K89k16M4j22J33q7J35K6n4j97K17o5K5O2r3j73K78k04k4K74k78J24
4948Ak37L32j20O1k2r5K92p8j11o7k2j44L72k01k13J20K07j0Oj40p0K49j90K60
$$ plain form
4972 180 120 62 -54 55 -197 -119 238 -270 -117 -15 13 11 2 -61 -70 -110 55 -114 -104 -173 90 -96 21 114 340
4997 340 29 -92 16 6 -60 -11 -25 89 14 -32 -91 -40 -43 -125 144 234 31 -165 123 149 -243 -31 -16 -177 61
5022 61 366 166 -235 -20 -1 36 67 -82 116 0 39 -161 37 88 -108 -83 78 71 106 -54 199 42 14 23
5046 23 -125 -134 -28 5 -171 29 68 52 201 55 221 95 -6 -113 -77 12 -179 -101 18 58 162 273 -136
5069 -136 -86 -27 -128 81 51 247 15 127 -64 -40 43 -63 -8 89 45 -157 121 18 -91 157 10 71 -81
5092 -81 -86 128 -92 -142 42 -124 266 -130 -8 -172 61 33 -19 130 -298 -230 -48 -18 -187 248 249 -95 -38 14
5116 14 281 -54 144 134 -144 81 -204 -107 -198 180 57 -14 93 60 2 -53 233 140 -161 -71 -110 126 157 108
5140 108 45 -1 59 19 -20 6 114 99 -2 -61 -111 -294 -103 -147 180 -30 -177 120 -299 7 178 -56 -122 -59
$$ packed form
4972A80o0n8j16J09k52P8L57n08J53J02K8kro3rm0J65j69J0o9K63j86J17R3K26
4997C40l11j21J08j0o6M9j4J14p5m6n9N1lq2K69R0k03j96K88K6l92K12J5j61K38
5022F1L05k00m01K15J9L7L1j49J98j16L9k00J98N1j96K5J61pL5j60K53j57k8R
5046B3j48rJ06L3j76K00L9j6J49j46J66j26j01j07L6Q9j91P8J19M0J04J11m09
5069a36N0N9j01K09l0J96k32J12j91K4Q3j06N5R7m4k02K78j03j09K48j47O1j52
5092h1nK14k20n0J84j66L90l96J22j64K33k8n2J49m28O8J82L0j69M35Jl44N7N2
5116A4K67l35J98j0k78K25k85R7r1L78j23p1J07l3n8n5K86r3l01R0l9K36L1m9
5140A08o3m6O0m0l9K6J08j5j01n9n0j83J91m4L27k10j47K97m19L06J71k34o6O3
$$ plain form
5164 -59 -20 140 -457 -159 42 152 102 164 60 -187 70 -68 -110 -82 -159 -237 -162 29 -12 -125 40 -117 -120 80
5188 80 -19 192 -119 -43 -50 -268 -88 70 -136 77 -155 -52 145 -79 -59 296 105 65 -9 227 23 66 20
5211 20 31 -70 -80 -84 -82 39 -81 13 -105 227 -45 38 68 -182 125 36 -46 -179 -99 -55 -62 57 22 -272 83 312
5237 312 -98 -98 173 -97 230 -160 9 170 104 84 42 307 166 157 -90 -203 13 122 -57 57 129 3 89
5260 89 -88 -45 -77 75 191 106 -1 422 -167 -35 -84 -148 -84 107 -159 149 -128 85 -166 -183 16 -91 9
5283 9 92 -45 6 -179 168 156 -23 -22 -240 -73 185 146 2 -221 -2 -29 31 6 2 -44 -108 0 32 -140 39
5308 39 -52 30 168 -82 93 -152 -64 210 247 159 -225 -102 -65 196 -120 -39 96 -69 329 5 -56 -251 -155
5331 -155 -3 -108 358 -1 -5 -19 -134 114 -119 -148 -123 -145 79 -131 287 -246 11 -31 -76 143 235 108 60
$$ packed form
5164e9L9J60n97K98K01J10n0O2j04k47K57j38m2K8p7p8P5J91m1j13J65j57lK00
5188H0r9K11l11P6pk18J80J58k06K13k32J03J97k24K0L55j91m0p4K36k04M3m6
5211B0J1j01j0mKJ21j20R4j18L32k72Q3L0k50L07q9q2j33Q0M4pJ19l5k94L55K29
5237C12m10%K71k70L27l90J69J61o6k0m2K65j41rk47j13K16J09j79J14P2j26Q6
5260H9j77M3l2J52J16q5j07M23n89J32m9o4O4J91k66L08k77K13k51j7J99j07J00
5283IQ3j37N1j85L47j2j79Jk18J67K58l9j44k23K19k7O0k5mm6o4J08L2j72J79
5308C9r1Q2J38k50J75k45Q8K74L7q8l84J23L7K61l16Q1J35j65L98l24o1j95R6
5331a55J52j05M66l59mj4j15K48k33k9K5k2K24k10M18n33K57m2m5K19R2j27m8
$$ plain form
5354 60 -12 -70 -45 68 23 60 68 68 -52 27 243 0 32 47 57 -45 92 93 -79 -149 -11 12 -68 -90 10 19 112 -28
5382 -28 -85 2 34 11 -167 48 37 -13 40 -108 -74 -42 -31 -75 138 -96 12 1 -246 -321 114 67 -230 35 -125
5407 -125 173 115 35 -113 8 46 -107 80 -6 42 -99 60 -35 12 -24 -135 -215 82 179 40 87 64 211 39
5431 39 254 -3 167 -218 -101 1 -211 43 16 -70 -171 -47 12 28 -107 -125 165 -38 201 28 30 -88 50
5454 50 -99 123 91 121 75 146 4 22 -212 -18 35 -138 110 58 32 39 57 -44 -85 -74 21 172 -96 -136 81
5479 81 -99 -107 -69 81 51 116 -140 14 -116 123 152 87 25 54 -165 196 16 173 -100 72 21 74 -6 -212
5503 -212 198 15 190 -28 364 -18 -146 -145 -131 -39 -90 314 98 -84 49 69 -147 53 143 87 78 -93 251
5526 251 52 -64 -181 -147 -77 91 -55 -260 -265 169 45 -168 -149 -140 3 139 94 -201 -131 -271 -168 -215 55
$$ packed form
5354F0p2n8K5J13m5L7Q%j20P9K16k43L2J5J0j02J37Jj72p0J38K3q0k2J00RR3j40
5382b8n7Q7L2k3j78K15j1n0N3j48L4L2J1m4K13k34J08j1k47p5M35m7k97K65j60
5407a25K98n8q0j48J21L8j53J87q6M8j41J59r5M7l6j11q0K97R7j39M7k3J47j72
5431C9K15k57J70l85J17J02k12K54k7q6j01J24N9J6j35j8K90k03K39j73Kj18J38
5454E0j49K22l2L0m6P1j42J8k34J94N3j73K48n2k6PJ8j01m1J1R5J51k68m0K17
5479H1j80qL8J50l0O5k56J54j30K39K9o5o2K9k19L61j80J57k73J72n1N3q0k06
5503b12M10j83J75k18L92l82j28JJ4R2n1M04k16j82J33K0k16K00R0n6rj71L44
5526B51j99j16j17L4P0J68j46k05nM34j24k13J9RJ43J36m5k95P0j40J03m7K70
$$ plain form
5549 55 104 64 -22 62 61 49 -200 -9 189 -30 108 89 226 -185 11 90 -14 -112 -284 25 6 -103 5 -289
5573 -289 -199 -114 -120 -88 39 76 74 -154 62 80 -198 381 -94 -3 53 51 -89 -34 -7 -52 110 -122 -88 9 61 -31 -51
5600 -51 76 -232 22 -16 -161 -58 -67 -56 -42 6 -318 11 20 191 121 234 -41 207 -6 299 274 -153 -189 -7
5624 -7 -10 -300 160 90 -2 61 -105 14 23 -166 157 -42 100 -36 125 30 -187 6 -73 150 87 -222 -151 165
5648 165 -2 37 49 148 -98 46 60 -52 -95 54 159 -74 -69 -52 -89 403 182 -150 -109 -100 -101 96 122 -80 130
5673 130 -260 -89 -26 394 -199 -97 105 97 -30 -145 -166 -32 30 83 -62 72 68 145 -5 168 -54 -34 -59 -175
5697 -175 -176 -40 75 14 87 -88 21 75 -14 -13 259 9 14 34 -148 45 -16 -17 39 196 -33 -48 8 -22 -14 27 -243
5724 -243 -28 170 -106 125 -4 215 -41 -219 142 -377 -255 -41 -6 -54 54 41 117 150 -88 -68 123 -2
$$ packed form
5549E5M9m0q6Q4jj2k49J91J98k19J38j9J37m11J96P9j04r8j72L09j9j09J08k94
5573b89R0Q5oL2J27L7kk28K16J8k78N79m75R1N6kj40N5K7m5J62k32L4R7N2r2k0
5600e1J27l08K54l8j45J03rJ1J4M8l24L29RJ71p0J13k75K48k13L05k5m27l6J82
5624glk90M60p0r2O3j66J19Rj89L23j99J42j36J61r5k17J93p9K23o3l09P1L16
5648A65j67L9J2R9k46J44J4j12m3J49J05k33NJ7l7M92k21l32M1RjJ97K6k02K10
5673A30l90J71O3M20n93J02K02qj27j15k1J34O2N3j45J34mP7j50J73k22K0k5j16
5697a75jJ36J15o1P3j75J09N4q9JK72k50NK0j82J93o1jN6J57k29j5N6l0QM1k70
5724b43K15J98k76K31j29K19k56j78L61n19J22K14L5m8J08j3P6L3k38K0J91j25
$$ plain form
5746 -2 37 178 -106 -74 26 -157 -197 -67 9 -203 130 272 -170 318 16 19 53 161 146 126 -81 26 125 153
5770 153 11 43 -202 -22 -41 -52 -85 111 -137 -14 -73 273 23 129 117 -97 -10 -17 75 -61 101 -77 106
5793 106 -249 236 29 -56 -140 238 205 -124 -39 -13 -90 -137 -55 -15 -132 34 -13 173 98 -48 77 64 49 135 -68
5818 -68 -131 24 144 30 136 133 207 -16 -15 -281 -186 -1 250 30 -99 137 -74 108 201 102 -1 -82 141 -105
5842 -105 -71 228 -33 -82 -1 86 8 82 -215 1 -98 3 -40 68 -291 34 -7 -186 -85 63 -41 22 -16 -14
5866 -14 -20 19 58 -76 82 -43 -7 234 58 4 48 168 284 138 92 162 -84 188 5 54 -126 226 223 41
5890 41 24 -25 66 85 -100 219 -138 -187 -86 -100 26 -68 162 76 -191 -99 54 45 17 -175 248 2 -156 271
5914 271 114 -39 46 -6 -21 -141 -144 134 -7 143 93 65 -212 -72 -207 154 -76 80 -79 40 -56 -192 37
$$ packed form
5746bL9J41k84L2J00j83m0J30P6k12L33J42m42M88l02LL4J08j5k0k07J07R9K8
5770A53j42L2k45J80j9j1l3J96k48J23n9L46k50J06j2k14Q7pR2j36J62j78J83
5793A06l55M85k07q5q4L78l3l29Q5K6p7m7Q2M0j17J66m7J86p5j46J25j3j5Q6k03
5818f8o3J55J20j14J06lP4k23Jk66R5J85K51k20j29K36k11J82R3r9j03q1K23k46
5842a05L4K99k61m9Q1Q7p8P4k97K16r9J01m3J08l59L25m1j79J01J48j04O3l8K
5866a4oL9L9j34J58j25L6K41j76n4M4J20J16j46m6P0k46K72j83M9j80L52lj82
5890D1j7m9R1J9j85L19l57m9J01j4J26r4K30q6k67R2J53rk8j92M23k46j58M27
5914B71j57j53Q5n2j5j20lK78j41J50n0k8k77J40j35L61k30J56j59J19r6j36K29
$$ plain form
5937 37 128 10 45 -74 -1 -231 -36 4 -69 352 54 -37 -37 -58 33 150 -37 -47 93 -121 76 181 -232 251
5961 251 -149 118 -45 -13 31 340 -79 133 160 -33 33 345 -150 136 22 123 -28 118 2 35 137 30
5983 30 36 -47 185 -6 179 110 100 -25 71 -141 -24 55 61 -259 -78 64 3 134 117 61 -52 127 14 147
6007 147 -39 -17 -50 29 -73 33 -138 -33 182 -105 -40 -44 136 11 258 -84 -126 38 -23 36 -91 -24 -71 -139
6031 -139 248 61 54 -88 -40 50 131 -10 152 75 69 -35 -50 -13 -33 -164 -46 193 -54 56 -171 -33 122 120
6055 120 -17 -202 -146 -50 42 -128 -5 7 38 20 -32 -80 -21 -77 164 20 101 108 158 229 -41 -196 -192 -212 96 -54
6081 -54 27 -14 94 187 -133 -94 29 -85 -82 -139 -71 -64 -308 -23 94 -31 -55 131 -345 6 2 -55 160 113 -212
6106 -212 126 -22 -3 314 -138 182 125 154 143 -82 17 203 -63 274 -170 233 45 141 119 -149 -61 -15 -144
$$ packed form
5937C7R1j18L5j19P3k30J95M0p3M21k98r1%k1R1J17j87j0J40k14J97J05m13M83
5961B51m00K67j63L2M4L09m19K12K7j93O6L12m95K86j14J01j51J46j16L3J02j07
5983C0Oq3K32j91J85o9j0j25R6k12J17P9Ol20J81J42o1J31j7n6j13J79j13J33
6007A47j86K2l3P9j02J06j71J05K15k87O5mJ80j25K47l42m2J64o1N9j27O7m7o8
6031a39L87j87pj42M8R0Q1j41J62p7oj04j5L7k0j31J18K39k47J10k27J38J55k
6055A20j37j85N6R6R2j70J23J2L1j8n2m8N9n6K41j44Q1PN0P1k70j55Mk0L08j50
6081e4Q1m1J08R3l20L9J23j14Ln7O8Pk44K85J17j25k4J86m76L51mn7K15m7l25
6106b12L38j48J9L17m52L20n7K9j1k25R9J86k66L37m44M03j88R6k2k68Q8M6j29
$$ plain form
6129 -144 -145 -120 -196 33 141 148 79 -134 84 -54 39 -147 157 -89 173 46 137 -90 99 -359 94 234 99
6152 99 -70 -143 112 57 16 -15 -66 48 -36 -51 200 128 147 -42 190 -9 208 -37 120 20 169 169 180 94 -21
6177 -21 229 136 8 29 -110 -273 22 -27 -171 -74 -92 -102 193 -106 -130 -148 29 -171 150 314 -154 0 143
6200 143 -24 108 5 -157 -20 -4 15 33 -99 -31 119 -141 -28 -15 -164 -231 17 -89 232 357 -418 0
6222 0 42 35 121 -156 -198 73 104 -47 2 -68 402 -76 -87 -188 -106 -73 -28 -160 65 -131 140 90 270 -44 -98
6247 -98 21 -9 88 50 105 -61 -277 82 -112 -20 -52 171 -78 -231 186 -200 86 10 112 -38 175 86 118
6270 118 117 -66 156 248 -180 44 90 -8 46 -80 -104 -212 -126 -210 65 85 -116 11 21 -32 123 -1 -134 -25
6294 -25 -150 52 20 186 -13 50 -123 -98 -111 25 -211 51 -178 -3 48 -227 -12 -276 -53 160 -103 -45
$$ packed form
6129a44jK5p6K29J08Po9k13K18j38R3j86L04k46K62j27R1k27J89m58M53J40j35
6152I9j69p3K55n5m1l1n1J14q4j5K51p2J9j89K32j99K17k45J57j00J49%J1q6j15
6177b1K50r3j28K1j39j63K95m9j44R7j8j0K95k99k4j8J77k00L21J64m68J54J43
6200A43j67J32j03j62J37J6J9J8j32O8J50k60J13J3j49o7K48j06L21J25p75M18
6222@M2pQ6k77m2K71L1j51M9p0M70m78j1j01Q2L3M5j32K25j96K71n0J80l14n4
6247i8J19l0R7l8N5j66k16L59j94R2l2K23k49j53M17l86K86p6J02j50K13q9L2
6270A18jj83K22R2m28K24M6r8N4j26k4j08Q6q4K75K0k01J27J0n3J55j24j33J09
6294b5j25K02l2J66j99O3j73K5j3J36k36K62k29J75N1k75K15k64K23K13k63N8
$$ plain form
6316 -45 -203 232 78 59 127 -210 -155 34 -101 24 28 -201 -77 -41 -14 26 -14 -137 -32 -48 160 88 55 -26 102
6341 102 246 -94 54 -57 0 -62 -114 -8 31 64 27 28 -38 -97 31 37 3 -42 -265 78 176 140 -206 -48 80
6366 80 93 72 -81 119 -44 10 21 85 133 46 106 -199 -68 -49 -111 0 -122 14 -246 114 -29 252 71 111
6390 111 204 -97 -104 55 210 46 56 145 -5 -93 -35 -4 88 -46 63 -59 -244 21 29 -84 69 20 -38 -26 -70
6415 -70 165 16 -71 193 -76 10 -88 -156 12 -126 14 46 1 -22 55 105 119 136 90 46 -103 -20 -24 -157 75 -44
6441 -44 -96 -39 43 57 -145 -117 -31 -79 -26 -6 82 -45 89 142 -55 0 82 30 15 0 126 21 -254 21 32 -62
6467 -62 -25 26 35 143 -23 -18 68 -16 -281 -221 148 195 -44 -28 80 30 -142 -182 9 -58 117 -44 167 271 -65
6492 -65 -69 -24 83 15 -175 -154 -9 286 -41 -104 44 -105 18 55 17 229 -51 -159 -249 -74 88 -244 -140
$$ packed form
6316d5j58M35j54j9O8l37N5J89j35J25Mk29J24L6K7M0m0j23J05j6K08p2l3q1J28
6341A02J44l40J48j11N7o2n2J06L9L3l7Jo6n9J28Ol4m5k23L43R8l6l46J58J28
6366H0J3k1j53K00j63N4J1O4M8q7O0l05J31J9o2J11j22J36k60L60j43K81j81M0
6390A11R3l01pJ59J55j64J0Q9j50q8N8L1R2j34J09j22j85K65Qj13J53m9n8J2m4
6415g0K35j49q7K64k69Q6r8o8J68j38J40L2m5k3P7N0J4J7m6m4j49Q3mj33K32j19
6441d4n2N7Q2J4k02K8Q6m8N3K0Q8j27J34N3j97N5Q2n2j5j5J26j05k75K75J1r4
6467f2L7N1RJ08j66NQ6q4k65O0L69M7k39J6J08n0j72m0J91o7J75j61K11J04l36
6492f5mM5J07o8j90K1J45K95l27o3J48j49J23L7l8K12k80j08r0J75J62l32J04
$$ plain form
6515 -140 -1 -162 221 -54 41 -75 45 -31 -23 -82 -4 199 125 129 111 -50 -227 101 75 280 190 73 11 58 19
6540 19 -126 84 -21 -111 39 -201 24 37 -111 -68 -269 -264 -108 89 89 -65 87 75 52 -69 185 -98 39
6563 39 -17 122 19 -59 -138 74 -27 -61 35 41 180 -119 55 -145 -25 200 -32 18 -176 -89 -303 -24 -89 -172
6587 -172 69 67 -89 -324 223 27 16 -45 95 55 122 138 139 -103 -27 -35 -308 89 -86 -142 -58 -66 49 50 -186 149
6613 149 202 -36 -196 -6 24 -104 -15 -72 -67 107 -2 -271 19 -35 27 -22 186 -78 -126 20 -119 -11 -196
6636 -196 216 128 -106 -135 4 -114 138 -1 -19 11 4 -24 -91 5 -87 162 13 -30 -79 -166 -98 -64 22 163 40
6661 40 79 40 23 -155 67 -77 151 96 -99 -42 -1 -307 -16 -64 -111 72 -88 -348 77 -31 -50 30 -174 80
6685 80 136 270 1 -99 90 45 131 -183 24 -15 56 62 -17 -62 -151 86 -124 -125 -239 -115 200 40 142 244
$$ packed form
6515a40J39j61L83k75R5j16J20p6Qn9P8K03p4Mj8j61j77L28k6K05r0j17o2M7l9
6540A9j45K10j05r0J50k40K25J3j48M3k01NJ56J97%j54J52j2k3j21K54k83J37
6563C9n6J39j03p8p9K12j01l4R6OJ39k99J74k00J20K25k32N0j94Q7k14K79o5q3
6587a72K41kj56k35N47j96j1o1J40m0O7J6Jk42P6qk73L97j75n6Q4qJ15Jk36L35
6613A49N3k38j60J90L0j28Q9n7NJ74j09k69K90n4O2m9K08k64m8J46j39J08j85
6636a96M12q8k34k9J39j18K52j39j8L0pk8o7R6r2K49j49m3m9q7O8L4Q6J41j23
6661D0L9l9j7j78K22j44K28n5j95N7M1l06K91m8m7J83j60k60M25j08j9Q0k04K54
6685H0N6J34k69j00J89m5Q6l14K07l9P1Op9m5q9K37k10jj14J24L15j60J02J02
$$ plain form
6709 244 241 -98 -97 48 62 319 -162 -28 -211 181 53 -121 227 244 154 54 -15 212 146 93 171 -195 43 36
6733 36 -83 96 -107 41 -114 108 60 -121 -240 18 -116 -201 -72 -182 -19 179 12 -42 -155 33 -149
6754 -149 -177 -79 13 132 -106 223 7 25 126 6 -32 24 -153 64 389 -15 -150 186 80 -95 11 67
6776 67 54 -79 -131 122 112 98 -65 -200 286 33 -111 -368 87 80 -278 -28 73 154 29 -30 87 -94 173
6799 173 -9 76 -339 -71 -98 -225 -25 14 66 163 195 -64 -7 -87 -200 -282 10 -73 72 128 1 59 -15 1 -140
6824 -140 11 -28 -2 -109 -113 146 12 -123 -4 166 -221 -119 39 151 -189 135 -27 88 92 15 129 208 312
6847 312 -117 -256 61 289 -158 -228 -128 28 264 -90 -49 -188 168 219 173 -166 -83 -107 -103 -103 17 -16 36 111
6871 111 -106 4 10 4 -53 -259 5 -30 59 111 179 -18 -26 -148 -7 314 74 148 81 127 -48 70 106 -84 97
$$ packed form
6709B44ll39JJ45J4K57m81J34j83L92j28j74L48J7r0j00o9K27o6n3P8l66K38p
6733C6j19J79k03J48j55K22m8j81j19K58j34q5J29j10J63J98j67n4j13J88j82
6754a49k8R8R2J19k38L29k16J8J01j20l8N6j77K17L25m04j35L36j06j75J06N6
6776F7j3j33n2K53j0j4j63j35M86k53j44k57M55pl58K50J01Q1j25n9J17j81K67
6799A73j82Q5m15K68k7j27K00L9N2R7L2k59N7q0j13q2K92q3J45N6j27N8p4J6j41
6824a40J51l9K6j07mK59j34j35J19J70l87J02J58J12l40L24j62J15Mp7J14P9J04
6847C12m29j39L17K28m47p0J00J56K36l54M1j39L56N1m6l39Q3k4M%J20l3N2P5
6871A11k17J10Oon7k06K64l5Q9N2O8j97qj22J41L21k40P4o7M6j75J18L6j90J81
$$ plain form
6896 97 9 -289 173 116 -17 -211 -228 -49 62 50 22 81 -56 158 101 14 -70 -30 -5 8 58 -58 -52 -115 153 -168
6922 -168 213 -37 -147 -23 214 -124 -30 -220 55 365 77 -26 -5 52 90 110 167 190 29 -29 71 93 49
6945 49 229 102 88 30 23 63 -95 -237 28 -59 81 13 -101 42 28 27 -301 -227 247 -29 266 1 -25 75
6969 75 -81 66 37 -91 161 -129 86 181 -146 50 -46 -12 4 -120 -71 121 14 104 -6 -23 -149 118 47
6992 47 207 245 -255 20 -313 38 42 -265 21 34 235 -15 98 56 -25 88 -62 -55 69 -18 72 125 -156 236
7016 236 -135 -51 103 23 -156 235 3 109 130 -33 101 -71 -4 -40 -3 -74 30 109 -89 21 176 -258 37
7039 37 96 12 -62 -27 -51 -115 164 -49 -112 70 383 -2 -82 32 35 -91 125 -91 24 -170 23 166 -22 141
7063 141 14 -94 -40 -87 133 8 -268 150 122 52 59 -234 -92 -54 42 -163 -131 -26 111 209 -26 53 20 -178
$$ packed form
6896I7q8k98M62n7j33j94j7J79J11j2k8N9j37K14n7q7q4M0K5J3N0j16Oo3K68l21
6922a68L81k50j10J24K37l38R4j90K75L10k88j03K1N7L8K0N7K3j61n8J00K2m4
6945D9J80j27j4n8pM0j58j42K65q7J40o8j14J43j4jl28P4M74k76K95k65k6J00
6969G5j56J47k9j28K52k90K15R5l27J96r6L4J6j24M9J92j07R0j10j7j26K67p1
6992D7J60L8n00K75l33L51Ml07K86J3K01k50J13m2q1J13j50PJ24q7R0N3k81L92
7016B36l71Q4J54q0j79L91k32J06K1j63J34j72O7l6L7p1J04P9j98J10J55m34K95
7039C7N9q4p4L5k4o4K79k13o3J82L13l85q0J14Lj26K16k16J15j94J93J43j88J63
7063A41j27j08N4m7K20j25k76M18k8p0Pk93J42L8R6k05L2J05J37R8k35P9l3j98
$$ plain form
7087 -178 29 -41 62 -128 18 67 52 -117 83 41 96 174 -142 59 67 127 -13 50 -57 -16 174 -44 -54 103
7111 103 103 -15 49 17 -217 87 -59 195 16 206 49 202 -83 -122 202 232 38 -116 -140 -68 116 128 107
7134 107 103 -18 35 22 -34 -48 7 88 167 -2 -142 221 116 -22 -117 -81 -12 166 231 -70 20 6 -34 -14 107 139
7160 139 33 73 126 16 -1 261 -270 6 276 -69 -147 -64 -197 221 -65 18 -15 142 -163 -66 6 -203 54
7183 54 -160 -121 102 28 -63 54 -123 261 -133 -137 66 -8 -103 51 147 -133 -14 120 -6 77 -181 123 -147
7206 -147 -34 -64 -59 174 -335 103 127 -67 27 -102 6 -95 15 -48 -263 -33 88 -109 -69 -118 47 206 -1
7229 -1 -18 -35 -109 -266 118 30 204 3 226 135 56 102 173 10 26 56 139 54 -116 56 56 92 71 239 86 56
7255 56 154 152 112 242 -2 270 -45 -198 -47 -84 -182 -20 10 -82 -233 75 -25 -96 219 67 -26 171 -32 16
$$ packed form
7087a78K07p0J03j90J46M9j5j69K00m2N5P8l16K01QO0j40O3j07M1J90k18j0J57
7111A03%j18O4l2k34L04j46K54j79J90j57J53k85l9L24L0j94j54k4P2J84J2k1
7134A07mj21N3j3n6j4N5Q1P9j69j40L63j05j38r5L6O9J78O5l01R0j4m0K0J21L2
7160A39j06M0N3j10j7K62n31K76K70l45p8Q3j33M18k86Q3l3J57l05R7P2k09K57
7183E4k14L9K23p4r1J17j77L84l94mK03p4r5J54R6k80J19J34j26Q3k58L04k70
7206a47J13l0NK33n09M38K4j94R4j29J08j01J10o3k15K30J21j97M0m9J65J59k07
7229aj7j7p4j57L84q8J74k01K23r1p9M6P1j63J6L0Q3q5j70J72%L6k1J68j53l0
7255E6R8km0J30k44K72l15j53J51l7r8J62L0r2j51L08j00p1L15j52r3J97k03M8
$$ plain form
7279 16 -142 -113 91 87 -76 -43 -43 99 -162 -186 20 -117 203 -3 70 -32 -205 124 -37 91 28 85 170 -131
7303 -131 153 -62 54 20 83 2 -10 -182 -19 -53 -86 -89 26 155 0 -72 -46 92 -6 -121 -23 128 -23 -30 -185
7328 -185 75 -201 140 22 -54 -103 -177 6 46 -204 70 22 125 -32 73 46 59 263 -197 -265 -86 16 -24
7351 -24 67 -39 -21 -27 -67 -9 -72 75 127 33 35 90 33 87 14 -165 97 -5 -64 -55 194 -91 -206 118 -99 -56 91
7378 91 96 53 394 37 149 -49 210 -161 147 48 135 -15 156 -97 -283 -116 -5 136 -217 163 -145 256
7400 256 -50 -2 -101 -17 -12 -40 -199 29 -65 29 -154 134 -86 253 193 -245 215 -110 -49 144 -271 -79 280
7423 280 72 214 53 235 97 -138 29 111 52 -63 122 -143 -136 62 87 -4 28 27 -306 -22 -255 144 154
7446 154 -104 -75 21 -186 105 -83 178 104 91 -199 76 -31 -30 -148 -160 -219 -244 -18 -4 327 96 61 -15 -82
$$ packed form
7279A6j58K9K04mj63L3%J42k61k4K06j37L20k06P3j02j73L29j61J28o3N7Q5l01
7303a31K84k15J16l4O3q1j2j72J63l4l3lJ15J29j55p2K6J38r8j15R8J51j51pj55
7328a85K60k76L41j18p6m9p4J83M0k50K74m8J03j57J05k7J3K04m60o8J79J02m0
7351b4R1j06J8om0N8o3J47N2r4KN5n7N4p3j79K62j02n9RK49k85j15L24k17M3J47
7378I1Nm3L41l57J12j98K59l71L08r9Q7j50J71k53j86J67J11J41l53L80l08M01
7400B56l06M8r9Q4Nk8j59K28r4R4j83K88k20L39o0m38M60l25O1J93m15J92L59
7423B80k08J42j61J82j38k35J67Q2n9j15J85k65PJ98K5r1L2jl33K84k33L99J0
7446A54k58K9R6k07K91j88K61p4j3k90K75j07Jj18j2n9k5K26J4L31k31l5p6o7
$$ plain form
7470 -82 -47 -55 153 271 84 78 -92 101 -40 57 -188 119 222 144 -175 -64 241 75 -88 -118 -44 -152 67
7493 67 20 125 22 -184 -159 122 90 -32 -44 -164 30 -300 48 -22 -68 -47 -91 35 27 -49 -9 -75 -154 -104 68
7518 68 -229 87 -15 -89 72 80 240 17 154 84 -48 -72 -35 168 5 -8 51 173 140 10 56 11 133 -22
7542 -22 -191 348 134 -118 -309 -41 145 -10 24 44 -9 -30 -126 -88 -27 -82 -171 -42 -56 -73 -141 164 58 -27 -20
7567 -20 23 -62 217 -85 -154 160 -102 190 210 377 -119 -109 69 39 -24 90 -74 -82 107 140 -146 26 -28 -50
7591 -50 -16 -67 -28 57 -48 121 -85 67 -20 -48 138 139 169 -211 -63 -94 261 -102 -142 153 -304 6 231 235 127
7616 127 94 -64 70 92 -63 103 58 -102 112 -213 106 157 -121 -77 -48 -85 106 159 64 -57 222 27 155
7639 155 236 67 149 -132 104 -15 105 53 157 53 120 158 -76 -35 6 33 -11 3 -167 -79 -21 86 113 -131
$$ packed form
7470h2L5qK08J18j87oj70J93j41R7k45L07J03p8l19J11L05j66j63l0P4j08K19
7493F7m7J05j03k06K5K81l2j22j2j20J94l30L48p0m6K1m4J26qp6M0o6p9N0J72
7518F8k97L16j02p4J61QJ60k23J37p0j32k4L7K03j63j3N9J22l3j30M6m5J22j55
7542b2j69N39k14k52j91K68J86j55L4K0n3k1r6L8O1n5q9J29j4j7o8L05j06q5P
7567b0M3q5K79l02o9L14k62K92K0J67m96J0J78l0o3J14j64qJ89L3k86J72n4k2
7591e0L4n1L9Q5j05J69k06J52q7k8J86JL0l80J48l1L55l63m0K95m57L10K25Mj08
7616A27l3j58J34K2j55J66m5j60K14l25L19N1k78M4K9l7J91N3r5j21K79j95J28
7639A55Q1j69Q2k81K36j19J20n2J04j04O7L8k34M1M1K7m4J4j70Q8N8J07K7k44
$$ plain form
7663 -131 334 132 -165 223 93 65 -102 -163 20 24 138 159 41 5 32 -132 14 80 -81 -7 98 120 -136
7686 -136 -112 -129 118 90 -30 -103 -119 -179 -100 28 54 -299 0 95 -106 -45 -94 64 -15 51 77 -154 108 -97 -30
7711 -30 -157 -50 199 -105 -96 -167 298 250 17 -63 64 -102 74 -44 101 115 -106 -2 -29 55 -6 142 2
7734 2 -41 129 87 136 14 45 148 18 -62 164 -61 -138 -127 80 -82 -28 -33 111 192 232 168 72 6 -123 72 -58
7760 -58 11 -55 98 6 2 96 67 165 85 81 285 -52 169 158 -121 167 115 78 -121 203 26 -134 -20 19 110 -73
7786 -73 -180 -61 141 -121 -95 93 -44 5 -189 -18 99 -162 -221 140 -64 -58 91 -58 -14 20 -12 -117 10
7809 10 130 -65 -263 -20 -45 195 45 -41 -189 -16 214 151 87 178 -135 -48 61 -121 116 167 103 110 -153 82
7833 82 -145 143 4 68 1 -2 -114 -42 -190 89 60 -106 19 -115 -139 -51 -44 -85 -77 104 139 -2 76 165 -64 32
$$ packed form
7663a31M65k02k97L88j30k8j67o1J83MJ14K1j18l6K7j64J46O6j61P4J05K2k56
7686a36K4j7K47k8j20p3j6o0P9J28K6l53K99R5k01O1m9J58p9O6K6k31K62k05O7
7711c0j27J07K49l04Rp1M65m8k33q0J27j66J76j18J45J4k21J04k7Q4o1J48j40
7734Bm3J70m2M9j22L1J03j30q0K26k25p7J1K07j62N4nJ44Q1M0o4r6o6j29J95j30
7760e8O9o6J53r2mR4k9R8q0mK04l37K21j1k79K88n2l7j99L24j77j60J14L9R1j83
7786g3j07J19K02k62K6J88j37M9j94J71J17k61n9L61k04OJ49j49M4L4l2j05J27
7809A0J20j95j98K43k5K40j50q6j48J73K30o3o4R1l13Q7J09j82K37N1o4Pk63K35
7833H2k27K88j39O4o7lj12P2j48K79k9j66J25j34k4Q8Pm1QJ81L5j41P8Q9k29R6
$$ plain form
7859 32 -151 65 -72 43 -1 63 64 -297 -86 -205 -105 118 117 -169 216 0 2 131 138 -42 -151 -149 -350 -41
7883 -41 8 5 36 205 -232 73 -20 52 59 32 179 47 76 128 -63 88 -157 -107 -70 -15 -72 108 -4 85 -138 87
7909 87 124 133 -164 -70 -120 -185 29 -46 -238 -30 80 141 -109 191 128 -44 105 -192 180 -75 80 -98 41
7932 41 19 -133 -63 251 98 44 -3 -26 -29 -66 -138 33 216 181 -101 -180 35 77 123 -91 101 195 54 78 38 163
7958 163 130 -149 108 45 29 -50 -8 185 -28 -130 -42 -203 58 -32 -112 230 18 133 82 -57 137 -36 65
7981 65 -150 -184 -35 250 -95 8 -41 35 -13 179 193 -113 169 -51 -70 25 14 -46 82 38 18 71 132 245 -113
8006 -113 115 0 70 -16 35 205 237 186 -136 -113 67 130 145 -121 -75 89 -37 -227 -38 -98 258 -228 27
8029 27 27 -253 -127 -25 -31 -20 17 -146 41 -213 56 90 392 -220 -25 131 -159 -14 -54 -95 -14 133 -104 -80
$$ packed form
7859C2j83K16j37J15m4O4Jl61K11j19J00K23jk86L85k16KJ29Pj80j09Kk01L09
7883d1M9lL1J69m37L05r3P2Pk7J47j32K9N2j91J51k45N0L7N5n7J80j12Q9k23K25
7909H7L7Rk97R4n0o5K14p5j92K08J10O1k50L00o3j72J49k97L72k55J55j78J39
7932D1k2j52P0L14j53n4m7k3ll7p2J71J83l5k82p9K15M2M6k14J92R4j41K4m0J25
7958A63l3k79K57o3j6p9M2J93k13j02Q8j61K61r0q0L42k12J15n1j39J94j73J01
7981F5k15l4J49K85l45J03m9P6m8J92J4l06K82k20j9R5j1o0J28m4k0N3O1J13l58
8006a13K28j15P0q6N1J70L2n1l22K3J80O3J5k66M6J64j26j90J89o0L56m86K55
8029B7%k80J26J02oJ1L7j63J87k54K69L4L02o12J95J56k90J45m0m1Q1J47k37K4
$$ plain form
8053 -80 -176 -141 164 -58 -112 -39 -38 80 71 -26 77 152 -164 -25 80 -50 243 185 118 -15 9 127 125 75 117 180
8079 180 327 -68 -427 -204 105 40 123 -235 56 23 -7 30 4 -96 -88 -306 -42 -140 117 37 -158 180 59
8102 59 18 -32 -37 49 72 115 -118 -273 -62 -231 -73 16 115 40 -134 -82 50 145 -90 21 11 -186 -28 54 -111
8127 -111 -167 -1 -192 -114 -55 52 -186 -313 -76 89 76 -29 47 89 98 -53 -35 2 -28 194 -47 -33 -119 -128 -48
8152 -48 -61 -218 140 -19 -77 -5 -55 -252 -3 -184 -118 -48 -55 29 1 -202 -251 77 147 -54 -61 -225 188 148 177 53
8178 53 -201 16 -30 101 -71 143 69 25 39 -286 -74 -121 -155
$$ packed form
8053h0r6L5L05k22n4P3JJ18rr7J03P5l16J39J05j30K93n8o7j33K4J18kn0M2O3
8079A80J47l95l59K23L09o5Q3l58K91l3l0L7k6j00Qk18K64r8K57q0j95L38j21
8102E9m1n0nQ6K3M3k33j55K11j69J58Q9R9p5j74N2J32R5k35J11j0j97J58Q2j65
8127a11n6J66j91P8N9J07k38j27K37J65j3j05P6M2Rj51J8L7l0K22k41J4q6rQ0
8152d8j3j57L58j59n8P2n0j97K49j81O6P0pQ4k8k03m9L28P0k01pj64M13m0K9j24
8178E3k54K17m6J31j72K14p4m4J4l25K12m7l4
8191a55
$$ Imaginary data points
##PAGE= N=2
##DATA TABLE= (X++(I..I)), XYDATA
$$ plain form
0 0 0 0 0 0 0 0 0 0 0 0 8 -8 8 -8 8 -16 16 -24 24 -32 40 -47 54 -63 72 -86 98 -112 130 -148 168 -192 218
33 218 -244 274 -310 347 -388 433 -482 535 -593 656 -726 802 -886 978 -1076 1185 -1305
50 -1305 1438 -1585 1748 -1931 2138 -2372 2643 -2954 3320 -3761 4298 -4971 5841 -7010 8670
65 8670 -11202 15498 -24110 47859 -244371 -719837 145031 410860 -42487 65548 223662
76 223662 -232935 -179656 338682 179014 -235415 -44820 89743 -125469 -74675 129140
86 129140 21273 -68144 18885 307 -42182 49014 38619 -32425 28057 6885 -126889 -6683
98 -6683 174134 33734 -77314 72839 64051 -44976 109603 173383 -69998 -87933 103206
109 103206 5826 -98374 77277 63945 -129642 -24891 120740 1908 -13083 108000
$$ packed form
0@%%%%%%%%%%Qj6J6j6J6k4L2m0M8n6P2q7J01j17J35j58J84k10K42k78L16l60M10
33B18m62N18n84O57p35Q21r15J017j128J249j382J528j688J864k054K261k490
50a305K743l023L333l679M069m510N015n597O274p081Q059r269J0812j2851J5680
65H670j9872K6700l9608P1969k92230m75466Q64868K65829m53347J08035J58114
76B23662m56597N3279N18338j59668m14429J90595J34563k15212N0794K03815
86A29140j07867q9417Q7029j8578m2489R1196j0395p1044O0482k1172j33774J20206
98f683J80817j40400j11048J50153q788j09027J54579O3780k43381j7935J91139
109A03206r7380j04200J75651j3332j93587J04751J45631j18832j4991J21083
$$ plain form
119 108000 44062 -24017 51055 17601 -29398 87547 66712 -116229 -78392 76361 57932
130 57932 16947 22356 -49066 -29102 131778 107776 -69336 -44011 76399 26756 -28241 19387
142 19387 -7202 -47953 35798 61234 -37606 -30310 52933 21998 -4177 51176 8123 -69658
154 -69658 3628 60280 -6508 -8201 20675 -45637 -30467 84155 54452 -37610 -1956 3311
166 3311 -51686 24818 86746 -37326 -102321 -13904 10675 -4922 36338 3010 -70552 -9127
178 -9127 62216 12128 -2830 39751 -1653 -42729 11503 31527 -7240 -39 1475 -47361 -30790
191 -30790 31611 5038 -41567 -2661 15194 -36758 -34927 19209 22054 3353 1954 -27222 -36764
204 -36764 31275 67677 10740 -30515 -22876 -11564 25202 55696 6116 -45409 -23882 -3695
$$ packed form
119A08000o3938o8079P5072l3454m6999J16945k0835j82941L7837J54753j8429
130E7932m0985N409p1422J9964J60880k4002j77112K5325J20410m9643n4997M7628
142A9387k6589m0751Q3751K5436r8840P296Q3243l0935k6175N5353m3053p7781
154f9658P3286N6652o6788j693K8876o6312J5170J14622k9703r2062L5654N267
166C311n4997P6504O1928j24072o4995Q8417K4579j5597M1260l3328p3562O1425
178i127P1343n0088j4958M2581m1404m1076N4232K0024l8767P201J514m8836J6571
191c0790O2401k6573m6605L8906J7855n1952J831N4136K845j8701j399k9176r542
204c6764O8039L6402n6937m1255P639J1312L6766L0494m9580n1525K1527K0187
$$ plain form
216 -3695 1143 35842 26924 -42189 -44206 8724 12765 14623 36760 -5774 -56786 -12895 42105
229 42105 32741 16135 -3229 -39807 -19443 48213 47038 -9390 -22577 -6716 504 19780 27216
242 27216 -1624 -16510 6392 15647 1396 7423 17395 2041 -2393 12013 2667 -11772 5137
255 5137 17211 3629 -3377 -5853 -14902 5198 36192 16024 -20943 -13851 3079 10616 27513
268 27513 16983 -23884 -24513 11524 20716 11080 6988 -8552 -19285 5027 22566 8079 -3027
281 -3027 -5339 -9635 -1716 10058 2584 -8828 -7030 -2929 -4126 -2268 -2319 -8843 -5214 7137 4141
296 4141 -10880 -12645 -24 9901 10988 2546 -16083 -23516 24 22127 11398 -10756 -23499
309 -23499 -22189 1517 27322 17986 -15269 -30139 -17294 5654 22779 13248 -21511 -38116 -18268
$$ packed form
216c695M838L4699q918o9113k017N2930M041J858K2137m2534n1012M3891N5000
229D2105r364j6606j9364l6578K0364O7656j175n6428j3187J5861P220J9276P436
242B7216k8840j4886K2902R255j4251O027R972j5354m434J4406r346j4439J6909
255E137J2074j3582p006k476r049K0100L0994k0168l6967P092J6930P537J6897
268B7513j0530m0867o29L6037R192r636m092j5540j0733K4312J7539j4487j1106
281c027k312m296P919J1774p474j1412J798M101j197J858n1o524L629J2351k996
296D141j5021j765J2621R925J087q442j8629p433K3540K2103j0729k2154j2743
309b3499J310K3706K5805r336l3255j4870J2845K2948J7125r531l4759j6605J9848
$$ plain form
322 -18268 8525 20086 9756 -15889 -27437 -10126 15010 21608 9177 -9245 -21050 -13622
334 -13622 6681 13262 1060 -10438 -13228 -9165 2543 14383 12235 945 -2178 2193 -1019
347 -1019 -1976 7044 8729 -2164 -13513 -17423 -9289 9976 21852 8674 -14482 -18134 2203 26047
361 26047 29998 4971 -22534 -21381 2007 20876 21789 3256 -19763 -17610 12469 34203 26494
374 26494 7436 -6941 -11888 3707 24451 17870 -9055 -23196 -16160 196 14497 14263 -2246
387 -2246 -10252 2233 15212 17415 11858 2143 -3270 1063 4396 1221 -116 971 365 2569 7881
402 7881 5954 884 4559 11004 8918 71 -10337 -14865 -4419 10858 6513 -14500 -20657 -3306
416 -3306 15247 19836 10181 -7285 -14605 1531 16838 8140 -10189 -19155 -18849 -8837 2670 -684
$$ packed form
322a8268K6793J1561j0330k5645j1548J7311K5136O598j2431j8422j1805P428
334a3622K0303O581j2202j1498k790M063J1708J1840k148j1290l123M371l212
347a019r57R020J685j0893j1349l910Q134J9265J1876j3178k3156l652K0337K3844
361B6047L951k5027k7505J153K3388J8869R13j8533k3019K153L0079K1734p709
374B6494j9058j4377m947J5595K0744o581k6925j4141P036J6356J4301k34j6509
387b246q006J2485J2979K203n557r715n413M333L333l175j337J087o06K204N312
402G881j927n070L675O445k086q847j0408m528J0446J5277m345k1013o157J7351
416c306J8553M589r655j7466p320J6136J5307q698j8329q966L06J0012J1507l354
$$ plain form
430 -684 -10862 -9541 -2777 1286 4555 3054 -2052 -906 796 -7715 -10676 -3021 -3378 -7681 -3916
445 -3916 -3534 -12191 -11721 -773 5153 1690 -9883 -22529 -21226 -2461 10434 -1937 -23967 -28711
459 -28711 -11307 9715 14523 2664 -14126 -20049 -7259 10433 14396 1610 -20484 -31117 -13413
472 -13413 11312 12542 -6134 -21675 -22083 -5206 12957 10109 -6990 -15819 -16173 -10061 2682 4635
486 4635 -8785 -15828 -12605 -9092 -638 4868 -2327 -7130 -2548 -4293 -6666 3449 10525 2418 -5048
501 -5048 -6600 -3925 4980 9678 1679 -6024 -8535 -10420 -8399 411 5475 -3446 -19208 -21780 -3778
516 -3778 14634 14419 -2673 -16220 -11686 10275 24112 12012 -6515 -10242 -5823 6276 17083
529 17083 9425 -8971 -14966 -6520 7150 12717 -2014 -17998 -10937 2782 2843 -1405 -3541 -5962
$$ packed form
430f84j0178J321O764M063L269j501n106J146J702q511k961P655l57m303L765
445c916L82q657M70J0948N926l463j1573j2646J303J8765J2895j2371k2030m744
459b8711J7404K1022M808j1859j6790n923J2790J7692L963j2786k2094j0633J7704
472a3413K4725J230j8676j5541m08J6877J8163k848j7099q829l54O112J2743J953
486D635j3420p043L223L513Q454N506p195m803M582j745k373J0115P076q107p466
501e048j552K675Q905M698p999p703k511j885K021Q810N064q921j5762k572J8002
516c778J8412k15j7092j3547M534K1961J3837j2100j8527l727M419J2099J0807
529A7083p658j8396n995Q446J3670N567j4731j5984P061J3719O1m248k136k421
$$ plain form
543 -5962 1793 11711 5047 -699 5601 7833 5755 7727 2188 -9187 -8386 987 4173 -690 -10431
558 -10431 -16322 -4428 11922 10883 -69 -5880 -3393 5707 11080 6676 2243 -2669 -8224 -3967
572 -3967 7425 10698 3365 -5935 -8481 570 11324 7356 -4348 -7645 -6721 -4367 715 -265 -3255
587 -3255 -220 -2027 -4227 5431 10834 4050 2643 6152 1671 -3295 -318 641 2312 4824 -5779
602 -5779 -15640 -2705 13355 12872 3636 -6202 -9558 1690 14217 11576 -1652 -14503 -17607 -4980
616 -4980 11624 12528 -1796 -16888 -14782 7952 24842 14088 -5196 -10559 -3917 8246 15252
629 15252 6934 -6302 -9132 -3509 4754 10833 6160 -3124 -4798 -1362 2216 4541 9 -5298 -2470
644 -2470 -469 -6287 -4464 3761 5505 3338 391 -3393 1589 11773 9239 1243 454 -2462 -5521
$$ packed form
543e962P755R918o664n746O300K232k078J972n539j1375Q01R373L186m863r741
558a0431n891J1894J6350j039j0952n811K487R100N373m404m433m912n555M257
572c967J1392L273p333r300k546R051J0754l968j1704l297R24K354N082r80k990
587c255L035j807k200R658N403o784j407L509m481m966K977R59J671K512j0603
602e779r861J2935J6060m83r236r838l356J1248J2527k641j3228j2851l104J2627
616d980J6604R04j4324j5092K106K2734J6890j0754j9284n363O642J2163P006
629A5252q318j3236k830N623Q263O079m673r284j674L436L578K325m532n307K828
644b470K001n818J823Q225J744k167k947l784M982J0184k534p996p89k916l059
$$ plain form
659 -5521 1382 7335 2882 -4370 -8011 -6340 3609 11630 6166 -4403 -8241 -3937 6014 9741 2028
674 2028 -6646 -7586 -5034 1611 8959 4023 -7148 -8853 -1254 6683 7190 -1144 -7116 -3953 1356
689 1356 3277 1939 -3224 -5634 1721 6002 149 -3398 -1867 -580 4287 5748 -3561 -10759 -4196
704 -4196 4297 5888 52 -9439 -11714 -1257 7976 5137 -3114 -9049 -8442 1227 8102 4213 -2136
719 -2136 -6529 -8067 -844 8686 6648 -2968 -8165 -5771 1355 6645 5161 -2295 -6822 -4515 1644
734 1644 4927 606 -3858 -2612 -2699 -3288 128 929 -1650 -806 159 -3344 -3558 1158 5035 4324 53
751 53 -5551 -4609 2640 6734 5796 -8 -8917 -8460 4542 11445 6116 -3228 -9949 -7491 5747 13850
767 13850 5652 -7575 -10998 -4028 7002 11588 3235 -7161 -7894 -2080 5653 9251 2655 -5685
$$ packed form
659e521O903N953m453p252l641J671R949Q021n464j0569l838M304R951L727p713
674B028q674r40K552O645P348m936j1171j705P599P937N07q334n972L163N309
689A356J921j338n163k410P355M281n853l547J531J287M867J461r309p198O563
704d196Q493J591n836r491k275J0457R233k839q251n935O07R669O875l889o349
719b136m393j538P223R530k038r616n197K394P126N290j484p456m527K307O159
734A644L283m321m464J246q7n89L416Q01k579Q44R65l503k14M716L877p11m271
751E3n604R42P249M094r38n804q909M57J3002O903n329r344o721K458J3238Q103
767A3850q198j3227l423O970J1030M586q353j0396p33N814P733L598o596q340
$$ plain form
781 -5685 -5814 -1110 4034 6441 3077 -3220 -3964 634 4806 6056 3830 -453 -979 2216 3421 2611
797 2611 982 -430 1330 1813 -2031 -2564 930 3631 2954 -596 -4754 -3866 2990 6601 2949 -2280
813 -2280 -4757 -2119 5718 9339 4386 -1694 -4205 -992 6660 9323 2103 -5602 -5022 -45 5266
828 5266 5358 -571 -4912 -2629 2518 4403 2980 -890 -3171 165 2036 73 -1111 -1843 -865 1827
844 1827 2365 -717 -2552 988 4358 4827 1700 -3110 -3408 1112 4046 3694 -182 -5416 -5729 1274
860 1274 7534 6335 -741 -6480 -4772 3043 8042 4241 -5010 -9838 -5963 2925 6211 1108 -4833
875 -4833 -6416 -2032 4861 7721 2228 -2945 -4039 -1204 2521 3281 -272 -3444 -2750 -395 684 2232
891 2232 2088 903 375 -233 -2027 -1657 596 812 -1288 -4583 -6752 -4757 1306 4681 1128 -4011
$$ packed form
781e685j29M704N144K407l364o297p44M598M172J250k226m283n26L195J205q10
797B611j629j412J760M83l844n33L494K701o77l550m158Q88O856L611l652n229
813b280k477K638P837L621m953o080k511L213P652K663p220p705N80M977N311
828E266R2n929m341K283N147J885j423l870k281L336J871j963j184p32R78K692
844A827N38l082j835L540L370M69l127m810k98M520K934l52l876n234l13P003
860A274O260j199p076n739J708P815M999l801r251m828L875Q888L286n103n941
875d833j583M384O893K860n493n173j094K835L725P60l553l172O94K355J079J548
891B232j44j185n28o08j794L70K253K16k100l295k169J995O063L375l553n139
$$ plain form
907 -4011 -5439 -1396 4807 7046 1466 -6372 -8230 -2696 3919 5003 -28 -6971 -7962 -408 7114
922 7114 7725 358 -6421 -6093 23 4710 2898 -3963 -8390 -6896 -1333 2993 2069 -3041 -4972 -2378
938 -2378 1595 2503 550 -2492 -3643 -1648 -348 -1796 -2892 -1548 -306 156 100 -1281 -1003 1436
954 1436 2928 1218 -2190 -4441 -4090 -979 2061 -602 -5954 -6739 -1985 2890 4391 806 -4349 -4776
970 -4776 60 4149 2631 -1394 -5409 -5610 -408 3555 1913 -1966 -3697 -2021 2217 3969 1353
985 1353 -2400 -1610 1193 886 -1250 -1298 -1016 604 1636 18 -1656 -1099 1539 3030 2275 -1157 -3954
1002 -3954 -3720 1068 3794 967 -3730 -5844 -2644 4185 6917 2947 -2860 -3426 1153 5462 6883
1017 6883 3515 -3673 -5567 329 5541 5710 1235 -4811 -5245 1137 5990 3730 -479 -3442 -3400 116
$$ packed form
907d011j428M043O203K239n580p838j858N534O615J084n031o943r91P554P522
922G114O11p367o779L28O116M687j812o861m427J494N563M326r24n110j931K594
938b378L973R08j953l042j151J995J300j448j096J344J242M62n6j381K78K439
954A436J492j710l408k251L51L111L040k663n352p85M754M875J501l585n155m27
970d776M836M089j518m025m015k01N202L963j642l879j731J676M238J752k616
985A353l753P90K803l07k136m8K82J620J032j618j674N57K638J491p55l432k797
1002c954K34M788K726k827m697k114L200O829K732l970n807n66M579M309J421
1017F883l368p188j894N896N212J69m475o046m34O382M853k260m209k963M2L516
$$ plain form
1033 116 3607 2695 -508 -1570 -1521 676 3646 2861 695 471 1169 1935 1428 720 2041 3146 1600
1050 1600 -1522 -2161 950 3954 4579 298 -3093 -2305 1202 4256 4146 -197 -4781 -3701 1148 4797
1066 4797 4206 -781 -5983 -3239 3502 5940 3456 -1086 -4305 -2347 3943 5702 1984 -1219 -3422
1081 -3422 -1605 3476 5355 954 -2863 -2353 251 2726 2149 -1660 -2535 -412 1159 341 -789 -1433
1097 -1433 -267 1223 1016 -887 -1543 -1166 601 2392 1396 -1762 -2981 -1200 2603 4083 569 -3868
1113 -3868 -2972 1184 3651 3029 -613 -4414 -2305 1096 2301 1543 -772 -4000 -3355 902 2285 248
1129 248 -1504 -3169 -2329 1049 1850 -805 -1516 -978 -690 147 674 -388 -178 751 48 -399 -192 -1152
1147 -1152 153 1937 875 -1975 -3657 -1492 2015 3571 -230 -4459 -4441 -694 3428 3330 -1581 -5578
$$ packed form
1033A16L491r12l203j062M9K197K970p85k166k24O98P66n07p08J321J105j546
1050A600l122o39L111L004O25m281l391P88L507L054j10m343m584J080M849L649
1066D797n91m987n202K744O741K438k484m542l219J958O290J759l718l203k203
1081c422J817N081J879m401l817N10K604K475n77l809q75K123J571q18j130o44
1097a433J166J490k07j903o56L77J767J791r96l158j219J781L803J480l514m437
1113c868Q96M156K467o22l642l801K109L401J205p58k315l228O45M257J383k037
1129B48j752j665Q40L378Q01k655p11N38K88Q37N27j062K10R29p03m47K07r60
1147a152J305J784j062k850j682K165L507J556l801m229J8L747M122r8m911l997
$$ plain form
1163 -5578 -4134 457 3601 3061 -1587 -5812 -3965 2039 4228 2932 -1911 -5298 -2377 2977 4088
1178 4088 1208 -1534 -3500 -1796 2286 2727 124 -1658 -2547 -1683 756 1514 -605 -1444 -862 -1071 -616
1195 -616 -81 -628 -252 544 -754 -2381 -1165 432 1680 1320 -633 -2399 -1279 1278 2869 2278 -1143
1212 -1143 -3945 -1760 1996 3396 1618 -2454 -4516 -1385 2627 3119 723 -2716 -4402 -1026 3081
1227 3081 2448 -618 -2665 -3227 -725 3003 1894 -978 -1472 -907 942 2815 1372 -827 -532 1260
1243 1260 978 643 25 -1106 124 2154 771 -1421 -1299 -651 1261 2203 100 -2479 -2355 10 2593
1260 2593 2154 -639 -3091 -1958 1518 3495 2802 -601 -2733 -1187 2606 3617 1895 -1192 -2567
1275 -2567 -523 2696 2614 1081 -762 -1870 -556 2160 1971 14 -533 -798 -185 1146 599 -740 226
$$ packed form
1163e578J444M591L144n40m648m225J847O004K189j296m843l387K921N354J111
1178D088k880k742j966J704M082M41k603j782q89Q64K439P58k119q39N82k09M55
1195f16N35n47L76P96j298j627J216J597J248l60j953j766J120K557J591n91l421
1212a143k802K185L756J400j778m072k062L131M012M92k396l439j686L376M107
1227C081o33l066k047n62K502L728j109k872m94N65J849J873j443k199K95J792
1243A260k82l35o18j131J230K030j383k192J22O48J912R42k103k579J24K365K583
1260B593m39k793k452J133L476J977o93l403k132J546L793J011j722l087j375
1275b567K044L219q2j533j843j108J314K716j89j957n47k65O13J331n47j339R66
$$ plain form
1292 226 481 -300 -25 -457 -59 2032 2152 -192 -1578 -804 887 2762 2497 -284 -2787 -1002 1974
1309 1974 3669 2675 -1277 -3826 -1411 2705 3964 1461 -2631 -4034 -1402 2787 3481 370 -2768
1324 -2768 -3686 -589 2762 3006 236 -2350 -2459 -15 2711 1941 -232 -1484 -1072 411 1727 1157
1340 1157 52 -131 39 -134 632 482 -630 3 528 -824 -1221 -534 -352 551 656 -1346 -2419 -1240
1358 -1240 792 1582 681 -1680 -3224 -973 2027 2265 714 -1758 -2975 -350 2550 2765 71 -2519
1374 -2519 -2369 334 2412 1678 -1348 -2505 -1778 263 1461 459 -1577 -1885 -1119 549 754 -621
1390 -621 -1645 -890 318 350 -188 -1275 -993 802 1362 -293 -1392 -1174 292 1838 1459 -868 -2346
1407 -2346 -1197 743 1720 1465 -1531 -2964 -1338 977 2107 918 -1734 -3423 -1412 1712 2072 42
$$ packed form
1292B26K55p81K75m32L98K091J20k344j386P74J691J875k65k781k503J785K976
1309A974J695r94l952k549K415M116J259k503m092j403K632M189O94l111l138
1324b768r18L097L351K44k770k586j09K444K726p70k173j252M12J483J316n70
1340A157j105j83J70j73P66j50j112O33N25j352l97O87J82R03J05k002j073J179
1358a240K032P90r01k361j544K251L000K38j551k472j217K625K900K15k694k590
1374b519J50K703K078p34l026j157P27K041J198j002k036l08P66J668K05j375
1390f21j024P55J208L2n38j087K82J795N60j655j099K18J466J546l79k327j478
1407b346J149J940R77k55k996j433J626K315J130j189k652j689K011L124L60k030
$$ plain form
1423 42 -1994 -2888 -683 2135 2360 -42 -1806 -1747 707 1890 1719 -219 -1035 -179 554 923 355 -167
1441 -167 -200 282 -410 -89 -340 415 883 417 -1060 -1549 -781 829 1708 366 -1298 -2230 -303 1755
1459 1755 2370 881 -1930 -2415 462 2896 2706 423 -1845 -2028 582 3241 2466 42 -2135 -1823
1475 -1823 934 3088 2349 -671 -1898 -1231 662 2264 1238 -657 -1526 -865 770 1526 502 -605
1491 -605 -650 439 1373 890 601 439 910 1005 720 43 59 1229 1821 1028 -538 -784 70 1470 1824 622
1511 622 -1316 -1767 83 1796 2011 293 -1983 -1591 758 2265 1651 -136 -1427 -866 1277 2555
1527 2555 1474 -186 -832 -43 1714 1892 940 -551 -648 663 1059 931 290 -100 320 942 381 -577
1545 -577 -391 323 844 512 -170 -1198 -727 940 1675 877 -596 -1529 -516 1687 2524 513 -1495 -1589
$$ packed form
1423D2k036q94K205K818K25k402j764N9K454J183j71j938q16Q56P33L69n68n22
1441a67l3M82o92L21k51P55M68m66j477m89P68J610Q79j342j664r32J927K058
1459A755O15j489k811m85K877K434j90k283k268j83K610K659p75k424k177L12
1475a823K757K154p39l020j227O67J893J602j026j895q69O61J635P56j024j107
1491f05m5J089R34m83k89j62M71R5k85o77J6J170N92p93j566k46Q54J400L54j202
1511F22j938m51J850J713K15j718k276L92K349J507o14j787j291N61K143J278
1527B555j081j660o46P89J757J78r52j491r7J311L96j28o41l90M20O22n61r58
1545e77J86P14N21l32o82j028M71J667P35p98j473r33J013K203Q37k011k008r4
$$ plain form
1563 -1589 135 2118 2418 192 -2032 -1581 406 2001 1866 -287 -2183 -1539 359 1564 1082 -1200
1579 -1200 -2123 -1392 534 1169 502 -915 -1439 -683 133 431 293 -444 -389 171 155 137 -20 86 294 370
1599 370 -260 -879 -363 946 916 -134 -1342 -1836 -136 1218 982 -905 -2388 -1920 -227 1635 1131
1616 1131 -1155 -2707 -1482 697 2037 1240 -1306 -2485 -700 1174 1782 740 -1249 -1868 -410 1278
1632 1278 1476 468 -1042 -1142 -172 719 564 -169 -881 -1015 -106 180 -723 -665 -271 60 184 -164 -892
1651 -892 -593 647 761 95 -606 -969 -192 1468 1465 -135 -1091 -923 297 1894 1401 -762 -1764 -871
1669 -871 438 1641 659 -992 -1575 -587 748 1548 232 -656 -1374 -160 768 887 217 -804 -1030 296
1687 296 599 308 45 -70 93 420 261 -397 59 347 754 318 -262 -666 90 1234 1234 336 -723 -1571
$$ packed form
1563a589J724J983L00k226k224M51J987J595j35k153j896O44J898J205m82k282
1579a200r23P31J926O35o67j417n24P56Q16K98j38p37N5N60j6j8j57J06K08P6
1599C70o30o19N16J309l0j050j208m94J700J354k36j887j483M68J693J862n04
1616A131k286j552J225K179J340p97k546j179J785J874O08j042j989o19J458J688
1632A278J98j008j510j00R70Q91j55p33p12j34R09K86r03N8L94L31J24l48p28
1651h92K99J240J14o66p01l63P77J660lj600r56J68J220J597m93k163j002Q93
1669h71J309J203r82j651n83R88J335Q00j316q88p18J214R28J19o70j021k26J326
1687B96L03k91k63j15J63L27j59o58M56K88M07m36n80m04P56J144%q98j059q48
$$ plain form
1707 -1571 -199 1548 834 -688 -1941 -1612 -74 1844 1212 -802 -2029 -665 1080 2312 1332 -887
1723 -887 -1379 -109 1343 1657 948 -984 -1280 -201 1266 1162 139 -1030 -949 -399 676 47 -216 -961
1741 -961 -612 -15 -67 -303 -157 116 257 140 -140 -199 466 664 715 -204 -746 -936 170 1311 762 -805
1761 -805 -1142 -565 949 1860 747 -868 -1443 -486 867 1258 242 -1492 -2003 -396 912 1585 110
1778 110 -1317 -1068 302 1104 867 -170 -873 -914 403 781 550 -289 -141 -25 668 351 189 -220 251
1797 251 486 10 -172 -969 -381 257 464 -637 -891 -765 243 887 743 -85 -1118 -655 385 1292 518
1816 518 -934 -1317 -736 543 1256 406 -835 -1046 128 1146 1529 449 -778 -1114 -85 426 287
1833 287 -361 -828 -842 52 403 22 -542 -566 -367 -44 -425 -743 -486 51 169 -260 -414 -905 -41 1013
$$ packed form
1707a571J372J747p14j522j253L29J538J918o32k014j227J364J745J232r80k219
1723h87m92J270J452L14p09j932k96J079J467j04j023j169Q1N50J075o29k63p45
1741i61L49N97n2k36J46K73J41j17k80n9O65J98N1r19n42j90J106J141n49j567
1761h05l37N77J514R11j113j615n75R57J353L91j016j734n11J607J308O73j475
1778A10j427K49J370Q02k37j037p03m1J317L78k31q39J48J16O93l17j62m09M71
1797B51K35m76j82p97N88O38K07j101k54J26J008O44j44q28j033M63J040R07p74
1816E18j452l83N81J279P13q50j241k11J174J018L83j080j227l36J029N11j39
1833B87o48m67j4Q94L51l81n64k4J99L23l81l18K57N37J18m29j54m91Q64J054
$$ plain form
1853 1013 629 -140 -835 -896 304 1214 644 -842 -1730 -824 510 927 187 -1100 -1569 -583 686 1101
1871 1101 -34 -1215 -1479 -266 759 958 -170 -1568 -1230 60 937 771 -69 -828 -168 410 759
1888 759 83 -314 -608 -217 -91 97 -180 -145 10 116 -53 -258 -322 -353 338 123 -422 -908 -321 414 840
1909 840 278 -702 -936 -95 1018 1326 366 -688 -709 338 1207 1245 335 -910 -653 636 1525 1438 -31
1928 -31 -943 -376 371 869 272 -429 -842 -369 421 497 165 -329 -382 151 473 749 -36 65 327 850 461
1949 461 97 -11 251 1037 466 273 -311 -39 568 1029 793 -252 -545 -138 745 1060 442 -685 -920
1968 -920 2 1228 1330 -25 -837 -744 -43 808 812 -29 -485 -60 336 775 985 -94 -456 190 507 504 243
1989 243 47 -24 25 118 -59 116 292 149 8 31 -296 -461 27 252 151 -334 -579 -268 610 1063 303
$$ packed form
1853A013l84p69o95o1J200R10n70j486q88R06J334M17p40j287m69R86J269M15
1871A101j135j181k64J213J025J99j128j398L38J290Q77j66q40p59O60N78L49
1888G59o76l97k94L91J26J88k77L5J55J06j69k05o4l1O91k15n45m86N87P35M26
1909H40n62r80k34Q41J113L08r60j054k1J047Q69L8r10j245K57J289Q89q7j469
1928c1r12N67P47M98n97p01m13M73P90P6l32m94n3N33L22K76p85J01K62N23l89
1949D61l64j08K62P86n71j93n84K72O07M61k36j045k93M07Q83L15o18j127k35
1968i20R22J226J02j355q12R3P01Q51Mq41m56M25L96M39K10j079l62O46L17lk61
1989B43j96p1M9R3j77J75J76j43j41K3l27j65M88K25j01m85k45L11Q78M53p60
$$ plain form
2010 303 -924 -671 130 790 1158 73 -844 -699 155 881 822 -33 -933 -831 196 967 528 -674 -866
2029 -866 -707 203 572 19 -311 -661 -403 282 186 43 -309 -245 -212 87 366 -3 51 102 281 -38 -299 -227
2051 -227 -43 428 91 -286 -742 -537 386 391 -127 -757 -961 -213 527 660 -134 -1005 -766 350 638 396
2071 396 -523 -1081 -689 462 596 234 -266 -613 -279 250 631 76 -507 -201 -101 516 497 -26 -480 -154
2091 -154 197 231 134 -257 103 57 88 -289 -403 -187 133 234 -183 -267 -821 -140 335 881 359 -316 -224 260
2113 260 714 682 16 -823 -811 80 797 315 -445 -863 -490 237 631 398 -672 -780 -497 302 524 73
2133 73 -714 -561 128 81 248 7 -302 121 130 140 75 205 41 -278 114 -218 -29 -1 286 512 154 -534
2155 -534 -547 -219 342 223 -405 -1124 -842 -13 336 319 -394 -916 -428 433 813 514 -40 -376 -110 624 987
$$ packed form
2010C03j227K53Q01O60L68j085r17J45Q54P26n9q55r00J02J027P71m39j202j92
2029h66J59R10L69n53l30l50K58O85r6j43l52O4L3K99K79l69N4N1J79l19k61P2
2051b27J84M71l37l77m56K05R23Nn18o30k04P48P40J33p94q71K39J116K88k42
2071C96r19n58L92J151J34l62n00l47L34N29L81n55n83L06J00O17j9n23m54L26
2091a54L51L4r7l91L60m6L1l77j14K16L20J01m17q4n54O81M75N46n22o75R2M84
2113B60M54l2o66q39J2Q91P17m82p60m18L73P27L94k33j070j08K83P99K22m51
2133G3p87J53O89m7J67k41l09M23RJ0o5J30j64l19L92l32J89K8K87K26l58o88
2155e34j3L28N61j19o28p19K82Q29L49j7p13n22M88Q61L80k99n54l36K66P34L63
$$ plain form
2176 987 332 -531 -422 -284 309 587 -337 -820 -462 -102 387 249 -145 -143 -193 -96 143 111 -210 -82 153 115
2198 115 -14 -220 63 74 176 77 -576 -179 296 372 231 -402 -503 -26 448 802 592 -122 -351 62 346
2219 346 676 308 -305 -380 -23 447 675 -71 -432 -566 -249 252 169 -13 -149 -561 -163 213 424 -31 -97
2240 -97 -34 313 100 67 -71 -12 301 40 17 -228 11 90 233 -6 -656 -230 62 445 247 -199 -591 -322
2262 -322 276 278 151 -887 -737 -434 334 735 80 -376 -471 -14 358 711 -29 -411 -566 -102 224 270 -186
2283 -186 -398 -358 -116 53 -78 -374 -662 -516 -260 -421 -330 -218 -94 133 62 210 -46 436 541 297 223
2304 223 -93 3 156 349 194 -232 -584 -277 394 507 12 -614 -675 -305 277 329 -270 -628 -590 -68 268
2325 268 367 -51 -376 -385 -39 155 309 -351 -533 -442 -67 237 -121 -153 -72 -82 118 268 3 204 170 -12 183
$$ packed form
2176I87o55q63J09J38N93K78r24m83L58L60M89j38l94Kn0R7K39l2l21J28K35l8
2198A15j29k06K83J1J02r9o53L97M75P6j41o33j01M77M74L54k10p14k29M13K84
2219C46L30l68o13p5L57M70K28p46l61j34L17N01q3j82j36m12L98L76K11m55o6
2240i7O3L47k13l3j38N9L13k61k3k45K39P9J43k39o50M26K92L83j98m46l92K69
2262c22N98Kj27j038J50L03P68M01o55m56r5M57L72L53p40l82j55M64L26M6m56
2283a86k12M0K42J69j31k96k88J46K56j61R1J12J24K27p1J48k56M82J05k44p4
2304B23l16R6J53J93j55m26l52L07O71J13m95o26o1L70N82N2n99l58L8N22L36
2325B68R9m18l25rL46J94J54o60j82R1L75L04l58l2Q1j0K00J50k65K01l4j82J95
$$ plain form
2348 183 -118 -305 -98 94 -44 -190 -240 -383 120 374 166 -42 -253 -177 333 561 216 -257 -432 13 497
2369 497 499 188 -541 -403 68 483 431 87 -288 -307 81 544 325 -50 -441 -379 -82 306 54 -50 -361 -28
2391 -28 -76 -41 135 26 43 158 56 -60 -127 195 230 212 55 -152 92 431 422 266 -83 -354 -241 161 425
2414 425 -207 -504 -322 -16 399 544 -31 -445 -431 110 421 148 -193 -370 -134 158 502 96 -6 -42 12
2435 12 370 241 278 -81 -129 196 172 -63 122 159 -192 155 7 -85 97 112 105 23 -452 -461 -233 143 155 135 -376
2460 -376 -361 -81 370 319 -82 -247 -159 111 715 424 6 -555 -248 138 189 256 -479 -495 -293 69 268 33
2482 33 -254 -475 -39 2 281 67 -257 -211 54 162 -83 32 -103 157 194 -94 116 126 119 135 -172 -6 -333
2505 -333 -24 186 440 -72 -296 -323 -63 329 356 -184 -344 -333 123 571 234 -151 -501 -230 101 281 210
$$ packed form
2348A83l01j87K07J92j38j46n0j43N03K54k08k08k11P6N10K28l45m73j75M45M84
2369D97Kl11p29J38M71M15n2l44l75j9L88M63k19l75l91O2K97L88k52j04l11L33
2391b8m8L5J76j09J7J15j02j16o7L22L5j8j57k07K44L39rj56l49k71J13M02K64
2414D25o32k97J82L06M15J45n75m14J4N41L11k73l41j77K36K92L44m06j02l6N4
2435A2L58j29L7l59m8L25k4k35J85L7l51L47j48r2J82J5pq2m75rK28L76J2k0n11
2460c76J5K80M51n1m01j65Q8K70O04k91m18n61L07L86N1O7p35j6K02L62J99k35
2482C3k87k21M36M1K79k14l24M6K65J08k45J15j35K60L7k88K10J0pJ6l07J66l27
2505c33L09K10K54n12k24k7K60L92K7n40j60J1M56M48l37l85l50K71L31J80p1
$$ plain form
2526 210 -328 -269 -266 245 343 83 -154 -358 -95 103 339 183 130 -193 -77 -32 -170 14 -175 -119 -166 -6 -115
2549 -115 -193 82 29 -208 -65 -191 -20 -247 251 47 -313 -105 47 327 81 -86 -561 -158 97 734 47
2570 47 -96 -445 -279 72 305 -153 -314 -370 -90 46 221 137 -118 -136 275 245 205 36 -210 -63 -197 -132
2592 -132 59 62 -82 189 132 -24 -112 18 62 363 -118 29 -201 -236 97 317 -406 -258 -103 -86 244 325 -30
2615 -30 -363 -280 91 552 -69 -134 -400 145 290 351 152 -99 -107 -97 410 359 222 -349 -395 -164 34 207 -80
2638 -80 311 135 174 13 423 -98 79 189 378 -47 -300 -68 39 19 -35 -162 -242 -60 19 31 -89 -159 -65
2661 -65 400 649 345 37 -84 -133 250 516 67 -137 -344 -98 266 229 104 -347 -382 -283 -7 387 -132 -391
2683 -391 31 -22 113 322 77 -117 -13 340 427 199 70 -164 44 27 -43 142 -163 305 289 132 79 -205
$$ packed form
2526B10n38N9LN11R8k60k37k04K63J98K36j56n3l23J16M5j38J84j89N6m7J60j09
2549a15p8K75n3k37J43j26J71k27M98k04l60K08J52K80k46j67m75M03K55O37o87
2570D7j43l49J66L51K33m58j61n6K80J36J75q4k55j8M11l0m0j69k46J47j34O5
2592a32J91Lj44K71n7j56q8J30M4L01m81J47k30l5L33K20p23J48J55J7L30Q1l55
2615c0l33Q3L71M61o21o5k66N45J45O1j99k51qJ0N07n1j37n71m6K31J98J73k87
2638h0L91j76L9j61M10n21J77J10J89m25k53K32J07k0n4j27q0J82P9J2j20p0R4
2661f5M65K49l04l08j21m9L83K66m49k04k07K46L64l7j25m51l5R9K76L94n19k59
2683c91M22n3J35K09k45j94J04L53Q7k28j29k34K08j7p0J85l05M68j6j57n3k84
$$ plain form
2705 -205 -92 212 263 -242 -392 -120 -45 242 227 -392 -418 -20 306 247 27 -276 -258 124 299 305 158 -181 -166
2728 -166 -80 141 206 14 -109 -652 -144 206 20 -59 -158 -449 -61 215 -84 -200 81 249 -7 -260 -103
2749 -103 32 -6 -3 172 24 -154 19 173 -64 -291 -300 -82 -148 204 106 -150 -236 -171 132 330 -183 -281 -360 -136
2773 -136 270 146 175 -206 -435 -80 356 155 -215 -423 -283 -41 105 71 -36 -89 -38 336 215 0 83 67
2795 67 24 136 157 -101 152 353 184 77 -87 -153 340 -163 -42 -313 -284 78 144 195 300 -159 -219 -172 236
2818 236 345 -241 -128 -179 131 167 229 28 -160 -257 264 245 276 71 -230 -68 -14 240 -45 -5 -252 -149 81
2841 81 89 72 13 -170 -254 11 -141 -58 -216 238 102 -361 -61 44 147 233 102 -2 -31 143 226 303 25 -91
2865 -91 -14 -142 143 292 -194 -303 -143 38 366 324 43 -360 -151 -163 465 13 99 -81 -239 -251 236 106
$$ packed form
2705b05J13L04N1n05j50K72P5K87j5o19k6L98L26n9k20l03J8L82J75Oj47l39J5
2728a66Q6K21O5j92j23n43N08L50j86p9r9k91L88K76k99j16K81J68k56k53J57
2749a03J35l8LJ75j48j78J73J54k37k27rK18o6L52r8k56q6O5L03J98n13r8p9K24
2773a36M06j24K9l81k29L55M36k01l70k08J40K42J46l4j07n3N1L74j21k15Q3j6
2795F7m3J12K1k58K53K01j69j07j64o6M93n03J21k71K9L62O6N1J05m59o0M7M08
2818B36J09n86J13n1L10L6O2k01j88r7N21j9L1k05l01J62N4K54k85M0k47J03K30
2841H1Qj7n9j83q4K65j52Q3j58M54j36m63L00J05J03Q6j31j04k9J74Q3P7k78j16
2865i1P7j28K85J49m86j09J60J81L28m2k81m03K09j2O28m52Q6j80j58j2M87j30
$$ plain form
2887 106 17 21 -373 -44 -49 181 9 -40 98 51 -146 -29 168 33 276 -14 -109 -77 -12 480 8 -119 -252
2910 -252 -417 -47 81 -18 -150 -315 192 140 288 60 -207 -61 295 105 136 45 -81 -166 12 228 288 -140
2932 -140 -124 -124 161 151 47 103 -394 125 60 77 -4 -305 -221 106 -143 182 -103 -152 286 380 -34 86 -195 31
2956 31 152 222 33 -10 8 117 348 -21 -427 -585 -92 309 128 -18 -266 -396 -20 405 34 122 -100 -155
2978 -155 169 282 107 -153 -175 61 108 193 62 -169 1 67 -102 121 -114 -234 17 84 206 237 7 -187
3000 -187 45 -55 93 -132 -43 55 194 188 -55 -135 111 139 415 173 -288 -161 177 343 386 -12 -205 -264 221
3023 221 434 73 -198 -267 -129 132 100 -322 -256 -101 -57 142 284 30 -39 -178 -7 208 -54 -121 -108 29
3045 29 -83 -58 -5 -21 79 -113 282 -184 -273 53 -117 205 10 -100 -299 -154 145 167 49 -617 -157 137
$$ packed form
2887A06q9Ml94L29nK30j72m9J38m7j97J17J97j35K43k90r5L2O5M92m72j27j33
2910b52j65L70J28r9j32j65N07n2J48k28k67J46L56j90L1r1j26q5J78K16O0m28
2932a40J6%K85j0j04N6m97N19o5J7q1l01Q4L27k49L25k85m9M38R4m14J20k81K26
2956C1J21P0j89m3J8J09K31l69m06j58M93M01j81j46k48j30L76M25l71Q8k22n5
2978a55L24J13j75k60k2K36M7Q5j31k31J70O6j69K23k35j20K51O7J22L1k30j94
3000a87K32j00J48k25Q9R8J39ok43q0K46K8K76k42m61J27L38J66M3l98j93n9M85
3023B21K13l61k71o9J38K61l2m22O6J55M4J99J42k54o9j39J71K15k62o7J3J37
3045B9j12K5N3j6J00j92L95m66q9L26j70L22j95j10j99J45K99K2j18o66M60K94
$$ plain form
3067 137 286 83 -217 -23 -328 -17 56 100 -194 -151 -141 212 177 139 -18 -222 -78 105 149 -69 100 28 39
3090 39 193 95 50 115 202 -208 71 -84 -252 -84 66 -174 -166 -49 -245 210 254 80 -111 -82 -21 341 225
$$ packed form
3067A37J49k03l00J94l05L11P3M4k94M3J0L53l5l8j57k04J44J83M4k18J69p2J1
3090C9J54r8m5O5Q7m10K79j55j68J68J50k40QJ17j96M55M4j74j91K9O1L62j16
$$ [...]
8191D2
##END NTUPLES=NMR FID
##END=
