##TITLE=1H_Ser 78-V-2
 CDCL3
 8 sc, 
 11.04.2022
##JCAMPDX= 6.0         $$ Bruker NMR JCAMP-DX V2.0
##DATA TYPE= NMR FID
##DATA CLASS= NTUPLES
##ORIGIN= UXNMR, Bruker Analytische Messtechnik GmbH
##OWNER= root
$$ XWIN-NMR		Version 3.5
$$ Mon Apr 11 15:34:33 2022 Russian Standard Time (UT+4h)  she@DPX200
##.OBSERVE FREQUENCY= 200.13135
##.OBSERVE NUCLEUS= ^1H
##.DELAY= (6, 6)
##.ACQUISITION MODE= SIMULTANEOUS
##.ACQUISITION SCHEME= undefined
##.AVERAGES= 8
##.DIGITISER RES= 18
##SPECTROMETER/DATA SYSTEM= spect
##.PULSE SEQUENCE= zg30
##.SOLVENT NAME= CDCl3
##.SHIFT REFERENCE= (INTERNAL, CDCl3, 0, 15.7039)
##AUDIT TRAIL= $$ (NUMBER, WHEN, WHO, WHERE, WHAT)
$$ ##TITLE= Audit trail, XWIN-NMR		Version 3.5
$$ ##JCAMPDX= 5.01
$$ ##ORIGIN= Bruker BioSpin GmbH
$$ ##OWNER= she
$$ F:/spectra/data/she/nmr/H-F/1/audita.txt
$$ ##AUDIT TRAIL=  $$ (NUMBER, WHEN, WHO, WHERE, WHAT)
(   1,<2022-04-11 15:33:28.17 +0400>,<she>,<DPX200>,
      <created by zg, POWCHK disabled, PULCHK disabled
       configuration hash MD5:
       00 E9 B6 7A A2 85 ED C7 34 08 36 98 17 FE 4E 26
       data hash MD5: 16K
       25 49 BF 5B 8F 4B 35 65 63 3C 96 4E FC 13 6F 43>)
$$ ##END=
$$ 
$$ hash MD5
$$ D4 F0 09 CE C8 E2 AB D0 7C 62 91 D3 2F B5 5F 1F
##$RELAX= 
##$RELAX= 
##$RELAX= 
##$RELAX= 
##$RELAX= 
##$RELAX= 
$$ Bruker specific parameters
$$ --------------------------
##$DU= <F:/spectra>
##$EXPNO= 1
##$NAME= <H-F>
##$PROCNO= 1
##$TYPE= <nmr>
##$USER= <she>
##$AMP= (0..31)
100 100 100 100 100 100 100 100 100 100 100 100 100 100 100 100 100 100 
100 100 100 100 100 100 100 100 100 100 100 100 100 100 
##$AQSEQ= 0
##$AQ_mod= 1
##$AUNM= <au_zg>
##$AUTOPOS= <>
##$BF1= 200.13
##$BF2= 200.13
##$BF3= 200.13
##$BF4= 200.13
##$BF5= 200.13
##$BF6= 200.13
##$BF7= 200.13
##$BF8= 200.13
##$BYTORDA= 1
##$CFDGTYP= 0
##$CFRGTYP= 5
##$CHEMSTR= <none>
##$CNST= (0..31)
1 1 145 1 1 1 1 1 1 1 1 1 1 1 1 1 1 1 1 1 1 1 1 1 1 1 1 1 1 1 1 1 
##$CPDPRG= <>
##$CPDPRG1= <>
##$CPDPRG2= <>
##$CPDPRG3= <>
##$CPDPRG4= <mlev>
##$CPDPRG5= <mlev>
##$CPDPRG6= <mlev>
##$CPDPRG7= <mlev>
##$CPDPRG8= <mlev>
##$CPDPRGB= <>
##$CPDPRGT= <>
##$D= (0..31)
0 1.2 0 0 0 0 0 0 0 0.06 0 0.03 0 0 0 0 0.0002 0 0 0 0 0 0 0 0 0 0 0 0 
0 0 0 
##$DATE= 1649676807
##$DBL= (0..7)
120 120 120 120 120 120 120 120 
##$DBP= (0..7)
150 150 150 150 150 150 150 150 
##$DBP07= 0
##$DBPNAM0= <>
##$DBPNAM1= <>
##$DBPNAM2= <>
##$DBPNAM3= <>
##$DBPNAM4= <>
##$DBPNAM5= <>
##$DBPNAM6= <>
##$DBPNAM7= <>
##$DBPOAL= (0..7)
0.5 0.5 0.5 0.5 0.5 0.5 0.5 0.5 
##$DBPOFFS= (0..7)
0 0 0 0 0 0 0 0 
##$DE= 6
##$DECBNUC= <off>
##$DECIM= 32
##$DECNUC= <off>
##$DECSTAT= 4
##$DIGMOD= 1
##$DIGTYP= 9
##$DL= (0..7)
0 120 120 120 120 120 120 120 
##$DP= (0..7)
150 150 150 150 150 150 150 150 
##$DP07= 0
##$DPNAME0= <>
##$DPNAME1= <>
##$DPNAME2= <>
##$DPNAME3= <>
##$DPNAME4= <>
##$DPNAME5= <>
##$DPNAME6= <>
##$DPNAME7= <>
##$DPOAL= (0..7)
0.5 0.5 0.5 0.5 0.5 0.5 0.5 0.5 
##$DPOFFS= (0..7)
0 0 0 0 0 0 0 0 
##$DQDMODE= 0
##$DR= 18
##$DS= 0
##$DSLIST= <SSSSSSSSSSSSSSS>
$$ [...]
##$SUBNAM2= <"">
##$SUBNAM3= <"">
##$SUBNAM4= <"">
##$SUBNAM5= <"">
##$SUBNAM6= <"">
##$SUBNAM7= <"">
##$SUBNAM8= <"">
##$SUBNAM9= <"">
##$SW= 18.05172834244
##$SWIBOX= (0..15)
0 0 2 0 0 0 0 0 0 0 0 0 0 0 0 0 
##$SW_h= 3612.71676300578
##$TD= 16384
##$TD0= 1
##$TE= 0
##$TE2= 300
##$TE3= 300
##$TEG= 300
##$TL= (0..7)
0 120 120 120 120 120 120 120 
##$TP= (0..7)
150 150 150 150 150 150 150 150 
##$TP07= 0
##$TPNAME0= <>
##$TPNAME1= <>
##$TPNAME2= <>
##$TPNAME3= <>
##$TPNAME4= <>
##$TPNAME5= <>
##$TPNAME6= <>
##$TPNAME7= <>
##$TPOAL= (0..7)
0.5 0.5 0.5 0.5 0.5 0.5 0.5 0.5 
##$TPOFFS= (0..7)
0 0 0 0 0 0 0 0 
##$TUNHIN= 0
##$TUNHOUT= 0
##$TUNXOUT= 0
##$USERA1= <user>
##$USERA2= <user>
##$USERA3= <user>
##$USERA4= <user>
##$USERA5= <user>
##$V9= 5
##$VALIST= <valist>
##$VCLIST= <CCCCCCCCCCCCCCC>
##$VD= 0
##$VDLIST= <DDDDDDDDDDDDDDD>
##$VPLIST= <PPPPPPPPPPPPPPP>
##$VTLIST= <TTTTTTTTTTTTTTT>
##$WBST= 1024
##$WBSW= 4
##$XGAIN= (0..3)
0 0 0 0 
##$XL= 0
##$YL= 0
##$YMAX_a= 243823
##$YMIN_a= -396195
##$ZGOPTNS= <>
##$ZL1= 120
##$ZL2= 120
##$ZL3= 120
##$ZL4= 120
##$ABSF1= 10
##$ABSF2= 0
##$ABSG= 5
##$ABSL= 3
##$ALPHA= 0
##$AQORDER= 0
##$ASSFAC= 0
##$ASSFACI= 0
##$ASSFACX= 0
##$ASSWID= 0
##$AUNMP= <proc_1d>
##$AZFE= 0.1
##$AZFW= 0.1
##$BCFW= 1
##$BC_mod= 2
##$BYTORDP= 1
##$COROFFS= 0
##$CY= 11.3945322036743
##$DATMOD= 1
##$DC= 2
##$DFILT= <>
##$DTYPP= 0
##$F1P= 2.36226072786647
##$F2P= -0.459571619588291
##$FCOR= 0.5
##$FTSIZE= 0
##$FT_mod= 4
##$GAMMA= 1
##$GB= 0.15
##$INTBC= 1
##$INTSCL= 1
##$ISEN= 128
##$LB= 0.24
##$LEV0= 0
##$LPBIN= 0
##$MAXI= 10000
##$MC2= 0
##$MEAN= 0
##$ME_mod= 0
##$MI= 1.114404
##$NCOEF= 0
##$NC_proc= 0
##$NLEV= 6
##$NOISF1= 3.799351
##$NOISF2= 2.8
##$NSP= 1
##$NTH_PI= 0
##$NZP= 0
##$OFFSET= 15.70392
##$PC= 1
##$PHC0= -18394.73
##$PHC1= 23.20078
##$PH_mod= 1
##$PKNL= yes
##$PPARMOD= 0
##$PSCAL= 0
##$PSIGN= 0
##$REVERSE= no
##$SF= 200.130013532006
##$SI= 16384
##$SIGF1= 3
##$SIGF2= 2
##$SINO= 400
##$SIOLD= 16384
##$SREGLST= <1H.CDCl3>
##$SSB= 0
##$STSI= 0
##$STSR= 0
##$SW_p= 3612.71676300578
##$SYMM= 0
##$S_DEV= 0
##$TDeff= 0
##$TDoff= 0
##$TI= <>
##$TILT= no
##$TM1= 0
##$TM2= 0
##$TOPLEV= 0
##$USERP1= <user>
##$USERP2= <user>
##$USERP3= <user>
##$USERP4= <user>
##$USERP5= <user>
##$WDW= 1
##$XDIM= 8192
##$YMAX_p= 0
##$YMIN_p= 0
$$ End of Bruker specific parameters
$$ ---------------------------------
##NTUPLES= NMR FID
##VAR_NAME=  TIME,          FID/REAL,        FID/IMAG
##SYMBOL=    X,             R,               I
##VAR_TYPE=  INDEPENDENT,   DEPENDENT,       DEPENDENT
##VAR_FORM=  AFFN,          ASDF,            ASDF
##VAR_DIM=   8192,          8192,            8192
##UNITS=     SECONDS,       ARBITRARY UNITS, ARBITRARY UNITS
##FACTOR=    0.0002768,     1,               1
##FIRST=     0,             0,               0
##LAST=      2.2672688,     0,               0
##MIN=       0,             -396195,         0
##MAX=       2.2672688,     243823,          0
$$ Real data points
##PAGE= N=1
##DATA TABLE= (X++(R..R)), XYDATA
$$ [...]
1787c57m12R93N32l28p46l85J73M23M20J10m87m35p4j7O82O57k84n59k20qO34
1808C12K97L22l87q60k05M21L93K99l27l05k50M75L17K11km27o20k24P15N82n48
1829A89L0k94n30K61M37O50o85k32m32M1N38K88j68k6m45m81P44N66L5k73n01
1850b88j65k9Q41n7r0m99j95m79L14O92o6m24m18k15O32R9J75J09o32l74K34P55
1872h0N07r7n05l56J74N60j5N16j89n48k55O16M18mp3o01m0j88M08L6K72m07p51
1895f02J27K94M12J03l9o62r4J68O26L23J19q35k43K22P24L77k25l44m33k33L41
1916A26J05L18J96q98l65K0N71L25k34m39k70k41L97R31K50o74m58K10J00M31
1936D01J51k19l17k31J83K87L96p3o22j45J8j06N80J18k78l77m22Q3L68N55k32
$$ plain form
1787 -357 -769 224 756 428 -318 -703 -530 -107 313 423 -64 -499 -573 -590 92 749 465 -94 -314 -322 312
1808 312 609 931 544 -316 -521 -100 293 592 265 -40 -290 185 502 713 711 284 -336 -560 155 737 189
1829 189 219 -75 -605 -344 93 743 58 -174 -606 -565 -27 261 93 67 -378 -859 -115 451 486 213 -288
1850 -288 -453 -482 359 302 212 -287 -482 -961 -647 45 -21 -445 -863 -1078 -446 -347 -172 -63 -695 -1069 -835 -80
1872 -80 427 330 -175 -531 -357 203 188 704 515 -33 -288 328 746 742 669 68 28 -160 248 284 556 149 -602
1895 -602 -475 -181 231 334 295 -367 -461 -293 333 656 775 -60 -303 -81 643 1020 795 451 18 -215 126
1916 126 231 549 745 -153 -518 -498 73 398 164 -275 -545 -786 -389 542 792 118 -340 -130 -30 401
1936 401 552 333 16 -215 -32 255 651 578 -44 -189 -171 -277 303 421 143 -234 -656 -573 -205 350 118
1957A18l25k98K31mN07L6k57k38l78j08O06K74r8n86k7QM69K12K65m06k68O4M43
1980B40K82Ol87l73j29J67L59L22nm30o82L80J11N56k28l05j56l19N01L91n7q3
2002A61m52l36N94M32N71o91m0R7j45K39M69k04m35m33j7M6L39N4k75n38P7m4
2024e31J97M13r6l49Q4m67L56P23ml78q1j99J48L98O69l88o26j8l9N59O2j63j60
2047A10m92m5J81L23M6l36m83J72M9K53M8K96n29k5K26J44O22ml71k30k41J37
2069a49K58m5M49o72L5L37K3J66j41r1l72j58K74J6M38p2n12o5J39J29N3L24o93
2092c29j4j76J50P58k03m42k54j94P07L70R3j78l59n42N21K21J48o6j86j95K0
2113a50N39J21n19L03k46r06N64K70lj88j20k84K80K81K27j32m8o76k2N59M58
$$ plain form
1957 118 -207 -505 -274 -278 229 265 8 -230 -608 -716 -110 164 66 -520 -547 -539 -70 142 407 1 -267 -203 240
1980 240 522 528 141 -232 -361 -194 165 487 482 52 -630 -250 -139 417 189 -116 -272 -591 -90 301 244 161
2002 161 -291 -627 -33 399 970 279 239 336 191 430 899 695 260 -173 -190 -144 195 249 -26 -564 -487 -531
2024 -531 -334 79 -17 -366 -282 -749 -393 330 326 -52 -133 -332 -184 214 883 495 -131 -149 -188 371 433 270 110
2047 110 -382 -427 -246 77 123 -213 -696 -524 -475 -222 -174 122 -407 -432 -206 -62 560 556 185 -45 -286 -149
2069 -149 109 64 513 -159 -124 213 236 402 261 170 -202 -360 -86 -70 368 296 -216 -281 -142 -13 40 364 -329
2092 -329 -343 -519 -369 389 186 -256 -510 -704 3 373 466 288 -71 -613 -92 129 277 211 25 -170 -150
2113 -150 389 510 -9 294 48 -858 -294 -24 -27 -215 -335 -619 -339 -58 169 37 -11 -687 -709 -150 308
2134C08O2m8j92j99K98K65L4P3l9m12r4J72N9j96j21k64l01L20P2Q1K8m26J38
2157c82J60K25N53J02r58R8N07m29O21O7l05J9j67J65j0M67m43l99q2q4K24r3
2179a44K84o26j28L99L6L01K13p5l01J4K76J71n0J92q59J03jj25L89M3j20k04
2201b12q3kP47k2k71j27m3k50N18j97K47l16j10k13K02L78k52j22l94q1LK28J90
2224a82j70j68j37K86N56J13k01k04J01l39M70K85j78j36L0l57K2N52j01l7p0
2245A35j2k69K16K73j98p6j92j98J8M35j64K78j65k79N0K52L06J48k93l63K53
2266A55K63J67Q6j35l24j48m5J08K72j73l10k8j68M38k30L32n48k85j00R3L49
2287b31O2J93j52O1J44K11R9m0p4k47j76J24K23J90m54ko8J29P8K28l66J25m17
$$ plain form
2134 308 370 322 130 -69 229 494 528 601 562 150 56 228 287 91 -30 -294 -595 -275 -203 -122 -94 -520 -382
2157 -382 -222 3 556 658 -300 -202 305 -124 497 564 259 278 111 276 266 733 290 -109 -191 -275 -51 -144
2179 -144 140 -486 -614 -215 -179 122 335 260 -41 -27 249 420 370 562 -297 -194 -195 -320 69 112 -8 -212
2201 -212 -295 -297 450 428 157 30 -13 -263 255 58 305 -11 -121 -334 -132 246 -6 -128 -522 -603 -600 -372 -182
2224 -182 -352 -520 -657 -371 185 298 97 -107 -6 -345 125 410 232 96 126 -231 -209 343 242 205 135
2245 135 123 -146 70 343 145 69 -123 -321 -303 132 -32 246 81 -198 -148 104 410 558 265 -98 155
2266 155 418 585 671 536 212 64 19 127 399 226 -84 -112 -280 158 -72 260 -288 -573 -673 -580 -231
2287 -231 -169 24 -128 -67 77 288 387 347 273 26 -150 -26 197 387 -67 -69 -137 -8 70 298 -68 57 -360
2310c60K15K33q1K8k40j18O9K6L36K04k86l42j44J22K56J24J47q35L87J86l5J25
2332A7L6j93R6j07J5J18R9m27J9J56k42N62j8k55k23K49j12J21r9O6j82Q2q8Q7
2356b23J89M51k52l6p5L0J30J06P2j37%m04K16J79J84j84k02k07k2L64K47m44
2378a8n0l60J80M25j5k7j68l10N3K06J50q7k4j4j84N8M96k30K39j90k82K03LN9
2402A13J52m38J64j81o2J95K71k94K8m58L3L07J01k07J43k07J22J32J13J66N0
2423B43j9k55J22K42j07J23k65k82L93J4j39K90j84m93K00q5K23MP2l35j87n9
2445d84L83K01j76J70m01K89l5N7K04r3k01L6J02J40K58j37l21j37K4J94J75r1
2467A57l04l6jM7kL37j36l89k9K34K90j63J58j36k76O3J15L13J64o2n55K35Kj7
$$ plain form
2310 -360 -145 88 7 35 -205 -323 -254 -228 108 312 26 -316 -460 -338 -82 42 189 -646 -259 -73 -108 17
2332 17 53 -140 -44 -151 -136 -18 81 -346 -327 -171 -413 149 131 -124 -347 -98 -210 -89 -188 -122 -304 -222 -310 -223
2356 -223 -34 417 165 129 54 84 214 320 392 255 255 -149 67 246 430 246 44 -163 -185 179 426 -18
2378 -18 -68 -428 -248 177 162 135 -33 -343 -290 -84 66 -21 -45 -59 -243 -185 311 81 320 130 -152 51 54 113
2402 113 265 -173 -9 -190 -252 -57 214 -80 -52 -510 -477 -170 -69 -276 -133 -340 -218 -86 27 193 243
2423 243 224 -31 91 333 226 349 84 -198 195 209 70 360 176 -317 -117 -202 21 25 97 -238 -425 -484
2445 -484 -101 100 -76 94 -307 -18 -53 4 208 115 -86 -50 52 192 450 313 -8 -145 -121 73 248 157
2467 157 -147 -183 -184 -137 -139 198 62 -327 -356 -122 168 5 163 27 -249 -186 -71 242 406 344 -211 24 26 9
2491IK46k47j48J31M3J03L82n41q9op6J81J71k74J08m37L57j21L06lm26J81l33
2514d83P1K01K25j72K06k74j03M15K81k79J01j02j01r7J90K90O1l79l09n7J19
2535a96N49l55J04k39k33K42j38M69j25k44Lj08L70K15j93m6k39PJ00K70Q2l79
2557h4J45m9K53N6Rj80l81Q9l3J67k2J50k52j89N4j4K29J84j89o9n08L83K08O9
2581B6j4j4r5k65K20K83O6j37R5k77l8J89O0J69l50l6j12P9K89P6o25L18J09j44
2605a28K60o5k79k35L90n9L70K30k19l94J52o0J41J2M6k13m0K6o9J89K1K30k98
2628Hj7j39J91M05j88q2j96j39L72j06R7j8j68n11L89J24l9j07j52j62m7M29j00
2651a56J50r3J63j21K77q2J95k7j24l8o9q9J24K87p87J1K39k3K64j94j1k14j2
$$ plain form
2491 9 255 8 -140 -9 34 137 519 -22 -111 -117 -193 -12 159 -115 -7 -444 -87 -208 98 95 -331 -150 -483
2514 -483 -412 -211 14 -158 48 -226 -329 86 367 88 189 87 -14 -111 79 369 430 51 -258 -315 -196
2535 -196 353 -2 102 -137 -370 -128 -266 203 78 -166 -163 -271 99 314 121 75 -164 -157 -57 213 295 -84
2557 -84 61 12 265 321 330 150 -231 -142 -175 -8 -30 120 -132 -321 -267 -281 -52 132 -57 -126 -634 -251 -43 26
2581 26 12 -2 -97 -362 -142 141 207 70 165 -112 -150 39 99 268 -82 -118 -230 -151 138 214 -411 -93 16 -128
2605 -128 132 67 -212 -447 -57 -116 254 484 265 -129 23 -37 104 116 162 -51 -91 -65 -134 55 76 306 8
2628 8 -9 -148 43 448 260 178 -18 -157 215 109 206 188 20 -491 -102 22 -17 -124 -276 -438 -485 -56 -156
2651 -156 -6 -99 64 -57 220 138 333 306 182 144 75 -14 110 397 -390 -379 -140 -163 101 -93 -104 -318 -330
2674c30l4K33K87P2j75j67Q4K59o6k32Q2P6J07Q5j78PJ08j35k11m7j6jj21j16
2698d29J55j54K76L45k15j23L29l21o8J80n3R4j33j66J04K80K20K5j30j36J70
2719B50n5L09l72k09r1JJ79J18O0q3k29r4m6J76J50l5K9m10K2M98J34k81Q5j52
2743d6L7J67j06K26j77m90N14j56j07L43k40L0k27J43K2K7N0R6m04J56m1R9L26
2766B42j81m15L89k96NK59Ok90J38KJ80N0j15Q0j17l37K90K72j53K21j66o3j55
2789a54M08j47J34k05q3m7l7L52k81k6Lj58jJ57p9M6kJ42j07Q8k7R1j46P9j6J88
2815A72J02j56r3L85n01j14N45j87j04o4Ok89J69J93P4k67k18P0J93p7K39M3r9
2838B2k3j29m6L97o3R0l25PK63o4J34L14m70P9l49K3K60K80l51k78O3K16k84K22
$$ plain form
2674 -330 -364 -131 156 228 53 -114 -30 229 163 -69 13 89 196 281 103 110 218 83 -128 -175 -191 -192 -313 -429
2698 -429 -274 -428 -152 193 -22 -145 184 -137 -205 -25 -78 16 -117 -283 -179 101 321 346 216 80 250
2719 250 195 504 132 -77 -168 -167 12 130 190 107 -122 -216 -262 -86 64 29 58 -352 -330 168 302 21 106 -46
2743 -46 -9 158 52 278 101 -389 125 -31 -138 205 -35 -5 -232 -89 -67 -40 10 106 -298 -142 -183 -84 242
2766 242 61 -354 35 -261 -256 3 9 -281 -143 -141 39 89 -26 54 -63 -400 -110 162 9 230 64 1 -154
2789 -154 254 107 241 36 -47 -94 -131 221 -60 -86 -83 -241 -242 -85 -164 -118 -120 22 -85 3 -24 67 -79 0 -16 172
2815 172 274 118 25 410 -91 -205 340 153 49 -15 -9 -298 -129 64 138 -129 -347 -277 -84 -161 78 121 22
2838 22 -1 -130 -176 221 158 248 -77 -70 193 129 263 577 107 186 -163 -140 120 400 49 -229 -166 50 -234 -12
2862a2N3j74q5O6k5K61r3p3p9P0n0p1J84K15M8l34J26mK19j74n3O6r7l9J73Q6
2888B04m78K36m18K1L46J50k06r8J77J18q0j1J22q2R3l00KM53r0j49J46j74K76
2911B58j27L07j38k63J43q0q9j23L95j40K6J09j43j34N4J14j57l0j58J41Q7J26
2933A78j56Ok76L34j02K72m07J13oJ67J4j85M65j08m21Q6J01jN4o6j79J25p5M2
2957b5L37l76j02j05Q1K85P5k61kl42R8M69p1l1J6K9k6o5L13k19J92l96K39R1
2981B04l39R7J03P0l55L2K82r8J72j81j59L99l58j88L28n9J58k46n7J31J83n7
3003F2J7k18M3Q5J34J11o5J75j53j41J41j83K07m81J10O4q0K74r8R5l45Q2J08
3026e6L7p9J6K20k59J37m4m9J43K96k19l06J46o2J75K46m90J64p0L32j42Q5m37
$$ plain form
2862 -12 41 -133 -218 -152 -177 84 -9 -82 -161 -91 -141 -212 -28 187 235 -99 27 23 242 68 15 81 -16 -55 118 204
2888 204 -274 -38 -456 -435 -89 61 -145 -243 -66 52 -28 -39 83 1 94 -206 -204 249 159 10 156 -18 258
2911 258 131 438 300 37 180 100 11 -112 283 143 169 278 135 1 55 169 12 -18 -176 -35 52 178
2933 178 22 28 -248 86 -16 256 -151 -38 -44 123 137 -48 417 309 -112 -26 75 74 128 62 -117 8 -67 -25
2957 -25 312 -64 -166 -271 -190 95 170 -91 -93 -435 -337 132 61 30 46 75 49 -16 297 78 270 -126 113 204
2981 204 -135 -38 65 135 -220 -188 94 -4 168 -13 -172 227 -131 -319 9 -50 108 -138 -195 -64 119 62
3003 62 79 -139 -96 -11 123 234 169 344 191 50 191 8 215 -266 -156 -92 -172 102 4 99 -246 -164 -56
3026 -56 -19 -98 -82 138 -121 16 -28 -77 66 362 143 -163 -17 -79 96 342 -148 16 -54 278 136 221 -216
3049b16p3K49jP5J23j79o7j65r2L61Q9r4M3k83J70K51j55K73j59k28M2J02J63
3072B29k2o9J38l14J83O2r6m0j2J7k46M48m69L58n6k73j5M5J8J35r4K8j99K41
3096cMR9J4j53l6j2K18Q5P3j95J8Kl9O2K06j75k15j6M0P3l7J88k48K1K32j9l74
3123a87O6O1k71L16k33J66R4J30mm47O8J06P9K05P1l61K21J07r2l5K08l78K44
3146A34n2k19n0M05j98n8l14L92k24K56k73o3j75K75K35J17k65N6P5o2o5K77k06
3169bk1K21n1K60k73M24n86lJ35j9l1r1K56j65r7j15j62M04j18M0R3k75R7L6Q5
3194D2K2j42o9mK75pk1q8J32P3k53r7N3J51L0r2K2mN5l28K04K9Q1k03J31j54K11
3221D9m3j51j06J64J60Nj12j07J85k47K35P1j91K89k17K14p3J38q3J9o6j07N1
$$ plain form
3049 -216 -289 -40 -41 34 157 -22 -89 -254 -346 15 104 10 53 -230 -60 191 36 309 150 -78 -36 66 229
3072 229 207 138 276 -38 145 207 111 71 59 76 -170 278 -191 167 111 -162 -177 -132 -114 21 -73 -45 -244 -3
3096 -3 1 100 114 -39 -75 -87 131 216 289 94 112 114 75 137 343 168 -47 -63 -23 50 13 201 -47 -26 206 187 -187
3123 -187 -121 -60 -331 -15 -248 -82 12 142 138 -309 -241 -135 -56 149 220 -141 80 187 95 60 268 -110 134
3146 134 82 -137 -187 218 20 -38 -352 40 -184 72 -201 -264 -439 -164 71 188 -77 -21 54 -8 -73 204 -2
3169 -2 -23 198 147 407 134 558 -28 -31 104 85 54 -37 219 54 -43 -158 -320 84 -34 6 99 -176 -79 -43 42
3194 42 64 -78 -147 -151 124 117 96 8 140 213 -40 -137 -84 67 97 5 27 23 78 -250 -46 -17 64 -139 -8 -162 49
3221 49 6 -145 -251 -87 73 78 -34 -141 44 -203 32 103 -88 201 -16 198 125 263 180 199 133 26 77
3244G7j15L7n6j23q1K67m1J41n4j9j27R5k0j13M9k37J49K04J7J4l6k14K59K9j86
3269h4P6n7j23K34m1L5O2Q9K9n4j80k39K89K10pk90k2o4NMn5K62j60j1K67J3k36
3296d8J18p4J89q8J3Q6l0p5j81K40k49L12j71N7j74J60l05J18J3N2j98j03M35
3319I7k78K77m49K18J05k03M84j75p8Q1q7k87J89J86LO2j30k56J39P1Q0j2J83
3342B20m07J5J68n6K67j04o8j99R7J77j93PJ84k33J91J1P8Jj17k56K76j02J46
3365A03j9K27l49j77L79j39Q2q4P0J3j80J64k25J11j80k35N47l95N42m35K56k61
3387a85JJ44J49j36Pj31K30k06L10q1j80L05l02k6L6j10P6L16k98k5O1O6J37k60
3411a02L06k74k77K88k6L5J17k87K78J12m24K40J91j89n2j16K52l01J45J14Q3
$$ plain form
3244 77 -38 -1 -57 -180 -261 6 -35 106 52 33 -94 1 -19 -132 -83 -320 -171 33 50 64 28 -186 73 102 -84
3269 -84 -8 -65 -188 46 5 40 102 191 220 166 -14 -253 36 246 239 -51 -73 -137 -132 -128 -183 79 -81 -92 175 188 -48
3296 -48 70 -4 185 97 110 196 166 91 -90 150 -99 213 42 99 -75 85 -220 -102 -89 -37 -235 -338 97
3319 97 -181 96 -353 -135 -30 -233 251 76 -2 79 -8 -295 -106 80 83 145 15 -241 -102 -31 49 37 220
3342 220 -187 -172 -4 -60 207 103 35 -164 -67 110 -83 -76 108 -125 66 77 155 156 39 -217 59 -43 103
3365 103 84 311 -38 -215 164 25 107 23 93 106 -74 90 -135 -24 -204 -439 108 -287 255 -180 76 -185
3387 -185 -184 -40 109 -27 -20 -151 79 -127 183 102 -78 227 -75 -101 -65 -175 -99 217 -81 -106 -45 21 158 -102
3411 -102 204 -70 -347 -59 -85 -50 67 -220 58 170 -254 -14 177 -12 -64 -180 72 -229 -84 30 113
3432A13p7j28J20L0p8K7j39O9K45m1J99l54j73P4Q5J9o3M6k04J81K80k67N2j8
3456bj14K91j55q8J58l3K04k83%K63J73j96j38j51k9Pj53kK39k78M31K4k75KJ09
3481Dj13M2K28m53L10J5J68J1j22p7j5k6N5Q6r3K03k57J70m8o5j26j69L44j74
3505a02j3J46j13P6J22j31J68l0k44j00O6K66o1j89K09N9r1j30M4J51J89k30j35
3528g3Q5M4J03K25j56j32j86O9O4p7J03j59j59M33l60K80K6p8j91l6K51k02K39
3551A13O0l82J59kL14j69M2p4k37p7M59j13k2J8k71J43j15J48K06j47j03j77K49
3574B2q1J24j05P2j31K63j42k50J17K73k10k39K20J84J27k64J05r2j41J66J15
3595A33n3l6p3l4J19j12j5J89l36J86O6J45j24J69k44j04l7r0L10orj61L9J3K91
$$ plain form
3432 113 36 -92 28 58 -20 7 -132 -63 182 141 340 -14 -187 -113 -28 -9 -72 -26 -230 -49 231 -36 16 -2
3456 -2 -116 175 20 -68 90 57 261 -22 -22 241 414 218 80 -71 -100 -93 -246 -248 -9 -287 144 168 -107 -105 4
3481 4 -109 -67 161 -292 18 33 201 212 90 13 -2 -28 27 113 20 223 -34 136 88 23 -103 -272 72 -102
3505 -102 -115 31 -82 -6 116 -15 153 123 -121 -221 -155 111 50 -139 70 129 38 -92 -48 103 292 62 -73
3528 -73 12 56 159 384 228 96 -90 -21 43 -34 69 -90 -249 184 -176 104 130 52 -139 -175 76 -126 113
3551 113 173 -209 -50 -52 262 93 135 61 -176 -253 206 93 71 89 -182 -39 -154 -6 200 53 -50 -227 22
3574 22 -59 65 -40 32 -99 164 22 -228 -111 162 -48 -287 -67 117 244 -20 85 -7 -148 18 133
3595 133 80 44 -29 -63 56 -56 -71 118 -218 -32 34 179 55 224 -20 -124 -161 -251 59 53 44 -117 -78 -65 226
3620B26j09J06k60K30k37J27n5l9P5r3M2pq6N84n66j88N47l84J1O9J15P8k85j2
3644a11r3M17j44j4j44J96MN1P8j64r6P2n6R0oJ12K6m30K73P3O9j29n8r2j34p9
3670b89K4K31K6J5j05K19k96L36r1J13m83k1J58K41M5m7O8k38J45o0j89K18n4
3693c4j83k8J64O4j00J44j61r1Q6K31k38K13r5k14J14K37j5l79J21M95n59J30
3715i8J79J33k96K7O1j98L52J87l25J06k97K25K2k80M35j22o5l93L37r4M3P2j20
3738a09J66m9j44J3J83l91K79J6kJ34J44k85J05k71J16K38j22M4k49L35q6l37
3760b72M22j94J23j68O2j30j25L70j66r1N7K00p5j24j88L92j35M7k5Q7p0k9j48
3783a80K27o1Q3p7j77O6JO8p0J16j29P8k17L45k0n9K10j24l42J85N3K5l19J8Q8
$$ plain form
3620 226 117 223 -37 193 -44 83 28 -11 64 -29 13 6 -80 504 -62 -250 297 -87 -76 -7 108 186 -99 -111
3644 -111 -204 213 69 55 -89 107 111 162 240 76 -20 52 -4 86 80 192 218 -212 61 134 203 74 16 -76 -210 -289
3670 -289 -265 -34 -8 7 -98 121 -175 161 70 183 -300 -321 -163 78 123 76 144 -94 51 -9 -198 20 -34
3693 -34 -217 -245 -81 -17 -117 27 -134 -225 -139 92 -146 67 -28 -242 -128 109 94 -285 -164 331 -228 -98
3715 -98 81 214 -82 -55 6 -192 160 347 22 128 -169 56 78 -202 233 111 46 -347 -10 -104 -61 11 -109
3738 -109 57 8 -136 -123 60 -331 -52 -36 -38 96 240 -45 60 -211 -95 143 21 65 -184 151 65 -272
3760 -272 150 -44 79 -89 -27 -157 -282 88 -78 -169 -112 88 13 -111 -299 93 -42 5 -20 67 -3 -32 -180
3783 -180 47 -14 69 -8 -185 -119 -118 -50 -120 -4 -133 -55 -272 73 53 -6 204 80 -262 -77 -24 1 -318 -300 -212
3808b12R6l0K58j95j46K85j75P4J33m0K97m60mM7K89l5k35O0j34k9M3J75Q7mP1
3833B16k11j47J4O8l0J10L13l94l9K58n3j55J08j64K20k6q6Lj03o1k3K21J14j75
3857b2J65j90J35j88O8J4L52n06j02K17K22l45J37nj20r7J95J86R1j71K9k7Kq6
3881d6p5L94k60J8N4O5j27n4J50j49n2K36r2L4j14O8k74J19J63j21K68l76k1J7
3905a75M3M38k01k11K89m39J27K08j61L09n61K12j5K80j3j66J37J14l61K54q5
3926B3JP8j39j5m7K47L1k67l7J56j27n9P9J57P0j11j56L93j89j04O3q5J84o6O5
3951A45k51J52j33R2L0o5P7k6R7j12j31J62j65J8N3J80k68K37l03J18J9N9j03
3974a18J09L7j37L7Q4J30k82j7J83k8J68m18K56R3j59q1J95q2R2M3o6RQ1k28L0
$$ plain form
3808 -212 -116 -146 112 -83 -229 56 -119 -45 88 48 345 -115 -119 -72 217 182 -53 7 -127 -156 -113 62 149 145 216
3833 216 5 -142 -128 -60 -90 20 333 -61 -100 158 105 -50 58 -106 114 88 2 5 -98 -159 -182 39 153 -22
3857 -22 143 -47 88 -100 -32 -18 334 -172 -274 -57 165 -180 -43 -48 -168 -265 -70 116 207 36 65 38 40 -46
3881 -46 -121 273 13 31 85 150 23 -31 119 -30 -82 154 62 96 -18 50 -224 -105 58 -63 205 -171 -192 -175
3905 -175 -132 306 105 -106 183 -256 -129 79 -82 227 -334 -122 -137 143 130 -36 101 215 -146 108 23
3926 23 24 102 -37 -52 -99 148 179 -88 -125 31 -96 -155 -76 81 151 40 -116 277 88 -16 47 -38 146 80 145
3951 145 -106 46 -87 5 35 -30 47 21 118 6 -125 37 -128 -110 -57 123 -145 92 -211 -93 -74 -15 -118
3974 -118 -9 28 -109 -72 12 142 -140 -157 26 -2 166 -252 4 97 -62 -143 52 -30 62 105 39 48 129 -99 -69
3999f9J02L9J5O3o6Kj81n9L11j92K18j81O0J6pJ48n3nq9lp8j20R5n1J71j52J50
4026H4k05O2J03j32N7o9K24j64r1K60J7k65J57J00o8o1P4j91Q4M1j19L57k64j11
4050a20P1j25J72o2j32K08j52L6L10r2o7m3n5J76j57J21j47O1M1N2j25O8P3j11
4074Ap7J99j54J05p8o2p0J62J2j1p3N3q2J19q7K18j8j0k24L8J49k07R8j22K59
4099A38m7j23j27R2J20L6P4P5j03n9j2m3J1l1p9j92K49j43J78k37M14l19n0J13
4123f5K57Q7j42l42J45P6k7M1mk69K26j83K26M33l27l4r3J3J02J6J37m83K05j45
4147a50K07P5j59l29M62j74M0k3J80j44r9K17k73L27l2p4q9K67m08K30N1J1Rr1
4171C1J93j44r5p2K21j17K02k17L7J08j72j80J67J69k20J37L1k09l2J46L4r1K31
$$ plain form
3999 -69 33 72 87 150 84 86 -95 -154 157 -35 183 2 62 78 71 219 166 161 72 69 -9 -129 -34 -85 86 -66 84
4026 84 -121 -59 44 -88 -31 -100 124 -40 -131 129 146 -119 38 138 70 9 83 -108 -24 17 -102 255 -9 -120
4050 -120 -49 -174 -2 -64 -196 12 -140 -104 206 114 47 4 -51 125 -32 89 -58 3 44 96 -29 39 112 1
4074 1 -76 123 -31 74 -4 -66 -136 26 38 27 -46 7 -75 44 -43 175 157 147 -77 -39 110 -97 1 -121 138
4099 138 91 -32 -159 -67 53 89 163 238 135 76 64 21 32 1 -78 -270 -21 -164 14 -223 191 -128 -178 -65
4123 -65 192 279 137 -205 -60 16 -11 30 26 -243 -17 -200 26 459 132 98 5 18 120 136 273 -210 -5 -150
4147 -150 57 132 -27 -356 106 -68 -28 -51 129 -15 -114 103 -170 157 125 51 -38 229 -179 51 102 113 122 31
4171 31 224 80 -15 -87 134 17 219 2 39 147 -25 -205 -38 131 -89 48 79 -130 -162 -16 18 -73 158
4194A58j54K6Lk09J68R1k04M0L34j26l71M64j59l5l6q5R0n3k1K1N0l13M88k56
4218h9J14k46K05j12kn1J34P4k8j29K35l59L75j0k52K00J28l70J95K12p0o9k77
4241a92L02j56J05k85L33m8k59J59Q2J7n4r9K62k28j72L36j03NL6j85R4j06J48
4264hn5M00k50o8pn3J15j93J10K4O7kNL0j97Q3j68K26K1j4Q5k31j49K87n4J36
4290A40O4l11K37j91j01L52j85j72J20l3Q9r0K26J44o12K57J33k35K56J25k13
4311@J46k02j42K00J74k06m0j11J28J92l69J81q3J85J9k0J97l37k1K4RL6K31k93
4335a02l0j82K37J84j21k3K15j46j05K13j6j52j10J01J28l4k17J40j77K75l02
4356b24J13K34R8J65n26J35p1J43R0j12j78L56p8j49r5K44j69j0q8J7J37l2L28
$$ plain form
4194 158 4 30 33 -176 -8 83 -121 -81 253 127 -244 220 61 26 -10 -95 -5 -58 -79 -58 -8 -321 167 -89
4218 -89 25 -221 -16 -128 -130 -181 -47 27 -1 -130 105 -254 121 111 -141 59 187 -183 12 224 154 85 -192
4241 -192 110 -46 59 -226 107 59 -200 -41 41 58 4 -95 167 -61 -233 103 0 5 41 -144 -50 -156 -8
4264 -8 -63 337 87 19 12 -41 74 -119 -9 15 82 80 85 115 -82 1 -167 59 80 66 151 -80 -229 58 4 140
4290 140 204 -107 130 -61 -162 190 5 -167 -47 -80 9 -81 145 289 -323 -66 67 -168 88 213 0
4311 0 146 -56 -198 2 176 -30 -70 -181 -53 139 -230 -49 -132 53 72 52 249 -88 -109 -85 -76 -40 191 -102
4335 -102 -132 -314 -77 107 -14 -37 178 32 -73 140 124 -28 -138 -37 91 57 -160 -20 -197 78 -224
4356 -224 -111 123 221 386 -140 -5 -76 67 157 45 -133 223 145 -4 -99 145 -24 -34 -122 -105 32 0 328
4379C28k61k43J81j8j65q1N08l52J82J40j90n5K66Jl24R4p5K68j20k24K19k80
4401b01K22P7J8j43k13P6k5k4R7N8J35j10R0l9l28J63J55Q0R6k38o4r3K98O8k72
4426a17J27j15J71k8K1j74j44K07O4l6K01k72P9K5k69K21n6q5N1O2P2J54m0R4
4450B13k50l08L53N0j00J29L06m33Q1p3K06k11K13k36J59j52J44j00L9o6l3K22
4472A53j93j50RJ61rP2k71K95l95K98q7pP8J15p4k2J50J9n4l14K80p5K9MK58l38
4498f8L1J01K22k79l1J65m08L00J20k99J0K10j35n8J5Q4L2O6k5o2L2N7j99j4L67
4523B34l40J89K91m44M5j06n9L34M1j57J29l59J90J86o0k07J64K1Q3k57J86j52
4545d8M1J24j12p3j51L76k53n9P7J5L43k89K78q0k64L46j61j74nk9k3k2J28J89
$$ plain form
4379 328 67 -176 5 -13 -178 -259 249 -103 79 219 29 -26 240 241 -83 11 -64 204 84 -140 79 -201
4401 -201 21 98 116 -27 -240 -164 -189 -213 -116 -58 77 -33 57 18 -310 -147 8 88 184 -54 -118 -211 87 155 -117
4426 -117 10 -105 66 38 59 -115 -259 -52 12 -24 177 -95 -16 9 -260 -39 -95 -180 -129 -67 5 159 119 213
4450 213 -37 -345 8 58 -42 87 393 -40 41 -32 174 -37 176 -60 99 -53 91 -9 30 -36 -69 153
4472 153 -40 -190 -181 -20 -29 43 -228 67 -328 -30 -117 -124 -46 69 -5 -27 123 142 88 -226 54 -21 8 12 270 -68
4498 -68 -37 64 286 7 -24 141 -267 33 153 -146 -136 74 -61 -119 -104 -20 12 78 53 -9 23 80 -119 -133 234
4523 234 -106 83 374 -70 -25 -131 -190 144 185 28 157 -202 -12 174 114 -93 71 92 175 -82 104 -48
4545 -48 -7 117 5 -68 -219 157 -96 -155 -78 -63 280 -9 269 189 -75 271 110 -64 -69 -98 -121 -143 -15 174
4569A74r1J31l76J30K27k70J99j51j36K47j09o9RJ85Qp4J11q1J44k20L26k16k70
4592a72L06j19r0K11K0j86L5l17K64Q1J64l39J25K0R0R9j07Q5k10m4M9j26J25
4615c6n7J57J4k07J68K4j0P1l2j04M1O1j10o8l8J41M1k03J79j80j07RL71k05p7
4640a57L02k12o2mM9j07J5K70j84q7J78R8j9j61K58j82n7P9p7J03k4j64J1j0J14
4665c0j40K55R5k93N1R6J90j16o7M3l82L24J78j80J08k78o6M38k8j91j96K02P0
4688H3j17J40K2Mo0q9P1Mq1P1Q4j54N7j89r7J49J16J3k22L4J98K6Jk07J34O2k12
4715a59J53M0Qk46j9M22k26o8J19n2M2K0Rk18K45k11P6p9n0K1J68j4k44K59j04
4740a08oL30M5j90j2j17j5n8J19j7j96Q6K20O2J17k00K0j10qN4L1M9j62pP0r4
$$ plain form
4569 174 83 214 -162 -32 195 -75 124 -27 -163 84 -25 -94 -85 100 108 34 145 64 208 -12 314 98 -172
4592 -172 134 15 -75 136 156 -30 5 -312 -48 33 197 -142 -17 3 93 192 85 170 -40 -84 -35 -161 -36
4615 -36 -93 64 78 -129 39 63 53 124 92 -12 29 90 -20 -88 -126 15 56 -147 32 -148 -255 -246 125 -80 -157
4640 -157 145 -67 -129 -133 -84 -191 -176 94 -90 -177 1 99 80 -81 177 -5 -62 17 -60 43 19 -145 -134 -144 -30
4665 -30 -170 85 180 -113 -62 34 224 108 41 84 -298 26 204 24 132 -146 -212 226 198 7 -189 13 83
4688 83 -34 106 128 132 72 -17 54 58 -23 48 132 -22 35 -154 -251 -102 14 27 -195 -161 37 63 64 -143 -9 53 -159
4715 -159 -6 34 42 -204 -223 199 -27 -95 24 -28 14 34 43 -175 70 -141 -65 -144 -194 -173 -5 -19 -263 -4 -108
4740 -108 -114 216 261 71 59 -58 -73 -131 -12 -29 -225 -139 81 143 260 60 80 -30 -38 16 47 96 -66 -73 -3 -97
4766i7J79o5L6k60J11J94l36J10L9j0O8J71j9l14R9J00j08J34J8o6L77o5j28n0
4790A18R4k95n2J62Pj19R1L0n5J21j21N0j60q2J34o1Q5j5m8j7p2J10K24j32O6
4815F3n9J61P7n18L9K88j35o7R3j5m1n7J50P6o4O0j9j09K68j04k86J70j19J28
4839b0J3Kp5QJ79j27R6q0M3j71K54k31n3J28J96j84n0L7J29j09L20l28M0O4k38
4864a57J59n8j45N4L8J55L15m54J2P5j63L37k17K03q5p5j66J65k34N94j08k10
4886C5k88L95q8q6M59l05k11j73K98M6P0r5j56J16j21J79m8j02p7J64k02L83j7
4909A76o5n4j70K58k32Jj52M38o3k04N4O8ro5J25j25K59m40L04j24J56j68Q0l60
4933c12M67q6J8P8j71R1j14J14j39J4k39K31R8k36L37k35J58J68k59N8Q1rk73
$$ plain form
4766 -97 82 17 53 -207 -96 98 -238 -128 -89 -99 -31 140 121 -193 -94 6 -102 32 50 -16 361 296 168 118
4790 118 212 -83 -135 27 34 -85 6 36 -19 102 -19 31 -129 -211 -77 -138 -53 -68 -116 -133 -205 -95 129 -3 63
4815 63 4 165 242 -276 -237 51 -84 -151 -58 -73 -114 -171 -21 55 -9 51 32 -77 191 87 -199 -29 -148 -20
4839 -20 -7 -5 -80 -72 107 -20 76 -4 39 -132 122 -109 -162 -34 162 -22 -72 -35 94 -15 305 -23 17 81 -157
4864 -157 2 -56 -201 -147 -109 46 361 -93 -81 -6 -169 168 -49 154 69 -6 -172 -7 -241 353 245 35
4886 35 -253 142 54 -32 427 122 -89 -262 36 82 152 57 -99 17 -104 75 27 -75 -152 12 -190 193 176
4909 176 111 57 -113 145 -87 -86 -238 200 137 -67 -13 55 46 -19 106 -19 240 -200 104 -20 136 -32 48 -312
4933 -312 155 69 87 165 -6 85 -29 85 -54 -40 -279 -48 50 -186 151 -84 74 242 -17 41 122 113 -160
4956a60J19P5k9j12J40k41J41M0k8j60J46Q8p3n2K64k06K36l33J94J69k0r0q6
4979B2j10MJ03k1j42J00P0J78n9m30L79k50J77K11k97L14k00j27k6J03J11j40
5001c0J01J69k14K40j37l47J9J80J95l59J67kJ31q2j59K21J15o4j50R8j84l0K2
5024a00K60j80j92K93j50j69K3J26K2J17o0J52k71M62m81pL06m7Nj1j27R8%j6
5048E3j81N3J36j20l9Q7k6r4q3J85J15j38J74k24J81J9l81L62N3j07r6K45k81
5071a07K14j92J10j05j32K81o5R0l2J19o2l26N43m27L6L36k82J09j38K21j39j79
5093a27K32j48rj7RmP5J9r0K17k14J7J22o9j75K67j29J99j87j16J29K1q2n8K78
5118A60k01LJ17m7k5J27j79o8MK9k56J11J42M8N9J84l75K78R6m9l0O9m15L53j88
$$ plain form
4956 -160 -41 34 5 -107 33 -208 -67 -27 -55 -215 -69 19 -54 -106 158 -48 188 -145 49 218 198 108 22
4979 22 -88 -84 19 -2 -144 -44 26 204 145 -285 94 -156 21 232 -65 249 49 -78 -104 -1 110 -30
5001 -30 71 240 26 266 129 -218 -199 -19 176 -183 -16 -18 113 31 -128 93 208 144 -6 92 -92 -122 -100
5024 -100 160 -20 -212 81 -69 -238 -215 -89 -67 50 -10 142 -129 333 -148 -155 151 104 109 98 -29 69 69 53
5048 53 -128 -75 61 -59 -98 -11 -37 -131 -214 -29 86 -52 122 -102 79 98 -283 79 132 25 -71 174 -107
5071 -107 107 -85 25 -80 -212 69 4 94 62 181 119 -207 336 -91 -55 281 -1 108 -30 191 52 -127
5093 -127 105 -43 -52 -69 -60 -64 11 30 -60 157 -57 -40 82 13 -162 105 -24 175 -12 -128 1 22 -60 -118 160
5118 160 -41 -38 79 32 7 134 -45 -113 -109 -80 -336 -225 -83 -35 24 208 -167 111 207 158 128 197 -218 135 -53
5143e3Ok19L33l46J71K3J92O3j20R5m28J40K1L4k63P7K47j44J03J01k02P9KJ09
5167B1l8J26j11K39l21K54k89J32R5j58K51l40L75j03J35m71K43m7l72K18L83
5188B22l07k51M28Q6m47K82P9o8J03j49J78q4J31l00J96m8o5k21J32J43k4R1p7
5211C0oj34J26o1J59m3M8j07q1O1j8M1j52j51M04l5p9j05k9RnQ4j54l0L47k07
5237h8J23O0J31j88p9Q5Q3Mj07Q6J6J22m02J45k35M9M00o54L34L34l46M6N9J98
5261A76k46M59l60Q5k10Q7m1J37j38O1n5O3JO6q8n7j86K49Pj10j19J92j30L25
5285A68kj15K9r6o8j87M33m7n6J69j70J75N8p9k61K42j78K6o8MJ03q6oj89M19
5310B18j99q2L1K48l18K20j71Q1J4j88J31k87K12P7Q0j24j01K03k54L83j50M2
$$ plain form
5143 -53 -47 -266 67 -279 -108 -85 107 170 50 145 -283 -143 -122 -88 -351 -274 -27 -171 -68 33 -169 -90 -88 21
5167 21 -17 109 -2 237 -84 170 -119 13 108 -50 201 -139 236 133 268 -203 40 -7 -379 -161 222
5188 222 -85 -336 92 178 -269 13 92 24 127 -22 156 72 203 -97 99 51 -14 -235 -103 40 16 107 30
5211 30 24 -110 16 -45 114 71 119 12 -69 -8 -26 15 -137 -288 116 81 2 -103 -132 -123 -128 -44 -198 -228 119 -88
5237 -88 35 95 226 38 -41 44 127 131 24 110 126 248 -154 -9 -244 -195 205 -449 -115 219 -127 -81 -22 176
5261 176 -70 389 29 114 -96 -9 -50 87 -51 10 -45 18 19 85 -3 -60 -246 3 10 -100 -219 -27 -157 168
5285 168 166 51 80 -16 -84 -271 162 115 59 228 58 233 291 212 -49 193 15 41 -27 -23 80 -6 -12 -201 218
5310 218 19 -63 -32 216 -102 118 -53 28 42 -146 -15 -302 -90 -13 67 -57 -158 45 -209 174 24 66
5332F6q1L4r7k7k2L02k51J21j38L37m33R1K26j25p8n3M57l78j25J89K91l91K11
5355A26m7J04j96L4N6l4J65j33k9o6J75l11N6l1J6Lj90M17J00j03j1J42j42n4
5379D7l25L81r2M4o4R1J13j09j92j76L67j38j04K23M6o7j4j32K7j07jj9M80k43
5403C6L7Pk25O2J52j71M2M4o3j0L8o3RK27j13m6j78K6J54J24k96J36RJ29M99n57
5429IK32j46q4Q0k93K55j16j6K93J92m36M5m1J79l6k16L86l96J32j51J79J89n16
5452b76K67Q2lM9k2k0J09k51J41m7P2m4O3k28N2J28k5k59J91K20l57J89k3j90
5476a82K24k33M89m35O5K38j68J24l41L82p4p2k89L81L2p4J51N9k41R0m09K75
5498hl3o6K41j30j0L9r1L6k0M4qKr4J0L94j69j18q1J59P1j07k41M15J17n8k44
$$ plain form
5332 66 -15 19 -78 -105 -127 175 -76 45 -93 244 -189 -98 128 3 -75 -128 329 -49 -174 15 306 -85 126
5355 126 79 183 -13 21 77 43 208 75 46 -20 155 -156 -100 -131 -115 -112 -302 115 215 112 101 243 101 47
5379 47 -278 103 11 55 -9 82 195 86 -106 -282 85 -53 -157 66 112 45 31 -101 -74 -181 -182 -201 279 36
5403 36 73 80 -145 -83 69 -102 -60 -16 -79 -89 -51 -114 -105 122 9 -37 -215 -189 -35 89 -207 -71 -62 67 566 9
5429 9 241 95 11 91 -202 53 -63 -79 214 406 -30 15 -26 153 117 -99 287 -109 23 -128 51 240 -276
5452 -276 -9 73 70 119 97 77 186 -65 76 29 101 57 120 -108 -56 72 47 -212 -21 199 -158 31 8 -182
5476 -182 42 -191 298 -137 -72 166 -2 122 -219 163 89 17 -272 109 141 67 218 277 36 126 -283 -8
5498 -8 -41 -107 134 4 -6 33 -58 -22 -42 2 -6 -4 -98 -88 306 137 19 -62 97 168 61 -180 235 352 294 50
5524E0rK39k51l51L11L21m96J9K23j85K20j26J03p1J4p6j9r7J66J69j0k91l1l1
5548b09L23j04K7l38pL03j14P9K3P5N2qj71p3K00J73j75K42m81M87l09J08J54
5571B57j52k90J95j13J71N3Q3q3J1k16n9Q3j9K26k1j17JO7J45j40l0J67k51l0
5595f2Q4j31K81O3k85K6m7K30j87O7j79L11j50j35M9k29K69K63m4r8J24q5k38
5618a03O3k9Qn3J89j64nO5J95k05R9J54k6p4L5p3k74K12j08R1o6P0k1r4J28N6
5644G0j63J42j26J4J84qkj71jj35J21N2Q7Q2j43n2L13r0k21L3j77J68J83pj54
5669aj35K8J03K92l54J76l0M2j07K90m16O2l6k57N54m73K98qq0l4K70k11K32l18
5693a13M8m6L22j48K9p7M4m1k92M20l27J82K25m18J93j15k16K69j7M3j38J82K3
$$ plain form
5524 50 41 280 29 -322 -11 310 -186 -167 56 -129 91 -35 68 -3 11 -65 -84 -181 -15 154 144 -147 -178 -209
5548 -209 114 10 37 -301 -308 -5 -119 -40 -17 58 110 102 -69 -142 58 231 56 298 -183 304 -5 103 257
5571 257 105 -185 10 -103 68 121 204 121 132 -84 -143 -60 -79 147 126 9 10 77 222 82 52 219 -32 -62
5595 -62 22 -109 172 235 -50 -24 -71 159 -28 39 -140 171 21 -114 -65 -294 -25 238 194 96 220 135 -103
5618 -103 -40 -69 -61 -114 75 -89 -94 -29 166 -39 60 214 188 114 149 76 -198 14 -94 -3 -69 1 -20 -114 14 70
5644 70 -93 49 -77 -63 121 113 111 -60 -61 -196 -75 -23 64 146 3 -49 264 174 -47 -14 -191 -23 160 153 -1
5669 -1 -136 -108 -5 287 -67 109 79 121 14 304 -112 -50 -86 -343 211 -262 36 28 -52 -86 184 -27 205 -113
5693 -113 -65 -111 211 63 92 15 59 18 -274 146 -181 1 226 -192 1 -114 -330 -61 -78 -35 -173 9 32
5716C2j4J59%j50k27K12Q3k60J87k31J39J34j55L65l01k2J21O5k41l4M59l04l7
5739b0l5K10j72l1p2J00r8K40q2%NK40j81k1l8J63n9j79k15L16J4p1k11K25l50
5764c22L85l03L12j53jJ1O2o7r3K80k10P8L1L3m6n6J90Q2m8j1j91Q8m2j02J33
5789D0%L2K4j00M8k53J87K7O9j22J14j31j1J64q8j20m7L70k12J81j83j0q2J32
5813B9J01j43K18j97M0M7n7o0K07l20K40j01O4l5O9j88Q7j73p8J06R2n1j04L96
5837A89m02m1J12K87O8r5j31M1q8O4o6J75p1Q9j24J65l08K38j40Q0k20K48j4j96
5861a40K29j28k03J05K9K87kk11L5N6M4p3k00R4p8K36m9J50j4j62p7P0j08R6J6
5886BJ9r4K47k05J26M6k37L08k03j26L25m29N1M21l26K7j00j83Q6K62J58l98J19
$$ plain form
5716 32 18 177 177 27 -200 12 95 -165 22 -209 -70 64 -91 274 -27 -49 72 137 -104 -138 321 17 -20
5739 -20 -55 155 -17 -48 -120 -20 -118 122 40 40 45 285 104 83 45 208 149 -30 -245 71 85 14 -197 28 -322
5764 -322 63 -240 72 -81 -82 -71 -9 -76 -169 111 -99 -21 10 43 -3 -59 131 213 165 154 -37 51 9 -93 40
5789 40 40 72 96 -4 44 -209 -22 5 74 -48 66 -65 -76 88 0 -120 -167 203 -9 172 -11 -21 -103 29
5813 29 130 -13 205 8 48 95 38 -22 185 -135 105 4 68 33 102 -86 1 -172 -250 -144 -52 -103 -207 189
5837 189 -213 -254 -142 145 213 118 -13 28 -60 4 -62 113 42 131 7 172 -136 102 -38 42 -178 70 56 -140
5861 -140 89 -39 -242 -137 -108 179 177 -34 1 57 101 28 -172 -78 -156 80 31 181 167 5 -72 -2 -110 -14 2
5886 2 21 -73 174 -31 95 141 -96 212 9 -117 208 -221 -170 251 -75 -48 -148 -331 -245 17 175 -223 -104
5909a04K52Mj84n8R4N8k7o6J09mK38m03K14k28K38K2R2k70J79m19L27k3j24O8
5933a5j34J94k08K73l40L97l62J03K23k56K12j47J87k65J90N2k15N8O7J45o2j47
5955e0o4J57K7o7Q5J20l40K18j21j80J45qk33L25J64j51O8p0R6P7j92J03k58K30
5979H1k19J69J8P9l5Kj00n9J23K2J27j65j62PN8RJ54l31J72j00q5J97k44L06K5
6004D9k20L31k5o6l11K66l0J49j33K17o6k06J50l1L18l57J77l48J69L03m95K82
6026A23k4j67J5j05L36l44J35J3K00j01j74N7L6qM8j68J94j35o8L95n31Q2K83
6049I2k29P0M4j68J65L1L9O2j70L3K7R9l66j99N33l18L67L3j66J43QR5k82P5j79
6074a61O5J24k88M63j76o0j4J5O8j85K57l00j6M11k52J36k96L80k44N8pr4L5J96
$$ plain form
5909 -104 148 152 -32 -90 4 62 35 -31 78 74 312 -91 123 -105 133 155 247 -23 156 -263 64 41 -83 -15
5933 -15 -149 45 -163 110 -230 167 -195 -92 131 -125 87 -60 127 -138 52 104 -111 -53 14 159 97 -50
5955 -50 -114 43 70 3 88 208 -132 86 -35 -215 -70 -78 -311 14 178 27 95 25 121 198 6 109 -149 81
5979 81 -138 31 49 128 93 95 -5 -64 59 81 208 43 -119 -112 -54 -45 109 -222 -50 -150 -235 -38 -282 24 49
6004 49 -171 160 135 69 -242 24 -6 143 10 227 161 -45 105 74 392 35 212 -136 33 336 -159 123
6026 123 99 -68 -53 -158 178 -166 -31 -18 182 81 -93 -36 0 -8 40 -128 66 -69 -137 258 -273 -191 92
6049 92 -137 -67 -23 -191 -26 5 44 106 -64 -31 -4 95 -271 -470 63 -255 112 145 -21 122 130 225 -57 18 -161
6074 -161 -96 28 -260 203 27 -33 -47 -32 36 -149 108 -192 -208 203 -49 87 -209 171 -73 -15 -22 -116 -81 115
6098A15l3p0K01j08j14J11kK9o5q0Q3J08j5J99l67M2j14K14M7l91J76l8o7O4R1
6123A6J12J06r9k24K93l20OO1j43M90k57q6P7N1j45j26L83k05j19K25k26K77p9
6146F8N3m3j3l27K54r9J23J11j33Q8O4n18L20J60j83J19j8J38k02n7K81k66PJ49
6170G6j10J50Nk8p0N3k53J55Q7Qq1JJ86j76P2r5K4j9o9k9M32k82J29k38L3Q1l7
6197EK3j58J80M3j17j99K72M6j68l9j51M67l57qL22j11r8oj54K22L45l63k25K61
6221C2j13K74k59j28J60Oj76K43j10M3k18J57k2K15o7O7k06P1L51l91j2j16J83
6244a6P6q4J17k37J09qq5Q3J02l04M27k45M6%K3K5K26n6k36J95p3l00L59J52k76
6269B0J69l25K77k48J1P3K8m8M36l38j60J41J51p6j62q6K35j18l2Pp0L3pJ06m7
$$ plain form
6098 115 82 12 213 105 -9 102 100 129 64 -16 67 175 160 359 -8 34 -80 134 181 -210 -34 -72 -139 -75 16
6123 16 128 234 135 -89 204 -116 -110 -49 -192 298 41 -45 32 83 -62 -188 195 -10 -129 96 -130 147 68
6146 68 121 78 65 -262 -8 -107 16 127 -6 82 146 -372 -52 108 -75 44 26 164 -38 -95 186 -80 -73 76
6170 76 -34 116 121 93 23 76 -177 -22 65 73 -8 -7 179 3 75 -20 4 -15 -84 -113 319 37 166 -72 -39 42 5
6197 5 28 -130 50 93 -24 -223 49 95 -73 -112 -263 204 -153 -161 161 50 -48 -54 -208 14 359 -4 -229 32
6221 32 -81 193 -66 -194 -34 -28 -204 39 -71 -28 -246 -89 -111 104 37 104 -102 -31 320 -71 -83 -199 -16
6244 -16 60 -24 93 -144 -35 -43 -128 -45 57 -247 180 -65 -19 -19 4 29 255 199 -37 158 85 -215 144 296 20
6269 20 189 -136 141 -107 -96 -23 5 -43 393 55 -105 36 187 111 -51 -137 98 -20 -52 -45 -115 -82 -89 17 -30
6294c0m6rJ21j34k2m6j14L35K28j82k25R9j05M46r9m99L69j84Q1M07m36k9M5m4
6318g3K09n2L1J81m56N3J47l8M4q0J96l64J88ML58n46m3K95Nj24j03M40j59q4
6342B9KJ86l66K8J47R6O2k47r6J94n3O1j09k4p6M18m90J88k12J38JJ27N8lM9k28
6368a20j13J41n8k0K94l66J31J9O0q4J04k10J58K32j37Q8j97k5o5K29j58K03J74
6391B80j38j49Om0K55j36r5O4k6J78m11K78Or1J6j13P1N2k32L67j30L3m8l2J22
6416H7j22p3J49m5P0m6j70N69m64O8j67j57M76k78J99j45l9K46j52q3J33p1o6
6439h1Q1J59k64nJ14l0K8q1L94m74L45k75k5j55J4M1L88j7j78L9j4Q9k13rK90
6464A61r7J85k73K28p9o0M7J2j58K02k82J30k7j0J78j96JJ21j82Q2J85l85L17
$$ plain form
6294 -30 -76 -85 36 -98 -120 -166 -280 55 283 101 -124 -25 -130 316 217 -282 87 -97 -16 391 -45 -74 -29 -73
6318 -73 136 84 115 296 -160 -107 40 2 46 -34 162 -202 -14 -10 348 -198 -241 54 59 -65 -168 272 113 29
6342 29 31 217 -149 -121 26 122 184 -63 -159 35 -18 43 -66 -90 -166 252 -238 -50 -262 -124 -123 4 62 59 108 -120
6368 -120 -233 -92 -150 -170 124 -242 -111 -92 -32 -116 -12 -222 -64 168 31 119 -78 -103 -168 61 -97 106 280
6391 280 142 -7 -1 -41 214 78 -17 47 21 199 -212 66 72 -19 -3 -116 -45 7 -225 142 12 45 -3 -35 87
6416 87 -35 -108 41 -4 66 20 -150 419 -45 23 -144 -301 175 -103 96 -49 -88 158 6 -77 56 -15 -81
6439 -81 0 159 -105 -110 4 -26 2 -79 315 -159 186 -89 -114 -269 -255 -214 174 157 -21 18 4 93 -120 -129 161
6464 161 64 249 -24 204 125 65 112 124 -34 168 -114 16 -11 -21 157 -39 -38 83 -99 -17 168 -217 100
6487A00l74J65J65n9P9N8j25J03N0J2j89J92l48J58J32q3j34J93J51k41j4K56
6509B47o5j64j90J74n8P9J38j21j08l7K64j52Kk1j02J26j35P8j49P3N56m42L7
6532C0kj89J35j35Q5R0j72K85j36k09J07J44L12k79k5j67J27K1j38J63j15m2k2
6555a32L16j14n9j18J39j98Q4K60k25pJ52J03j13k07P4k1J76p5M7J37j83J3P9
6578A28J9j70J30l32L1J56L02k44k46J48M57j78j37J0l31K69Q5k1J15k19O1K5
6600E8j84J24J42j53j2k0K90l10N6l50L02j74J78J68j32R4j39L27k06K7n4J7K83
6623C32m39J52k95K53j49L50k13R9nj90L2lQ9j8K65p7k41j1j86q6J81K32J49j90
6647C1j42J23J77j55J32k45Q7N0J7k11q2J79K85m39P6J54P9q7p5j9R9J39nq0N4
$$ plain form
6487 100 -274 -109 56 -3 76 134 9 112 162 174 -15 177 -171 -13 119 36 -98 95 246 5 -9 247
6509 247 182 18 -172 2 -56 23 161 40 -68 -105 159 7 9 -12 -114 12 -123 -45 -194 -121 435 -7 30
6532 30 28 -161 -26 -161 -76 14 -158 127 -9 -218 -111 33 345 66 41 -126 1 22 -116 47 -68 -110 -132
6555 -132 184 70 11 -107 32 -166 -82 178 -47 -54 98 201 88 -119 -45 -66 110 35 82 219 36 49 128
6578 128 147 -23 107 -225 -194 -38 264 20 -226 -78 379 201 64 74 -257 12 97 76 191 -28 33 58
6600 58 -126 -2 140 -13 -25 -45 245 -65 -9 -359 -57 -231 -53 115 -17 77 -62 265 59 86 32 49 332
6623 332 -107 45 -250 3 -146 204 -9 90 85 -105 -73 -76 13 -5 260 183 -58 -69 -255 -341 -160 72 221 31
6647 31 -111 12 189 34 166 -79 8 58 75 -136 -218 -39 246 -193 -117 37 116 29 -46 -65 34 173 168 88 142
6672A42J4l19K99j29J02qJ50k75Q7J41k34J40L9R2N8l93J30J83l06L71p0j60j03
6695d9l5J10j85J52j41K00L2l8rr3k3m9R8l0J39k13r2K80n4J22N3r9N6p8k05J61
6721A0j11K05j0R6j21J17j13r7o2r9J62J20q5k70K19j51J77p1O7j58K81j17P9
6744F8q7L4r4j19L74j24k81J58J3O0j30O1M5J25k10J88k3J38m32M21l12p0K41
6767D4M9J1j18K30j87j30k28K93J38k30L79j87L7j29j23J72J49k56J35m4j37M3
6789h9J35l04K71J39j01K4QJ38l37R8j01K20pj82L53Nl05J59k55Qj02K28j17q5
6813a99J58j61J40J94k5j35j72M2L54Pl49J41R4j4j30J57k43J51q4J44j57r6K76
6836I3l20L18j80K55l48J68J13J23k26J75k59N8J06j83K22k28J82l08J87J36J8
$$ plain form
6672 142 156 -163 136 7 109 101 251 -24 63 204 -30 110 149 241 299 -94 36 219 -87 284 214 54 -49
6695 -49 -84 26 -159 -7 -148 52 84 46 37 -56 -79 -128 -30 -60 79 -134 -226 54 0 122 175 76 132 54 -151 10
6721 10 -101 104 94 190 69 186 73 -24 -86 -185 -23 97 12 -258 -39 -190 -13 -84 -17 -175 106 -11 68
6744 68 -19 15 -79 -198 176 52 -229 -71 -58 2 -128 -67 -22 103 -107 81 58 196 -236 185 -127 -197 44
6767 44 93 104 -14 216 29 -101 -329 -36 102 -128 251 64 101 -28 -151 21 170 -86 49 5 -132 -89
6789 -89 46 -258 13 152 51 75 83 221 -116 -18 -119 101 94 -88 265 270 -35 124 -131 -123 -225 3 -114 -199
6813 -199 -41 -202 -62 132 107 -28 -200 -158 196 203 -146 -5 89 75 -55 102 -141 10 -74 70 -87 -183 93
6836 93 -227 91 -89 166 -182 -14 99 222 -4 171 -88 -30 76 -107 115 -113 69 -239 -52 84 102
6857A02j79J08J97j62k99J44K74j18j69J94O4j55N8j18L7q4K26k15K57l8l2j44
6879e2K20j07K13j72j13j05L54j30n8k14J41o0O2p3P3n2K57k06L39m19J94k40
6901a48J31K2J36j32j79R7P7J8p7P4N9L5j68p0K61j62K6J8k9J6J02r7L12m44J77
6926E5j73K07p1r6J79j52L6k15K48RJ84k75O9J18k75K72r4J05k77N0J72M4q4j44
6950a08J65j34m7J81J19j41j60L38k73r5j7Q2j00J71J8j6K4j03R8j6O2r6R6K67
6974C15o9n45J55L98k12J63k40Qk46K12%K55l08j88K87j58K97j65p9k1KJ51Q8
6997A00J4k17Q7L6K2j58j04L17J52j32l4k34K66j67K4J18j8j7P4P1k91NJ86n0
7021E0l43J18K14r3n0j57L68J11j27l1k4k5m4J8n4j25P2K33j05J38j57j73k7M30
$$ plain form
6857 102 -77 31 228 66 -233 -89 185 67 -102 92 156 1 59 -59 -22 -106 120 -95 162 124 92 -52
6879 -52 168 61 274 102 -11 -116 238 108 50 -164 -23 -83 -21 -94 -21 -73 184 -22 317 -102 92 -148
6901 -148 -17 5 141 9 -170 -73 4 22 -55 19 78 113 -55 -125 136 -26 0 18 -11 5 107 10 322 -122 55
6926 55 -118 89 18 -78 101 -51 -15 -230 18 27 211 -64 5 123 -152 120 26 131 -146 -96 76 120 36 -108
6950 -108 57 -77 -124 57 176 35 -125 213 -60 -155 -172 -90 -190 -19 -1 -17 7 -96 2 -14 48 -48 48 315
6974 315 246 -299 -144 254 42 205 -35 -27 -273 -61 -61 194 -114 -302 -15 -173 124 -41 -120 -141 -139 12 100
6997 100 114 -103 -16 20 42 -116 -220 97 249 117 83 -151 115 -52 -28 90 72 55 129 200 -91 -86 100 50
7021 50 -293 -175 39 -54 -104 -261 107 218 91 60 36 11 -33 -15 -69 -194 -122 111 6 144 -13 -186 -213 217
7045B17k91K19l62K53M4j72K45J7l25M6R1l3jJ27j81J92N9p3l34K87n1j52J16
7068f2O5O5j83K90j44J05k81K72l8J84m65K90j99r7M41m05J57m7k9p6K71r4p9
7091e9J26j52q2L7K64k72J07MP7j55K12j17m9j2L09k39j01J34j75J71J5j15nK04
7115A27j81j79L06K01k74PR0J55m18J66J48j5k03O7j38L95k59k53J2J29J10j65
7137a72J76l8l3P5L06k16p4k30rL04Mn29J75J99Q6n7J44j02N3n3J8J80l41J89
7161E5o5o3L74k3k51r7L78k93j25o8M42n18K18K4Q9p7LQ3Ok4K6k18M02k59K11
7186B30j99J5k63J79O3j65j38L40k29K32j85J34J42r7J09m38L99o3P4p0J25k76
7208h1O9J78j38k06R7j70J21M01j8l52M9J22l9j37J67j50K79l28P3j07J60L6P4
$$ plain form
7045 217 -74 145 -217 36 80 -92 153 170 -155 -109 -18 -51 -52 75 -106 86 145 72 -262 25 -26 -178 -62
7068 -62 3 68 -115 175 31 136 -145 127 89 273 -192 98 -101 -198 243 -162 -5 -52 -81 -157 114 20 -59
7091 -59 67 -85 -167 -130 134 -138 -31 -27 50 -105 107 -10 -59 -71 238 -1 -102 32 -143 28 43 -72 -77 127
7115 127 -54 -233 73 274 0 7 97 252 -166 0 148 133 -70 -3 -141 254 -5 -258 -246 -117 -7 -172
7137 -172 4 -34 -67 8 314 98 24 -206 -215 89 93 -436 -261 -62 24 -33 111 9 62 9 27 207 -134 55
7161 55 -10 -73 301 278 27 -70 308 15 -110 -178 264 -254 -36 -12 77 0 3 86 92 68 94 -124 278 19 230
7186 230 31 46 -217 -38 25 -140 -278 62 -167 65 -120 14 156 59 168 -270 129 66 140 70 195 -81
7208 -81 -12 166 28 -178 -81 -251 -130 271 253 -99 -50 72 33 -104 63 -87 192 -136 -63 -170 -10 26 100
7231A00l05J74J6J15j17R8K38j40k29Kj97J85Q3j96J57j58J78P5n1N1k79J79J36
7254A15j21k62j0J32k4J23L0q0j4j15K49j47P5J01j75J91k60L38p3N1K9P3j05
7277A21j59j36R2K4K02k27P2J13qj13j74J71P0P8n1k21M6j5m4R1R6J73o3k12J56
7302H2k49Q9M1k52L49j93L37j49J91j21j65Oo2o4J75j2q0J2j9j07K40j90j02K51
7326HJ40j6P9k47qJ47o9j44k0K01n3l60K38M32l73K05o9l41L51l23P4K15n4J14
7350A27p7j75J3J92P0k11J0j6R4L6k07M1K90j00j57j8K68l15J12J60N8o6j09P9
7374I9k14O0k7JJ08J65j70J15j94NR9j12Q4j98J93j25J38l12K23NO1K15m46M73
7398B46l59Q1j0JN9k35M06l68K87j9j1ml7K4j49J48P5j2k1rp7o4L0J28j64n7M5
$$ plain form
7231 100 -205 -31 -15 100 -17 81 319 179 -50 -48 -245 -60 23 -173 -16 -174 4 79 28 79 -200 -21 115
7254 115 -6 -268 -278 -146 -170 -47 -17 -97 -111 -226 23 -124 -49 52 -123 68 -192 146 73 124 153 226 121
7277 121 -38 -174 -82 -58 144 -83 -11 102 94 -19 -193 -22 48 126 75 -146 -100 -115 -159 -68 28 201 138 -74 82
7302 82 -167 -78 -37 -289 60 -133 204 55 246 125 -40 -34 -96 -160 15 3 -77 -65 -84 -191 49 -141 -243 8
7326 8 148 132 211 -36 -44 103 34 -110 -130 71 18 -342 -104 328 -45 160 91 -250 101 -222 -148 67 13 127
7350 127 50 -125 -112 80 150 -61 -51 -67 27 63 -144 -103 187 87 -70 -88 180 -135 -23 137 195 129 20 99
7374 99 -115 -55 -82 -81 27 192 22 137 -57 -52 47 -65 19 -179 14 -111 27 -285 -62 -57 4 219 -227 246
7398 246 -113 -32 -42 -41 18 -217 189 -179 108 89 78 74 37 61 -88 60 135 123 102 93 16 -48 -18 110 -54 -111 -66
7425f6K20j54q0M6R0P8j90J2J57k64K92k38J14J01J7N9k21j6PQ9MJ6L0j16Q5j10
7451c8J37n5Q4j96K09j48mm1M4LJ05q0k59M6K48j30J33Q0j87J16j34p7K80l03
7475a67J59K2Kr1O8J56j42J60j03Q8j05O1n5L8J2k11j4R8n5L37l29K51l88k8K35
7500aL7o9j72J56kL76m62J43p3m5k5K93j74p8J15J74j50j97L01qm63M24R0j81
7524IK30k64J04j84L36j63j72K95l21L98k34j65K16j74L1K78j18k2q3o3J95K0
7546A49M6j58o6q6M22l74J25k84J98q3J53j5l2K41l70J3J55m7Q9p0j13NK97m09
7570b14K24J03k40N3N1J0M5j44o5K25R4l12K11o8Q3Q1j67N8J6J50j96N2l8P6Q8
7595A76l83J59K00k43K35k45L12k51j25M6n6L65jj31n2K01l44%K89J52m36P3j33
$$ plain form
7425 -66 154 0 -80 -34 56 134 -56 -44 113 -151 141 -97 17 118 135 194 -27 -43 -36 53 57 73 103 -13 72 -38
7451 -38 99 44 128 -68 141 -7 -11 -52 -8 -5 100 20 -239 -193 55 -75 58 138 -49 67 -67 -144 136 -167
7475 -167 -8 14 16 -75 -7 149 7 167 64 152 47 108 53 91 103 -108 -122 -24 -79 258 -71 180 -208 -236 -1
7500 -1 36 -33 -205 -49 -51 325 -137 6 -67 -112 -137 156 -18 -96 19 193 43 -154 147 139 -324 100 190 9
7524 9 239 -25 79 -105 231 68 -104 191 -130 268 34 -131 85 -89 -58 220 102 80 -3 -66 129 149
7546 149 195 37 -29 -115 307 -67 58 -226 -28 -111 42 27 -5 236 -134 -121 34 -13 76 6 -107 -102 195 -214
7570 -214 10 113 -127 -74 -23 -13 32 -112 -177 48 142 -170 41 -27 56 137 -30 28 44 194 -2 50 12 88 176
7595 176 -207 -48 152 -91 144 -101 211 -40 -165 -119 -175 190 189 58 6 207 -137 -137 152 304 -132 -59 -192
7618a92m4M42L7j73k02J00l8K44j41k50J26J49j00n1J81l6j33K70Mn32L13L4J69
7641A77j86j33J73joJ30j48P1k28J38Ok6J08n0J65Q1k06j85j8J37j35O7J67j07
7665ik7j45p3K32J55j93L23j27k03p4J22L62l74l3n1Q2Lk31K42j24J27L6j40J55
7689C5M3j3K6p0qj53K22J13m9k75J46R9o6j43J82On50J06M33m7R0j03Oj69K0J63
7715D4O8J86l27o6lK09k34k3K61J02j57K49k89n5J66j8j18j28K83o1k10pP2j56
7739b12K52n3j23j06J70M2J48n8P8k5k75J93l17M17J76l25o6K27j20j5q7op7P1
7763i1M0J25j41M2j83K58j6o1O1R1k14K45k96q7j86M23j97J7J09r8J68J53m1k20
7787i9J86n14L80L74m97k7K02l3n4K32L8k92J9q7p7rK61k00kJ98M4J98j84KR4
$$ plain form
7618 -192 -236 206 243 70 -132 -32 -70 174 33 -217 -91 58 -42 -93 88 52 -81 189 193 -339 -26 8 177
7641 177 -9 -142 31 30 24 154 6 77 -151 -13 -7 -33 75 25 190 271 65 -120 -138 -1 -136 -69 98 -9
7665 -9 -36 -181 -254 -22 133 -60 263 136 -67 -141 -19 343 -31 -64 -115 -33 -30 -261 -19 -143 -16 20 -120 35
7689 35 78 65 91 21 13 -140 82 195 146 -129 17 116 50 -93 89 95 -455 -349 84 37 127 24 30 -139 -119 44
7715 44 112 298 -29 -95 -98 111 -123 -146 115 217 60 309 20 -35 131 113 -5 -133 150 89 -121 -128 -56 -212
7739 -212 40 -13 -136 -242 -72 -30 118 60 138 113 -162 31 -286 131 307 -18 -84 143 23 8 -79 -85 -162 -91
7763 -91 -51 74 -67 -25 -208 50 34 -27 34 125 -89 156 -140 -227 -413 10 -187 -170 -61 -159 9 162 121 -99
7787 -99 87 -427 -47 327 -170 -197 5 -28 -82 150 188 -104 -85 -172 -249 -258 3 -197 -199 -1 43 241 57 59 153
7812A53N7k92J45j00K17L5j08K98l78L0J0L7j08n3k1J50j75J26k42J27K05N8l02
7835a31J29q3J50j07J15l36L60j83J95m7j54J54J36m45Q6J07p8L35k75M6lL16
7857B87l08J90m49J76K56l82K98Lk2j44K00%l78J61p1J8L19n1j40j16L99l13K76
7880B09j58p3P6r9K93l52j05M90l06J56j6j39p1J67o1o7M9K7k9Q5k67O5L9M4J03
7905F0r2J90k80R3K08l50Q6k6K64q5j55K00j90j31K52J26l83K58K5m19L30R6j80
7928a03K02k51L8n9J7L50k24m3L15j32k80J4K40k7k7o6l1j8K36k06J74j93J07
7951C3m9k7K7j45O2k2P3K59q9J07q6j82J88j06J2N8k94J52M4j59K81q0m1m9R0
7976E7k19L27j61K58j89j86p5M34l56K87k00n3J34k17L53l02J55n3J62k04j4k7
$$ plain form
7812 153 210 -82 63 -37 180 215 107 405 27 57 67 104 -4 -57 -78 72 -103 23 -219 -92 113 171 -131
7835 -131 -2 -85 65 -42 73 -263 97 -86 109 62 -92 62 198 -247 -161 -54 -132 203 -72 -26 -29 287
7857 287 -21 169 -280 -104 152 -230 68 71 49 -95 105 105 -273 -112 -183 -165 154 103 -37 -153 246 -67 209
7880 209 51 -22 54 -45 248 -104 -209 281 -25 131 115 -24 -95 72 11 -56 -7 20 -9 76 -191 -126 -87 -43 60
7905 60 -32 158 -122 -29 179 -171 -85 -111 153 68 -87 113 -77 -208 44 170 -213 45 70 -349 -19 77 -103
7928 -103 99 -152 -114 -173 -156 194 -30 -73 242 110 -170 -156 84 57 30 -36 -67 -85 151 -55 119 -74 33
7951 33 -16 -43 -16 -161 -99 -121 -48 211 122 229 143 -39 149 43 55 113 -181 -29 15 -144 137 57 16 -33 57
7976 57 -162 165 4 262 73 -113 -188 246 -110 177 -23 -76 58 -159 194 -108 47 -6 156 -48 -62 -89
7998h9L9Q0J6j53JL31n23M23k26m4M4L3J60j83J65o3J3k25K13J98j14J17k85J25
8022E3J26l7k6j54rJ3O2k56J19O2N9J6j6L1K69l61j2L86l33J85k34r8J29k7P2
8047A9j04N8k66L16M4O5K0r9j88m2J26j51L89k10Q4n9R9j88O7m3n2J64Ol35M33
8072A53j0l41J92n8K29Q5q3K4j83k2M6j00K34P3o2j67J55j01j33m6R6P5j38kn1
8097a35J10J61j73K17K7n7k61P8J24j90J22j37m7L22k42N6jJ01J15j62j80L10
8119A58n6l70L57m7j99R8j56M32j88R7m14Q0L6K02K61k97j13RJ2J42l6r0l9K50
8143A29j01r2j00L51n9j42J75m5M6k09J26K54l03l24K41K40J43l50o3J33m2M4
8165E2p0m2L06J29n50Q2j13M30k90k60J41K67k35L26j92O9j6l9K8j09k3J51j9
$$ plain form
7998 -89 -50 30 46 -107 -106 225 -298 125 -101 -145 -101 -68 92 -91 74 11 24 -201 12 210 96 213 -72 53
8022 53 179 142 116 -38 -47 -34 28 -228 -109 -47 12 28 12 43 312 -49 -61 325 -8 177 -57 -155 -26 -53 19
8047 19 -85 -27 -293 23 67 132 152 53 -135 -177 -51 -202 187 -23 61 2 101 -87 -20 -63 -115 49 55 -280 153
8072 153 143 -198 -6 -64 165 250 167 191 8 -14 32 -68 166 239 177 10 165 64 -69 -115 -19 56 -82 -84 -135
8097 -135 -25 136 -37 180 207 150 -111 -33 91 -99 23 -114 -161 161 -81 -25 -26 75 190 28 -152 158
8119 158 102 -268 89 42 -157 -59 -215 217 29 126 -288 -208 -172 30 291 -6 -119 -110 -98 44 8 -82 -121 129
8143 129 28 -64 -164 187 128 -14 161 116 162 -47 79 333 30 -294 -53 187 330 -20 -83 50 8 52
8165 52 -18 -60 246 375 -175 -93 -206 224 -66 -326 -185 82 -153 173 -19 50 34 -5 23 -86 -109 42 23
8188B3j16K52j93
$$ plain form
8188 23 -93 159 -34
8191c4
$$ Imaginary data points
##PAGE= N=2
##DATA TABLE= (X++(I..I)), XYDATA
0@%%%%%%%%%%%%Pj5J6j6J6k0K8l2M0m8N5o3P2q8J03j17J33j52J74j98K23k51K84
35A51l22L61m03M50m99N55o18O85p56Q35r22J017j122J234j358J498j651J819
53I54k010K223k463K739l057L429l872M409n075N924p049Q614j0934J4723k1907
68a3352L9953j62491k60305N07937J32081l00755R5827J62107k71187k3136L04591
79B11270q2066k74544J22924J42031j33931l8368J08880k6420m0172N2376j9777
90B2203p3791K6711L9399j4543N169k1307n5720O5672Q6673o8965l0174R5609
102G6936m7241j06752J16474Q4262j65480m0228J48772n3280j14146J16133M0215
113E5665j24740N4676R3367j33925l8003J74860P674j30378K3043K7692o1846
$$ plain form
0 0 0 0 0 0 0 0 0 0 0 0 0 0 7 -8 8 -8 8 -12 16 -16 24 -24 31 -32 40 -48 55 -62 71 -81 93 -105 118 -133 151
35 151 -171 190 -213 237 -262 293 -325 360 -396 439 -483 534 -588 646 -712 786 -865 954
53 954 -1056 1167 -1296 1443 -1614 1815 -2057 2352 -2723 3201 -3848 4766 -6168 8555 -13352
68 -13352 26601 -135890 -396195 111742 243823 -56932 38895 201002 -70185 -93321 211270
79 211270 129204 -145340 -22416 119615 -14316 -52684 56196 29776 -10396 41980 22203
90 22203 -51588 -24877 14522 -21 5148 -16159 -71879 -6207 80466 11501 -18673 76936
102 76936 29695 -77057 39417 123679 -41801 -82029 66743 13463 -100683 15450 55665
113 55665 -69075 -14399 78968 -54957 -92960 81900 89574 -40804 -17761 9931 -51915
124e1915P1481Q9402j21640r9689R2393N9838l3528R489l089n7542K7319P4347
136E6866m2980n4801N7311J2387q1323O53O4145j5602k3622L8120j1038m1505
148d1389M7953M3018m4754r446K7796l1779j3552M0031j1406k2273M0503l009
160B1693n8137K3704N4261k8410k3002J1924l8215j6910N6080K711m8307K0363
172b2245K8468l9187P03O7062N478m8719K71J3969j3881J6110L2413k2411l6761
185a8730J2669J8038o777J2393Q901l8886j8316K8473k706j4692L2411O253m8634
198b9603K142N3353O239j6134R184j6635j9938L4118J2240m0556K037L1221j9201
211H467k4083J8933R565r191R201n353l5777l167K9839P572q739q550j6401J181
$$ plain form
124 -51915 19566 108968 -12672 -112361 -19968 39870 6342 15831 12742 -44800 -17481 56866
136 56866 13886 -40915 16396 28783 -52540 -51887 12258 -3344 -26966 11154 116 -41389
148 -41389 6564 49582 4828 -4618 23178 -8601 -22153 17878 6472 -15801 24702 21693
160 21693 -36444 -12740 41521 13111 -9891 2033 -36182 -53092 2988 5699 -42608 -22245
172 -22245 6223 -32964 -32261 34801 40279 -8440 -8169 5800 -8081 8029 40442 18031 -18730
185 -18730 -6061 11977 5200 17593 26494 -12392 -30708 -2235 -4941 -19633 12778 19031 -29603
198 -29603 -27461 25892 32131 15997 25181 8546 -11392 22726 34966 -5590 -3553 27668 8467
211 8467 -15616 3317 12882 3691 12892 7539 -28238 -31405 -1566 6006 -2733 -11283 -27684 -26503
225b6503L3633J7122k3431j1832J5597n380j5034K0972J7231k0903j1954Q581
237a901m943K369K4096m090k9188K325Q060j4535J4031K7133k4941k7434K0391
250h627J3546p224J2981M859k8530q024K1586K599k642J1990j0042j7546J6133
263A059J5382j1896j728J3060j1013k4218N635J7811N20j019k831j4687J985K4025
277A2085N565j1213J815l078k0447O154K8292p410k1568Q889K488j3989J2615
290A98J8524j1655j2934M74r181J93K3609L12k4076K385J1647q364O312K0455
304A7899o688k0141M03O621J284R463M929j5211n965J0610j030j066J4423l132
318A2399k6480n827J6860K775n128O590k548j4304P596J5324r64J383J672j6097
$$ plain form
225 -26503 7130 24252 821 -11011 4586 -794 -15828 5144 22375 1472 -10482 -1901
237 -1901 -6844 -4475 19621 15531 -13657 -11332 -3272 -17807 -3776 23357 -1584 -29018 -8627
250 -8627 4919 -2305 10676 15535 -12995 -21019 567 3166 524 12514 2472 -15074 1059
263 1059 16441 4545 2817 15877 4864 -19354 -13719 4092 4612 3593 762 -13925 -11940 12085
277 12085 17650 6437 8252 5174 -15273 -9119 19173 11763 -9805 -916 1572 -12417 198
290 198 18722 7067 -5867 -5393 -14574 -14381 9228 9540 -14536 -12151 -504 -8868 -2556 17899
304 17899 11211 -8930 -8527 -1906 -622 8841 13770 -1441 -7406 3204 2174 1108 15531 12399
318 12399 -14081 -19908 -3048 -273 -5401 1189 -1359 -15663 -8067 7257 6293 7676 9348 -6749
332f749q620J5581P905r051L781N439j5114j934K2646Q553j1012q009q161m413
346i158R389N348r934m161M871p643l477K0230J0110j3496n722L582n810J106
360d765J4086J778j4443n351M012K838J1248R132j3734j2506P009M536m038M913
374D715M671j1768j1044O173Q084K837J829o190q126M077M577p19O758Q094j0269
389C699j3483Q723J3578j391k643j886j3283n790J2507P589m562m928o006n158
403a3034Q617J2669o685r228N426l325j1178P257J5329q61r205m038P77P055J1506
418A1082p9j1853n182o16k472N604P345o381r949J890O817Q43K886P122l842q867
434e652P18K991M502Q853j101j3016L82J2155k95m457Q270p54j8680m952J0185
$$ plain form
332 -6749 -15369 212 8117 -934 2847 8286 -6828 -8762 13884 22437 11425 3416 -4745 -9158
346 -9158 231 5579 -4355 -8516 -3645 -11288 -14765 5465 15575 2079 -3643 -61 -5871 -4765
360 -4765 9321 11099 -3344 -8695 -4683 -1845 9403 18535 4801 -7705 -696 3840 -198 4715
374 4715 9386 -2382 -13426 -7253 831 3668 5497 -693 -8819 -4742 -165 -884 5874 13968 3699
389 3699 -9784 -1061 12517 11126 8483 6597 -6686 -12476 31 7620 3058 -1870 -7876 -13034
403 -13034 -4417 8252 1567 -7661 -2235 -5560 -16738 -9481 5848 4987 -4218 -8256 -7479 -424 11082
418 11082 11003 -850 -6032 -6648 -9120 -3516 3829 -2552 -12501 -10611 -3794 -2951 -65 7057 3215 -5652
434 -5652 -4934 -1943 2559 11412 10311 -2705 -2323 9832 9537 5080 13350 12596 -6084 -11036 -851
449h51L371O18m44r682m088J0578Q112R99K319n957j4428J971J6297J766p914
464B667r24k752k772Q328J0899j079q167n850m494O61Q796r10j3590l058P735
479d510k168l650R649P576p847n728K160k767M343R436p141j0702L827K392P83
494d347J3268M674j4998l833J3063J608o210N222p48r293k579j647p16R020L034
509E518j2910r050P054P442K933N304k186j2016k976J1926J0300k287j0063q426
523i437r17P444Q360k379o865N55o19j746P913L434r741m707M662l016m505O626
539d938O198M5L253j459m883J2413J3247q983j0172r8l404l852N181K697q479
554c234o325L200M637N347K600j876j150k552l582R83M556M450k322j0734k839
$$ plain form
449 -851 2520 3138 2694 -6988 -11076 -498 7614 8613 10932 4975 -9453 -7482 8815 10581 2667
464 2667 1743 -1009 -3781 4547 15446 14367 6200 350 -4144 -3483 5313 4403 -9187 -12245 -4510
479 -4510 -6678 -10328 -679 6897 -950 -6678 -4518 -7285 -2942 6494 -647 -11349 -7522 -5130 -4347
494 -4347 8921 13595 -1403 -5236 7827 9435 3225 8447 7699 -1594 -4173 -5820 -6536 2484 5518
509 5518 -7392 -16442 -9388 -1946 987 6291 4105 -7911 -10887 1039 11339 9052 -1011 -9437
523 -9437 -10354 -2910 5450 3071 -3794 -3239 -3858 -5604 2309 5743 -3998 -8705 -4043 -7059 -11564 -4938
539 -4938 1260 1305 4558 3099 -1784 10629 23876 14893 4721 4623 1219 -2633 2548 5245 -3234
554 -3234 -9559 -6359 -1722 3625 6225 4349 3199 647 -2935 -1952 2604 7054 4732 -6002 -8841
569h841J0715Q735J081j320o588q179K605R794J350o587q841q596N666J4487j223
584D258q441J327q4k193O481M572n298l063Q49k349L79M032k053j720N265l030
600a068r306L314J0174J880n876m162L18R19K375N712j301q549l574K752M287
615b105M401K109n974l117O401K488k242P417K928j2053n684M950L342K817J380
630G058q174p446N159N691J433J855n031j2706R79J0866J870m250k687k049L076
645d356N619J875J64J983m50m170m82L894P54k436RJ160l457m665N406Q516k940
662F424p486k295j038L112O553k326n526n90n04K24Q273M601q514n585L908l52
678a121j221N384J81o118k072J30K246P659K774p808o459K662M967J682K79k127
$$ plain form
569 -8841 1874 10609 11690 10370 3782 -4397 -1792 8002 9352 2765 -6076 -14672 -9006 5481 4258
584 4258 -4183 -2856 -2940 -5133 1348 5920 622 -2441 -1592 -3941 -3562 470 -1583 -3303 1962 -1068
600 -1068 -10374 -7060 3114 4994 -882 -5044 -4726 -3807 -1432 4280 2979 -5570 -9144 -6392 -2105
615 -2105 2296 4405 -1569 -4686 1715 4203 1961 9378 12306 253 -5431 -481 2861 5678 7058
630 7058 -1116 -8562 -3403 2288 3721 5576 545 -12161 -11182 -316 1554 -2696 -5383 -7432 -4356
645 -4356 1263 3138 3302 5285 4835 665 183 4077 4831 2395 2404 3564 107 -4558 848 9364 6424
662 6424 -1062 -3357 -4395 -1283 5270 2944 -2582 -3172 -3676 -3452 4821 9422 908 -4677 -769 -1121
678 -1121 -2342 3042 3223 -2895 -4967 -4837 -2591 5068 7842 34 -6425 -3763 1204 2886 3165 1038
694A038l483j622K138O211K103m461l371k55r5J215R10j29R0l602m455L280P269
711B781n42m443L83j254l004L974M647j790k92j849m301N106Q948j806n479O60
727A739p14l178K839N822k263n675k289O77L994L680j013k950l299k088J660L825
743G67K562k918n943m17N541L610k46l65o30k557l09J533J077K669o87q050j347
760e710O917J453j912K265k219o536J177O837Q87l016j882k481L0M745j17o19
776a81J965k791m948J462N790K133k131l084j102J027K847K206K81j751m052k664
792d993K884M871R80l556l484J826J799K93L574N15n299l472J537J731K068O26
808A900k733j923K077J190L98N215J127p107l340L125K558K69j200k554j759R45
$$ plain form
694 1038 -2445 -4067 -1929 4282 6385 1924 -1447 -1702 -1797 -582 328 199 289 -3313 -7768 -4488 2781
711 2781 2239 -2204 -1821 -3075 -6079 -2105 2542 752 460 -1389 -5690 -584 8364 6558 1079 1739
727 1739 1025 -2153 686 6508 4245 -1430 -3719 -3042 952 4632 3619 669 -2630 -4718 -3058 767
743 767 3329 411 -5532 -5949 -408 3202 2956 2591 1961 -596 -905 628 1705 4374 3687 -4363 -5710
760 -5710 1207 2660 748 3013 794 -5742 -4565 2272 3159 143 -1739 -4220 -4190 555 438 -181
776 -181 1784 -1007 -5955 -4493 1297 3430 1299 -1785 -2887 -1860 987 3193 3474 1723 -2329 -4993
792 -4993 -2109 2762 3742 186 -3298 -1472 327 620 4194 4709 -590 -4062 -2525 -794 1274 1900
808 1900 -833 -2756 -679 511 909 6124 7251 144 -3196 -71 2487 2756 1556 -998 -2757 -1812
824a812K171K268K404j188m561j128K329J651o25r82j506k580j404L104N362j33
840C370m209k581P83K777J908p96j855p27j388j353L589N003j776m276K36P84
856e11R36K272N41k247k205k007P07L811K568l836m703P14J965n3J574J564k158
873a068l224k98L766K966l74k138k173P6J838Q07J370J407j906l715O70M479J625
890D108j979j462j663j704J481K399pn19k557k414K135M773L73k866l69R0k318
907b499J063M380M24k517k267l81K896L248L02k169j289m68j152J107L451o74
923C455m308j184K029J456J317L68o61k662j663M01J702K187p99m447r97L069
939g37J501K41J165n01l270j263K390J716R6j490k874r66K466J180L89J693r13
$$ plain form
824 -1812 359 2627 5031 3843 -718 -1846 483 2134 1509 527 -979 -3559 -4963 -1859 3503 3370
840 3370 -839 -3420 -2637 140 2048 1252 -603 -1330 -2718 -4071 -482 4521 2745 -1531 -1295 -511
856 -511 425 2697 3238 991 -1214 -3221 -2514 1297 3865 29 -4674 -3960 -1995 -2048 -474 1090 -1068
873 -1068 -4292 -4590 -824 2142 1768 -370 -2543 -2467 -629 178 1548 2955 1049 -2666 -1996 2483 4108
890 4108 2129 667 -996 -2700 -1219 1180 1173 654 -1903 -4317 -2182 2591 2964 98 -271 -181 -2499
907 -2499 -1436 2944 3368 851 -1416 -1797 1099 4347 4649 2480 1191 723 -429 678 4129 3455
923 3455 -853 -2037 -8 1448 2765 3133 2472 -190 -1853 -1452 250 2437 1638 -2809 -3806 -737
939 -737 764 1005 2170 1669 -1601 -2864 -474 1242 1338 -152 -3026 -3992 -1526 -346 43 1736 823
956H23l387j579L675L066j909k816j315n40J988K310J276n22k525j825J425M012
972B157Q65l270j927N49n13O77K338L69j466j695p10J685K580N25j432j248L77
989a39r13J60K893J092l066l038K70K878J098m93k00j247r25Q88J670J679R8k797
1007i2k265J165K805P22l06O51j699j938K268L118N99j666l480j994J933J431
1023A252r6j054j094j498j059K769L674j053k931o38N93J104P10Q0m61j232n80
1040a514K61J602K451j71k211M55r9j217J068K180m61m173j608J575J759K097
1056A994q93l286q86J673j3Q16J780k591l164M73K963J239j87l33j442k3J036
1073h44K16K004J232k154k627R53K637J289o34j121j370j132P41K485J277j903
$$ plain form
956 823 -2564 -4143 -468 2598 689 -2127 -3442 -3982 -1994 316 1592 1070 -1455 -3280 -1855 2157
972 2157 3022 -248 -2175 -1626 -2139 -1462 876 1245 -221 -1916 -2626 -941 1639 2164 732 -516 -139
989 -139 -1052 -892 2001 3093 27 -3011 -2741 137 1235 742 542 -705 -1630 -742 928 2607 2705 -92
1007 -92 -2357 -1192 1613 2335 2029 2680 981 -957 1311 4429 5028 3362 -118 -2112 -179 1252
1023 1252 1156 102 -992 -2490 -3549 -780 2894 1841 -1090 -1728 -1135 -31 679 759 298 -934 -1514
1040 -1514 -1253 349 2800 2629 418 873 774 -443 625 2805 2344 -1829 -3437 -1862 -103 1994
1056 1994 1101 -2185 -3071 -1398 -1411 -595 1185 -1406 -4570 -4097 -1134 105 -82 -415 -1857 -1880 -844
1073 -844 -628 1376 2608 454 -2173 -1220 1417 2706 2072 951 -419 -1551 -810 1675 2952 1049
1089A049l242j36J995J525L06j550q16N62r27n35K691K74j605o90j09r1J534J844
1107B079M6j334j600q35J677L374o61l079q41Q94J198J600l70m21j414j512K64
1124i35K047J220k174j666J40M6N86J070N63O8j658k342J524L532m60j784p77
1141a000q98M79J856J934p66j527j655m15K703J769k089j471Q31p38m9J159Q21
1158I44p2j131j614K02J219J623n58r42j004o77O52K013J657p71k712j045K432
1175B16J091r3J59j185j429K45J335J686N38j481k835L18K292Rn43J032j799k380
1193b824J516J988P14j3j704j669J396J410m7r3K04j611j423K169J927n61j12
1210A267j361o70Q95J91L29K52m62j710p53J164J951K03j695j140L8M92K71J599
$$ plain form
1089 1049 -2193 -2329 -334 1191 1497 -53 -869 -307 -1234 -1769 922 1196 -409 -1099 -1208 -1299 235 2079
1107 2079 2125 791 -809 -1644 33 3407 2746 -333 -1174 -280 918 2518 2148 1727 313 -1199 -935
1124 -935 1112 2332 158 -1508 -1368 -1322 -736 334 897 965 -693 -3035 -1511 2021 1561 -223 -1000
1141 -1000 -1898 -1419 437 2371 1605 78 -1577 -1992 711 2480 391 -1080 -249 -987 -1036 123 944
1158 944 872 -259 -1873 -1671 -452 1171 613 -329 -1333 -2010 -1358 655 2312 1541 -1171 -2216 216
1175 216 1307 1214 1373 188 -1241 -996 339 2025 2563 1082 -1753 -1435 857 866 323 1355 -444 -2824
1193 -2824 -1308 680 1394 1381 -323 -1992 -596 814 767 674 878 -733 -2156 13 1940 1379 1267
1210 1267 -94 -764 131 322 651 903 441 -1269 -2022 -858 1093 1296 -399 -1539 -1501 -1009 -738 861
1228H61L34k233j141L31J529J953j32k145R4M39o48J352J865j048k410n31J331
1245a99O80Q58n45j739l47jL06J397J218k032j205L5J248J161K75l95p96l32j86
1264e99N63K182k45k137m82M57N71J769l69j014j88j321k52J931J487j279j881
1281h07l01O37R03J086n50r70l81j188O52K236Kj793q14K87M77P07O50O33r39
1300E27j543m4J242J545l02j677m22k05O42J340N9l63r62j455O14J481M51j016
1318h8q17k47q74O50J266N31n70r90j505J284J968j13r03k93l77k31J145R56N83
1337A375j330j078j93J584J083p73n09o06o00J21J107Q22k94j390j071O09R03
1354b40N23J50K1j353n98Q41J604R05m88j561o35J767K36J39O06o74j315p6J118
$$ plain form
1228 861 1195 -1038 -2179 -1848 -319 1634 1502 -643 -549 -110 -758 594 2459 1411 -999 -1530 -199
1245 -199 481 1339 794 -945 -1292 -1293 -987 410 1628 -404 -1609 -1574 -326 835 1110 715 -81 -413 -599
1264 -599 -36 2146 1901 -236 -718 -261 310 2079 1710 696 508 -813 -1065 866 2353 1074 -807
1281 -807 -1108 -471 432 1518 968 -2 -383 -1571 -919 1317 1319 -474 -1288 -1001 -524 183 833 1466 527
1300 527 -1016 -1060 182 1727 1425 -252 -674 -879 -237 1103 1162 799 -163 -1618 -1004 477 928 -88
1318 -88 -905 -1152 -2026 -1376 -110 421 -149 -1139 -2644 -1360 608 495 -408 -701 -1078 -1309 -164 792 1375
1337 1375 45 -1033 -1226 358 1441 668 159 -447 -1047 -926 181 1003 709 -681 -1752 -1143 -240
1354 -240 283 433 454 -899 -1497 -656 948 1853 1365 -196 -831 936 1172 1311 1917 1243 -72 -148 970
1373I70Q81P27j603j460j82R17K95NM35r17j867N48J866K66R1j207l14O4K84O99
1393D98N14k56r49j187Q80J186P34p88r20l29K21m0R87L76j014j189k10O21J096
1412B31K11p45p16l10K9P04Q03K58j555o59M99Q11Q91R3q14m98k43J76J062Q98
1432A126J6j564r17J334J069Pj79o81p18l06M45J360K74j303p23m05P24M32J9
1451A0Q4j56j179n60J204J420m02j214J09J07J38J205M33k46j71j154M16J258
1469A302Q63o85j032l15R0qJ085K25p91j019m64N72R17J46p95j064l2L31M59M38
1489B23P21p93j075J49P93J054L10q20o30L3l2N57N75L29j344j416R59Q25M1l01
1509A58n48n94o81N52Q57M37k25j247m88R01P44k3J36r0q13m17P34J194M06l24
$$ plain form
1373 970 1851 2578 975 -485 -667 250 545 550 985 68 -1799 -1251 615 881 972 -235 -549 -485 -201 498
1393 498 1012 756 -193 -1380 -500 686 1420 632 -288 -617 -396 -436 551 927 -87 -1276 -1486 -865 231
1412 231 442 -303 -1019 -1329 -1300 -596 207 465 -1090 -1749 -1250 -439 452 545 -269 -767 -1010 -834 228 1126
1432 1126 1142 -422 -1339 -5 1064 1071 892 211 -507 -813 -368 992 1266 -37 -760 -1165 -441 -9 10
1451 10 94 -62 -1241 -1801 -597 823 421 -793 -684 -577 -439 766 1199 953 782 -372 44 1302
1469 1302 2165 1480 448 133 223 215 1300 1525 734 -285 -749 -177 740 886 91 -973 -1005 -674 -215 223
1489 223 944 151 -924 -775 18 1072 1382 562 -68 -35 -67 490 1065 1394 50 -1366 -407 418 459 158
1509 158 -390 -984 -1665 -1113 -256 181 -44 -1291 -1779 -878 -134 -157 -21 -111 -924 -1341 -607 587 993 669
1529F69j243k84O49J062J13q00k14j155M13J257M93l50j119j9K10M40L02J7m68
1548b7%n24j75J127K03j76n32n06J10N94N14J62n52q85p21J059J693j07j127j69
1568c9m05J30J024J08k50k17j047J12P91P54m02n44n41K8j79P42Q18m85q95o92
1588a189N43J271L14l74n06l79J19K57Q66O13j007j223K91N03M75J51q9r78n24
1607h66K35K03L95R40j445j257O20L99O19O02J05j248l95O87Q56K75K8j096n33
1626h76J069L40K17K39l77p85j60L88N85J23n17o95n26M21J6O80J23k41j079j51
1646a206R22P35N29j132n08J52p6R29Q18m36l29o40j0N94J114n01j106j97l7l
1666c88Q25N23n88r86m0L17L79P06o82k93m15R0K11R28L77j154o63L87J51Q62
$$ plain form
1529 669 -574 -858 -209 853 966 166 -48 -1203 -790 467 960 610 -509 -528 -318 122 424 441 -27
1548 -27 -27 -551 -726 401 604 428 -104 -610 -500 94 608 770 218 -667 -1388 -329 1364 1257 130 -39
1568 -39 -444 -314 710 818 568 351 -696 -584 207 961 559 15 -526 -498 -677 65 883 398 -497 -1189
1588 -1189 -646 625 939 565 59 -320 -201 56 922 1535 528 -695 -404 99 574 725 636 -342 -866
1607 -866 -631 -428 -33 907 -538 -1795 -1175 -776 -157 445 550 -698 -1093 -406 450 725 753 -343 -876
1626 -876 193 533 750 989 612 -173 -333 55 640 763 246 -449 -975 -554 -538 142 265 24 -1055 -1206
1646 -1206 -284 451 980 -152 -660 -508 -584 345 1163 727 398 -242 -252 342 1456 955 -151 -348 -385 -388
1666 -388 437 960 372 -614 -654 -337 42 748 66 -227 -642 -552 -341 587 964 -190 -853 -466 -315 547
1686E47P3p30Jn80J20M14O99K8q57m47K68N03O71K97p33m62n95J29J040M31o09
1707B08r96n19M24N72N76m65n24M5l70N97R76L91n26m29j42K22O17J59j37k72
1727D07p87J68R72L21m13q3o13L4J89L81J35l27m40j074K21R26L88k5k33q68j6
1748g37R79K00K54m25m07o75N36R92l67P4n62m60K88P12K79o8n09r79Q5Q00M69
1769D79n03m87k92k50k55Q63M68L2q00m16N52P62K01L35l97p13qN05L20P07q45
1790B58m01q3L63J44J63J24n86p53L12J62K96M44k98r53J35M27N29K26q5m73n57
1811f06JP77M58l23n04k53o5N17J92M49l15n68j17K73O74K58n1r34r4K4J45O40
1833E78L30n46n92j38N4R47J25o33o13J16o5M81N63j21n21n33K91M79M16L05o29
$$ plain form
1686 547 620 -110 -109 -689 -569 -155 544 572 -285 -732 -464 39 710 1007 274 -188 -783 -654 386 817 208
1707 208 -788 -1307 -883 -311 265 -200 -724 -679 -1049 -452 524 915 389 -40 -182 40 657 816 679 407
1727 407 -380 -212 760 1081 668 585 -28 6 195 576 711 384 -56 -1130 -909 17 405 380 147 -721 -737
1748 -737 242 442 696 271 -136 -811 -275 717 350 424 -138 -598 -310 402 681 613 104 -875 -790 10 479
1769 479 -24 -511 -803 -1053 -1308 -445 23 55 -745 -1161 -609 153 354 689 292 -421 -429 76 396 1103 258
1790 258 -143 -226 137 281 444 568 -18 -771 -459 -297 -1 443 145 -808 -673 -246 283 509 424 -49 -606
1811 -606 -605 172 630 307 -197 -450 -515 2 194 643 328 -240 -357 -84 590 848 797 -137 -231 -207 -62 578
1833 578 908 362 -230 -368 -314 633 758 125 -488 -372 -437 44 607 486 -35 -568 -277 202 618 923 294
1854B94l62J44PL19L28j33o12l66J28O23M9m19p0p52k3L89N09k66o2q22k8K13
1876i12O52J27Kk73m93j09P60L94K20l24n18J87L85J51L60j73k90n15j33O26M84
1897F08n13k4p01o6O04o3K21k00o33j05O24L65K40k61j67J07j34O18K80K3l16
1918E07n97j08L13O57J28j40r08j50J05J97K99k94l59m69J84O12L66r9j25l31
1938b12m37M28M35M51l51m44l14M71K16K13K36n47k95n1M48K35J12k80p14J58
1958b42J19K97L02j66m30l12o9N12M88j7o28k66p5M67M6J51k20m01m19L80P18
1979B35O5n3o31J12j37K97O15k9l79k76j35L54L33J14m34n46P3j92O75K13m53
2000a79k44l81l9Q09J20k2m87p2K76k44O16L86j10m66J1J51N81M18n39k17J63
$$ plain form
1854 294 -68 76 83 402 730 597 -15 -381 -253 370 419 0 -70 -822 -845 -456 53 -213 -275 -1097 -1125 -912
1876 -912 -260 -133 -131 -404 -897 -1006 -246 148 368 44 -474 -287 98 249 609 436 146 -369 -502 124 608
1897 608 95 71 -630 -696 -92 -155 66 -134 -767 -872 -248 117 357 96 -71 36 -98 520 800 823 507
1918 507 -90 -198 115 772 900 760 -148 -298 -193 4 303 9 -350 -819 -635 -23 343 244 119 -212
1938 -212 -649 -221 214 665 314 -130 -444 27 243 456 692 145 -150 -201 247 482 594 314 -400 -242
1958 -242 -123 174 476 310 -120 -432 -501 11 499 482 -146 -412 -487 -20 26 177 -43 -444 -863 -483 235
1979 235 300 247 -384 -272 -409 -112 503 474 95 -181 -316 38 371 485 51 -495 -422 -614 61 274 -179
2000 -179 -423 -804 -843 -34 86 64 -423 -495 -219 -463 153 539 429 -37 -26 125 706 1124 585 368 531
2021E31m21l6L85P3l71k08k6l27N01K98m24l83m5j80K25P72J8j88o28J92K96L91
2043D45M29k77n20k50L57K21L10j85l59n30o8O09J81J22m78o37k38R01j33L64
2063B64m7m05l10L9L25L84jk62m36j37O38J16K53j05m34M3n8L22J41O1j97l54
2085a60l39O89K62r3l21j91j64J97L62J4M7n58r2J2N61j11j62k64K5j48L89N73
2107E28k27j60k72j44K43L53K32k61m48K15l97N38K85j96k14j47o27M83L94J88
2127C66m13m73N4j29L49N39n32l23l4n2L87M00p0k82J20j49K74L37K31J44n88
2148A56l78N44k4J97j91l87k66j46K93J63J1m16m26J78L81L4M03K50p91j3L26
2169a02J47L43K68l06l85j84M46J37J28r1r15J18L79j14J55k6k54k84K71M44K29
$$ plain form
2021 531 110 74 459 532 161 -47 -73 -400 101 399 -25 -408 -453 -633 -408 364 382 194 -434 -242 54 445
2043 445 874 597 77 -173 184 405 715 530 171 -359 -427 182 363 485 7 -630 -868 33 -100 264
2063 264 217 -188 -498 -459 -134 250 249 -13 -449 -586 52 168 421 316 -118 -75 -133 189 330 391 194 -160
2085 -160 -499 190 452 359 38 -153 -317 -120 242 256 303 -255 -347 -335 226 115 -47 -311 -286 -434 -45 528
2107 528 301 141 -131 -275 -32 321 553 292 -156 59 -338 200 485 289 75 -72 -699 -216 178 366
2127 366 -47 -520 -466 -595 -246 293 -239 -562 -596 -648 -261 139 69 -213 -93 -242 32 369 600 744 156
2148 156 -222 322 298 495 304 -83 -349 -495 -202 -39 -28 -444 -870 -692 -311 -277 126 376 -415 -428 -102
2169 -102 45 388 656 350 -35 -219 227 364 492 401 -514 -396 -17 -131 24 -2 -256 -540 -269 175 404
2190D04k76m0J46l46K39K00m6l18k92j0Q0L38K28k05l08P3j92N14M98l24K19p17
2212a35J8K92K73R0k78J04m68r6O79o6j46l11j95l97K59K90l38K20k87j86J11
2233e67M04L61l36p7j51M36j33O8J09k88q3k28M31J50K17L4m45L4k79N00L12k07
2255B62m23k38k62L70L34j78R8n70k27N06L25L95l98J13o04N12KN60k30j54J74
2276C67l53K03M27k52J64k57m06J16qN7J02m86n45M57R8K90r5L68m81j84P14j08
2298A88j5K94k38o05M82L11j34P8k99k44Q2J09N53j85p7l67k92J09M60Q2k83k3
2320a4l30J44K40J13N9l18j80j20l1O21j46J31l55N6M3O4J38J00l79K0j4l16L76
2343i8K42k72j88J24O0R8J70l10k71N7j6j34Q99j70o29J94k31K21M12N9q8r3o1
$$ plain form
2190 404 128 88 234 -112 127 327 281 -37 -329 -339 -259 79 307 102 -206 -133 -325 189 687 363 582 -135
2212 -135 -117 175 448 538 260 364 -104 -200 479 413 267 -44 -239 -636 -377 -87 -425 -205 -492 -678 -567
2233 -567 -163 198 -138 -215 -366 70 -63 5 114 -174 -257 -485 -54 96 313 347 -98 -64 -343 157 469 262
2255 262 -161 -399 -661 -291 43 -135 -37 -607 -834 -328 -3 392 -6 107 -497 15 17 577 347 193 367
2276 367 14 217 644 392 556 299 -107 9 1 58 160 -326 -871 -414 -316 -26 -121 247 -234 -418 296 188
2298 188 173 467 229 -376 106 417 283 361 62 -182 -100 9 562 377 300 -67 -359 -250 210 292 9 -14
2320 -14 -344 -200 40 153 212 -106 -286 -406 -437 184 38 169 -186 -130 -87 -23 115 215 -164 -144 -158 -474 -98
2343 -98 144 -128 -316 -192 -132 -34 136 -174 -445 -388 -404 -538 361 191 -438 -244 -475 -254 158 217 129 36 -25
2366b5j57M6N57j76l13n4K36J27K03L6k86j46l2k07M77K33m11K9k68r1K96J92
2388B66k0l96J77m46R0O75j08K0k76o7k31P05j47m4j73k11O5J56M52l59k91J71
2410HJ44l39N12j67k77Q9k57k23L11J02k03M8m35J34K75M84K8k14k27j43R0L10
2432E0L40j58k95j76M39K71o4j40k24j06m4M3O5J63l07j14m2J61K2J88k67k37
2454d32M1J62o1N97k50Q7J58l11M4J07p9J5J54m98K56L15J0J47k53m56K06M76
2476D35j55k6j11n75J73K33k3m6O0p6k61L40J41J27J1n6m63L60q1O7K28j58o3
2499H1j92K02k7L34K8l49k03K75j6k7J31ll90l8k7L16K46k27k99k66K36J85J0
2522b0l6k7k51J35k36K73M21k79l6M47l64p0K40K18l62k5J30l4P4J92l99j53Q
$$ plain form
2366 -25 -182 -136 421 245 -68 -122 114 241 444 480 194 48 16 -191 286 519 108 137 -131 -222 74 266
2388 266 246 -150 27 -419 -329 346 238 258 -18 -85 -316 389 242 198 25 -186 -121 35 487 128 -163 8
2410 8 152 -187 325 158 -119 -30 -287 -510 -199 -97 -300 -252 -687 -553 -278 206 234 20 -207 -350 -260 50
2432 50 390 232 -63 -239 200 471 407 267 43 -63 -107 -64 1 164 -143 -257 -299 -138 -116 72 -195 -432
2454 -432 -391 -229 -290 307 57 144 302 -9 35 142 63 78 232 -266 -10 305 315 462 209 -247 -41 435
2476 435 280 254 143 -432 -259 -26 -49 -95 -35 -111 -372 -32 109 236 247 191 -272 88 7 74 302 144 81
2499 81 -111 91 64 398 426 77 -126 149 133 106 237 234 -156 -194 -221 95 341 114 -185 -451 -215 -30 -20
2522 -20 -56 -83 -334 -199 -435 -162 259 -20 -56 391 27 -43 197 415 53 28 158 124 198 390 -9 -162 -154
2545a54j44L16mj35k41J67p3L50N5k34J39m36n7L85K99J14m73L42l36J36N05n2
2567D69j20j65J09m18L60P3m0m40k49K18J97Jk73L85l68N1j18K56P6j16Ko4j02
2590b76L44l0K55q5k71Kj55M14J15l8l87j65J88P8OJ26m11N5l14N85k02K32j47
2613h1k39L19Q4k2M9J36j04j79J26j52k01L61l10KR7K29j23K44k90j20J45K06
2635A77J5J0J63k5k36j29K11NK4k51jk37K93l11L64j88J1k00J7L09K04l4k5m42
2659b76J31M92m17J89M55j78k16j32L00j70j42k8O3l43L77j95O5K1n6l02K00L20
2681A58q5l9l27M1K89j73K88K3J03m27L00q8J83p8j73P8k32J4K08M8k80j26Q3
2704b12K7K50j59r6R9k79J67M4k85L23r1p9J97k0J50K43J1l92m7L29P9j1k44P7
$$ plain form
2545 -154 -298 18 14 -121 -362 -195 -268 82 137 -97 42 -394 -451 -66 233 347 -126 216 -120 16 521 469
2567 469 349 184 293 -125 235 308 268 -172 -421 -203 -6 -5 -278 107 -261 -210 -328 -72 4 -112 -110 -174 -276
2590 -276 68 38 293 208 -63 -61 -216 198 313 275 -112 -277 -89 -11 -5 121 -290 -235 -549 36 -166 66 -81
2613 -81 -320 -1 83 61 110 246 142 -37 89 -63 -264 97 -213 -211 -114 115 -8 236 -54 -174 -29 177
2635 177 192 202 365 340 104 -25 186 191 215 -36 -37 -274 19 -292 72 -116 -105 -305 -288 21 225 191 166 -276
2659 -276 -145 347 -70 119 574 396 180 48 348 178 36 8 71 -272 105 -90 -25 -4 -60 -362 -162 158
2681 158 73 34 -293 -252 37 -136 152 175 278 -149 151 63 246 168 -5 73 -159 -145 63 111 -169 -295 -212
2704 -212 -185 65 -94 -190 -91 -370 -203 -159 -444 -121 -212 -291 -94 -114 36 279 290 -102 -149 180 259 248 4 81
2728H1k56K8J19N7M33l06k78J07O3k74L70J13o4n00K90K53l58J22M28n95L9K41
2750A13j20L94M9l12R2k16k8L89n30J12n2J0J81J29J10k03j33j02J72K26P2l45
2772HJ16n5k32M8J52j56J61j92q2k46O65k80K13j08j5k09L44J42mj29L4l12K22
2795H5J87j46j3q4o1k57L18j94J48J2k90L6k3M07l64o3R0K53j95K57K71m51K64
2818A87m37M33K26j21m7k75J90j40O1o4k07N83m41n3j91J73K89j21J68l89K28
2839E2n7O9O4m54L06k37N47l37R0j60L7j0J33j35L95k28pj82M49Pn86L45J03k17
2863a3Q6k74K38kj26j22J50j7j5L18m04N7qp5N4j2J33J21j21J25j21J62N2k88
2887a02p5K06J51k05L19l34n2J02n9K49p8J42m87N2N3j03mM2J93k96Q0j7j7J68
$$ plain form
2728 81 -175 -147 -28 29 462 156 -122 -15 48 -226 144 257 193 -307 -17 236 -122 0 428 -167 -128 113
2750 113 -7 387 436 124 216 0 -28 361 -169 -57 -109 -99 82 211 321 118 -15 -117 55 281 353 8
2772 8 124 69 -163 -115 37 -119 42 -150 -232 -478 187 -93 120 12 -3 -212 132 274 270 141 175 -137 85
2795 85 272 126 113 29 -32 -289 29 -165 -17 -5 -295 -259 -282 125 -239 -302 -212 41 -154 103 374 -77 187
2818 187 -250 183 409 288 241 -34 156 16 77 13 -194 389 -52 -105 -296 -123 166 45 213 -176 52
2839 52 -5 64 128 -326 -20 -257 290 -47 43 -117 -80 -90 43 -92 303 75 68 -114 335 342 -244 101 204 -13
2863 -13 73 -201 37 35 -91 -213 -63 -80 -95 223 -181 -124 -132 -207 -153 -165 -32 89 -32 93 -28 134 186 -102
2887 -102 -177 29 180 -25 294 -40 -92 10 -49 200 122 264 -223 -171 -118 -221 -225 -183 10 -286 -206 -223 -240 -72
2911g2L4J10j47j5J8O6j7J14lr2J32r3Q9j34n6k71O32n22L33p3q4J72m77K50L44
2936B38J7l56J34l47K49n0M19n39K24Q9N4k6J27K15l02k10J29J50j41J17k07J17
2958A01j47N3J5M2N9k78K59l70K44J85k85j45K32j12Q5K49k47j5j3j43K37k49
2980b43M23k05K01pj69J34N1m0Q4r2j84m7K24N8n7l24J89j73K57o6r6K53k98j19
3004b46K13l3K59j83j78J56j53L02p7J41k63M4lJ03N5J06k01K07l06r6K45J49
3026B41k37j28k5rJ26J08N9j6l65M8p2R1J00J02l63K62J39k86M77n1l08K2l6L13
3050A92j52J41L0m6l33Oj7J53K29l72L0l7K40n6Q0k27j2J32k16K52k37L84j32
3073C2k38m3J61N8j9l5J32j54K33J68j07k45L76n42L66j20j02Q3k56J49N3l4P
$$ plain form
2911 -72 -38 72 -75 -90 -72 -6 -23 91 88 -4 128 35 124 -10 -66 -337 295 -227 106 33 -51 121 -356 -106 238
2936 238 255 -101 33 -314 -65 -115 304 -235 -11 78 132 106 233 448 146 -64 65 215 74 191 -16 101
2958 101 -46 7 22 64 123 -155 104 -266 -22 163 -122 -267 -35 -147 -62 187 -60 -75 -88 -231 6 -243
2980 -243 180 -25 176 169 0 134 185 145 229 137 -47 -94 130 188 131 -193 -4 -177 80 14 -82 171 -127 -246
3004 -246 -33 -66 193 10 -168 -12 -165 137 60 201 -62 -18 -21 82 137 243 42 249 -57 -153 92 241
3026 241 4 -124 -149 -158 -32 76 135 119 -246 -198 -270 -179 -79 23 -340 -78 61 -225 252 201 -107 -85 -121 192
3050 192 40 181 211 165 -168 -162 -179 -26 203 -169 -139 -176 64 8 88 -139 -151 -19 -235 17 -220 164 32
3073 32 -206 -249 -88 -30 -49 -84 48 -106 127 295 188 -57 319 -223 143 23 -79 4 -252 -103 -50 -84 -77
3096g7j8m6N8k11L23q1J96k00K19m00J3K27K25J48k30j20J24J75n2K19k96k66
3118g0K12j99J59q7j3k21R6J25p4K36j53N1R0l57Q1J54N5r1k83J01K9K48J2k52
3142a51K02k06L10j00J34J05l70K89j65q8K77J1l02j88K41jj5k9M9k00Q4j2O3
3165f2r6J10N0k70K9oL86j15m8O0j90O9K03q3K7l7p2j16J56K18k7k41M8J56mk15
3191g0p8K29j05O6j01L9J44k74K6j22J9K26J68J68n22J36Q4n8L30l95L84n08L60
3214A46k47K38K13j28j32j89Q7l9j00K24N5k59m0R0nJ4M0R4k36J21n9K13o8j14
3238h1L37j67k14L15P9l06o7Q4m2J21l62K99J17k38p2L05l0q3P0j11L0o3j02P8
3262a03j1J71k72j68L27O7j20J14N4p4l9J32O7M6r6k22J06K23m3k48K59j46j83
$$ plain form
3096 -77 -95 -141 -83 -294 29 -52 144 -56 163 -237 -224 3 228 376 146 26 150 325 273 492 196 -70
3118 -70 142 -57 102 15 2 -219 -123 2 -72 164 11 62 152 -205 -124 30 85 -6 -289 -188 -159 89 101 -151
3142 -151 51 -155 155 55 189 294 -76 213 48 -40 237 248 -54 -242 -1 -2 -17 -46 3 -197 -113 -125 -62
3165 -62 -158 -48 2 -268 -239 -245 141 26 -22 38 -152 -83 120 37 64 27 -45 -161 -5 213 186 -55 -7 149 145 -70
3191 -70 -148 81 -24 42 -59 -20 124 -150 -124 -246 -227 -1 167 335 -187 -51 33 -25 305 -90 294 -214 146
3214 146 -101 137 350 222 90 -99 -12 -51 -151 73 128 -131 -171 -81 -86 -72 -32 62 -174 -53 -112 101 33 -81
3238 -81 256 89 -125 190 269 -37 -104 -20 -62 59 -303 -4 113 -125 -197 108 78 -5 65 -46 -16 -79 -181 -103
3262 -103 -114 57 -215 -383 -56 11 -109 5 59 -15 -54 78 145 191 95 -127 -21 202 159 -89 170 24 -159
3285a59J36j4j26R8o1K17k89K68p1L3p9j49N5j05K21J0J77j79Q3q7J98J77k14
3308A40k09j01L2R8J94l5n7k86K84L9m6J2J13k19j51J39L12k27l4R4k13K18p9
3331A8j1j63J46j08J2J51J30j50R0j40K08P2l76J69m3Kq3J16j72J41K49k76k02
3354b20M1M4L8J07j21K91j51k08K26J37j14k4J4J33k8l15J72Lo6K1J5K45j33N
3378A12k79J62r3K5K42l22J16q1J95j72K09K5m40L45k22Nk79O49k52R7k07K96
3400A31M9n1J47j57j30q6L41j83O2n0J1k18J86l57J82j19J55j70Q5K47j34K31
3422A72r4l4m30K44J97Q8k05K00l79K21J88J38r8n17L70k31J8K06P9j64R9j84
3444a16rR2K15O2l61k94K82o2J59M3L8j13L1k6j47J29J5J99k25J64k32M99l07
$$ plain form
3285 -159 -23 -37 -163 -65 -126 91 -198 70 -1 32 -47 -196 -141 -246 -25 -15 162 -17 66 -21 177 354 140
3308 140 -69 -170 -138 -40 154 119 62 -224 60 99 53 65 178 -41 -192 -53 259 32 -2 92 -121 97 18
3331 18 7 -156 -10 -118 -106 45 175 25 115 -25 183 255 -121 48 5 7 -76 40 -132 9 258 -18 -220
3354 -220 -179 -135 -97 10 -111 180 29 -179 47 184 70 46 60 193 165 -150 22 25 -41 -20 -5 240 107 112
3378 112 -167 -5 -98 -73 169 -153 -37 -118 77 -95 114 139 -301 44 -178 -173 -452 197 -55 42 -165 131
3400 131 180 129 276 119 -11 -97 244 61 123 73 84 -134 52 -305 -123 -242 -87 -257 -172 75 -59 172
3422 172 78 44 -386 -142 55 143 -62 138 -241 -20 168 306 208 -309 61 -170 -152 54 133 -31 68 -116
3444 -116 -125 -33 182 244 -117 -411 -129 -191 -32 11 49 -64 -33 -59 -206 -77 -62 137 -88 76 -156 343 36
3467C6j09j11J11L12j39r3r9J2J81r6j44K07J44l66k1k50M26K17j58m8J72k49
3489f5J76k61L66q3j92J9J46j19J36K2j78M0j56K70l0J65m11N1p0K56Ml54K34
3512c4k20l0P0K0J18k01K94m29M86m7j84P9K18j3l31K07j75L35J09o3q1j52J13
3535H9l3M4l7m4J48k20Q4n2J15r5l25J05J79N6L2j46r8Q5M18m13K01k42J38q3
3559i4O9J20q0j09N9q5J83r9L16o4k68R4j88K13J1R6l14P6J84r6J28l64K99k70
3583a83J21J36o9L7j44J40j68k4K09N3j90J79m08J35J14o8K05r6K46j24j67J27
3605F1P5r7K4p0p6Ql3K02j2j45j70o4j6N08N6l28KQj22L08J70k79K39k35K57j90
3631H1j09J86l98J92K4J62JP5j15M4l86K30j46K78j77k44K05j67L53J65m53L92
$$ plain form
3467 36 -73 -184 -73 239 100 7 -92 -80 101 5 -139 68 212 -154 -175 -425 1 218 60 12 184 -65
3489 -65 111 -150 216 133 -59 -40 106 -13 123 145 -33 7 -149 121 91 256 -155 -104 -174 82 86 -268 -34
3512 -34 -254 -284 -214 -194 -76 -277 17 -412 74 27 -157 -78 140 127 -204 3 -172 163 272 209 128 -24 89
3535 89 56 100 63 19 167 -53 31 -21 94 -1 -326 -221 -42 14 46 -100 -198 -113 305 -108 93 -149 -11 -94
3559 -94 -25 95 15 -94 -35 -120 63 -36 280 216 -52 42 -146 67 78 174 -140 -64 120 24 152 -212 87 -183
3583 -183 -62 74 5 42 -102 38 -130 -154 55 108 -82 97 -311 -176 -62 -130 75 -21 225 101 -66 61
3605 61 136 39 63 -7 -83 -75 -108 94 82 -63 -233 -297 -313 195 251 -77 -75 -67 -189 119 289 10 249 14 271 81
3631 81 -28 158 -240 -48 -24 138 139 214 99 143 -243 -13 -159 119 -58 -302 -97 -264 89 254 -199 193
3653A93l56K09J0q2j6q9L12l13R8m2J86k5m9k98K91J80j20J31l72J06L6o6R2J34
3677A50k58J48n5M6k24L48n7J6j40J5k40K31K35k10o6j91J07J71m7K39j91k4K79
3700B82j82j62J39K35l65J77k40o7K63l18L45k82P2k67K60J8j5J68q2Q6k77N2
3722a60P2l7J37l9P7j39p0J28r1j06K07l3N6j42J57K37m40J17J79J00l37l4J70
3745IJ56j55j85or8R8R6J06J22k20r1L90k06l2O3K2j48k85L30Q3k02N06l59L9
3769C3j48l0J8O1j7j78P2J49K90l03NJ97k79J8L23k75L53l80J61p4J32J70l54
3792e6J98k11j66P5J60K72K6N4k85j05J04j07rn2K48J28l93J62k54L15j08N5j83
3815a32L6J82m2j46K23k03L2P4j13n7J72j8k3nr1K68m00K57j92K48j0J5k15P4
$$ plain form
3653 193 -163 46 56 -26 -42 -131 181 -132 -34 -76 110 85 36 -262 29 209 89 220 -152 -46 -10 -76 16 150
3677 150 -108 40 -15 31 -193 155 98 114 -26 -11 -251 -20 215 5 -61 -252 -145 26 -21 218 27 3 282
3700 282 100 -62 77 312 -53 124 -116 -183 80 -238 107 -175 -103 -370 -110 -92 -107 61 -21 65 -212 -160
3722 -160 -88 -125 12 -27 50 -89 -159 -31 -122 -228 -21 -54 2 -140 17 254 -186 -69 110 210 -127 -161 9
3745 9 165 10 -175 -181 -279 -181 -85 21 143 -77 -168 222 16 -16 47 69 -79 -364 -34 49 -153 353 -6 33
3769 33 -115 -145 -127 -66 -83 -261 -189 -40 250 -53 -48 149 -130 -112 211 -64 289 -91 70 -4 128 298 -56
3792 -56 142 -69 -235 -160 0 272 298 352 67 -38 66 -41 -50 -102 146 274 -119 43 -211 104 -4 51 -132
3815 -132 -96 86 44 -102 121 -82 -50 24 -89 -146 26 8 -15 -20 -111 157 -243 14 -178 70 60 75 -140 -66
3839f6M3k54P9M38k61j39J45k62M40l82J72q5J28J18J08K3k43Jj05L3J48K3N9
3862A61j58j51p3J08L09l2lk43N8l3p4m0K48j90m4q0K96J9j12j30J98j10J93l4
3886H3k83R5J10K3p8M2j00K65j59p1J12pj02J02P8m31L01M8j48K9L7j02M1Q9o1
3911h7O9K3j50J19j35R9J58j93Q0o0r0J48o7M5K02j13p7j63K36r6J48Q3K58l00
3935A37j45r0K71p5M4l61Q4j26L88k52K40k4k18J48k8j6K50l67J50LK1k65N89
3958C58o28L33j17q5j1J16J1J23l00J80j32N6M9k05J14O3R1m4l5m3k79L80J33
3981A28K89l73j11J72j72J45M9p2J83K0k92K33m38L25J64l46O1n8M9k4K3J22k60
4004a83O3l4N3L6j13K54r4l1J7PPJ60k8j74L77l03j52L54r4j75K82l39J66N6p6
$$ plain form
3839 -66 -23 -277 -198 240 -21 -160 -15 -277 163 -219 -47 -132 -4 114 222 245 2 3 -102 -69 79 102 161
3862 161 3 -148 -221 -113 196 164 161 -82 -24 -57 -131 -171 77 -113 -157 -237 59 78 -34 -164 34 -76 117 83
3886 83 -200 -105 5 28 -50 -8 -108 157 -2 -73 39 32 -70 32 110 -321 -20 28 -120 -91 -54 -156 -115 -26 -87
3911 -87 -18 5 -145 -26 -161 -62 96 -97 -17 -77 -167 -19 -86 -41 161 48 -29 -192 44 -52 96 179 437 137
3935 137 -8 -98 173 98 142 -219 -135 -261 127 -125 115 91 -127 21 -7 -23 227 -140 10 13 34 -231 358
3958 358 -270 63 -54 -139 -150 -34 -23 100 -200 -20 -152 -96 -47 -252 -138 -75 16 -28 -63 -106 -385 -5 128
3981 128 417 44 -67 105 -67 78 127 55 238 258 -34 199 -239 86 250 -96 -35 -93 -44 -68 -45 77 -183
4004 -183 -120 -154 -101 -65 -178 76 -18 -49 -32 -25 -18 142 114 -60 317 14 -138 216 122 -53 229 -110 56 112 36
4029C6l5j98K0L26l0k45J84j18j7L06k42nM0O5k60o0K46K58k11q2Q2k95J73K1
4053d1N3q5j52kJ85M7L6j6o3j45K67o3k8l4q9J1l5MJ85p0k63K64K45k45O0k89
4079b63L52j01j13k0K81K4j38p0p3K61l9j52K2j03P1N6J36N0j24J4Kj95J19k78
4103b81K83j79J99M1l29L33m2J87l7n3j73K1J29M2o3K9k2k7r8K15r2j02j2m9K65
4128A85l32K52k57L4j00J08L45n8m69K84P3l13N67l66J95n17J74J2L04kj65J55
4150A09J37k15K27k5m02K12O0J44k45o5R6k3J72k61m4J69r1K33q7j67J53k55J43
4173b5Rp8J50j99J37l7r2M53j23n35L66q2Q3k11K88k32L05r6j8p5K44j21j64K90
4197B37l27J75j58o9L52m8n8P8j20j6j61K4R9j57PJ60J10o7K39j78ol3j96J21
$$ plain form
4029 36 1 -197 -177 149 119 -126 58 -60 -77 229 -13 -18 22 87 -173 -233 13 271 60 -22 60 -235 -62 -41
4053 -41 12 -73 -225 -227 -42 5 41 25 -38 -183 84 21 -7 -41 -130 -119 -154 -150 35 -35 -298 -34 211 -34 26 -263
4079 -263 89 -12 -125 -145 136 160 22 -48 -121 140 101 -51 -29 -132 -61 -5 131 181 57 71 73 -122 -3 -281
4103 -281 2 -177 22 63 -266 67 25 212 175 122 -51 -30 99 141 78 107 85 58 -40 175 83 -19 -31 -80 185
4128 185 -147 105 -152 -118 -218 -110 235 177 -292 -8 65 -248 319 -47 148 -369 -195 -183 121 119 -46 109
4150 109 246 31 258 233 -169 43 103 247 2 -63 33 10 182 -79 -123 46 -45 188 101 -66 87 -168 -25
4173 -25 -16 -94 56 -143 -6 -43 -135 318 195 -340 26 -56 27 -184 104 -128 177 81 63 -12 232 111 -53 237
4197 237 -90 85 -73 -142 210 162 104 182 62 46 -115 -91 8 -149 -142 18 128 61 300 122 116 83 -113 8
4221Hj31J74K7j85J85j74r8L84m01K39j31l2L2pL28m09K27J67p1l2J50jl57J49
4245D1k13J51J70k8r0j25K22j67j00M3J78j36q0R3k53Q3r9K43K82j37M3j32K21
4268B10j62j97K7J86k82K39q6OK21q3R7k62J87k58K28j61l3J53m8p4K97k98J08
4291A5j92J87k40K26J52k08N9J09n7j0L0j52p8J07J24j73N0k3M8o4J41j67K12
4314I6j57J03j33q0K60K7%L2k02q2J03J73k01J49j66p9K1J62L2k07J62k02K82
4337I3l03L40j57kN7q6K60m45J45L5R5q9j48J59j00j7L0L50k40o7J48j35J04j51
4361a24k2M2L5M0j47M02k50j10R9K62l07k4J68q6J95k81L03k48K7K0J1j99M51
4384B57l2M3j83j82j4j6O3q2q3J45j7p6M18k44J73j36r0K44p2L5O6k68J06J45
$$ plain form
4221 8 -123 51 78 -107 78 -96 -194 190 -211 28 -103 -135 -103 -110 218 -191 36 203 132 100 250 249 -108 41
4245 41 -172 -21 149 121 31 -94 128 -39 -139 -96 82 -54 -134 -41 -294 -211 -310 -67 215 78 121 -11 210
4268 210 48 -149 -122 64 -218 21 -65 -59 162 79 176 -86 101 -157 71 -90 -123 30 -18 -92 205 -93 15
4291 15 -177 10 -230 -4 148 -60 -1 108 51 41 71 -81 -159 -52 72 -101 -51 -74 -26 -90 51 -116 96
4314 96 -61 42 -91 -171 89 116 116 148 -54 -136 -33 140 -61 88 -78 -157 -136 26 58 -149 13 -189 93
4337 93 -210 130 -27 -29 28 -58 202 -243 -98 -63 32 -57 -205 -46 -146 -163 -133 217 -23 -90 58 -77 27 -124
4361 -124 -146 -104 -69 -29 -176 226 -24 -134 -35 227 -80 -104 64 -22 173 -108 195 -53 -26 -6 5 -194 257
4384 257 225 268 85 -97 -111 -127 -64 -146 -229 -84 -101 -177 241 -3 170 34 -56 188 116 151 217 -51 55 200
4408B00j62Q9J2O6l55J52r4J95k12J27l2k02M70k09j2L55n54Q5p6M8J00Q0q4J37
4432A24j01n2L81j78r5P2j20n8J66o9L6k85J96J09k94K49j35r8K07k18n6K60L1
4455G2j90p%J11n9P0M1k16L09j72L4j05J83j04o7O1K38l71K79N1k34K39k28K08
4479A43k25J7L8J13q2J00l3O2l44K52J94j63R1l28P3J04j69J95K9N1J12j61j31
4502f2k8nJ58k3q8J36k02L58j43M4k4k54K48j55K02j78Pj16L17l88M96pk52n3
4526a2j82M0j79L98M9j09o8K15k20R8M6j83r3K02k03J63j73L50j66Nj41K91kk68
4550a42K81m7Q8m07K82m2j26O5J04R8n5JJ81o6j62l8O4PJ47j02j74J33J82l31
4574e9j1J15k9j1k00J41Jj65J65p4J04j37J69j17J42n5m7L2J72j76O4R1j01j34
$$ plain form
4408 200 38 127 139 205 -150 2 -92 103 -109 18 -14 -216 254 45 33 388 -166 -81 -157 -109 -9 71 -13 124
4432 124 23 -29 352 174 79 151 31 -27 139 70 106 -179 17 126 -168 81 -54 -152 55 -163 -219 41 72
4455 72 -118 -125 -125 -14 -73 -3 38 -178 131 -41 -7 -112 71 -33 -100 -39 199 -172 107 158 -76 163 -65 143
4479 143 -82 -65 -27 86 4 104 71 133 -211 41 235 72 163 -165 -92 12 -157 38 67 118 230 69 -62
4502 -62 -90 -95 63 40 -48 88 -114 244 101 145 121 -133 115 -40 162 -16 -9 -125 192 -196 300 293 41 -12
4526 -12 -194 -154 -333 65 114 5 -63 152 -68 30 76 -107 -200 2 -201 -38 -211 139 -27 -22 -163 128 126 -142
4550 -142 139 92 180 -227 55 13 -113 -48 56 154 99 100 281 215 53 15 79 86 233 131 -43 90 272 -59
4574 -59 -70 45 16 5 -195 -54 -53 -218 -53 -127 -23 -160 9 -108 34 -21 -68 -36 136 -40 24 115 14 -120
4598a20R3L44j69M2l36M8j55L01L2j57K37l56j6J71Q4j29L24k06q0j87L5J04L40
4621B44m94J53P1qoR2lj58J88L8l9r3j73J9J98j01m1J43L3m53K60J08J2k05J92
4646b3m7K2M2pl4Q9k58O1R1N1J58O2k40J16J70k14J1j66J34j9J93l26J18L2P5
4671I1l3P8j76j04lJ74p8R4R3m31K79j79J95j22J56R4l19J31q3K93j59n2NK53
4695A97o8j6o4lKj8J09Mq5j08j27N20k58k3j01J52l14m1J92M3p3j9J92j03J4J90
4721A94k13K6m8J59j12M4J56j84M7M0L5l1j28m0P9J30k65mK34j28O3o7K9q7m7
4746a18K20j64M54j98j54j7J40j26N8k15n1K88j11N2J10q8j39k71K77K01k90K68
4768A26J6m79K32J10k26M30p0j09L4K8M0n8P6j87m9J61k93K82j4O4l21K22q2K69
$$ plain form
4598 -120 -27 317 148 190 -146 -98 -253 48 80 -77 160 -196 -212 -41 43 -86 238 32 -48 -235 -200 -96 244
4621 244 -250 -97 -26 -34 -40 52 49 -109 79 117 78 -15 -188 -169 29 -72 -113 30 63 -390 -130 -22 -10 -215 -23
4646 -23 -70 -48 -6 -13 -47 42 -216 -155 -64 -13 145 207 -33 83 253 39 50 -116 18 -1 192 -134 -16 16 91
4671 91 58 136 -40 -144 -147 27 -51 43 136 -295 -16 -195 0 -122 34 128 -191 -60 -143 150 -9 -61 -56 197
4695 197 129 113 49 46 48 30 139 143 58 -50 -177 343 85 62 -39 113 -201 -242 -50 -7 -80 -99 93 -10 4 194
4721 194 -19 7 -41 118 6 50 206 22 69 109 144 113 -15 -55 24 154 -111 -115 119 -9 54 -13 16 -71 -118
4746 -118 102 -62 392 194 40 23 163 37 95 -120 -171 117 6 58 168 80 -59 -330 -53 148 -142 126
4768 126 142 -337 -105 5 -221 209 139 30 64 92 132 74 150 -37 -86 75 -218 64 50 114 -207 15 -67 202
4792B02j75k85J44O6j26J57j46J93L06l24L04m62J19k55L54k12L3P0j87J55J2
4813e7K42j81M2j19J50N6k38Q4K11j66r9J85j33J79j39k7k3L49l39J92j00j59
4835i0j55M89j35L2l51L46K4j49R0k40l9K65j51N4k2J16Q6k49J29j61P9P5Nl12
4859b64M79k35OQ9J46k48J80k87K40m9q3Q9l27J81n1j79J37J45j27L72l50J57
4881B1kN0Ll2j85J61K67p21L68K9j14K09j39J8J5J56m8k49K82q6j40K75m17K22
4905e7L8op1j77K15j28J55J21k7j1m0j31J26j57J83R8k1k54K5N7O9K8k71P1l2
4930a97K75J77N6l40J12r2L9j0o6J95j17j57K91k61L2L16k13k00L0P1l0J22k34
4953b01L66q7L8j25L2q8J76k36J49l9J29j6K8P4k28l4K32l66k2J84q6J1K09k5
$$ plain form
4792 202 27 -258 -114 -48 -174 -17 -163 30 336 12 316 -146 -27 -282 72 -140 -107 -37 -224 -69 -57
4813 -57 185 4 46 -73 77 133 -105 -21 190 24 -75 110 -23 156 17 -10 -33 316 -23 169 69 -90
4835 -90 -245 244 109 141 -210 136 160 11 101 -139 -178 87 -64 -10 -32 84 170 -79 50 -111 -32 43 48 -264
4859 -264 215 -20 -14 75 221 -27 153 -134 106 57 -26 63 -264 -83 -134 -313 -176 -31 -158 214 -136 21
4881 21 19 69 72 40 -145 16 283 -438 -70 -41 -155 54 -85 -67 -52 104 56 -193 89 3 -137 138 -279 -57
4905 -57 -19 -25 -96 -273 -58 -186 -31 90 63 52 12 -119 7 -150 33 131 110 -144 -119 -62 7 35 -236 -165 -197
4930 -197 78 255 311 -29 83 -9 30 20 -46 149 32 -125 166 -95 -63 253 40 -160 -130 -59 -89 33 -201
4953 -201 165 78 116 -9 23 -65 111 -125 24 -15 114 98 126 200 -28 -62 170 -196 -218 -34 -120 -109 100 75
4977G5N4m4k71N83m69J01j88J91K3J02j36nK91r8k66K52N3q4j06o4J97m04L00
5000H7k25N2Q1K2M46l47k33J43k34J94r4K53k96J41o7j49J79o9K5L14k13j88J3
5023a65M12k33k9N9j90J36J06ok25K68l54J26k20M12j99R3NQ5q0J16k24J44j0
5046B7J98q7n8K8j51J0J25j39j1J89j55l29L27J55l25M73m96L68r5m7Q6j52n0
5069a09J04j70M29k98L3n3Q5p1K79k28K60n74M36j33p2j07K35q3K57m37K78K2
5091H3j55J98k32j1k39L71j65J63k7K4P8M0j26M1M4j51J7J19k41J77r2K03n3k
5115F4N6n4K03J03m68K70k22K41n10L51l9l9j08K23k1j96N6J55J66j87k10K20
5137E4k58K98k19J84n6K8r5O6L0j0j01R4P0l46L08K00j87j29j0K20k12k51K42
$$ plain form
4977 75 129 85 -186 397 -72 29 -159 32 55 157 21 16 307 209 -57 195 248 164 58 -6 191 -213 87
5000 87 -138 -86 -5 17 463 116 -117 26 -208 -14 -108 145 -151 -10 -77 -226 -47 -116 -91 223 10 -178 -165
5023 -165 247 14 -15 44 -146 -10 96 90 -135 133 -221 -95 -315 97 -102 -9 -4 81 1 117 -107 37 27
5046 27 225 138 80 108 -43 -33 92 -47 -58 131 -24 -353 -26 129 -196 277 -219 149 54 7 93 -59 -109
5069 -109 -5 -175 254 -44 -11 -64 21 -50 229 1 261 -313 123 -10 -82 -189 46 -37 220 -217 61 83
5091 83 -72 126 -106 -117 -356 15 -150 13 -14 10 88 128 2 43 87 -64 -47 72 -169 8 -84 119 66 64
5115 64 120 66 269 372 -96 174 -48 193 -317 34 -5 -44 -152 71 50 -146 -90 65 231 44 -166 54
5137 54 -204 94 -125 59 3 31 -64 2 32 22 -79 15 85 -261 47 247 60 -69 -79 141 -71 -322 -80
5160h0O0k23L04p0o0J6Q0l6K08P2k27o2J10j80M9J52j42r5J87q9J26N1l15Q0L08
5185B24l17J24j1nJ2kl48K71j41K31j40J35q1j27J02J04j34m5J79N0K6l9j45M8
5209b9Nm7j14K23j65j23K70J0j70J30ql8j07J19n3o7N1m5P6N8j34L17j28j52j07
5234b28J68LJ6N7k7K8K08q1k56L29l39L19k59L00p8j86Q3m4k82J24K96k9j29J56
5258A49m07j24M08j61Q5J25k81m6K43J0J17j85M6lM1j4p4J88n4o9J78j57k10J8
5282a77L58l6p2j17m0K72r1N7j29l3L47n53K20J55P4m26K0K38j87K80j60J68K2
5305A90j37K4l7K03m36J12kJ83l01KK87n7j20p3J36m5M07n41J30k25L12j64o9
5328b21K64j19K0j6P9j93j44M37l01J78J03j91K11m0k03R4J61r3K49k43n8J06
$$ plain form
5160 -80 -20 -243 61 -9 -69 -53 27 -9 199 271 44 -18 92 -88 -39 113 -29 -124 63 -26 100 151 -164 -84 224
5185 224 -93 31 20 15 27 25 -323 -52 -193 38 -102 33 -48 -175 -73 31 -103 -148 31 81 107 68 -77 -29
5209 -29 -24 -71 -185 38 -127 -250 20 30 -140 -10 -18 -56 -163 -44 -97 -164 -113 -158 -82 -24 -158 159 31 -121 -228
5234 -228 -60 -57 -41 16 -11 17 225 144 -112 217 -122 197 -62 238 160 -26 57 13 -269 -145 151 122 -7 149
5258 149 -258 -382 26 -135 -50 75 -206 -252 -9 1 118 -67 -21 -24 17 3 -71 117 63 -6 172 15 -195 -177
5282 -177 181 145 73 -44 -84 188 97 154 25 -8 339 -214 6 161 235 -191 -171 67 -120 160 0 168 190
5305 190 53 77 40 243 -193 -81 -83 100 -201 -199 88 31 -89 -162 -26 -71 336 -205 -75 -300 12 -152 -221
5328 -221 43 -76 -56 -72 7 -186 -330 107 -194 -16 87 -104 107 67 -136 -42 119 26 275 32 -26 80
5350H0m9l84L13k9J80j27j09K6J06j04l6l9Q0K52j49O3r4r3J25J24k88K19k16
5373a49M13k55j34k1Q5O8J5K04M5k60K9j70L42k18k36N10m61L28j36j41k39K52
5395a29J88k8j97O7j62M35q7m0o2k5J05J00j85L2q6J04K6K94l96M1l0R1j13J54
5419I7k39L08r1N7J18Lj23m2j10Lr9L18j89J39k90J84p0k1j51m6J64nR6j18lm7
5445a57O2l8K54o1k9mj21M7K7p6N5L11k87k6Q0j98J06J28j2pr1P7q0M5J17q8J69
5472B03m5k01r0R9k2k23K53j8j58K73o2J36p6Jp6J5Q3k04K0K25k04J34j79L60
5496B44L8m69J8K68m7l1j2L5J8j62J06J73l36m6J33J07k31K02n3J40J18k06j48
5519a41J77j76K82j41r8K64k49Q7q0O4j6j86J71K07j34L9P3j76L4M2j57mN9j02
$$ plain form
5350 80 31 -353 -40 -69 111 -16 -125 -99 7 -97 -133 -172 -92 160 11 74 -20 -113 12 136 -152 67 -149
5373 -149 264 9 -125 -146 -61 7 22 226 271 11 40 -130 212 -6 -242 268 -193 135 -1 -142 -381 -129
5395 -129 59 31 -166 -99 -261 174 87 47 -15 -40 65 165 -20 12 -74 30 56 350 -46 -5 -35 56 -57 97
5419 97 -142 166 75 132 250 253 130 88 -22 -19 -118 200 11 150 -140 44 -26 -47 -198 -244 -80 -85 11 -107 -110 -157
5445 -157 -95 -133 121 60 31 27 -94 -47 -20 -96 -41 270 -17 -43 37 -161 -55 73 61 54 -37 40 -40 5 122 34 203
5472 203 158 -43 -133 -34 -56 -279 -26 -44 -202 71 9 145 69 70 -6 9 92 -112 -92 133 -71 63 -116 244
5496 244 282 -187 -169 99 52 21 9 44 62 -100 6 179 -157 -203 -70 37 -194 8 -45 95 213 7 -141
5519 -141 36 -140 142 1 -97 167 -82 5 -75 -11 -27 -213 -42 165 31 70 143 -33 1 43 -114 -118 -59 -161
5543a61K21j94j02K62j88K99k10J16J99j08j61n0L60k19n7J09k78mJ26J80r6O0
5565A04k06m5J79K1j30k44M15j09j59rO0J78R5m65N07j44j32O9j05J99j47J80
5587A12Pl99K68q7N0J15r5J72j65k03K32j91K61Rk05L17j31l2mj03M2j32K46q6
5611bj30K33k53J18rj16L5J95k89Q7K02J08om6o8J11n3k28J12p9K3J60k2K90m36
5636f3j72K51j03J03J09m7l51L26J88n43L13J15j21j39J34o2j24K41oj23l9J18
5658EN1k81L47j77lp7K90J3J64k71q5P1J21k4m8j44J7j02K41l26Q0M6M0J29rN3
5684A21j48m2J85j14o6M3oJ77j75k3j58N42l38P3O3P4j65p4J76l35J35J45K3n5
5708E8J50l03M9j37K38k07mL1kr2J22K29j4k05L54j83p1K6Q5m6j55P1m4p9R7L4
$$ plain form
5543 -161 60 -134 -236 26 -162 137 -73 43 242 134 -27 -77 283 64 7 116 -162 -166 -40 140 44 104
5565 104 -102 -147 32 53 -77 -321 94 -15 -174 -183 -123 55 150 -315 192 48 -84 -15 -120 79 -68 112
5587 112 119 -280 -12 -99 -49 66 -29 143 -22 -225 7 -184 77 86 -119 198 67 35 31 -72 -30 -162 84 -2
5611 -2 -132 101 -152 -34 -43 -159 -124 71 -218 -131 71 179 173 127 59 170 117 -111 1 -78 -55 105 83 373 -63
5636 -63 -235 16 -87 16 125 78 -273 53 241 -302 11 126 5 -134 0 -62 -186 55 49 -74 -113 5
5658 5 56 -225 122 -55 -58 -135 155 168 332 61 -24 47 168 144 96 -48 -31 -133 108 -218 -138 -92 -52 77 68 121
5684 121 -27 -69 116 2 -64 -21 -27 150 -25 -48 -206 336 -2 71 134 208 43 -31 145 -190 -55 90 113 58
5708 58 208 -95 -46 -183 55 -152 -156 -125 -127 -219 -97 132 118 -87 267 84 13 39 124 78 -77 -6 -50 -129 -32 2
5734BP0K05m10nQ9J27j53P4q5j10M96l08j51J45m11K40J14L36k03J87j52l56L15
5757E6M9j55L2Q3P3m68J83L20j59j09M1j7K8m5k15K48P2k4J25r1M6k42J82J9l0
5782Bm4j23J21j24J93j90K87P9N3k51K44K6Km09J0P5K62J46l34K1j7J20k72Q1
5806d2J13j32n9j22K08J4q9N3J43J43k92J96j57j21j35K89R0o7p8j44L47M4j29
5829G3j55J09j96K42N1j6L5j53J34k89J48J19J7j15l7m3M6q2N6n6J96j29J78N2
5853A85L4m9j11K30j28k37j14K03K05k91J36O0l05J92N5m3k9l7j0P1k50K95m2
$$ plain form
5734 2 72 277 -133 -138 -49 78 -75 -1 -86 -196 300 -8 -159 -14 -425 -185 -71 265 62 249 97 -259 56
5757 56 105 -50 -18 65 138 -330 -147 173 14 -95 -54 -71 -43 -88 -303 -55 17 -7 118 27 73 -169 13 32 2
5782 2 -42 -165 -44 -168 25 -165 122 201 254 3 247 273 275 -134 -124 -49 213 359 25 46 29 149 -123 -42
5806 -42 71 -61 -120 -242 -34 -20 -109 -56 87 230 -62 134 -23 -144 -279 10 100 33 -45 -189 158 202 73
5829 73 -82 27 -169 73 124 108 143 -10 124 -165 -17 102 119 4 -33 -76 -30 -112 -56 -112 84 -45 133 185
5853 185 219 170 59 289 161 -76 -190 13 218 -73 63 123 -182 10 65 22 -7 -44 -54 17 -233 62 20
$$ [...]
8191a23
##END NTUPLES=NMR FID
##END=
