##TITLE=1H_Ser 7-8-i
 CDCl3
 8 sc, 
 15.04.2022
##JCAMPDX= 6.0         $$ Bruker NMR JCAMP-DX V2.0
##DATA TYPE= NMR FID
##DATA CLASS= NTUPLES
##ORIGIN= UXNMR, Bruker Analytische Messtechnik GmbH
##OWNER= root
$$ XWIN-NMR		Version 3.5
$$ Fri Apr 15 14:42:10 2022 Russian Standard Time (UT+4h)  she@DPX200
##.OBSERVE FREQUENCY= 200.13135
##.OBSERVE NUCLEUS= ^1H
##.DELAY= (6, 6)
##.ACQUISITION MODE= SIMULTANEOUS
##.ACQUISITION SCHEME= undefined
##.AVERAGES= 8
##.DIGITISER RES= 18
##SPECTROMETER/DATA SYSTEM= spect
##.PULSE SEQUENCE= zg30
##.SOLVENT NAME= CDCl3
##.SHIFT REFERENCE= (INTERNAL, CDCl3, 0, 15.7039)
##AUDIT TRAIL= $$ (NUMBER, WHEN, WHO, WHERE, WHAT)
$$ ##TITLE= Audit trail, XWIN-NMR		Version 3.5
$$ ##JCAMPDX= 5.01
$$ ##ORIGIN= Bruker BioSpin GmbH
$$ ##OWNER= she
$$ F:/spectra/data/she/nmr/H-F/1/audita.txt
$$ ##AUDIT TRAIL=  $$ (NUMBER, WHEN, WHO, WHERE, WHAT)
(   1,<2022-04-15 14:41:06.03 +0400>,<she>,<DPX200>,
      <created by zg, POWCHK disabled, PULCHK disabled
       configuration hash MD5:
       00 E9 B6 7A A2 85 ED C7 34 08 36 98 17 FE 4E 26
       data hash MD5: 16K
       F3 35 71 72 A1 90 85 D4 18 B6 B3 B7 BD 1A 82 EF>)
$$ ##END=
$$ 
$$ hash MD5
$$ 58 86 C5 6D 83 60 E2 99 3E 93 03 2B 8E BB 73 FA
##$RELAX= 
##$RELAX= 
##$RELAX= 
##$RELAX= 
##$RELAX= 
##$RELAX= 
$$ Bruker specific parameters
$$ --------------------------
##$DU= <F:/spectra>
##$EXPNO= 1
##$NAME= <H-F>
##$PROCNO= 1
##$TYPE= <nmr>
##$USER= <she>
##$AMP= (0..31)
100 100 100 100 100 100 100 100 100 100 100 100 100 100 100 100 100 100 
100 100 100 100 100 100 100 100 100 100 100 100 100 100 
##$AQSEQ= 0
##$AQ_mod= 1
##$AUNM= <au_zg>
##$AUTOPOS= <>
##$BF1= 200.13
##$BF2= 200.13
##$BF3= 200.13
##$BF4= 200.13
##$BF5= 200.13
##$BF6= 200.13
##$BF7= 200.13
##$BF8= 200.13
##$BYTORDA= 1
##$CFDGTYP= 0
##$CFRGTYP= 5
##$CHEMSTR= <none>
##$CNST= (0..31)
1 1 145 1 1 1 1 1 1 1 1 1 1 1 1 1 1 1 1 1 1 1 1 1 1 1 1 1 1 1 1 1 
##$CPDPRG= <>
##$CPDPRG1= <>
##$CPDPRG2= <>
##$CPDPRG3= <>
##$CPDPRG4= <mlev>
##$CPDPRG5= <mlev>
##$CPDPRG6= <mlev>
##$CPDPRG7= <mlev>
##$CPDPRG8= <mlev>
##$CPDPRGB= <>
##$CPDPRGT= <>
##$D= (0..31)
0 1.2 0 0 0 0 0 0 0 0.06 0 0.03 0 0 0 0 0.0002 0 0 0 0 0 0 0 0 0 0 0 0 
0 0 0 
##$DATE= 1650019265
##$DBL= (0..7)
120 120 120 120 120 120 120 120 
##$DBP= (0..7)
150 150 150 150 150 150 150 150 
##$DBP07= 0
##$DBPNAM0= <>
##$DBPNAM1= <>
##$DBPNAM2= <>
##$DBPNAM3= <>
##$DBPNAM4= <>
##$DBPNAM5= <>
##$DBPNAM6= <>
##$DBPNAM7= <>
##$DBPOAL= (0..7)
0.5 0.5 0.5 0.5 0.5 0.5 0.5 0.5 
##$DBPOFFS= (0..7)
0 0 0 0 0 0 0 0 
##$DE= 6
##$DECBNUC= <off>
##$DECIM= 32
##$DECNUC= <off>
##$DECSTAT= 4
##$DIGMOD= 1
##$DIGTYP= 9
##$DL= (0..7)
0 120 120 120 120 120 120 120 
##$DP= (0..7)
150 150 150 150 150 150 150 150 
##$DP07= 0
##$DPNAME0= <>
##$DPNAME1= <>
##$DPNAME2= <>
##$DPNAME3= <>
##$DPNAME4= <>
##$DPNAME5= <>
##$DPNAME6= <>
##$DPNAME7= <>
##$DPOAL= (0..7)
0.5 0.5 0.5 0.5 0.5 0.5 0.5 0.5 
##$DPOFFS= (0..7)
0 0 0 0 0 0 0 0 
##$DQDMODE= 0
##$DR= 18
##$DS= 0
##$DSLIST= <SSSSSSSSSSSSSSS>
$$ [...]
##$SUBNAM2= <"">
##$SUBNAM3= <"">
##$SUBNAM4= <"">
##$SUBNAM5= <"">
##$SUBNAM6= <"">
##$SUBNAM7= <"">
##$SUBNAM8= <"">
##$SUBNAM9= <"">
##$SW= 18.05172834244
##$SWIBOX= (0..15)
0 0 2 0 0 0 0 0 0 0 0 0 0 0 0 0 
##$SW_h= 3612.71676300578
##$TD= 16384
##$TD0= 1
##$TE= 0
##$TE2= 300
##$TE3= 300
##$TEG= 300
##$TL= (0..7)
0 120 120 120 120 120 120 120 
##$TP= (0..7)
150 150 150 150 150 150 150 150 
##$TP07= 0
##$TPNAME0= <>
##$TPNAME1= <>
##$TPNAME2= <>
##$TPNAME3= <>
##$TPNAME4= <>
##$TPNAME5= <>
##$TPNAME6= <>
##$TPNAME7= <>
##$TPOAL= (0..7)
0.5 0.5 0.5 0.5 0.5 0.5 0.5 0.5 
##$TPOFFS= (0..7)
0 0 0 0 0 0 0 0 
##$TUNHIN= 0
##$TUNHOUT= 0
##$TUNXOUT= 0
##$USERA1= <user>
##$USERA2= <user>
##$USERA3= <user>
##$USERA4= <user>
##$USERA5= <user>
##$V9= 5
##$VALIST= <valist>
##$VCLIST= <CCCCCCCCCCCCCCC>
##$VD= 0
##$VDLIST= <DDDDDDDDDDDDDDD>
##$VPLIST= <PPPPPPPPPPPPPPP>
##$VTLIST= <TTTTTTTTTTTTTTT>
##$WBST= 1024
##$WBSW= 4
##$XGAIN= (0..3)
0 0 0 0 
##$XL= 0
##$YL= 0
##$YMAX_a= 214836
##$YMIN_a= -283320
##$ZGOPTNS= <>
##$ZL1= 120
##$ZL2= 120
##$ZL3= 120
##$ZL4= 120
##$ABSF1= 10
##$ABSF2= 0
##$ABSG= 5
##$ABSL= 3
##$ALPHA= 0
##$AQORDER= 0
##$ASSFAC= 0
##$ASSFACI= 0
##$ASSFACX= 0
##$ASSWID= 0
##$AUNMP= <proc_1d>
##$AZFE= 0.1
##$AZFW= 0.1
##$BCFW= 1
##$BC_mod= 2
##$BYTORDP= 1
##$COROFFS= 0
##$CY= 11.3945322036743
##$DATMOD= 1
##$DC= 2
##$DFILT= <>
##$DTYPP= 0
##$F1P= 2.36226072786647
##$F2P= -0.459571619588291
##$FCOR= 0.5
##$FTSIZE= 0
##$FT_mod= 4
##$GAMMA= 1
##$GB= 0.15
##$INTBC= 1
##$INTSCL= 1
##$ISEN= 128
##$LB= 0.24
##$LEV0= 0
##$LPBIN= 0
##$MAXI= 10000
##$MC2= 0
##$MEAN= 0
##$ME_mod= 0
##$MI= 1.114404
##$NCOEF= 0
##$NC_proc= 0
##$NLEV= 6
##$NOISF1= 3.799351
##$NOISF2= 2.8
##$NSP= 1
##$NTH_PI= 0
##$NZP= 0
##$OFFSET= 15.70392
##$PC= 1
##$PHC0= -18393.62
##$PHC1= 17.60075
##$PH_mod= 1
##$PKNL= yes
##$PPARMOD= 0
##$PSCAL= 0
##$PSIGN= 0
##$REVERSE= no
##$SF= 200.130013532006
##$SI= 16384
##$SIGF1= 3
##$SIGF2= 2
##$SINO= 400
##$SIOLD= 16384
##$SREGLST= <1H.CDCl3>
##$SSB= 0
##$STSI= 0
##$STSR= 0
##$SW_p= 3612.71676300578
##$SYMM= 0
##$S_DEV= 0
##$TDeff= 0
##$TDoff= 0
##$TI= <>
##$TILT= no
##$TM1= 0
##$TM2= 0
##$TOPLEV= 0
##$USERP1= <user>
##$USERP2= <user>
##$USERP3= <user>
##$USERP4= <user>
##$USERP5= <user>
##$WDW= 1
##$XDIM= 8192
##$YMAX_p= 0
##$YMIN_p= 0
$$ End of Bruker specific parameters
$$ ---------------------------------
##NTUPLES= NMR FID
##VAR_NAME=  TIME,          FID/REAL,        FID/IMAG
##SYMBOL=    X,             R,               I
##VAR_TYPE=  INDEPENDENT,   DEPENDENT,       DEPENDENT
##VAR_FORM=  AFFN,          ASDF,            ASDF
##VAR_DIM=   8192,          8192,            8192
##UNITS=     SECONDS,       ARBITRARY UNITS, ARBITRARY UNITS
##FACTOR=    0.0002768,     1,               1
##FIRST=     0,             0,               0
##LAST=      2.2672688,     0,               0
##MIN=       0,             -283320,         0
##MAX=       2.2672688,     214836,          0
$$ Real data points
##PAGE= N=1
##DATA TABLE= (X++(R..R)), XYDATA
0@%%%%%%%%%%%Qj6J6j6K4l2M0m8N6p2Q8j04J20j44J72j98K31k69L08l51M01m57
33b43N18n85O60p45Q38r37J044j164J296j439J595j766J952k157K380k622K888
50A513l181L506l863M261m703N199n764O405p144Q011r040J0286j1828J3795j6414
65h961K0080k5617L5057n5368J77805j74795j72318M14163j15157k52050K05442
76D8281R9022l46789O6341L12024j57326k26288K33669P7841k05238O2361J67182
87A31080j65538p7090J89205j0066j66466R9521R2932j40183k813J50436p9214
98B1804j00155J25752K0141j44715N4918J03001j22565m4887J46672l3639j26629
109a00302J04148Q4849j26663j2119J20883m8390p9886R8103K3952j30143J7211
$$ plain form
0 0 0 0 0 0 0 0 0 0 0 0 0 8 -8 8 -8 16 -16 24 -24 32 -40 48 -56 64 -80 92 -106 125 -144 164 -187 214 -243
33 -243 275 -310 350 -395 443 -494 550 -614 682 -757 838 -928 1024 -1133 1247 -1375 1513
50 1513 -1668 1838 -2025 2236 -2467 2732 -3032 3373 -3771 4240 -4800 5486 -6342 7453 -8961
65 -8961 11119 -14498 20559 -34809 142996 -31799 -204117 210046 94889 -157161 48281
76 48281 147303 -199486 -133145 178879 21553 -204735 28934 106775 -98463 -36102 131080
87 131080 -34458 -111548 77657 67591 -98875 646 93578 -46605 -49418 101018 21804
98 21804 -78351 47401 67542 -77173 -22255 80746 -41819 -86706 59966 26327 -100302
109 -100302 3846 88695 -37968 -50087 70796 22406 -57480 40623 64575 -65568 -48357
120d8357J22626n3152r2746O5316L9152o7518K3117O8264p2280n6829J03636L4768
132F5997j04137J608P7318m2963l3241P7403j1403q6459N2376P2684p7629l4350
144d2796Q3996j7068p7136N1768M5538p7729j1849P8506k7156o3282O7443M4608
156E4843q5494q813R1085k3701p2466N5071L4633q2437N156Q7047m8956p2071
168f6103Q1034L5655r0385J5781Q2123n8132m9153Q4231N336q7582L8873O3341
180E5019p7500k6767R0025j8514q0775N4889M8739p5500m322P9778l8493o2216
192e5637P5875L0231r0824J2716Q4620n1128n5215P5791J0469q1186L6899O3550
204E6161p6259k8770R3382j3916q1033N0609M5312p1741J729O9912m8297n3048
$$ plain form
120 -48357 74269 21117 -71629 -6313 32839 -34679 -11562 56702 -15578 -72407 31229 65997
132 65997 -38140 -36532 40786 -2177 -35418 41985 30582 -55877 -3501 69183 -8446 -42796
144 -42796 41200 24132 -53004 -1236 44302 -33427 -45276 33230 6074 -57208 10235 54843
156 54843 -30651 -39464 51621 27920 -44546 10525 45158 -37279 -32123 54924 5968 -66103
168 -66103 14931 50586 -39799 -24018 58105 -27 -49180 35051 40387 -47195 -8322 55019
180 55019 -22481 -49248 40777 22263 -58512 -3623 45116 -30384 -34706 45072 6579 -55637
192 -55637 20238 50469 -40355 -27639 56981 5853 -49362 26429 36898 -44288 -7389 56161
204 56161 -20098 -48868 44514 30598 -50435 174 45486 -26255 -24526 45386 -2911 -55959
216e5959P5384J7886q0977J9509O2233m9753k5092O8156j0988o2659M6727M5866
228E0333o4871j3599O6831k2566n3632M9735K2938o5658Q193O0118l8793m0018
240d0989N7236R471o0569K5243M7374m9779k0382N9157r463n0274L4363K8591
252B9979m9275p82N0644k5205l9517M1545J7825m4499O616L6103k5746k0466L9920
265A7142L152m1249J4756L2549k8470j5491L3320n833l1001K2386J9088l2711
277a2362m054L3985j3407k6213K6587J0685l1403N721K6939k0556j5228K8864
289I558J693k8329J2494K3044k0878q854K5473m121k1519J5546J4609k2296n222
302h802K1174p210j8817J5096Q264k2559O85K0970j1108j3410J7630N244j8468
$$ plain form
216 -55959 19425 37311 -43666 -24157 38076 -11677 -36769 31387 20399 -42260 4467 50333
228 50333 -14538 -28137 38694 16128 -37504 12231 35169 -30489 -22296 37822 -971 -40989
240 -40989 16247 25718 -34851 -9608 37766 -12013 -32395 26762 17299 -32975 1388 29979
252 29979 -19296 -20078 30566 5361 -34156 7389 25214 -19285 -12669 23434 -2312 -22778 17142
265 17142 20294 -20955 -6199 26350 -2120 -17611 15709 9876 -21125 1261 20349 -12362
277 -12362 -16416 17569 4162 -22051 4536 15221 -16182 -10461 16478 -4078 -19306 9558
289 9558 11251 -17078 -4584 18460 -2418 -11272 14201 10080 -11439 4107 18716 -3580 -8802
302 -8802 12372 5162 -13655 1441 9705 -12854 -12169 8801 -2307 -15717 1913 7157 -11311
315a1311P789J8085j4400r198J9529j510j8506J0796J0714j8515m196J7900n042
328B135j4250J4438O477j7800N290J9439j1989j2637J6710K001j7765O425J2324
341A0798j8152p272K1520l059k0426J3726J3621j7634j027K0077r033j4876J7523
354E786N775k2689M971J9437j5211j0570K0284k53j7583J3437J2275k0434k376
367g151K2507j0060j8779J7596N643k4126O283K0761j7947j1926K4438K45k2899
380a5415J4501J7482k4512n366K8246p839k2367J8776J0497k4445M400K5176j8496
393F38j7829K6589M820k8586R611K0010k2079p597K8169p028k5129K1587J6094
406A9270k8331j869K8768j4324k1146K3403M421k9049J0252K4679k3372j4432
$$ plain form
315 -11311 -3522 14563 163 -9035 10494 8984 -9522 1274 11988 -6527 -10723 7177 2135
328 2135 -12115 2323 8800 -9000 -3710 15729 3740 -8897 7813 9814 -7951 -1526 10798
341 10798 -7354 -14626 6894 3835 -16591 -2865 10756 -6878 -7905 12172 3139 -11737 5786
354 5786 11561 -11128 -6157 13280 -1931 -12501 7783 7530 -10053 3384 15659 -4775 -7151
367 -7151 15356 5296 -13483 4113 9756 -14370 -8087 12674 -5273 -17199 7239 7484 -15415
380 -15415 -914 16568 -7944 -13310 14936 7097 -15270 3506 14003 -10442 -6042 19134 638
393 638 -17191 9398 14218 -14368 -4757 15253 -6826 -14423 13746 6718 -18411 3176 19270
406 19270 -9061 -10930 17838 3514 -17632 5771 10192 -18857 -8605 16074 -7298 -21730
418b1730L1138J974k7340J6746J9352k5894l501L0577j1801k7044K2230J4259
430A8966l0684k36K9354j7029k1514K8053P663l1221Q981K7111k2990j6702L1794
443A1546J260l2718J4116K3312k7363o773L3030j0017k7883K5142J7680l1796
455a0464O32L1951j8183k2412L0570O807l4799R667K6556k5460j4646L2908k736
468A0391l4676J7747K5993k8261r070L2490q515k6455K5243J7001l4246k596L4593
481A9639j3682k6400K5988R578l0954Q434K9156k3208j7970L2689M466l3092J0039
494e317K4642k3950j2309L0020n607l0033J9382K3450k7115j0440L1255m323k6379
507a6724K1007J7079l3557m363L5366j2478k9572K4911J4066l4257O218L6629
$$ plain form
418 -21730 9408 11382 -15958 788 20140 -5754 -9255 21322 9521 -17523 4707 18966
430 18966 -11718 -11954 17400 371 -21143 6910 14573 -16648 -7667 19444 -3546 -20248 11546
443 11546 12806 -19912 -5796 17516 -9847 -16620 16410 6393 -21490 3652 21332 -10464
455 -10464 -9832 22119 3936 -18476 12094 18901 -15898 -6231 20325 -5135 -19781 13127 10391
468 10391 -24285 -6538 19455 -8806 -17876 14614 6099 -20356 4887 21888 -12358 -14954 19639
481 19639 5957 -20443 5545 15123 -15831 -7397 21759 -1449 -19419 13270 17736 -15356 -5317
494 -5317 19325 -4625 -16934 13086 7479 -22554 -3172 20278 -6837 -17277 13978 9655 -16724
507 -16724 4283 21362 -12195 -16558 18808 6330 -23242 1669 15735 -18522 -12304 24325
519B4325k3760k6325L7101Q817l7739J3744K9568l2255j4286M2562m637m0735
531b3620K2185K6402l4920o413L7330j7105l2421L1229J6823l9673J752L7646
543A9215k0400k3963L6737Q057l8055J4807L2773l1281j7309L9050m102l8522
555b2993K0714K3962l5550m369L9489j5727l1449L1769J7821l5618J439L2234
567B1722k1865k3103L3464O565l9294Q034L1874k1204j6272L3046J42l5160J8670
580c381L2176l0471j7644L4953m226l3070K4932K1628m0106o072M3321j1390l2736
593b2086K8486J3730l9011Q122L8175k7356k7612L4958Q114l5902J3391K8384
605B1393l0449j3781L9818j736l5848J8764K3576l0446o199L4880j2266l1097
$$ plain form
519 24325 565 -25760 11341 20158 -17581 -3837 25731 -6524 -20810 21752 17115 -23620
531 -23620 -1435 24967 -9953 -16366 20964 3859 -28562 2667 19490 -20183 -18431 19215
543 19215 -1185 -25148 11589 19646 -18409 -3602 29171 -2110 -19419 19631 15529 -22993
555 -22993 -2279 21683 -13867 -18236 21253 5526 -25923 5846 23667 -11951 -10512 21722
567 21722 -143 -23246 10218 16783 -22511 -14477 17397 -3807 -20079 12967 13109 -22051 -3381
580 -3381 28795 -1676 -19320 15633 11407 -21663 3269 24897 -15209 -21281 22040 10650 -22086
593 -22086 6400 20130 -18881 -10759 27416 60 -27552 7406 15520 -20382 -6991 21393
605 21393 -9056 -22837 16981 15245 -20603 -1839 21737 -8709 -14908 19972 7706 -23391
617b3391K6938J7965l4875J044L3956j9621k3974L1285Q178l4963R683K8179k4970
630d566j5543L3737j03l2379J5755K1723k5150o878K8774q713k7463J9145J8075
643A6414k5918m964K6662r491k1192K3984J4056k9100p74K9290j1793k1296K4032
656I910O245l2623Q091K9010k1951k0132K8346L039k8008J4752K2257k7410r773
669a8247L2498m099k7693J7745J5763k6209j700K8306j2243k2756K3474J1041
681A5880k8056M616K6869j7945j8158K7100M556k9134J0723K2816k4719j2093
693a7545L0855l775k9571J7565J8358k6496k917K8539j1510k2004K3011J1270
705A5780k7036L014K4606j5370j6224K2485M515k4217O973K0190j6322j2423K3329
$$ plain form
617 -23391 3547 21512 -13363 -12319 21637 2016 -21958 9327 17505 -17458 -7775 20404 -4566
630 -4566 -20109 13628 13525 -18854 -3099 18624 -6526 -13404 15370 6657 -20806 -1661 16414
643 16414 -9504 -14468 12194 2703 -18489 5495 19551 -9549 -10323 18967 7174 -14122 9910
656 9910 16155 -16468 -8377 20633 -1318 -21450 6896 9935 -18073 -3321 18936 -8474 -18247
669 -18247 14251 10152 -17541 204 15967 -10242 -11942 16364 4121 -18635 4839 15880
681 15880 -12176 -7560 19309 1364 -16794 10306 14862 -14272 -3549 19267 -5452 -17545
693 -17545 13310 9535 -20036 -2471 15887 -10609 -13526 15013 3503 -18501 4510 15780
705 15780 -11256 -8242 16364 994 -15230 7255 11770 -12447 -5474 14716 -1606 -14029 9300
718I300J458k3485J0768J8080j8994q333K2712l913k1904J4064J3685k2414k608
731a1584K3052j0327j7757J9506Q213k1876M087J9067j3483j0455K0847L10k1174
744a1574R482J6159j6508p477J8757k942j7318J2070J2009j8615l346K0766o125
757E338j7540J4514Q781j9187O83J7554j1129j2137J7009L556j8716O195J5601
770A0522j2328o704J5480j556j3212R191R366j4340k995J4396l886j1969R528
783A493O136j2695j23J3100n436j0647J0024N288j2597J542J2226q464r033J2232
797C046K920j3037L586R625r430m565J2571j355j1944P430Q263r953j170J0891
811F878l496q105Q102M414j0269K99R175o419p645Q412K421r207J818P448n722
$$ plain form
718 9300 10758 -12727 -1959 16121 -2873 -11206 11506 7593 -14311 -247 13438 -8976 -11584
731 -11584 11468 1141 -16616 2890 11103 -10773 -6686 12381 -1102 -11557 9290 9600 -11574
744 -11574 -2092 14067 -2441 -9918 8839 5897 -11421 649 12658 -5957 -9303 11463 5338
757 5338 -12202 2312 11093 -8094 -7411 10143 -986 -13123 3886 7442 -11274 -5079 10522
770 10522 -1806 -8510 6970 5414 -7798 1393 10759 -3581 -6576 7820 3934 -8035 1493
783 1493 7629 -5066 -5189 7911 2475 -8172 1852 7140 -5457 -3915 8311 -153 -9186 3046
797 3046 5966 -7071 -3485 6140 -3290 -7855 4716 3361 -8583 -1153 7110 -2843 -4013 6878
811 6878 3382 -4723 3379 7793 -2476 -2177 6998 579 -7066 1346 3767 -5440 -3622 3826 -1896
826a896l682R630J01j0212M985P054p658k640P494l244o489O938L729q515O70
841c735Q851l694m501P638J000p525K488N389n707l543N727j142n934K987M129
856B428m825j137N707j938l498M144J843n017M02M185l097k772M971j67m692K842
872f21L698l847q5L946k262k465M054J168m945P29L408k664j092L022j664l213
888b833K793J847l435o88K688j853j674L150O25l051J740L056k594m50L371j022
904A670l160K369J634m016L73L332l204j810N013k3l723K185K965m106j79M802
920D122l082m966M401R20n298J297M188m542k079O492L44n477L454M179n262j3
936a322O051l107n332M828K484n911J082N220m275l506O800N33o634K777M295
$$ plain form
826 -1896 -5578 4052 4153 -6059 -1074 5980 -1678 -4318 3176 -68 -6557 381 4110 -4405 -3735
841 -3735 5116 1422 -3079 4559 5559 -1966 522 5911 204 -3339 2388 1246 -4688 -1701 2428
856 2428 -2397 -3534 2173 235 -3263 881 2724 -2293 -1891 2294 -803 -3575 1396 1229 -3463 -621
872 -621 3077 -770 -855 3091 829 -1636 2418 3586 -1359 -630 2778 114 -978 2044 380 -2833
888 -2833 -40 1807 -1628 -2316 372 -1481 -3155 -5 620 -2431 -691 2365 -229 -679 2692 1670
904 1670 -1490 879 2513 -1503 -1130 2202 -1002 -2812 2201 2178 -1545 640 3605 -501 -680 4122
920 4122 1040 -3926 475 1395 -3903 -2606 1582 -2960 -5039 1453 1797 -3680 -226 3953 -1309 -1322
936 -1322 4729 1622 -3710 1118 3602 -2309 -1227 3993 -282 -3788 3012 3545 -3089 -312 3983
951C983n403j925O864j759o588L583M374n834j054O555l318n309O346L538o731
966b678K98O615l283m401P246J536q628J737O961n252m177O954l33q320M169P636
982F080p483l495Q765j440p531O641N009j0384j443J0109l180q698P844L108j0769
997f867K651J0919p217o517J0832J464j0117M789Q726r877m428J1987j789j1009
1011f453P199N499j0819k50J1476n833q988R519M365j1342K315R731p603o085
1025g269J1019J197j1487L825R173q056m755J0944j088j0138O285P723r680k586
1039d893J1690k385j0229P221O711j1055j752J1433n759r301R911M106j2385J213
1053e474J1607o901p523J1917K163j3155M829J1658j0275o493J2995m82j3006
$$ plain form
951 3983 -1420 -3345 3519 1760 -4828 -1245 3129 -2705 -3759 2796 -522 -5831 515 4053 -2678
966 -2678 -2380 4235 952 -3449 3797 5333 -3295 -1558 5403 151 -4026 2928 2595 -5725 -1556 6080
982 6080 -1403 -4898 3867 2427 -5104 1537 6546 -3838 -5281 4828 1648 -7050 794 3902 -6867
997 -6867 -4216 6703 -514 -7031 3801 5265 -4852 -63 8663 -1214 -5642 6345 4556 -6453
1011 -6453 746 6245 -4574 -4824 6652 819 -8169 1350 5715 -5627 -3312 6419 -1184 -7269
1025 -7269 3750 4947 -6540 -2715 6458 -1598 -6353 4591 3503 -6635 -350 7373 -2307 -4893
1039 -4893 6797 4412 -5817 1404 8115 -2940 -4692 6741 982 -8319 1592 5698 -6687 -5474
1053 -5474 6133 -768 -8291 3626 5789 -7366 -2537 9121 -1154 -7647 5348 4866 -8140
1066h140P412R483j2814l264J5584l898j2829J1131O353j4190J437J4156r922
1079D99j0659J4147K941j5517M568J1586j1541m604J5176k482j3902Q666J0196
1092I074j1968k864J2888m862j0422J0820N690j3722j13J2542n544q858J0587
1105C248L454j2907L072J2294q163q123J1402J320j2245M873J0025j0500o647
1118h897J3066j5j2300O256Q510j1127k803J3929k665j2175Q498Q239j1874j466
1132d824J3203o044j1148J1157N727j3978J730J2936r129r012J4611K472j5596
1145g895N315J2117j2309m837J5264l537j4971J0086R327j4179j325J3876o513
1158D19j0259J2884M939j4306K144J2562p525p447J2014J227j3550M711J1064
$$ plain form
1066 -8140 -728 8755 -4059 -7323 8261 4363 -8466 2665 9018 -5172 -3735 10421 499
1079 499 -10160 3987 6928 -8589 -4021 7565 -3976 -8580 6596 4114 -9788 -1122 9074
1092 9074 -2894 -5758 7130 2268 -8154 2666 8356 -5366 -5479 7063 1519 -7339 3248
1105 3248 6702 -6205 -3133 9161 998 -7125 4277 5597 -6648 -1775 8250 -2250 -8897
1118 -8897 4169 4154 -8146 -1890 6620 -4507 -7310 6619 3954 -8221 277 8516 -3358 -4824
1132 -4824 8379 2335 -8813 2344 8071 -5907 -4177 8759 -370 -9382 5229 7701 -7895
1145 -7895 -2580 9537 -2772 -7609 7655 4118 -10853 -767 8560 -5619 -6944 6932 419
1158 419 -9840 3044 7983 -6323 -4179 8383 858 -6589 5425 6652 -6898 -2187 8877
1171H877r552o146J1561j165j1501P312Q999j1305m278J2699j995j0606Q150N780
1185F830j2171q40J2905m887j0280R127M621j1289K384J1430p088q256J1430L215
1199G131j1401K795R849q845o339J2342K80j2938N313Q905j0555l105J2547l109
1213B870j1822R137P321j2238m76J2360o709r092J1812L353j3179L358J0748q657
1227a214n642J1812K72j1841O012Q918r591l169J0475k391r638O590O322j0292
1241c377j759R856l754q592Q290M585j0556R60J0149n458o625R170K199j0442
1255e354L327Q668p554m662R309k77r084N131O403p932k499R388j512p954N819
1270A217M944q732j175Q898l281p654O321L626q961P64Q977n290o361Q617K599
$$ plain form
1171 8877 -675 -6821 4740 3575 -7926 -614 8385 -2920 -7198 5501 3506 -7100 1050 6830
1185 6830 -5341 -6181 6724 1837 -8443 684 5305 -5984 -3600 7830 742 -7514 3916 7131
1199 7131 -4270 -1475 8374 -471 -6810 5532 5812 -7126 -1813 7092 -3463 -6568 5979 2870
1213 2870 -8952 185 7506 -4732 -5208 7152 443 -8649 3163 6516 -6663 -3305 7443 -1214
1227 -1214 -6856 4956 5228 -6613 -601 8317 -1274 -4443 6032 3641 -5997 593 6915 -3377
1241 -3377 -5136 4720 966 -7626 664 5249 -5307 -4347 5802 344 -6281 2889 5088 -5354
1255 -5354 -2027 6641 -913 -5575 3734 3457 -5627 -496 5907 -2025 -4524 4864 3352 -4602 1217
1270 1217 6161 -2571 -3746 5152 1871 -5783 538 4164 -4797 -4033 4944 -346 -6707 1910 4509
1285D509r123K767P530o837l833Q782J71q874M570N610p593j329Q064k350o796
1300d732N407M057p164j30P486l476o157O416K416p117K22O193m237m534O781
1315A431J128p270K196O602n440k615P099l20o426L798M736n923j258O038k380
1330A396n160M917K490n823K25M941k269l481M343J541n767Q30N148l179l802
1345c650M783L28n331K047M224l758k531N199O06m808L249L437m487j114N205
1360C399j268m028K869J707m289N37L839k571k838L370Q99l252N42K978k267j756
1376b129L214N15l571P74K740k680j393L032K78l128J478K408k493k6L206o87
1392A538k588K202J420k545Q1J845j670j186J662o8j929J50J510j001m79J369
$$ plain form
1285 4509 -4614 -1847 5683 -1154 -4987 3795 3966 -4908 -338 5272 -2321 -3650 4414 2064 -4732
1300 -4732 675 4732 -2432 -2562 4924 1448 -4709 1707 4123 -2994 -2772 3421 -816 -5350 1431
1315 1431 2559 -4711 -2515 4087 -1353 -3968 3131 2811 -3615 183 4919 -1004 -2262 3776 1396
1330 1396 -3764 1153 3643 -2180 -1955 2986 717 -2764 1579 3120 -2647 -1817 3331 152 -3650
1345 -3650 1133 1461 -3870 -1823 2401 -1357 -3888 1311 1917 -2891 358 3795 -692 -1806 3399
1360 3399 2131 -1897 972 2679 -1610 -1073 2766 195 -2643 727 1626 -1626 -1084 1894 -373 -2129
1376 -2129 1085 1600 -1971 -1197 1543 -1137 -2530 502 780 -2348 -870 1538 -955 -981 2225 1538
1392 1538 -1050 1152 2572 27 108 1953 283 -903 759 691 -1238 -1088 422 -579 -1058 311
1408C11J80j598K02J811m50j264N81O29j332L92J386r44j384J618M60q99K23J066
1426I88l67m93J077J91j238J00K79l39n64N59j3j028K62K31l99L1L67qk12J22
1446d54R26M17j289j82Q94l39q6N89l07r41L17J514n88o44P78K89q67N04J191
1465A722j367j353J877r5j906M52J248k037o48K653n90k236J915J250k031K61
1481h85L068j559k168K244R42k650P69K162k385j426K971L81k648Q87J949k373
1497g21n43L425o56l079J185J961k036p84K179j180k702K111K608l138j086L355
1513H99m48k168K580J622l572l89L889q04l137K293J252m030Q38M086k510l372
1529b971L739J441m311J531M002m181k209N219l75m889K558L074n226m54N551
$$ plain form
1408 311 491 -1107 -905 906 456 -808 -227 402 -930 -538 848 -96 -1480 138 598 -301 -78 988
1426 988 621 128 1205 1396 158 258 537 198 -366 193 180 -848 -586 -355 -754 -723 -356 -364 -576 -454
1446 -454 472 889 -400 -582 312 -27 -113 476 169 -772 -455 1059 471 -173 605 894 27 531 1722
1465 1722 355 -998 879 784 -1122 -670 578 -1459 -2107 546 -44 -2280 -365 885 -1146 -885
1481 -885 2183 624 -1544 700 1642 -1008 -239 1923 -462 -1888 1083 1464 -1184 -297 1652 -721
1497 -721 -1264 2161 1505 -1574 -389 1572 -464 -1248 931 -249 -2951 -840 1768 -1370 -2456 899
1513 899 451 -1717 863 2485 -1087 -1476 2413 1609 -1528 765 2017 -2013 -1175 2911 401 -2971
1529 -2971 768 2209 -2102 -571 3431 -750 -2959 2260 1885 -3004 -446 2628 -2598 -3052 2499
1544B499k098m683M430K367m934R88N436l739l410N575J250n806J647M685m888
1559f81k294N802r05n362L201L215m501o28M969k262m163M025K754n092k82M396
1575B192k746k793L955J557m768P4N083k184k924M283R65m642J278M933l364l659
1591b760M570J014n460J882M154m598k521N786r8o160L415M319n667q97O601k295
1607A285n845N425K938o455J54O391m076m537O881J283p377K824O495n909k561
1622c084O808j042o460M445M350o785j482O490k258n593N260K479o913J060O266
1637C541l712l983N727J229o139K038N374m207l331N637L62n960K643M290m521
1652a012k125N858M17n753K718M086n144j359N802j463o199M038L571n875j060
$$ plain form
1544 2499 401 -4282 148 2515 -2419 -1431 4005 266 -3144 2431 3681 -2125 -478 4207 -681
1559 -681 -2975 2827 1922 -3440 -239 2976 -1525 -2153 2816 554 -3609 416 3170 -1922 -2204 2192
1575 2192 -554 -3347 608 2165 -2603 -2529 2554 370 -2554 1729 2694 -1948 -670 4263 899 -2760
1591 -2760 1810 2824 -2636 -754 3400 -1198 -3719 2067 1969 -4191 -776 3543 -2124 -3021 3580 1285
1607 1285 -4560 865 3803 -2652 -2498 3893 -183 -4720 2161 3444 -3933 -1109 5386 -523 -3084
1622 -3084 3724 2682 -3778 667 5017 -1768 -3250 3240 982 -4611 649 3128 -3785 -2725 3541
1637 3541 -171 -4154 1573 2802 -3337 -1299 4075 -132 -3463 2174 2536 -3424 -781 3509 -1012
1652 -1012 -3137 2721 3138 -2615 103 4189 -955 -2314 3488 2025 -4174 -136 3435 -2440 -3500
1667c500O370k922n200N627L332p057R62O457l631m070O417Q72p676K511O583
1682E075n337l300O557q46o616M715M897o802j847P354j962n796N322K854p555
1697c287L71P479m400m832N864J222o847K671N938n224l444O790J52n587L148
1712A4M330n628j532O395j066n516K808L551n340m04O074k644n148M298L314n475
1728a969p7N546l297m539N925J612o476J139N292l849l473N889P23o474K769N443
1744D184m735k619O539j318n436L920M015n922j561O117j898n062M746K539o294
1759b785L84O145l389m178N530J057o130J806N352m596l379N859j56n376L395
1774d61L827m846j627O381j351m756L754L171n358j09N417k727m370L791J928
$$ plain form
1667 -3500 2870 -52 -5252 375 3707 -3350 -2388 4069 438 -3632 2785 3657 -4019 -1508 5075
1682 5075 -262 -3562 2995 2149 -4467 248 5145 -1657 -3504 3850 1888 -3908 1414 4268 -3287
1697 -3287 -2916 4563 163 -4669 1195 2417 -4430 -1759 4179 -1045 -4489 2301 2453 -3134 14
1712 14 4344 -1284 -2816 3579 2513 -3003 -195 3356 -1984 -2388 3686 1042 -4106 192 3506 -1969
1728 -1969 -2046 3500 203 -4336 1589 3201 -3275 -2136 3156 -693 -4166 1723 2446 -4028 -1259 4184
1744 4184 -551 -3170 3369 2051 -3385 535 4550 -1372 -2933 3184 1286 -3776 970 3509 -2785
1759 -2785 -2401 3744 355 -3823 1707 2764 -3366 -1560 3792 -804 -4183 1676 1520 -3856 -461
1774 -461 3366 -1480 -3107 3274 1923 -2833 921 4092 -1266 -1375 4042 1315 -3055 736 2664
1789B664n126K84M873k934l655M581J416m687J318M304l505k660N076K62n037
1804b826J948L717l902j686M962j144m336L342L179m408n86M657j881l869L887
1819A054J878m498L0M065k655k757M147M40m675J379M018k901k641M674J10m401
1835b733K253L117l630j263M601j009m311L208K322m086k15M089j762k704L149
1850A026J401l984K50M220k254l002L452M99l933J234K954k870j808L127N39l002
1866b151J382K591k908r24L629k34k927J656K037k811p42L619j460l034K570J710
1882B003l137M43K552j442k205K955P63k934L50K181k201j363K459Q5k956J202
1898a245K295j689q23K461j50k458J595K185k393o36K407n74k150J672J351k913
$$ plain form
1789 2664 -2462 -2178 2695 -239 -3894 687 2103 -2584 -1266 3038 -467 -3127 1949 2211 -2826
1804 -2826 -878 2839 -1063 -2749 2213 1069 -3267 75 3254 -1154 -1740 2917 1036 -2833 1054
1819 1054 2932 -1566 -1536 2529 -126 -2883 1264 1704 -2971 -1592 2426 -475 -3116 1558 1668 -2733
1835 -2733 -480 2637 -993 -2256 2345 1336 -2975 233 2555 -1531 -1746 2343 581 -2123 1026
1850 1026 2427 -1557 -1307 2913 659 -2343 1109 1608 -2325 -1091 1863 -1007 -2815 312 851 -2151
1866 -2151 -769 1822 -1086 -2010 1619 1385 -1542 114 2151 -660 -1402 2217 757 -2277 293 2003
1882 2003 -1134 -691 1861 419 -1786 1169 1932 -1002 -652 1529 -672 -2035 424 509 -2447 -1245
1898 -1245 1050 -639 -1462 999 849 -1609 -14 2171 -222 -858 1549 975 -1175 497 1848 -1065
1914a065j22K457o42j949J942M65j995L52K069j422j510J686L25j793N69J620
1930I87j630j014J661M99j413K11J513r85n35J827L05j760L19J552j256o84J369
1947I66k36j538L68J576j650n71J694l55j451R83J302j515m17J344l05j430Q85
1964c50R67j760QK005q21j255J242Q56j393M30J587q63r71J098L38j481M54J033
1982A124j211o28O09L95r74Q0P67o90n09J128N36j117J17P53k78p37Q94K70j307
2001g78J21J251m26j027J460L06j485M43J636r09j288J531K69j644O21J323j647
2018b43j231J925pj665N34J125j589M3K504q02k043J683R10j728J97J749j201
2035A61j597K080L33j803N91J131j174l70J848j24j782M96J587j181q44J248j27
$$ plain form
1914 -1065 -1187 1270 628 -1321 621 1086 -909 -557 1512 90 -1420 266 591 -1202 -633 987
1930 987 -643 -1657 4 503 -910 -699 814 -171 -706 1121 1426 -334 -15 1537 281 -403 966
1947 966 730 -808 -440 1136 -514 -1085 609 254 -1197 -214 1088 -427 -844 500 195 -1235 -350
1964 -350 617 -1143 -1135 870 49 -1206 36 892 -501 -71 1516 653 -318 780 1118 -363 91 1124
1982 1124 -87 -715 -106 289 -685 -605 162 -528 -1037 91 627 -490 -373 380 102 -635 259 529 -778
2001 -778 -657 594 168 -859 601 907 -578 -135 1501 592 -696 835 1104 -540 81 1404 -243
2018 -243 -1474 451 444 -1221 -687 438 -1151 -1108 1396 594 -1449 234 1144 -584 -387 1362 161
2035 161 -1436 644 977 -826 -235 896 -278 -648 1200 1076 -706 -210 1377 196 -648 600 473
2052D73j720N31J478j272r58J261K83j166P83J661j947p69K263L51k014R67J437
2069A642k295l49K357j64k831J502J607k296K22K494j359k288K456J264l195M11
2085h22K433k487j409L383J26l412J076K299k083n35L021r02k944K482J870l071
2101i75J7K790j826j558K914M10l256P00K570j632j611K643k38k267J037K249
2117A967k183j124J916m2k479J573J568k296j186K346O11k352J168J825k134m32
2133a254L057k83k643K010J826k911o88K736j141k881K248J786l299m16L574j844
2149a23k378L567P08m157J606L211l012j567L586m74l862K683K224l346k76L517
2165A907j352k809L445J464l848M49L171j920k174L019J61l279R60K677k313j697
$$ plain form
2052 473 -1247 -716 762 -510 -1468 -207 76 -1090 -307 1354 -593 -1362 901 1252 -762 205 1642
2069 1642 -653 -1002 1355 1191 -1640 -138 1469 -827 -605 1889 530 -1758 698 1962 -1233 -822
2085 -822 1611 -876 -2285 1098 1224 -2188 -1112 1187 -896 -1431 1590 688 -2256 226 2096 -975
2101 -975 -958 1832 6 -1552 1362 1772 -1484 -784 1786 154 -1457 1186 948 -1319 -282 1967
2117 1967 -216 -1340 576 534 -1945 -372 1196 -1100 -2286 60 671 -1681 -513 1312 -822 -1254
2133 -1254 1803 1520 -1123 887 2713 -198 -886 1850 709 -2172 76 1862 -1437 -1853 1721 -123
2149 -123 -2501 1066 1774 -2383 -777 2434 -578 -2145 1441 967 -2895 -212 2012 -1334 -1610 1907
2165 1907 555 -2254 1191 2655 -1193 -744 2427 507 -1667 1352 1513 -1766 -806 1871 -442 -2139
2181b139L117l4l200J530K488k407j194L549q08l079K234J911k878n44L084j091
2197E39k333K174J943l221k28L000j349k328K621J534l608J35L566k176k266K863
2213H66N85l421Q69L055k205k441L791K72l840K366K682l799r56L992j006l317
2229b507K693J971m043L48M158k141k499L267O99l061R62K671k290k121L530K19
2245A856l697J006K388k843j048L575q36l188K205K123k670j7L033j147k784K704
2261F60J826l396o5K789j115k473K735Q06l152QL210j649k037K721M06k791N91
2278i26L131k433k088L272P2l131J504K178k777q82L565o91l006K419K008l502
2294a287J93L385j536k742L015P82l200N70L036k266j923L087M12l221J098K392
$$ plain form
2181 -2139 978 944 -2256 -726 1762 -645 -1839 1710 902 -2177 57 1968 -910 -1454 1630 539
2197 539 -1794 380 2323 -898 -1126 1874 525 -1803 818 2352 -1256 -1121 2445 269 -1997 866
2213 866 1451 -1970 -1101 1954 -251 -2692 1099 1371 -2469 -103 2579 -1220 -2176 1816 810 -2507
2229 -2507 186 2157 -1886 -1538 2620 479 -2020 1247 1946 -1115 -153 2518 228 -1893 1637 1856
2245 1856 -1841 -835 1553 -1290 -2338 1237 401 -2787 -582 1541 -1129 -1146 1887 740 -2044 660
2261 660 2486 -910 -975 1814 699 -1774 961 1767 -1385 -1377 1833 184 -1853 868 1274 -1517 -926
2278 -926 2205 -228 -2316 956 1028 -2103 -599 1579 -1198 -2080 1485 794 -2212 207 2215 -1287
2294 -1287 -1094 2291 755 -1987 1028 1810 -1390 -820 2216 -50 -1973 1114 1526 -1695 -597 1795
2310A795k560j019L087k09k992J347K120k489r76L465j197k583K129J985k699
2325g96j27K725j108k416K645J349l168J94K937k013j703K543J25k759Q33K595
2341A856k119j384K622j43k796J545K029k347p95K738p01k373K084J282k859l15
2357a676L207j107j823J726J345k659L73K876j595j862K433K67k679O86K103k030
2373d15j352K323q3k151J218J354j812n02K461l45j964J443J093k272j50K119
2389I65o92k118K004J134k079J10K160j373j021K090M60k259J80K018j483j287
2405a191J889k43j847P97J650j427q78J736l04j399J306J089j618p31K044p6j801
2422a004J115J091j914j04K052r36j173J473N70j835K72J976j334j239J463M84
$$ plain form
2310 1795 -765 -1784 1303 1094 -1898 -551 1569 -920 -1896 1569 372 -2211 -82 1903 -796
2325 -796 -923 1802 694 -1722 923 2272 -896 -702 2235 222 -1481 1062 1187 -1572 -739 1856
2341 1856 -263 -1647 975 832 -1964 -419 1610 -737 -1532 1206 505 -1868 216 1498 -1361 -1676
2357 -1676 1531 424 -1399 327 1672 -987 -614 2262 667 -1195 1238 1505 -1174 -488 1615 -415
2373 -415 -1767 556 473 -1678 -460 894 -918 -1420 1041 696 -1268 175 1268 -1004 -1154 965
2389 965 273 -1845 159 1293 -786 -676 1484 111 -910 1180 1640 -619 -439 1579 96 -1191
2405 -1191 698 455 -1392 -595 1055 -372 -1250 486 182 -1217 89 1178 -440 -1171 873 797 -1004
2422 -1004 111 1202 -712 -816 1236 300 -873 600 1170 -665 -393 1583 249 -990 473 957
2438I57j619J76J344j417r57J532L33j490O65R82j310k08J975l93j595J047J088
2455A110j270L1J134m18j547J292Q16j818R5J328k25j202J519r2j289J94J184
2472H42r34o67Q05K90j086k5J281q16p67R57J46q72N10J127o96p88J628l3j590
2491f88P18J223j209n30J211k38j114P33P31j573L0J569p79j076J065O93j255
2508d89R1R43p82q43J113K73j336L31J288o75n94J012L45j124P01O42n70o14J191
2527I03j03j103L04O13r17l30Q29n0r56N23R16j110k58P15K18j141P60N76p03
2546c14n69J264R6j247P87Q40j410K1J626m31j055Q64M90j076p6J279q35j557
2564a303J570M37j504M74R04r93p67J856j61j405O17R65r83n7J101q19q79O55
$$ plain form
2438 957 -662 -486 858 -559 -1516 16 349 -1141 -476 506 -804 -1012 963 570 -1025 22 1110
2455 1110 -160 -129 1005 587 -960 332 1148 -670 -575 753 528 -674 845 753 -536 -342 842
2472 842 -92 -759 46 336 -750 -775 506 -310 -1077 -120 26 -846 -336 791 95 -693 935 902 -688
2491 -688 30 1253 44 -486 725 487 -627 106 837 -736 -706 863 84 -992 73 766 -489
2508 -489 -398 545 -237 -1080 33 306 -1030 -699 589 -86 -680 332 677 -447 254 896 326 -288 903
2527 903 800 -303 1 614 -303 -633 196 146 -810 -287 629 -481 -739 -24 194 -947 -187 389 -314
2546 -314 -883 381 477 -770 17 857 -553 -532 1094 663 -392 472 962 -114 -190 1089 254 -1303
2564 -1303 267 704 -800 -326 578 -415 -1182 674 513 -892 -275 690 -293 -350 751 -68 -947 -292
2582b92J295j353k78R05k10p36J153L93j051O8P59J51q37O39J63j200j67J294
2600F96l57j141N05L93q30Q1J004l60j326J176R90j525N44R98q56q67J675L54
2618A154j885J44J563j340o30K049m04j701J033J457j241p70J560o02j548J624
2634D63O63k147j03J615p72q44J516j7j813Q63J728j286p70J748k98j156J086
2651D76R95j709l84J338j20j154O90P11j655J46J542k23j215N43O49j299q8J293
2669E36o63r61P38R38j401J13J368p55j032J617P27j781p2J850n67j615J784J11
2687I35j899N44J744j346j139K089j24k062J290J443j995n21K194o99j761J885
2703E78J04j589k18K106j205j498K135L63j624L96J795j331p86J873j28j536J040
$$ plain form
2582 -292 1003 -350 -628 277 67 -669 484 877 -174 -106 653 804 -33 606 769 -431 -598 696
2600 696 339 -802 -297 96 -734 -653 351 -9 -1335 -159 831 -694 -150 848 -8 -875 800 1154
2618 1154 -731 -587 976 -364 -994 1055 651 -1050 -17 1440 199 -571 989 387 -1161 463
2634 463 1126 -1021 -1124 491 -281 -1125 391 374 -1439 -576 1152 -134 -904 844 546 -610 476
2651 476 1471 -238 -622 716 596 -558 132 843 -812 -666 876 653 -562 -19 630 -669 -757 536
2669 536 -127 -1088 -350 588 -813 -700 668 -87 -1119 498 1225 -556 -628 1222 655 -960 824 935
2687 935 -964 -420 1324 -22 -1161 928 804 -1258 32 1475 -520 -1041 1153 454 -1307 578
2703 578 682 -907 -1125 981 -224 -1722 413 776 -848 -452 1343 12 -774 1099 971 -565 475
2720D75J182j738l88J619p19j425J005Q42j544k22J486l41j356J244O69j606j8
2737h35J767q77j149J402M72j725K48J759j060j186J747L52j720N94J815j669
2753f5p26J827j97j629P70J294j737p37K047m48j971J221J333k047J36J779o98
2770A52j636J693P95k069O71J463j107j150J889M83k259O57J753j620o11J913
2786A017k88j666Q20J297j385o83J725n93j471J372O77j959J23J681n78j072J003
2803B0P22j588J05J923p83j491J277P54j740M61J763j260j169J676L25j584M85
2820a04J497j583o20K014l89j769O38J516j730m61J682m90j429R47J080j741N3
2837h89J632q89q36J513Q10j989K79J539j150p72J597K00j931P74J414j513n82
$$ plain form
2720 475 1657 -81 -469 1150 431 -994 11 853 -691 -913 573 232 -1124 120 789 -817 -835
2737 -835 932 55 -1094 308 780 -945 -697 1062 2 -1184 563 915 -805 -211 1604 -65
2753 -65 -791 1036 839 -790 -20 1274 -463 -1200 847 399 -1572 -351 982 -1065 -929 850 152
2770 152 -1484 209 1004 -1065 -394 1069 -38 -1188 701 1184 -1075 -418 1335 -285 -896 1017
2786 1017 729 -937 -117 1180 -205 -888 837 244 -1227 145 822 -1137 -1014 667 89 -983 20
2803 20 742 -846 -741 1182 399 -1092 185 939 -801 -340 1423 163 -1006 670 995 -589 -104
2820 -104 1393 -190 -810 1204 815 -954 -316 1200 -530 -991 691 201 -1228 -281 799 -942 -889
2837 -889 743 -146 -982 531 1341 -648 -369 1170 20 -752 845 1045 -886 -112 1302 -211 -793
2854g93J546j33j937J561R06j520n06J444k78j325J037R59j846k11J697p41r22
2871a062J170M60j101K26J462j000q45J277K65j549P09J150j461o13J594l08j317
2888i43R16R50j606j8J350l50j160J046P50j544O1R04p18o52J097N21j127j17
2906f40J431j038o20J674M12j704M64J280j068p37J243o5j475Q62P66j065o17
2923h97J345j99j224P73J022j488q0J196j49r38P67N59j204mJ137l51j058J091
2941B98N10j251M78R94p99q08J154K64j303M67J010j102o33Q28M12j402P59Q17
2959F93j148l06J293k92j056Q41P04r46l25J166m05r43Q91M86j006j54J184m41
2977B36p54R87L63j046Q7Q96p29n68J040k25j041O07O72q64l86J033k89r93P62
$$ plain form
2854 -793 753 620 -1317 244 1150 -370 -876 568 290 -1035 2 961 -885 -1096 601 -140 -1062
2871 -1062 108 568 -533 -307 1155 155 -690 587 852 -697 12 1162 -299 -912 682 374 -943
2888 -943 -27 923 -683 -701 649 299 -861 185 935 -609 -548 356 -362 -1014 83 604 -523 -640
2906 -640 791 -247 -867 807 1219 -485 -21 1259 191 -546 697 632 -843 19 785 -280 -897
2923 -897 448 249 -975 -202 820 -668 -748 448 299 -639 128 687 -517 -521 616 265 -793 298
2941 298 808 -443 35 1029 230 -578 576 840 -463 4 1014 -88 -721 107 519 -883 -124 693
2959 693 -455 -761 532 240 -816 25 729 -217 -542 624 219 -724 167 653 -353 -507 677 236
2977 236 -518 469 832 -214 -127 769 40 -528 512 287 -754 -147 525 -339 -725 308 19 -974 -212
2996b12P49j326K30J002l91n18N34O01q27l90J333p74k94M99K73p04j7Q35l22
3015B81o74N44M82j074K26Q18p03n65N84M90j028R5P54o44j64P71N3r95Q02O51
3035G04n78l00O42o6q16O13K29q12j47J098m78o84Q23K44q45K94N94l94o50R91
3055D62K7j013R5O15k67n44N96J91j022P32O31n60m21N98J90n12K63M94l92l80
3075b17N30o1n88O8P07o16m31J036L1r95L26O82o44PN42j71r13P66M7o15m5Q23
3097B69m2p26P31M27j135M11R34q59l38J214m33q05N78N13n91o28P42K66j436
3116i08P05N95p40m08J091l70m86O47K12j001L76P09k89n28O00l5n83K26O26j38
3136C01o23N69J87j16k7O8m10l39M33O11r03l32R44n37m97J021j62r73K94R76
$$ plain form
2996 -212 537 -789 -559 443 52 -466 68 669 -158 -548 785 11 -283 216 489 -215 -232 603 281
3015 281 -393 151 633 -441 -215 603 -100 -665 -81 409 -619 -524 230 -414 -578 193 246 -749 53 704
3035 704 126 -174 468 402 -414 199 428 -384 -531 567 89 -595 228 472 -373 -79 515 121 -529 462
3055 462 489 -524 -429 186 -81 -625 -29 162 -860 -128 503 -57 -478 120 310 -202 61 555 163 -217
3075 -217 313 252 -336 -268 439 -177 -608 428 459 -536 -210 472 -172 -165 377 206 -707 59 106 -509 -554 269
3097 269 227 -499 232 659 -476 -65 869 10 -328 886 453 -352 226 739 148 -480 262 528 -908
3116 -908 -203 392 -348 -756 335 -35 -521 126 338 -663 -287 422 133 -395 205 170 -413 -187 439 301
3136 301 -322 247 434 318 291 359 -51 -390 43 654 -249 -581 363 -174 -671 350 188 -785 -491 485
3156D85o54l32O99L10j184Q19N47o89n77Q84Op45P97J97j062J92J208o13o86P50
3176C52J80j222Q05Q90q68q11J014o3r90O15N84r82l31J157l31p20Q99J29m41
3195a34j47Q40m28o94N42O14q25M08M53o57m67M60L95k86l65P98m84l91O08K71
3215E11j046P7R07m20p24O29N42j110J20R29o46l74J135j23j042P26Q40j180k89
3234e38J167l34p33O84O90j419J28J219q56m67N28N94j350N46P41r60n31J210
3252C19qj223O42M92o92m1J043l16r55Q55N29p74k42J052m29q35R19M18j074q1
3272d01Q69n65o15Q61L40p28o0Q14m12q61J047L25j105P9J044p03o81O73L04j099
3292h74N85J015r84k87J023L3j038N58J030r73n83J258m14q94O03O41j148N5R15
$$ plain form
3156 485 -169 -501 198 508 -676 143 690 1 -576 308 314 -431 366 563 -499 -307 901 288 -398 352
3176 352 532 -690 115 1005 137 -674 340 277 -713 -98 486 -496 -827 330 -1 -721 178 307 -134
3195 -134 -281 559 131 -563 -21 593 -232 176 629 -28 -495 -35 360 74 -291 507 23 -368 240 511
3215 511 -535 -458 449 29 -695 -66 476 -634 -514 415 -231 -605 530 407 -635 91 931 -249 -538
3234 -538 629 295 -438 246 936 -483 -355 864 8 -459 69 663 -687 -141 600 -360 -891 319
3252 319 311 -912 -270 222 -470 -511 532 216 -739 116 645 -129 -371 681 252 -583 336 754 -320 -401
3272 -401 468 -97 -712 149 489 -239 -299 515 103 -758 289 614 -491 -412 632 -71 -752 -79 225 -874
3292 -874 -289 726 -258 -545 478 511 -527 31 1061 88 -495 763 349 -545 58 699 -449 -394 521
3311E21n64n38Q20Q5r13L07Q92q07n18J006j43q57O92K69o25k96R66J21j003Q23
3331B38J53o70Q6J035l91r69O33M50q52k3R37o46p15P90L20j170L88Q04o70k77
3351e49R73j18q59K38R66q39l39J111j80j218O24Q16p11J1N99k55p30N37O65p75
3371c3l43J229p31q49J212k04q74K14R75o66r32J144Q5j016N72P69p37l97Q94
3390C12J3q32O46N90r84K0O87k34o46L87N61p69j16J223n16j104R38M51j123J71
3410c25P98n93p87R01J72p15K74L77m60k13J026j61p39L74P40m99n13R54j60q18
3430c67O28M19r05j84P93j3p38N50M74j169J94P17l27n87P20j2p72K53N27l71
3450a70m04O38jo50L25O73n39j20N92J54p78L11P25j007o4Q69k50o48L92K44l97
$$ plain form
3311 521 -43 -581 239 324 -589 -282 610 -197 -715 291 148 -709 -17 252 -373 -669 297 418 -585 238
3331 238 391 -279 -193 842 451 -518 115 565 -287 -310 627 -19 -734 56 376 -794 -406 398 -272 -549
3351 -549 424 306 -553 -315 651 -188 -527 584 404 -814 -190 626 -85 -74 525 270 -460 77 742 -33
3371 -33 -376 853 122 -727 485 281 -593 -379 596 -70 -1002 142 227 -789 -217 552 -185 -582 312
3390 312 325 -507 139 729 -255 -235 452 218 -428 -41 520 -249 -365 858 342 -762 176 627 -496 -325
3410 -325 473 -120 -907 -6 166 -549 -275 102 -358 -571 455 294 -445 -71 669 170 -343 611 451 -367
3430 -367 261 680 -225 -409 384 371 -367 183 657 -512 -318 399 72 -515 205 193 -579 -326 201 -170
3450 -170 -574 64 63 -587 -262 411 -128 -248 344 498 -280 31 756 -251 -315 554 304 -344 48 292 -105
3471a05m25Q14k85o54O28L15o83K43P41m63m24M16K69q26J0L75m5l53Q52J74q26
3492b52K34P39o23n2M44k49m39L19K31o62j25Q19l51n90O79M24p98k88P37k20
3512b3l88L62L58q21K13P28n43l71Q03k47m56K48Q88q48l94R95L9o28L46K12k54
3533B19l31N16j65o07L39L58o60O8M93r4r14P61L66o02K44K60l95j36L33L53m99
3554i3j17N12k03m43Q62j61o92K74N38l55o51O10M48r33J88O65o68j51M56n5p65
3575g34O91K06m84j67N92j09m75N81L14q86K79Q56o45k09N70r3n57K09P66j132
3595d27J25O69l04k45K66L22n43o9N01n9n94K41K35l92PK36R1m28J30M96o50N9
3617c33O20j01n02J72M26l87j59L95j41j61J85J91j77l37N12k68j69M38m9n61
$$ plain form
3471 -105 -530 284 -1 -655 -27 288 -395 -152 589 126 -298 118 387 -439 -429 -54 -99 -452 400 574 -252
3492 -252 -18 721 98 46 490 241 -198 121 352 -310 -435 384 33 -557 122 546 -252 -540 197 -23
3512 -23 -411 -49 309 -512 -299 429 -114 -485 318 71 -385 -137 751 -97 -491 504 543 -85 261 473 219
3533 219 -112 404 239 -368 -29 329 -331 -263 230 136 -778 -17 349 -253 -9 251 -144 -280 53 406 -93
3554 -93 -210 302 99 -344 518 357 -335 -61 477 122 -529 81 529 -404 -216 449 -219 -370 86 31 -734
3575 -734 -43 163 -321 -488 104 -5 -480 101 415 -471 -192 664 19 -190 380 287 -270 -61 705 -427
3595 -427 -302 367 63 -182 84 406 -137 -206 295 236 -358 -117 118 -274 -267 -31 60 -368 -238 258 -392 -333
3617 -333 287 186 -316 -144 282 -105 -264 131 -10 -171 14 205 28 -309 203 -65 -234 204 155 -406
3637d06P0Q35l97o79M86K22m61J45L33n45l6P96l04n39O13M99p82J98J74J69m99
3658a08N52p5p06K41M76m40k19K66O1j24j39N51o38j70N55J11m22L57M0m67J94
3679a04K50J27p15K00L62O8l81L55J10l57K80J61k18k82L94Q9o91J56L65o11K12
3700b30N50j60n69K41L77n80K1J063l73q07M17N78j033L43O63o32l74R88j39m20
3720g6J36M49m94k53P89l52o61P19Ol78k23N99m64k70M61L68q46K36J68O4l92
3741d14O66O1n62K92Q4q7j81J77L05n07N4N98n79J6P7L23m62L76J04m55k84O05
3763B07k5m24j1M40k99m88P79l06k89O51J21o80M06K30j18p53N99L71o70L75J68
3784B84l66l46Q63l1o47J94M27o76p9P36k02o70N35M26o48p1O04k71o27O31r4
$$ plain form
3637 -406 -336 499 102 -577 -91 131 -330 -185 148 -397 -433 363 59 -480 133 632 -150 48 222 391 -108
3658 -108 444 369 -337 -96 380 -60 -279 -13 48 -76 -215 336 -302 -472 83 194 -228 129 169 -298 -104
3679 -104 146 273 -442 -242 120 188 -193 162 272 -85 195 356 138 -144 250 339 -352 -196 169 -442 -230
3700 -230 320 160 -409 -168 209 -371 -350 713 340 -467 -50 528 -505 -162 501 -131 -505 483 344 -76
3720 -76 60 509 15 -238 551 199 -462 257 263 -115 -338 261 -203 -473 -12 356 -490 -254 -86 -22 -414
3741 -414 252 313 -249 43 127 40 -141 36 341 -166 -112 486 -93 -77 0 323 -139 237 341 -114 -398 207
3763 207 182 -242 -253 187 -112 -600 179 -127 -416 235 356 -324 82 312 194 -559 40 411 -259 116 284
3784 284 -82 -428 435 404 -243 -49 378 -298 -377 359 157 -513 22 448 -200 -271 333 62 -565 66 -28
3805b8k45o8N68p6n51O11J43n38K15L25j04l87K49L8n26J88P04m60l99N71p9n52
3827d01R6O33m41r9M63j12p79N21K18m68p5Q21l92n36N22L24m44Q5O95o17l7M43
3849D20qo74P1N72k41m67N26J42n41J46P5k04r8Q05l06p37M98K46o32O3M55k34
3871a23m54N57M24o37L3M19j96m61M44J79l41K23O37n44l84N93r6l47J28Q3j78
3892d1n73P79J77r55N00L45l82j56N32o2p18N42M05p30P5O01r7o70P32J68p08
3913b36J05N46k04n41O02L9m81l7N79m52k95N84J15p77K81M33m95j36Q73l38o09
3934d44M31L48n41M5M12j2n09L63J62l50qM15k44k03L66p1l89J69L97k60l47L87
3956A17r4l54K34L22m85k33L23K03l86J21M97m15k21N11m6k94L22J34k93j25L06
$$ plain form
3805 -28 -273 -341 227 151 -400 211 354 -184 31 356 252 -135 114 152 -374 -186 518 58 -341 230 151 -401
3827 -401 -305 328 -113 -212 251 139 -640 -119 99 -369 -444 377 -15 -551 -29 295 -149 -64 631 14 -23 420
3849 420 412 -262 -191 381 140 -327 199 341 -200 -54 21 -183 -281 524 218 -519 -21 225 -407 -344 111 -123
3871 -123 -577 -20 404 -233 -200 219 23 -438 6 185 -156 67 704 160 -224 369 273 -74 54 137 -41
3892 -41 -614 165 342 -613 -113 232 -150 -306 226 164 -554 -12 393 -337 -262 339 242 -428 304 472 -236
3913 -236 -131 415 211 -330 272 311 -170 -207 372 -80 -375 209 324 -453 -172 261 -234 -370 503 165 -444
3934 -444 -13 335 -206 -161 251 239 -270 93 255 -95 -103 312 68 -135 231 160 -229 -60 337 77 -270 117
3956 117 23 -331 -97 225 -260 -493 -170 33 -353 -232 265 -150 -371 140 94 -200 122 256 -37 -162 144
3977A44j2k54K61K97o00j38P97m46m16N13N5j92J1J88m87n23J046k32l54J45K11
3998A4l41j08O87K6n13J11L37k43j09L55k98P0K26L65p83M05O7l48j77M39J68
4019C50n97K09N24n80k18N06j7n99K70M39m06n2K27o5k32J78L96n92j03M23J61
4040B22n54M79L12m60jL23k47K7J65j02j61j65L24q5m86M72J29n56K23M25l92
4061a08k34N43j71j56m3L47l87J29K61O2p47M04N4r2K9K46J35l76K62J70k26k81
4083a79M45k89j23O5L02n57K62K76p4l58K01M6N2j71K58l07rJ02M26m75n7K66
4105A02l26L40K2j39k77L56L03m07p2O13m22n10L82L61o18J20J02o6k97L47J53
4126F7k83N5O56n94k29P84r3l17O2r6k1j27K21q1k17L59K57l42k94K83k4j79J02
$$ plain form
3977 144 132 -122 139 436 -164 -302 495 49 -367 146 201 9 20 208 -279 -802 244 12 -342 -197 14
3998 14 -327 -435 252 278 -235 -124 213 -30 -139 216 -82 -12 214 579 -204 201 268 -80 -257 182 350
4019 350 -247 -38 486 -94 -312 194 177 -422 -152 287 -119 -171 56 -9 -241 -63 333 -259 -362 61 222
4040 222 -332 147 459 -1 -2 321 74 101 266 164 3 -162 162 77 -409 63 192 -364 -141 284 -108
4061 -108 -342 201 30 -126 -169 178 -209 -80 181 243 -504 -100 -46 -138 -109 137 272 -104 158 328 102 -179
4083 -179 266 -23 -146 -81 221 -336 -74 202 128 -230 -29 17 69 -102 156 -151 -160 -58 368 -107 -164 102
4105 102 -224 116 138 -1 -278 78 381 -26 -98 515 93 -417 -35 326 -292 -172 -70 -136 -433 -86 67
4126 67 -216 -161 495 -99 -328 456 363 46 108 12 -9 -136 85 4 -213 146 403 61 -233 50 26 -153 -51
4149e1Pm9k06M55p8m28J96K63k13P4K55k06k43K61L31m20j58N28k38k02J83P7
4171A38j86J9L84l97j08K26K21o46J87M12O0n41K90R5m88L27J56k22q8K80k95
4192a76j93L48M09o01K0N95k70n05M14Q2k43K06K79o51J73K95J5m53M04N0K7m54
4214b29K70J03m56J08M63m27k1K48M1j16j04K18k46j65N13k16J86k02J88p1O6
4235A51mL6j86k0K76l39n3L48j03j65J14J13m30J56L75m35j63L25k2j97K49J27
4257A53j34m29O31k99k50J88L48m82R8L03o3l9J98Q0n00L9L39q5j82M60q9l80
4279i5j88L56j87q9l2J02k03K63K15m86K37rK23k52m8J74j77l2L40J49p36N04
4301B9M63n91N8K38J02l44N56p7m96j39L46j93k16M66l8n34M66j16J4n56Q47k53
$$ plain form
4149 -51 -44 -93 -299 156 78 -350 -154 109 -104 -30 225 19 -224 37 368 -52 -210 318 80 -122 61 138
4171 138 -48 -29 355 -42 -150 76 297 -349 -162 250 310 -231 59 154 -334 -7 149 -73 -161 119 -176
4192 -176 -369 -21 388 -213 -193 402 132 -373 41 123 -120 86 365 -286 -113 182 197 -256 148 198 225 -229
4214 -229 41 144 -312 -204 259 -168 -189 59 100 -16 -120 98 -148 -313 200 -16 170 -32 156 85 151
4235 151 147 183 -3 -23 253 -86 -139 209 106 -59 55 168 -262 -106 269 -166 -329 -4 -26 -223 26 153
4257 153 19 -410 221 -78 -328 -140 208 -274 -176 127 64 25 223 303 -197 -158 181 96 -86 374 285 -95
4279 -95 -283 73 -114 -203 -235 -133 -336 -73 142 -344 -107 -116 107 -145 -193 -19 -196 -228 112 261 -475 29
4301 29 492 -99 -41 197 299 -45 511 434 -62 -201 145 -48 -264 202 164 -370 96 -20 -6 -562 285 32
4323C2k42p1N25k98j84L85l21J40J25K12k17j30L37l20j75L41J4r1l87O83j58
4344B00k18J53k6n86L86r5J16k88M90k60r8J17J95q3l40N19j41K87n57N56j81
4365A46j99O8J59m81J48N16p21K61M55l17k44K31K54m97M0K38L8m83K05L12l88
4386b59J3L94lk92M82l52r6R5K63o5j47k9J40j99K08M3k4m04L54J65m09J12K05
4409A95j36q4L9J83l27J08O7l76L31K65l94p8J63O2k25J12N39o03J05J00J73l62
4431a43P7K19l84J85N22l88k38K65o6j01L1j81K17l75N38L2m75J12K66l03p1N20
4453B59k85j40J64J04l19L20JQ9l52J82J67p6q1rq9oK71J00k36k62K42jk32q1
4477b70L78j29j65R4O7j99M16l37p5M9M86l89r9K77j44j98J10K85k10K9K22j11
$$ plain form
4323 32 -210 -281 244 -54 -238 147 -174 -34 91 303 86 -44 293 -27 -202 139 153 62 -325 358 200
4344 200 -18 135 109 -477 -91 -186 -70 -358 132 -128 -226 -109 86 3 -337 182 41 328 -229 327 146
4365 146 -53 15 174 -307 -159 357 -364 -103 352 35 -209 22 276 -221 -181 57 95 -388 -183 129 -259
4386 -259 -246 148 145 -147 335 -17 -113 -18 245 180 33 4 144 -55 153 196 172 -232 122 287 -122 -10 195
4409 195 59 -25 14 197 -130 -22 45 -331 0 265 -129 -207 -44 18 -207 -95 444 -159 -54 46 219 -143
4431 -143 -66 153 -231 -46 476 88 -150 115 49 -52 -21 -202 15 -360 178 210 -265 -153 113 -190 -261 259
4453 259 -26 -166 -2 102 -217 103 104 193 -159 23 190 114 33 24 -65 -71 200 300 64 -198 44 43 -189 -270
4477 -270 108 -21 -186 -92 -25 -224 192 -145 -220 -171 315 -74 -173 104 -40 -238 -128 157 -53 -24 198 87
4499H7N5q6J37l14J0N7P0k87L32r1m36J26L18J77n09K26K53q0l06O19j87n74N61
4522A58Q7j34l7P5O3k72L81J1l77J31K87l92M8J67j1m15M40k5k60J67K2l75M4
4545b17M52p1m61K87l9L3L3K4K23m97K20L28q6p3Nl6j67J18O0k10j01K39J60n57
4569c33M98j3k86o0M95j26k55q2L75j60j93m1J28j13L9K48k79l0K68M9k50L11
4591A90R8l19j39L69j01j70J87Lk50K19j41O4j10L14l57l4J46K63k62L4m1l6j64
4614b37K58M6k22O4R2P5Jj01RK38l8k01J55j37O0l5J70k41K05p1m18M90j25j29
4638i2j53M08j04l06L01M8j73nK86k20J0r8M22l42j05K45k90J47N5L2j2j04K69
4661B19j82J9J54k36p6K19j29j48L22l3Q7n29J51R2k26L17R7j58k07N43m92m8
$$ plain form
4499 87 142 56 193 -121 -111 -54 16 -271 61 -30 -466 -340 -22 155 -354 -128 125 45 -261 358 171 -403 158
4522 158 245 111 74 149 212 -60 321 332 -45 86 373 -19 29 196 185 -230 210 185 -75 92 114 -261 -217
4545 -217 235 164 -297 -10 -49 -16 17 41 264 -233 -13 315 229 156 161 125 -42 76 136 -74 -175 64 224 -333
4569 -333 165 152 -134 -194 301 175 -80 -162 213 53 -140 -181 -53 -166 -127 121 -158 -188 80 129 -121 190
4591 190 288 -31 -170 199 98 -72 115 118 -132 87 -54 10 -100 214 -143 -177 -31 232 -30 4 -37 -73 -237
4614 -237 21 67 -155 -91 1 76 77 -24 -15 223 185 -16 139 2 62 27 197 -44 161 90 -328 162 37 -92
4638 -92 -245 163 59 -247 54 102 -71 -76 210 -10 0 -98 324 -18 -123 122 -168 -21 34 66 54 -50 219
4661 219 37 56 210 -26 -102 117 -12 -160 162 129 216 -313 -162 -70 -296 21 118 -40 -247 296 -196 -244
4683b44K05N5n2N5J63j02j57J15J79l66K46p4l1O8J60k44pK17l05K96j40K11m69
4706b21P5k2J31K18j96j46J63N5q6K64k55k27L60k04N1K40J62p08J66L10j94k29
4728b93O94n7m15J35N4k90KK58J41n33k39P82l93J50l6L0j20MK21k15J46J38j93
4751b9j71L42Kj49q1n1L25l24Q3M0p5N2J99k4j64J7J21k35P1p1o3j78L56l3Rn0
4777h1J81j90n2K45k76P4q9M40j17r3k83M29n19L69J00k68J15K2J05j02K33j81
4799F2j46l4K49m20K23L1L32m98j30M10q7PoN5j10J74p3Q7n9Q8j4l76L70k8j73
4824f6p3L53j55m2l8J67j35pp8Q3j46M98l18j45J14J89n3l08M50p4l53K0K75k12
4848e4p2J70N1n9k99M67j82J42k42J76n5o7K03j98%j04K19l58K8M46m37J0M30
$$ plain form
4683 -244 -39 16 -36 19 182 80 -77 38 217 -149 97 23 -8 60 220 -24 -31 186 -119 177 37 248 -221
4706 -221 -146 -168 -37 181 -15 -161 2 57 -29 235 -20 -247 113 -91 -40 200 362 -346 -180 130 -64 -293
4728 -293 401 344 -71 64 118 -172 -170 88 229 -304 -543 239 -154 -4 -40 -10 -130 -126 95 -120 26 164 -29
4751 -29 -200 142 144 -5 -86 -137 188 -136 -53 -13 -88 -36 163 139 -25 -8 113 -122 -51 -122 -185 -363 -7 -40 -31 -81
4777 -81 100 -90 -142 103 -173 -99 -188 252 135 42 -241 188 -331 38 138 -130 -15 7 112 10 243 62
4799 62 -84 -118 131 -289 -66 -35 297 -201 -331 79 -8 -1 -7 48 -62 112 39 126 67 155 141 -235 135 107 -66
4824 -66 -139 214 59 17 -21 146 11 4 -74 9 -137 361 43 -102 12 201 148 -160 290 216 -137 -117 158 -54
4848 -54 -126 44 95 36 -263 204 22 164 -78 98 43 -24 179 -19 -19 -123 96 -262 -234 212 -225 -215 215
4871B15m08j24J35Q8M1j48L04j13M5k2K85m33L38J1j97j01K27p9J08K0k72J19
4893C9k61J64J74l79N0J47l9p4N4J05L0j15J05Q1q0N1p7j32K77J90m18P2K53j60
4917E7K5Q1l4l2m7J91k96J00J3L5j87Q2K8j48J08n1Q0nJ60J2l67L20k33p2j25
4942c05L90K04l16p6M2K23k11J24L8n1j21L79m84j34J15N3K11J4M0q8k49j6K31
4965A3l04Q5J41j4qj3J2j70L18j20q1K48k47J94J00j10rq2O3J37j07r7R7J3p8
4990a9p5J57J60k89J42Q9l90K27rl6K2L9J10m39J88J38J7j01K34l08J12K61k43
5013a3j05J99J75j94j76J4M11l51P7K4k21L1K03o7j43n0L35j13p7k8K56k35J56
5036A08oj99n3Q7K99l35k6L58j37k62M3K07K30l31P6o8j66J08L76l29k38K28j55
$$ plain form
4871 215 -193 -317 -182 -94 -53 -201 103 -10 35 13 298 -135 203 214 17 -84 143 64 172 192 -80 39
4893 39 -222 -58 116 -263 -213 -66 -105 -179 -125 -20 10 -105 0 81 1 52 -25 -157 120 310 -108 -36 217 57
4917 57 82 163 129 97 50 241 -55 45 58 93 -94 -12 16 -132 -24 -75 5 0 160 172 -195 125 -108 -180 -305
4942 -305 85 289 -27 -103 -61 162 -49 75 113 62 -59 320 -164 -298 -183 -130 81 95 135 47 -202 -218 13
4965 13 -291 -206 -65 -79 -87 -100 -88 -258 60 -60 -141 107 -140 54 154 44 35 -47 16 153 46 -51 46 59 -19
4990 -19 -94 63 223 -66 76 165 -225 2 -7 -43 -21 18 128 -311 -123 15 32 -69 165 -143 -31 230 -13
5013 -13 -118 81 256 62 -114 -100 311 -40 37 61 -160 -129 74 7 -136 -186 149 36 -41 -69 187 -48 108
5036 108 102 -97 -150 -63 236 -99 -125 233 96 -166 -123 84 314 -17 59 -9 -175 -67 309 -20 -258 -30 -185
5059a85J16jJ01m9J10J04k99j68L00q6j23j7K27j13K02o0j23j80M39O1m10L60
5081B06k94K28j80J97j22k98K31K81o10K80J14k09Q7K01L1l24m0Q2L3J37R2r5
5103B8j56l7K49j98J32K04j93M1J31J8k93J23lK2k16K71l66J98N0P0j22J57J18
5126B28k85j08o3L58n0n4O2o9q7O8K69l93J01N0q3p3O0K79k43m9J18k80J86J49
5150I1r8J20j62L51m16Q6o6N1J67j03j6J28j24o8J54n7k51L34o6j61J69k1k17
5173a75Q7J86j59J55p4m3J37p2m7j63l7J32l7K7P8L8n0k09K71j66P7J90m12J17
5197a49q9J14L42l94K88Q7j25q4j26J91N3J02l64PL3K69m51K20K67j70M7k58K57
5220F7P1j82K39k64j16J84J27r0q7M5O4j60L30j59j45J3Q5j14K88k08Q7j8j19
$$ plain form
5059 -185 -69 -70 31 -18 92 196 -103 -271 29 -57 -180 -197 30 -83 119 59 -64 -244 195 256 -154 206
5081 206 -88 140 -40 157 35 -263 -32 249 -361 -81 33 -176 -89 112 143 -181 -221 -139 -106 31 123 28
5103 28 -128 -165 84 -114 18 222 29 70 201 219 -74 49 46 68 -148 123 -243 -45 5 75 -47 110 228
5126 228 -57 -165 -228 130 80 26 88 19 -68 0 269 -124 -23 27 -56 -129 -69 210 -33 -82 36 -244 -58 91
5150 91 -7 113 -49 302 -114 -28 -94 -43 124 21 5 133 9 -59 95 38 -213 121 55 -106 63 42 -175
5173 -175 -88 98 -61 94 20 -23 114 42 -5 -168 -205 -73 -110 -83 -5 33 -17 -226 45 -121 -44 146 -266 -149
5197 -149 -238 -124 218 -176 112 199 74 -10 -136 55 108 210 -154 -147 -114 155 -296 -76 191 21 68 -190 67
5220 67 138 -44 195 -69 -185 -1 126 36 -51 -6 58 -102 228 69 -76 -63 22 -92 196 -12 75 57 -62
5243f2M19m05J10J03k28j53R3J79k13l4K88K0J5j56J93n36J80L64m6k06K65k36
5265d6kQ6k52K52j47l8J9Q1J7Kq3M1K15r8Q0Q3k84J90j11k21O4l3o3L17p8J22
5291A13r5L6k12J33R9pk28K58j11j17L08k66j39J78M1l03K10j8K27Q7j79R2J8
5314A25k20M21l01j77K27L2l41J3J97l8J1K10J86l60p0J89o2j91K38O9k00RO9
5337C6r5N1J09j06Q0j76p4J75J4j4r4P9j97K46l11M00r2J15j56n9j21N4j22K38
5361b0k1k57N15j97o8n7J42M7N9j96O3M1j26Q1RK50j83l1L0j5k50M41k09l2j46
5386a30j2K06j66R0j76M17k52P0j0J40k17J68R2k72j2r1M42m20j2K79j43r7Q7
5409a9J6kj74L86q5j91J33k95M66q3j76k19K15k8J86j61P5j00k06R1L24m3lj75
$$ plain form
5243 -62 357 -48 62 165 -63 -216 -123 56 -157 -191 97 117 132 -24 169 -367 -187 177 131 -75 190 -46
5265 -46 -48 38 -214 38 -109 -147 -128 -47 -30 -28 -111 -70 145 47 127 210 -74 116 5 -216 -152 -185 -248 69 -9 113
5291 113 18 54 -158 -25 74 67 -161 97 -14 -131 177 -89 -228 -50 -9 -312 -102 -120 107 194 15 107 125
5314 125 -95 326 25 -152 75 107 -234 -221 -24 -62 -51 159 345 -15 -85 104 42 -149 89 158 -42 -33 36
5337 36 -59 -8 101 -5 75 -101 -175 0 14 0 -94 -15 -212 34 -277 123 31 146 -10 -69 -190 -136 -258 -20
5361 -20 -41 -298 217 20 -48 -105 37 84 143 -53 10 51 -75 6 15 265 82 51 81 66 -184 257 48 16 -130
5386 -130 -142 64 -102 -12 -188 229 -23 47 37 177 -40 128 220 -52 -64 -155 287 -133 -145 134 -9 -106 -19
5409 -19 -3 -5 -179 207 122 -69 64 -231 235 152 -24 -243 -28 -56 130 -31 44 -56 -262 -171 153 110 107 -68
5433f8L7lJ60j59n5P5LJ8J3nR0j23j45J04R5l4k99L48j09J37n7J54k26K4n1L1
5459d5Oj36L74j88J44j49j56J30J67r2k79L37k22K6pJ28r1o9N2L04l77J31L3P
5483B8j80J48J20k21o7K13r7n9M25j53j43q6L4O7m0l2K30n2Lk0K4n9l1j11o1M1
5509g9J39k28K66j78J0p4R7J55k20J26n3K13l54K54k70j1R8O1K03j43M0R3rk06
5533g0K2N8k9J4K02r3j06k7J01k00L18k58K22j74K02l61K00j80j3j20L40k30J26
5556e6m6K53k50O7o8Q9L8O8j58J06r1J77k11j38L48Pj28p3q0J25j11pQ8J86j11
5581B4L9r7m4O7N7k02L14r2r0J30q7j40R2nJ18j5k21L81m89K53P6J54k61O7o2
5606c3k3j21L97j0k91l02L22r0M9p8L03R4j77J8m2J29K54l44j09j19K18n2L2q3
$$ plain form
5433 -68 -31 -34 126 -33 -88 -13 -10 8 21 16 106 -17 -162 -58 37 3 -296 52 -57 80 23 177 -49 -25 -76 -45
5459 -45 -39 -175 199 11 155 6 -150 -20 147 55 -224 113 -109 -83 -90 38 -53 -122 -70 234 -143 -12 21 28
5483 28 -152 -4 116 -105 -172 41 -56 -115 310 157 14 -72 -38 29 -11 -43 187 135 138 118 142 83 52 -59 -120 -79
5509 -79 60 -168 98 -80 -70 -144 -47 108 -112 14 -39 174 -180 74 -196 -207 -109 -48 155 12 52 145 136 -70
5533 -70 -48 10 -19 -5 197 104 -2 -29 72 -128 190 -68 154 -20 182 -179 21 -159 -172 -292 48 -182 -56
5556 -56 -102 151 -99 -32 -100 -11 27 95 -63 43 -48 129 -82 -220 128 135 7 -66 -146 -21 -132 -139 -51 135 24
5581 24 63 -34 -78 -11 46 -156 158 66 -24 106 19 -121 -29 -34 84 69 -152 229 -260 -7 69 223 -38 29 -33
5606 -33 -56 -177 220 210 -81 -383 -61 -151 -102 -180 123 217 40 58 16 145 399 55 -54 -173 45 -7 25 -58
5630e8K87k04o0J12j49J34o0j38J11R2k14J57k3O3q3%j10P3l1J85j4k12Q4n3j36
5655b47J3K23K2Q6l32J02M00k43N9Rk02kK05J28l86K35N7k90J36J39l5j71j09
5678b03J82P1K0j76p0K35jP2l02J75j21j37K82J32l34O8k32N78k33j3k8P7k93
5701b51L58j2j88KK18j70J74p1r5K0J65l13J02O6M7J5l83K46K54j29k07K62k59
5724a49P5J86J2p0J75j06k96J52k53M12m30J11O6N6J62o4P4k60K24j7j30J28j07
5747d9J07j26M2J27j00N7k67L44l68J58M38n94L16Q7j44k03J41J56j20J43M4m22
5769b33K14J00r5j31j16K65l1j30K66M8k93qJ2L59l01k1K61k19l3J15n1qM2p5
5793f3J32q5O6l0l04K72J07j33Pq5K33j15K5J59k19J05m9q0n3J19O8q4k89K58
$$ plain form
5630 -58 229 25 -35 77 -72 62 2 -136 -25 67 -147 10 -13 50 -33 -33 -143 -70 -101 84 70 -142 -58 -111 -247
5655 -247 -234 -11 11 97 -235 -133 267 24 83 92 -110 -112 93 221 -165 70 127 -163 -27 112 77 -94 -203
5678 -203 -21 50 70 -106 -176 59 58 130 -172 3 -118 -255 27 159 -175 -107 -339 239 6 -7 -35 42 -251
5701 -251 107 95 -93 -91 127 -43 131 60 -35 -15 150 -163 -61 5 52 67 -316 -70 184 55 -152 110 -149
5724 -149 -74 112 124 54 229 123 -173 -21 -274 138 -292 -181 -115 -59 103 39 113 -147 77 60 -70 58 -49
5747 -49 58 -68 -26 101 1 58 -209 135 -233 -75 363 -231 85 172 28 -175 -34 122 2 145 189 -233
5769 -233 -19 81 -14 -145 -261 4 -27 -157 109 157 -136 -144 -132 227 -74 -95 166 -53 -86 29 -22 -30 12 -63
5793 -63 69 -16 50 20 -284 -12 95 -38 -31 -116 117 2 27 186 -33 72 23 -57 -110 9 77 -7 -296 -38
5817c8R7j99K21k40J84j31O3J27r2M9K44k20k0j43k03K56J28p4j66J16r7p8L44
5840A28j57j7j48J38l9nk5J25J31l5k07J94K8q3K53l50P1n2J47k41K72k2m9j00
5864d3n4M39j86k56o1J47m3r1R4N8K96k48J35k72oJ51p7k8Q2j38p1J11N2J47k00
5889f2J36j21k3J84q5j04J46j13K09j19L8k37J9L11j38j34j09K18o5l1L61j61
5911A20j57o4L58m17J69m8n9K3O0L1p7J52j08P9Q9j1k01J94J29j76j01J48k45
5934a12Q5k6p6OJ15pK4n1n5j03L2J85J42r6P7k66J00K14l63K11r3L7l8o7K35j21
5960a1j16K15k56p3L36o0n8M9J52l09J02J79k78p2K76r6j47j5N5p7J58q0J54J38
5984A66j65J75p2j91J0P8r6K84l39K57l12J70Q4p6JJ32p0O7q4k72K29O5j67J59
$$ plain form
5817 -38 59 -140 81 -159 25 -106 -43 84 -8 41 285 65 45 -98 -301 -45 83 9 -157 -41 -138 -216 128
5840 128 -29 -46 -194 -56 -95 -100 -125 0 131 96 -111 83 111 28 281 -69 2 -50 97 -144 128 106 57 -43
5864 -43 -97 342 156 -100 -161 -14 -57 -148 -54 4 300 52 187 -85 -91 60 -17 -45 37 -101 -172 -61 -9 138 -62
5889 -62 74 -47 -70 114 29 -75 71 -42 167 48 86 -151 -132 179 41 -93 -202 16 -49 -80 281 120
5911 120 -37 -101 257 -160 9 -39 -98 -75 -15 16 -61 91 -17 62 151 140 -61 133 262 86 -15 133 -112
5934 -112 -27 -53 -129 -123 -8 -15 9 -42 -97 -200 -168 17 159 63 140 -126 -26 188 -175 36 -57 -20 -58 -125 110 -11
5960 -11 -127 88 -168 -241 95 35 -23 26 178 -131 -29 150 -128 -200 76 -20 -167 -182 -127 -204 -46 -126 28 166
5984 166 1 176 104 -87 -77 1 -95 189 -150 107 -205 -35 49 -27 -26 106 36 103 19 -253 -24 41 -126 33
6008C3k97K76K4r8n2K13k26J71J67k40k6K60k02P1q8Jm6M1J14j72J46l34M28l83
6032b19L10j72q7o3L54l19L19k08K3j06J69M0j67J75Mr7L2n8L6N5Q5O3j28L3k28
6057a54O0L23j49k55K27J23k12j82J98P8J22l20J75j31n5K24J16k80L48j49R0
6078A97k70q2L30lj24P7k35K01N5j19j60K87k00J05Pp8j54L42o8o8M8j60M9r4
6102a17K27k83K74o2J78l91j10M21l49K23J89m70K57r3K09m5j64M5K69k27N8j10
6124g1L6J08j84R2r9M0Q8j48k00L78R9k11q3J23l17K46K22r0l4M1J03k91R7J46
6148I1k12N0K70k68L4j80N63k62o5L2k75Q4O1K06j04N5M4j48J07j69J4K06m89
6171c55M47k48J31j01L15k70L43k52J9q7r1L01k72m3L04j09l14N64l10P0N6N4
$$ plain form
6008 33 -264 12 36 -62 -114 99 -127 44 211 -29 -55 205 3 74 -14 -13 -59 -18 96 -76 70 -264 164 -219
6032 -219 91 -81 -168 -231 123 -196 123 -85 -62 -168 1 41 -126 49 53 -44 -12 -70 -34 21 106 169 41 74 -154
6057 -154 -94 229 80 -175 52 175 -37 -219 -21 57 179 -141 34 -97 -152 72 188 -92 256 107 197
6078 197 -73 -155 175 172 48 125 -110 91 146 27 -133 154 -46 59 66 -12 -166 176 108 40 88 -72 -23 -117
6102 -117 110 -173 101 39 217 -174 -284 137 -212 11 200 -270 -13 -106 103 58 -106 -61 208 -19 39 -71
6124 -71 -35 73 -111 -19 -118 -78 10 -138 -338 40 139 -72 -155 -32 -349 -103 119 29 -5 36 139 -152 -55 91
6148 91 -121 -71 199 -69 -35 -215 348 86 21 53 -222 -138 -77 129 25 80 124 -24 83 -86 -72 134 -355
6171 -355 92 -156 -25 -126 189 -81 262 10 29 -58 -149 152 -120 -163 141 32 -282 282 -28 42 98 152
6193A52j63nq3P1J53p9j48m2J73j93m6M48l75J32p4J05L85m29R4J4k40P6k7P9
6217b2j74K74M1j88J05k65L0K14r2J28J05k89R8J75j79k3j10Q4k1K32k46j03L38
6240A12k14Q4j09P4K7Q1M0k64J29K05j88q7R3j42K76l8j19K1j8J69k07j4m4mK64
6265A27j12K8j32K35j56j03J28M5m8k42L94j07n7j12L22k62O0J55q8N2n6l27J90
6288f6j27K07J21j2l44K62j31J14j76J95j47K3M3p4Q2J43j42L89n55m5J81k52
6310c11N94m07O7j80M33k00Q5Rl0J90m38J01m3J95qp0j86L26n5q1k6j17m6O5K34
6335A01j34k39M21k02K51j24j42jL37l02j29K61P8k69M9J16N6r1j07J00j72K92
6357A50k38k21j6J69L45j83j6k1N8q1J02K38k67K1n9L5p1m7Q0J01m8j59J33j3
$$ plain form
6193 152 -11 -16 -99 -28 125 46 -102 -144 29 -164 -210 238 -137 -5 -79 26 411 -18 76 90 -150 -74 -101 -22
6217 -22 -196 78 119 -69 36 -229 -199 15 -77 51 156 -133 -35 140 -39 -62 -172 -88 -109 123 -123 -226 112
6240 112 -102 -18 -127 -53 -26 55 95 -169 -40 165 -23 -110 -17 -159 117 79 -40 -19 -37 132 -75 -89 -133 -137 127
6265 127 15 43 -89 146 -10 -113 15 60 12 -230 164 57 0 -112 210 -52 8 163 75 127 71 -256 -66
6288 -66 -193 14 135 123 -221 41 -90 24 -152 43 -104 -81 -38 -112 -30 113 -29 360 -195 -240 -59 -311
6310 -311 283 -124 -57 -237 196 -4 81 90 60 250 -188 -87 -130 65 57 -13 -199 127 72 -9 -35 -152 -198 -133 101
6335 101 -33 -272 149 -53 198 74 -68 -69 268 -34 -163 98 176 -93 -44 72 128 37 -70 30 -142 150
6357 150 -88 -309 -325 -156 189 6 -10 -31 27 -54 48 286 19 40 -19 16 -55 -102 -22 79 31 -128 5 -8
6381hk3K1J33j38m1L02k90l3K24k24K40j29k83K1L91p3j89M24k19m30K20J25L4
6404E5j2p3j11J02q1L19k90J51J12J8o6j98J83J7j94m23L76K67k03j23J20j03
6426a57J28j31J99j80q4K4J14K90k30k1K27P9m92K10o3J06j53Rk4p0K55N9Nj98
6450i8J07j42PJ36j04R8j55J9K53j27j51o5J9J91P5r6J84k26N4L19k23j71L56
6473B60m03K12j70j23K01J31j07n5j92J06J09J3%k31L11j34l7jq9J39J12k82L07
6496G7J53j4j27j22K1r6J47Q6q6r0q4O1m3K27k15J67l52J30J69j01j8J67K1p3
6520EJ17j67L9o1J56P8k76J77k74K07J49j00j78K64j79o0K47n2j46J18o7k3k42
6543b68L26j3n7Q0j82J14m7q2K29o7k06M14j24m3j96J33n2j97L3K46J41l77J02
$$ plain form
6381 -8 -31 -10 123 -15 -56 246 -44 -77 147 -77 163 34 -249 -228 163 90 -99 325 106 -324 -104 21 55
6404 55 43 -30 -141 -39 -120 199 -91 60 172 190 124 -74 109 126 -68 -491 -115 152 -51 -174 -54 -157
6426 -157 -29 -160 39 -141 -225 -201 -87 203 -27 -48 179 258 -234 -24 -87 19 -134 -125 -149 -219 36 95 100 -98
6450 -98 9 -133 -126 10 -94 4 -151 -132 121 -6 -157 -222 -203 -12 63 -33 151 -75 -21 298 75 -96 260
6473 260 -143 69 -101 -224 -23 108 1 -54 -246 -140 -31 -18 -18 -249 62 -72 -109 -110 -199 -60 52 -230 77
6496 77 230 216 89 -33 -12 -108 39 125 39 -51 -135 -74 -117 110 -105 62 -290 -160 9 -92 -110 57 78 5
6520 5 122 -45 -6 -67 89 167 -109 68 -206 1 150 50 -128 136 -43 -103 144 92 -54 64 -3 -26 -268
6543 -268 58 45 -12 68 -114 0 -47 -129 100 33 -173 241 117 74 -122 11 -41 -238 -205 41 182 -195 -93
6566i3J45O7K7o9j35OJ96k3q5L20l86j85K13R0j35k33L74p0m16K25J97q3K36k36
6590e3J15l11K55O4k10Q6L5j00J18r9nJ91N1K8k9k54K58J7j8j65M5Q1j40J51m60
6615c49M20j13NJ61K3k65P7L4j00M30l99R0M2o0j81K38k13P6L4P6m4P5M4p7j1
6640A3p6K21k81J64j90L8J46J9J3k52J40L1L9J33l10R8p0K68k65J22j83J54J44
6663A16j16n7J15j3k09K84j29k2j29Q6k5j01R4J03oj40J20J70j61lk5J81j95J39
6687G7j6r8K60j99O5J55l81L48l55J54n0J18k53K25k15PJ73K8r6j53R2K74j61
6710aK97j93j28K9J70k74J1J48k44R5J25J17j20j8k00M02k62p2Q6m0k1L49l60
6733a04M7J12k82J14J15l01J8K47L35l60Q5K9k43M10r2qQJ46l00L0K12j40M1k
$$ plain form
6566 -93 52 119 146 77 -58 -52 144 121 36 356 -30 -215 -2 88 -47 -280 94 24 -392 -167 30 -53 183 -53
6590 -53 62 -249 6 70 -140 -54 -19 -119 -1 -100 -105 86 137 165 136 -118 140 157 139 -26 19 100 -40 111 -349
6615 -349 71 -42 -37 124 147 -118 -41 -7 -107 323 -76 14 56 -4 -185 53 -160 -84 -50 26 -18 57 101 24 13
6640 13 -63 158 -123 41 -149 -111 35 54 67 -185 -45 -14 25 158 -152 -54 -124 144 -121 1 -182 -28 116
6663 116 0 -57 58 45 -164 120 -9 -31 -160 -74 -99 -200 -106 -3 -9 -149 -29 141 -20 -23 -48 133 -62 77
6687 77 61 -37 223 24 89 244 -137 211 -144 10 -40 78 -175 50 -165 -158 15 43 -53 -206 -114 160 -1
6710 -1 296 103 -25 4 174 -100 -89 59 -185 -90 35 152 32 14 -186 216 -46 -118 -32 -72 -93 256 -104
6733 -104 -57 55 -227 -113 2 -299 -281 -34 301 -59 26 55 -188 222 130 122 130 276 -24 6 218 78 119 117
6757A17O8R3k84N1k3j16K8k3j2K34j35J97k36O7J86j82j24L02k74L21k32j39j75
6780b91M35j63k0J0J16N8p3l36J29L64j44m8M0m8l5J03K52m06m5N0J56J5j64P2
6804B7r7j40L00M9k31J03k16L2o1L51j30J9r9J3p3J80j07J52q6J9Pj32K18K8k60
6829a34j71M3L35r7j33K80q0O0j68J28J01j29n5N3k0R5k18L79n12K46L5l06L73
6852A05k73J14N2J7r8R0L0K18j56pk14J2o5Q4J05L0l05K17j43p1K8K24l7M9j00
6877i4K20J11k27k35J98K02k07j9n6J68j36J40q7j1r6K13j18O7j1l5k15R9J73
6900D4l0r1l7J23n3L5l0L9j08l9M9JQ6K9q6mK4J18j7J4n8J32j12L4K1J27j29n
6928G7k19J8K93k1K5j15R8R4l64K97l94K00K06j88j63J43j7K21m26R7j86K56J16
$$ plain form
6757 117 185 278 -6 45 22 -94 -66 -89 -101 133 -2 195 -41 26 212 30 -94 208 -66 255 23 -116 -291
6780 -291 144 -19 -39 -29 87 145 72 -264 -135 229 85 37 77 29 -6 97 349 -57 -102 -52 104 119 -45 27
6804 27 -70 -210 90 139 -92 11 -205 -173 -234 117 -13 6 -93 -80 -153 27 -80 72 -14 5 12 -120 98 126 -134
6829 -134 -305 -262 73 -24 -157 123 43 103 -65 63 164 35 -20 33 13 108 -110 269 -243 3 38 -268 105
6852 105 -168 -54 -2 15 -83 7 37 255 99 92 -122 -110 -175 -91 14 44 -261 -44 -187 -258 -230 -6 -43 6 -94
6877 -94 126 237 10 -225 -27 175 -32 -51 -107 61 -75 65 -22 -33 -129 84 -34 33 22 -13 -228 -129 44
6900 44 14 -77 -114 9 -44 -9 -39 0 -108 -147 -98 -97 -11 18 -68 -72 -48 70 53 67 9 141 29 63 84 211 82 77
6928 77 -142 -124 169 148 173 58 156 250 -114 183 -211 -11 195 7 -156 -13 -30 191 -235 -138 -324 -68 48
6951D8M7J8j46Q8k2j95j46N05j03j41J65j26j2Mr6R3J08j20J97j37p1J00l0n2
6975b4K4P0Q1j54k2j08p9N41k01J9l07P0J32j67l4K18j33J02j45j9J74l7J0j13
6999a02Q8l2J38r0p1J24Rj41K46J74k36N4m52K21J68k19J46J02k54K08R7j65P8
7022I1M2j81O4J62j57J21j26K63j34oj80j79K39L9j21k24L27l63L10L6P3j3j3
7045G0o7Qj16J22j7K7P8j64NJ87k88n7L94j66k89K32J24k18J59J5J12j31j10M1
7069d9J00j67k1P8K73l19nJ15oJ29l19Q8j00L48k93J82k43K01j5QM36l54R5j08
7093E4K76j53k67o9J27n7N3k99K39l6J57L4Q1k89J87j91K74k37J28k24J73rm1
7116h9O5L95l94J29l56K63Q3%N3k1m3q7j73L1M42l36J46p5j92J1K35j71R4m1j11
$$ plain form
6951 48 95 113 -33 55 33 -162 -308 197 94 -47 118 -8 -20 -16 -112 -19 89 -31 166 29 -42 58 28 -24
6975 -24 0 70 151 -3 -25 -133 -212 329 128 147 -160 -90 42 -125 -159 59 -74 28 -117 -136 38 1 11 -102
6999 -102 -14 -46 92 2 -69 55 64 -77 169 343 107 161 -291 -70 98 -121 25 127 -127 81 178 13 91
7022 91 133 -48 16 178 21 142 16 279 145 139 -41 -220 19 58 -63 -287 40 -323 -13 23 96 83 70
7045 70 3 11 -105 17 0 27 105 -59 -54 133 -155 -212 182 16 -273 -41 83 -135 24 39 151 20 -90 -49
7069 -49 51 -116 -137 -59 214 -105 -110 5 -1 128 -191 -103 -203 145 -148 34 -209 -8 -23 -15 421 67 162 54
7093 54 330 177 -90 -159 -32 -89 -36 -335 -96 -132 25 59 140 -149 38 -153 121 -116 12 -212 -39 -48 -89
7116 -89 -24 371 -23 106 -250 13 96 96 149 128 85 -2 -175 -144 298 -38 108 33 -159 -148 87 -84 10 -31 -142
7141a42J16j17r9L01k35m1K04J11m8j8K00j36j06j40O8J41j3K27m50Q7Q9R3o5
7164B7J6n1n3J95m8n3m6j36K72j48q7J87N2j69P2K2q0j54K5N9j1K3O4K8n8M0N1
7191C9j47m3J31R8K4M8q5j20k59P7Q0J47mM3j55J22j74M12k14j5P4j41O4K14k5
7216A91k56Q5Q6j42j35J25l0j1M9K19j42j13j34K77j5k61R4K07k90L02l22K05
7238a1Q0j68J14k49J92j9J18j05k08K57qJ15j73M7J51j00l0j41j13Q0P9K25k18
7261h5p9J50J95k64J15Qj21J44k93J59l26M99k4m9k0mj44j26M9L95l28K0L7J34
7285D2n2J38r2k51J11n4J05N7Pmk83L42L2j77L33m46L23j29k27J05J13L21j2m00
7309i8K7N0K27j60O9k23J75j03QJ53k68n6L66j13m19K78R5r6K6j75J61M2K21l82
$$ plain form
7141 -142 -26 -143 -242 59 -176 -217 -13 98 50 32 232 96 -10 -150 -82 59 46 273 -177 -90 -1 92 27
7164 27 43 -8 -61 134 86 33 -13 -149 123 -25 -112 75 127 -42 30 52 -28 -182 -157 -98 -109 -86 -22 6 -52 -12 39
7191 39 -108 -151 -20 78 102 150 65 -55 -314 -237 -157 -10 -14 29 -126 -4 -178 234 20 5 79 -62 2 216 191
7216 191 -65 20 106 -36 -171 -46 -76 -87 -38 181 39 -74 -208 69 54 -207 -113 94 -196 106 -216 -11
7238 -11 69 -99 15 -234 -42 -61 57 -48 -256 1 -7 108 -65 -18 133 33 3 -138 -251 -171 -92 133 -85
7261 -85 -164 -14 181 -83 32 40 -81 63 -230 -71 -397 102 78 29 9 5 -139 -265 -216 179 -149 -129 -92 42
7285 42 -10 128 36 -215 -104 -158 -53 4 11 7 -276 66 98 -79 254 -192 131 2 -225 -120 -7 314 302 -98
7309 -98 -71 -21 206 46 115 -108 67 -36 -28 125 -143 -199 167 54 -365 -87 8 -88 -62 -237 -76 -34 187 -195
7333a95J05j0k19K02J88l00K55J55l36Q7L3J96k4j45NJ54j95q6L28j14o5j61n9
7356b01K72m8j43O0L9L9qj26J12O4m9j33K20r6j35J2Q8Jo2J50K02k48J00J65m17
7381a42L7L6M4o6K02l7q7N9m2K10k15K3J84l18J40k36R9O0j4pJ33K1k43R0L1m6
7407h4K90r6j78N3Rk1R9k23J30o2K76j07k27m0j20K60j2MK45k69J59k63K51l4
7431D0j63K05j18n5j52K04J34l24K56k6k61L56kL8m09K14O3j04K76j00j3J59j92
7454B6m9j08p0K12j01J45Q1n8p3j2Kk14K40J07j25J16l10Q8J37l4lk57J27J88
7478E5k18K32m9L1o0j87K36L01m78K44K4Q9l71J95O4j22J64l91K27n0P9J8l45
7501c12K44M3j00L58l11J81n0j23m8K22l9j02j65K67j39qN8j4J82J25l25O2k0
$$ plain form
7333 -195 -90 -100 -319 -117 71 -229 26 181 -155 -68 -35 161 137 -8 -3 151 -44 -130 198 84 19 -142 -201
7356 -201 71 23 -120 -60 -21 18 10 -116 -4 60 11 -122 98 2 -133 -121 -33 -32 -94 56 258 10 110 275 -142
7381 -142 -105 -69 -25 -91 111 74 -13 46 4 214 -1 22 206 -112 28 -208 -109 -49 -63 -70 63 84 -159 -69 -38 -84
7407 -84 206 110 -68 -15 -6 -27 72 -151 -21 -83 193 86 -141 -181 -301 -41 -53 -49 196 -73 86 -177 74 40
7431 40 -123 82 -36 -91 -243 -39 95 -229 27 1 -260 96 94 132 -277 -63 0 -104 172 72 59 218 26
7454 26 -23 -131 -201 11 -90 55 136 78 5 -7 -5 -219 21 128 3 119 -191 -103 34 0 -3 -260 -133 55
7478 55 -163 69 20 51 -9 -196 40 341 -137 107 131 220 -151 44 108 -14 150 -241 -14 -64 15 33 -312
7501 -312 -68 -25 -125 233 -78 103 53 -70 -118 104 65 -37 -202 65 -74 -82 -24 -38 144 269 -56 6 -14
7524a4J35O6j46k31Q6M0O8K73l10L1j04k2j5L88m22J41m8J49K03n57L63j34J76
7547A16k82J0J84Q9k32R8N7j56K05rj55L1K85n46M67k20j17L72j45l09L2j13K98
7570d0j41R8j72M50k33o9J76k39K40J01m6j57K75Pl02l6j11K14J06j86n2N7l6
7593i6MK93j92l6K53j93K26k43K16k63N2r8M6J96m94K50q4Q9J93k21J62k68O1
7616a47K64j18m5L19j87k61K24m3j25K79j73m1J8p5Q9J06Q2n0k10J01M0m00K30
7639a23lJ41n3J00j65M7J24r1j48l5J16j34J57jJ18O3Jl16Q1M1J96m5j55J81m2
7664E5O9j22oj50K4J75j67KJ50k6p6M13l78K03J0k82N8p1J21Q1Jj43j12L12k05
7689f4j02K25O4j26K19k38J28m5j03K72k91K2j78L8P5j3L68l14j25K11K56k85
$$ plain form
7524 -14 121 187 41 -190 -104 -64 4 277 -33 -2 -106 -128 -143 245 -177 -36 -84 65 268 -289 74 -60 116
7547 116 -166 -156 28 117 -115 -17 40 -116 89 80 -75 -44 241 -305 162 -58 -175 197 52 -257 -225 -338 -40
7570 -40 -181 -83 -255 195 -38 -107 69 -170 70 171 125 -32 243 250 -52 -88 -199 15 121 -65 -117 -60 -96
7593 -96 -92 201 9 -27 226 33 259 16 232 -31 21 -77 -31 165 -329 -79 -163 -74 119 -102 60 -208 -147
7616 -147 117 -1 -46 273 86 -175 49 6 -119 160 -13 -54 -36 -111 -22 84 166 116 -94 7 47 -353 -123
7639 -123 -126 15 -38 62 -103 -56 68 -23 -171 -206 -90 -224 -67 -68 50 113 114 -202 -121 -80 116 71 -84 97 55
7664 55 124 2 -4 -154 -130 45 -122 -120 30 4 -72 341 -37 166 176 -106 -48 -119 2 83 84 -59 -171 141 -64
7689 -64 -166 59 123 -3 216 -22 106 61 -42 230 -61 -39 -217 -179 -104 -117 251 -63 -188 23 279 -6
7711fo4K78l58L02m33P9L68k34M3l9N3P6r2K15j65j15K1k13L79l03K82P3q3P2
7735A36l03N28m66L01k89Q5N6rk08J13M4R1j87j7j07P0J66j02M2L4P2j71mJ82
7759E7J88k96J27m06J75J74k64M96k82R2M5M5l07K76j38L2j26jk7J80o7r2K56
7782A37J78k89l18K38J6J49r8j81R8k5j1jN7J36o3J03k59J08R2j8O8k15lJ33j52
7807a20rJ60q6J40Lj69K05j68j7j20L48j63P6k13J47k57J91J70l65J59Q9L4j6
7830A9k19K19j62J14j1q9K23k62R5J25r1q9j1Q8K29l50K94j81k7J36P6q2q4j09
7854a49K01P5j4jl5m2p2J01o7k2J17k07J40q9Qj33J33J59M1q7j78l2K90Q7j03
7879A21j22O7j44nJ23n5J6q2J61j45Q5k25J1K1K75j5J04k53L3j27K89o8k9O0J
$$ plain form
7711 -6 -70 208 -150 152 -281 -202 166 -68 -25 -64 -11 65 -27 188 23 -92 -71 -284 95 -208 74 147 64 136
7735 136 -167 361 -105 196 -93 -8 48 39 -169 -56 -12 79 -108 -125 -232 -162 4 -98 -56 -22 50 -121 -125 57
7759 57 245 -51 76 -330 -155 19 -245 251 -31 61 106 151 -156 120 -18 14 -112 -113 -140 40 -27 -119 137
7782 137 315 26 -292 -54 -38 111 13 -168 -70 -95 -106 -107 -50 86 23 126 -133 -25 67 49 117 -98 -101 32 -120
7807 -120 -129 31 -55 85 88 -81 124 -44 -61 -181 167 4 80 -133 14 -243 -52 118 -247 -88 1 35 19
7830 19 -200 19 -143 -29 -40 -129 94 -168 -73 52 -39 -128 -139 -51 178 -172 122 -59 -86 50 126 44 -40 -149
7854 -149 52 127 113 112 77 35 -37 64 -3 -25 92 -115 25 -64 -56 -189 -56 103 144 57 -121 -153 137 224 121
7879 121 -1 66 -78 -83 40 -15 1 -81 80 -65 20 -205 -194 -173 102 87 191 -62 -29 -156 133 65 36 96 97
7904I7j4k89K86j30j56O9J45J12j02L3J93j13n4m1j20m6R9J18L0m4K5k56k9j78
7928c65J84K37Q0m20L63r9k3J18r8j47K49n4l51M89m85Q6M43k34j3k6m3K83j18
7951E6J54k69r6M5P9J10j9k18L26j93L0n2J58j0l7k35J84k8M0L51l52k27L12P7
7975A86k83J75j22K8j7j42P1K72n0k34n2K39o2M0j98R2nK32j30k5R8k20L2J75
7999A00k45P6K16k42J26j89J03j5o4J66r5M3M6O9l71O9M38k74j08j04Q6K14j95
8022a50o6P9n0L55k33j66oL15j94j3L08l09O6o6J13J28O5k36k70M01j86M5J40
8045G0k32P3R7J31j19j85J09K00k37J67k05K41j84n0o6J76m3O5j72O6J32q5L25
8068B74m38K59K11l20J54k14K7j7R2K0K68l88N4J23l1O2k5M7k32Oj9J69j18p9
$$ plain form
7904 97 83 -206 80 -50 -206 -137 8 120 18 51 244 131 77 36 -84 -130 -31 87 117 73 98 -158 -187 -365
7928 -365 -181 56 136 -284 79 -20 -43 75 -23 -170 79 25 -326 163 -322 -236 207 -27 -40 -66 -109 174 56
7951 56 210 -59 -155 -110 -31 79 60 -158 168 -25 5 -47 111 101 64 -171 13 -15 25 376 24 -203 109 186
7975 186 -97 78 -44 -16 -33 -175 -104 168 118 -116 -168 71 9 49 -149 -57 -62 170 40 15 113 -107 -75 100
7999 100 -145 -69 147 -95 31 -158 -55 -70 -134 32 -63 -20 26 95 -276 -207 231 -43 -151 -255 -169 45 -150
8022 -150 -216 -137 -187 168 -65 -231 -237 78 -116 -129 179 -130 -64 -130 -17 111 176 -60 -330 71 -115 -70 70
8045 70 -162 -89 8 139 20 -165 -56 144 -93 74 -131 110 -74 -124 -190 -14 -57 8 -164 -98 34 -51 274
8068 274 -164 95 306 -14 140 -74 -47 -64 28 48 316 -72 -18 105 74 136 111 158 -74 -68 -87 82 -36 -115
8092a15J61j05J19j29j23K41j04K45k39J90l10L45j38k7K9p8N8j15M3M0Q0k4r5
8115e1M5O5M6k11L38P2n09J60J05Q8m7m3J2mk45J45n6k5k9K76Mm65M84k67K16
8140A04j79L33j09l63K97l02K91o5o9J2k5K44k5k88K21j16k65K99j89J92M0j01
8162f3L5j30P8m7J05J49R6n1l36J78J48j53K5r1Q5o1J62Oj97L7M9j39N7J28k57
8187a87JJ20P2n8
$$ plain form
8092 -115 46 -59 60 -69 -192 49 -55 190 -49 141 -169 176 38 11 40 -38 20 -95 -52 -12 68 44 -51
8115 -51 -6 59 105 -106 232 304 -205 -45 60 148 101 58 70 66 -179 -34 -90 -115 -144 132 136 -329 155 -112 104
8140 104 -75 258 149 -214 83 -219 72 7 -62 -50 -75 169 144 -144 77 -39 -304 -5 -194 -2 38 -63
8162 -63 -28 -158 -80 -127 -22 127 223 172 -164 14 162 9 34 -57 28 -33 129 135 -62 -25 24 -115 -58 70 -187
8187 -187 -186 -66 6 -52
8191e2
$$ Imaginary data points
##PAGE= N=2
##DATA TABLE= (X++(I..I)), XYDATA
0@%%%%%%%%%%%%%%Qj6J6j6J6k4L2l8M6n2O0p2Q4r2J04j21J41j62J82k05K33k64
36a40K96l28L66m09M54n05N58o16O82p53Q30r15J008j109J223j348J483j638J814
55I53k012K235k493K799l161L600m144M839n758P037q937J2028j7871L2430j28507
70a06962j76358M40480J8719l18387J61398J87468k96436j7069L21983j29441
80H5395k91974K01031J50318k26441p869J93045j18936j16712J87799L3483j89098
91i9959N6267J33313j20817m7298J52630m0694j25861J13703O9516j38416J7185
102c0431J25116r4193p9066J36799q60j49051O6542J08224j18193m6781J29993
113D8099j7685r9912Q1979N8108j14292k969J27650l8984j11057O0620O4461p2337
$$ plain form
0 0 0 0 0 0 0 0 0 0 0 0 0 0 0 0 8 -8 8 -8 8 -16 16 -22 24 -28 32 -40 44 -48 56 -65 76 -86 96 -109 124 -140
36 -140 156 -172 194 -215 239 -266 292 -324 358 -395 435 -480 528 -581 642 -706 777 -861 953
55 953 -1059 1176 -1317 1482 -1679 1921 -2223 2616 -3142 3895 -5042 6986 -10885 21545 -106962
70 -106962 -283320 157160 175879 -142508 18890 206358 -90078 -107147 214836 85395
80 85395 -206579 -5548 144770 -81671 -89540 103505 -15431 -132143 55656 89139 -99959
91 -99959 -43692 89621 -31196 -78494 74136 33442 -92419 21284 90800 -47616 -30431
102 -30431 94685 492 -78574 58225 57365 -91686 -25144 83080 -35113 -81894 48099
113 48099 30414 -69498 12481 70589 -43703 -46672 80978 41994 -69063 -8443 56018 -16319
125a6319j1478O8203m7609o1908R0928M6207j08543j6509R6208k1786n8279N9324
137A8439R221q2827L6594Q4902o6677n5115Q5326J3152p9540L6305O0349p1401
149a1272l2004P9038j0578p6657M3734N2913p7440k3932R4525n959q3060M2374
161h318N8007o6651j5428Q4219l1545q4710O7129N5992q9799j3252Q8461l6617
173G488o3858P7032K9103q9723J7776Q0371n8333m6051Q4292J017q9827L8318
185a2395O7346o8992l0542P7722j7654p1818O0495M7892q7862r345R2440l0408
197A6879p0178O5253L2678q1686J4944P6711n8445m9567Q6293P232q8885L5728
209a3043O6253o4606k2627P4398k4000o2513O3168L3569q4233N48P4268l7372
$$ plain form
125 -16319 -27797 40406 -7203 -69111 21817 68024 -40519 -57028 39180 17394 -40885 18439
137 18439 27660 -55167 -18573 66329 -348 -55463 29863 43015 -36525 -220 60129 -11272
149 -11272 -43276 35762 25184 -51473 -7739 45174 -32266 -56198 38327 32368 -50692 -8318
161 -8318 49689 -16962 -32390 51829 20284 -64426 2703 58695 -31104 -44356 44105 7488
173 7488 -56370 20662 49765 -39958 -22182 58189 -144 -46195 38097 39114 -50713 -12395
185 -12395 54951 -14041 -44583 33139 15485 -56333 4162 52054 -35808 -45153 47287 16879
197 16879 -53299 11954 44632 -37054 -22110 54601 -3844 -53411 32882 40114 -48771 -13043
209 -13043 53210 -11396 -34023 40375 16375 -46138 17030 50599 -33634 -33086 41182 3810
221C810m7451N8244N813o6176L2845N7792n7436l0926P0363j192n9668L8176L7970
234D2164o1161p266O6168k4547n3678M7201K3768o0668R986N6256m0679l6525
246c8981N6604P024n4571K2964L9157m4643j4743N3471j1218m7275L3131K7795
258B8715m4601m076M2327j8524l0550L2984J3260l9358P297L7674k3463k4288
270b2603L3824O729l2825J2718K4320k8650j0565L5354n508l3022J9817J9537
282A9126k9029j473K9240j6309k2765K6127R193k9522M193K4601j7570j4987K6159
295F984K923k5034J0390J9961j7008p672K2657j945k1254J2578J5327j9644n640
308g377J9353p943j7917J4687Q586k0371m23J8932r408j2030J8480M249j9475
$$ plain form
221 3810 -43641 14603 20416 -45760 -12915 44877 -12559 -43485 26878 25686 -33982 4194 42164
234 42164 -18997 -26263 39905 15358 -38320 8881 32649 -28019 -18033 38223 -2456 -38981
246 -38981 17623 24647 -29924 -6960 32197 -12446 -27189 26282 15064 -32211 920 28715
258 28715 -15886 -19962 22365 3841 -26709 6275 19535 -19823 -12526 25148 1685 -22603
270 -22603 11221 17950 -14875 -2157 22163 -6487 -17052 18302 12794 -20228 -411 19126
282 19126 -9903 -11376 17864 1555 -21210 4917 14110 -15412 -11219 13382 -4188 -19175 6984
295 6984 9907 -15127 -4737 15224 -1784 -9456 13201 11256 -9998 2580 17907 -1737 -7377
308 -7377 11976 4033 -13884 803 9389 -10982 -11405 7527 -1881 -13911 4569 8818 -10657
321a0657P877J7247j4321q330J6645k650j6962J0520J0193j8436j994J9415p045
334A502j3969J6700Q048j7601L086J6863j1507j1503J8131k95k2425Q271J7186
347A2487j7567q487J9395k975j5728J5007J0707k1618p52K2247r683j6275J6583
360C341L654k0234Q697J7472j6877p804K2988k527j9134J5885J1838k3642r80
373g323K2846j2653j7443J9737M692k5397Q457K2397k0038j2486K6647j078k4663
386a6305J4768J6539k3772l496K6122r712k1361K3426J0824k8796L384K6140j6432
399A329j6338K4220n68k6457J5322K2058k6441j0016L1194m065k3657J9097J1753
412A7431k8197K508K8008j8473k3021K5999O578k9931Q904K4698k1907j1266L0666
$$ plain form
321 -10657 -2780 14467 146 -8184 8461 5811 -11151 -631 9562 -8874 -10868 8547 1502
334 1502 -12467 4233 12281 -5320 -2234 14629 3122 -8381 9750 9455 -12970 -4699 12487
347 12487 -5080 -13567 5828 2853 -12875 2132 12839 -8779 -9531 12716 3033 -13242 3341
360 3341 6995 -13239 -4542 12930 -3947 -11751 11237 8710 -10424 5461 17299 -6343 -7323
373 -7323 15523 2870 -14573 5164 9856 -15541 -7084 15313 -4725 -17211 9436 8358 -16305
386 -16305 -1537 15002 -8770 -12266 13856 4144 -17217 6209 17033 -11763 -8379 17761 1329
399 1329 -15009 9211 8643 -17814 -2492 19566 -6875 -16891 14303 10238 -13419 5678 17431
412 17431 -10766 -8258 19750 1277 -21744 4255 10833 -19098 -10194 14504 -7403 -18669 11997
425A1997j411k7412J8444K0917k8454p433L1990q399k7952K1220J4099l0366J994
438a0766L0714j7027k3948K8277J0664l2563O572K7552k3635j6095L1727j201
450A0271l1947J6363K2979k8603p180L4515r632k8507K5421J6882l2036K543L1337
463B2406j9167k1695L0630P306l5759Q471K9264k4392j7855L1615m39l1489J6919
476d185K3648k9010q679L5588o851l1622K0682J9534k9789j849K9673j7117k2953
489b2930L0388J2221l4114K887L0879j6000j7880K6978J390l2424J2076K8414
501B1885k4251j8820K8748L285k8251J5106K3897k8254j1709L6000k916l3319
513a8599J8344K0649l2283n221L7254j5152l3402L0644J8073l7491L814L6032
$$ plain form
425 11997 10586 -16826 1618 22535 -5919 -13352 18638 10239 -17713 3507 17606 -12760 -10766
438 -10766 19948 2921 -21027 7250 17914 -14649 -8077 19475 -4160 -20255 11472 10271
450 10271 -21676 -5313 17666 -10937 -18117 16398 6766 -21741 3680 20562 -11474 -8931 22406
463 22406 3239 -18456 12174 19480 -16279 -7808 21456 -2936 -20791 10824 10385 -21104 -4185
476 -4185 19463 -9547 -18226 17362 10511 -21111 -429 19105 -10684 -12533 17140 23 -22930
489 -22930 7458 19679 -14435 -11548 19331 3331 -14549 12429 13819 -18605 -6529 21885
501 21885 -2366 -21186 7562 10847 -17404 -2298 21599 -6655 -18364 17636 14720 -18599
513 -18599 -255 20394 -11889 -17110 20144 4992 -28410 2234 20307 -17184 -13370 22662
525B2662k3771k3739L8792O168m1562J4224L4616l0277j6111L8915m412l6609
537b1104K3685K4021l7723q184L8707j3133l4519K7857J6974l7097N094L7176
549B1754k3029k4280L8648R280l9813J1995L1021l0227j4887L8561p451l8421
561b6849K3886K6115l2919o492L5758j2133k7837K9738J5957l8309j412L4090
573A9593j6390k5587K7815P937l5920R459L6127k3166k3871L4189O776l5427J5621
586b844K8693l3634j5725M1730l281l8490K1719K4839l4824l344M0473j7233l3262
599b5183L1788J7092l8364K312L3183k2900k2438L5230N492l8480J2199L1690
611B1621k5414j5661L3741k478l2979K0110K4472l2749r116L6363r602k9720K5765
$$ plain form
525 22662 -1109 -24848 13944 20112 -21450 -7226 27390 -2887 -18998 19917 15505 -21104
537 -21104 2581 26602 -11121 -19305 19402 6269 -28250 -393 16581 -20516 -15422 21754
549 21754 -1275 -25555 13093 22373 -17440 -5445 25576 -4651 -19538 19023 11572 -26849
561 -26849 -2963 23152 -9767 -16259 19499 7366 -20471 9267 25224 -13085 -14497 19593
573 19593 3203 -22384 5431 13368 -22552 -13093 23034 -132 -24003 10186 16962 -18465 -2844
586 -2844 25849 -7785 -23510 18220 14939 -23551 -1832 23007 -11817 -15161 25312 8079 -25183
599 -25183 6605 23697 -14667 -12355 20828 -2072 -24510 10720 16212 -22268 -10069 21621
611 21621 -3793 -19454 14287 11809 -21170 -1060 23412 -9337 -18453 17910 8308 -21412 4353
624D353J6045l4129J829L3263j8932k4341L0140Q019l3313Q939K7689k2008j4325
637a6771K9344K15k8820J3514K2344k3814j2248K6580l021k6620J6283J7934k6169
650a1249o174L0892n288k5633K0280J5666k7878Q94L0928j6247k5573K6117J1102
663A7837l0673M707K5320k1218j5773L1184K077l1441J1873K3447k2156r224K6953
676A2913o226k5920J8575J8144k7121m729K8620j0689k1953K3992J1420k9537
688a2511L807K8077j7328j8265K7928L100l1172J1974K4555k4122j2223K7546
700A1366m169k5195J7696J6757k6471m250K7705q313k0569J8789R823k3670J879
713h622K3281j2478j7735J9612P244k2807N214K1082j5552j3782K3052L515k2792
$$ plain form
624 4353 20398 -13731 -11902 21361 2429 -21912 8228 16247 -17066 -8127 19562 -2446 -16771
637 -16771 12573 12788 -16032 -2518 19826 -3988 -16236 10344 7323 -19297 -3014 14920 -11249
650 -11249 -17423 13469 8181 -17452 2828 18494 -9384 -8490 22438 6191 -19382 6735 17837
663 17837 -12836 -8129 17191 -4027 -19800 11384 13461 -17980 -6107 17340 -4816 -14040 12913
676 12913 6687 -19233 -658 17486 -9635 -14364 14256 3567 -18386 5606 17026 -12511
688 -12511 -8704 19373 2045 -16220 11708 14808 -16364 -4390 20165 -3957 -16180 11366
700 11366 7197 -17998 -302 16455 -10016 -14266 13439 5126 -15443 3346 13169 -10501 -8622
713 -8622 14659 2181 -15554 4058 11302 -11505 -6291 14791 -761 -14543 8509 12024 -10768
726a0768Q963J7554j9179p487K3398m801k2147J4347J2427k0737j667K0665j0015
739E53j5504J8288O925k1202M884J9118j3697j1553J9193K063j9250P193J4782
752A1793j5223p150K0404k065k0069J1120J4905j6786m022J7892o873j4913J4572
765C585P901j9856K98J6884r425j0619J4700K054j5373O111J2947j0969o382J4284
779F140n33j3690P530R632j1642m145J2725k337j1122Q011P926j2135k515J3826
793G671m191j1252J0384N140j2813J173J1745o770q815J0838J275j1956M650R390
807F469r936n108J1223m2r198O322N975q701p08J1022k685r320O854M835r030
822b028m84P692n088o451P978K672r449K325Q656o180m336Q608l00q261M341M705
$$ plain form
726 -10768 -1805 15749 -3430 -10917 12481 7680 -14467 -120 12307 -8430 -10097 10568 553
739 553 -14951 3337 10262 -10940 -6056 13062 -635 -12188 7005 9068 -10182 -2989 11793
752 11793 -3430 -10580 9824 7759 -12310 -1190 13715 -3071 -7093 10799 3926 -10987 3585
765 3585 11486 -8370 -8072 8812 -613 -11232 3468 5522 -9851 -3740 9207 -1762 -8144 6140
779 6140 5607 -8083 -553 9079 -2563 -6708 6017 3680 -7442 569 8495 -3640 -6155 7671
793 7671 3480 -7772 2612 7752 -5061 -3888 7857 1087 -7728 3110 4385 -7571 -2921 6469
807 6469 -3467 -8575 2648 2606 -6592 -270 5705 -2996 -3704 7318 4633 -4687 2167 7002 -2028
822 -2028 -2512 5180 92 -6359 1619 4291 -5158 -2833 5823 -357 -4693 3915 3615 -4646 -305 4400
838D400q207j652Q588l034p497O509M112o210J645O684m109l657O313J661p002
853a456P96M777m677k166N039r74n397L176L737m101m56M270k284l480M255J666
869B725n721Q31L433l123q41M097j029m120L622K885l917J63M050k524k424L952
885B059L25l150J502K194l072n93L142r34l478J818R73k843Q11K149k894j468
901c459L740R67l017J545K398l281K24L935k601l653L361J018l650J817L215l673
917a114j475N983l42m663L630K522n474J15M828l717m335M344J038n772J969N015
933B552m772k198O576l58n630M231L391n859n90O339k559n195M996K364o287J911
949a088N757m577l040N994R97o651K550N039o026k385O487j242o825M155L937
$$ plain form
838 4400 -3807 -5459 3129 95 -7402 -893 3219 -2991 -1346 5338 1229 -2428 3885 5546 -1456
853 -1456 -660 4117 -560 -2726 2313 1339 -4058 -882 2855 -1246 -1702 2568 284 -3196 1059 2725
869 2725 -2996 -2165 1268 -1855 -2696 1401 372 -3748 -126 2759 -1158 -995 3055 531 -1893 2059
885 2059 2384 -766 736 2930 -142 -735 2407 1473 -2005 -187 786 -2057 -1246 903 -1991 -3459
901 -3459 281 1248 -1769 -224 2174 -1107 -883 3052 451 -3202 159 1177 -2473 -656 2559 -1114
917 -1114 -2589 3394 3052 -1611 2019 4541 -933 -818 4010 293 -4042 302 1340 -4432 -2463 2552
933 2552 -2220 -4418 2158 1800 -3830 401 3792 -2067 -2657 3682 1123 -4072 924 3288 -2999 -1088
949 -1088 4669 92 -2948 3046 4043 -2608 -58 4981 -1045 -3430 3057 1815 -5010 -855 3082
964C082o318q44O687k124o271N837M199p184Q6P969m001n132O926J988q440J555
980a985P447n895m953Q141J086r047M056P366p563k999J0081j708r771O014O446
995F716j0077j671J0221n147q896R590M208j1164J452J0548o448o082J1883N82
1009E715j1947N573Q931r446l298J0794l321j0503Q496O830j1201k141J1254m249
1023A487q005R419L189j2038J698J1281o345p931R056K175j0740L933R423q888
1037b286n637J1073O97j0129N771Q071r454l338J2145j760j0693P064O424j1613
1051c665j384J2330m940j1256R380N831j2327J194J2701q110r054J2686L814j3844
1065f644L545J1183j0797o299J5061p61j5350Q331J0369j2052k123J4660o107
$$ plain form
964 3082 -3236 -4080 2607 483 -5788 49 4248 -2936 -2850 5119 1118 -4014 2912 4900 -3540 -1985
980 -1985 5462 -433 -5386 2755 3841 -5206 -1150 6216 -1347 -4346 5735 4027 -5744 270 6716
995 6716 -3361 -5032 5189 42 -8854 736 4944 -6220 -4768 5780 -668 -6750 5133 5715
1009 5715 -6232 -659 8272 -1174 -4472 6322 3001 -7502 994 7824 -3377 -5518 5736 1487
1023 1487 -6518 2901 6090 -5948 -4250 7031 686 -7245 1811 3986 -6754 -2821 6602 -2286
1037 -2286 -7923 3150 3847 -6282 -511 7560 -1894 -5232 6913 5153 -5540 1524 7948 -3665
1051 -3665 -5049 7281 2341 -8915 465 6296 -6031 -4837 7864 -246 -9300 3386 7200 -6644
1065 -6644 -3099 8084 -2713 -9012 6049 5288 -10062 -1731 8638 -3414 -5537 9123 3016
1078C016j2667J2943P759j5514j68J3144q668q364J4203L57j5667N331J3009j0137
1092a423o338J2812j554j2016Q772Q646j2637l564J3272l047j0275Q296O203j2390
1106e243q17J3302m889j0073J0074M770j2067K013J1999p336r403J1519L170j3054
1120f035L157J0685r904o813J2966N06j2968N631J0176j0299n007J4014j860j2872
1134h623Q869Q435j3092j598J4426o111j1935J1951O511j5178J778J4215r815
1147a67q430J4909J161j5624O765J1660j2552n394J4264l148j3171R392Q404j3938
1161e869j513J3992n213r790J0445N316j2908J498J2703p445q507J1220K649j2624
1175f046L433J0633q771o753J2375N24j2188N638R315j0493m073J2818k645j1426
$$ plain form
1078 3016 -9651 3292 11051 -4463 -4631 8513 -155 -8519 5684 6041 -9626 -4295 8714 -1423
1092 -1423 -7761 5051 3497 -8519 253 8899 -3738 -7302 5970 2923 -7352 944 7147 -5243
1106 -5243 -6060 7242 2353 -7720 2354 7124 -4943 -2930 9069 1733 -7670 3849 7019 -6035
1120 -6035 -2878 7807 -2097 -8910 4056 4562 -8406 -2775 7401 -2898 -7905 6109 4249 -8623
1134 -8623 246 8681 -4411 -6009 8417 2306 -9629 2322 8833 -6345 -4567 9648 -167
1147 -167 -8597 6312 7473 -8151 -1386 10274 -2278 -7672 6592 3444 -9727 -335 8069 -5869
1161 -5869 -7382 6610 1397 -8393 2052 7368 -5540 -4042 8661 1216 -7291 3929 6578 -6046
1175 -6046 -2613 8020 -751 -7504 4871 5395 -6793 -1155 8160 -2333 -6406 6412 3767 -7659
1189g659P378P189j1054k265J1701m400r958R932N424j1772O49J1904n841q088
1203f860J0609L348j2884L433J1471q969p021J1675K21j2555O510R351j1420m212
1217g303J3414k353j1814R159O152j2637L49J2503o878q851J0256L024j1761L292
1231c448J0150q004n843J1280R27j0099M329Q058q400l682J0583j362j0273N527
1245b57O899r467k072J0308l606r269P997N082r745J62R608n391o564R181K115
1260D981j0332K674P724o129m626Q668L87r109M322P493o791l419Q713r99q076
1275d519N531N809q643k419Q838k672p966P041L821r737O98R011m892n818P832
1290A915J963q911L504P380o712l967P877j54p430M082N086o923k014P772o80
$$ plain form
1189 -7659 -281 6908 -4146 -6411 5290 890 -9068 864 6288 -5484 -4835 7069 1228 -6860
1203 -6860 3749 7097 -5787 -2354 9117 148 -6873 4802 5023 -7532 -1022 8329 -3091 -7303
1217 -7303 6111 3758 -8056 1103 7255 -5382 -5033 7470 592 -8259 1997 5021 -6740 -3448
1231 -3448 6702 -1302 -7145 4135 5062 -5037 -708 7350 -1050 -4732 5851 4489 -5784 -257
1245 -257 6642 -2825 -4897 5411 1805 -7464 533 5615 -4130 -3968 5640 249 -6315 2866 4981
1260 4981 -5351 -2677 5047 -1082 -5708 2960 3347 -5762 -1440 6053 -738 -4157 4556 3557 -4519
1275 -4519 1012 6821 -1822 -4241 4597 1925 -6041 1000 4821 -4916 -4218 4793 -99 -5917 1915
1290 1915 3878 -5033 -1529 5851 -861 -4828 3049 2895 -4535 -453 4633 -2290 -4304 3468 2788
1305B788o759M498M613o762p17P221k901o033N257K898p091M21O383m545m958
1320e687O756J889p164K309N502m818k397O702n46o245L507M166n353j262N679
1335C038j821m937M155L327m892q97N233k154l819M439J980n472J23M823k947
1350A79l601M206Q00n477J818M568l675k242M945o7l953K668K960l824j094M598
1366B809j485l393L041J758m147JL618j401k629K085J438l306J009L444k270k797
1382b225K522Q94k778N69J995k116j854L305K61k773J482J480j567J40K646q80
1398A101j549J288Q67j545l73J834j409j090J305M01j420m70J616l92r62Q16J176
1415A194j760l74J424m15j296Q98O02j113l02J125k47p81J019L36p52O92J283
$$ plain form
1305 2788 -3971 527 5140 -1622 -2339 4882 1981 -4052 1205 4103 -2988 -2567 3816 -729 -5687
1320 -5687 1069 2958 -4206 -1897 3605 -1213 -3610 3092 2546 -3699 -192 3974 -1379 -2641 3038
1335 3038 1217 -3720 435 3762 -1130 -2027 3206 1052 -2767 1672 3652 -1820 -1697 3126 179
1350 179 -3422 784 1584 -3893 -2075 2493 -1182 -3424 1521 1454 -2499 169 3129 -695 -1789 2809
1366 2809 1324 -2069 972 2730 -1417 -1416 2202 801 -1828 257 1695 -1611 -602 2842 572 -2225
1382 -2225 297 1191 -1587 -1018 977 -1139 -2993 312 573 -2200 -718 762 -805 -665 1981 1101
1398 1101 -448 840 1707 162 -211 1623 214 -876 429 830 -590 -1060 556 164 -798 18 1194
1415 1194 -566 -940 484 69 -1227 -329 273 -840 -1142 -17 -264 -1045 -26 310 -442 250 1533
1432A533p73p71N43P31m20o16L01n53m38O95pn75o94R00L98o68J1O34o83m42R67
1453G3J75p05l34J140o39q62J099O73j319j88J932m03q51J616L0j511L41J890
1471B157j468j766K064l97k162J394J123k243q02K821n64k043J910J357k748N18
1487h49K769j642k142K250Q55k719Q51K219k038j499L002Q14l208J242K348j881
1503C72j009K649m11k674J114J934k723j508K838j59k522J213J940k718m37L853
1519A752o12l442K345K465l272m53L591j600l701L443K249m526J6M491k316k698
1535b268M028J093n435J794M481l821k328M617p15n330L426L456n601q74N583
1550B106j688m344M562K249n811J139N463l156l152M975L95n766K689M229m282
$$ plain form
1432 1533 760 -11 532 1263 843 227 528 -25 -463 232 225 -350 -1044 -144 254 -414 -403 231 -452 -894 73
1453 73 248 -457 -791 349 -290 -1152 -53 620 -699 -887 1045 642 -209 1407 1437 -74 267 2157
1471 2157 689 -1077 987 590 -1572 -178 945 -1298 -2100 721 157 -1886 24 1381 -1367 -849
1487 -849 1920 278 -1864 386 1241 -1478 -627 1592 -446 -1945 1057 1871 -1337 -95 2253 372
1503 372 -637 2012 1601 -1073 41 1975 -748 -2256 582 423 -2099 -886 1054 -1664 -2101 1752
1519 1752 1140 -2302 43 2508 -764 -1217 2374 774 -2927 516 2765 -1761 -1745 2746 430 -2268
1535 -2268 1760 2853 -2582 -788 3693 -128 -2456 2161 1446 -3884 -458 2998 -2603 -3477 2106
1550 2106 418 -3926 636 2885 -2926 -1787 3676 520 -2632 2343 2738 -3028 -339 3890 -392
1565c92k532N075n73m459L152L257m774j528N141r31l910K640J957m466k53M839
1581B243j586m356L197K339l913L39M620k610l862M525L163n405p8N077l299l566
1597c172O059Q36p232J482N912m440k671O003j108o388M474N155o621j721O474
1612C042k239n240N626K749p922L30P565l770m426O121Q80p024L921N947n715
1627a55l308O802l61o136M012L813o661j440O893k311n173M577K436o255M01O542
1643C676l163m483M791K060n504J169M926l934l862N357J652n573J256N135m077
1658e74k789O683Ko009K465M852m916k359O028j335o766M350M208o543j115O650
1674B832k740m773N740L013p277L48P000l872m417O251R44p194K765O369n893
$$ plain form
1565 -392 -2924 2151 1578 -2881 271 3528 -1246 -2774 2367 1436 -2474 166 2123 -2343 -2596 2243
1581 2243 657 -3699 -502 1837 -2076 -1737 2883 273 -3589 936 4099 -1306 -1384 3693 394 -3172
1597 -3172 2887 3723 -3509 -2027 3885 -555 -3226 2777 1669 -4719 -245 4910 -1711 -3432 3042
1612 3042 803 -4437 1189 3938 -3984 -3654 3911 141 -4285 1836 2716 -4308 -387 5560 -155
1627 -155 -3463 3339 2978 -3158 854 4667 -1994 -3434 3459 1148 -4025 552 2988 -3267 -2866 3676
1643 3676 513 -3970 821 2881 -2623 -1454 3472 -462 -4324 1033 2685 -2888 -1632 3503 -574
1658 -574 -3363 3320 3322 -2687 -222 4630 -286 -2645 3383 2048 -4718 -368 3840 -2703 -3818 2832
1674 2832 92 -4681 1059 4072 -3205 -2857 4143 271 -4146 2105 3049 -4145 -1380 4989 -904
1689i04l400P266l91o683M278M732o534j570P466k298n927N050K913o605M2O457
1705C892l749m677N813J133o422K074N414m406l135O387P1n768K831M551n053
1720a044j724N654r27n634L577L721n173j322O070j328n491M519L266o201k09
1735b246N933k776n022N134J928o341P99N977m083m049O324J021o061K397M811
1750C746m750k251O306l07o027L049M308n475j076O056k284n330M817K905n890
1765b203R8N871l259m051N362J463o550J297N064l877l098N471m0n490K838M292
1781C188m493j510N526r48m343L501L152n067r20M948j481m592L743J997n001
1796b300J99M931k596l620M191J643m938J213M657l671k859M775j8m884K380L655
$$ plain form
1689 -904 -4304 2962 2571 -4112 166 4898 -1636 -3206 4260 1962 -3965 1085 3998 -2607 -2565 3892
1705 3892 143 -4534 1279 2412 -4010 -1936 3478 -928 -4063 2324 2395 -3373 -542 4009 -1044
1720 -1044 -2768 2886 1959 -3675 -98 3623 -1550 -2872 3198 1870 -3621 898 4164 -2037 -2246
1735 -2246 3687 911 -4111 1023 2951 -3390 -2591 3386 -697 -4746 1578 2599 -3462 -1065 3746
1750 3746 -1004 -3255 3051 2744 -3283 -234 4074 -1401 -2477 3579 1295 -4035 782 3687 -2203
1765 -2203 -2105 3766 507 -3544 1818 3281 -3269 -1972 3092 -785 -3883 1588 1548 -3942 -1104 3188
1781 3188 -1305 -2815 2711 1763 -2580 921 4073 -994 -1914 3034 1553 -3039 704 2701 -2300
1796 -2300 -2101 2830 234 -3386 805 2448 -2490 -1277 3380 -291 -3150 1625 1607 -3277 -897 2758
1812B758m083j797N053o20m174K948L008m218n57M790j693m191L563K012l997
1827a198j69L962k338l480M040J537m777P30L915k787k263M506N8m597J911L646
1843B696l394j449L681q13l627L027K462l756o69L947j054l116L194J588l731
1858a014J51L642k228k337K778O66l406L64L015k072k307L220M18l362J819K809
1874B156k412j761L496r3l305J735K291l242q15L507r60k491K366J277k530K70
1890e11K922j480k425K479R39k609r1J969j686j562K212N42k864R96K145j666
1906f90j241L181l0k727J213J976k117o80K453o31k247J636J447k001l36K131
1922A337r45j163J512N98k082j53K069q45j398J269O36j877J41J472j054j477
$$ plain form
1812 2758 -1325 -3122 1931 1311 -2863 85 3093 -1125 -1682 3108 1415 -2776 787 2799 -1198
1827 -1198 -1367 2595 257 -3223 817 2354 -2423 -1693 2222 -565 -2828 1678 1736 -2861 -950 2696
1843 2696 -698 -2147 1534 721 -2906 121 2583 -1173 -1842 2105 1051 -2065 1129 2717 -1014
1858 -1014 -863 2779 551 -1786 992 1658 -1748 -1384 1631 -441 -2748 472 890 -2472 -653 2156
1874 2156 -256 -2017 1479 1386 -1919 -184 2107 -1135 -1950 1557 597 -1894 472 1749 -781 -511
1890 -511 2411 931 -1494 985 1924 -685 -776 1193 -493 -2055 157 699 -2165 -1169 976 -690
1906 -690 -1931 1250 1220 -1507 -294 1682 -435 -1115 1338 707 -1540 96 1543 -458 -794 1337
1922 1337 392 -771 741 1339 -743 -896 1173 328 -1070 199 835 -1042 -901 571 -483 -1960
1938a960J543R60j693M93J843j171j013J823L77j340L79J107j064r62J647mj812
1955h47K18J584j117l43J138J74j812Q77J378j322p70J457p87j389J624N12j552
1972i77k28J457k66n24J029K42j226J26J690n85o38O85J26j118O0R57n28j010
1990g28M80N56j009L68Q75o05q77Q86R65j277n64J280l16j166J185N18j601j91
2008a221J805k80j212J195N60j374L45K212j356j262J456K53k015P57J341j568
2024c64j273K079K41k242J289R60j329j41J723o38j821J816P22j850J9J773j212
2041b48j049J579N25j618N62J701j091j050J566M81j796N64J263r59j550J556
2057D36K95j740M57J319j153j335J858K55j759P63J787j538r33K433l5k739J197
$$ plain form
1938 -1960 -417 543 -1150 -657 1186 15 -998 825 1202 -138 241 1348 284 -678 969 965 -847
1955 -847 -629 955 -162 -505 633 807 -1005 -128 1250 -72 -842 615 -172 -1561 63 575 -977
1972 -977 -1205 252 -14 -538 491 733 -493 -367 1323 738 100 785 911 -207 -147 810 282 -728
1990 -728 -248 308 -701 -333 542 -63 -940 -54 911 -366 -930 350 34 -1132 53 571 -1030 -1221
2008 -1221 584 304 -908 287 847 -527 -182 2030 674 -588 868 1121 -894 -137 1204 -364
2024 -364 -1637 442 683 -1559 -270 690 -639 -780 943 305 -1516 300 1022 -828 -809 964 -248
2041 -248 -1297 282 807 -811 -249 1452 361 -689 877 1358 -438 126 1389 430 -1120 436
2057 436 731 -1009 -552 767 -386 -1721 137 392 -1367 -604 1183 -355 -1288 1145 1110 -1629 -432
2074d32K019k278p45K665l46k466J676K045k893k62L049j544k066K450Q53l435
2090a710R57K748k658j343K866k8l065J637K363k966n62K872p08j943J979Q92
2106A331k529L0K865j090k329J854J456k362L52K203j549j642K484R86k748J91
2122d97K202j797j460K389J72k618K45K236j694j168K502j40k663J251K977k197
2138b60j220K844Ok610K015K286l583j086L452r76l141K692J406m015P66L997
2154B573k375k509L281N96l743J724K934l466j540L393m1l258K290J980l544k04
2170a909M251j170l040K465J211k738N76K678j904k610K864J260l349M27K658
2185A670k357j646L126O14l452R74K480j920j451L244m12l081J924K333k492j174
$$ plain form
2074 -432 1587 -691 -1436 1229 883 -1583 93 2138 -755 -1017 2032 488 -1578 872 1725 -1710
2090 -1710 -753 1995 -663 -2006 860 832 -2233 -596 1767 -1199 -1761 1111 403 -1540 439 1331
2106 1331 -1198 -1168 1697 607 -1722 132 1588 -774 -422 1781 232 -1410 1074 2060 -688 -497
2122 -497 1705 -92 -1552 837 1009 -1609 -1364 872 -822 -1990 512 372 -2291 -1040 1937 -260
2138 -260 -1480 1364 1370 -1240 775 3061 -522 -1608 1844 868 -2273 419 1825 -2190 -1424 2573
2154 2573 198 -2311 970 1566 -2177 -453 2481 -985 -2525 868 827 -2431 -141 1839 -1705 -1909
2170 -1909 2342 1172 -1868 597 1808 -930 -354 2324 420 -2190 674 1934 -1415 -988 1670
2185 1670 -687 -2333 793 1407 -2045 -1071 1409 -511 -1962 1282 870 -2211 -287 2046 -446 -1620
$$ [...]
8191c9
##END NTUPLES=NMR FID
##END=
