##TITLE=1H_Ser 7-6-i
 CDCl3
 8 sc, 
 13.05.2022
##JCAMPDX= 6.0         $$ Bruker NMR JCAMP-DX V2.0
##DATA TYPE= NMR FID
##DATA CLASS= NTUPLES
##ORIGIN= UXNMR, Bruker Analytische Messtechnik GmbH
##OWNER= root
$$ XWIN-NMR		Version 3.5
$$ Fri May 13 10:58:02 2022 Russian Standard Time (UT+4h)  she@DPX200
##.OBSERVE FREQUENCY= 200.1313499996
##.OBSERVE NUCLEUS= ^1H
##.DELAY= (6, 6)
##.ACQUISITION MODE= SIMULTANEOUS
##.ACQUISITION SCHEME= undefined
##.AVERAGES= 8
##.DIGITISER RES= 18
##SPECTROMETER/DATA SYSTEM= spect
##.PULSE SEQUENCE= zg30
##.SOLVENT NAME= CDCl3
##.SHIFT REFERENCE= (INTERNAL, CDCl3, 0, 15.7039)
##AUDIT TRAIL= $$ (NUMBER, WHEN, WHO, WHERE, WHAT)
$$ ##TITLE= Audit trail, XWIN-NMR		Version 3.5
$$ ##JCAMPDX= 5.01
$$ ##ORIGIN= Bruker BioSpin GmbH
$$ ##OWNER= she
$$ F:/spectra/data/she/nmr/H-F/1/audita.txt
$$ ##AUDIT TRAIL=  $$ (NUMBER, WHEN, WHO, WHERE, WHAT)
(   1,<2022-05-13 10:56:37.00 +0400>,<she>,<DPX200>,
      <created by zg, POWCHK disabled, PULCHK disabled
       configuration hash MD5:
       00 E9 B6 7A A2 85 ED C7 34 08 36 98 17 FE 4E 26
       data hash MD5: 16K
       50 2A 07 28 91 59 23 80 3F CA 59 1F F5 81 F5 38>)
$$ ##END=
$$ 
$$ hash MD5
$$ DB CA E7 E6 7B 5B 0E FC 02 C4 9B 6D 6C A7 47 C9
##$RELAX= 
##$RELAX= 
##$RELAX= 
##$RELAX= 
##$RELAX= 
##$RELAX= 
$$ Bruker specific parameters
$$ --------------------------
##$DU= <F:/spectra>
##$EXPNO= 1
##$NAME= <H-F>
##$PROCNO= 1
##$TYPE= <nmr>
##$USER= <she>
##$AMP= (0..31)
100 100 100 100 100 100 100 100 100 100 100 100 100 100 100 100 100 100 
100 100 100 100 100 100 100 100 100 100 100 100 100 100 
##$AQSEQ= 0
##$AQ_mod= 1
##$AUNM= <au_zg>
##$AUTOPOS= <>
##$BF1= 200.13
##$BF2= 200.13
##$BF3= 200.13
##$BF4= 200.13
##$BF5= 200.13
##$BF6= 200.13
##$BF7= 200.13
##$BF8= 200.13
##$BYTORDA= 1
##$CFDGTYP= 0
##$CFRGTYP= 5
##$CHEMSTR= <none>
##$CNST= (0..31)
1 1 145 1 1 1 1 1 1 1 1 1 1 1 1 1 1 1 1 1 1 1 1 1 1 1 1 1 1 1 1 1 
##$CPDPRG= <>
##$CPDPRG1= <>
##$CPDPRG2= <>
##$CPDPRG3= <>
##$CPDPRG4= <mlev>
##$CPDPRG5= <mlev>
##$CPDPRG6= <mlev>
##$CPDPRG7= <mlev>
##$CPDPRG8= <mlev>
##$CPDPRGB= <>
##$CPDPRGT= <>
##$D= (0..31)
0 1.2 0 0 0 0 0 0 0 0.06 0 0.03 0 0 0 0 0.0002 0 0 0 0 0 0 0 0 0 0 0 0 
0 0 0 
##$DATE= 1652424996
##$DBL= (0..7)
120 120 120 120 120 120 120 120 
##$DBP= (0..7)
150 150 150 150 150 150 150 150 
##$DBP07= 0
##$DBPNAM0= <>
##$DBPNAM1= <>
##$DBPNAM2= <>
##$DBPNAM3= <>
##$DBPNAM4= <>
##$DBPNAM5= <>
##$DBPNAM6= <>
##$DBPNAM7= <>
##$DBPOAL= (0..7)
0.5 0.5 0.5 0.5 0.5 0.5 0.5 0.5 
##$DBPOFFS= (0..7)
0 0 0 0 0 0 0 0 
##$DE= 6
##$DECBNUC= <off>
##$DECIM= 24
##$DECNUC= <off>
##$DECSTAT= 4
##$DIGMOD= 1
##$DIGTYP= 9
##$DL= (0..7)
0 120 120 120 120 120 120 120 
##$DP= (0..7)
150 150 150 150 150 150 150 150 
##$DP07= 0
##$DPNAME0= <>
##$DPNAME1= <>
##$DPNAME2= <>
##$DPNAME3= <>
##$DPNAME4= <>
##$DPNAME5= <>
##$DPNAME6= <>
##$DPNAME7= <>
##$DPOAL= (0..7)
0.5 0.5 0.5 0.5 0.5 0.5 0.5 0.5 
##$DPOFFS= (0..7)
0 0 0 0 0 0 0 0 
##$DQDMODE= 0
##$DR= 18
##$DS= 0
##$DSLIST= <SSSSSSSSSSSSSSS>
$$ [...]
##$SUBNAM2= <"">
##$SUBNAM3= <"">
##$SUBNAM4= <"">
##$SUBNAM5= <"">
##$SUBNAM6= <"">
##$SUBNAM7= <"">
##$SUBNAM8= <"">
##$SUBNAM9= <"">
##$SW= 26.0245750270697
##$SWIBOX= (0..15)
0 0 2 0 0 0 0 0 0 0 0 0 0 0 0 0 
##$SW_h= 5208.33333333333
##$TD= 16384
##$TD0= 1
##$TE= 0
##$TE2= 300
##$TE3= 300
##$TEG= 300
##$TL= (0..7)
0 120 120 120 120 120 120 120 
##$TP= (0..7)
150 150 150 150 150 150 150 150 
##$TP07= 0
##$TPNAME0= <>
##$TPNAME1= <>
##$TPNAME2= <>
##$TPNAME3= <>
##$TPNAME4= <>
##$TPNAME5= <>
##$TPNAME6= <>
##$TPNAME7= <>
##$TPOAL= (0..7)
0.5 0.5 0.5 0.5 0.5 0.5 0.5 0.5 
##$TPOFFS= (0..7)
0 0 0 0 0 0 0 0 
##$TUNHIN= 0
##$TUNHOUT= 0
##$TUNXOUT= 0
##$USERA1= <user>
##$USERA2= <user>
##$USERA3= <user>
##$USERA4= <user>
##$USERA5= <user>
##$V9= 5
##$VALIST= <valist>
##$VCLIST= <CCCCCCCCCCCCCCC>
##$VD= 0
##$VDLIST= <DDDDDDDDDDDDDDD>
##$VPLIST= <PPPPPPPPPPPPPPP>
##$VTLIST= <TTTTTTTTTTTTTTT>
##$WBST= 1024
##$WBSW= 4
##$XGAIN= (0..3)
0 0 0 0 
##$XL= 0
##$YL= 0
##$YMAX_a= 182293
##$YMIN_a= -292225
##$ZGOPTNS= <>
##$ZL1= 120
##$ZL2= 120
##$ZL3= 120
##$ZL4= 120
##$ABSF1= 10
##$ABSF2= 0
##$ABSG= 5
##$ABSL= 3
##$ALPHA= 0
##$AQORDER= 0
##$ASSFAC= 0
##$ASSFACI= 0
##$ASSFACX= 0
##$ASSWID= 0
##$AUNMP= <proc_1d>
##$AZFE= 0.1
##$AZFW= 0.1
##$BCFW= 1
##$BC_mod= 2
##$BYTORDP= 1
##$COROFFS= 0
##$CY= 11.3945322036743
##$DATMOD= 1
##$DC= 2
##$DFILT= <>
##$DTYPP= 0
##$F1P= 2.36226072786647
##$F2P= -0.459571619588291
##$FCOR= 0.5
##$FTSIZE= 0
##$FT_mod= 4
##$GAMMA= 1
##$GB= 0.15
##$INTBC= 1
##$INTSCL= 1
##$ISEN= 128
##$LB= 0.24
##$LEV0= 0
##$LPBIN= 0
##$MAXI= 10000
##$MC2= 0
##$MEAN= 0
##$ME_mod= 0
##$MI= 1.114404
##$NCOEF= 0
##$NC_proc= 0
##$NLEV= 6
##$NOISF1= 3.799351
##$NOISF2= 2.8
##$NSP= 1
##$NTH_PI= 0
##$NZP= 0
##$OFFSET= 15.70392
##$PC= 1
##$PHC0= -17870.85
##$PHC1= 38.40075
##$PH_mod= 1
##$PKNL= yes
##$PPARMOD= 0
##$PSCAL= 0
##$PSIGN= 0
##$REVERSE= no
##$SF= 200.130013532006
##$SI= 16384
##$SIGF1= 3
##$SIGF2= 2
##$SINO= 400
##$SIOLD= 16384
##$SREGLST= <1H.CDCl3>
##$SSB= 0
##$STSI= 0
##$STSR= 0
##$SW_p= 3612.71676300578
##$SYMM= 0
##$S_DEV= 0
##$TDeff= 0
##$TDoff= 0
##$TI= <>
##$TILT= no
##$TM1= 0
##$TM2= 0
##$TOPLEV= 0
##$USERP1= <user>
##$USERP2= <user>
##$USERP3= <user>
##$USERP4= <user>
##$USERP5= <user>
##$WDW= 1
##$XDIM= 8192
##$YMAX_p= 0
##$YMIN_p= 0
$$ End of Bruker specific parameters
$$ ---------------------------------
##NTUPLES= NMR FID
##VAR_NAME=  TIME,          FID/REAL,        FID/IMAG
##SYMBOL=    X,             R,               I
##VAR_TYPE=  INDEPENDENT,   DEPENDENT,       DEPENDENT
##VAR_FORM=  AFFN,          ASDF,            ASDF
##VAR_DIM=   8192,          8192,            8192
##UNITS=     SECONDS,       ARBITRARY UNITS, ARBITRARY UNITS
##FACTOR=    0.000192,      1,               1
##FIRST=     0,             0,               0
##LAST=      1.572672,      0,               0
##MIN=       0,             -292225,         0
##MAX=       1.572672,      182293,          0
$$ Real data points
##PAGE= N=1
##DATA TABLE= (X++(R..R)), XYDATA
$$ [...]
$$ plain form
2353 3011 156 -2136 -654 1187 740 -537 -94 -529 -442 951 1592 -568 -2523 -540 2820 903
2369 903 -2786 -2345 1348 1661 -1287 -1638 -440 48 -5 515 -123 -1754 -498 2220 1590 -1910 -1967 1685
2387 1685 3327 -73 -2121 295 2344 1337 -411 -499 -136 182 1211 1290 -1153 -1747 752 2859 -267
2404 -267 -3102 -1013 2554 1488 -1724 -1873 455 1069 -241 -359 -911 -874 61 1465 376 -2541 -1694
2421 -1694 1905 2108 -1769 -2224 819 1958 -597 -1375 -179 785 557 614 406 -887 -1123 1384 2322
2438 2322 -557 -2165 766 3067 679 -1993 -909 1486 1210 -787 -325 285 -321 16 1267 -55
2454 -55 -2009 -537 2115 916 -2118 -1821 1342 1418 -847 -1470 110 730 -205 -414 151 -649 -601 1334
2472 1334 1031 -1408 -2334 678 2345 -296 -2145 -65 1842 585 -970 -350 652 260 585 1358
$$ packed form
2353C011k855k292J482J841m47j277M43m35Q7J393O41k160j955J983L360j917
2369I03l689M41L693L13k948l51J198M88n3N20o38j631J256K718o30l500n7L652
2387A685J642l400k048K416K049j007j748q8L63L18J029P9k443n94K499K107l126
2404b67k835K089L567j066l212j49K328O14j310j18n52L7R35J404j089k917Q47
2421a694L599K03l877m55L043J139k555p78J196R64k28N7k08j293k36K507R38
2438B322k879j608K931K301k388k672J084K395k76j997M62O10o06L37J251j322
2454e5j954J472K652j199l034K97L163P6k265o23J580O20r35k09N65q00M8J935
2472A334l03k439r26L012J667k641j849K080J907j257j555O20J002l92L25P73
$$ plain form
2488 1358 254 -1129 75 2301 904 -1759 -886 2147 1441 -1519 -1507 630 821 -589 -625 -22 -663
2505 -663 -377 500 168 -1711 -1515 895 1507 -1205 -1961 448 1684 -411 -1303 -42 1193 8 -523
2522 -523 324 282 -1086 -86 1570 190 -1619 214 2097 528 -1539 -834 1730 943 -624 -286 1213
2539 1213 412 -274 375 641 -951 -815 1470 1110 -1345 -1424 877 1299 -1504 -1629 391 741 -652 -1067
2557 -1067 555 67 -1053 -77 978 -326 -1175 173 1639 -206 -1409 29 1739 730 -1074 134
2573 134 1193 239 -826 352 1120 -686 -276 1105 631 -1217 -665 1391 1374 -1351 -824 1165 1523
2590 1523 -900 -482 822 524 -608 -199 562 -521 -985 338 656 -727 -1552 -155 1097 -920 -1997
2607 -1997 246 1042 -577 -1318 -2 813 -620 -536 666 695 -472 -43 1524 656 -1385 9 1664
$$ packed form
2488A358j104j383J204K226j397k663Q73L033p06k960J2K137J91j410l6O03o41
2505f63K86Q77l32j879J96K410O12k712p56K409J236k095q92J261J235j185n31
2522e23Q47m2j368J000J656j380j809J833J883j569k067P05K564p87j567L38J499
2539A213q01o86O49K66j592J36K285l60k455p9K301M22k803j25K020L50j393m15
2557a067J622m88j120R76J055j304q49J348J466j845j203J438J710j009j804J208
2573A34J059r54j065J178P68j806M10J381m74j848N52K056j7k725N27J989L58
2590A523k423M18J304k98j132M09P61j083m64J323L18j383q25J397J252k017j077
2607a997K243P96j619p41J316Q15j433Q4J202K9j167M29J567q68k041J394J655
$$ plain form
2624 1664 822 -1391 -457 1546 882 -965 -232 902 474 -255 252 620 -463 -876 834 1356 -1025
2641 -1025 -1151 803 1451 -950 -1713 602 1138 -677 -1167 380 61 -737 -297 795 -215 -1146 257
2658 257 1165 -123 -1803 -40 2001 317 -1584 -416 1392 582 -545 176 866 -39 -202 810 678
2675 678 -1113 -462 1527 1151 -1020 -1351 1277 1232 -728 -1040 509 759 -322 -344 424 -576 -791 531
2693 531 1030 -872 -1606 290 1304 -338 -1786 -534 1289 135 -1439 -184 489 -502 -527 467 -297
2710 -297 -1072 -45 1868 930 -1676 -847 1821 1370 -610 -551 1097 1585 -178 22 596 156 -564 963
2728 963 1098 -839 -1273 915 1492 -907 -1750 144 1613 -110 -1143 -245 659 -87 -432 689 -75
2745 -75 -1097 73 1251 -54 -1904 -454 2003 864 -1600 -871 1187 801 -800 -186 -74 209 42
$$ packed form
2624A664q42k213R34K003o64j847P33J134m28p29N07L68j083m13J710N22k381
2641a025j26J954O48k401p63K315N36j815m90J547l19p98M40J092j010r31J403
2658B57R08j288j680J763K041j684j901J168J808q10j127P21O90r05j63J012j32
2675F78j791O51J989l76k171l31K628m5j960l12J549K50j081k2P68j000k15J322
2693E31M99j902p34J896J014j642j448J252J823j154j574J255O73r91k5R94p64
2710b97p75J027J913r38k606Q29K668m51j980N9J648M88j763K00N74m40p20J527
2728I63J35j937m34K188N77k399q43J894J469j723j033Q98R04p46l45J121p64
2745g5j022J170J178j305j850J450K457j139k464P29K058l86j601O14J12K83j67
$$ plain form
2762 42 662 601 -1074 -636 1502 1398 -1092 -1618 895 1818 -490 -1471 -104 1064 52 -412 -34 -138
2780 -138 -891 -14 811 -396 -1680 -281 1862 -1 -2043 -923 898 631 -1196 -750 504 359 -267
2797 -267 193 246 -1153 -422 1685 762 -1043 -989 1278 1764 -758 -1425 549 1219 264 -325 154 571 -119
2816 -119 759 997 -490 -1019 1024 1783 79 -1477 -33 1635 454 -1471 -464 694 -28 -579 -99
2833 -99 -214 -1243 -280 993 -174 -1963 -863 1388 1254 -1707 -1361 957 1444 -281 -624 132 158 10
2851 10 589 621 -1032 -1013 1198 1697 -705 -1701 513 2001 132 -1467 -171 1007 274 -83 28 -241
2869 -241 -516 356 1256 -105 -1763 -606 1946 624 -2065 -1241 1257 1135 -761 -1251 16 284 32
2886 32 244 -72 -968 -759 1108 704 -1184 -1739 991 1805 -610 -1327 79 1378 424 -235 123 475
$$ packed form
2762D2O20o1j675M38K138j04k490n26K513R23k308r81J367J168j012m64L78j04
2780a38p53Q77Q25j207j284J399K143j863k042J120J821k67j827M46J254j45o26
2797b67M60N3j399P31K107r23j805N4K267M86k522o67J974O70r55n89M79M17o90
2816a19Q78K38j487n29K043P59j704j556J444J668j181j925J007J158p22n51M80
2833i9j15j029R63J273j167j789J100K251j34k961L46K318M87j725l43P56K6j48
2851A0N79L2j653J9K211M99k402r96K214J488j869j599J296J178p33l57J11k69
2869b41k75Q72R00j361j658J157K552j322k689Q24K498j22j896m90J267K68k52
2886C2K12l16q96K09J867m04j888n55K730Q14k415p17J406J299r54o59L58L52
$$ plain form
2904 475 -69 381 1303 -274 -1220 92 2180 450 -1888 -550 1124 837 -919 -907 344 494 -484
2921 -484 118 16 -1094 -682 1231 1086 -1531 -1495 614 1477 -1116 -2250 -23 1344 189 -529 -60
2938 -60 -238 -631 657 595 -690 -1340 1071 2301 130 -1758 -246 1847 1191 -698 -718 872 602 -17
2956 -17 110 -150 -1016 106 1540 507 -1991 -1133 1876 1629 -1437 -1782 763 1481 -471 -1305 -313 320
2974 320 -9 726 223 -1044 -1256 779 1466 -1333 -2131 362 1992 204 -1832 -499 1210 747 -324
2991 -324 -437 41 -118 510 1214 -380 -1335 -5 1992 1103 -1580 -1031 1201 1326 -497 -933 73 537
3009 537 25 336 50 -765 -643 1225 1397 -1463 -1645 704 1865 -392 -1867 -659 1186 286 -713
3026 -713 -380 87 -302 222 868 -430 -1298 198 1863 311 -1881 -1017 1437 1433 -1072 -1027 460 798
$$ packed form
2904D75n44M50R22j577r46J312K088j730k338J338J674k87j756J2J251J50r78
2921d84O02j02j110M12J913j45k617L6K109Q63k593j134K227J367j155p18M69
2938f0j78l93J288o2j285o50K411J230k171j888J512K093o56j889k0J590k70o19
2956a7J27k60q66J122J434j033k498Q58L009k47l066l45K545P18j952q34R92O33
2974C20l29P35n03j267k12K035O87k799p98K493J630j788k036J333J709m63j071
2991c24j13M78j59O28P04j594r55J330J997q89k683N49K232J25j823m36J006M64
3009E37n12L11k86q15J22J868J72k860j82K349J161k257j475J208J845r00r99
3026g13L33M67l89N24O46j298q68J496J665j552k192Q64K454mk505M5J487L38
$$ plain form
3044 798 183 213 72 -543 86 2038 1499 -1382 -1460 1164 2292 -149 -1826 75 1642 245 -1013
3061 -1013 -730 122 -56 469 47 -637 -1347 555 1554 -467 -2149 -767 2045 1197 -1448 -1609 719
3078 719 967 -98 -479 -88 -196 268 1211 59 -1317 -892 1840 1582 -1181 -1687 1214 1841 -140 -1143
3096 -1143 102 901 406 246 -43 -238 -491 919 1534 -579 -1530 353 1726 -144 -1883 -689 1253
3113 1253 688 -725 -753 92 49 134 496 -340 -1274 -328 1492 447 -1689 -952 1356 1494 -778 -997 658
3132 658 627 -143 -33 509 314 -221 722 1045 -713 -1058 956 1787 -18 -1421 -270 1165 227 -970
3150 -970 -252 491 29 196 224 -316 -966 -551 1097 167 -1495 -436 1216 629 -1483 -893 289 536
3168 536 -615 -570 -64 72 -310 464 511 -566 -833 1177 1567 -748 -1103 478 1735 201 -886 -26
$$ packed form
3044G98o15L0j41o15O29J952n39k881p8K624J128k441j677J901J567j397j258
3061a013K83Q52j78N25m22o84p10J902R99k021j682J382K812q48k645j61K328
3078G19K48j065l81L91j08M64R43j152j376M25K732k58k763n06K901O27j981j003
3096a143J245P99m95j60k89j95k53J410O15k113r51J883J373j870j739J194J942
3113A253n65j413k8Q45m3Q5L62q36r34R46J820j045k136P37K308J38k272k19J655
3132F58l1p70J10N42j95n35R43L23j758l45K014Q31j805j403J151J435r38j197
3150i70P18P43m62J67K8n40o50M15J648r30j662J059J652n87k112N90J182K47
3168E36j151M5N06J36l82P74M7j077k67K010L90k315l55J581J257j534j087Q60
$$ plain form
3186 -26 873 -83 -30 126 -126 -501 608 1356 293 -1532 -409 1807 354 -1472 -1018 1317 381 -953
3204 -953 -465 219 -184 -368 187 361 -691 -414 563 720 -1129 -1076 780 1195 -594 -1153 464 840 -235
3223 -235 -640 427 213 -226 112 1038 144 -915 774 1522 22 -705 -7 1387 173 -1076 58
3240 58 769 28 -296 284 287 -948 -703 757 729 -1030 -714 765 760 -1155 -1122 440 264 -574 -550 463
3260 463 73 -402 -111 758 -132 -806 478 883 -343 -1184 46 990 -304 -884 712 1018 171 -410
3278 -410 801 540 -286 -284 837 514 -575 -357 1190 487 -847 -511 863 594 -1029 -613 439 207
3296 207 -830 -260 780 -259 -1100 22 650 -235 -1012 322 684 -80 -843 376 1110 -278 -733 555
3314 555 509 -601 -383 482 265 -720 106 765 -3 -536 27 1530 85 -865 87 717 95 -668 -78
$$ packed form
3186b6Q99r56N3J56k52l75J109P48j063j825J123K216j453j826M54K335r36j334
3204i53M88O84m03j84N55J74j052K77R77J57j849N3J856M15j789n59J617L76j075
3223b35m05J067k14m39L38R26q94j059J689P48j500p27O98J394j214j249J134
3240E8P11p41l24N80Lj235K45J460k8j759L16J479nj915L3J562j76q38K4J013
3260D63l90m75K91Q69q90o74J284M05j226q41J230R44j294n80J596L06q47n81
3278d10J211k61q26KJ121l23j089K18J547p03j334L36J374k69j623M16J052k32
3296B07j037N70J040j039q41J122O28q85p77J334L62p64p63J219P34j388m55J288
3314E55m6j110K18Q65k17r85Q26O59p68n33N63J503j445r50R52O30o22p63N90
$$ plain form
3333 -78 793 354 -834 386 807 -588 -858 571 448 -542 -734 469 467 -873 -1153 357 107 -692 -401
3352 -401 747 444 -627 -316 461 290 -874 -28 1166 -313 -679 328 949 -86 -619 203 1163 -48
3370 -48 -511 347 652 -355 -267 441 865 -566 -501 887 201 -878 -160 1027 464 -661 -591 741 -149
3389 -149 -957 -285 313 -2 -781 -189 485 -486 -1304 236 569 -832 -1210 71 928 -317 -797 402
3407 402 783 -280 -670 438 533 -492 74 777 297 -889 7 868 189 -761 -351 932 571 -792
3425 -792 92 620 243 -549 362 411 -495 -633 572 557 -831 -544 623 514 -708 -866 397 675 -465
3444 -465 -460 356 209 -514 -159 766 18 -1097 -246 865 59 -966 -249 1017 779 -900 -147 646 471
3463 471 -300 462 660 -624 -151 1128 572 -925 -271 858 992 -778 -1171 496 1037 -392 -463 331
$$ packed form
3333g8Q71m39j188J220M21j395k70J429j23r90j92J203kj340k80J510k50p99K91
3352d01J148l03j071L11P77j71j164Q46J194j479l66J007O21j035n33Q22R60j211
3370d8m63Q58L05j007Q8P08M24j431O5J388o86j079P18J187n63j125P0J332q90
3389a49q08O72N98l15p79N92O74r71q18J540L33j401l78J281Q57j245m80J199
3407D02L81j063l90J108R5j025N66P03m80j186Q96Q61o79r50M10J283l61j363
3425g92Q84N28l77p92R11M9r06j38J205j5j388K87J167j09j222j58J263K78j140
3444d65NQ16j47p23L55R25p48j115Q51J111q06j025P17J266k38j679P53P93j75
3463D71p71P62J98j284M73J279n56j497O54J129J34j770l93J667N41j429p1P94
$$ plain form
3481 331 403 -273 -146 406 -62 -701 89 588 -255 -1121 192 940 -130 -855 69 736 122 -349 111 25
3501 25 -466 -298 721 31 -907 -149 942 1060 -898 -602 969 822 -380 -77 450 327 -121 -187 645
3520 645 -129 -728 496 1166 -431 -1154 175 761 -345 -942 -236 934 160 -594 -216 186 -485 -109
3538 -109 419 -13 -1001 -133 981 230 -1206 -623 1192 458 -436 -620 541 431 -171 -158 321 -93 -296
3557 -296 871 824 -491 -989 686 1140 -132 -865 258 1033 -22 -545 -41 295 -220 -243 412 -345 -1260
3576 -1260 59 863 -372 -1237 -304 718 317 -976 -613 406 511 -405 -265 349 -538 -75 791 537
3594 537 -884 -638 921 1163 -499 -849 559 1170 -190 -447 248 505 -206 136 516 -465 -465 595 1345
3613 1345 -220 -1233 -10 1282 286 -1111 -843 524 267 -424 -143 262 -330 -110 450 111 -1076
$$ packed form
3481C31P2o76J27N52m68o39P90M99q43q66J313P48j070p25R24O67o14m71M60q6
3501B5m91J68J019o90r38P58J091J18j958K96J571j47j202L03N27j23m48o6Q32
3520F45p74n99J224O70j597p23J329N86j106n97P06J170p74p54L78M02o71L76
3538a09N28m32r88Q68J114p51j436N83J815p34q94j84J161j10o02J3M79m14k03
3557b96J167m7j315m98J675M54j272p33J123P75j055n23N04L36n15k3O55p57r15
3576a260J319Q04j235q65R33J022m01j293L63J019J05r16J40O14q87M63Q66k54
3594E37j421K46J559K42j662l50J408O11j360k57O95K57p11L42L80r81%J060P50
3613A345j565j013J223J292r96j397K68J367k57o91K81M05n92K20N60l39j187
$$ plain form
3630 -1076 -460 862 387 -1082 -812 603 965 -213 -828 -18 517 30 296 -171 -295 -487 912 1041
3648 1041 -695 -839 572 946 35 -1359 -139 1235 436 -413 -376 -84 -158 72 158 -347 -659 247 960
3667 960 215 -1405 -640 781 646 -880 -935 185 353 -330 -253 124 -158 -82 401 494 -803 -965 629
3686 629 844 -309 -1051 403 1216 107 -657 -40 705 156 -90 487 342 -371 -52 922 233 -1117 -177
3705 -177 1153 516 -951 -1140 491 710 -293 -245 318 -342 -205 501 62 -841 -694 785 722 -797 -1442
3724 -1442 402 860 -6 -984 -423 352 24 -223 115 -362 -185 613 899 -372 -984 279 1559 508
3742 508 -1203 -375 991 1030 -424 -271 -55 286 122 591 -183 -770 -321 1192 968 -1070 -1130 737 871
3761 871 -521 -955 107 599 84 -545 -273 193 -444 371 516 -523 -899 333 850 -280 -1123 -116
$$ packed form
3630a076O16J322m75j469K70J415L62j178o15Q10N35m87K66m67j24j92J399J29
3648A041j736j44J411L74r11j394J220J374p99q49L7K92p4K30Q6n05l12R06P13
3667I60p45j620P65J421j35j526n5J120J68o83P7L77k82P6M83R3j297j62J594
3686F29K15j153p42J454Q13j109p64O17P45n49k46N77j45p13L19R74o89j350R40
3705a77J330o37j467j89J631K19j003M8N63o60J37P06m39r03J47J479o3j519o45
3724a442J844M58q66r78N61P75l28k47L38m77J77P98K86j271o12J263J280j051
3742E08j711Q28J366L9j454J53K16L41j64M69p74n87M49J513k24k038o0J867J34
3761H71j392m34J062M92n15o29K72M66o37Q15J45j039l76J232N17j130q43J007
$$ plain form
3779 -116 721 316 -682 -294 463 186 -16 175 337 -263 51 585 283 -615 -60 1140 570 -359 -685 637
3799 637 862 -167 -536 202 317 23 116 79 -577 -524 331 505 -278 -989 77 926 -115 -870 -414 264
3819 264 99 -355 -4 -50 -70 202 852 166 -952 -189 666 525 -817 -465 635 565 -192 -429 102 4
3839 4 179 383 265 -287 -347 723 556 -592 -826 517 903 -349 -946 -12 412 -54 -190 -352 -12 -96
3859 -96 57 269 -136 -812 369 969 -104 -849 -505 949 342 -405 -380 361 431 -48 31 -9 -224 -232 484
3880 484 137 -444 -239 793 757 -700 -657 203 782 -19 -219 330 310 -317 206 857 -24 -417 92 554
3900 554 -33 -1063 -243 656 -59 -807 -147 568 60 -811 -82 321 -348 -362 227 171 -628 -426 600 426
3920 426 -356 -440 702 553 -92 -365 718 500 -141 -77 469 130 -290 58 1037 -189 -580 32 909 -146
$$ packed form
3779a16Q37m05r98L88P57k77k02J91J62o00L14N34l02q98N55J200n70r29l26J322
3799F37K25j029l69P38J15k94R3l7o56N3Q55J74p83p11J066Q49j041p55M56O78
3819B64j65m54L51m6k0K72O50o86j118P63Q55j41j342L52J100p0p57k37N31r8
3839DJ75K04j18n52o0J070j67j148k34J343L86j252n97R34M24m66j36j62L40q4
3859i6J53K12m05o76J181O00j073p45L44J454o07p47K5P41P0m79P9m0k15qP16
3880D84l47n81K05J032l6j457M3Q60N79q01k00N49k0o27N23O51q81l93N09M62
3900E54n87j030Q20Q99p15p48O60P15n08q71P29M03o69j4N89n6p99K02J026j74
3920D26p82q4J142j49o45k73J083k18o41O4N46l39m20L48R79j226l91O12Q77j055
$$ plain form
3940 -146 -758 -258 398 178 -348 353 257 -397 -364 360 25 -610 -408 413 160 -666 -648 276 194 -568 -348
3961 -348 397 -192 -347 14 180 -99 -494 362 636 -210 -243 275 835 54 -755 314 906 -262 43 127
3981 127 104 -340 -136 267 129 -777 -292 647 201 -603 -191 492 185 -564 -230 246 -11 -694 -302 589
4001 589 -86 -598 39 104 -379 -700 -81 448 -423 -684 292 613 -79 -80 234 279 -290 -166 541 261 -314
4022 -314 -36 778 422 -280 71 539 429 -601 -127 516 110 -116 -127 384 -215 -402 228 360 -353 -574
4042 -574 67 310 -85 -598 118 187 -294 -370 35 25 -533 -332 604 124 -424 -212 470 97 -274 -30 490
4063 490 91 -47 116 529 199 -411 229 479 205 -501 417 692 -464 -545 236 447 -172 -244 622 91
4083 91 -644 -222 622 -37 -392 -251 263 -19 -928 -377 701 90 -402 -10 408 -168 -411 -174 151 -285
$$ packed form
3940a46o12N00O56k20n26P01r6o54L3P24l35o35K02Q21k53q26J8R24q2p62K20
3961c48P45n89j55L61J66k79l95Q56K74q46l3N18N60p81q09J069N92j168L05Q4
3981A27k3m44K04M03j38r06M85R39m46q04M12O83l07p49L34M76k57o83L92Q91
4001E89o75n12O37O5m83l21O19N29q71k61R76L21o92jL14M5n69J24P07k80n75
4022c14K78Q14l56p02L51M68j10j030M74O43m06k26j1N11n99j87O30J32p13k21
4042e74O41K43l95n13P16O9m81p6M05j0n58K01R36m80n48K12O82l73l71K44N20
4063D90l99j38J63M13l30o10O40K50k74p06R18K75j156q1P81K11o19p2Q66n31
4083I1p35M22Q44o59l55J41N14k82r09N51J078o11m92L92M18n76k43K37L25m36
$$ plain form
4103 -285 -571 361 201 -432 -525 513 278 -224 -122 365 562 -251 105 438 117 -26 65 749 146 -453
4123 -453 -183 620 139 -270 68 437 135 -648 17 850 -223 -366 -215 363 -395 -380 620 135 -697 -514
4143 -514 -78 34 -425 -560 207 136 -550 -200 446 231 -314 36 508 21 -261 159 637 38 -404 124
4163 124 693 -168 -433 25 373 -282 -73 272 140 -421 -266 338 241 -467 -415 589 282 -568 -330 94
4183 94 -91 -630 -458 -21 -201 -617 -97 244 -193 -585 86 571 -194 -902 493 631 -129 -341 -76 544
4203 544 194 -140 60 115 -370 -124 740 6 -739 -119 763 346 -707 -289 561 437 -212 -4 -14 243
4223 243 -341 167 350 -128 -202 221 167 -740 -741 206 480 -452 -847 9 195 -393 -371 78 -48 -735 181 585
4245 585 -24 -649 152 571 47 -539 -100 561 222 -1 -110 227 0 -121 4 -68 -509 -140 475 431 -755
$$ packed form
4103b85k86R32j60o33r3J038k35n02J02M87J97q13L56L33l21j43R1O84o03n99
4123d53K70Q03m81m09L38L69l02p83O65Q33j073j43J51N78p58J5J000m85q32J83
4143e14M36J12m59j35P67p1o86L50O46k15n45L50M72m87k82M20M78n99m42N28
4163A24N69q61k65M58L48o55K09L45j32n61J55O04r7p08N2J004l07q50K38M24
4183I4j85n39J72M37j80m16N20L41m37l92O71M85p65p08J395J38p60k12K65O20
4203E44l50l34K00N5m85K46Q64p34p45O20Q82m17j053M18Q50j24o49K08j0K57
4223B43n84N08J83m78p4M23n4r07jR47K74r32l95Q56J86n88K2M49j26o87R16M04
4245E85o09o25Q01M19n24n86M39O61l39k23j09L37k27j21J25p2m41L69O15m4j186
$$ plain form
4266 -755 -629 454 463 -370 -544 18 307 -322 -342 150 72 -439 247 182 -174 -739 114 806 -34 -251 27
4287 27 304 97 -365 -497 304 59 -239 330 95 -77 98 810 422 -440 -359 764 469 -374 -227 -153 439
4308 439 -93 -357 119 -6 -405 -13 218 -390 -432 247 1002 -130 -850 253 732 32 -736 19 348 202
4328 202 -29 -32 -93 -245 2 680 -155 -713 -402 708 530 -660 -695 431 170 -302 -410 21 -9 -25 445
4349 445 167 -107 -36 418 769 -446 -846 278 852 24 -783 -178 645 104 -275 284 106 -222 -68 139
4369 139 -35 -655 -78 481 198 -876 -487 484 415 -238 -403 407 66 -240 -278 -141 -552 -64 476 722
4389 722 -443 -644 483 504 -356 -392 164 646 81 -410 408 34 -6 289 224 5 -586 255 667 -189 -528
4410 -528 -71 537 340 -467 -336 497 183 -63 -145 -197 -589 -115 425 386 -704 -658 575 592 -514 -430 -12
$$ packed form
4266g55J26J083Rq33j74N62K89o29k0M92p8n11O86o5l56n65Q53O92q40k17K78
4287B7K77k07m62j32Q01k45k98N69k35j72J75P12l88q62Q1J123k95q43J47P4N92
4308D39n32k64M76j25l99L92K31o08m2O79P55j132p20J103M79p00p68P55L29j46
4328B02k31lo1j52K47O78q35n58L11J110j78j190l5J126k61m72j08M31l0j6M70
4349D45k78k74P1M54L51j215m00J124N74q28q07O05Q23n41l79N59j78l28J54K07
4369A39j74o20N77N59k83j074L89R71o9o53j65Q10l41l06l8J37m11M88N40K46
4389G22j165k01J127K1q60l6N56M82n65m91Q18l74m0K95o5k19n91Q41M12q56l39
4410e28M57O08j97q07J31Q33l14k46q2n2l92M74N40l9j090M6J233J7j106Q4M18
$$ plain form
4431 -12 334 -246 -215 20 201 -178 -23 135 -334 -708 191 690 -199 -832 -257 629 -14 -566 -284 477 409
4452 409 -208 273 479 -244 245 167 71 -491 -84 594 220 -816 -499 348 378 -376 -204 455 -258 -147 62
4473 62 77 -199 -281 193 536 -268 -376 119 524 -193 -595 380 613 23 -241 303 378 13 256 428 -214
4494 -214 -419 12 666 447 -457 -342 861 232 -498 -483 -88 266 -166 -27 89 -344 -362 154 66 -410 -622
4515 -622 134 713 -305 -878 -239 565 39 -493 145 168 -84 -93 99 9 -373 -78 836 -216 -678 -198 628
4536 628 96 -414 -242 477 58 -152 -94 197 317 -26 427 309 -487 -546 367 301 -207 -496 -46 434 -392
4557 -392 -159 241 276 -446 -176 300 -224 -398 -97 522 -48 -459 -373 350 275 -621 -137 233 -81 -581 97
4578 97 285 -169 -167 575 440 -407 -22 224 531 -345 -408 511 471 -269 -419 57 317 -325 121 99 244 -504
$$ packed form
4431a2L46n80L1K35J81l79J55J58m69l74Q99M99q89o33N75Q86o43n52K82P61o8
4452D09o17M81K06p23M89p8r6n62M07O78l74j036L17Q47L0p54J72O59p13J11K09
4473F2J5k76q2M74L43q04j08M95M05p17m02R75K33n90k64N44P5l65K43J72o42
4494b14k05M31O54k19r04J15J203o29p30J5L95L54m32J39J16m33j8N16q8m76k12
4515f22P56N79j018n73O39Q04n26n32O38K3k52rJ92r0l82K95R14j052m62M80Q26
4536F28n32n10J72P19m19k10N8K91J20l43M53j18p96n9R13o6n08k89M50M80q26
4557c92K33M00L5p22K70M76n24j74L01O19n70m11Q6P23p5q96M84L70l14n00O78
4578I7J88m54KP42j35q47L85K46L07q76o3R19m0p40j50M76K60o42M46k2J45p48
$$ plain form
4600 -504 186 411 -51 -625 -247 364 -292 -519 -40 407 101 -315 -68 191 -161 4 556 235 -350 -179
4620 -179 761 375 -414 -348 170 412 -272 -196 281 12 -238 144 474 100 -338 163 360 -463 -467 133 315
4641 315 -190 -481 121 378 -176 -493 -63 269 -533 -436 61 -170 -591 -341 454 -122 -518 -21 546 83
4661 83 -331 -189 416 195 -350 71 397 33 -356 151 543 106 -358 48 531 65 -416 480 470 -417 -320
4682 -320 46 220 -5 -252 214 82 -417 -25 266 -228 -343 -225 723 307 -768 -125 68 -190 -439 -59
4702 -59 386 -318 -520 234 428 -228 -338 395 321 -532 -340 341 432 -293 -114 326 63 -53 98 270 134
4723 134 -394 -21 266 -90 -112 -106 866 32 -446 139 382 -12 -435 129 26 -264 -127 281 291 -500 -132
4744 -132 320 521 -669 -737 76 -54 -536 -252 325 -262 -480 -46 194 69 12 396 44 22 -370 -24 559
$$ packed form
4600e04O90K25m62n74L78O11o56k27M79M47l06m16K47K59l52J65N52l21n85J71
4620a79R40l86p89O6N18K42o84P6M77k69k50L82L30l74m38N01J97q23mO00J82
4641C15n05k91O02K57n54l17M30L32q02R7M97k31m21K50P95n76l96M97N67m63
4661H3m14J42O05k21n45M21L26l64l89N07L92m37m64M06M83m66m81Q96j0q87R7
4682c20L66J74k25k47M66j32m99L92K91m94j15J18R48m16j075O43J93k58k49L80
4702e9M45p04k02P54J94o56j10P33p4q53J92O81R1p25J79M40k63j16J51J72j36
4723A34n28L73K87l56k2OR72q34m78N85K43l94m23N64j03k90J37M08J0p91L68
4744a32M52K01j190o8Q13j30m82K84N77n87k18M34K40j25n7L84l52k2l92L46N83
$$ plain form
4765 559 -105 -360 -7 529 50 -260 349 271 43 -314 160 -3 -157 -6 147 120 -390 -50 535 282 -412
4786 -412 -102 131 -196 -144 209 401 -100 -535 238 427 -231 -431 99 329 34 -515 152 485 -147 -291
4806 -291 645 181 -203 -37 249 142 -202 159 224 -61 -56 -1 511 243 -359 -50 314 -10 -460 416 469 -117
4828 -117 -29 179 2 155 -511 173 512 -152 -542 155 183 -343 -212 -17 -177 -234 -321 560 -34 -252 -126
4849 -126 175 296 -652 -8 183 -28 -611 314 285 161 -72 97 302 -213 -98 116 370 113 -445 207
4869 207 443 -55 -316 -3 296 -230 197 362 20 -486 -174 199 -186 -535 -367 51 101 -207 -44 203
4889 203 -133 -382 279 475 -58 -171 16 415 -304 -435 254 292 -422 -307 337 200 134 -105 135 162 -159
4910 -159 -250 193 198 -363 0 219 185 -344 -160 263 114 -382 -196 311 -38 -261 -309 6 -72 -25 536 454 -67
$$ packed form
4765E59o64k55L53N36m79l10O09p8k28l57M74j63j54J51J53k7n10L40N85k53o94
4786d12L10K33l27N2L53J92n01m35P73J89o58k00N30K30k95n49O67L33o32j44
4806b91R36m64l84J66K86j07l44L61O5k85NN5N12k68o02L09L64l24m50Q76N3n86
4828a17Q8K08j77J53o66O84L39o64l90O97K8n26J31J95j60n7q7Q81n94k18J26
4849a26L01J21r48O44J91k11n83R25k9j24k33J69K05n15J15K14K54k57n58O52
4869B07K36m98k61L13K99n26M27J65l42n06L12L73l85l49J68M18N0l08J63K47
4889B03l36k49O61J96n33j13J87L99p19j31O89L8p14J15O44j37o6k39K40K7l21
4910a59r1M43Nn61L63K19l4n29J84M23j49m96J86N07l49k23m8L15p8M7N61q2n21
$$ plain form
4933 -67 -295 364 434 -215 -584 427 336 -389 -173 117 2 -343 -22 241 -16 -407 80 564 179 -323 45
4954 45 359 56 -212 82 25 47 -319 116 154 -142 -53 223 48 -336 -109 380 272 -227 -410 159 206 -318
4976 -318 -264 -163 165 -238 123 188 214 -411 113 387 -277 -262 86 540 -21 -237 134 82 -270 -248 161 339
4998 339 66 -88 362 130 -137 -96 450 151 -479 -212 590 54 -102 -135 372 272 -322 132 287 63 -113
5019 -113 210 415 -180 -703 -47 329 -84 -401 -224 -120 85 -537 -64 234 -158 -46 90 89 -314 -160 482
5040 482 148 -373 97 398 430 -360 -160 292 301 -365 -2 215 100 128 213 465 -46 -346 231 225 -275 -156
5062 -156 383 130 -141 -359 -62 17 -73 99 59 49 -371 62 572 -256 -608 22 62 296 -362 76 336 238
5084 238 -64 149 24 126 -114 134 160 -286 159 417 272 -365 -589 249 463 -128 -139 -232 -143 -65 41 52
$$ packed form
4933f7k28O59P0o49l69J011r1p25K16K90j15l45L21K63k57l91M87M84l85n02L68
4954D5L14l03k68K94n7K2l66M35L8k96Q9K76j75l84K27M89j08m99j83N69M7n24
4976c18N4J01L28m03L61O5K6o25N24K74o64J5L48M54n61k16L71n2l52K2M09J78
4998C39k73j54M50k32k67M1N46k99o30K67Q02n36j56l3N07j00n94M54J55k24j76
5019a13L23K05n95n23O56L76m13l17J77J04K05o22M73K98l92J12J36jm03J54O42
5040D82l34n21M70L01L2p90K00M52Ro66L63K17j15K8Q5K52n11l00N77on00J19
5062a56N39k53k71k18K97P9r0J72m0j0m20M33N10q28l52O30M0K34o58M38K60r8
5084B38l02K13j25J02k40K48K6m46M45K58j45o37k24Q38K14n91j1r3Q9P8J06J1
$$ plain form
5106 52 -166 -276 20 228 -248 -593 -11 427 79 -632 -115 262 142 -450 -87 509 4 -162 166 -238
5126 -238 -127 -152 162 192 -609 -539 115 118 -382 -525 222 62 109 -45 318 -166 -229 -111 398 17 -335 67
5148 67 500 -34 -464 467 560 11 -371 -189 -148 19 -209 296 286 -318 -80 445 -26 -427 -298 89 326
5169 326 -305 -78 375 42 99 -36 66 -304 -281 193 214 -194 -313 190 581 -170 -472 143 258 -237 -249
5190 -249 223 148 -12 -75 160 -59 2 -25 19 86 -346 -256 309 86 -329 -160 351 164 -502 -234 236 -85
5212 -85 88 -245 281 -498 -530 426 36 -189 -280 250 649 -264 -393 243 301 -135 90 463 -309 131 -50
5233 -50 276 86 -141 260 101 -200 -591 -146 371 14 -25 -243 164 -286 -475 71 -301 -78 -174 341 -35
5254 -35 -49 -205 169 272 -459 -189 15 204 127 -191 20 147 -308 93 260 -8 -657 125 175 130 -160 89
$$ packed form
5106E2k18j10K96K08m76l45N82M38l48p11N17L77j20n92L63N96n05j66L28m04
5126b38J11k5L14L0q01P0O54Ln00j43P47j60M7j54L63m84o3J18N09l81l52M02
5148F7M33n34m30R31R3n49l82J82M1J67k28N05j0o04K38N25m71m01J29L87K37
5169C26o31K27M53l33N7j35J02l70K3M74K1m08j19N03L91p51l02O15J15m95j2
5190b49M72p5j60o3K35k19O1k7M4O7m32R0N65k23m15J69N11j87o66K68M70l21
5212h5J73l33N26p79l2R56l90k25r1N30L99r13j29O36N8m36K25L73p72M40j81
5233e0L26j90k27M01j59l01l91M45N17l57l9k18M07m50j89N46l72K23r6N15l76
5254c5j4j56L74J03p31K70K04J89p7l18K11J27m55M01J67k68o49P82N0m5k90K49
$$ plain form
5276 89 310 -5 -186 -47 -92 67 2 170 76 183 283 344 246 -279 -275 304 297 -339 -305 171 347 27 115 291
5300 291 86 -130 -363 104 -20 -365 287 186 -256 -465 66 194 -271 -250 -165 -53 -327 -210 179 158 -154
5321 -154 -30 623 3 -167 104 484 -3 -188 -350 104 145 -147 128 -35 -36 89 337 12 -119 -279 38
5342 38 30 -236 -264 201 306 1 -79 195 372 -72 -97 25 188 -171 61 292 -143 -174 -3 401 -36 -165
5364 -165 -155 218 100 -321 139 72 -54 -244 155 288 -336 -205 131 79 29 -261 380 530 -118 159 -230
5385 -230 192 -336 -168 148 -218 1 -41 177 -93 -335 -237 241 -64 -414 -217 102 -163 -291 -100 171 261
5406 261 -50 113 -87 -310 46 -224 349 -337 -265 74 176 -211 70 278 125 131 -134 233 308 -78 136
5427 136 261 -6 -209 -83 33 101 -67 55 394 -221 -53 -278 137 255 -121 -93 79 -239 -304 302 202
$$ packed form
5276H9K21l15j81J39m5J59o5J68r4J07J00O1r8n25MN79po36L4M76J76l20Q8J76
5300B91k05k16k33M67j24l45O52j01m42k09N31J28m65K1Q5J12k74J17L89k1l12
5321a54J24O53o20j70K71L80m87j85j62M54M1k92K75j63jJ25K48l25j31j60L17
5342C8qk66k8M65J05l05q0K74J77m44k5J22J63l59K32K31m35l1J71M04m37j29
5364a65J0L73j18m21M60o7j26j90L99J33o24J31L36n2n0k90O41J50o48K77l89
5385b30M22n28J68L16l66K19m2K18k70k42R8M78l05l50J97L19k65j28J91K71R0
5406B61l11J63k00k23L56k70N73o86P2L39J02l87K81K08j53Ok65L67P5l86K14
5427A36J25k67k03J26J16O8j68J22L39o15J68k25M15J18l76K8J72l18o5O06j00
$$ plain form
5448 202 -361 -54 85 141 -79 -324 257 -21 -188 -321 293 -22 15 -232 457 142 -267 235 178 46 -112
5469 -112 -210 247 102 -24 200 62 -91 -41 -60 86 -112 -191 9 317 -281 -62 152 196 -72 -299 334 -157
5491 -157 -499 -180 49 -382 -180 151 153 48 -434 277 357 -215 -197 8 272 -126 -86 252 183 -248 -183 329
5513 329 198 -18 263 158 181 -204 57 42 45 -364 70 257 -124 -430 -319 184 -70 -50 285 251 -297 -3
5535 -3 -13 131 -87 -234 53 153 -152 -191 141 -18 -351 -266 103 -17 -351 28 286 128 207 -79 -123 73
5557 73 -94 88 -5 11 153 134 221 -61 -60 69 -326 -19 -323 150 254 -228 -171 46 149 -133 -87 -286 -49
5580 -49 12 -155 -26 -164 -323 214 -49 78 -189 -355 227 -80 -286 171 -80 -258 -344 -47 164 -97 -2
5601 -2 178 401 -198 -47 219 103 -191 -156 79 390 -16 -181 -31 322 -10 5 95 80 -60 -51 253 92 -102
$$ packed form
5448B02n63L07J39N6k20k45N81k78j67j33O14l15L7k47O89l15m09N02n7j32j58
5469a12r8M57j45j26K24j38j53N0j9J46j98p9K00L08n98K19K14M4k68k27O33m91
5491a57l42L19K29m31K02L31Kj05m82P11Q0n72J8K05K64l98M0L38o9m31O5N12
5513C29j31k16K81j05K3l85K61j5Lm09M34J87l81l06J11N03k54K0L35l4n48K94
5535cj0J44k18j47K87J00l05l9L32j59l33Q5L69j20l34L79K58j58P9k86m4J96
5557G3j67J82r3J6J42j9Q7k82JJ29l95L07l04M73J04m82N7K17J03k82M6j99K37
5580d9O1j67J29j38j59N37k63J27k67j66N82l07k06M57k51j78q6K97K11k61R5
5601bJ80K23n99J51K66j16k94L5K35L11m06j65J50L53l32J5R0j5j40RL04j61j94
$$ plain form
5624 -102 117 74 124 -377 -14 87 -82 -147 -156 125 -152 -422 66 125 52 -200 51 -25 -153 -53 182 184 -327
5647 -327 201 249 -97 83 -176 117 104 -248 191 105 -263 -186 60 442 1 -232 123 37 -171 -385 88 197
5669 197 -194 -184 103 -169 -398 -396 406 429 -646 -112 390 -139 -364 -284 -150 41 -52 -74 -121 142 -71 -24 221
5692 221 -110 -391 238 319 85 -112 -125 316 257 24 180 -104 58 63 288 -96 -110 37 132 -152 -457 46
5714 46 362 -38 -109 230 121 252 -391 -334 -13 -132 -300 -7 231 -561 32 103 -8 -252 -455 233 -108
5735 -108 -54 -169 85 301 148 -37 268 60 -388 85 555 28 -145 -146 83 132 -178 43 294 203 -314 -89
5757 -89 -185 -142 -131 330 142 -32 -232 286 -6 -145 -143 29 324 -145 -127 33 113 -103 251 103 -197 -31 77
5780 77 78 -102 -352 352 84 56 -424 60 334 -45 -59 -185 -315 74 91 136 255 56 -57 36 251 -182 -509
$$ packed form
5624a02K19m3N0n01L63J01j69o5rK81k77k70M88N9p3k52K51p6j28J00K35Kn11
5647c27N28M8l46J80k59K93j3l52M39q6l68P7K46L82m41k33L55q6k08k14M73J09
5669A97l91J0K87k72k29KQ02K3j075N34N02n29k25Q0J34J91r3k2m7K63k13M7K45
5692B21l31k81O29Q1k34j97j3M41n9k33J56k84J62NK25l84j4J47R5k84l05N03
5714D6L16m00p1L39j09J31o43N7L21j19j68K93K38p92N93P1j11k44k03O88l41
5735a08N4j15K54K16j53j85L05k08m48M73M70n27j73jK29M9l10K21K51r1n17K25
5757h9r6M3J1M61j88j74k00N18k92j39KJ72K95m69J8J60Q0k16L54j48l00J66J08
5780G7Jj80k50P04k68k8m80M84K74l79j4j26j30L89J7M5J19j99j13R3K15m33l27
$$ plain form
5803 -509 19 277 -461 -77 38 -111 -83 64 138 -63 -246 8 179 -180 -20 -33 305 -211 -258 6 15 -59
5825 -59 -107 62 172 207 -221 38 130 -51 -23 203 159 -202 -94 316 285 116 -10 265 151 -154 -50 62
5847 62 62 145 -51 376 -380 -583 92 16 -139 -230 -88 206 -309 -309 202 13 -33 -30 83 -148 -89 -150 330 45
5871 45 -35 -161 137 442 -266 308 86 -36 -74 307 133 18 -72 350 249 -119 -330 -157 317 -67 -77 122
5893 122 106 191 -269 -54 -103 176 -18 270 -57 -224 -162 190 -102 -195 -55 442 71 -69 -64 74 102 -31 120
5916 120 -67 -199 -276 167 34 -498 -362 220 177 -99 -78 294 141 -166 -177 284 -154 -306 -5 345 -276
5937 -276 49 91 279 28 -141 -216 -49 -282 -344 5 -116 -56 164 -74 -77 74 77 -11 95 6 60 94 198 -76
5961 -76 -174 43 82 -163 -22 3 342 141 74 79 -128 -130 59 108 -22 -146 20 69 -39 -161 61 149 271 7
$$ packed form
5803e09N28K58p38L84J15j49K8J47P4k01j83K54J71l59J60j3L38n16m7K64Rp4
5825e9m8J69J10L5m28K59R2j81K8K26m4l61J08M10l1j69j26K75j14l05J04J12
5847F2%Q3j96M27p56k03O75p6j55r1J42K94n15%N11j89m6LJ13k31N9o1M80k85
5871D5q0j26K98L05p08N74k22j22l8L81j74j15r0M22j01l68k11J73M74l84j0J99
5893A22j6Q5m60K15m9K79j94K88l27j67O2L52k92r3J40M97l71j40NJ38K8j33J51
5916A20j87j32p7M43j33n32J36N82m3k76K1L72j53l07j1M61m38j52L01L50o21
5937b76L25M2J88k51j69p5J67k33o2L49j21O0K20k38lJ51Lq8J06q9N4L4J04k74
5961g6r8K17L9k45J41K5L39k01o7Nk07kJ89M9j30j24J66M9j08j22K22Q8J22k64
$$ plain form
5985 7 -157 382 33 -89 49 34 -267 -13 247 187 -34 -164 268 -88 -224 5 63 -170 -73 135 -116 -81
6007 -81 -83 299 18 161 -476 5 188 -37 -86 -38 267 -3 -127 189 -14 -106 -4 52 -34 -300 -116 231 136
6030 136 -134 -143 386 -185 -112 -312 292 -82 -195 26 154 132 6 53 -76 -105 -248 108 -38 -294 -328 113
6052 113 102 124 -56 173 177 -95 -272 462 -54 -120 -283 0 -177 -502 -77 -38 85 -32 -1 35 197 387 -70
6075 -70 238 179 -77 215 196 -229 210 50 170 -38 -113 314 104 -107 -416 125 235 -80 -91 -222 -131 -322
6097 -322 -97 269 311 -80 -320 123 67 77 -26 185 86 -314 47 152 156 -106 63 134 172 -74 -17 338 -37
6120 -37 82 388 285 11 -217 330 74 69 49 297 261 -468 -108 274 441 -130 -69 -35 -91 -70 -74 186 -81 8
6144 8 -13 307 22 -276 356 -54 -334 -87 51 96 -30 68 200 170 -204 -179 78 -43 -30 140 115 333 -5
$$ packed form
5985Gj64N39l49j22J38j5l01K54K60o0k21j30M32l56j36K29N8k33R7K08k51L5
6007h1kL82k81J43o37M81J83k25m9M8L05k70j24L16k03r2J02N6q6k66J84L47r5
6030A36k70rN29n71P3k00O04l74j13K21J28k2j26M7j29k9j43L56j46k56l4M41
6052A13j1K2j80K29Mk72j77P34n16o6j63K83j77l25M25L9J23j17L1L6J62J90m57
6075g0L08n9k56K92j9m25M39j60J20k08p5M27k10k11l09N41J10l15j1j31R1j91
6097c22K25L66M2l91k40M43n6J0j03K11r9m00L61J05Mk62J69P1L8k46N7L55l75
6120c7J19L06j03k74k28N47k56nk0K48l6p29L60L82J67n71O1L4n6K1mK60k67Q9
6144Hk1L20k85k98O32m10k80K47J38M5j26R8J32l0l74K5K57j21J3J70k5K18l38
$$ plain form
6167 -5 362 -71 -51 -9 60 322 -55 -76 233 236 -98 -363 52 69 -24 102 214 -400 -509 -406 -124 83 -311
6190 -311 -223 -15 265 125 -235 280 158 -212 -16 140 55 64 -92 336 -153 87 -105 96 291 -140 197
6211 197 234 -395 -241 134 -83 124 88 -70 -215 -51 43 -257 -221 -319 264 233 -190 85 -31 230 -15 -267
6233 -267 111 13 -14 -275 -319 24 119 -410 -2 164 -107 -163 -23 258 -51 55 -106 12 -152 -7 -110 -144
6255 -144 -11 162 113 188 -102 121 389 -203 169 111 112 65 61 -123 377 -62 -205 -52 158 140 -1 136 -40
6278 -40 -7 -307 -108 210 -236 -157 113 -163 -395 -326 -16 364 137 -142 71 -38 -530 -104 293 -109 -81 -160
6300 -160 206 -130 -116 308 200 -99 -23 70 358 26 -220 23 151 -233 -315 -38 -18 -136 189 368 81 181
6322 181 245 70 167 -140 24 302 15 126 107 -133 102 -160 -153 12 -58 97 55 82 75 -192 119 159 -192 -135
$$ packed form
6167eL67m33K0M2O9K62l77k1L09Ll34k65M15J7r3J26J12o14j09J03K82K07l94
6190c11Q8K08K80j40l60N15j22l70J96J56q5Rj56M28m89K40j92K01J95m31L37
6211A97L7o29J54L75k17K07l6j58j45J64R4l00L6r8N83l1m23K75j16K61k45k52
6233b67L78r8k7k61m4L43R5n29M08J66k71n6J40K81l09J06j61J18j64J45j03l4
6255a44J33J73m9P5k90K23K68n92L72n8Jm7mj84N00m39j43J53K10j8j41J37j76
6278d0L3l00J99L18m46P9K70k76k32O9L10L80k27k79K13j09m92M26L97m02K8p9
6300a60L66l36J4M24j08k99P6R3K88l32k46K43J28l84q2K77K0j18L25J79k87J00
6322A81O4j75R7l07J64K78k87J11j9k40K35k62PJ65p0J55m2K7pk67L11M0l51N7
$$ plain form
6346 -135 125 -19 -132 -161 -17 -37 63 50 91 52 -186 56 210 -38 -145 -341 -113 174 -22 -36 -50 -128 -214
6369 -214 173 -80 162 -162 112 439 -262 -22 112 183 -245 -202 233 -54 -274 -91 -169 46 -18 -31 -23 129
6391 129 217 12 -36 179 199 300 228 -182 -298 97 302 159 -92 -92 122 29 7 183 71 -233 18 -47 -127
6414 -127 -214 -196 321 -45 -143 -2 11 0 158 -2 139 -119 -281 220 48 66 -386 23 -120 -102 51 9 46
6437 46 28 -187 109 258 -94 -231 158 271 -27 -81 30 11 -253 438 208 192 -241 -59 54 -152 -57 -137
6459 -137 2 -217 324 250 126 -180 -299 -89 -24 -116 -30 170 123 110 30 -59 -54 -370 -198 146 -133 -356 -24
6482 -24 327 170 -50 -191 99 -33 123 -109 224 -173 -88 -145 -11 9 -5 160 -156 -153 27 56 328 -11 -268
6505 -268 -235 41 -171 -196 189 -32 -103 -74 47 241 115 33 -3 -141 -100 68 177 129 -154 136 109 164 -31
$$ packed form
6346a35K60j44j13k9J44k0J00j3M1l9k38K42J54k48j07j96K28K87j96j4j4p8q6
6369b14L87k53K42l24K74L27p01K40J34P1m28M3M35k87k20J83p8K15o4j3QJ52
6391A29Q8k05m8K15K0J01p2m10j16L95K05j43k51%K14r3k2J76j12l04K51o5q0
6414a27q7J8N17l66r8J41J3j1J58j60J41k58j62N01j72J8m52M09j43J8J53m2L7
6437D6j8k15K96J49l52j37L89J13k98n4J11j9k64O91k30j6m33J82J13k06R5q0
6459a37J39k19N41p4j24l06j19K10O5r2Q6K00m7j3q0q9Nl16J72L44k79k23L32
6482b4L51j57k20j41K90j32J56k32L33l97Q5n7J34K0j4J65l16LJ80K9K72l39k57
6505b68L3K76k12k5L85k21p1K9J21J94j26q2l6j38M1J68J09m8k83K90k7N5j95
$$ plain form
6528 -31 -137 -8 -213 -125 59 77 4 -220 71 -44 -91 -98 471 99 -209 27 -162 13 114 125 231 1 114
6551 114 -105 -190 136 121 224 38 -134 78 140 -225 -144 -36 -143 104 146 -273 132 -21 -98 -250 -33 -58
6573 -58 -249 202 392 -46 -136 -182 98 74 199 -36 -238 -63 -124 111 57 -357 -86 -127 -15 110 -157 416
6595 416 270 60 -431 -32 -22 -114 -92 7 148 -34 -206 389 160 -286 -120 50 303 -319 -232 183 -254 -267
6617 -267 253 202 -24 -273 303 70 -149 116 53 74 -210 -170 170 311 -187 -7 85 23 97 174 249 -131 -146
6640 -146 54 116 -350 -199 -83 282 311 67 -115 -50 -39 130 -81 -97 47 -199 -189 174 -121 -239 -107 47
6662 47 -59 -152 322 121 -102 209 328 89 -95 -312 83 -30 65 79 114 -232 126 169 418 -56 -146 -213 247
6685 247 -159 -304 143 236 73 -319 226 -84 74 -36 -220 138 -28 -244 -50 109 -57 62 107 -119 -122
$$ packed form
6528c1j06J29k05Q8J84J8p3k24K91j15m7pN69l72l08K36j89J75J01J1J06k30J13
6551A14k19q5L26j5J03j86j72K12O2l65Q1J08j07K47M2m19M05j53p7j52K17k5
6573e8j91M51J90m38r0m6K80k4J25k35k02J75o1K35n4m14K71m1J12J25k67N73
6595D16j46k10m91L99J0r2K2R9J41j82j72N95k29m46J66J70K53o22Q7M15m37j3
6617b67N20n1k26k49N76k33k19K65o3K1k84M0L40J41m98J80R2o2P4P7P5l80j5
6640a46K00O2m66J51J16L65K9k44j82O5J1J69k11j6J44k46J0L63k95j18J32J54
6662D7j06r3M74k01k23L11J19k39j84k17L95j13R5J4L5l46L58M3K49m74r0o7M60
6685B47m06j45M47R3j63l92N45l10J58j10j84L58j66k16J94J59j66J19M5k26l
$$ plain form
6706 -122 -278 57 -39 -2 -350 202 -253 -285 -110 194 -4 -136 -130 145 105 -50 428 -6 196 -26 334 128
6728 128 -48 -31 279 56 -294 -225 68 151 -71 -163 331 231 -132 -159 -9 -211 -186 176 3 130 45 -115
6750 -115 -49 0 -428 -70 -114 47 -107 -248 84 -11 -208 137 23 256 144 -121 398 -97 115 -133 -186 -159
6772 -159 -123 26 264 -136 -12 -14 -46 72 -22 133 -300 16 -92 101 -46 -79 10 220 -115 -193 -125 78 -120
6795 -120 -285 -271 -240 49 -205 -48 88 -258 3 205 123 74 215 333 122 -125 68 177 -108 -180 116 36
6817 36 -203 -1 -286 305 199 203 158 165 74 -24 -54 130 123 255 -341 93 -98 -425 351 -372 -90 48 -14 -71
6841 -71 -222 -251 -66 -159 52 109 181 -137 336 89 -157 -140 -280 -68 89 -150 -103 16 192 -247 81 137 -20
6864 -20 -11 23 -55 -110 -11 -286 60 -240 -131 133 338 8 -146 -74 -193 -145 -180 -39 -198 -82 -6 -130 -75 43
$$ packed form
6706a22j56L35r6L7l48N52m55l2J75L04j98j32OK75m0j55M78m34K02k22L60k06
6728A28j76J7L10k23l50O9K93Q3k22r2M94j00l63k7J50k02K5L62j73J27q5j60
6750a15O6M9m28L58m4J61j54j41L32r5j97L45j14K33j12k65N19m95K12k48n3K7
6772a59L6J49K38m00J24kl2J18r4J55m33L16j08J93j47l3Q9K10l35p8O8K03j98
6795a20j65J4L1K89k54J57J36l46K61K02q2m9J41J18k11k47J93J09k85p2K96q0
6817C6k39K02k85N91j06Mm5Pr1r8l0J84pJ32n96M34j91l27P76p23K82J38o2n7
6841g1j51k9J85r3K11N7P2l18M73k47k46J7j40K12J57k39M7J19J76m39L28N6j57
6864b0RL4p8n5R9k75L46l00J09K64K05l30j54P2j19M8l5J41j59J16P6j24N5J18
$$ plain form
6888 43 -104 139 42 363 110 62 185 -138 67 48 -84 -79 -174 173 -143 -200 43 324 183 -228 323 240 6
6911 6 -65 100 344 -313 -531 188 75 -204 -376 89 70 -6 -157 -88 283 -336 64 10 157 279 -70 -38 -5
6934 -5 -265 -18 167 -361 -115 -26 91 36 -219 131 -61 -39 -265 -148 463 -153 -129 137 169 -275 183 -67
6956 -67 307 200 -44 237 281 29 -19 -35 -40 54 29 -48 43 70 -88 90 185 -125 -141 -69 -302 -623 -163 -146 -49
6981 -49 -74 308 -129 204 96 228 45 -9 46 208 223 -10 -126 -314 24 -131 82 -237 245 -265 17 -150
7003 -150 25 -373 -47 -41 -5 -231 -119 -75 -35 -7 165 414 280 178 -40 -125 -63 -57 62 66 -64 57 -60 23
7027 23 77 -57 258 -35 -227 -208 219 223 -6 77 -16 66 -282 -133 -163 -96 -168 -76 188 -50 -547 267 251 -89
7051 -89 203 42 219 -167 89 276 -62 -27 68 15 43 -236 36 215 122 -319 -37 -169 -87 103 41 66 85
$$ packed form
6888D3j47K43r7L21k53m8J23l23K05j9j32Nr5L47l16n7K43K81j41m11N51q3k34
6911Fp1J65K44o57k18P19j13k79j72M65j9p6j51O9L71o19M00n4J47J22l49L2L3
6934ek60K47J85n28K46Q9J17n5k55L50j92K2k26J17O11o16K4K66L2m44M58k50
6956f7L74j07k44K81M4k52m8j6nR4k5p7R1K7j58J78R5l10j6P2k33l21M60J7R7
6981d9k5L82m37L33j08J32j83n4N5J62J5k33j16j88L38j55K13l19M82n10K82j67
7003a50J75l98L26OL6k26J12M4M0K8J72K49j34j02k18q5O2OJ19Mj30J21j17Q3
7027B3N4j34L15k93j92J9M27Mk29Q3r3Q2l48J49l0O7p2R2K64k38m97Q14j6l40
7051h9K92j61J77l86K56J87l38L5R5n3K8k79K72J79r3m41K82j32Q2J90o2K5J9
$$ plain form
7074 85 80 -29 80 -95 -191 78 77 -138 65 16 278 19 -129 128 -107 36 63 -74 -32 -110 -75 122 21 172
7098 172 -219 234 231 172 -38 197 -33 -33 53 -264 1 -183 60 30 -94 -121 59 33 82 -130 301 27 -270
7121 -270 -50 282 -44 -32 130 -47 75 -339 89 -3 -46 -50 -247 -133 -133 38 89 9 -175 -193 90 328 -341
7144 -341 -344 14 -39 -23 -95 180 -74 -37 132 -71 -14 -180 -149 185 65 -101 52 -6 106 -185 5 -85 53
7167 53 -61 -4 120 -28 -126 112 -30 -190 -134 41 171 -13 -17 231 137 2 1 -30 17 239 36 98 -186 -208
7191 -208 -95 125 -62 -267 396 298 -80 -44 90 -80 -6 98 -188 -52 160 -40 9 -161 59 -259 -24
7212 -24 145 -254 31 -29 42 135 12 188 -90 -233 -347 415 -453 -315 289 143 236 -140 -231 -11 -293 -195
7234 -195 160 317 -107 -118 272 265 -20 -27 218 211 66 -78 172 -38 -90 -11 185 124 -140 -161 -65 -167 -3 -2 -100
$$ packed form
7074H5nj09J09j75r6K69jk15K03m9K62k59j48K57k35J43K7j37M2p8L5J97j01J51
7098A72l91M53ln9k10K35k30%Q6l17K65j84K43l0j24k7J80k6M9k12M31k74k97
7121b70K20L32l26J2J62j77J22m14M28r2m3mj97J14%J71N1q0j84j8K83K38o69
7144c41lL58n3J6p2K75k54L7J69k03N7j66L1L34j20j66J53n8J12k91J90r0J38
7167E3j14N7J24j48r8K38j42j60N6J75J30j84mK48r4j35jl1M7K22k03O2k84k2
7191b08J13K20j87k05O63r8l78L6J34j70P4J04k86J36K12k00M9j70K20l18K35
7212b4J69l99K85o0P1R3j23J76k78j43j14P62q68J38O04j46R3l76r1K20k82R8
7234a95L55J57m24j1L90pk85pK45pj45j44K50k10n2P9J96o1k64k1R6j02J64Jr8
$$ plain form
7259 -100 77 -261 191 263 149 -584 -62 -131 88 48 80 -123 -5 -92 -347 -328 -9 235 223 -304 24 -225
7281 -225 143 -66 -336 -45 330 74 18 -153 -99 60 91 -5 -24 -173 43 61 -135 -162 -247 252 -132 -111 -187
7304 -187 -338 -35 -15 -209 36 -177 -156 90 246 -159 -143 -71 89 126 -163 -185 122 241 185 -296 119 -98
7326 -98 164 62 212 35 -115 -36 241 175 -138 -132 -73 -284 -149 7 20 -26 19 161 -73 -94 8 417 -111
7349 -111 -60 -346 143 229 211 -272 -281 -154 -200 -100 -47 -34 -204 190 -78 18 -200 30 108 315 96 -140 -120 -5
7373 -5 143 -39 161 -203 2 -64 -109 -107 169 209 -97 -348 145 -70 31 63 -33 237 254 8 144 64 92 88 -7
7398 -7 -5 -91 -33 -117 225 -86 -154 -90 308 -99 -90 64 0 291 121 208 -236 -14 -65 42 -5 23 -263 44 284
7423 284 -20 102 389 286 -214 -21 282 53 -104 124 0 49 109 -60 183 24 145 -242 -26 34 -88
$$ packed form
7259a00J77l38M52P2j14p33N22o9K19m0L2k03J18q7k55J9L19K44j2n27L28k49
7281b25L68k09k70K91L75k56n6j71N4J59L1r6j9j49K16J8j96k7q5M99l84K1p6
7304a87j51L03K0j94K45k13K1K46J56m05J6P2J60L7k89k2L07J19n6m81M15k17
7326i8K62j02J50j77j50P9K77o6l13ON9k11J35J56J3m6M5J42k34k1J02M09n28
7349a11N1k86M89Q6j8m83rJ27m6J00N3J3j70L94k68R6k18K30P8K07k19k36K0J15
7373eJ48j82K00l64K05o6m5KK76M0l06k51M93k15J01L2r6K70J7k46J36q0K8mr5
7398gKq6N8q4L42l11o8O4L98m07RJ54o4K91j70Q7m44K22n1J07m7K8k86L07K40
7423B84l04J22K87j03n00J93L03k29j57K28j24M9O0j69K43j59J21l87K16O0j22
$$ plain form
7444 -88 200 -89 -5 -42 416 -392 143 274 28 -150 -13 -15 206 96 -1 -20 159 -84 83 198 -76 -197
7466 -197 254 197 231 130 -140 242 103 -35 36 95 127 -182 -272 -188 85 -453 -18 214 -120 -122 229 51 13
7489 13 -30 93 352 -203 -297 86 -51 -113 -12 35 369 -106 19 -80 -2 -30 -112 267 140 52 12 -10 69 2 19
7514 19 -42 17 88 258 195 -131 -138 -99 196 -27 -322 -9 2 -299 68 205 257 -10 -153 -126 60 -167 -190 -192 205
7539 205 9 -24 82 -50 -417 -134 -8 298 -147 -193 150 21 -143 263 177 -109 -48 97 30 120 -273 -52
7561 -52 62 34 -105 65 -90 -70 -261 -39 -226 -426 318 189 98 23 385 280 253 3 33 198 -113 31
7583 31 -137 351 4 -104 -178 -75 23 104 48 -22 -151 -53 34 46 -56 105 167 63 8 35 118 -27 -104 -278 30
7608 30 -26 -16 237 20 49 59 358 85 -227 -22 218 189 80 10 60 -79 -230 -372 -164 -27 20 100 -88
$$ packed form
7444h8K88k89Q4l7M58q08N35J31k46j78J37kK21j10r7j9J79k43J67J15k74j21
7466a97M51n7L4j01k70L82j39j38P1N9L2l09r0Q4K73n38M35K32l34kL51j78l8
7489A3m3J23K59n55r4L83j37o2J01M7L34m75J25r9P8k8q2L79j27q8m0k2P9o7J7
7514A9o1N9P1J70o3l26pL9K95k23k95L13J1l01L67J37N2k67j43K7J86k27k3kL97
7539B05j96l3J06j32l67K83J26L06m45m6L43j29j64M06q6k86O1J45o7R0l93K21
7561e2J14k8j39J70j55K0j91K22j87k00P44j29r1p5L62j05k7k50L0J65l11J44
7583C1j68M88l47j08p4J03R8Q1n6p0j29R8Q7J2j02J61O2j04n5K7Q3j45p7j74L08
7608C0n6J0K53k17K9J0K99k73l12K05K40k9j09p0N0j39j51j42K08J37M7Q0j88
$$ plain form
7631 -88 -291 146 -137 286 -95 117 -30 -189 -40 132 -193 -95 172 -28 262 127 -183 -354 202 175 59
7652 59 17 -143 92 226 -169 41 119 -52 -341 97 -57 118 348 -27 -35 -299 -89 74 -209 -207 -134 -71 157
7675 157 -325 -160 148 2 90 239 342 -143 43 233 -5 -289 -80 -121 136 -117 -293 21 316 -8 -35
7696 -35 56 88 -162 276 107 -107 -150 12 154 -136 158 179 -225 -126 -68 -140 -108 67 -233 63 178 -161 13
7719 13 173 497 -22 -362 46 -7 -226 304 69 100 108 -66 29 -192 -66 59 -32 -121 84 -29 -72 -64 51 416
7743 416 266 -67 10 62 -199 -58 -281 139 218 314 117 -87 -241 25 -114 34 313 186 -2 10 78 -275
7765 -275 154 163 -64 -313 -244 -51 -223 -216 -152 203 -78 -137 4 -99 -67 -61 75 99 -85 96 -2 179 41 -46
7789 -46 -188 232 -91 -345 -108 -243 -123 67 -109 205 -11 -96 -4 -51 399 130 -168 -156 -204 -236 128 -79
$$ packed form
7631h8k03M37k83M23l81K12j47j59J49J72l25R8K67k00K90j35l10j71N56k7j16
7652E9m2j60K35J34l95K10P8j71k89M38j54J75K30l75qk64K10J63k83KP3O3K28
7675A57m82J65L08j46Q8J49J03m85J86J90k38k84K09m1K57k53j76L14K95l24k7
7696c5R1L2k50M38j69k14m3J62J42k90K94K1m04R9N8p2L2J75l00K96J15l39J74
7719A3J60L24n19l40M08n3k19N30k35L1Qj74R5k21J26J25r1q9K05j13m3QJ15L65
7743D16j50l33P7N2k61J41k23M20P9R6j97k04j54K66j39J48K79j27j88J2O8l53
7765b75M29Rk27k49O9J93j72PO4L55k81n9J41j03L2OJ36K4j84J81r8J81j38q7
7789d6j42M20l23k54K37j35J20J90j76L14k16q5R2m7M50k69k98J2m8l2L64k07
$$ plain form
7811 -79 -109 205 62 278 111 96 93 -187 -13 -4 336 32 -219 -33 163 -75 -374 -221 67 93 344 -131 216
7834 216 -148 -26 -97 134 151 63 211 -125 -68 -151 183 -57 91 -79 15 -308 23 -148 168 -24 -32 181 256
7857 256 210 -62 479 247 -221 -9 181 51 86 67 88 -190 150 -229 267 -174 -261 221 -92 -23 1 236
7879 236 -128 -174 40 256 -66 -112 7 179 78 222 76 19 -75 -22 61 154 -122 -42 -119 53 -267 -289 -157
7902 -157 -40 100 -216 20 167 35 7 189 -344 89 -211 -111 254 -51 109 78 -73 -84 157 -113 267
7923 267 -55 52 105 -6 -47 89 -9 71 33 175 -31 -58 428 105 -21 14 -153 68 -38 199 21 109 169
7946 169 -157 -102 -152 -196 -10 41 305 131 195 14 210 -170 -151 6 173 393 -240 327 -176 137 216 38
7968 38 50 -32 -72 11 6 54 -348 356 293 -248 -160 106 -84 69 -71 196 18 140 -254 153 65 60 -210 -14
$$ packed form
7811g9l0L14j43K16j67j5lk80J74RL40l04k51J86J96k38k99J53K88K6K51m75L47
7834B16l64J22p1K31J7q8J48l36N7q3L34k40J48j70R4l23L31j71L16j92qK13P5
7857B56m6k72N41k32m68K12J90j30L5j9K1k78L40l79M96m41q7M82l13O9K4K35
7879B36l64m6K14K16l22m6J19J72j01J44j46n7r4N3Q3R3k76Q0p7J72l20k2J32
7902a57J17J40l16K36J47j32k8J82n33M33l00J00L65l05J60l1j51j1K41k70L80
7923B67l22J07N3j11m1J36r8Q0l8J42k06k7M86l23j26L5j67K21j06K37j78Q8O0
7946A69l26N5n0m4J86N1K64j74O4j81J96l80J9J57J67K20o33N67n03L13P9j78
7968C8J2q2m0Q3nM8m02P04o3n41Q8K66j90J53j40K67j78J22l94M07q8nk70J96
$$ plain form
7992 -14 -124 246 -250 172 -14 127 369 219 -29 -306 -214 -32 236 31 -41 278 115 -109 -19 371 -138
8013 -138 87 134 16 -127 -109 295 66 -222 -88 48 267 39 94 -116 123 176 255 85 -8 41 -188 26
8035 26 -199 198 -186 128 60 -165 229 222 -223 66 159 -390 -92 159 62 1 -393 -73 48 -110 -89 -56 216
8058 216 61 -163 -57 5 -117 -11 -292 164 189 -92 195 0 -42 145 3 144 -229 259 113 -45 -67
8079 -67 -284 197 -126 88 48 201 -229 -229 -117 38 -60 -279 34 -39 -160 -80 -24 132 190 145 152 52 -32 -69 212
8104 212 283 -86 -288 -72 -18 213 -143 260 81 -407 -106 143 235 -165 24 62 24 116 17 -106 79 10 382
8127 382 85 -355 -198 -157 4 188 32 -184 47 122 137 -159 -33 38 -409 330 -168 -89 237 -76 -215 71
8149 71 -42 -191 -42 -133 -25 -13 -9 -394 -273 51 -197 -37 -44 72 -86 -53 40 5 76 60 -43 70 -285 64
$$ packed form
7992a4j10L70m96M22j86J41K42j50k48k77R2J82K68k05p2L19j63k24R0L90n09
8013a38K25M7j18j43J8M04k29k88J34J36K19k28N5k10K39N3P9j70r3M9k29K14
8035B6k25L97l84L14o8k25L94pm45K89R3n49K98K51r7o1l94L20J21j58K1L3K72
8058B16j55k24J06O2j22J06k81M56K5k81K87j95m2J87j42J41l73M88j46j58k2
8079f7k17M81l23K14m0J53m30%J12J55r8k19L13p3j21Q0N6J56N8m5Pj00q4l7K81
8104B12P1l69k02K16N4K31l56M03j79m88L01K49R2m00J89L8l8R2r9j23J85o9L72
8127C82k97m40J57M1J61J84j56k16K31P5J5k96J26P1m47P39m98P9L26l13j39K86
8149G1j13j49J49r1J08J2Ml85J21L24k48J60pJ16j58L3R3l5P1j6j03J13l55L49
$$ plain form
8173 64 -286 72 147 -121 28 83 -297 -65 -39 165 145 -109 37 68 89 -77 -71 126
$$ packed form
8173F4l50L58P5k68J49N5l80K32K6K04k0k54J46L1K1j66OJ97
8191A26
$$ Imaginary data points
##PAGE= N=2
##DATA TABLE= (X++(I..I)), XYDATA
$$ plain form
0 0 0 0 0 0 0 0 0 1 0 8 -8 8 -8 16 -16 16 -24 27 -32 39 -45 49 -57 69 -77 87 -101 115 -129 146 -164 183
32 183 -205 230 -255 285 -317 351 -390 431 -479 529 -584 647 -718 798 -887 990 -1106 1246
50 1246 -1410 1609 -1857 2174 -2599 3190 -4083 5580 -8551 16741 -86243 -292225 -96780
63 -96780 155158 173051 -22172 -109593 -2234 137123 109188 -41072 -125343 -14399 155261
74 155261 152822 -44776 -170992 -63506 109007 96331 -48015 -92982 10661 87198 36236
85 36236 -57532 -76486 -15559 51020 46841 -24193 -70169 -19424 49901 20604 -67023 -60440 43558
98 43558 85461 5283 -64992 -26057 47317 50399 2304 -19342 6668 43290 40850 -16917 -70163
111 -70163 -34562 59205 72902 -30527 -102074 -32527 68124 50159 -41434 -63083 4547 54347
$$ packed form
0@%%%%%%%JjQj6J6j6K4l2L2m0N1n9P1q4R4j06J26j46J64j88K16k44K75l10L47
32A83l88M35m85N40o02O68p41Q21r10J008j113J231j365J516j685J877k096K352
50A246k656L019l466M031m773N789p273R663j4131K5292j02984k05982J95445
63i6780K51938J7893j95223q7421J07359J39357k7935j50260q4271J10944J69660
74A55261k439j97598j26216J07486J72513j2676j44346m4967J03643P6537n0962
85C6236r3768j8954O0927O6579m179p1034m5976N0745O9325k9297q7627O583J03998
98D3558M1903q0178p0275L8935P3374L082m8095k1646K6010L6622k440n7767n3246
111g0163L5601R3767J3697j03429p1547O9547J00651j7965r1593k1649O7630M9800
$$ plain form
123 54347 27434 -30531 -50982 -9286 54874 58524 -21566 -81413 -23706 76602 70199 -32494
135 -32494 -78149 -11640 55633 35819 -21180 -37636 -6794 29431 30043 -16477 -59863 -27133
147 -27133 54991 65747 -23318 -84403 -27903 54453 42662 -27586 -44166 2449 35865 17669
159 17669 -23203 -41193 -10701 43353 50619 -12908 -59494 -11256 62156 45471 -33393 -46393
171 -46393 24076 64437 21581 -34518 -34985 4196 32167 23341 -15657 -39560 -8160 40581 24779
184 24779 -43963 -57440 15902 66413 19352 -49097 -43113 11641 33506 8477 -20640 -22643
196 -22643 783 24105 10786 -34005 -43853 12213 55403 12647 -53598 -40836 27302 45150
208 45150 -1810 -30995 -6839 21903 17195 -7264 -22915 -12004 21186 37052 651 -44975
$$ packed form
123E4347k6913n7965k0451M1696O4160L650q0090n9847N7707J00308o403j02693
135c2494m5655O6509O7273j9814n6999j6456L0842L6225O12m6520m3386L2730
147b7133Q2124J0756q9065o1085N6500Q2356j1791p0248j6580M6615L3416j8196
159A7669m0872j7990L0492N4054P266o3527m6586M8238P3412j6685p8864j3000
171d6393P0469M0361m2856n6099m67L9181K7971q826l8998k3903L1400M8741j5802
184B4779o8742j3477P3342N0511m7061o8449N984N4754K1865k5029k9117k003
196b2643K3426K3322j3319m4791r848N6066M3190m2756o6245J2762O8138J7848
208D5150m6960k9185K4156K8742m708k4459j5651J0911L3190J5866l6401m5626
$$ plain form
220 -44975 -25742 36816 44909 -14130 -43752 35 40692 15190 -28788 -27092 7286 26536
232 26536 15392 -13493 -32766 -14443 27188 30038 -19668 -46304 -280 47525 21297 -36909
244 -36909 -36421 13128 34578 8265 -18243 -17575 1040 18944 14938 -14045 -29619 3811 44835
257 44835 25181 -30846 -35272 17931 43134 8016 -23732 -8854 17447 16207 -481 -11219
269 -11219 -8903 7419 25005 13411 -22233 -27769 11676 34409 2055 -32367 -13961 18517
281 18517 10264 -17916 -20857 -3995 3314 -114 -4770 -13977 -16562 3046 21150 3936 -23727
294 -23727 -11934 23266 23778 -8578 -16354 8174 19549 4699 -6981 -3015 563 3513 9453
307 9453 2787 -16902 -15353 13211 21403 -8489 -25985 -1097 22542 6999 -16012 -9713 7314
$$ packed form
220d4975J9233O2558Q093n9039k9622M3787M0657k5502m3978J696L4378J9250
232B6536j1144k8885j9273J8323M1631K850m9706k6636M6024M7805k6228n8206
244c6909M88M9549K1450k6313k6508O68J8615J7904m006k8983j5574L3430M1024
257D4835j9654n6027m426N3203K5203l5118l1748J4878K6301j240j6688j0738
269a1219K316J6322J7586j1594l5644n536L9445K2733l2354l4422J8406L2478
281A8517q253k8180k941J6862P309l428m656r207k585J9608J8104j7214k7663
294b3727J1793L5200N12l2356p776K4528J1375j4850j1680L966L578K950N940
307I453o666j9689J549K8564Q192k9892j7496K4888K3639j5543k3011O299J7027
$$ plain form
320 7314 7844 1380 -272 -5660 -8586 5136 16655 171 -20403 -5524 22823 15363 -15373 -17262
334 -17262 6951 14207 -19 -6644 -1701 -1837 -2257 4157 514 -14684 -10659 13910 16962 -11709
348 -11709 -23391 2485 21683 5305 -12425 -2805 11611 8354 376 -1353 -2931 -1535 11310
361 11310 15523 -4746 -19479 42 22140 6085 -21733 -13103 15361 15353 -8430 -15697 -3189
374 -3189 4155 2368 -359 -6815 -13194 -3452 12816 3295 -21881 -18597 11885 18905 -8376 -21442
388 -21442 9 17171 6201 -7149 -3896 3514 6794 10610 7713 -6494 -8708 11767 21620
401 21620 -817 -18939 -621 22850 10662 -14703 -11681 7879 9416 -1531 -5620 -4226 -4026
414 -4026 1932 7628 -3480 -17468 -5864 16916 10144 -15792 -15533 11207 17490 -3786 -13931
$$ packed form
320G314N30o464j652n388k926J3722J1519j6484k0574J4879K8347p460l0736j889
334a7262K4213P256j4226o625M943j36m20O414l643j5198M025K4569L052k8671
348a1709j1682K5876J9198j6378j7730R620J4416l257p978j729j578J396J2845
361A1310M213k0269j4733J9521K2098j6055k7818Q630K8464qk3783p267J2508
374c189P344j787k727o456o379R742J6268r521k5176L284L0482P020k7281j3066
388b1442K1451J7162j0970j3350L253P410L280L816k897j4207k214K0475R853
401B1620k2437j8122J8318K3471j2188k5365L022J9560J537j0947m089J394K00
414d026N958N696j1108j3988J1604K2780o772k5936K59K6740O283k1276j0145
$$ plain form
427 -13931 68 10620 5092 -431 -2238 -5449 -2526 8460 7237 -11545 -15907 6067 17287
440 17287 -3986 -21446 -5277 14891 7576 -8850 -6870 3166 4522 3991 4459 -2858 -7732 3540
454 3540 15906 3296 -16388 -7735 14991 11857 -10893 -13703 3905 10228 -756 -6927 -3884
467 -3884 -3306 -1270 5017 1442 -11948 -11181 7157 10725 -10667 -19063 1750 15322 780 -14096
481 -14096 -5766 6669 5361 1208 894 -1343 -2811 6701 12232 -1427 -12721 2728 20927 8758
495 8758 -14250 -9238 12110 13434 -2152 -6922 702 4117 2966 3664 -2244 -10187 -3183 12819
509 12819 7632 -13835 -16125 6817 14387 -5829 -18491 -4515 9689 4210 -5016 -6311 -4573
522 -4573 -742 7392 7129 -7213 -12027 6535 18708 1221 -17822 -5086 17331 12131 -8644
$$ packed form
427a3931J3999J0552n528n523j807l211K923J0986j223j8782m362K1974J1220
440A7287k1273j7460J6169K0168p315j6426J980J0036J356n31M68p317m874J1272
454C540J2366j2610j9684Q653K2726l134k2750k810J7608O323j0984o171L043
467c884N78K036O287l575j3390P67J8338L568k1392q396K0813J3572j4542j4876
481a4096Q330J2435j308m153l14k237j468R512N531j3659j1294J5449J8199j2169
495H758k3008N012K1348J324j5586m770P624L415j151O98n908p943P004J6002
509A2819n187k1467k290K2942P570k0216j2662J3976J4204n479r226j295J738
522d573L831Q134k63j4342m814J8562J2173j7487j9043J2736K2417n200k0775
$$ plain form
535 -8644 -11363 1751 7391 3172 -2001 -6757 -7686 2869 12514 1317 -16240 -7791 16172 14675
549 14675 -9889 -16437 5673 19110 5934 -8209 -5992 1832 5142 5357 -1062 -10838 -6659 10604
563 10604 11212 -11862 -22538 396 19928 5753 -17027 -12341 7386 10133 -1430 -7949 -6125
576 -6125 58 8976 9308 -5977 -16605 185 21069 11004 -14589 -12100 14649 21272 -83
589 -83 -12987 -2225 10625 11535 3852 -5130 -9742 -649 12733 5355 -16576 -17198 9018 19145
603 19145 -5472 -24969 -9499 13264 9023 -8934 -13455 -3989 5339 6808 -538 -12736 -11223
616 -11223 8667 18560 -1965 -21914 -6662 20371 16026 -10885 -15765 5292 17797 7523 -6143
629 -6143 -8472 -1788 9152 12180 -2107 -17108 -6252 16909 13516 -14683 -22330 3374 20397
$$ packed form
535h644k719J3114N640m219n173m756r29J0555R645j1197j7557Q449K3963j497
549A4675k4564o548K2110J3437j3176j4143K217P824L310K15o419r776M179J7263
563A0604O08k3074j0676K2934J9532j4175k2780M686J9727K747j1563o519J824
576f125O183Q918L32j5285j0628J6790K0884j0065k5593K489K6749O623k1355
589h3j2904J0762J2850R10p683q982m612R093J3382p378k1931o22K6216J0127
603A9145k4617j9497J5470K2763m241j7957m521R466R328J469p346j2198J513
616a1223J9890R893k0525j9949J5252K7033m345k6911m880K1057J2505j0274j3666
629f143k329O684J0940L028j4287j5001J0856K3161l393k8199p647K5704J7023
$$ plain form
642 20397 4621 -15584 -10990 5222 10355 3372 -5545 -8150 955 15031 13090 -9221 -17669 4284
656 4284 23158 7347 -17154 -11623 11615 13810 -5132 -15068 -7768 3097 7061 2377 -10064
669 -10064 -14955 -1155 14436 5011 -16514 -12221 13936 20309 -2861 -16781 -2924 13950 11881
682 11881 1316 -3744 -1784 4551 11424 4458 -11827 -11550 10255 20404 -1168 -21002 -8586
695 -8586 12907 9805 -9127 -13824 -2224 6240 4626 -3738 -13517 -12451 4320 15039 448 -18834
709 -18834 -9905 14913 14657 -10055 -17676 2740 17812 8789 -5795 -9064 -1240 7952 10614 255
723 255 -12009 -5223 14398 14583 -9872 -20197 1455 20994 8882 -12289 -10043 6191 10872
736 10872 2294 -6219 -7793 -142 10788 9670 -8683 -18690 -1837 17007 6684 -16941 -14226
$$ packed form
642B0397j5776k0205M594J6212N133o983q917k605R105J4076j941k2311q448K1953
656D284J8874j5811k4501N531K3238K195j8942r936P300J0865L964m684j2441
669a0064m891J3800J5591r425k1525M293K6157O373k3170j3920J3857J6874k069
682A1881j0565n060J960O335O873o966j6285K77K1805J0149k1572j9834J2416
695h586K1493l102j8932m697J1600Q464j614q364r779J066J6771J0719j4591j9282
709a8834Q929K4818k56k4712p621K0416J5072r023j4584l269P824R192K662j0359
723B55j2264O786J9621J85k4455j0325K1652J9539j2112k1171K246J6234M681
736A0872q578q513j574P651J0930j118j8353j0007J6853J8844j0323k3625K715
$$ plain form
749 -14226 8599 14667 -3060 -14514 -5643 6534 9366 3566 -6561 -10411 820 14160 6407
762 6407 -14308 -13175 10488 18448 -2660 -18572 -5608 12336 10369 -3572 -7814 -1925 5116
775 5116 8699 3121 -9226 -9474 8325 17005 117 -17326 -7264 12960 10804 -7864 -11812 502
789 502 8092 3796 -3587 -8017 -6763 2964 11321 1754 -14827 -10288 9816 12438 -6856 -15557 -46
804 -46 12780 5484 -6978 -8041 -384 5332 7693 1449 -7633 -5618 9649 13787 -3488 -15393
818 -15393 -636 17519 9254 -9750 -9339 5317 10117 2319 -4369 -4761 -712 6575 7622 -3272
832 -3272 -13052 -2867 13420 8700 -11212 -13003 4910 12137 -1243 -11309 -5187 3985 4537 752
846 752 -4683 -8103 -2438 8719 7128 -8243 -12658 4224 14300 985 -12912 -4989 10100 8573
$$ packed form
749a4226K2825O068j7727j1454Q871J2177K832n800j0127l850J1231J3340p753
762F407k0715J133K3663P960k1108j5912J2964J7944j967j3941m242N889P041
775E116L583n578j2347k48J7799Q680j6888j7443J0062K0224k156j8668l948J2314
789E02P590m296p383m430J254R727Q357r567j6581M539K0104K622j9294q701J5511
804d6J2826p296j2462j063P657N716K361o244r082K015J5267M138j7275j1905
818a5393J4757J8155q265j9004M11J4656M800p798o688l92M049P287J047j0894
832c272r780J0185J6287m720j9912j791J7913P227j3380j0066O122R172N52l785
846G52n435l420N665J1157j591j5371m415J6882J0076j3315j3897P923J5089j527
$$ plain form
860 8573 -3285 -6646 -1194 2892 5186 3540 -4643 -8346 1973 11615 2472 -12515 -7134 10455
874 10455 10819 -5010 -10022 207 6750 3005 -1218 -1983 -2083 1541 6909 3291 -8481 -8978 5188
889 5188 10585 -2761 -12557 -3297 6895 2169 -6909 -5652 -660 922 2381 1503 -4942 -7810 2160
904 2160 11305 2679 -9484 -3404 11249 9592 -4185 -6857 3496 8500 4312 -344 -1277 -1869 2351
919 2351 7201 1939 -8998 -6422 7715 9685 -5683 -12967 -983 8389 1451 -8096 -5103 962
933 962 2202 1120 -1122 -5957 -5364 4488 9151 -2013 -11241 -1504 11149 5032 -8797 -7076 4978
948 4978 7429 -113 -4076 -2428 -496 2990 5080 -520 -7933 -1276 10650 6767 -8134 -9163 5602
963 5602 11475 -511 -8495 -1240 5924 3514 -855 -2216 -2573 -468 5267 4647 -5554 -8687 2540
$$ packed form
860H573j1858l361N452M086K294j646q183l703J0319R642r143j4987N381J7589
874A0455L64j5829n012J0229O543l745m223p65j00L624N368l618j1772m97J4166
889E188N397j3346r796R260J0192m726r078J257M992J582J459q78o445k868R970
904B160R145q626j2163O080J4653j657j3777k672J0353N004m188m656r33n92M220
919B351M850n262j0937K576J4137J970j5368p284J1984R372o938r547K993O065
933I62J240j082k242m835N93R852M663j1164r228R737J2653o117j3829J721J2054
948D978K451p542l963J648J932L486K090n600p413O657J1926l883j4901j029J4765
963E602N873j1986p984P255P164k410m369j361l57K105N735o20j0201l133J1227
$$ plain form
978 2540 9700 -222 -10130 -3406 7286 3679 -4936 -4689 831 2029 962 1044 -1858 -6077 -741 6967
994 6967 2260 -8244 -5430 6688 6929 -4173 -7515 1152 6207 1964 -1152 163 -368 711 4889
1009 4889 4596 -3408 -4594 5806 10248 -1340 -9183 -998 8140 2515 -5529 -3862 1206 664 -1665
1024 -1665 -1520 -3228 -5064 163 4987 -988 -9467 -4554 6374 4411 -6063 -6283 3712 5604 -586
1039 -586 -2885 439 868 840 3635 2781 -3454 -3486 5899 7311 -3288 -7864 2387 8185 755 -6497
1055 -6497 -1422 4143 2137 -508 -312 -1111 -1491 2187 5048 -1512 -6870 88 7997 2546 -7773
1070 -7773 -4375 5499 4990 -3224 -4563 661 1438 -474 -2 -750 -3438 -1679 4692 2892 -6224 -6322
1086 -6322 3931 6585 -2387 -6586 1212 5518 450 -2727 -502 894 158 2078 3488 -1769 -4735
$$ packed form
978B540P160r922r908O724J0692l607q615K47N520J198j067Q2k902m219N336P708
994F967m707j0504K814J2118K41j1102l342Q667N055m243l116J315n31J079M178
1009D889k93q004j186J0400M442j1588p843Q185R138n625q044J667N068n42k329
1024a665J45j708j836N227M824n975q479M913J0928j963j0474k20R995J892o190
1039e86k299L324M29k8K795q54o235l2R385J412j0599m576J0251N798p430p252
1055f497N075N565k006k645J96p99l80L678K861o560n358O958P909n451j0319
1070g773L398R874n09q214j339N224P77j912M72p48k688J759O371j800r116r8
1086f322J0253K654q972m199P798M306n068l177K225J396p36J920J410n257k966
$$ plain form
1101 -4735 2778 8034 214 -6950 -613 8254 3752 -4469 -3004 3410 2939 -820 -309 -72 -1711 3
1117 3 3371 -64 -6861 -3697 4773 3494 -6567 -7126 2433 4440 -3047 -5877 -192 2197 -67 -217
1133 -217 1206 -1384 -1456 3678 5241 -1752 -4346 3449 8436 917 -5535 -163 6357 2675 -3168 -864
1149 -864 2120 547 35 1168 -1346 -4253 -690 5371 626 -6746 -3256 5156 3211 -5303 -4814 2961
1165 2961 3637 -1573 -2324 129 -299 -723 1836 1358 -3586 -3328 3797 4725 -3888 -6475 1657 6128 -1100
1182 -1100 -5809 -400 3994 788 -2026 -55 950 -1003 1384 4211 -357 -4335 907 7106 1917
1197 1917 -5239 -1457 5845 3870 -3559 -2631 2440 2040 -988 15 -143 -2419 -1650 3070 1659 -5289
1213 -5289 -4893 3842 4363 -4329 -6365 967 4450 -976 -3911 -794 862 -616 170 1051 -2140 -3599
$$ packed form
1101d735P513N256p820p164O337Q867m502q221J465O414m71l759N11K37j639J714
1117CL368l435o797L164Q470j279j0061n59R559K007p487k830N685K389k264j50
1133b17J423k590p2N134J563o993k594P795M987p519o452N372O520l682n843K304
1149h64K984j573n12J133k514k907L563O061m745p372L490Q412j945q514M89P775
1165B961O76n210p51K453m28m24K559m78m944K58P125R28q613k587Q132M471p228
1182a100m709N409M394l206k814J971J005j953K387K827m568l978N242O199n189
1197A917p156L782P302j975p429R28N071m00l028J003j58k276P69M720j411o948
1213e289L96Q735N21q692k036P332L483n426k935L117J656j478P86Q81l191j459
$$ plain form
1229 -3599 2483 5352 -1096 -6007 592 7364 2676 -4406 -1185 5103 3897 -667 -526 1282 164
1244 164 922 3212 696 -4541 -1637 5185 2741 -5937 -5458 3477 4555 -2849 -5780 -614 1509 -524
1260 -524 -1178 -864 -2375 -1760 2802 3201 -3558 -5556 2879 7061 -529 -6673 -518 5983 2184 -3516
1276 -3516 -2650 1336 1052 1137 1285 -1524 -3365 1051 6390 573 -6756 -2315 7235 5605 -4340 -4803
1292 -4803 2897 5072 31 -2262 -664 410 1675 3198 436 -5535 -3569 4787 5400 -4500 -7613
1307 -7613 1380 6422 -781 -7440 -2872 2544 1821 -1140 -1836 -2239 -1808 2137 3760 -2261 -6012 1360
1323 1360 8188 2299 -6871 -3312 5797 5000 -2207 -3210 701 2556 1796 933 -1242 -3099 527 6579
1339 6579 3594 -5332 -4685 4846 6441 -2507 -6627 324 5170 1092 -3217 -2591 -1744 -747 1689 1046
$$ packed form
1229c599O082K869o448m911O599O772m688p082L221O288j206m564J41J808j118
1244A64P58K290k516n237K904O822k444q678M79Q935J078p404k931N166K123k033
1260e24o54L14j511O15M562L99o759j998Q435M182p590o144O155O501l799n700
1276c516Q66L986k84Q5J48k809j841M416N339n817p329M441R550j630r945m63
1292d803P700K175n041k293J598J074J265J523k762n971J966Q356O13r900l113
1307g613Q993N042p203o659M568N416p23k961o96m03M31L945J623o021l751P372
1323A360O828n889r170L559R109p97p207j003L911J855p60q63k175j857L626O052
1339F579k985q926O47R531J595q948m120O951M846m078m309O26Q47R97K436o43
$$ plain form
1355 1046 -4044 -5443 2294 6189 -1750 -8139 -1576 6624 3702 -4374 -4002 2033 3363 878 -224
1370 -224 -1195 -1569 2176 6035 685 -6001 -2540 7080 5885 -4092 -5638 2677 6228 526 -4351 -2034
1386 -2034 1009 1989 2080 92 -4157 -2937 4501 5617 -3581 -7646 1216 7872 989 -7083 -4085 3502
1402 3502 3730 -1361 -3111 -2408 -574 2334 2634 -3228 -7033 -424 7174 2394 -7430 -5532 4889
1417 4889 6038 -1695 -4868 478 4162 3135 810 -1440 -2462 522 6368 3717 -4790 -5330 4523
1432 4523 7658 -1596 -7463 -915 5816 2672 -2879 -3123 -613 578 1758 872 -3195 -4632 1711
1447 1711 5838 -906 -8296 -3183 6032 4609 -4630 -5337 1198 3212 0 -1957 -1748 -1251 1609 4529
1463 4529 1194 -5595 -2911 5666 6590 -2903 -6288 2112 7369 1342 -3973 -1956 1635 2228 1945 43
$$ packed form
1355A046n090j399P737L895p939o389O563Q200k922q076L72O035J330k485j102
1370b24r71l74L745L859n350o686L461R620j195r977j546Q315L551n702m877K317
1386b034L043R80R1j988m249J220P438J116r198m065Q862O656o883q072K998P587
1402C502K28n091j750P03J834K908L00n862l805O609P598m780r824J898J0421
1417D889J149p733l173N346L684j027k325k250j022K984N846k651q507n40R853
1432D523L135r254n867O548O731l144n551k44K510J191J180q86m067j437O343
1447A711M127o744p390N113R215j423r239p07O535K014l212j957K09M97K860K920
1463D529l335o789K684Q577R24r493l385Q400N257o027n315K017L591N93k83j902
$$ plain form
1479 43 -3521 -3280 2864 4816 -2471 -7515 -768 6877 2555 -6358 -5096 2566 4331 -269 -2834 -1966
1495 -1966 -462 2168 3534 -1281 -5730 -1299 6706 3949 -6109 -6787 3097 6810 -839 -6012 -1769
1510 -1769 3075 2509 66 -1919 -2583 -111 4898 3421 -4145 -5942 3470 8625 1196 -6377 -1763
1525 -1763 6421 4275 -2380 -3543 282 2514 2571 891 -2836 -4662 583 5545 167 -7566 -4005
1540 -4005 5057 4546 -4612 -6798 -210 4216 1121 -1981 -1768 -1005 844 3065 973 -4159 -3156 4577
1556 4577 6239 -2183 -6457 579 6173 2181 -3380 -2059 2142 2477 1286 404 -2131 -2210 2230 5335
1572 5335 43 -5992 -1653 5907 3317 -4989 -4589 2306 4152 -328 -2454 -2174 -1022 689 2431
1587 2431 -129 -4924 -2748 4396 4330 -4320 -6691 1419 6520 857 -4659 -2564 2158 2551 277 -880
$$ packed form
1479D3l564K41O144J952p287n044O747P645m322q913J262P662J765m600k565Q68
1495a966J504K630J366m815m449M431Q005k757j0058o78R884L713p649n173M243
1510a769M844n66k443j985o64K472N009j477p566j797R412N155p429p573M614
1525a763Q184k146o655j163L825K232N7j680l727j826N245M962n378p733L561
1540d005R062n11r158k186O588M426l095l102K13P63J849K221k092n132J003P733
1556D577J662q422m274P036N594l992n561J321M201L35j191q82k535p9M440L105
1572E335n292o035M339P560k590q306M00O895J846m480k126K80J152J711J742
1587B431k560m795K176P144o6q650k371Q110N101n663n516K095M722L93k274j157
$$ plain form
1603 -880 -2126 -844 3767 4222 -2420 -5965 834 7611 2348 -5813 -3643 4471 4537 -1702 -3831 -344
1619 -344 2171 2641 1669 -1432 -3722 -140 5251 2309 -5596 -3910 4659 5900 -2457 -6512 -761 3600
1635 3600 1077 -2204 -2889 -1234 -191 1257 394 -4356 -4371 2475 5796 -1284 -6508 -1165 5712 2984
1651 2984 -3424 -2549 2544 3194 829 -187 -1043 -1660 1919 4754 1277 -4795 -1799 4810 3591 -3635
1667 -3635 -4573 1679 4248 106 -2828 -1546 -168 177 1173 640 -3069 -2635 2814 3550 -2997 -5980
1683 -5980 91 5137 691 -4099 -2509 2083 1524 -781 -1019 -1158 -827 1932 3680 -546 -4227 -642
1699 -642 5566 2836 -3800 -3088 3549 4063 -979 -3245 -179 1362 1429 1134 -238 -2911 -1184 3544
1715 3544 2670 -3272 -4522 2512 5244 -1061 -5030 -1137 3422 1482 -1787 -1327 -324 131 1119 1211
$$ packed form
1603h80j246J282M611M55o642l545O799O777n263q161K170Q114O6o239k129L487
1619c44K515M70r72l101k290L582N391k942p905J686Q569J241q357m055N751M361
1635C600k523l281o85J655J043J448q63m750j5O846L321p080n224N343O877k728
1651B984o408Q75N093O50k365j016q56o17L579K835l477o072K996O609j219p226
1667c635r38O252K569m142k934J282J378L45R96n33l709M34N449P36o547k983
1683e980O071N046m446m790J590M592n59k305k38j39L31K759J748m226l681L585
1699f42O208k730o636P12O637N14n042k266L066J541O7k95j372k673J727M728
1715C544q74n942j250P034K732o305l969L893M559j940l269M60J003M55R88R2
$$ plain form
1731 1211 -2313 -4074 911 4590 -473 -5687 -2266 4244 2332 -3529 -3486 1388 2398 33 -486 -510
1747 -510 -965 832 3552 1379 -2900 -1780 4527 4488 -1924 -3840 1793 4561 56 -2894 -456 1138
1763 1138 255 -101 -89 -1860 -2425 1236 3197 -1838 -4729 -314 4091 618 -4538 -1992 2606 1812
1779 1812 -1576 -1598 -33 -272 319 1758 -40 -2727 -493 3816 2231 -3045 -2491 3067 3684 -1650
1795 -1650 -2658 662 2063 181 -272 648 -125 -519 1956 2064 -1380 -2983 1847 3806 -550 -4135
1811 -4135 108 3268 318 -2944 -1328 725 233 -686 349 -889 -2463 -178 2748 310 -3876
1826 -3876 -1425 3560 1930 -3310 -2371 2008 2150 -910 -1170 401 460 -113 1074 919 -1536 -1337 2662
1843 2662 3069 -1593 -2564 1568 3946 -300 -2655 457 3026 721 -814 445 396 -493 719 1947
$$ packed form
1731A211l524j761M985L679n063n214L421O510j912n861M3M874J010k365n19k4
1747e10m55J797K720k173m279J120O307l9o412j916N633K768m505k950K438J594
1763A138q83l56J2j771n65L661J961n035k891M415M405l473n156K546M598p94
1779A812l388k2J565k39N91J439j798k687K234M309j585n276N54N558O17n334
1795a650j008L320J401j882m53R20p73l94K475J08l444j603M830J959m356l585
1811d135M243L160k950l262J616K053m92r19J035j238j574K285K926k438m186
1826c876K451M985j630n240R39M379J42l060k60J571N9n73J187j55k455J99L999
1843B662M07m662r71M132K378m246k355L112K569k305j535J259m9q89J212J228
$$ plain form
1859 1947 -273 -2715 136 3101 -409 -4116 -1587 2291 951 -2955 -2298 871 352 -1399 -524 28
1875 28 -986 -700 1976 1220 -2526 -1895 2500 2922 -1579 -2206 1847 3104 -116 -1744 635 1380 -111
1892 -111 79 986 -417 -1294 1290 2408 -814 -3346 17 3699 247 -3110 -509 2455 632 -2105
1908 -2105 -428 892 -298 -274 1274 129 -2483 -1124 2624 1080 -2892 -1832 2695 2101 -2003 -2755
1924 -2755 1033 1690 -605 -574 521 -248 -471 1446 1664 -1567 -1728 2259 3507 -772 -2972 695 3489
1941 3489 645 -2312 -421 1952 997 -251 229 -63 -1292 517 2285 -97 -3118 -508 3286 1016
1957 1016 -3165 -2437 1900 1651 -1887 -2070 -115 254 -437 -83 -268 -2118 -1534 2221 1807 -2909 -3010
1974 -3010 1972 3675 -1064 -2799 272 3148 1061 -736 -141 731 520 1703 1719 -684 -2152 1328
$$ packed form
1859A947k220k442K851K965l510l707K529L878j340l906O57L169n19j751Q75N52
1875B8j014K86K676p56l746O31M395M22m501o27M053J257l220j628K379P45j491
1892a11J90R07j403q77K584J118l222k532L363L682l452l357K601K964j823k737
1908b105J677J320j190K4J548j145k612J359L748j544l972J060M527n94m104p52
1924b755L788O57k295L1J095p69k23J917K18l231j61L987J248m279k200L667K794
1941C489k844k957J891K373r55j248M80k92j229J809J768k382l021K610L794k270
1957A016m181P28M337k49l538j83J955L69o91L54j85j850N84L755m14m716j01
1974c010M982J703m739j735L071K876k087j797N95Q72k11J183J6k403j468L480
$$ plain form
1990 1328 3870 -396 -3780 -841 3284 1491 -2804 -2132 1109 1479 -645 -854 -553 -1222 -10 2126
2006 2126 242 -3465 -1436 2859 2396 -2974 -3193 1436 3037 -267 -2052 -87 1365 716 -17 128
2022 128 -1413 -865 1664 2585 -1368 -3492 980 4211 205 -3299 -921 2612 2023 -889 -603 -12
2038 -12 345 743 1568 -112 -2460 17 3367 1292 -3965 -2538 2316 2786 -1641 -3341 21 1409
2054 1409 -128 -981 -859 -1772 -431 2040 1287 -2885 -3296 1571 3609 -1017 -3801 -39 3127 1316
2070 1316 -1933 -1399 521 756 1097 918 -575 -1655 1523 3732 310 -3468 -761 4222 2795 -2066
2086 -2066 -2343 1287 2626 325 -1065 -555 -319 630 1679 -12 -3443 -2475 2590 2310 -2407 -3962
2102 -3962 697 3598 74 -3263 -1406 1383 1398 322 -138 -1281 -717 1741 2815 -902 -3241 742
$$ packed form
1990A328K542m266l384K939M125j793m295O72L241L70k124k09L01o69J212K136
2006B126j884l707K029M295m63n370k19M629J601l304j785J965J452o49p33J45
2022A28j541N48K529R21l953k124M472L231m006l504K378L533n89k912K86N91
2038a2L57L98Q25j680k348K477L350k075n257J427M854M70m427j700L362J388
2054A409j537q53J22r13J341K471p53m172m11M867K038m626k784L762L166j811
2070A316l249N34J920K35L41j79j493j080L178K209l422l778K707M983j427m861
2086b066k77L630J339k301j390N10K36R49J049j691l431R68N065k80m717j555
2102c962M659K901l524l337J857K789J5j076m60j143N64K458J074l717k339L983
$$ plain form
2118 742 4171 1083 -3520 -2126 2523 2569 -768 -1345 -472 581 711 769 -411 -2400 -360 3600 1519
2135 1519 -2939 -2881 2145 3537 -890 -3233 -401 2435 578 -1106 -997 -965 -658 1153 1281 -2463 -3355
2152 -3355 843 3395 -559 -3787 -1417 3305 2004 -1762 -1767 323 1367 1041 783 -577 -1755 957
2168 957 3335 842 -3284 -1587 3726 3491 -1341 -3183 813 2776 773 -1426 -617 192 758 1659
2184 1659 149 -2710 -2149 2122 3110 -1173 -4220 -317 3442 -1 -3405 -2065 709 1285 -232 -807
2200 -807 -1385 -1285 714 1881 -787 -3129 -403 3465 1905 -3093 -2240 2242 3217 23 -1459 -2
2216 -2 1354 784 631 206 -1754 -652 2874 2155 -1991 -2985 1317 3124 6 -2837 -629 2009 656
2233 656 -877 -871 -384 -489 1152 1690 -1008 -3042 48 2864 727 -3097 -1651 2287 1868 -1657 -1953
$$ packed form
2118G42L429l088m603J394M649M6l337n77Q73J053J30N8j180j989K040L960k081
2135A519m458N8N026J392m427k343K832K836j857j684J09L2L07J811J28l744q92
2152c355M198K552l954l228K370M722j301l766nK090J044l26k58j360j178K712
2168I57K378k493m126J697N313k35m832j842L996J963k003k199Q09Q09N66R01
2184A659j510k859N61M271R88m283l047L903L759l443l404J340K774N76j517n75
2200h07n78J00J999J167k668k342K726L868j560m998Q53M482R75l194j482J457
2216bJ356n70j53m25j960J102L526p19m146r94M302J807l118k843K208K638j353
2233F56j533OM87j05J641N38k698k034L090K816k137l824J446L938m19l525k96
$$ plain form
2250 -1953 -148 750 187 325 -613 -1754 -491 2636 1585 -2491 -2478 2100 3473 -637 -2624 0
2266 0 2425 1312 -373 -749 -35 580 1144 1045 -1287 -2454 1147 3511 -331 -3960 -1537 2666 1826
2283 1826 -2100 -2186 499 1353 313 -595 -1292 -1402 507 2386 92 -3008 -1847 2694 2602 -2460 -3377
2300 -3377 836 3425 520 -2003 -840 658 1155 1112 419 -1473 -355 2495 2540 -1547 -3221 891
2316 891 3991 1265 -2766 -1134 2234 1274 -913 -1197 -549 -272 573 1044 -762 -2637 -1018 2411 923
2333 923 -2630 -2190 1660 2031 -1180 -2398 95 1061 323 -223 -27 -1212 -389 1635 1458 -1259 -2325
2350 -2325 1312 2922 -89 -2565 -438 1791 1047 -893 -743 364 65 740 1407 -595 -1782 626
2366 626 3129 912 -3079 -1737 2209 1754 -1207 -1844 283 1017 30 -450 -600 -1520 -299 1440 813
$$ packed form
2250a953J805Q98n63J38r38j141J263L127j051m076J3M578J373m110j987K624
2266@K425j113j685l76P14O15N64r9k332j167L601K364l842l629K423M203q40
2283A826l926q6K685Q54j040r08o97j10J909J879k294l100J161M541r2n062r17
2300c377M213K589k905k523J163J498M97m3o93j892J118K850M5m087j674M112
2316H91L100k726m031J632L368r60k187k84O48K77Q45M71j806j875J619L429j488
2333I23l553M40L850L71l211j218K493R66p38n46J96j185Q23K024j77k717j066
2350b325L637J610l011k476K127K229p44j940J50J107k99O75O67k002j187K408
2366F26K503k217l991J342L946m55k961o37K127P34r87m80j50r20J221J739o27
$$ plain form
2383 813 -2309 -2550 1212 2118 -1278 -3072 -229 2464 813 -1553 -870 -28 184 1174 1041 -606 -1085
2400 -1085 1344 2710 -295 -2883 -481 2958 1726 -2087 -1678 1570 1593 -177 -677 -28 245 474 1454
2417 1454 -177 -2373 -1093 2277 1656 -1895 -2201 1043 2021 -932 -2394 -517 583 239 -74 -235
2433 -235 -1101 -890 1344 1513 -1229 -2312 900 2673 70 -2555 -786 2128 1416 -789 -730 736 304
2450 304 221 785 -476 -1519 -245 2135 982 -2043 -1695 1711 1826 -1374 -1715 696 1291 162 -666
2467 -666 -157 -270 -476 445 831 -1569 -1798 875 1951 -718 -2591 -235 1661 208 -1520 -872 853
2484 853 -140 -235 180 -479 -1137 159 1979 348 -1687 -219 2250 1664 -1303 -1140 1711 2026 -272
2501 -272 -556 740 412 -379 718 731 -781 -1004 1360 1212 -1314 -2098 612 1886 -536 -2255 -133
$$ packed form
2383H13l122k41L762R06l396j794K843K693j651k366O83Q42K12R90j33j647m79
2400a085K429J366l005k588K402L439j232l813M09L248K3j770n00O49K73K29R80
2417A454j631k196J280L370o21l551l06L244R78k953j462J877J100l44l13j61
2433b35q66K11K234J69k742j083L212J773k603k625J769K914p12k205N9J466m32
2450C04q3N64j261j043J274K380j153l025L48L406J15l200l41K411N95j129q28
2467f66N09j13k06R21L86k400k29K673J076k669j873K356J896j453j728O48J725
2484H53r93r5M15o59o58J296J820j631k035J468K469n86k967J63K851L15k298
2501b72k84J296l28p91J097J3j512k23K364j48k526p84K710J274k422j719K122
$$ plain form
2518 -133 970 -87 -1008 208 -261 -841 -47 1168 -456 -1993 -24 1393 48 -1674 -523 1483
2534 1483 804 -1408 -679 1114 285 -355 382 720 -370 -190 1375 1239 -908 -1061 1501 1593 -269 -1511
2552 -1511 971 1230 -363 -1285 331 301 -804 -497 718 -139 -1263 160 1326 -330 -1742 -209
2568 -209 1543 -346 -1736 -332 1022 -350 -1208 156 425 -256 -428 1029 546 -899 -432 1073 848
2585 848 -1106 -1054 1412 1216 -715 -879 704 740 -255 39 1330 709 -498 983 1010 -398 -1114 648
2603 648 1582 -488 -1544 464 1197 -776 -1574 -23 338 -783 -681 353 20 -1121 -392 1019 23
2620 23 -1533 -473 1544 308 -1412 -446 1636 371 -1092 -446 1204 263 -652 -104 684 -109 -535
2637 -535 1153 1156 -715 -932 840 1412 -690 -1027 896 1481 -78 -935 475 509 -605 -202 602 -69
$$ packed form
2518a33J103j057r21J216m69n80P94J215j624j537J969J417j345j722J151K006
2534A483o79k212P29J793q29o40P37L38j090J80J565j36k147j53K562R2j862j242
2552a511K482K59j593r22J616l0j105L07J215q57j124J423J166j656j412J533
2568b09J752j889j390J404J354j372q58J364K69o81j72J457m83j445M67J505k25
2585H48j954N2K466j96j931j64J583L6r95K94J291o21j207J481K7j408p16J762
2603F48R34k070j056K008P33j973p98J551L61j121J02J034l33j141P29J411r96
2620B3j556J060K017j236j720R66K082j265j463O46J650r41r15N48P88p93m26
2637e35J688Lj871k17J772N72k102l37J923N85j559q57J410L4j114M03Q04o71
$$ plain form
2655 -69 -1268 318 1521 -204 -2054 -170 1569 185 -1588 -582 1071 490 -1038 -436 507 -478
2671 -478 -357 980 503 -1110 -224 1215 822 -1085 -666 1678 1433 -748 -1030 855 1078 -346 -692
2688 -692 593 30 -480 570 1019 -503 -1423 571 1612 -328 -1623 -25 1611 127 -1343 -370
2704 -370 614 -169 -682 172 -221 -1080 -151 1162 -186 -1649 -541 1273 860 -1594 -955 871 1207 -453
2722 -453 -857 822 659 -102 861 956 -335 -749 963 1742 -587 -1460 341 1933 38 -1509 -200
2739 -200 1270 -93 -435 123 -164 -676 -3 1321 -626 -1889 -256 1843 558 -1831 -1013 1356 894
2756 894 -1162 -1437 169 -96 -81 336 168 -1130 -738 1247 1096 -1303 -1468 1186 1453 -627 -1287 255
2774 255 1422 79 -537 403 431 99 616 1299 -586 -1464 537 1698 -83 -1859 -366 1871 496
$$ packed form
2655f9j199J586J203j725j850J884J739j384j773J006J653n81j528O02R43r85
2671d78J21J337m77j613Q86J439l93j907M19K344k45k181k82J885K23j424l46
2688f92J285n63n10J050M49j522r20J994J041j940j295J598J636j484j470R73
2704c70R84p83n13Q54l93q59R29J313j348j463J108J814m13k454O39J826L36j660
2722d53m04J679j63p61R63R5j291m14J712P79k329q73J801J592j895j547J309
2739b00J470j363l42N58k87n12O73J324j947j263J633K099j285k389Q18K369m62
2756H94k056k75J606k65J5M17j68j298L92J985j51k399j65K654K67k080o60J542
2774B55J167j343o16R40K8l32N17O83j885q78K001J161j781j776J493K237j375
$$ plain form
2791 496 -1570 -767 547 631 -429 -329 -169 -942 -287 1159 456 -1467 -1045 1362 1282 -1213 -1519 554
2809 554 1282 -241 -1000 37 131 -225 231 786 -689 -848 863 1929 -516 -1446 498 1953 514
2826 514 -1101 -29 1249 746 -57 43 72 -576 -35 1174 67 -1828 -950 1601 817 -1808 -1742 924
2844 924 992 -543 -1098 -173 -26 -379 132 232 -1228 -1051 1013 1462 -765 -1724 313 1775 -45 -1588
2862 -1588 -346 989 666 -660 -108 -40 -49 403 1077 283 -1560 92 1958 661 -1781 -920 1768 1230
2880 1230 -764 -1351 476 660 228 -35 33 -627 -723 983 462 -1376 -1389 875 1801 -834 -2254 -216
2898 -216 985 -201 -1013 -422 402 -311 183 954 -412 -1105 523 1912 420 -1988 -174 2109 850
2915 850 -1233 -817 790 865 34 115 399 -565 -164 1061 695 -1038 -1099 1416 1505 -1171 -1607 252 1512
$$ packed form
2791D96k066Q03J314Q4j060J00J60p73O55J446p03j923M22K407q0k495l06K073
2809E54P28j523p59J037R4l56M56N55j475j59J711J066k445r30J944J455j439
2826E14j615J072J278n03q03J00K9o48N41J209j107j895Q78K551p84k625O6K666
2844I24O8j535n55R25J47l53N11J00j460J77K064M49k227r59K037J462j820j543
2862a588J242J335l23j326N52O8rM52O74p94j843J652J866j297k442Q61K688n38
2880A230j994n87J827J84m32k63O8o60r6J706n21j838j3K264R26k635j420K038
2898b16J201j186q12N91Q24p13M94P71j366o93J628J389j492k408J814K283j259
2915H50k083M16J607P5q31Q1K84r64M01J225l66j733o1K515Q9k676m36J859J260
$$ plain form
2934 1512 235 -1063 -355 -78 -453 -228 391 -780 -1416 705 1503 -849 -2348 -254 1668 799 -1277
2951 -1277 -769 649 1049 19 -249 125 117 645 1316 38 -1471 -437 2000 1170 -1497 -1475 1166 1772
2969 1772 -423 -1520 -318 747 378 -26 -156 -518 -520 1214 1230 -1199 -1889 563 2034 -51 -2071
2986 -2071 -551 1221 735 -868 -720 -52 -303 188 281 -302 -1050 172 1933 325 -1821 -941 1520
3003 1520 1479 -892 -955 632 953 -6 -89 -19 -192 -214 1215 1109 -862 -1034 902 1568 -423 -1945 33
3022 33 1513 208 -1076 -399 245 -174 -32 485 -443 -972 -81 1401 104 -2073 -1046 1641 1055 -1362
3040 -1362 -1276 46 715 -347 -281 97 -430 -95 1043 32 -1588 -1047 1537 2014 -638 -1247 959 2116
3058 2116 459 -1019 -307 978 783 226 213 -788 -815 674 1303 -467 -1835 -215 2322 497 -1965
$$ packed form
2934A512j277j298P08K77l75K25O19j171o36K121P98k352j499K094J922q69k076
2951a277N08J418M00j030k68L74qN28O71j278j509J034K437q30k667K2K641O06
2969A772k195j097J202J065l69m04j30l62kJ734J6k429o90K452J471k085k020
2986b071J520J772m86j603J48O68k51M91R3n83p48J222J761j608k146Q80K461
3003A520m1k371o3J587L21r59q3P0j73k2J429j06j971j72J936O66j991j522J978
3022C3J480j305j284O77O44m19J42N17r28n29Q91J482j297k177J027K687n86k417
3040a362Q6J322O69j062O6L78n27L35J138j011j620N41K584M77k652o09K206J157
3058B116j657j478P12J285j95n57j3j001k7J489O29j770j368J620K537j825k462
$$ plain form
3075 -1965 -1288 1149 1109 -664 -1007 -32 26 63 312 -45 -1163 -405 1732 1284 -1649 -1546 1137 1939 -610
3094 -610 -1455 447 1069 -6 -382 -202 -192 -149 805 1099 -492 -1244 700 1993 -150 -1568 46 1850
3112 1850 649 -1337 -487 600 -39 -115 163 -15 -931 -298 690 -22 -1783 -1048 1273 1075 -1218 -1331
3130 -1331 497 889 -194 -291 10 41 -312 527 1049 -762 -1154 1023 1832 -287 -1577 489 1479 250
3148 250 -960 48 770 357 137 804 -150 -511 550 1236 220 -1204 -368 1852 683 -1395 -1054
3165 -1054 639 1090 -686 -566 39 -291 -408 67 -207 -1047 -767 798 983 -1247 -1667 482 1128 -174
3183 -174 -1012 185 948 11 -618 317 24 -338 303 1006 -4 -1060 234 1293 172 -1386 -558 1427
3201 1427 868 -633 -35 521 385 -459 -45 215 -528 -279 992 840 -1050 -891 1198 1023 -734 -1198
$$ packed form
3075a965O77K437m0j773l43R75N8L7K49l57j118P58K137m48k933J03K683Q02k549
3094f10q45J902O22j075l76J80J0M3R54K94j591p52J944J293k143j418J614J804
3112A850j201j986Q50J087o39p6K78j78r16O33R88p12j761P35K321j98k293j13
3130a331J828L92j083r7L01L1l53Q39N22j811l92K177Q09k119j290K066R90j229
3148B50j210J008P22m13k20O67r54l61J061O86j016j424Q36K220j169k078L41
3165a054J693M51j776J20O05l30j17M75k74q40K80J565J85k230m20K149O46j302
3183a74q38J197P63r37o29R35k93l62O41P03j010j056J294J059j121j558Q28J985
3201A427n59j501N98N56j36q44M14K60p43K49J271j52j890J59K089j75j757m64
$$ plain form
3219 -1198 490 670 -522 -897 -74 -6 -537 -344 375 -144 -795 -20 1298 -193 -1262 209 1073 321
3237 321 -882 -98 849 256 -371 380 568 -72 -129 758 399 -868 -670 1440 1199 -834 -938 591 716
3256 716 -509 -362 611 541 -549 -299 226 -400 -1157 234 1122 -414 -1370 55 1001 -147 -1435 -18
3274 -18 757 -182 -933 -69 612 -406 -267 572 688 -863 -151 1046 723 -814 -199 1326 849 -954
3292 -954 -262 912 793 -567 191 595 -12 -746 418 818 -639 -577 539 827 -430 -863 562 864
3310 864 -523 -907 159 457 -554 -462 -38 326 -682 -267 734 70 -854 -407 636 416 -1045 -316
3328 -316 1054 246 -676 206 1231 -20 -482 386 852 20 -449 481 975 -378 -247 411 905 -682
3346 -682 -488 633 619 -763 -562 431 295 -907 -531 392 246 -712 59 589 -115 -892 -14 873 -206
$$ packed form
3219a198J688J80j192l75Q23O8n31J93P19n19o51P75J318j491j069J471Q64p52
3237C21j203P84R47n93o27P51J88o40n7Q87l59j267J98K110k41k033j04J529J25
3256G16j225J47R73p0j090K50N25o26p57J391Q88j536r56J425R46j148j288J417
3274a8P75r39p51Q64O81j018J39Q39J16j551P12J197l23j537O15J525m77j803
3292i54O92J174j19j360P58M04o07p34J164M00j457O2J116K88j257m33J425L02
3310H64j387l84J066K98j011R2M24L64j008M15J001o64r24M47J043k20j461P29
3328c16J370q08r22Q82J025j251m62Q68M66q32m69R30M94j353J31O58M94j587
3346f82J94J121j4j382K01R93j36j202L76R23j46r58P71N30p04p77Q78Q87j079
$$ plain form
3365 -206 -960 9 918 -218 -694 74 584 55 -683 354 641 -399 -209 486 626 -964 -401 705
3383 705 547 -571 -200 950 240 -352 -257 572 354 -855 186 632 -86 -827 274 666 -651 -863
3401 -863 25 629 -627 -1176 211 644 -363 -619 432 264 -639 -191 834 181 -1052 -415 1141 347
3419 347 -702 -392 1135 -84 -863 -184 704 407 -453 -95 512 -99 -128 856 799 -678 -397 867 1176
3438 1176 -620 -853 308 512 -136 -638 74 126 -745 -157 399 -389 -1098 -55 673 -58 -1050 -233 983
3457 983 250 -1186 -380 777 548 -729 216 519 -322 -574 557 808 -702 -453 894 866 -477 -618
3475 -618 735 516 -359 -646 210 362 -342 109 572 -277 -516 37 847 -382 -998 112 1045 11 -958
3494 -958 -332 658 -161 -790 -298 225 -220 -166 311 108 -1239 -422 1097 204 -1058 -577 986 655 -531
$$ packed form
3365b06p54R69R09j136m76P68N10n29p38J037K87j040J90O95J40j590N63J106
3383G05j58j118L71J150p10n92R5Q29k18j209J041M46p18p41J101L92j317k12
3401h63Q88O04j256n49J387M33j007k56J051j68r03M48J025o53j233O37J556p94
3419C47j049L10J527j219p79O79Q88k97q60L58O07o11k9R84n7j477K81J264L09
3438A176j796k33J161K04o48n02P12N2q71N88N56p88p09J043P28p31r92Q17J216
3457I83p33j436Q06J157k29j277R45L03q41k52J131K51j510K49J347k8j343j41
3475f18J353k19q75k87Q56J52p04M51M63q49k39N53Q10j229o16J110R33j034r69
3494i58O26R90q19o29M92N23m45N4M77k03j347Q17J519q93j262M81J563l31j186
$$ plain form
3513 -531 -746 607 744 -118 82 473 14 -20 671 1157 -676 -599 617 1069 -177 -1135 -57 1173 15
3532 15 -715 -114 311 149 -177 185 -142 -1014 8 762 112 -1192 -773 679 450 -1103 -730 285 247
3551 247 -605 -554 327 -252 -322 693 484 -752 -862 644 898 -652 -1002 327 1273 95 -546 182 818
3570 818 144 17 339 2 -482 467 1017 90 -1246 -321 1293 484 -949 -404 348 222 -1012 -527 225
3589 225 -77 -270 359 280 -658 -623 450 582 -793 -854 501 1012 -459 -609 -34 657 -166 131 279 -436
3609 -436 -657 343 869 -276 -832 230 1636 349 -911 -337 954 575 -295 -151 307 286 106 423
3627 423 147 -797 -251 1020 442 -1264 -1040 782 1179 -869 -1202 -37 760 237 -568 211 -190 -222 341
3646 341 598 -619 -729 298 1120 -543 -1524 40 1073 488 -524 -497 616 218 32 374 -202 -469
$$ packed form
3513e31k15J353J37q62K00L91m59l4O91M86j833P7J216M52j246r58J078J230j158
3532A5p30O01M25j62l26L62l27q72J022P54o50j304M19J452k29j553L73J015l8
3551B47q52N1Q81n79p0J015k09j236j10J506K54j550l50J329R46j178o41P28O36
3570H18o74j27L22l37m84R49N50r27j336R25J614q09j433N45P52j26j234M85P52
3589B25l02j93O29p9r38L5J073J32j375o1J355N11j471j50N75O91q23K97J48p15
3609d36k21J000N26j145n56J062J406j287j260N74J291l79q70J44M58k1j80L17
3627D23k76r44N46J271n78j706K24J822L97k048l33J165P97n23q05P79m01l2N63
3646C41K57j217j10J027Q22j663r81J564J033n85j012K7J113l98j86L42n76k67
$$ plain form
3664 -469 412 988 194 -1257 -432 1408 838 -866 -675 723 957 -203 -872 -222 213 7 97 146 -1025
3683 -1025 -1100 293 803 -667 -1101 82 1019 -369 -989 -396 575 87 -106 227 53 -559 456 879
3701 879 -113 -712 -337 1439 464 -953 -681 751 629 -360 -244 285 -44 30 286 177 -363 -258 810
3720 810 836 -788 -1206 520 1137 7 -1261 131 394 24 -214 -172 -189 -549 39 326 -804 -1085 -123
3739 -123 1028 530 -1068 -505 1223 756 -782 -518 220 526 206 20 264 -250 232 1108 449 -850
3757 -850 -698 1180 1070 -303 -1151 358 1185 -70 24 -82 374 8 137 189 -830 -619 486 897 -85
3776 -85 -1084 -359 894 315 -1072 -789 618 95 -378 -280 -333 -611 -122 347 381 -596 -273 865 142 -1003
3796 -1003 -724 649 813 -210 -422 423 240 -250 154 405 -301 -364 820 941 -407 -1137 234 846
$$ packed form
3664d69Q81N76p94j451Q25J840n70j704J91J398K34j160o69O50M35k06R0M9j171
3683a025p5J393N10j470m34J183R37j388o20N93R71m88j93L33j74o12J015M23
3701H79r92n99L75J776r75j417K72J432j22r89J16N29l29P4K56j09n40J05J068
3720H10K6j624m18J726O17j130j268J392K63l70k38M2j7l60N88K87j130k81R62
3739a23J151m98j598N63J728m67j538K64P38L06l20j86K44n14M82Q76o59j299
3757h50J52J878j10j373q48J509Q27j255R4j06M56l66J29N2j019K11J105M11r82
3776h5r99P25J253n79j387K83J407n23m73R8n3k78M89M69L4r77L23J138p23j145
3796a003K79J373J64j023k12Q45j83m90M04K51p06o3J184J21j348p30J371O12
$$ plain form
3814 846 -83 -963 31 788 -361 -514 -334 -135 -460 58 748 -1 -952 -177 537 121 -936 -443 829
3833 829 452 -503 -438 198 34 100 55 48 -50 -310 372 88 -493 -843 535 968 79 -702 4 924 -148
3854 -148 -418 182 402 72 154 378 -244 -647 338 641 -27 -1050 -211 610 79 -958 -617 377 225 -407
3874 -407 -243 36 -444 -333 506 437 -445 -433 506 451 -731 -671 398 764 152 -390 103 166 15 -58 317
3895 317 310 -146 307 1093 2 -735 41 646 -41 -588 -75 352 102 -294 35 572 -307 -206 343 180
3915 180 -681 -618 59 268 -510 -923 402 141 -481 -338 157 92 -414 120 357 -111 -423 103 625 -247
3935 -247 -525 130 955 -3 -847 -8 810 111 -260 351 329 -238 -103 410 344 -423 -553 592 270 -789
3955 -789 -106 738 829 -620 -468 96 -254 -431 -367 175 -306 -572 -285 438 -401 -830 355 303 -122 -687
$$ packed form
3814H46r29q80R94P57j149j53J80J99l25N18O90p49r51P75P14m16j057M93J272
3833H29l77r55O5O36j64O6m5pr8k60O82k84n81l50J378M33q89p81P06R20j072
3854a48k70O00K20l30Q2K24o22m03R85L03o68j023Q39Q21n31j037L41R94j52o32
3874d07J64K79m80J11Q39o9q82J2R39n5j182O0J069L66o12n42M93O3j51p3L75
3895C17pm56M53P86j091p37P76O05o87n47N13M27k50l96L29N37q79J01N49j63
3915A80q61O3O77K09p78m13J325k61o22J43M95o5n06N34K37m68l12N26N22q72
3935b47k78O55Q25r58q44Q39Q18o99l71O11k2n67J35N13o6p67j30J145l22j059
3955g89O83Q44R1j449J52N64l50j77O4N42m81k66K87P23q39m29J185n2m25n65
$$ plain form
3975 -687 183 610 204 -226 -195 604 -346 -109 176 -4 -265 -66 660 164 -273 -297 595 167 -676 -48 578
3996 578 237 -252 130 278 -105 -419 165 260 63 -438 11 645 -358 -502 120 480 -576 -837 385
4015 385 245 -429 -679 62 -21 -556 -461 311 259 -474 46 437 102 -513 63 497 56 -520 276 332 -14
4036 -14 -272 525 673 -169 -285 224 382 -250 -565 467 541 -402 -122 531 87 -254 -265 277 106 -771 -323
4057 -323 466 176 -647 162 549 151 -766 241 329 -399 -482 -235 506 -138 -456 351 471 -189 -231 270 387
4078 387 -108 -240 324 617 -221 -254 670 273 -73 -135 509 72 -471 87 884 -6 -295 -247 516 -62 -646
4099 -646 -61 507 -224 -403 -115 286 -260 -672 510 474 -534 -472 263 319 -562 -81 366 223 -763 -110
4119 -110 524 366 -320 117 647 -9 -684 231 1134 -44 -325 211 463 -114 -657 299 88 -268 -405 522
$$ packed form
3975f87Q70M27m06m30L1P99r50K37K85j80k61J99P26m96m37k4Q92m28q43O28O26
3996E78l41m89L82J48l83l14N84R5j97n01M49O34j003j44O22L60j056k61J222
4015C85j40o74k50P41q3n35R5P72n2p33N20L91l35o15N76M34m41n76P96N6l46
4036a4k58P97J48q42j16N09J58o32l15J032P4r43K80O53m44l41j1N42j71q77M48
4057c23P89k90q23Q09L87l98r17J007Q8p28q3K47P41o44l18Q07J20o60m2N01J17
4078C87m95j32N64K93q38l3R24l97l46o2O44m37n43N58P97q90k89M8P63n78n84
4099f46N85N68p31j79K88M01n46m12J182l6j008O2P35N6q81M81M47j43r86O53
4119a10O34j58o86M37N30o56o75R15R03j178k81N36K52n77n43R56k11l56j37R27
$$ plain form
4139 522 247 -387 -368 297 440 -486 -342 456 303 -536 -349 266 310 -747 26 465 -175 -511 134 978
4159 978 -88 -707 420 844 -36 -602 183 99 -80 -127 404 308 -63 -282 578 474 -258 -166 659 297 -248
4180 -248 -143 716 432 -514 -94 286 178 10 54 510 -329 -734 141 535 -330 -704 89 348 -110 -822
4200 -822 -83 52 -409 -198 86 189 -362 -290 502 6 -814 159 654 384 -523 -368 522 369 -202 -365
4220 -365 258 334 -134 325 296 -224 -152 436 592 -392 -632 344 497 -42 -450 206 588 121 -674 93 63
4241 63 -282 -149 384 -63 -785 -159 240 -36 -920 -201 471 136 -812 -235 81 220 -106 53 93 -373 -286
4262 -286 571 428 -453 -518 532 888 -195 -310 81 603 -298 -299 351 127 -220 22 295 -113 -662 175
4282 175 770 -176 -812 -269 730 290 -622 -160 211 -95 -293 35 226 -429 -311 373 230 -1039 -512 689
$$ packed form
4139E22k75o34J9O65J43r26J44P98j53q39J87O15M4j057P73M39o40l36O45Q44
4159I78j066o19J127M24q80n66P85q4j79m7N31r6l71k19Q60j04p32R2Q25l62n45
4180b48J05Q59k84r46M20L80j08j68M4M56q39m05Q75L94q65l74P93K59m58p12
4200h22P39J35m61K11K84J03n51P2P92m96q20R73M95k70r07J55Q90j53n71j63
4220c65O23P6m68M59k9n20P2N88J56r84k40R76J53n39m08O56L82m67p95P67l0
4241F3l45J33N33m47p22O26L99k76q84P19O72l35r48N77L16J39l26J59M0m66Q7
4262b86Q57j43q81o5J050L56j083j15L91N22r01jO50k24l47K42K73m08n49Q37
4282A75N95r46o36N43R99m40r12M62L71l06j98L28J91o55J18O84j43j269N27J201
$$ plain form
4302 689 332 -313 -625 509 790 115 -500 118 599 154 289 128 -151 -408 631 702 45 -687 357
4321 357 730 8 -469 -176 546 -75 -232 -27 121 -296 -64 499 -160 -576 -284 691 1 -972 -596 157
4341 157 265 -711 -620 136 195 -155 -230 343 -282 -247 445 246 -87 -403 381 937 -146 -698 332 810 -175
4362 -175 -325 198 395 -65 104 353 -51 -431 -662 545 -83 -854 -470 838 355 -576 -575 454 115 -244
4382 -244 212 123 -128 -384 196 338 -285 -502 633 628 -219 -718 -39 395 -6 -337 167 -28 -362 -78 403
4403 403 -216 -312 -126 491 129 -710 136 809 388 -407 -31 688 181 -314 129 222 -472 -195 498 -223 -471
4424 -471 -195 442 303 -414 -735 36 648 -160 -456 -201 59 -303 -317 -21 -237 -307 448 367 -254 -939 111
4445 111 783 27 -605 199 790 373 -202 -17 75 -51 269 443 34 -556 -363 844 297 -624 -187 350
$$ packed form
4302F89l57o45l12J134K81o75o15O18M81m45J35j61k79k57J039P1o57p32J044
4321C57L73p22m77K93P22o21j57K05J48m17K32N63o59m16K92R75o90r73L76P53
4341A57J08r76R1P56N9l50p5N73o25L5O92j99l33l16P84N56j083n52J030M78r85
4362a75j50N23J97m60J69K49m04l80k31J207o28p71L84J308m83r31JJ029l39l59
4382b44M56q9k51k56N80J42o23k17J135nq47m99O79M34m01l31N04j95l34K84M81
4403D03o19r6J86O17l62q39Q46O73m21p95L76P19n07m95M43R3o94K77O93p21k48
4424d71K76O37j39p17l21P71O12q08k96K55K60l62j4K96k16p0P55q1o21o85J050
4445A11O72p56o32Q04N91m17n75J85R2j26L20J74m09n90J93J207n47r21M37N37
$$ plain form
4465 350 96 -382 -516 49 217 -320 -54 120 5 -284 -21 424 -730 -636 32 216 -132 -624 31 508
4485 508 -345 -468 242 163 -316 -206 348 297 -589 31 877 412 -539 -454 238 340 -396 -554 358 172 -228
4506 -228 33 193 -104 -107 645 592 -482 -394 573 843 -485 -574 77 668 -117 -482 -249 314 -1 -435 199
4527 199 -127 -572 -92 372 -77 -590 -375 510 771 -396 77 437 283 -227 -206 577 -25 -104 242 385
4547 385 -453 -171 94 434 -204 -421 340 454 -154 -506 197 307 -54 4 182 318 -371 -76 341 -108
4567 -108 -519 -229 530 -73 -421 -271 342 172 -603 -99 502 -279 -247 127 -99 -530 -102 342 360 -244 -368
4588 -368 105 538 -2 -19 369 151 -434 -60 508 80 -442 35 602 57 -171 137 491 -70 -550 -177
4608 -177 133 -103 -202 -232 259 -31 -54 380 -15 -495 -227 238 379 -278 -616 601 374 -279 -211 -118 247
$$ packed form
4465C50k54m78j34N65J68n37K66J74j15k89K63M45j154R4O68J84l48m92O55M77
4485E08q53j23P10p9m79J10N54n1q86O20Q46m65r51Q5O92J02p36j58R12j86m00
4506b28K61J60k97lP52n3j074Q8R67K70j328q9O51N91p85l65K33N63l15m34O34
4527A99l26m45M80M64m49n13K15Q85K61j167M73L60j54n10K1P83o02p9L46J43
4547C85q38K82K65L40o38k17P61J14o08l52P03J10l61N8J78J36o89K95M17m49
4567a08m11K90P59o03l48J50O13j70p75N04O01p81L2L74k26m31M28M44J8o04j24
4588c68M73M33n40j7L88k18n85L74N68m28n22M77N67n45k28L08L54n61m80L73
4608a77L10k36r9l0M91k90k3M34l95m80K68M65J41o57l38J217k27o53O8R3L65
$$ plain form
4629 247 -278 -162 212 89 -3 88 783 -221 -397 409 408 268 -369 236 597 256 -551 323 204 -320 45
4650 45 108 334 -298 -271 491 58 -699 -65 350 125 -964 28 224 170 -473 -155 19 -173 -215 156 250 -175
4672 -175 -190 -100 508 -193 -468 173 289 -153 -306 485 233 105 -108 141 -167 -301 15 397 208 -278 -158
4693 -158 346 123 -68 -49 439 87 -431 22 -70 46 -178 52 172 -136 -440 142 404 -285 -396 -34 342
4714 342 -203 -498 71 96 -341 -125 175 -72 -363 43 399 -74 -373 126 534 -169 -272 -14 387 42
4734 42 -194 18 486 166 -116 221 254 -419 -407 277 389 -431 -441 376 282 -731 -511 119 177 -139 -202 81
4756 81 -310 -498 38 139 -306 -596 78 392 80 -85 54 308 290 -430 105 150 -6 -294 283 194 -360
4777 -360 -450 459 443 -252 111 567 343 -339 -274 418 237 -331 -319 410 -65 -113 557 652 60 -491 -196 468
$$ packed form
4629B47n25J16L74j23r2R1O95j004j76Q06jj40o37O05L61l41q07Q74j19n24L65
4650D5O3K26o32K7P62m33p57O34M15k25j089R92J96n4o43L18J74j92m2L71R4m25
4672a75j5R0O08p01k75O41J16m42j53P91k52j28k13K49l08j34L16L82j89m86J20
4693a58N04k23j91J9M88l52n18M53r2J16k24K30J20l08l04N82K62o89j11L62L76
4714C42n45k95N69K5m37K16L00k47k91M06L56m73k99M99M08p03j03K58M01l45
4734D2k36K12M68l20k82L37L3o73J2O84J12q20j0Q17r4j013K20O30N8l16o3K83
4756H1l91j88N36J01m45k90O74L14l12j65J39K54j8p20N35M5j56k88N77q9n54
4777c60r0R09j6o95L63M56k24o82O5O92j81n68J2P29m75m8O70R5n92n51K95O64
$$ plain form
4799 468 -71 -391 -39 568 -503 -398 -183 -82 150 -324 363 -110 -405 -337 245 181 -351 80 414 258
4819 258 -206 66 608 -29 -448 138 878 -12 -132 168 336 64 -374 429 572 -67 -280 151 527 4
4839 4 105 190 200 -450 -571 185 78 -531 -325 500 129 -264 -293 456 94 -225 115 313 -277 -419 -20 254
4861 254 -139 -643 391 414 -139 -408 -123 656 -11 -335 446 322 -244 69 308 362 -312 -221 466 -22 -236
4882 -236 -3 281 14 -513 -285 566 -68 -469 7 194 -118 -177 305 196 -114 -153 279 474 -73 -301 94
4903 94 137 -201 -195 175 -82 -176 -121 58 464 -124 -87 293 386 -308 39 457 44 -23 -262 350 -164 -232 136
$$ packed form
4799D68n39l20L52O07j071J05K15J01K32m74O87m73k95O8N82o4n32M31L34j56
4819B58m64K72N42o37m19N86P40q90j20L00J68k72m38Q03J43o39k13M31L76n23
4839DJ01Q5J0o50j21P56j07o09K06Q25l71l93k9P49l62l19L40J98n90j42L99K74
4861B54l93n04J034K3n53k69K85P79o67l24P81j24n66L13K39N4o74R1O87m88k14
4882b36K33K84k67n27K28Q51o34m01M76J87l12n9M82j09l10l9M32J95n47k28L95
4903I4M3l38OL70k57r4N5J79M06n88L7L80R3o94L47M18m13o7k39O12n14o8L68
$$ [...]
8191b9
##END NTUPLES=NMR FID
##END=
