##TITLE=1H_Ser 7-4-k2
 CDCl3
 8 sc, 
 23.09.2022
##JCAMPDX= 6.0         $$ Bruker NMR JCAMP-DX V2.0
##DATA TYPE= NMR FID
##DATA CLASS= NTUPLES
##ORIGIN= UXNMR, Bruker Analytische Messtechnik GmbH
##OWNER= root
$$ XWIN-NMR		Version 3.5
$$ Fri Sep 23 16:37:00 2022 Russian Standard Time (UT+4h)  she@DPX200
##.OBSERVE FREQUENCY= 200.1313499994
##.OBSERVE NUCLEUS= ^1H
##.DELAY= (6, 6)
##.ACQUISITION MODE= SIMULTANEOUS
##.ACQUISITION SCHEME= undefined
##.AVERAGES= 8
##.DIGITISER RES= 18
##SPECTROMETER/DATA SYSTEM= spect
##.PULSE SEQUENCE= zg30
##.SOLVENT NAME= CDCl3
##.SHIFT REFERENCE= (INTERNAL, CDCl3, 0, 15.7039)
##AUDIT TRAIL= $$ (NUMBER, WHEN, WHO, WHERE, WHAT)
$$ ##TITLE= Audit trail, XWIN-NMR		Version 3.5
$$ ##JCAMPDX= 5.01
$$ ##ORIGIN= Bruker BioSpin GmbH
$$ ##OWNER= she
$$ F:/spectra/data/she/nmr/H-F/1/audita.txt
$$ ##AUDIT TRAIL=  $$ (NUMBER, WHEN, WHO, WHERE, WHAT)
(   1,<2022-09-23 16:35:27.43 +0400>,<she>,<DPX200>,
      <created by zg, POWCHK disabled, PULCHK disabled
       configuration hash MD5:
       00 E9 B6 7A A2 85 ED C7 34 08 36 98 17 FE 4E 26
       data hash MD5: 16K
       6B 3D B4 AD CC 6C 5F E3 91 09 C6 C3 38 4A 9B 67>)
$$ ##END=
$$ 
$$ hash MD5
$$ E0 2A DD 08 B8 E6 81 26 23 C0 5E 3A 37 AB DE 81
##$RELAX= 
##$RELAX= 
##$RELAX= 
##$RELAX= 
##$RELAX= 
##$RELAX= 
$$ Bruker specific parameters
$$ --------------------------
##$DU= <F:/spectra>
##$EXPNO= 1
##$NAME= <H-F>
##$PROCNO= 1
##$TYPE= <nmr>
##$USER= <she>
##$AMP= (0..31)
100 100 100 100 100 100 100 100 100 100 100 100 100 100 100 100 100 100 
100 100 100 100 100 100 100 100 100 100 100 100 100 100 
##$AQSEQ= 0
##$AQ_mod= 1
##$AUNM= <au_zg>
##$AUTOPOS= <>
##$BF1= 200.13
##$BF2= 200.13
##$BF3= 200.13
##$BF4= 200.13
##$BF5= 200.13
##$BF6= 200.13
##$BF7= 200.13
##$BF8= 200.13
##$BYTORDA= 1
##$CFDGTYP= 0
##$CFRGTYP= 5
##$CHEMSTR= <none>
##$CNST= (0..31)
1 1 145 1 1 1 1 1 1 1 1 1 1 1 1 1 1 1 1 1 1 1 1 1 1 1 1 1 1 1 1 1 
##$CPDPRG= <>
##$CPDPRG1= <>
##$CPDPRG2= <>
##$CPDPRG3= <>
##$CPDPRG4= <mlev>
##$CPDPRG5= <mlev>
##$CPDPRG6= <mlev>
##$CPDPRG7= <mlev>
##$CPDPRG8= <mlev>
##$CPDPRGB= <>
##$CPDPRGT= <>
##$D= (0..31)
0 1.2 0 0 0 0 0 0 0 0.06 0 0.03 0 0 0 0 0.0002 0 0 0 0 0 0 0 0 0 0 0 0 
0 0 0 
##$DATE= 1663936526
##$DBL= (0..7)
120 120 120 120 120 120 120 120 
##$DBP= (0..7)
150 150 150 150 150 150 150 150 
##$DBP07= 0
##$DBPNAM0= <>
##$DBPNAM1= <>
##$DBPNAM2= <>
##$DBPNAM3= <>
##$DBPNAM4= <>
##$DBPNAM5= <>
##$DBPNAM6= <>
##$DBPNAM7= <>
##$DBPOAL= (0..7)
0.5 0.5 0.5 0.5 0.5 0.5 0.5 0.5 
##$DBPOFFS= (0..7)
0 0 0 0 0 0 0 0 
##$DE= 6
##$DECBNUC= <off>
##$DECIM= 32
##$DECNUC= <off>
##$DECSTAT= 4
##$DIGMOD= 1
##$DIGTYP= 9
##$DL= (0..7)
0 120 120 120 120 120 120 120 
##$DP= (0..7)
150 150 150 150 150 150 150 150 
##$DP07= 0
##$DPNAME0= <>
##$DPNAME1= <>
##$DPNAME2= <>
##$DPNAME3= <>
##$DPNAME4= <>
##$DPNAME5= <>
##$DPNAME6= <>
##$DPNAME7= <>
##$DPOAL= (0..7)
0.5 0.5 0.5 0.5 0.5 0.5 0.5 0.5 
##$DPOFFS= (0..7)
0 0 0 0 0 0 0 0 
##$DQDMODE= 0
##$DR= 18
##$DS= 0
##$DSLIST= <SSSSSSSSSSSSSSS>
$$ [...]
##$SUBNAM2= <"">
##$SUBNAM3= <"">
##$SUBNAM4= <"">
##$SUBNAM5= <"">
##$SUBNAM6= <"">
##$SUBNAM7= <"">
##$SUBNAM8= <"">
##$SUBNAM9= <"">
##$SW= 18.0517283424941
##$SWIBOX= (0..15)
0 0 2 0 0 0 0 0 0 0 0 0 0 0 0 0 
##$SW_h= 3612.71676300578
##$TD= 16384
##$TD0= 1
##$TE= 0
##$TE2= 300
##$TE3= 300
##$TEG= 300
##$TL= (0..7)
0 120 120 120 120 120 120 120 
##$TP= (0..7)
150 150 150 150 150 150 150 150 
##$TP07= 0
##$TPNAME0= <>
##$TPNAME1= <>
##$TPNAME2= <>
##$TPNAME3= <>
##$TPNAME4= <>
##$TPNAME5= <>
##$TPNAME6= <>
##$TPNAME7= <>
##$TPOAL= (0..7)
0.5 0.5 0.5 0.5 0.5 0.5 0.5 0.5 
##$TPOFFS= (0..7)
0 0 0 0 0 0 0 0 
##$TUNHIN= 0
##$TUNHOUT= 0
##$TUNXOUT= 0
##$USERA1= <user>
##$USERA2= <user>
##$USERA3= <user>
##$USERA4= <user>
##$USERA5= <user>
##$V9= 5
##$VALIST= <valist>
##$VCLIST= <CCCCCCCCCCCCCCC>
##$VD= 0
##$VDLIST= <DDDDDDDDDDDDDDD>
##$VPLIST= <PPPPPPPPPPPPPPP>
##$VTLIST= <TTTTTTTTTTTTTTT>
##$WBST= 1024
##$WBSW= 4
##$XGAIN= (0..3)
0 0 0 0 
##$XL= 0
##$YL= 0
##$YMAX_a= 21949
##$YMIN_a= -11615
##$ZGOPTNS= <>
##$ZL1= 120
##$ZL2= 120
##$ZL3= 120
##$ZL4= 120
##$ABSF1= 10
##$ABSF2= 0
##$ABSG= 5
##$ABSL= 3
##$ALPHA= 0
##$AQORDER= 0
##$ASSFAC= 0
##$ASSFACI= 0
##$ASSFACX= 0
##$ASSWID= 0
##$AUNMP= <proc_1d>
##$AZFE= 0.1
##$AZFW= 0.1
##$BCFW= 1
##$BC_mod= 2
##$BYTORDP= 1
##$COROFFS= 0
##$CY= 11.3945322036743
##$DATMOD= 1
##$DC= 2
##$DFILT= <>
##$DTYPP= 0
##$F1P= 2.36226072786647
##$F2P= -0.459571619588291
##$FCOR= 0.5
##$FTSIZE= 0
##$FT_mod= 4
##$GAMMA= 1
##$GB= 0.15
##$INTBC= 1
##$INTSCL= 1
##$ISEN= 128
##$LB= 0.24
##$LEV0= 0
##$LPBIN= 0
##$MAXI= 10000
##$MC2= 0
##$MEAN= 0
##$ME_mod= 0
##$MI= 1.114404
##$NCOEF= 0
##$NC_proc= 0
##$NLEV= 6
##$NOISF1= 3.799351
##$NOISF2= 2.8
##$NSP= 1
##$NTH_PI= 0
##$NZP= 0
##$OFFSET= 15.70392
##$PC= 1
##$PHC0= -17953.35
##$PHC1= 21.00069
##$PH_mod= 1
##$PKNL= yes
##$PPARMOD= 0
##$PSCAL= 0
##$PSIGN= 0
##$REVERSE= no
##$SF= 200.130013532006
##$SI= 16384
##$SIGF1= 3
##$SIGF2= 2
##$SINO= 400
##$SIOLD= 16384
##$SREGLST= <1H.CDCl3>
##$SSB= 0
##$STSI= 0
##$STSR= 0
##$SW_p= 3612.71676300578
##$SYMM= 0
##$S_DEV= 0
##$TDeff= 0
##$TDoff= 0
##$TI= <>
##$TILT= no
##$TM1= 0
##$TM2= 0
##$TOPLEV= 0
##$USERP1= <user>
##$USERP2= <user>
##$USERP3= <user>
##$USERP4= <user>
##$USERP5= <user>
##$WDW= 1
##$XDIM= 8192
##$YMAX_p= 0
##$YMIN_p= 0
$$ End of Bruker specific parameters
$$ ---------------------------------
##NTUPLES= NMR FID
##VAR_NAME=  TIME,          FID/REAL,        FID/IMAG
##SYMBOL=    X,             R,               I
##VAR_TYPE=  INDEPENDENT,   DEPENDENT,       DEPENDENT
##VAR_FORM=  AFFN,          ASDF,            ASDF
##VAR_DIM=   8192,          8192,            8192
##UNITS=     SECONDS,       ARBITRARY UNITS, ARBITRARY UNITS
##FACTOR=    0.0002768,     1,               1
##FIRST=     0,             0,               0
##LAST=      2.2672688,     0,               0
##MIN=       0,             -11615,          0
##MAX=       2.2672688,     21949,           0
$$ Real data points
##PAGE= N=1
##DATA TABLE= (X++(R..R)), XYDATA
0@%%%%%%%%%%%%%%%%%%%%%%%%%%%Oj4J6j6J6j6J6j6J6k3L1l2L2l3M1m8M9n6O3
$$ 0 0 0 0 0 0 0 0 0 0 0 0 0 0 0 0 0 0 0 0 0 0 0 0 0 0 0 0 6 -8 8 -8 8 -8 8 -8 8 -15 16 -16 16 -17 24 -24 25 -31 32
46C2o8P6q3R1j02J11j22J35j48J65j83K04k27K54k91L35l89M60n56O98r24J342
$$ 32 -36 40 -43 48 -54 57 -65 70 -78 87 -96 108 -119 135 -156 179 -210 250 -306 392 -532 810
68H10k378R293J4224k1270j0132O964Q37l116P900p3j1030J745J3764j130j0369
$$ 810 -1568 7725 21949 679 -9453 -2489 -1652 -4768 3132 3059 -7971 -6226 7538 6408 -3961
83c961P42O362k294k884L480J979l020kK159k806m323L021N499o47l660k19l62
$$ -3961 -3219 3143 849 -2035 1445 3424 404 402 2561 -245 -4568 -1547 3952 3305 -355 -574 -936
100i36j956J766L135k886l938K716M340k29j500p16j370K94K342j24j391J069
$$ -936 -2892 -1126 2009 -877 -4815 -2099 2241 2012 512 -204 -1574 -1280 1062 938 -453 616
116F16N83k328j833J80J893L703P26n345k923N217M520k264l508j666p21L048
$$ 616 1199 -1129 -2962 -2782 -889 2814 3540 -1805 -4728 489 5009 2745 -763 -2429 -3150 -102
132a02M685j693n760l66L746O43j179N90J43r94L18Q55p30q22O64O46l48k54L47
$$ -102 4583 2890 -2870 -3236 510 1153 -26 564 707 -287 31 886 156 -666 -2 644 296 42 389
151C89J62M7N47Mj447j076J241J862J34j201j447q14J580K846j21k735o30J575
$$ 389 551 598 1145 1149 -298 -1374 -133 1729 1863 662 -785 -1599 -19 2827 2706 -29 -659 916
169I16M60M3M50j369j904P77J301m08K45O99j833j794J863K121n08p69j92q70
$$ 916 1376 1419 1869 500 -1404 -627 674 266 511 1210 -623 -2417 -554 1567 1059 290 98 -772
187g72L28K101J81j923m5J431l32q53Q85O82j065r89P2p7MP70M6j261p15J049
$$ -772 -444 1657 1838 -85 -130 1301 969 116 1001 1683 618 -371 -299 -376 -372 398 444 -817 -1532 -483
207d83Q80l73j28M36k12o99K24P32K55k72o34r41J96J819R64j278j345j6O32R75
$$ -483 397 24 -104 332 120 -579 -355 377 632 360 -274 -1215 -1019 800 1764 486 -859 -875 -243 732
227G32P37r62j859q5J361N48k40k44p04n87P88J292j33r88m31P8J71M11J33m92
$$ 732 1469 507 -1352 -1437 -76 472 232 -12 -716 -1303 -515 777 644 -344 -775 -697 -526 -115 18 -474
247d74j77M57J3m37L70Q05J1n17k70j70J89R00L24j210j086N61J008K50l29l50
$$ -474 -651 -194 -181 -618 -248 557 568 51 -219 -389 -200 700 1024 -186 -1272 -711 297 547 218 -132
267a32n96k14P30P63k14o62m96r2M11P99K41o08p41j03O18Q64L36o96r01R7P82
$$ -132 -728 -942 -212 551 337 -325 -821 -913 -502 297 538 -70 -811 -914 -296 568 904 208 -693 -596 186
288A86M50k7k52n10n14M27Q13q7p16k06J99q5j2L97Q9m39j66O9mJ44L53J29l55
$$ 186 636 609 357 -153 -667 -240 573 486 -230 -436 -237 -322 -334 63 152 -287 -453 -384 -388 -244 109 238 -117
311a17n26l9O00O71J0o35m40Q7L13O20M07n35j101j82R20P92o5o59p64l01O20
$$ -117 -643 -682 -82 589 599 -36 -476 -389 -76 544 951 416 -685 -867 53 845 780 121 -643 -944 -324
332c24J039J48j003q83J54P33N13n0m77n21pN22M86K3k77k64n9J91L37N0j31p
$$ -324 715 863 -140 -1023 -869 -136 377 327 -150 -671 -678 -156 330 353 76 -188 -247 -56 281 331 200 193
354A93l0k49m4L68L25p7l11l89l26K16P17J51p89p68O1N99N72J95l66n53j65L99
$$ 193 163 -86 -130 238 563 486 175 -214 -540 -324 393 544 -245 -1013 -952 -353 219 414 48 -505 -670 -271
376b71P20M71m52r78m30M59P61M82k88r94n60O89J241K02p95q29j82M56M89m4
$$ -271 449 920 468 -510 -940 -481 280 762 474 -520 -1080 -391 850 1052 257 -572 -754 -298 191 147
396A47m72m39k8K06M15K34r9p0R8j92k18J99K62k12k86l05k67J79O40N04r1n03
$$ 147 -325 -764 -792 -586 -171 63 -36 -106 -8 -200 -418 -219 43 -169 -455 -760 -1027 -848 -208 296 205 -298
418b98m28L37J005M07p46q87l76J63O36M98m53r38k18M97P08M57j31p18n41N3
$$ -298 -726 -389 616 1023 277 -610 -986 -823 -187 311 -142 -1080 -1298 -801 -93 364 233 -485 -1026 -973
438i73N15O15L7r44p50N22R44L73Pk82n54J63P74Q7m68r9j45m60O1L22k8Q4K21
$$ -973 -458 157 194 -750 -1500 -978 -34 339 346 64 -490 -327 447 534 66 -33 -178 -638 -577 -255 -283 -199 22
461B2l97l36N29M63p3j07k90o30L3O29K50j61k83n40JJ107P41l83m86l65j57O63
$$ 22 -375 -711 -182 281 208 101 -189 -819 -786 -157 93 -68 -351 -891 -890 217 958 575 89 -276 -433 230
483B30R25m27j146k62L25K88N03J24p82n28K78L11K89K73n48p09L00N22o9J93
$$ 230 1155 728 -418 -680 -355 -67 436 560 -222 -750 -472 -161 128 401 -147 -856 -556 -34 -103 90
503I0K91n11k78N89J88l26K55J17o72k81L42K12J50K6n97m15N93M72r9k9k41n89
$$ 90 381 -130 -408 181 369 43 298 415 -257 -538 -196 16 166 192 -405 -820 -227 245 146 117 -124 -713
525g13J78Q67L2m50l4j88k41M06M50j77m39l68k26M11N78j43m86m6qK09P87L52
$$ -713 -535 332 364 -86 -120 -308 -549 -143 307 130 -309 -677 -903 -492 86 -57 -543 -589 -597 -388 399 751
547G51o66m27L48J59J8J92l09n42%J85m0J19J27k38MJ56k56m2N91P9n95k75K05
$$ 751 85 -342 6 165 183 375 66 -476 -476 -291 -331 -212 -85 -323 -319 -163 -419 -461 130 209 -386 -661 -456
570d56J27L98L65m69m87L19N97K35k8m77o13K36O44j9l36k20l19L7O12L12k99
$$ -456 -329 69 434 -35 -522 -203 394 629 601 124 -489 -253 391 372 36 -184 -503 -466 146 458 159
591A59j65p4j15J74K63j59k16p0k76j29N70L78k67m4J24j30J74N35M4m92k07j3
$$ 159 -6 -80 -195 -21 242 83 -133 -203 -479 -608 -38 340 73 29 153 23 197 732 776 284 77 64
613F4k9J48J67k01k15j02n9K70M42n9m32j90PN9L20K16m18m92R8M47L60J06l28
$$ 64 35 183 350 149 -66 -168 -227 43 485 426 -6 -196 -189 -130 190 406 -12 -504 -406 41 401 507 179
636A79m47L0L84L69L6m70o18P8N91K72j65k78k33m5M05L12j12k09j12j38J7J34
$$ 179 -268 -238 146 515 551 81 -537 -459 132 404 239 -39 -272 -317 88 400 288 79 -33 -171 -154 -20
658b0K2m0K2k45l38J89M64Q2j13j20l07m0M83M11j59l24l32k7M42M19q7m37l30
$$ -20 2 -38 -16 -261 -599 -410 54 136 23 -97 -404 -444 39 450 291 -33 -365 -392 50 469 382 -55 -385
681c85J0L17M11j9m73l66K4K58L56N6l57l15j10J81M75K71l03n03o9L49L94J79
$$ -385 -375 -58 353 334 -139 -505 -481 -223 133 189 -168 -483 -593 -412 63 334 31 -472 -541 -192 202 381
703C81k03n00j23M03L37k8j53j98r8J15J44Pk6L8j80k51MK63J64Pj69k90j27K21
$$ 381 178 -322 -445 -42 295 267 114 -84 -182 -67 77 84 58 96 -84 -335 -331 -68 96 103 -66 -356 -483 -262
727b62M44J69l58m62rM00L09J74j64n48k73N21O17o2m28k65k8J40L59J99k67m32
$$ -262 182 351 -7 -469 -478 -78 231 405 241 -307 -580 -59 558 496 68 -197 -225 -85 274 473 206 -226
749b26j00J50K71J64j35k81k01k5L08L54p1m34k20K48J81P3P2j18j56O8Q0J26
$$ -226 -326 -176 95 259 124 -157 -358 -383 -75 279 208 -226 -446 -198 -17 56 128 10 -146 -78 2 128
771A28R9J32j33k14j40L6K30K54j80m59k18K17L62K16j38l37l02J16M41L18j62
$$ 128 227 359 226 12 -128 -92 138 392 212 -247 -465 -248 114 330 192 -145 -447 -331 110 428 266
792B66n36k58K30M08K17n9l01k99J26M35K60j63k65j70QJ17K09L0j66k47r9J50
$$ 266 -270 -528 -298 110 327 268 -33 -332 -206 229 489 326 61 -109 -101 16 225 255 89 -158 -257 -107
814a07K69R6j42k20n4j7J12J20Qj67j32j9L9J98J78O7k34k75L5L99K89j05l68
$$ -107 162 258 116 -104 -158 -175 -63 57 65 -102 -234 -253 -214 -16 162 229 -5 -280 -245 154 443 338 -30
837c0k60P3L05K94j2l91l64N2L96K52j40k94k66RK33K59qk54l12Q4K80J78n5n3
$$ -30 -290 -217 88 382 370 -21 -385 -333 63 315 175 -119 -385 -376 -143 116 108 -146 -458 -374 -94 84 29 -24
861b4j59j26J04K77J11j35j23n0M0P9J20R3j32k06r9J73R7J9p5r9j82pK20K21
$$ -24 -183 -309 -205 72 183 48 -75 -125 -85 -6 114 207 75 -131 -230 -57 40 59 -16 -115 -297 -304 -84 137
885A37o1k11j75KJ94K65Nk75k55O2K61K75O6l07j97J26K29J48J6k09k59k4K39
$$ 137 76 -135 -310 -308 -114 151 156 -119 -374 -312 -51 224 290 -17 -214 -88 141 289 305 96 -163 -187 52
908E2Q9k5j25j81L4J18J33J4n0j07o1J6Q3K9n6lo5m2J09J15R1O3j20j38O8J74
$$ 52 141 116 -9 -190 -156 -38 95 109 59 -48 -109 -93 -10 19 -37 -40 -105 -147 -38 77 168 231 111 -27 41 215
934B15K3n4r2j88j15K45K59j09j93p6RJ28K38l2k95j56l9J74J36J6k40j50J25
$$ 215 238 184 92 -96 -211 34 293 184 -9 -85 -76 52 290 258 -37 -193 -232 -58 78 94 -146 -296 -171
957a71J71J12J24j10k40K5K48J19q6p0j42o2P5J15L2n4j33j08J38K5r6R0k1j80
$$ -171 0 112 236 126 -114 -89 159 278 192 122 -20 -82 -7 108 140 86 -47 -155 -17 8 -88 2 -19 -199
981a99j45J22R0j4J09o1j76qK27J58L4p5k65p0K97J99j42j26j19j13J52L70n8
$$ -199 -344 -222 -132 -146 -37 -98 -274 -282 -55 103 137 62 -203 -273 24 223 81 -45 -164 -277 -125 245 187
1004A87l08j39J26O4J40R0k53j97l7J87J67O5j42k34jJ78J28R1m9k27r1J33J71
$$ 187 -121 -260 -134 -70 70 160 -93 -290 -327 -140 27 92 -50 -284 -285 -107 21 112 63 -164 -255 -122 49
1027D9N3J6j31m1K3L7L8J60m4j72j24J02MP8J33j15k50m9J91J33P7j03k78o6K33
$$ 49 102 118 -13 -54 -31 6 44 204 160 -12 -136 -34 -30 48 181 66 -184 -233 -42 91 168 65 -213 -279 -46
1052d6J81Q8r8k48j82L08L14n6k03j05o6J38K42L9k01k03n0J21K69K3j46j48r0
$$ -46 135 223 125 -123 -305 3 317 261 58 -47 -113 25 267 306 105 -98 -148 -27 242 265 119 -29 -119
1075a19m8J57K22j17k65k9Q0QR3J24q6j48J4P5Q4J74k9j69n4k9NK09J88k24k78
$$ -119 -167 -10 212 95 -170 -199 -119 -111 -18 106 20 -128 -114 -39 45 219 190 21 -33 -62 -57 152 340 116 -162
1100a62K0J11R0J65n0l45j52J61K12J22j28k47j80J49K59J23n7k25j57J37K68
$$ -162 -142 -31 59 224 174 -171 -323 -162 50 172 44 -203 -383 -234 25 148 91 -134 -291 -154 114
1121A14O9q4j38j28K0K09J32o4r0j36n9J55J72o2o0r5j28l0J90J00p5o7o6j43
$$ 114 183 99 -39 -167 -147 62 194 130 40 -96 -155 0 172 110 50 -45 -173 -203 -13 87 12 -55 -121 -264
1145b64R9K12K9r3r2j29J5K94J65j60j70m9K6J59K40o0k70p3J0J74J85m3k65j36
$$ -264 -165 47 76 -17 -109 -238 -223 71 236 76 -94 -143 -117 42 282 222 -48 -121 -111 63 248 205 -60 -196
1169a96J24Q2P0R7j86k54J13J71J2j0Oj48q6J63J10L4K7j25j41J02J38l8O7L8
$$ -196 -72 10 80 177 -9 -263 -150 21 33 23 29 -119 -205 -42 68 102 129 4 -137 -35 103 65 132 170
1193A70k15j31K20J19m9%p6k14jK53M4r1q5j35n3K28J38n9j02j31k8J39K13l0
$$ 170 -45 -176 44 163 114 114 38 -176 -177 76 120 29 -56 -191 -244 -16 122 63 -39 -170 -198 -59 154 124
1217A24j78m5L1L3J61N4r8j35LN6P3R6q0j22PMj6P6P3j51j16Q1l2O0R9m9j56n8
$$ 124 -54 -99 -68 -35 126 180 82 -53 -50 6 79 175 95 -27 -20 -16 -32 44 117 -34 -150 -69 -101 -41 58 9 -147 -205
1245b05P3J24J19mj69j30R3J60R0K6j39j65N0J82R6q0j14p8m8J40J06k6j03j14
$$ -205 -132 -8 111 107 -62 -192 -99 61 151 177 38 -127 -77 105 201 121 7 -71 -119 21 127 101 -2 -116
1269a16k4P9J40n8r3kn1m3J46L7k6q1K0K3J7Q6J7k2n6p8M9J36N4j33n9nj5O5J14
$$ -116 -140 -61 79 21 -72 -74 -125 -168 -22 15 -11 -92 -72 -49 -32 54 71 49 -7 -85 -36 100 154 21 -38 -43 -58 7 121
1298A21k7j93o6P1O0P2l0q7j39L1J31J19J1j77q7N1J72N6j4p3j24J4J06J37m4
$$ 121 94 -99 -165 -94 -34 38 8 -79 -218 -187 -56 63 74 -103 -190 -139 33 89 75 2 -122 -108 -2 135 91
1323I1j49MJ0O0J0L6p1p0k9L4O0l1j2K6o0l8M6O6M3n5m0J1k1O8R8oj03o6L6J52
$$ 91 -58 -54 -44 16 26 62 -9 -79 -108 -74 -14 -45 -57 -31 -91 -129 -83 -17 26 -29 -69 -58 -79 -11 87 81 -22 -88 -52 100
1353A00P4m2q4j08O1M9R6Pj34j56K1J35J09m4j12j19MJ24R3J0j15o8LR0J26j7
$$ 100 174 132 48 -60 1 50 146 153 19 -137 -116 19 128 84 -28 -147 -143 -19 74 84 -31 -99 -96 -6 120 103
1379A03p0l2PRQ0K9j0k1n5J1K5M0qLp8o0oQ3P1m6p0p7nP9P0L8j14j16kJ11R6K3
$$ 103 33 1 8 17 97 126 116 95 40 51 76 116 108 111 33 -27 -33 50 121 75 5 -72 -77 2 72 110 -4 -120 -122 -11 85 108
1411A08j22p0OJ05J10L0r1j54J3R5J12J1q3j50k4R5J01oo9j41JL8M0N0Nq1n7J6
$$ 108 -14 -84 -78 27 137 167 76 -78 -65 30 142 153 70 -80 -104 -9 92 86 17 -124 -123 -85 -45 5 10 -71 -128 -112
1439a12R1M7J4m3p3QkJ01O4qr2j10L3J26K9K1j06j02m1J34O8M1j38j08l2J06R8
$$ -112 -21 26 40 -3 -76 -68 -70 31 95 87 -5 -115 -82 44 73 94 -12 -114 -155 -21 47 88 -50 -158 -190 -84 14
1466A4M0n5j34q5J20J37O0j36p6k2O6J31O7q0j12j3M2R8M6k4j04j1MK4L9L7o6
$$ 14 54 -1 -135 -220 -100 37 97 -39 -115 -137 -71 60 127 47 -65 -78 -36 62 108 84 -20 -31 -27 -3 36 73 7
1493Gj02OM9J4L1L3r1r8K0P9R5J6j02p9L0O7Q8J02n8j64l5J04J02K9l2q6j15O0
$$ 7 -95 -89 -40 -26 5 38 -53 -151 -131 -52 43 59 -43 -122 -92 -25 63 165 107 -57 -92 12 114 143 111 25 -90 -30
1521c0J31jk3j38o6P4Q2j2l0J6j12jR8P2p8n5NRJ2N8M5m0k4m5L8M6M3k6j9m9q1
$$ -30 101 100 77 -61 -127 -53 29 17 -13 3 -109 -110 -12 60 -18 -73 -68 -59 -47 11 56 16 -8 -53 -15 31 74 48 29 -20 -101
1552a01Q2J38k8p8j04l4K8J30O3j07r6o5J6J68J17j08j55J1L0P9J11rj76m0J17
$$ -101 -19 119 91 13 -91 -125 -97 33 96 -11 -107 -172 -156 12 129 21 -134 -123 -93 -14 97 88 -88 -128 -11
1577a1L6k4P4p2r0O2N8l0k0N5j31J7N5qn3M9Mr4kJ28j3l4K9q8j7Q7P8m3J6m2p3
$$ -11 25 1 75 3 -87 -25 33 3 -17 38 -93 -76 -21 -29 -82 -33 -29 -123 -125 3 -10 -44 -15 -103 -120 -33 45 2 18 -24 -97
1608i7N7J44j1o9j4r2j8J81N5q4j13rn9J31J46j03j81J4L2J1J10K4j51n8J23K
$$ -97 -40 104 93 24 10 -82 -100 81 136 52 -61 -70 -129 2 148 45 -136 -122 -90 -79 31 55 -96 -154 -31 -29
1634b9PP4j02o1M4R0k1J5M7p6K9M9n8rP6jj11J6K3jJ0N2q9j04R1M5K9l1n1j19
$$ -29 -22 52 -50 -111 -67 23 2 17 64 -12 17 66 8 -1 75 74 -37 -21 2 1 11 63 -26 -130 -39 6 35 4 -47 -166
1664a66R0R3J7l0m0j06L9J77P5j45n2K7l5R4Q2n4r7j0K6L2Q6n3j24lO2K0lN7n0
$$ -166 -76 17 34 4 -36 -142 -103 74 149 4 -48 -21 -56 38 120 66 -31 -41 -15 17 103 50 -74 -77 -15 5 2 59 9
1693Ij14L9O6l7L0Lo1j7P2PJ5N4l7q5O5M1lL3K0j20n3P9L7Nk3n4q4N3J17K5o6
$$ 9 -105 -66 0 -37 -7 -4 -65 -82 -10 -3 12 66 29 -56 9 50 47 80 100 -20 -73 6 43 48 25 -29 -113 -60 57 82 16
1724A6n9j20P1J14O2n3q6m6NQ9J25l1j12n5K3J00K3K4q3k0J8rM4M6j05o3N2J3
$$ 16 -43 -163 -92 22 84 31 -55 -101 -96 -7 118 87 -25 -80 -57 43 66 90 7 -13 5 -4 40 86 -19 -82 -30 -17
1752a7m1N3M0q5o2L4K1lO9m2m8k9QO4Q3j4q0l7P9L7K6J4o3p1qJ01J3Oq4n6k1O8
$$ -17 -58 -5 35 -50 -112 -78 -57 -60 9 -33 -81 -110 -102 -38 45 31 -49 -86 -7 30 56 70 7 -64 -72 29 42 48 -36 -92 -113 -45
1784d5P2K4m4r2n9J16O8l0m5l1k3J3P2O4n3n7k9M2M3L8K6o2k7m2N3O5J4m6k6k2
$$ -45 27 51 7 -85 -144 -28 40 10 -35 -66 -89 -76 -4 60 7 -50 -79 -37 6 44 70 8 -19 -61 -8 57 71 25 -1 -23
1814b3J1O5L8k6n7p1k7R9N1Pr0n9MO0P9K6m8p3nO2O6L1o0l7n6L3L6Q3n3o1k8L
$$ -23 -12 53 91 65 8 -63 -90 9 60 67 -23 -82 -78 -18 61 87 39 -34 -39 23 89 120 60 23 -33 0 36 119 66 5 -23 -20
1846b0L9N0qn6m3k8O0M5Nk1q2k0N7Q6J0j1r1k5L7P4K8Mo3q0J4L5P1L7m3p9j4L4
$$ -20 19 69 61 5 -38 -66 -6 39 44 23 -59 -79 -22 64 74 63 -28 -53 -16 58 86 90 27 -53 -39 -4 67 104 61 -18 -32 2
1878BM7L4m5p7q1N1Q0J7k7p5m9O2P2L0j8l4n2J3M3M3J6n4l5pM0N0K9n1j9n2L2
$$ 2 49 83 38 -39 -120 -69 11 28 1 -74 -123 -61 11 41 23 -11 -63 -50 -7 36 52 -2 -37 -44 -4 46 75 24 5 -47 -15
1909a5K9L9j5n0m5j0O2K5K0p6l0lJ0O4npl8l5K7Q4j7K9m8j1QN7M0j9o3Kk7O6J9
$$ -15 14 53 38 -12 -57 -67 -5 20 40 -36 -66 -69 -59 5 0 -7 -45 -80 -53 31 14 43 -5 -16 -8 49 89 70 7 9 -18 48 67
1942F7j1m2k1qJ9K4J3k6n4mK8K5%K5n2j4K3L0K2j0k5j0mK0N9k1j6m8j7K1O2J4
$$ 67 56 14 -7 -15 4 28 41 15 -39 -43 -15 10 10 35 -17 -31 -8 22 44 34 9 -1 -5 15 74 53 37 -11 -28 -7 55 69
1974F9m3l9k4L0M9kj9n2LK2j4K9Jk1m3L3M4K7j0m3J4oK0J3J0k9qm7M4N6k8j3k
$$ 69 26 -13 -37 -7 42 40 21 -31 -28 -6 -20 9 10 -11 -54 -21 23 50 40 -3 11 5 25 38 48 19 11 -36 8 64 36 23 21
2007B1m9k1N0J4l1l5J7m3L3K5k3%J9l1jQ9k1l8PJ0KN3K5l1n9J4L6oN1l4r2k1L9
$$ 21 -28 -49 1 15 -16 -51 -34 -77 -44 -19 -42 -42 -23 -54 -55 34 13 -25 -18 -8 -6 47 72 41 -18 -4 32 26 77 43 -49 -70 -31
2040c1O4Mk3m9o2N8L6l1J2qj8j9P3j0k0M9k4q4Q1M5k4QPr3L4O1K0l1j4jn1N0P0
$$ -31 33 37 14 -35 -97 -39 -3 -34 -22 -30 -48 -67 6 -4 -24 25 1 -83 -2 43 19 27 34 -59 -25 36 56 25 11 10 -41 9 79
2073G9l3p1J5k9L6O2l3p4KK2j2N5L8n8n5N0K2rM6Nq7j1N1QJ6K9m0o6K3K4j6O3
$$ 79 46 -25 -10 -39 -3 59 26 -48 -46 -24 -36 19 57 -1 -56 -6 16 7 53 58 -29 -40 11 19 35 64 24 -42 -19 5 -11 52
2105E2mr7RN3j5J3L1m1j05M6P3nMj3p3M1O1J9m0L2l4j6O3L8k9o1K4m8J2P2qo7
$$ 52 48 -49 -40 13 -2 11 42 1 -104 -58 15 10 14 1 -72 -31 30 49 9 41 7 -9 54 92 63 2 26 -22 -10 62 54 -13
2137a3k6j1J5K3N3m1n4RqK4O4j1l5rL7n3M6P9l8o0K5oKO8j7p4l7K0J9K5M1j0j06
$$ -13 -39 -50 -35 -12 41 0 -54 -45 -53 -29 35 24 -11 -20 17 -36 10 89 51 -9 16 10 12 80 63 -11 -48 -28 -9 16 57 47 -59
2170e9J8N5j3L8k3q9lN6j0K6J6o2k4N9N9k3m6O4o9k8Q5J2pj3k3k3L8L3k4l2L3
$$ -59 -41 14 1 39 16 -73 -76 -20 -30 -4 12 -50 -74 -15 44 21 -25 39 -30 -58 27 39 32 19 -4 -27 11 44 20 -12 21
2201B1p3j2R6Pp2L6j8l5K0N8kk7l4PK5M1K2o6l8kJ6N6K8p7J9l3J4QP1Rn5m6L3
$$ 21 -52 -64 32 39 -33 3 -15 -50 -30 28 26 -1 -35 -28 -3 38 60 -6 -44 -46 -30 26 54 -23 -4 -37 -23 -15 56 65 10 -36 -3
2234cL5J9j2o1k4J3RL3kl8qj1N8j1L3nj5k8J9M4K9kk2l6OK1NLro3k0M7M1l7k5
$$ -3 32 51 39 -22 -46 -33 -24 9 7 -31 -39 -50 8 -3 30 25 10 -18 1 45 74 72 50 14 20 41 46 49 40 -23 -43 4 45 8 -17
2269a7Lm4M1K6J7j3l2k3KL4L2j6Jk5J2K9N3Ko4j6J8pK7K3k7rj7J6L8Mm1j9m8K1
$$ -17 -14 -58 -17 9 26 13 -19 -42 -40 -6 26 10 11 -14 -2 27 80 82 18 2 20 13 40 63 36 27 10 26 64 68 27 8 -40 -19
2303a9K0mK9m3m2J3K6RJ5mj3k7M7J5J3qk1k9K6K5LLkk6pL2j1K0m0k3J7L0k1%J3
$$ -19 1 -3 26 -17 -59 -46 -20 -11 4 0 -13 -40 7 22 35 27 6 -23 3 28 31 34 32 6 -1 31 20 40 0 -23 -6 24 3 3 16
2338A6n6j0PM4J6Kl8ppK8K2ol4j7K2M4J8j2lm8L3KLqL0m9j4J0M1k9J2j6JQRLk
$$ 16 -40 -50 -43 1 17 19 -19 -26 -33 -5 17 11 -23 -40 -18 26 44 32 29 -19 14 16 19 11 41 -8 -22 -12 29 0 12 -4 -3 5 14 17 15
2375A5Kl2J3NL2k2j8kJK5K3NQk7m1J9K0lj8j7JJ1J0K1l2j1l8K0L6L6k0m9k8M8
$$ 15 17 -15 -2 3 35 13 -5 -7 -6 19 42 47 55 28 -13 6 26 23 5 -12 -11 0 10 31 -1 -12 -50 -30 6 42 22 -27 -55 -7
2409gK6J6rj9J0l5O7K1j7n1%RKQJ8J4l3l7L9jjK2m4j2l2L4M1j0l6j7LJ8j2O2r
$$ -7 19 35 26 7 17 -18 49 70 53 2 2 11 13 21 39 53 20 -17 22 21 20 42 -2 -14 -46 -12 29 19 -17 -34 -31 -13 -25 37 28
2444B8p2j5P1POOl7Mj9J5M2Lqp8N2J3J0j3j7k2j1L3M1on9K9l9ML9lk2J1j4j0K9
$$ 28 -44 -59 12 19 25 31 -6 -2 -21 -6 36 39 31 -47 5 18 28 15 -2 -24 -35 -2 39 33 -26 3 -36 -32 7 4 -18 -7 -21 -31 -2
2479bM3l3lo1M1KN3Lm4J9j3j4J2n%J2l3JJ5NL9n7mK2J5J7Km1j1pN3M0k3j0n2k
$$ -2 41 8 5 -56 -15 -13 40 43 -1 18 5 -9 3 -2 -2 10 -23 -22 -7 -2 37 -20 -24 -2 13 30 32 -9 -20 -27 26 66 43 33 -19 -21
2515b1L2J8jOo0QK8K5j1l7J5m1J5L6Pk5Rl4j4J1J5L2LQn9L1L6j0qK1Ql0k5L4K3
$$ -21 11 29 28 34 -26 -18 10 35 24 -13 2 -39 -24 12 19 -6 3 -31 -45 -34 -19 13 16 24 -35 -4 32 22 14 35 43 13 -12 22 45
2550D5k4l7K4mj8O6j4m3pj0K3J3k2p0N5K9k1N2l3k1mJ7KJ2K0k0m3J9L6k9L1K9
$$ 45 21 -16 8 4 -14 52 38 -5 -12 -22 1 14 -8 -78 -23 6 -15 37 4 -17 -21 -4 -2 10 30 10 -33 -14 22 -7 24 53
2582E3q5J1M9j7LJ2K1o2K0L0j4k9N2n9k1K7pjK1Nm6L6K5j5J1Qn0OP0k4nPj9m1
$$ 53 -32 -21 28 11 14 26 47 -15 5 35 21 -8 44 -15 -36 -9 -16 -17 4 9 -37 -1 24 9 20 28 -22 -16 54 30 25 32 13 -28
2616b8N3Qql4j8jQQL3n7QJ9PJ6pJ0m0j6M2MJ7rl7J4J7Ok0N7m2Rk2K4nk4M3n3l7
$$ -28 25 33 25 -9 -27 -28 -20 -12 21 -36 -28 -9 -2 14 7 17 -23 -39 3 7 24 15 -22 -8 9 15 -5 52 10 19 -3 21 16 -8 35 -18 -55
2653e5M4pj1L6k3l8K0J4J5roj4l0N7J4L2n7K2m0N3L3Qm9%kOM6k7k8pj6J8%L6l6
$$ -55 -11 -18 -29 7 -16 -54 -34 -20 -5 -14 -20 -34 -64 -7 7 39 -18 4 -36 17 50 58 9 9 7 13 59 32 4 -3 -19 -1 -1 35 -1
2688apjMJ4Lj1k6K3j5lRL1m6NrJ0J6K8m4J0j4L1K7k7K2j3rpM4Lk5j9k0N8l4j9
$$ -1 -8 -9 -5 9 12 1 -25 -2 -17 -20 -11 20 -26 -21 -30 -20 -4 24 -20 -10 -24 7 34 7 29 16 7 0 44 47 22 3 -17 41 7 -12
2724a2K7pk2j2JK7j1J9l2lJ5J8NmKJQrJ1j1RpNm7N3%k1PnqrL6k6j4J7rpL6rl1
$$ -12 15 8 -14 -26 -25 2 -9 10 -22 -25 -10 8 13 9 11 12 20 11 22 11 20 13 18 -29 24 24 3 10 5 -3 -12 24 -2 -16 1 -8 -15 21 12 -19
2764a9%L1kJ3j8K1j0l8N9l5kQj7k6M8mOrm0NOKJ8l6J1J9OoPj2j1rRM2k0J6k0k
$$ -19 -19 12 10 23 5 26 16 -22 37 2 0 8 -9 -35 13 9 15 6 -34 -29 -23 -21 -3 -39 -28 -9 -3 -9 -2 -14 -25 -34 -25 17 -3 13 -7 -9
2802iOJ7%J3rKl6M7qlRj1l5K4J%j1LQl5N2k5k2Nk3%J6QQnMkj1J5L5jm4J4J8J9
$$ -9 -3 14 14 27 18 20 -16 31 23 20 29 18 -17 7 8 8 -3 0 8 -27 25 0 -22 -17 -40 -40 -24 -16 -8 -13 -9 -11 -22 -7 28 27 -17 -3 15 34
2842C4j3J3qmj1J7J7Pl6%l9J2J3J9oj0j2nK2Pj5Jl6J8KL6Kj5k1j3L4k3L7l8j8
$$ 34 21 34 26 22 11 28 45 52 16 16 -23 -11 2 21 15 5 -7 -12 10 17 2 3 -33 -15 -13 23 25 10 -11 -24 10 -13 24 -14 -32
2877c2M0l2L6J6k2k0loL2NMl3l1K6N4j5j5k6%RJ1J9mJ2k5j3J0K5j4K1l0k4L0J
$$ -32 8 -24 12 28 6 -14 -17 -23 9 14 18 -15 -46 -20 34 19 4 -22 -22 -13 -2 17 13 25 0 -13 -3 22 8 29 -1 -25 5 6
2911FMJ0j5l0J3J9j8pJ9jqJ6K9m9J9j3j1J1J3%OmJ1k1L4Nj1k0kJ2j0J7lLm4PK
$$ 6 10 20 5 -25 -12 7 -11 -18 1 0 -8 8 37 -12 7 -6 -17 -6 7 7 13 9 20 -1 33 38 27 7 5 17 7 24 21 24 -20 -13 -11
2948a1J7k5L7l7j2LK3L1k1k1k2J6j5J9K9nk4LjL6J7j5oL%OK8k2j1j9K0pj0J0j8
$$ -11 6 -19 18 -19 -31 -28 -5 26 5 -16 -38 -22 -37 -18 11 6 -18 -15 -16 20 37 22 16 19 19 25 53 31 20 1 21 14 4 14 -4
2983dJ4k7J3KJ1j2Lj6nL5jnKl4NK8J3k1J1j2%qJ0oJ0J3k0oJ4QJ2k4qj9K3K3k9
$$ -4 10 -17 -4 -2 9 -3 0 -16 -21 14 13 8 10 -24 -19 9 22 1 12 0 0 -8 2 -4 6 19 -1 -7 7 15 27 3 -5 -24 -1 22 -7
3020goM3l3RJ3jk0KJ3j7K9j5MlK0l6pL8j4l5j1M2Qk0K3j7l1OJ8RJ7j8k6J2J5K1
$$ -7 -13 30 -3 6 19 18 -2 0 13 -4 25 10 14 11 31 -5 -12 26 12 -23 -34 8 16 -4 19 2 -29 -23 -5 4 21 3 -23 -11 4 25
3056B5j4l3KK9j6M6LLk3l4L6j3L9l1k3M5n0K0%j7moJ2oJ7j8j1k4L3J7j2J1kOk5
$$ 25 11 -22 -20 9 -7 39 42 45 22 -12 24 11 50 19 -4 41 -9 11 11 -6 -10 -16 -4 -10 7 -11 -22 -46 -13 4 -8 3 1 7 -18
3091a8LL0k0L7ok1J8k0LJ1J7j7j4K2Qj1k2J5j9%Ojj5J2%KJ6KJ8n0%lL2oj4qJ2
$$ -18 -15 15 -5 32 26 5 23 3 6 17 34 17 3 25 33 22 0 15 -4 -4 2 1 -14 -2 -2 0 16 18 36 -14 -14 -17 15 9 -5 -13 -1
3128al1O6poj2QrNlJ8n4J1j2K2k%J3k7K9j1K2J1k9j0OlK8qRpk9J7N%K0k7rPjR
$$ -1 -32 34 27 21 9 17 8 13 10 28 -26 -15 -27 -5 -7 -7 6 -21 8 -3 19 30 1 -9 -3 -6 22 14 23 16 -13 4 9 9 29 2 -7 0 -1 8
3168HJ6m8RKLJ1Pl9K4j5%L0Jj2oJ4Lj9L0m0L8j3j8M0l7L1Lrj1J4K1nk2j2OjLK3
$$ 8 24 -24 -15 -13 -10 1 8 -31 -7 -22 -22 8 9 -3 -9 5 8 -11 19 -21 17 4 -14 26 -11 20 23 14 3 17 38 33 11 -1 5 4 7 30
3206C0k3Mmo8O0Jj4JJ1k2j1M4j2Qj1k0L3oJ1NJ1rnJ2qPk0Pk3J6K6j6Ol6OJ2j2
$$ 30 7 11 7 -61 -1 0 -14 -13 -2 -24 -35 9 -3 5 -6 -26 7 1 12 17 28 19 14 26 18 25 5 12 -11 5 31 15 21 -15 -9 3 -9
3243iOK6l0k6L2k8L6LK0n4J1J8Ok0NJlK4j8N3l5k3KlK6j0pQkMK4k9QNk4Oj2L9
$$ -9 -3 23 -7 -33 -1 -29 7 10 30 -24 -13 5 11 -9 -4 -3 -6 18 0 53 18 -5 -3 -6 20 10 3 11 9 13 37 8 16 21 -3 3 -9 30
3281C0k5Roj1j1J1K1J2k0k5J1K4%JRj8QMql2J5j8J2L0rl2j6K6kOl%L4mk0J6j3
$$ 30 5 14 8 -3 -14 -3 18 30 10 -15 -4 20 20 21 30 12 20 24 16 -16 -1 -19 -7 23 14 -18 -34 -8 -10 -4 -7 -7 27 23 3 19 6
3318FK0j0J9l2nJ1pPjjpRloJ0j8KJ7k0K0j9j8LJLJ0Mk2Nj4K2rrL3l1M2j3%j1K9
$$ 6 26 16 35 3 -2 9 2 9 8 7 0 9 6 0 10 -8 -6 11 -9 11 -8 -26 -23 -22 -19 -9 -5 -27 -22 -36 -14 -23 -32 1 -30 12 -1 -1 -12 17
3358A7J6n2K0K4l2MRj2K3k9K1k5LJ7l8L0K3j9k1Rq%J4J0j7j4NNJ1LJ3j0kl1L1
$$ 17 33 -19 1 25 -7 -3 6 -6 17 -12 9 -16 -13 4 -34 -4 19 0 -21 -12 -20 -20 -6 4 -13 -27 -22 -17 -6 -3 10 0 -2 -33 -2
3393bKL2k2k4LK0j7OjmR%pj3ML6m2L8j6qL3m4J2RJ7j1k1K3k0j5J2J5nmNj7K0M
$$ -2 0 32 10 -14 -11 9 -8 -2 -3 -7 2 2 -5 -18 -14 22 -20 18 2 -6 27 -17 -5 4 21 10 -11 12 -8 -23 -11 4 -1 -5 0 -17 3 7
3431Gj3Kj7J8k6M1lK3j4kj1K8j9J7m6L9k8K0J7k3K2k1%%j6J5j2K0k7J4j3rL6q
$$ 7 -6 -4 -21 -3 -29 12 9 32 18 16 5 33 14 31 -15 24 -4 16 33 10 32 11 11 11 -5 10 -2 18 -9 5 -8 -17 19 11
3465A1m1LL4j9Ol0J0J4Jj7K2J5k3J4qJ7mPNrJ2kK7k7l3J2mJ1J1Nj1j5J6k3J8j2
$$ 11 -30 -27 7 -12 -6 -36 -26 -12 -11 -28 -6 9 -14 0 -8 9 5 12 17 8 20 18 45 18 -15 -3 -7 4 15 20 9 -6 10 -13 5 -7
3501gJ2k2OL1j2pj9J7JQk6M6j2pj6Pj5J9J1k5J5nlRj0K1j4QNk0L6l6J1K2j6k4
$$ -7 5 -17 -11 20 8 1 -18 -1 0 8 -18 28 16 9 -7 0 -15 4 15 -10 5 0 -3 6 -4 17 3 11 16 -4 32 -4 7 29 13 -11
3537a1K7j4qR%k0M7rl8L3k0nQL6m3J5jj6L4j9KmQoj2J4j7%qK0j7J0K1J2j6k1K1
$$ -11 16 2 -6 3 3 -17 30 21 -17 16 -4 -9 -1 35 -8 7 6 -10 24 5 7 3 11 5 -7 7 -10 -10 -18 2 -15 -5 16 28 12 -9 12
3574A2Lj9K8nk9K8k2K2J3k0KK1k4K%ql1L0N%qNj8QJ%lJ9l4JK6Ll0N0Pk8j1K7K1
$$ 12 15 -4 24 19 -10 18 -4 18 31 11 13 34 10 12 12 4 -27 3 8 8 0 5 -13 -5 -4 -4 -7 12 -22 -21 5 8 -22 28 35 7 -4 23 44
3613D4n5MK8k8L7Jj7oj6J6J8k4J0l6J5J1J5k2oj4ORmMQJ4m0K0Rj1K1%k6J5PJ6
$$ 44 -11 -7 21 -7 30 31 14 8 -8 8 26 2 12 -24 -9 2 17 -5 -11 -25 -19 -10 -14 -10 -2 12 -28 -8 1 -10 11 11 -15 0 7 23
3649B3j6LJ1qok0KL1nk0lK0J5n5L5J0Nj6L0Rm5J2Pj9k2K3J6j6k0OlK9qPo%MpJ3
$$ 23 7 10 21 13 7 -13 -11 20 15 -5 -8 12 27 -28 7 17 22 6 36 45 0 12 19 0 -22 1 17 1 -19 -13 -16 13 5 12 6 6 10 3 16
3688A6k2j%J3pkmJ7KJ5n9M9jk1J6j1nK6J7J3l1NJ5k6MlrJ6j1J0j0Kk2j2J5pJ3
$$ 16 -6 -7 -7 6 -1 -3 -7 10 12 27 -32 17 16 -5 11 0 -5 21 38 51 20 25 40 14 18 15 6 22 11 21 11 13 -9 -21 -6 -13 0
3725@J3k5K3l5nM6k2NpK9qj6rK3nNqRnj5K8k8jL7j3k2J4j6K0j3K8j5j8K5j3Kj9
$$ 0 13 -12 11 -24 -29 17 -5 0 -7 22 14 -2 -11 12 7 12 4 13 8 -7 21 -7 -8 29 16 -6 8 -8 12 -1 27 12 -6 19 6 8 -11
3762a1L8k3j0kK1l2jJ3kj3J3MJ0mj6oL6k5J5K0l8L4k0J1j1J4LkmNnK0j0J6m0j3
$$ -11 27 4 -6 -8 13 -19 -20 -7 -9 -22 -9 -5 5 1 -15 -21 15 -10 5 25 -13 21 1 12 1 15 18 16 12 17 12 32 22 38 -2 -15
3798a5O4j8k9jMj6J3Oj1MK2m3L2k9L9k3j5J1Kk1J3K6j3rqmK3rRpL0jl9K1J2ok2
$$ -15 49 31 2 1 5 -11 2 8 -3 1 23 -20 12 -17 22 -1 -16 -5 -3 -24 -11 15 2 -7 -15 -19 4 -5 4 -3 27 26 -13 8 20 14 -8
3835hL2j5mK9k2MRj2mJ6J0l4%LML1l9j6j6J5Pj9J4rJ7j2K0k7K6J2oj1Jk2M5MQ
$$ -8 24 9 5 34 12 16 25 13 9 25 35 1 1 4 8 39 0 -16 -32 -17 -10 -29 -15 -24 -7 -19 1 -26 0 12 6 -5 -4 -26 19 23 31
3872C1l7qJ8J%J3k0K6k6J8k0J1j8jJ1J2j3J3k2J0j3j2J8j1K1j8J5nkK9k4j5%J5
$$ 31 -6 -14 4 5 5 18 -2 24 -2 16 -4 7 -11 -12 -1 11 -2 11 -11 -1 -14 -26 -8 -19 2 -16 -1 -6 -8 21 -3 -18 -18 -3
3906cK0j9K5On2L1j1KK7l2k5J8L9j3rj2J3pOqJ2k1J0MkK2j2k7L7k6j4J2J0k1P
$$ -3 17 -2 23 29 -23 8 -3 -1 26 -6 -31 -13 26 13 4 -8 5 -2 4 -4 8 -13 -3 1 -1 21 9 -18 19 -7 -21 -9 1 -20 -13
3941a3%K0Pj7jJ9l6j9J6K5j1k6K8MlJ7k9K5j1QRkOJ6k8Kk0K2K2k2J0JrLnj0Rk0
$$ -13 -13 7 14 -3 -4 15 -21 -40 -24 1 -10 -36 -8 -4 -7 10 -19 6 -5 3 12 10 16 32 4 6 -14 8 30 8 18 19 10 13 8 -2 7 -13
3979a3RL1m0L0n3J5K4mj7%RK3m0L8k6RPj5K9k2J3KK2j1j6KOk2K9rj7OL9l5j3K5
$$ -13 -4 27 -13 17 -36 -21 3 -1 -18 -18 -9 14 -26 12 -14 -5 2 -13 16 -6 7 9 31 20 4 6 12 -10 19 10 -7 -1 38 3 -10 15
4015A5j5j9K6k5K0j3J3Rm2nK5Mj4K0j8kJ6nJ7j8j4K3kj9K2j3K0jNj3JL4l0pj3
$$ 15 0 -19 7 -18 2 -11 2 11 -31 -36 -11 -7 -21 -1 -19 -21 -5 -10 7 -11 -25 -2 -4 -23 -1 -14 6 5 10 -3 -2 32 2 -5 -18
4050a8K7oj0j5K6%j2L1k2LkPrNj7J6Lk6%K6NpMl7L7k8PQOJPl0L3j4llK5j0MJr
$$ -18 9 3 -7 -22 4 4 -8 23 1 4 2 9 0 5 -12 4 7 -19 -19 7 12 5 9 -28 9 -19 -12 -4 2 3 10 -20 13 -1 -4 -7 18 8 12 13 4
4091DPMm5M0Ll2OL8Jj0qoK0j2l4L0j2j6K7Nmk6lj0K0LK1j4jLkj0J3j0L4j5K6k3
$$ 4 11 15 -30 10 13 -19 -13 25 26 16 8 2 22 10 -24 6 -6 -22 5 10 6 -20 -23 -33 -13 -10 11 -3 -4 -1 -3 -13 0 -10 24 9 35 12
4129A2j5K3J4qk6K2Pom0j3L1Pjj3j1PqL1k0pkM3l2Pmj8mj7M9l6K4J4Ml5K5j9K7
$$ 12 -3 20 34 26 0 22 29 23 -17 -30 1 8 7 -6 -17 -10 -18 13 -7 -14 -16 27 -5 2 -2 -20 -24 -41 8 -28 -4 10 14 -21 4 -15 12
4166A2lk4K1k0L0k0K2Ll2J1K3rpLOj1j7K2J8m2NQlQpmK3j2j8j7K3MN%Jj2j2%R
$$ 12 9 -15 6 -14 16 -4 18 21 -11 0 23 14 7 10 16 5 -12 10 28 -14 -9 -1 -4 4 -3 -7 16 4 -14 -31 -8 -4 1 1 2 -10 -22 -22 -13
4205a3K2j4pl2N3Pm1J1J3j0oM0rJ0J8l1J3j9NL4m1MOkJ1mLk3Oj0LqK4Kl8j4L7
$$ -13 9 -5 -12 -44 9 16 -25 -14 -1 -11 -17 23 14 24 42 11 24 5 10 44 3 7 13 11 22 18 21 -2 4 -6 -3 -11 13 15 -23 -37 0
4242@m1J0K4j6RK0k0P%oJ4j4RK2j4j5M3l5rL2j3kk1M3k0k2L8l2L1m3K9j0j7JQ
$$ 0 -41 -31 -7 -23 -14 6 -14 -7 -7 -13 1 -13 -4 18 4 -11 32 -3 -12 20 7 5 -16 27 7 -15 23 -9 22 -21 8 -2 -19 -18 -10
4277a0kJ8l0K9m3M0j3J0rJ1Rl7J7kK4ojpNOK1j9Rk0QK0j9j0J0j5L7l2J4k3J4J7
$$ -10 -12 6 -24 5 -38 2 -11 -1 -10 1 10 -27 -10 -12 12 6 5 -2 3 9 30 11 20 0 8 28 9 -1 9 -6 31 -1 13 -10 4 21
4313B1j3j4L7j8mlNj1K2j4j8%K8k6Pr%j4L0k7j3M1jk1K4j0nK3j1rK0j2lL3l5L5
$$ 21 8 -6 31 13 9 6 11 0 22 8 -10 -10 18 -8 -1 -10 -10 -24 6 -21 -34 7 6 -15 9 -1 -6 17 6 -3 17 5 2 35 0 35
4349C5k7j1K1K0l2K7k0Oj2pj7K3k2%M9l1j3%K2k2Qj5L7l7KLK7qNJ7l8J7J9qkP
$$ 35 8 -3 18 38 6 33 13 19 7 0 -17 6 -16 -16 33 2 -11 -11 11 -11 -3 -18 19 -18 -16 -13 14 6 11 28 -10 7 26 18 16 23
4385B3pk0L6k6J0j5J4Rj4qJ5lJ7Pm2JLNj9oPj6J4J2Lj7K3j5KnJ4ooJK1Kj9K9j3
$$ 23 16 -4 32 6 16 1 15 24 10 2 17 14 31 38 -4 -3 0 5 -14 -20 -13 -29 -15 -3 0 -17 6 -9 -7 -12 2 -4 -10 -9 12 14 -5 24 11
4424A1j7NJ6kMj8kQj1rJ0RL0m1K3k8LJ3j5J0QoNjk6J2J1l6M5j0k9K0Lk0M6j0k1
$$ 11 -6 -1 15 13 17 -1 -3 5 -6 -15 -5 4 34 -7 16 -12 -9 4 -11 -1 7 1 6 5 -21 -9 2 -34 11 1 -28 -8 -5 -25 21 11 -10
4461a0J4J6l2PMk5OKJ6MJ3j2J5k4qMK6j2MLj6%J5j4K5k0j4K6k0K5k5j7J8%KpJ2
$$ -10 4 20 -12 -5 -1 -26 -20 -18 -2 2 15 3 18 -6 -14 -10 16 4 8 11 -5 -5 10 -4 21 1 -13 13 -7 18 -7 -24 -6 -6 -4 -11 1
4498Aj3okOL7k5j2K0rJ3OLNKk5J0J3j3prL5p%JkJj7Ok1%QLnnqL2l3LOj5j4J3L2
$$ 1 -12 -18 -20 -14 23 -2 -14 6 -3 10 16 19 24 26 1 11 24 11 4 -5 30 23 23 24 22 23 6 12 -9 -9 -1 2 -3 -8 -16 16 -17 -14 -8 -23 -37 -24 8
4541Hk1OK0j9j3K6Mm3K9J4l2K3jjRJ3rnj9L0j3L%j9K5LPk5Rj3KNPqMJk0j5J3k4
$$ 8 -13 -7 13 -6 -19 7 11 -32 -3 11 -21 2 1 0 9 22 13 8 -11 19 6 9 9 -10 15 18 25 0 9 -4 -2 3 10 2 6 7 -13 -28 -15 -39
4581c9L1j5J2lPQk0RJ5k1L0l9MQK5j1lLk2J8PK9qQl7K2k6RJ3oOqMj0j0K2j6nj6
$$ -39 -8 -23 -11 -14 -7 1 -19 -10 5 -16 14 -25 -21 -13 12 1 -2 1 -21 -3 4 33 25 33 -4 18 -8 1 14 8 14 6 10 0 -10 12 -4 -9 -25
4620b5L5j7K6m5K1Mj9K0MkmNj3J4%jj9MJ7rqL2j9K2l4J5K8l1K1j3nprj6L0J7k6
$$ -25 10 -7 19 -26 -5 -1 -20 0 4 2 -2 3 -10 4 4 3 -16 -12 5 -4 -12 20 1 23 -11 4 32 1 22 9 4 -3 -12 -28 2 19 -7
4657gJ0k0K1Pk8L1l6L1j8L7k5j9pML5j9j5%L8j7j7L0j5nj6J1K8l0J3J9j4K5m2
$$ -7 3 -17 4 11 -17 14 -22 9 -9 28 3 -16 -23 -19 16 -3 -18 -18 20 3 -14 16 1 -4 -20 -9 19 -11 2 21 7 32 -10
4690a0jM3k2%j9J4k0J3%nOk4J8j7j2O6l5K0k4J4K0n4K5MLMlj9J8k3M8mk9JJ6p
$$ -10 -11 32 10 10 -9 5 -15 -2 -2 -7 -1 -25 -7 -24 -36 30 -5 15 -9 5 25 -29 -4 0 3 7 4 -15 3 -20 28 24 -5 -4 12 5
4726Ej7MK7j6kJ9j6J7jj8JJ9oj5K6rk4j6J3QQRk8J8j0K3l6J4JNk7K3k4M9l1%j
$$ 5 -12 -8 19 3 1 20 4 21 20 2 3 22 16 1 27 18 -6 -22 -9 -1 7 16 -12 6 -4 19 -17 -3 -2 3 -24 -1 -25 24 -7 -7 -8
4763hj1K2NRk1j3J6K6k6kJ6K3j7j2Rk0K0qK4k4j2%jOJ4k3J5nRk0j9K9Qj2pK0j9
$$ -8 -19 3 8 17 -4 -17 -1 25 -1 -3 13 36 19 7 16 -4 16 8 32 8 -4 -4 -5 1 15 -8 7 2 11 -9 -28 1 9 -3 -10 10 -9
4800iL3j5j4jorL5nl2K0K7k0nM6l9j4M6l1j4LJ9k4NNj3j0J4J8pRl8K9K0j2Oj4
$$ -9 24 9 -5 -6 -12 -21 14 9 -23 -3 24 4 -1 45 6 -8 38 7 -7 -4 15 -9 -4 1 -12 -22 -8 10 3 12 -26 3 23 11 17 3
4836Cl1J6RRj3j1j2PrK8ljK5k3NljJ4NJNj8j4K7k%L%k1RJ0Lj2L5n1M9Jl8K9k6
$$ 3 -28 -12 -3 6 -7 -18 -30 -23 -32 -4 -7 -8 17 -6 -1 -4 -5 9 14 15 20 2 -12 15 13 13 16 16 -5 4 14 17 5 40 -11 38 39 1 30 4
4876Dn%Qk7OK7m3J8j6J5Ok5K5pj1oK9K5k8K5k6pJ9l7K0M4m1M1l4NLjJ5Mj0j8k0
$$ 4 -1 -1 7 -20 -14 13 -30 -12 -28 -13 -7 -32 -7 -14 -25 -31 -2 23 -5 20 -6 -13 6 -31 -11 33 -8 33 -1 4 7 6 21 25 15 -3 -23
4913b3L3j2J4j5J4l0LL1j6rLk3J5RJ8ll3JK6Jl0J6oLJ2kL3j9RQqkJplJJ2j4qK0
$$ -23 10 -2 12 -3 11 -19 -16 15 -1 -10 -7 -30 -15 -6 12 9 -24 -23 3 4 -26 -10 -16 -13 -1 -3 30 11 20 28 20 18 19 12 9 10 22 8 0 20
4953B0j2JRoPk8NKok3L9qJ1l6K1mL6m8J5%J2Kj6j0KJ2PJ0j0Qj7%K6qJ%k1J1K8
$$ 20 8 9 18 12 19 -9 -4 -2 -8 -31 8 0 11 -25 -4 -8 28 -20 -5 -5 7 9 -7 -17 -15 -3 4 14 4 12 -5 -5 21 13 14 14 -7 4 32
4992C2l1J0JPm0K3J9j3j0oj7K3kNOj1Jj5Pj8LJ6j4K8lj0RJk7M8m5K9j4QRj0L5
$$ 32 1 11 12 19 -21 2 21 8 -2 -8 -25 -2 -4 1 7 -4 -3 -18 -11 -29 -26 -10 -24 4 1 -9 0 1 -26 22 -23 6 -8 0 9 -1 34
5029C4k3j1J9j1OmLl0K1j0J1Pj6K4m7L8k6L6k5j1j7M8k2j0K2k3LOqNj2K7K6k1
$$ 34 11 0 19 8 14 10 13 -17 4 -6 5 12 -4 20 -27 11 -15 21 -4 -15 -32 16 -6 -16 6 -17 -14 -8 -16 -11 -23 4 30 9
5063Ij2rK7oJ8j5j0K1l4Qk2L7mK0Mk9OJ2j1k2K0JLqj6jJ1J1J5k3J1k1Oq%k1K7
$$ 9 -3 -12 15 9 27 12 2 23 -11 -3 -25 12 8 28 32 3 9 21 10 -12 8 9 12 4 -12 -13 -2 9 24 1 12 -9 -3 -11 -11 -32 -5
5100ej8LM1j2l6K5l0K1J1lJ6JplJ0j6lJ9j4K3mk3JJ6Nj1J3opj7Rj0Pj3L8Pj0j3
$$ -5 -23 -20 21 9 -27 -2 -32 -11 0 -3 13 14 7 4 14 -2 -5 14 0 23 19 -4 -3 13 18 7 20 14 7 -10 -1 -11 -4 -17 21 28 18 5
5138Ek1K2qJnNj3K0l7M6j9j6K4qj0J0L2k0l0Q5o1J4%oJ4j8Qj0K4k9RLl%Oj1NK5
$$ 5 -16 6 -2 -1 -6 -1 -14 6 -31 15 -4 -20 4 -4 -14 -4 28 8 -22 63 2 16 16 10 24 6 14 4 28 -1 8 11 8 8 14 3 8 33
5176C3k7kooQQJ3j3k9L9Lj4m9M3kJ0j4jK4J0pm7N0rOMj6Pj5K0Nj9Rj2J0Jj7NM
$$ 33 6 4 -2 -8 0 8 21 8 -21 18 21 7 -42 1 -1 9 -5 -6 18 28 21 -26 24 15 21 25 9 16 1 21 26 7 16 4 14 15 -2 3 7
5215Gj8K0j7RJ7k0l5QlK0K0k8J3kK3k4%qJ9J1k8L5j6J6pJ6mj5j7M6n1J4K7j6R
$$ 7 -11 9 -8 1 18 -2 -37 -29 -32 -12 8 -20 -7 -9 14 -10 -10 -18 1 12 -16 19 3 19 12 28 24 9 -8 38 -13 1 28 12 21
5250B1m5K7NqK2j8Lj8N%J7jj6mkmj7K4mRj2L7n8J2L1LoqPlQrJ6k5J6MOj3j6K5
$$ 21 -24 3 8 0 22 4 7 -11 -6 -6 11 10 -6 -10 -12 -16 -33 -9 -13 -4 -16 21 -37 -25 6 9 3 -5 2 -1 7 -2 14 -11 5 9 15 2 -14 11
5290A1JJm4N3k9JqK6rNmJj9K0j6l0M2qJk2M8k3qj6L0k6nj0MN5Nl1kjK8j4nKJ8
$$ 11 12 13 -31 22 -7 -6 -14 12 3 8 4 5 -14 6 -10 -40 2 -6 -5 -27 21 -2 -10 -26 4 -22 -27 -37 -33 22 27 -4 -6 -7 21 7 2 4 22
5329B2ok8L6jk1rK0onJ6j6J3J0k8K%j9Mj6J4J6jrLk0K6rj1%J3J6qj9K0Klll0K5
$$ 22 16 -12 24 23 2 -7 13 7 2 18 2 15 25 -3 -1 -1 -20 -16 -32 -18 -2 -3 -12 -9 -29 -3 -12 -23 -23 -10 6 -2 -21 -1 1 -2 -5 -35 -10
5368a0K4RJ9l9J2mK5k3J8qj0j7k%J9lJ7rk2j3j1L9qj5P%J0kj5Pk9M0nJ9k7J%P
$$ -10 14 23 42 3 15 11 36 13 31 23 13 -4 -6 -6 13 10 27 18 -4 -17 -28 11 3 -12 -5 -5 5 3 -12 -5 -34 6 1 20 -7 -6 -6 1
5406AJ6j0J1j4Rk8L4k3MkOJ7j9J4qN%J6j2ojj1J3l2J3J8OKj9mj3K9l0L4l4MRl6
$$ 1 17 7 18 4 13 -15 19 -4 0 -2 4 21 2 16 8 13 13 29 17 11 10 -1 12 -20 -7 11 17 19 0 -4 -17 12 -18 16 -18 -14 -5 -41
5444d1K5J4j1kL1k8J7j3Lj2J5J1L5l4J0MnJ0l7L7k2pJ0Rj0LJ4l1OPj2J5lk5J3
$$ -41 -16 -2 -13 -15 16 -12 5 -8 -5 -17 -2 9 44 10 20 24 19 29 -8 29 7 0 10 19 9 12 26 -5 1 8 -4 11 8 -17 -4
5479dLj3J4l6N9k1rQj5K9j0k5K8k8L5j4j0j3M2Jj6J4k3OPj8K7j2K0nrk2kK9l6
$$ -4 -1 -14 0 -36 23 2 -7 1 -14 15 5 -20 8 -20 15 1 -9 -22 20 21 5 19 -4 2 9 -9 18 6 26 21 12 -10 -12 17 -19
5514a9K2j1j5LNK9L3n9L4j1k3rK3qj4J1K8k5J4olllOj8K7j7LmK3k6J8l7M7j6J8
$$ -19 3 -8 -23 -20 -15 14 47 -12 22 11 -12 -21 2 -6 -20 -9 19 -6 8 2 -1 -4 -7 -1 -19 8 -9 -6 -10 13 -13 5 -32 15 -1 17
5550A7Qj6j5M0l4K6j3rJ9k0K5k3k5K3j1nRnnj7l1M1JRj3LlJ4Oj5mjK3PNj8K5J
$$ 17 25 9 -6 34 0 26 13 4 23 3 28 5 -20 3 -8 -13 -4 -9 -14 -31 -62 -21 -20 -11 -24 -21 -24 -10 -4 -19 -23 -24 -1 6 11 -7 18 19
5588A9l2J1J8j2O%J5j0l1J7L5l5k3L8l6LLJk3K2J7j1K1j2Pk4j2J0J2pK3k0j2O
$$ 19 -13 -2 16 4 10 10 25 15 -16 1 36 1 -22 16 -20 -17 -14 -13 -36 -14 3 -8 13 1 8 -16 -28 -18 -6 -13 10 -10 -22 -16
5622a6L7rRl2J8LrPoJ7oJnnMkPk2J6MJkk0K1k8K0%qJ4m0LL1qlKj7J0K0k1J3K4
$$ -16 21 12 21 -11 7 10 1 8 2 19 13 14 9 4 8 6 13 -9 7 11 12 10 -10 11 -17 3 3 -5 9 -31 -28 3 -5 -8 -6 -23 -13 7 -14 -1 23
5663B3l2K0j5J2pjNJ2j0K7l6J2Qk6J6qkJ5P%l1MK5j3np%J4MRl1kK6k3J7Lk1Mk
$$ 23 -9 11 -4 8 1 0 5 17 7 34 -2 10 18 -8 8 0 -2 13 20 20 -11 -7 18 5 0 -7 -7 7 11 20 -11 -13 13 -10 7 10 -11 -7 -9
5702iJ4Lk4L3m6J5L4o%J7m2K3Qj3mJ3joK7j9j5ORl1M0k7j3L6k7J5J2m1%mK1nl2
$$ -9 5 8 -16 17 -29 -14 20 14 14 31 -11 12 20 7 3 16 15 9 36 17 2 8 17 -14 26 -1 -14 22 -5 10 22 -19 -19 -23 -2 -7 -39
5739c9L7J0j8j1L2pJ1nj5J8JKj9RJnK8k6jM0l1Qjj0j0L0m3M4j0k1KJ3lj2J1k1
$$ -39 -2 8 -10 -21 11 4 15 10 -5 13 14 16 -3 6 7 2 30 4 3 43 12 20 19 9 -1 29 -14 30 20 -1 1 14 11 -1 10 -11
5775a1%jj7M9l2J0PJ1k2K3mk6j4L2j9KJ8Ll2LK7j1J3Lj7rK8J4l3J1L1l1j2PJ9
$$ -11 -11 -12 -29 20 -12 -2 5 16 -6 17 13 -13 -27 5 -14 -12 6 9 -23 -20 7 -4 9 12 -5 -14 14 28 -5 6 37 6 -6 1 20
5810B0J5k5Rk7J2oJLJ0nj5J9jNj6lPk0Ok6K6pK2KK1j9NmJ9j6k4M7J0j4m6L4qJ5
$$ 20 35 10 19 -8 4 -2 -1 2 12 7 -8 11 10 15 -1 -4 3 -17 -11 -37 -11 -18 4 6 27 8 13 9 28 12 -12 35 45 31 -15 19 11 26
5848B6k2mrPRlJ4oj4J5jPj0j4j4J5%pOOk6L6j1Qrj4L3j3jkJ1j9K2J2k2%j1NK7
$$ 26 4 0 -9 -2 7 4 18 12 -2 13 12 19 9 -5 -19 -4 -4 -11 -5 1 -25 11 0 8 -1 -15 18 5 4 2 13 -6 16 28 6 6 -5 0 27
5887B7k2J9mNJqj0Ml2M3Qk7JQj2k5K8Rqk1KJ2J3l6M1Jk1Mj3qL7j7nPoNj9J8KJ7
$$ 27 5 24 20 25 26 18 8 12 -20 23 31 4 5 13 1 -24 4 13 5 -16 -14 -2 11 -25 16 17 -4 0 -13 -21 16 -1 -6 1 -5 0 -19 -1 1 18
5927A8j3j7J9K3nl5JJ5kj6K8j1oJL0l2j0J1J3Nj2J1rk2J7j8K0j3KmPJ5J5l9K7
$$ 18 5 -12 7 30 25 -10 -9 6 4 -12 16 5 -1 0 30 -2 -12 -1 12 17 5 16 7 -15 2 -16 4 -9 -7 -11 -4 11 26 -13 14
5962A4lkjk5MJ7j3K2j8K0J7k1j0rL7k9%J2Mjj3pPoJ1Pj0pPLk6QJ8k5J8k9J3L2
$$ 14 11 9 8 -17 -13 4 -9 13 -5 15 32 11 1 -8 29 0 0 12 16 15 2 -5 2 -4 7 14 4 -3 4 7 -19 -11 7 -18 0 -29 -16 16
6000A6m3K7l4L4Rj3J7k1qJ8K0K0l8mJ6J8k0K1m5OK3j3qlJ6k5J8j2J8k2nj1K0M
$$ 16 -27 0 -34 0 9 -4 13 -8 -16 2 22 42 4 0 16 34 14 35 -10 -4 19 6 -2 -5 11 -14 4 -8 10 -12 -17 -28 -8 -4
6034dK0j3J3l2J9oJ1J2qk3jJ2j3POKJkj4K5K0j4nK5n1J1J0J6KPj6PonNj9k8M8
$$ -4 16 3 16 -16 3 -3 8 20 12 -11 -12 0 -13 -6 0 2 3 1 -13 12 32 18 13 38 -13 -2 8 24 26 33 17 24 18 13 18 -1 -29 19
6072A9j7J8lpj2kOkoK0l6J3k0LM2k2lj1K6r%j0L0j4%K1Rk7lj2pL3oKj2M0j3k7
$$ 19 2 20 17 10 -2 -4 2 0 -6 14 -22 -9 -29 -26 16 -6 -9 -20 6 -3 -3 -13 17 3 3 24 33 6 3 -9 -16 17 11 13 1 41 28 1
6110APj0QK2l8kJJM3l7nj0jJ4j5J6nJK5k9J9J1k1nJ4Jk1NK1pnJ1j2J5mOJ4Kk3
$$ 1 8 -2 6 28 -10 -12 -11 -10 33 -4 -9 -19 -20 -6 -21 -5 -10 -9 16 -13 6 17 -4 -9 5 6 -15 -10 11 4 -1 10 -2 13 9 15 29 31 8
6149Hl3K5j0L0npNl4J3QmOoPOm2JL6KKk0J3Pk1LMj1KL1k1JJ9J3kKk4j3QL2k0j9
$$ 8 -25 0 -10 20 15 8 13 -21 -8 0 -4 2 -4 3 9 -33 -32 4 6 8 -12 1 8 -13 -10 -6 -17 -15 16 -5 -4 15 28 26 28 4 -9 -1 31 11 -8
6190hJ7qj8M8mrqoJ2j4j0OK2l3L5l8j7QML9j3j4lqLJ6j2RoK8Mk5Kjj8K7rJ1j3
$$ -8 9 1 -17 31 27 18 10 4 16 2 -8 -2 20 -13 22 -16 -33 -25 -21 18 5 -9 -12 -20 -17 -1 -13 -4 -10 18 22 -3 -1 -2 -20 7 -2 9 -4
6229dPLpJ7oJ7J6l8j2M3k9NJ2ljj9nPj8QMk1J1pNj7J1J8j1K4kJ2%qk3J2j%Olo
$$ -4 3 6 -1 16 10 27 43 5 -7 36 7 12 24 21 20 1 -4 3 -15 -7 -3 -24 -13 -20 -15 -32 -21 -3 -14 10 8 20 20 12 -11 1 0 0 6 3 -3
6270cJ1j8OqK7J1k3j6L6l9K7k0RJ2oJ4j2j2JqoJ9plKJJ5l5L1J5m3K9j6J2JJ2j4
$$ -3 8 -10 -4 -12 15 26 3 -13 23 -16 11 -9 0 12 6 20 8 -4 -3 -11 -17 2 -5 -8 -6 -5 10 -25 6 21 -22 7 -9 3 4 16 2
6307BMj2Ok0J5PJ3J0oj6K3J%J3m3J4Okj0J7qMk7j7K2L6k8j9J6opPJ3J1j8j0K4
$$ 2 6 -6 0 -20 -5 2 15 25 19 3 26 27 27 40 -3 11 17 15 5 22 14 18 -9 -26 -4 32 4 -15 1 -5 -12 -5 8 19 1 -9 15
6344A5l2L0nj5N2o6K9J0rJ0k4J0NJ9j5j9J3oJ8rJ1Ok6L5j8j7K0n1M9k6j1QRJ4
$$ 15 -17 13 8 -7 45 -21 8 18 9 19 -5 5 10 29 14 -5 8 2 20 11 22 28 2 37 19 2 22 -29 20 -6 -17 -9 0 14
6378A4k7Nk%RNm5J7K3kk2K3J8j2pPmL7o3L5%pRqK9l1KK5l1J5km%RjMkl2k3L8K
$$ 14 -13 -8 -10 -10 -1 4 -41 -24 -1 -3 -25 -2 16 4 -3 4 0 37 -26 9 9 2 11 3 32 1 3 28 -3 12 10 6 6 15 14 18 16 -16 -39 -1 1
6419ApJ8l6QJ3%PNol0J4kM3m9M2j0l3OM0rm6O7k2J0k3J5LpqJ0j7J4NmoJ8j5l0
$$ 1 -6 12 -24 -16 -3 -3 4 9 3 -27 -13 -15 28 -21 21 11 -22 -16 24 15 -31 36 14 24 1 16 19 12 4 14 -3 11 16 12 6 24 9 -21
6457b1M0j0Lj1k1N2m1%K8k2lJrK3k0Jk9K0%M6j7oK4k8K0Mj3mNRl5N7m7LQJ8qJ5
$$ -21 19 9 12 1 -20 32 -9 -9 19 -3 -6 -5 -14 9 -11 -10 -39 -19 -19 27 10 4 28 0 20 24 11 7 12 21 -14 43 -4 -1 7 25 17 32
6495C2j9j3L8l7KkJ6k9Qj8JJ5j7K0j4koK9Pk7J8j4J0K7k3j5K3Jomj0J8MKK8m2
$$ 32 13 0 38 1 3 1 17 -12 -4 -22 -21 -6 -23 -3 -17 -19 -25 4 11 -16 2 -12 -2 25 2 -13 10 11 5 1 -9 9 13 15 43 1
6531AL0j7%j1L6Kl0QJ0k8MOk2J4mj7J6J6k1K5l3mK2j8L7l2JRlRJ6j5J1k2K5qj4
$$ 1 31 14 14 3 39 41 11 19 29 1 5 11 -11 3 -1 -18 -2 14 -7 18 -15 -19 3 -15 22 -10 -9 0 -3 6 22 7 18 -4 21 13 -1
6568aKK3jj9L6j7Rj1j3J4j4K1kj3J7j3pk7QJ7k5L2j5lj3OK6l0lJ8nJ0k0NK4j3
$$ -1 1 24 23 4 40 23 32 21 8 22 8 29 27 14 31 18 11 -16 -8 9 -16 16 1 -2 -15 -9 17 -13 -16 2 -3 7 -13 -8 16 3
6604ClJ5m1J0L3k5K4j5J8rRl6M5j9j5K2MJ5p%k7OrPLRl8K1j1M5k1j5Nqk4L1j9
$$ 3 0 15 -26 -16 17 -8 16 1 19 10 19 -17 28 9 -6 16 20 35 28 28 1 7 -2 5 8 17 -21 0 -11 34 13 -2 3 -5 -29 2 -17
6641a7K3nJ0k6J3L4j7nMLj1J5Lj6NJ9j6Jlj1pM1k8K3l3N3l5q%j0J8k2K4j5k2J2
$$ -17 6 1 11 -15 -2 32 15 10 14 17 6 21 24 8 13 32 16 17 14 3 -4 37 9 32 -1 52 17 9 9 -1 17 -5 19 4 -18 -6
6677fj2OrJ4LmRk2jMJ2KJ3k4K1k0NL8mj7QJ9nj4nj3LMlj0M9l6MJ1qj8L0j1RJ4
$$ -6 -18 -12 -21 -7 -4 -8 1 -21 -22 -18 -6 -4 9 -15 6 -14 -9 29 25 8 16 35 30 16 11 -2 1 5 2 -8 41 5 9 20 12 -6 24 13 22 36
6717C6m3J4j1pL1Pm0JK2k1K3Nk5RP%RlMk7M1Jn5L4j4QK2j5N7n6j6J4RK6m4K2k5
$$ 36 -7 7 -4 -11 20 27 -13 -12 10 -11 12 17 -8 1 8 8 17 14 18 -9 32 33 -22 12 -2 6 28 13 70 14 -2 12 21 47 3 25 0
6754@kj7L3j7K7l5J6J7k9L3l1K%k3L4l1QJ5pL5m0QmL7oj4J9j6KOk8L6m2K6LmJ5
$$ 0 -2 -19 14 -3 24 -11 5 22 -7 26 -5 -3 -3 -26 8 -23 -15 0 -7 28 -12 -4 -8 29 23 9 28 12 14 20 -8 28 -14 12 15 11 26
6791B6l0J9kk0K9k5Jj9K9%Lj8NJ3J0pl2J9oK4Mk4Oj9jL3Nj2MLJ1Lk2j5J2j0Pn
$$ 26 -4 15 13 -7 22 -3 -2 -21 8 8 11 -7 -2 11 21 14 -18 1 -5 19 23 -1 5 -14 -15 18 23 11 15 18 29 32 10 -5 7 -3 4 -1
6829anMO5m9k1K3Mj4jlJ6j4J1k0K6kj5j8j5OJ2K2j7pkJ6j2oOJ6Lm1M8k2J5J4P
$$ -1 -6 -2 63 14 -7 16 20 6 5 2 18 4 15 -5 21 19 4 -14 -29 -23 -11 11 -6 -13 -15 1 -11 -17 -11 5 8 -33 15 -7 8 22 29
6866B9l6J3KPJ0J0l5K1j6K5%J6l2jMk3nK8pqqPjJ1j9K9j4j6K2l2M1j4j1k5K0O
$$ 29 -7 6 8 15 25 35 0 21 5 30 30 46 14 13 17 -6 -11 17 10 2 -6 1 0 11 -8 21 7 -9 13 -19 22 8 -3 -28 -8 -2
6902bMl3K3jJ8J5olnj6J7JOnj5K7j5pRK4k6kj6K1L3l0Lk3qORm7N9l7kL9kj3j5
$$ -2 2 -31 -8 -9 9 24 18 15 10 -6 11 12 18 13 -2 25 10 3 12 36 10 8 -8 13 46 16 19 -4 -12 -6 3 -44 15 -22 -24 15 13 0 -15
6941a5K9K3n1j0K0J0KJ3k1mL4l2K3kMj2JoL0l1kK9%J0l9j2J9NPj3k8J1lPmMPp
$$ -15 14 37 -14 -24 -4 6 8 21 0 -4 30 -2 21 19 23 11 12 6 36 5 3 32 32 42 3 -9 10 15 22 9 -19 -8 -11 -4 -8 -4 3 -4
6979dNj1J7Rj4J0pk8L1oJ1%Lk1L2j4J7l6K0K5j4Oj3j7L7Jlk5rJ2JJ4pkj1J8n1
$$ -4 1 -10 7 16 2 12 5 -23 8 2 13 13 16 -5 27 13 30 -6 14 39 25 31 18 1 38 39 36 11 2 14 15 29 22 20 9 27 -24
7016b4L5kj3pKjL0k0Mj2K9k0M5m1qK0l4kL6k2K9n8L9KJpjK3lQj0j7j5L2nnPK1
$$ -24 11 9 -4 -11 -9 -10 20 0 4 -8 21 1 46 5 -3 17 -17 -19 17 -5 24 -34 5 7 8 1 0 23 20 28 18 1 -14 18 13 8 15 36
7054C6l0KK1k6J6j3j5Rjm9J9M2Jopl1L5pK3m7K3K3j3oK3j8K1j3J5J8k7J8k3%k2
$$ 36 6 8 29 3 19 6 -9 0 -1 -50 -31 11 12 6 -1 -32 3 -4 19 -28 -5 18 5 -1 22 4 25 12 27 45 18 36 13 13 -9
7089iL1K5j9j3J6npk9M0Lm1mK1J2j1j0nK1j4J9j1j0K0j8mk2qK6LqJ7QNmQj5KO
$$ -9 22 47 28 15 31 26 19 -10 30 33 -8 -12 9 21 10 0 -5 16 2 21 10 0 20 2 -2 -24 -32 -6 -3 -11 6 14 19 15 23 8 10 16
7127A6K3j0j7jJ1rlj4K1rJ7mk1rJJ8j8RJk0qL4j4moJ1j9J7j1L1j6K6m0%K5J4l4
$$ 16 39 29 12 11 22 13 10 -4 17 8 25 21 0 -9 -8 10 -8 1 2 -18 -26 8 -6 -10 -16 -5 -24 -7 -18 13 -3 23 -17 -17 8 22 -12
7164a2K4k0K1%%koK0pj9K8j0NJ5l0JlJ8m6MM5j9j4J2j2NK1k0l2L5pJ3k5jJ4J0
$$ -12 12 -8 13 13 13 11 5 25 18 -1 27 17 22 37 7 8 5 23 -23 -19 26 7 -7 5 -7 -2 19 -1 -33 2 -5 8 -17 -18 -4 6
7200Fj1j2K9OnrJ2J1olkj5pLL0k4MQj9J9JJ3k4j4K4k8MNnrL0j3Mml4L0nmj2J1
$$ 6 -5 -17 12 18 13 4 16 27 21 18 16 1 -6 -3 27 3 7 15 -4 15 16 29 5 -9 15 -13 -9 -4 -9 -18 12 -1 3 -1 -35 -5 -10 -14 -26 -15
7240a5L%rj7M8j3rOknLK6OQj0Oj8LJ2k9L6nJ1Lk7m6L2MLMrj4K9Lk7o%QljjNj8
$$ -15 -12 -12 -21 -38 10 -3 -12 -6 -8 -13 -10 16 22 30 20 26 8 11 23 -6 30 25 36 39 12 -34 -2 2 5 9 0 -14 15 18 -9 -15 -15 -7 -10 -11 -12 -7 -25
7283b5J7j1J9j9J0k9L8OqK6m5K5lL2l0K1k1NJ2J5j0J3l5OJ2k8L7k4J1mmk5L5o
$$ -25 -8 -19 0 -19 -9 -38 0 6 -2 24 -21 4 1 33 3 24 3 8 20 35 25 38 3 9 21 -7 30 6 17 13 9 -16 19 13
7317A3l9M8l9Moj3K8%lk0L0rJ2k2jJ4mJ8K2l5K0jk7PL0j1jM3l3j7Qk4J4j3J0M
$$ 13 -26 22 -17 -13 -19 -32 -4 -4 -7 -27 3 -6 6 -16 -17 -3 -7 11 33 -2 18 17 -10 -3 27 16 15 58 25 8 16 -8 6 -7 3 7
7353Gk6J5MRK6pk4j2%Rjl1J9nK6j4j3L3k5M2n2L1j5K2Qk7Oj0Qj5J0%PMRoJ8K6
$$ 7 -19 -4 0 9 35 28 4 -8 -8 1 0 -31 -12 -17 9 -5 -18 15 -10 32 -20 11 -4 18 26 -1 5 -5 3 -12 -2 -2 5 9 18 12 30 56
7391E6n8K6LlJ8n3M8m0QJ2Mm3J7J4j6l7M4K3l9RJoj8M9j4JOk8K1J4j4J4nj9K1
$$ 56 -2 24 27 24 42 -11 37 -3 5 17 21 -22 -5 9 -7 -44 0 23 -16 -7 -6 -12 -30 19 5 6 12 -16 5 19 5 19 14 -5 16
7426A6j1J8J0j1j9RJjK7o9O4k9J6j5J7j6l0qK8QMl6J0K5l3M4k4QJMnlnmK2JJ0
$$ 16 5 23 33 22 3 12 13 12 39 -30 34 5 21 6 23 7 -23 -31 -3 5 9 -27 -17 8 -25 19 -5 3 4 8 3 0 -5 -9 13 14 24
7463B4Pk1jmk8K0L4j0ojj8M0pk4KJ1k0L0n0L6lj0K6ll5J2l%k8L1j6K1j6JJ7l0
$$ 24 31 10 9 5 -23 -3 31 21 15 14 -4 36 29 5 7 18 -2 28 -22 14 11 1 27 24 -11 1 -2 -2 -30 1 -15 6 -10 -9 8 -22
7499b2%K9jmL%PpK3okK1k4pJ0K9pl2J0QnqPl%Kj2J0k5K0mok2K0Nj6Jk4J3k5K8
$$ -22 -22 7 6 2 5 5 12 5 28 22 20 41 17 10 20 49 42 10 20 28 23 15 22 19 19 21 9 19 -6 14 10 4 -18 2 7 -9 -8 -32 -19 -44 -16
7540a6L5k5k1L6LqL2l0LK3j8j1K0kj2PMpK8k0nRj7JJj1PK0rm1L7mJ0qj1j5K3j0
$$ -16 19 -6 -27 9 12 4 36 6 9 32 14 3 23 21 9 16 20 13 41 21 16 25 8 9 10 -1 6 26 17 -24 13 9 19 11 0 -15 8 -2
7578bj5K0J1j7Nk1K3k0M6j3Kkj6OQj0kKJ8%J1j8kJ4j2J0k9j4N5Lk6j0oK0oLj4
$$ -2 -17 3 14 -3 2 -19 4 -16 30 17 19 17 1 7 15 5 3 5 23 23 34 16 14 28 16 26 -3 -17 38 41 15 5 -1 19 13 16 2
7615Bj8K6Jl6K0Pkj3j4K0k5M1j2%Jj7L4j0j2J2rOK8l3K1K2rk8J2jJ0k7J1J8j2
$$ 2 -16 10 11 -25 -5 2 0 -13 -27 -7 -32 9 -3 -3 -2 -19 15 5 -7 5 -4 2 30 -3 18 40 31 3 15 14 24 -3 8 26 14
7650A4qL1l1nJ3l0J4k6J8J3Jj2mj3J1Jj2RJ8j2RJ9m4J9nK4OkNo%k8L0KpOK4l4
$$ 14 6 37 6 1 14 -16 -2 -28 -10 3 4 -8 -12 -25 -14 -13 -25 -16 2 -10 -1 18 -26 -7 -12 12 18 16 21 15 15 -13 17 19 12 18 42 8
7688HlM8n3j0J0K5Kk3njJ7J5qk3k7J8kL6j5k5mj5L9j5mPJ0J7pj8pj7K8K5j3J6
$$ 8 5 53 0 -10 0 25 27 4 -1 -2 15 30 22 -1 -28 -10 -12 24 9 -16 -20 -35 4 -11 -15 -8 2 19 12 -6 -13 -30 -2 23 10 26
7724B6Mk2qJ1j5L5kk1K1j5oj3J8Lj1joj2RK9l1j5%k2N4lRn1K0OK8k9j3%PK4j3
$$ 26 30 8 0 11 -4 31 29 8 29 14 8 -5 13 16 5 4 -2 -14 -5 24 -7 -22 -22 -44 10 7 16 -35 -15 -9 19 -10 -23 -23 -16 8 -5
7761eK9j9Pj%k6K6lK6j2m3%M2Pj6J1j3jlLj3K1kJj4QPj0%Rl6J8j0Mj2K2k3J6K1
$$ -5 24 5 12 11 11 -15 11 8 34 22 -21 -21 21 28 12 23 10 9 6 9 -4 17 15 16 2 10 17 7 7 16 -20 -2 -12 -8 -20 2 -21 -5 16
7800A6l9RJ9LJ9Mnn3O8j5l2K8k5MJ7Ql1J7Nj6M1n6J5Qj2j6jJ1Lj3QoJ8rJ0Lk3
$$ 16 -23 -14 5 8 27 31 26 -27 41 26 -6 22 -3 1 18 26 -5 12 17 1 42 -14 1 9 -3 -19 -20 -9 -6 -19 -11 -17 1 -8 2 5 -18
7837a8K6j4k2K6Lk1K8rkOJ4mJ1J1m5J6mlOkL3lnk1j%kJj1Qk2J9Kk9N3k0nk1OJ9
$$ -18 8 -6 -28 -2 1 -20 8 -1 -3 3 17 13 24 35 -10 6 2 -1 5 3 36 33 28 7 6 6 4 5 -6 2 -20 -1 1 -28 25 5 0 -21 -15 4
7877DLm6J7K5l6NM8j3rj4OK8j8K0qj6j3K2LJ9j7j2J0J6RlNoJ%k8L6l9kJ4pj6o
$$ 4 7 -39 -22 3 -33 -28 20 7 -2 -16 -10 18 0 20 12 -4 -17 5 8 27 10 -2 8 24 33 30 35 29 30 30 2 38 -1 -3 11 4 -12 -18
7915a8QRj7J0K1l1QK2Jl3jK1j7kK9lj4KJ3pj5L7kk5K6j3J9k1j1rK2NK1l1JjK8
$$ -18 -10 -1 -18 -8 13 -18 -10 12 13 -20 -21 0 -17 -19 10 7 -7 -5 8 1 -14 23 21 -4 22 9 28 7 -4 -13 9 14 35 4 5 4 32
7952C2l0j7L0j2Nk1K7l0J9JOl6J8J1j4Pj6J8JlLMkL4k0Qkj6m%M9m8J5oLK2qj1
$$ 32 2 -15 15 3 8 -13 14 -16 3 4 10 -26 -8 3 -11 -4 -20 -2 -1 -4 -1 3 1 35 15 23 21 5 1 1 50 2 17 11 14 36 28 17
7990A7kk2mJ0K3m8J7%QKJqk%n%K7j5kkj1L1l0J9RPm0RL4j5qK1k9%K6jlj1pK7o
$$ 17 15 -7 -11 -1 22 -26 -9 -9 -1 1 2 -6 -8 -8 -13 -13 14 -1 -3 -5 -16 15 -15 4 13 20 -20 -11 23 8 0 21 -8 -8 18 17 14 3 -4 23 17
8031A7j9J5k5L9j2pjmj1QJ1Jk2oJ9k3L7l1qK2Nl1K4rJ4k8J6NnOjjJ7QLqkOpj0
$$ 17 -2 13 -12 27 15 8 7 3 -8 0 11 12 -10 -16 3 -20 17 -14 -22 0 5 -26 -2 -11 3 -25 -9 -4 -9 -3 -4 -5 12 20 23 15 13 19 12 2
8071BPJ3k9K9ol0L6Lj9ooJ5J7pk5K0n2L3Pk1lJ2KlLJ3k0J1k9J7L0oljPo%%j5K4
$$ 2 9 22 -7 22 16 -14 22 25 6 0 -6 9 26 19 -6 14 -38 -5 2 -19 -22 -10 -8 -11 -8 5 -15 -4 -33 -16 14 8 5 4 11 5 5 5 -10 14
8111A4lJ3j5K7k9rPj5QJ4pl0M5nj6MMk5NK0rK3j8j2oJ7kj9MLqpJ0J4J7nj8K2k7
$$ 14 11 24 9 36 7 -2 5 -10 -2 12 5 -25 20 15 -1 3 7 -18 -13 7 -2 21 3 -9 -15 2 0 -19 -15 -12 -20 -27 -17 -3 14 9 -9 13 -14
8150a4K1MlQJ4k0J9J4k1pL0nn0J1K3qj5mrJm%J6Jj6L2k2l0L2Lk8kK9j3J6lrQJ
$$ -14 7 11 8 16 30 10 29 43 22 15 45 40 -10 1 24 16 1 -3 -12 -11 -15 -15 1 2 -14 18 -4 -34 -2 1 -27 -29 0 -13 3 0 -9 -1 0
8189@K4l0
$$ 0 24 -6
8191f
$$ Imaginary data points
##PAGE= N=2
##DATA TABLE= (X++(I..I)), XYDATA
0@%%%%%%%%%%%%%%%%%%%%%%%Qj6J6j6J6j6J6k3L1l2L2l9M7m8N6o4O6p4Q5r3J04
$$ 0 0 0 0 0 0 0 0 0 0 0 0 0 0 0 0 0 0 0 0 0 0 0 0 8 -8 8 -8 8 -8 8 -15 16 -16 16 -23 24 -24 32 -32 34 -40 45 -48 56
44E6j15J23j36J52j68J85k04K27k50K75l05L37l73M14m62N18n86O68p69Q98j071
$$ 56 -59 64 -72 80 -88 97 -107 120 -130 145 -160 177 -196 218 -244 274 -312 356 -413 485 -586
65e86J314j683K324l747J3169o063j6343J5392L286m301J667J095j1578J244J2088
$$ -586 728 -955 1369 -2378 10791 4728 -11615 3777 7063 2762 4429 5524 -6054 -4810 7278
80G278r16j2470J835Q741m45m151L446J859l613j902K081k009l016L332N795j527
$$ 7278 6362 -6108 -4273 4468 4023 -128 3318 5177 1564 -338 1743 -266 -3282 50 5845 4318
96D318m414K21K015p20J246K209k922m291K367L697k058l471m15J63J105K736
$$ 4318 -96 125 2140 1420 2666 4875 1953 -2338 29 3726 1668 -1803 -2218 -2055 -950 1786
112A786O14j560P06P88k116j528J163J647J271j158n040j970N694M226l695m019
$$ 1786 2400 840 1546 2334 218 -1310 -147 1500 2771 1613 -3427 -5397 297 4523 828 -3191
128c191N82J932K996K918k742n903K87M728N40k549j77M75q62J64J054m62p45
$$ -3191 -2609 -677 2319 5237 2495 -3408 -3121 1607 2147 -402 -579 -104 -966 -802 252 -210 -955
145i55Q33P94n32m25L10J90j69R9j14j038m75J490J552p05j858r84K81J717K028
$$ -955 -122 672 140 -285 25 215 46 145 31 -1007 -1482 8 1560 855 -1003 -1987 -1706 11 2039
164B039p47k891k39K470Q26n74lq21j253J127J794n80p28L44j269j292K015K087
$$ 2039 1292 -1599 -1838 632 1458 884 881 60 -1193 -66 1728 1148 420 764 -505 -1797 218 2305
182B305j292j714l0j91K23J523r9k147r0J918J65q08R12J017q07p26O78M69q9
$$ 2305 1013 -701 -731 -922 -699 824 725 -1422 -1512 406 571 -237 675 1692 885 159 837 1306 1217
201A217K06l53j400o74J022P58o73n39M62Q3m08L53R02j5o45o06m53M09J412K86
$$ 1217 1423 1070 -330 -1004 18 776 103 -436 26 109 -299 54 956 941 296 -310 -763 -354 1058 1344
221A344j686j200P90J301P62K05j014j375N17J676L00r72o67m26k29Q20J037m82
$$ 1344 -342 -1542 -752 549 1311 1516 502 -873 -356 1320 1620 648 -19 -445 -674 146 1183 701
239G01j151j20O27L75K49m5n97l10L24n8m90J65O10j72o44o0L51M23O80N9j043
$$ 701 -450 -570 57 432 681 636 39 -271 53 -5 -495 -330 280 108 -536 -596 -245 178 858 917 -126
260a26p19R68J112j98p96m12k42J25P78M95m57q51j68L10N21M74k04q34o20K50
$$ -126 -845 123 1235 1037 241 -171 -413 -288 490 985 528 -323 -491 -181 340 814 610 -224 -844 -594
280e94P36N29j60r13o70M59J042K74l70l41k74l4O04P33k34q29j01M41N3j09J91
$$ -594 142 671 511 -402 -1072 -613 429 703 333 -8 -282 -316 288 1021 787 -42 -143 298 351 242 433
301D33mm71k39K71J16N0J83l5m99l60K14N83L84l55p60k60M46N00L50M2o37p63
$$ 433 429 -42 -281 -10 106 156 339 304 -195 -555 -341 242 626 271 -489 -749 -303 197 547 589 -48 -811
323h11K35J186N83n49q22m27K11P93P26k80j140n44N90Q79K15m70o41l58J97N41
$$ -811 -576 610 1193 644 -178 -605 -394 399 1125 845 -295 -839 -249 630 845 375 -266 -624 -427 114
343A14L01k98m54j52J41K93K70k1k28o7L7q3K4M09K68k17k98q6Q5M17N80r7q70
$$ 114 415 117 -337 -489 -348 -55 215 194 -34 -101 -64 -147 -123 286 554 337 39 -47 38 455 1035 938 68
366F8o34L41O27K67l27o77m62J46O40O24R0o08p86O1Q19O95j09o85q50j87R59
$$ 68 -566 -225 402 669 342 -335 -797 -651 -11 613 703 95 -691 -630 189 884 775 90 -760 -947 12
387A2J090j86r93m99M61Q02M09k48o32l98O2K44J47n6k85j50J61Q1NL89K75j65
$$ 12 1102 916 -77 -576 -115 687 1096 848 216 -182 -120 124 271 215 -70 -220 -59 22 27 416 691 526
409E26l44k37j45J53L34Pn85n55r4O30R92K31p75o08L11O93N00P5p76r79m8O64
$$ 526 182 -55 -200 -47 287 294 -291 -846 -940 -310 682 913 138 -470 -159 534 1034 1109 333 -646 -694 -30
431c0N28J7m44o20j48N62P00L03l62j032n98O33P90j20n89l50k31M22R07K07m81
$$ -30 498 515 71 -549 -697 -135 565 868 506 -526 -1124 -491 299 179 -410 -760 -991 -569 338 545 64
452F4j2J71j45N9L21j75k90n2l31k48N43N57k63k36n4j96K30O88no48m38l62J32
$$ 64 52 223 78 137 458 283 -7 -59 -390 -638 -95 462 199 -37 -91 -287 -57 631 626 -22 -460 -822 -690
475f90Q47L93p72o10J32L92P30P11n25j139R8Q24L47O8j37p54m01N92N18J3p0
$$ -690 157 550 -222 -832 -700 -308 422 1133 608 -531 -433 391 738 806 669 -85 -486 106 624 637 567
496E67n06o17M01O10j85k34J48m13k75O75L66m14J14K72m31j89N65K80j55j80
$$ 567 61 -556 -155 455 270 36 184 -229 -504 171 537 123 237 509 78 -111 454 734 579 399
516C99m41k64O24M90l29l09j02l01K59P95q6p32j01K06p5M06M90l57m86j02R9
$$ 399 -42 -306 318 808 479 170 68 -233 26 821 735 3 -98 108 33 439 929 572 86 -16 83
537H3L74L80m10q08r1J78R6L96R1p36l16P33M38K1J48j47l81J12L33j10r2j0k93
$$ 83 457 837 427 -381 -472 -294 -198 198 289 -447 -763 -30 408 429 577 430 49 161 494 384 292 282 -11
560a1j56J87m4p4M77J10o43k30L65J10L3J0n60m96M66O74lk14k60k08M94P59j24
$$ -11 -167 20 -24 -98 379 489 -154 -384 -19 91 124 134 -426 -922 -456 218 215 1 -259 -467 27 786 662
583F62o15j73p8L8M13J16m72k92J41J38K32L05j24k92k8j21j20L51J20n45l14
$$ 662 47 -126 -204 -166 247 363 -109 -401 -260 -122 110 415 291 -1 -29 -150 -270 81 201 -344 -658
604f58J88nJ82M63M3m35o4L88J69J05J16k83k69j2R5J65K39j43m95k7K58J77J72
$$ -658 -470 -475 -293 170 213 -222 -286 102 271 376 492 209 -60 -72 23 188 427 284 -211 -238 20 197 369
627C69O5m81m10K13N21J15k23l97k73K52N52K20j63m71l27K76O62J34m52l56j18
$$ 369 434 -47 -457 -244 277 392 169 -228 -501 -249 303 523 360 -111 -438 -162 500 634 182 -174 -292
648b92J59L64K45k63k43QR0J28J88Qj39p1j61k17J78L78n5l51j93j29J12M29K27
$$ -292 -133 231 476 213 -30 -22 68 196 384 392 253 182 21 -196 -18 360 305 -46 -239 -368 -256 173 400
671D00l43m29q5K01M67K72k66m72j13K69M22K73k21m94k23K41L99J53j62m25k71
$$ 400 57 -372 -457 -256 211 483 217 -255 -368 -99 323 596 375 -119 -342 -101 298 451 289 -136 -407
692d07J15L12L14pm51m59J09N02K67j01l69m24R6N08L37k23k55r7L6J99K20n5
$$ -407 -292 20 334 327 -124 -583 -474 28 295 194 -175 -599 -503 5 342 119 -136 -233 -197 2 222 167
714A67r5J6j02j72J03K48J02k01j79j98OL13L16p3n10l58K16M97J99j37k99m38
$$ 167 72 88 -14 -186 -83 165 267 66 -113 -311 -305 8 324 251 -259 -617 -401 96 295 158 -141 -579
736e79l6O38N00k64o00j31K79K63K72L3l50k86L6L22K42M5l10k86q4J74K93K06
$$ -579 -615 23 523 259 -341 -472 -193 70 342 375 25 -261 -225 97 339 384 74 -212 -296 -122 171 377
758C77k41m67m8L20J96j22q9j17j45M2J65O1N6K8r5j22L7K17K90R2k24m31m8L54
$$ 377 136 -331 -379 -59 137 15 -74 -191 -336 -294 -129 -68 -12 16 -79 -201 -164 53 343 435 211 -220 -268 86
782H6L06p3k68l53q5K65M46J14l44m89o3L86L62j2k85l58j38K47M34J10k81k48
$$ 86 392 319 51 -302 -387 -122 324 438 94 -395 -458 -72 290 278 -7 -365 -503 -256 178 288 7 -241
804b41kJ81K17J73n4k61k26N2K50J76k3k07j82N0J47J46N4o0j83j42M3P2P1P0
$$ -241 -243 -62 155 328 274 13 -213 -161 89 265 242 35 -147 -97 50 196 250 190 7 -135 -92 -20 51 121
828A21r9k59j76J63M33J55k46l54o2K47L35J84j86m20k11L08M25J03k54l24j05
$$ 121 22 -237 -413 -250 183 338 92 -262 -324 -77 258 442 256 -164 -375 -67 358 461 207 -117 -222
849b22J42L23J42j31m18j69J54L05O5j91j85m6j0J21K33Jk12j70P4R4J21Q2qj45
$$ -222 -80 243 385 254 -164 -333 -179 126 191 0 -185 -231 -241 -120 113 114 -98 -268 -194 -100 21 103 95 -50
873e0j39O7K25J51j03j11j10p1JK32J27j85k89l5J13J79J83j25l26j75J54K70
$$ -50 -189 -122 103 254 151 40 -70 -141 -140 92 219 34 -255 -290 -177 2 185 60 -266 -441 -287 -17
895a7J23j75k98j13K26K94Q2j28j14j31J48K74P6j60j91j10Q8J40J13r3r0m9k4
$$ -17 106 -69 -367 -480 -254 40 122 -6 -120 -251 -103 171 247 87 -104 -214 -126 14 127 34 -56 -105 -129
918a29J34R1mr5q1r0j5P9R6m6p9q6n2J36K46M5j21j8j23kK46J48j99k53PJ33J45
$$ -129 5 96 92 -3 -84 -174 -189 -110 -14 -60 -139 -225 -277 -141 105 150 29 11 -112 -114 132 280 81 -172 -165 -32 113
945A13J34l1k52p5J63J91P4j15k90j43J77J40k5l8j39j71Q8L36P4j26r8J4nR0
$$ 113 247 216 -36 -111 52 243 317 202 -88 -231 -54 86 61 23 -116 -287 -199 137 211 85 -13 1 -4 86
969H6J14rq8r3l7J78M6k4L6J1j29j57J56J08j28n5r1j44J1K32J15r6j46j28N5
$$ 86 200 191 103 10 -27 151 197 173 209 220 91 -66 90 198 70 15 -76 -220 -209 23 138 42 -104 -232 -177
994a77L23J76k63j94K5K6J09K93j25m06L1K21P9O3qk15j69J32K03N8p3k04j89
$$ -177 146 322 59 -135 -110 -84 25 318 193 -213 -182 39 118 181 173 -42 -211 -79 124 182 109 -95 -284
1017b84Q9J94J05r4j03j65o8K36J36m4q1r0m1J07Q4L4N4l1j95OJ76O3KL6j15k18
$$ -284 -195 -1 104 10 -93 -258 -326 -90 46 2 -79 -169 -210 -103 -19 15 69 38 -157 -151 25 88 90 126 11 -207
1043b07Q8K44P1o8j48k14nK81J78j44j66j96m2L24K52j88l09l0J34J64J89k8k35
$$ -207 -119 125 196 128 -20 -234 -239 42 220 76 -90 -286 -328 -4 248 60 -249 -279 -145 19 208 180 -55
1066e5j36N3K26J78k8k54r6J08O3J52J43j96k63NJ90k6M8P2k11j49M4J11P5P1
$$ -55 -191 -138 88 266 238 -16 -112 -4 59 211 354 158 -105 -100 90 64 112 184 -27 -176 -132 -21 54 125
1090A25n8j93j1J24L7J38J00k66j84J44K17N6J4q4k84n4K93K43o7k23k19m6K26
$$ 125 67 -126 -137 -13 24 162 262 -4 -188 -44 173 229 243 159 -125 -179 114 357 290 67 -152 -198 28
1113B8K12m1j88j90q6K13K51l8j97j38j5R6K39M4j24j20p7L4K00J33p5j56J3l4
$$ 28 240 199 11 -179 -265 -52 199 161 -36 -174 -189 -93 146 190 66 -54 -131 -97 103 236 161 5 18 -16
1137a6J8K07M3j87j00ro9R5K01o3j93r3k7P9K24Q1k67j57P9Q1J17J61j48k54j8
$$ -16 2 209 252 65 -35 -44 -113 -18 183 120 -73 -166 -193 -114 110 191 -76 -233 -154 -73 44 205 57 -197 -215
1162b15K04J45R7p1k70o1K22J22Nl6j53j77J89J79n8m7r1r9m3J76P0l1o5q5q1
$$ -215 -11 134 231 160 -110 -171 51 173 178 142 -11 -188 1 180 122 75 -16 -115 -158 18 88 57 -8 -93 -174
1187a74Q2J92n7l9K5j76n8L03J22j42n4rq4L9K48L4j96r8n4M6K00O9j63j45l2
$$ -174 -92 100 43 4 29 -147 -205 98 220 78 24 15 -69 -30 218 252 56 -42 -96 -50 150 219 56 -89 -121
1212a21J5J39J56o7k76j1J17P7O3rj42p6Q8N6Q0L6j28o9O8O1J8M9L2j56p9R2O4
$$ -121 -106 33 189 122 -154 -165 -48 29 92 83 -59 -135 -47 9 89 125 -3 -72 -4 57 75 124 156 0 -79 13 77
1239G7K2J8q8j35pJ22P9J2p8j78n1J43J69l1n1p1j48J15K42M8j32j37J0M4J68
$$ 77 99 117 29 -106 -113 9 88 100 22 -156 -207 -64 105 74 23 -48 -196 -81 161 209 77 -60 -50 -6 162
1264A62L1n0j15p2NJ43R7j09j03m1K5K3P0K0j02r4KQ0L4L7k6n8l1MQ5J02J0j23
$$ 162 193 143 28 -44 -39 104 201 92 -11 -52 -27 -4 66 86 -16 -110 -108 -28 6 43 17 -41 -72 -68 17 119 129 6
1292Fn5O4PP1R2o1j36m3R4J26jp9r7q0Q2R0Q7j40j38m8J08J33mj08o0m4O5J27
$$ 6 -49 15 22 93 185 124 -12 -55 39 165 164 85 -12 -92 -10 80 167 27 -111 -159 -51 82 78 -30 -90 -134 -69 58
1320E8N6r9j12J2Q2Q1j9J0m1k3l7O4P2k5m9kj7n3N1M5qq0o7L2QP5K8m9j05l0N2
$$ 58 114 15 -97 -85 -3 78 59 69 28 5 -32 32 104 79 30 28 11 -42 9 54 46 -34 -101 -69 -61 14 42 -7 -112 -142 -90
1351i0J07M3r6o8l8J09J04O4o3j44j8L9J69M3r1j24p5Q1J16O0p7j44m5R4N4M2
$$ -90 17 60 -36 -104 -142 -33 71 135 72 -72 -90 -51 118 161 70 -54 -129 -48 68 128 51 -93 -138 -44 10 52
1377E2o2j06%L3N8N4j8l4qj8N3O5J9k3k8m9RL1Q9Rq3n8J9J0M0Q3m0j58m1jJ39
$$ 52 -10 -116 -116 -83 -25 29 11 -23 -31 -49 4 69 88 65 37 -12 -3 28 117 126 43 -15 4 14 54 137 97 -61 -102 -103 36
1408C6O4o5j26p0P6J18P8nj74p9O8J93Q0p3j04q4MJ77N9Mj47p4L9P4N8l4m4o1
$$ 36 100 35 -91 -161 -85 33 111 106 -68 -147 -79 114 194 121 17 -67 -63 114 173 177 30 -44 -5 69 127 93 49 -12
1436a2o4M3R3J0o8n9o3pO0P8N2p2j08k4Q0J37K9q1n5p5M7J01Q4l9j49m3K7J49
$$ -12 -76 -33 60 70 2 -57 -120 -127 -67 11 63 -9 -117 -141 -61 76 105 24 -31 -106 -59 42 126 87 -62 -105 -78 71
1464G1M5n4j03q4j1J37J16l6k06o7P0P9O7K2j15j01K8R1P0L5r1o1RP8M0Qjn7p6
$$ 71 116 62 -41 -125 -136 1 117 81 -125 -192 -122 -43 24 46 -69 -170 -142 -51 19 54 -37 -98 -89 -11 29 37 36 -21 -97
1493i7N3M5J2K8j0r7o7O6R7J8m4j32l8L9J15M5J4r3j62Q6J32Q4o4n6m8k8J27R7
$$ -97 -44 1 13 41 31 -66 -133 -67 30 48 4 -128 -166 -127 -12 33 47 -46 -208 -122 10 94 30 -26 -74 -102 25 122
1521A22k0o4j04qJ04P7k1o9k6m5K0J08K1j35p2Q5RrK2Rm5m5L0K0O3J9j9l4j4j5
$$ 122 102 38 -66 -74 30 107 86 17 -9 -54 -34 74 95 -40 -112 -27 -18 -27 -5 4 -41 -86 -56 -36 27 46 27 -7 -21 -36
1551c6Q2J10k4q2p7LO5J27J0j24j32J7O6J31L5j70j50N2Q7K7O8l8j90k7J86O4
$$ -36 46 156 132 50 -27 -24 41 168 178 54 -78 -61 5 136 171 1 -149 -97 -10 17 85 47 -143 -170 16 80
1577H0p2j0j4q6P2J08l2n8M4l3k4R2K1o7L9J5j11J5R3j7n5Ko8k6P6P6o7k8l0p2
$$ 80 8 -2 -16 -102 -30 78 46 -12 32 -1 -25 67 88 21 60 75 -36 -21 72 55 0 2 -66 -92 -16 60 -7 -35 -65 -137
1607a37Q7J33n4j16j5K3K0J56O1j25j26M0M5Q3Q9j23j42L6Q7J6M8Mj91k2J33K8
$$ -137 -50 83 29 -87 -102 -79 -59 97 158 33 -93 -53 -8 75 164 41 -101 -65 22 38 86 90 -101 -123 10 38
1633C8n6J5k5q4N7J01p3l1L7j6j8O7K3l0L5K5q6j2J16o1MN3j08q3J42L9l0l9n6
$$ 38 -18 -3 -28 -112 -55 46 -27 -58 -21 -37 -55 12 35 5 40 65 -21 -33 83 22 26 79 -29 -112 30 69 39 0 -56
1662e6m7N7J33m6j18j5j4K0J53Lj73n1P2L8R8O8j08j26N9O6L3K6Lj85L1J27K6
$$ -56 -103 -46 87 41 -77 -92 -106 -86 67 70 -103 -154 -82 -44 54 122 14 -112 -53 13 46 72 75 -110 -79 48 74
1689G4l1J5n8l8N8N5o8kjo5pN9Qm0J5k0q2M5J08j0j7K8q7j1R3Q1l5k3n7n5J23
$$ 74 43 58 0 -38 20 75 7 5 4 -61 -68 -9 -1 -41 -26 -46 -128 -83 25 15 -2 26 -61 -72 21 102 67 44 -13 -68 55
1720E5N6Op5n2p0M9J55Pj60l7RPJ08L1n3j23kO5M0L2k4p0l3N6K9L7M9q4n5Q6K3
$$ 55 111 117 42 -10 -80 -31 124 131 -29 -66 -57 -50 58 89 36 -87 -89 -24 16 48 24 -46 -79 -23 6 43 92 8 -47 39 62
1751F2l6J7K7p9l6L4K7K6J4n2p0KK8J03k8m7r0JJ09N2k7mm2o0N7J21mp8k6l6J3
$$ 62 26 43 70 -9 -45 -11 16 42 56 4 -66 -64 -36 67 39 -8 -98 -97 12 64 37 33 -9 -69 -12 109 105 27 1 -35 -22
1782b2Q6L2n1p1n3rJ22N5q6m2k1nM2P4Lr1n0k2K0P4L5m7o5K6M6J8O8k2j7o7jM7
$$ -22 64 96 45 -26 -79 -88 34 89 3 -39 -60 -65 -23 51 54 -37 -87 -109 -89 -15 20 -27 -92 -66 -20 -2 66 44 27 -40 -41 6
1814FJ7N5n8k5n4O7P1M8o0j00o8P1O4k0j3j02n1N9N0N5M0j01l7K1M5O5J1l6p5
$$ 6 23 78 20 -5 -59 8 79 127 67 -33 -101 -30 34 14 1 -101 -152 -93 -43 12 52 -49 -86 -65 -20 45 56 20 -55
1843e5OK0Q2N3l7o4l0J5P3K6qp5k8lO0J4J7p1n5RK8O6Qk4r1oN6M7N0l1q1j9L4
$$ -55 -49 -29 53 106 69 5 -25 -10 63 89 81 6 -22 -25 35 49 66 -5 -60 -51 -23 43 51 27 -64 -70 -14 33 83 52 -29 -48 -14
1876a4O3M8j3n9n3j7O1J07l6r0m1QL1M5Jo1n8lN6L2L5j8p2qK1L6L7Pl4m3rM7L2
$$ -14 49 97 84 25 -28 -45 16 123 87 -3 -44 -36 -5 40 41 -20 -78 -81 -25 7 42 24 -48 -56 -35 1 38 45 11 -32 -41 6 38
1909C8J9l7m8j6K6K6N3o4o3j3OQ6Qm3l0n5K7L1M8k9m2l9kP4J7L8j9p5K2J7O8j7
$$ 38 57 20 -28 -44 -18 8 61 -3 -66 -79 -73 13 21 -22 -52 -107 -80 -49 -1 -30 -72 -111 -113 -39 -22 16 -3 -78 -56 -39 29 12
1941A2j7k8J0j0J2P1rp4k7O0jQkn6Ok1J3M0Lm2j5k9O0JJ3M5m1n2M8L9J2j1J2m1
$$ 12 -5 -33 -23 -33 -21 50 41 -33 -60 0 -1 7 5 -51 -45 -66 -53 -13 -10 -52 -67 -96 -36 -35 -22 23 -18 -70 -22 17 29 18 30 -11
1975a1j2L8K9L1l3p3L3L9kj6j2m9l2R1j9J1l2kmk6L8J7Mj6n0J8L9M1l5KL0o4j4
$$ -11 -23 15 44 75 42 -31 2 41 39 23 11 -38 -70 21 2 13 -19 -21 -25 -51 -13 4 8 -8 -58 -40 -1 40 5 7 37 -27 -41
2008d1P1K3l8j3rkL6K2k2r0J7%J8L9L0r1K5RrM3J9n5n5N6O4Om8J5o9L4K9L7l0
$$ -41 30 53 15 2 -7 -9 27 49 27 -63 -46 -46 -28 11 41 -50 -25 -16 -25 18 37 -18 -73 -17 47 53 5 20 -49 -15 14 51 21
2041B1Pl9j5J3R4n2l6K8m9mM2j3l6M0k8m0K2P7m6j3mk6J1O7Rn2K4J6m0M2N1j9
$$ 21 28 -11 -26 -13 81 29 -7 21 -28 -32 10 -3 -39 1 -27 -67 -45 32 -14 -27 -31 -57 -46 21 30 -22 2 18 -22 20 71 52
2073E2q8L1J4lO0k8j18J1M9J3J8J7o1r0O4R5o4kOj9m1O7ROK5o1j7L6M7%j3%m1
$$ 52 -36 -5 9 6 66 38 -80 -69 -20 -7 11 28 -33 -123 -59 36 -28 -30 -24 -43 -84 -17 -8 -2 23 -38 -55 -19 28 28 15 15 -26
2106b6l4J02pk6K2j8n9M0O7l7l5%l9J1O6Jp4pj4ON8M4k3p1L8J3K1M2j3n6m1K3
$$ -26 -60 42 35 9 31 13 -46 -6 61 24 -11 -11 -50 -39 27 28 -46 -53 -67 -61 -3 41 18 -53 -15 -2 19 61 48 -8 -49 -26
2138b6M0J1M5r7rJ6K9l6O8j4j09O4nL1JN8o9m3M2K1l6J06k2q3k3N4j0J3M4o5o1
$$ -26 14 25 70 -27 -36 -20 9 -27 41 27 -82 -18 -23 8 9 67 -2 -45 -3 18 -18 88 66 -17 -40 14 4 17 61 -4 -65
2169f5K8Q3Pk8Kn0rP1J1l4Pp6J4mN3j8o7N8m4RM6N8p3JkJ6M3K6n2l8J9QK9L0q
$$ -65 -37 46 53 25 27 -23 -32 39 50 16 23 -53 -39 -43 10 -8 -75 -17 -61 -52 -6 52 -21 -20 -22 -6 37 63 11 -27 -8 0 29 59 51
2204E1k9k0K3k3%M7l2n4k2M3PK4k3m5k1K4J5K8M9o0p7L0N5K1j1L5r1k7Q4O0Pl8
$$ 51 22 2 25 2 2 49 17 -37 -59 -16 -9 15 -8 -53 -74 -50 -35 -7 42 -18 -95 -65 -10 11 0 35 -56 -83 1 61 68 30
2236C0j6n4L0P0nl0ro6J8J3L0m0Nqm8O5J4Jk4lrJ8M7j0nk4j8kM1N9l4n4rk9N1
$$ 30 14 -40 -10 60 55 25 16 -50 -32 -19 11 -29 -24 -32 -80 -15 -1 0 -24 -27 -36 -18 29 19 14 -10 -28 -30 11 70 36 -18 -27 -56 -5
2271eL5j1m1pj9K1N1J7m6lqLM5oK0n6j4LN5l1J8j2j7mM5lK8n6j5K1K3K4k5mm1
$$ -5 30 19 -22 -29 -48 -27 24 41 -5 -8 -16 -13 32 26 46 -10 -24 -21 34 3 21 9 -8 -12 33 30 58 2 -13 8 31 55 30 26 -15
2306a5QK9JJ2m1%m2J4L2N4j6l3k6PL9oLQk9nK4K6lNqj0l7K6N3l4m3kL2k2L0j6
$$ -15 -7 22 23 35 -6 -6 -48 -34 -2 52 36 3 -23 -16 23 17 20 28 -1 -6 18 44 41 46 38 28 -9 17 70 36 -7 -9 23 1 31 15
2342A5n8KJ1J4L8m1K0j8k4j2L9J4kj3k0NL0L7nk7kK4mkRj8j9K9rK6j9l8j4J1q
$$ 15 -43 -41 -30 -16 22 -19 1 -17 -41 -53 -14 0 -2 -15 -35 -30 0 37 32 5 3 27 23 21 30 12 -7 22 13 39 20 -18 -32 -21 -29
2377b9L7j8J4l8lj3L0L0k7j5k0K8jL0J5l1k9%N3j0J3k6j8K6jL4nln5J7J7K6k0
$$ -29 8 -10 4 -34 -37 -50 -20 10 -17 -32 -52 -24 -25 5 20 -11 -40 -40 13 3 16 -10 -28 -2 -3 31 26 23 -32 -15 2 28 8
2410Hj0Qk8mL9j1Mj9k2K7PN9k0Jm6j2J2RK0jl6jJ2jM7j5n4nK7K8qnl4l8N1J2N6
$$ 8 -2 6 -22 -26 13 2 6 -13 -35 -8 -1 58 38 39 -7 -19 -7 2 22 21 -15 -16 -4 -5 42 27 -27 -32 -5 23 15 10 -24 -62 -11 1 57
2447E7o1rj3J9nL9pj7j7KNP5l8kj3l4K0J8L6j6l1n0K5kJ7J9n8j2PlK0L1l6mJ7
$$ 57 -4 -13 -26 -7 -12 27 20 3 -14 -12 -7 68 30 28 15 -19 1 19 55 39 8 -42 -17 -19 -2 17 -41 -53 -46 -49 -29 2 -34 -38 -21
2482b1K0j8N1j4l4L9j9K5rKJ4l9j3L6MK3k0l3j0L2j9LJk5k4QN4j3Pk7l8J1N0K3
$$ -21 -1 -19 32 18 -16 23 4 29 20 22 36 -3 -16 20 24 47 27 -6 -16 16 -3 0 1 -24 -48 -40 14 1 8 -19 -57 -46 4 27
2516B7k0k8l5M1oN2k6Rk3l0M3L1j1j5j9pJ7jL9m6lmk3J5K9Qm2NK4JnJ6J0m6K0
$$ 27 7 -21 -56 -15 -21 31 5 14 -9 -39 4 35 24 9 -10 -17 0 -1 38 -8 -11 -15 -38 -23 6 14 -28 -23 1 2 -3 13 23 -23 -3
2551cmQJ5j2k0QPJ3J2K3m9m1ML6j1K9k3l4j3N1K9j3kj7l8K6L7j8K6l2k1%L7L3
$$ -3 -7 1 16 4 -16 -8 -1 12 24 47 -2 -43 -39 -3 -14 15 -8 -42 -55 -4 25 12 10 -7 -45 -19 18 0 26 -6 -27 -27 10 43
2585D3n0N0nm6PM1nl9J7l7J7J8Nj3oJ0m1M3J3j9l8K1l3KM3J4k9k3J6L4j3L8k6
$$ 43 -7 43 38 -8 -1 40 35 -4 13 -24 -7 11 16 3 -3 7 -34 9 22 3 -35 -14 -47 -45 -2 12 -17 -40 -24 10 -3 35 9
2618Ik7NL8J6nJ9p4LMK1J5Jk7k4KK6J6k2Kj0m4M1Jj3J1K0j7k2M3j0J2k1j2k3O1
$$ 9 -18 -13 25 41 36 55 -19 -16 -12 9 24 25 -2 -26 -24 2 18 -4 -2 -12 -56 -15 -14 -27 -16 4 -13 -35 8 -2 10 -11 -23 -46 15
2653A5j0k1L4l1j7L3M6l3n1O0l6rJ7J0j6k4Mj0K6N2n6J3k0K3JK0mm4JL3ok0L5
$$ 15 5 -16 18 -13 -30 3 49 16 -35 25 -11 -20 -3 7 -9 -33 -29 -39 -13 39 -17 -4 -24 -1 0 20 16 -28 -27 6 0 -20 15
2686A5k4k7K5K7j6K4k8k4QK6j7mPJj8K3k0ORQm1K9k0L1K5l5Kk5M3nJ9j0Kk2J8
$$ 15 -9 -36 -11 16 0 24 -4 -28 -20 6 -11 -15 -8 -7 -25 -2 -22 -16 -7 1 -40 -11 -31 0 25 -10 -8 -33 10 5 24 14 16 -6 12
2721A2NMk2K6l3kK6l2j4L2l9pJ5J7k9kJ3j4J9J8mJ6k5%L7%J5qj2J2l4L0J0j2k8
$$ 12 17 21 -1 25 -8 -10 16 -16 -30 2 -37 -44 -29 -12 -41 -43 -30 -44 -25 -7 -11 5 -20 -20 17 17 32 24 12 24 -10 20 30 18 -10
2756a0K0J0Jk1J8pJ2l2nM3j2pl1j0K0%K5pl4qK1K8nj2j2J7j2NJ2kLJ5%l6L3k9
$$ -10 10 20 21 0 18 11 23 -9 -14 29 17 10 -21 -31 -11 -11 14 7 -27 -35 -14 14 9 -3 -15 2 -10 -5 7 5 8 23 23 -13 20 -9
2792iJJ1oJ8j1K%Mlj5J0L9k4k4%JPROk3k9LJ1J1OK1l5lJM9l5Rj7rkJ4J2Nrk4O
$$ -9 -8 3 -3 15 4 6 6 10 7 -8 2 41 17 -7 -7 -6 1 10 16 -7 -36 -33 -22 -11 -5 16 -19 -22 -21 28 -7 2 -15 -24 -26 -12 0 5 -4 -28 -22
2833b2M3l5J6j5j5K9k0L0k8J9l6J3kL6J4ll9oK3J4qjkm3K0k3L3K7n0mj4L5j1N1
$$ -22 21 -14 2 -13 -28 1 -19 11 -17 2 -34 -21 -23 13 27 24 -15 -21 2 16 8 7 5 -38 -18 -41 -8 19 -31 -35 -49 -14 -25 26
2867B6m0Nk2OL9j8J1qK2k6K4k9L3J2n0NK9J1Kk9oj8L1%j4jk2j4L8k1J0nJl6J7
$$ 26 -14 -9 -31 -25 14 -4 7 -1 21 -5 19 -10 23 35 -15 -10 19 30 32 3 -3 -21 10 10 -4 -5 -27 -41 -3 -24 -14 -19 -18 -54 -37
2902c7K7K2rj1jk1RJ2J0J9l9%J2J7J3k1l1L2j4PK6j1rk3K9j7L7j9l2J7rrL0K1
$$ -37 -10 12 3 -8 -9 -30 -21 -9 1 20 -19 -19 -7 10 23 2 -29 3 -11 -4 22 11 2 -21 8 -9 28 9 -23 -6 -15 -24 6 27
2936B7j6k2l%J4QJk3k5OKN0k5ll0J0J5oL2l2LJ3m5L4M2k9Ml7L9lJ7J1k6Rj7K1
$$ 27 11 -11 -14 -14 0 8 9 -14 -39 -33 -31 19 -6 -9 -39 -29 -14 -20 12 -20 -17 -4 -49 -15 27 -2 2 -35 4 1 18 29 3 12 -5 16
2972A6J6m2K3k2kJ0L6l9K7l4K0j4J4l1PJ2j6j2J1Pk4N1m6k0K9J4j4KJ0LrJNRk
$$ 16 32 -10 13 -9 -11 -1 35 -4 23 -11 9 -5 9 -22 -15 -3 -19 -31 -20 -13 -37 14 -32 -52 -23 -9 -23 -21 -11 -8 -17 -16 -11 -2 -4
3007dpJM8J8m5k1K3JPLm1J1j5RKk5L1Qj0l1L3rl2K3j5PM3l2J1K3pj3J9l0L2l2
$$ -4 -11 -10 38 56 11 -10 13 14 21 24 -17 -6 -21 -12 -10 -35 -4 4 -6 -37 -4 -13 -45 -22 -37 -30 13 -19 -8 15 8 -5 14 -16 16 -16
3043a6J2KkK6j7J5J6l9PJ7mK4k0k1k0J2j5N1j3j6oj4K6Nk3Rj2K3lrMj0j3J7J7
$$ -16 -4 -2 -4 22 5 20 36 -3 4 21 17 41 21 0 -20 -8 -23 28 15 -1 -7 -21 5 10 -13 -4 -16 7 4 -5 -1 -11 -24 -7 10
3078A0k1LJ6j6RJ0k2o%Rj8L8k0j4N0k7kJ1K1m3rK3J6k0j6J7J3%Jk7LK0Qj1ol6
$$ 10 -11 -8 8 -8 1 11 -11 -17 -17 -8 -26 12 -8 -22 28 1 -1 10 31 -12 -21 2 18 -2 -18 -1 12 12 13 -14 -11 9 17 6 0 -36
3114c6nL3pk3K6ol6M7J5k5%Kj0J5J3j1Nk5L4MMoQjJ5j9NJ7lj3k7L2k0J2pj6LJ6
$$ -36 -41 -8 -15 -38 -12 -18 -54 -7 8 -17 -17 -15 -25 -10 3 -8 -3 -28 6 10 14 8 16 15 30 11 16 33 30 17 -10 22 2 14 7 -9 -6 10
3152A0m4L0j1rJ9k1j2L7j0J4qj2j0K3J6j1Nk5rL0qL1k7K9l9K5j6K4qj7k1N6oj5
$$ 10 -34 -4 -15 -24 -5 -26 -38 -1 -11 3 -5 -17 -27 -4 12 1 6 -19 -28 2 -6 25 -2 27 -12 13 -3 21 13 -4 -25 31 25 10
3186A0J2k6k4L0J1l3J2K9m0mJ8J3j6J0j1Mk0MJPQj8k3K8J6Qj4MLjK6j2j1l7K0
$$ 10 22 -4 -28 2 13 -20 -8 21 -19 -23 -5 8 -8 2 -9 -5 -25 -21 -20 -13 -5 -23 -46 -18 -2 6 -8 -4 -1 -2 24 12 1 -36 -16
3221a6K2j8L6j9qJ7l0K7M%Mj9j1K0lj5LPMJk6J3Qmk6L1nk3PoJ8LJ4k7Qj6nNK2
$$ -16 6 -12 24 5 -3 14 -16 11 15 15 19 0 -11 9 6 -9 -6 1 5 6 -20 -7 1 -3 -29 2 -3 -26 -19 -25 -7 -4 10 -17 -9 -25 -30 -25 -3
3260cKMRPOk6L2j5k6L7k3k9K7oK3j4jJ7nmRj3k5lk1J4L7l3J8mMOk1pk0K5L3Ol9
$$ -3 -1 3 12 19 25 -1 31 16 -10 27 4 -25 2 -4 19 5 4 21 16 12 21 8 -17 -20 -41 -27 10 -23 -5 -9 -5 1 -20 -27 -47 -22 11 17 -22
3299b2K4poPJ5K1k7KNoj2K9j1lmpj0L5n3K0kj8L7kpLrJ0l0KJ9NpJ6Qm5N6l7J9
$$ -22 2 -5 -11 -4 11 32 5 7 12 6 -6 23 12 9 5 -2 -12 23 -30 -10 -12 -30 7 5 -2 1 -8 2 -28 -26 -7 -2 -9 7 15 -30 26 -11 8
3338Hl6lL0onj1JJ4j0K7j7M1j0n2L5lJ1mJ7k9qJ6RJ8k5l%J0l0L8rk7nj5L5j4p
$$ 8 -28 -31 -1 -7 -12 -23 -22 -8 -18 9 -8 33 23 -29 6 3 14 10 27 -2 -10 6 15 33 8 5 5 15 -15 23 14 -13 -18 -33 2 -12 -19
3375a9L0k3j4K7jj2j1ML8m7K4K1lk1L6j9J3l1M1Kj7Jk3K5qNpl8M0J0j8oJ5m0j
$$ -19 11 -12 -26 1 0 -12 -23 -19 19 -28 -4 17 14 -7 29 10 23 -8 33 35 18 19 -4 21 13 18 11 -27 13 23 5 -1 14 -26 -27
3410b7L0J3j8k4L0k1%J2k3K5j4RJ2l8K4Kj6K9K4k0M0n6L1n2K4J6kj8QL5l3J1o
$$ -27 3 16 -2 -26 4 -17 -17 -5 -28 -3 -17 -8 4 -34 -10 -8 -24 5 29 9 49 -7 24 -28 -4 12 10 -8 0 35 2 13 7
3443Gkj6QP%j0Pl1L7l1K6kjloj3J4oL2qk7MK5k5%mJ5QK2m2K1Rl2J0pJ0%M5o2K6
$$ 7 5 -11 -3 4 4 -6 1 -30 7 -24 2 0 -1 -4 -10 -23 -9 -15 17 9 -18 -14 11 -14 -14 -18 -3 5 27 -15 6 15 -17 -7 -14 -4 -4 41 -21 5
3483EJ8l2M4l3K7j4j1OLk7K0orJ4j2L6l7Pm6O0m7RL1m4K7L0k3lJ2k0j4K5kj3O
$$ 5 23 -9 35 2 29 15 4 10 13 -14 6 0 -9 5 -7 29 -8 -1 -47 13 -34 -25 6 -38 -11 19 -4 -7 5 -15 -29 -4 -6 -19 -13
3518a3J3LJ9k6K7j5pOK1k8jjQj4MNk3L4nJ9l0k9L2l2L0K5o5M1%J2k1J5pMl1J1
$$ -13 0 3 22 -4 23 8 1 7 28 0 -1 -2 6 -8 -4 1 -22 12 7 26 -4 -33 -1 -33 -3 22 -43 -2 -2 10 -11 4 -3 1 -30 -19
3554a9M0l4J1k0K9j2kK7k7%J9k0J9j3J0Kk6J2J9j9olj4K2Olj9J9j6RjL3k7j9L2
$$ -19 21 -13 -2 -22 7 -5 -7 20 -7 -7 12 -8 11 -2 8 10 -16 -4 15 -4 -10 -13 -27 -5 1 -2 -21 -2 -18 -9 -10 23 -4 -23 9
3589IK5o2J6qj7K1lj1J8JJ1m1K6mOL2nlj6j4M5l1K0qj1nNK9j4j8K5Lk3K5l0L4
$$ 9 34 -28 -12 -20 -37 -16 -19 -30 -12 -11 0 -41 -15 -19 -13 19 14 11 -5 -19 26 -5 15 7 -4 -9 -4 25 11 -7 18 21 -2 23 -7 27
3625B7j8Qk0k3k3N2Mk5J2JKk0K4j6J6k8M5klj6kOLlJ8J3m6K6qK2k2K4k1j0J4k0
$$ 27 9 17 -3 -26 -49 3 7 -18 -6 -5 -3 -23 1 -15 1 -27 18 16 13 -3 -5 1 4 1 19 32 -14 12 4 26 4 28 7 -3 11 -9
3661iJ3J0ll6Qj3K7k1NMPj1%K2l0j0J8QL3j4l2K3j4J3J0j3J0J6k8L0llk3L7j3
$$ -9 4 14 11 -25 -17 -30 -3 -24 -19 -15 -8 -19 -19 3 -27 -37 -19 -11 22 8 -24 -1 -15 -2 8 -5 5 21 -7 23 20 17 -6 31 18
3696A8rj1J0J2oj6rJ6j1j8K0Kj8PK%J4k6K9l2j0LJ7KK4n6K7mJ3j0K2j0oJ7Kj3
$$ 18 9 -2 8 20 14 -2 -11 5 -6 -24 -4 -2 -20 -13 -11 -11 3 -23 6 -26 -36 -33 -16 -14 10 -46 -19 -23 -10 -20 2 -8 -14 3 5 -8
3732hNLJ0j8jJj5O4m7K2k7L8j0j0pkjrK3k1J3J0k6J5k4J0%NPpJ1l6K7j1ROok0
$$ -8 -3 0 10 -8 -9 -8 -23 41 -6 16 -11 27 17 7 0 -2 -3 -12 11 -10 3 13 -13 2 -22 -12 -12 -7 0 -7 4 -32 -5 -16 -7 -1 -7 -27
3770b7JnL9oJpj9L6j7J9l1L4oj2lPJ4l2J7LlqqK2k7J0rl4K4nL8j4lk0rQQjk6L7
$$ -27 -26 -31 8 2 3 -4 -23 13 -4 15 -16 18 12 0 -3 4 18 -14 3 6 3 -5 -13 9 -18 -8 -17 -51 -27 -32 6 -8 -11 -31 -40 -32 -24 -25 -51 -14
3810a4K9k2LJ0Qk6kL9j4%nM6l9k4kL8m7J1K4L5n0LkrK1k5QoLLjk9L8jj1rrK3k
$$ -14 15 -7 -4 6 14 -12 -14 25 11 11 6 52 13 -11 -13 25 -22 -11 13 48 -2 1 -1 -10 11 -14 -6 -12 -9 -6 -7 -36 2 1 -10 -19 -28 -5 -7
3849gpKKo%J0J1qOJ8j8K5m0J3Lk0RK7j9Qk2M7m6%j6M9j8MK0l0K2plj3olJ2j0J3
$$ -7 -14 -12 -10 -16 -16 -6 5 -3 3 21 3 28 -12 1 4 -16 -7 20 1 9 -13 34 -12 -12 -28 21 3 7 27 -3 19 12 9 -4 -10 -13 -1 -11 2
3888Bj6j5QoJ6k1J5Pjk3M9nk7L0%rqj0J9OKPk9L8J2k9lj4j3L5pJ5l9J4j7L6pk2
$$ 2 -14 -29 -21 -27 -11 -32 -17 -10 -11 -34 15 10 -17 13 13 4 -4 -14 5 11 13 20 -9 29 41 12 9 -5 -18 17 10 25 -14 0 -17 19 12 -10
3926a0m0M0Oj2nJ3kJ1lj8kK4joRj2K4l0L3qmJ3J1k9J9j2j1K5l7O1k7j9K5k9jj4
$$ -10 -50 -10 -4 -16 -21 -8 -10 1 -2 -20 -22 2 1 -5 4 -8 16 -14 19 11 7 20 31 2 21 9 -2 23 -14 47 20 1 26 -3 -4 -18
3962a8PnK8k3l1M4j3rJJ5j4KOK4k1K9k7Pj0mJ2j1J3rkJ5j7J0k5J8OjjqN5k5j3
$$ -18 -11 -16 12 -11 -42 2 -11 -20 -19 -4 -18 -16 -10 14 -7 22 -5 2 -8 -12 0 -11 2 -7 -9 6 -11 -1 -26 -8 -2 -3 -4 -12 43 18 5
3999ElJ4qKk1Lj0J2K9k7J1k0Kr%jJ9J1j3j3j5nM4l6K4kJ9l1K1MpJ6k4L9l2K9l1
$$ 5 2 16 8 10 -11 -8 -18 -6 23 -4 7 -13 -11 -20 -20 -21 -2 9 -4 -17 -32 -37 7 -29 -5 -7 12 -19 2 6 -1 15 -9 30 -2 27 -4
4036djL8j5K2l8MJ0j4K0m4MJ9lJ8j5j9K1j6K8n9M1k2MkK0m0O5j1k2Rl0K0RKQK
$$ -4 -5 33 18 40 2 6 16 2 22 -22 -18 1 -2 16 1 -18 3 -13 15 -44 -3 -25 -21 -23 -3 -43 22 11 -11 -2 -32 -12 -3 -1 7 9
4072IJ2JnmOj3J8kj8j7M2k7J1k5L6Jl2L2nl9J2J0K1k8Oj6j4L8k3rJ9m0L2K1j4
$$ 9 21 22 17 13 19 6 24 22 4 -13 29 2 13 -12 24 25 -7 25 20 -19 -7 3 24 -4 2 -14 -28 10 -13 -22 -3 -43 -11 10 -4
4107drj2K6Ok6L4mk5J2J3j4l8L6J4LpK0kk4J3l7J9J1Nk3OJ2l5J8K3o2N0j0J4l5
$$ -4 -13 -25 1 7 -19 15 11 -14 -2 11 -3 -41 -5 9 12 5 25 23 -1 12 -25 -6 5 10 -13 -7 5 -30 -12 11 -51 -1 -11 3 -32
4142c2M0lj3k1K7mj4%J5j5NrK8lNj5J4l1K9lrPJ8L8l9j1K2k1j9J7k4j0L5J3j8
$$ -32 8 5 -8 -29 -2 -6 -20 -20 -5 -20 -15 -24 4 1 6 -9 5 -26 3 0 -9 -2 16 54 15 4 26 5 -14 3 -21 -31 4 17 -1
4177amK8k4l2K5nKk7L3J5n1NN1m4L5k4LOjj6K5j9MK4PPlmJ4k2NJ6l9K5J4mk9q
$$ -1 -5 23 -1 -33 -8 -13 -11 -38 -5 10 -41 -36 15 -29 6 -18 -15 -9 -10 -26 -1 -20 -16 8 15 22 19 15 29 7 12 28 -11 14 28 24 -5 -13
4215a3K5J6l4K6k5Nj8J5j8l5N6%k0kJ1k1N1j3m2M1j1J1KQj0lQk0oL9l4J7j5Lj5
$$ -13 12 28 -6 20 -5 0 -18 -3 -21 -56 0 0 -20 -22 -11 -32 19 6 -36 5 -6 5 7 15 5 2 10 -10 -16 23 -11 6 -9 -6 -21
4250b1L4K1m5K6k4J8l1J8K2k1K7nl3L7j9j6RJ0k0j0J0J1Jj1k1L6jkl0L0%J5j0
$$ -21 13 34 -11 15 -9 9 -22 -4 18 -3 24 19 -14 23 4 -12 -3 7 -13 -23 -13 -2 -1 -12 -33 3 2 0 -30 0 0 15 5
4283Ej5kj5J8K5k1J2nK4k2J1JrK0nKj5pjMrK3k1Oj0RMk2QJ3j4prlJ6RJj3j2OK3
$$ 5 -10 -12 -27 -9 16 -5 7 2 26 4 15 16 7 27 22 24 9 2 1 5 -4 19 -2 4 -6 3 7 -15 -7 6 -8 -15 -24 -27 -11 -2 -1 -14 -26 -20 3
4324CKj7j2J7nQJ1NmJ5j6J0k8NL0j9J8m1J8jlL1j8lK0j8l6J9J7l4lK9rj3OLMk
$$ 3 5 -12 -24 -7 -12 -4 7 12 8 23 7 17 -11 -6 24 5 23 -18 0 -1 -4 27 9 6 26 8 -28 -9 8 -26 -29 0 -9 -22 -16 -13 -9 -11
4362a1%MJ2j8nK4LJ4j8Pj4J4k8J5j5K8kj4jLK2j4j9OJ8j7MqQj9L6j4kj3J3nJ2
$$ -11 -11 -7 5 -13 -18 6 9 23 5 12 -2 12 -16 -1 -16 12 10 -4 -5 -2 20 6 -13 -7 11 -6 -2 -10 -2 -21 15 1 -1 -14 -1 -6 6
4399Fok5nJ3nk4PL1j9K5K3n9L4l0RKJL1j9L0j5nJ6j1%PPj2k4PK5k6M3n0L5Lok0
$$ 6 0 -25 -30 -17 -22 -46 -39 -8 -27 -2 21 -38 -4 -34 -25 -23 -22 9 -10 20 5 0 16 5 5 12 19 7 -17 -10 15 -11 32 -18 17 20 14 -6
4437fK9jl3j0K1oj9MJ1J8l2J9l5J8J0j4M3Mj5k9K0pN2k5JJ3k4lK4l5MJQJ3j3q
$$ -6 23 22 -11 -21 0 -6 -25 -21 -10 8 -24 -5 -40 -22 -12 -26 17 21 6 -23 -3 -10 42 17 18 31 7 4 28 -7 -3 -2 6 19 6 -2
4473bJ8j7j8J0rj3KK6n5L2K1j6qJ5L4m9L1k8lJ7N0o7J6KK0k6M8j7k0nj1J8Okk
$$ -2 16 -1 -19 -9 -18 -31 -29 -3 -58 -26 -5 -21 -29 -14 20 -29 2 -26 -29 -12 38 -29 -13 -11 9 -17 31 14 -6 -11 -22 -4 2 0 -2
4508bKoK6n1K8rJ1j5JK4j9mM0j6j7nrJ9Rj4k0L8m8N0k5Ok7L9qJ7qj%j9PJ9pk1
$$ -2 0 -6 20 -31 -3 -12 -1 -16 -15 9 -10 -14 26 10 -7 -12 -21 -2 7 -7 -27 11 -37 13 -12 -6 -33 6 -2 15 7 6 6 -13 -6 13 6 -15
4546a5J2kj7L0Jj5QJ0k0J9Ll5L6k6KK1l0Lk1M3qj4J4l1nJ5j2k0K9rPJ0k7L6rK4
$$ -15 -3 -5 -22 8 9 -6 2 12 -8 11 14 -21 15 -11 -9 12 -18 -15 -36 7 -1 -15 -1 -32 -37 -22 -34 -54 -25 -34 -27 -17 -44 -8 -17 7
4582Gk1qj3J6kJ7J1%RJ4l7K2k8J0j0L4m0K1OJ3qj5lpJ5Mrj8m%QKqqPN%j0K1%j1
$$ 7 -14 -22 -35 -19 -21 -4 7 7 16 30 -7 15 -13 -3 -13 21 -19 2 8 21 13 -2 -5 -12 3 7 -2 -20 -24 -24 -16 -14 -22 -30 -23 -18 -18 -28 -7 -7 -18
4623a8%K9j6L7k6%Rl4L1k9J6J3j7j5J7K0j4k4M5j3l7M0j6Mj8kQj1J4j8NJ2mJ4
$$ -18 -18 11 -5 32 6 6 15 -19 12 -17 -1 12 -5 -20 -3 17 3 -21 24 11 -26 14 -2 2 -16 -18 -10 -21 -7 -25 -20 -8 -12 2
4657Bnj6j1J4OJ1m0M8lk4J5rk7N0k0Pj3L5rj0J3j9j6K3MK4m0j1M0j9lkqJ0J5k1
$$ 2 -3 -19 -30 -16 -10 1 -39 9 6 -18 -3 -12 -39 11 -9 -2 -15 20 11 1 14 -5 -21 2 6 30 -10 -21 19 0 -3 -5 -13 -3 12 -9
4693iK1l0J7k3qK7l1J7kk0M1j9K1n1L6jj7J6J3j0mMJ5j2j8L6Jl%jRk0j4J9Qnp
$$ -9 12 -18 -1 -24 -32 -5 -36 -19 -21 -41 0 -19 2 -49 -13 -14 -31 -15 -2 -12 -16 -12 3 -9 -27 9 10 7 7 6 15 -5 -19 0 8 3 -4
4730dJ3Knk7J9nrlLpLj9jM2J9m1J1k8L2k5J3J4J%j3jRJ4koK8k8J1RJ5l8nqM6k6
$$ -4 9 11 6 -21 -2 -7 -16 -19 -16 -23 -20 -39 -40 2 21 -20 -9 -37 -5 -30 -17 -3 -2 -2 -15 -16 -7 7 5 -1 27 -1 10 19 34 -4 -9 -17 29 3
4770CJlOL0p3L2J3rj2K6j8j9jL1j9k1J9pJ1J2pk3j0J2K5JpNj7j6K8K0k1%J7ml6
$$ 3 4 1 7 37 -36 -4 9 0 -12 14 -4 -23 -24 7 -12 -33 -14 -21 -10 2 -5 -28 -38 -26 -1 0 -7 -2 -19 -35 -7 13 -8 -8 9 5 -31
4807c1K4J7J0J3l1jJ6j2Nj8ollJ3lQoK2l4J6pj7lmL2K4n9J0kJ4LJ7j9lJ7QKk4
$$ -31 -7 10 20 33 2 1 17 5 10 -8 -14 -17 -20 -7 -10 -2 -8 14 -20 -4 -11 -28 -31 -35 -3 21 -38 -28 -30 -16 -13 4 -15 -18 -1 7 9 -15
4845a5J8M4l6mJ0l9M4rj6K6QKk0j7Jj6J7k1M3j9Nl1%L7k1kK1k9ML4j2k4K1j2k
$$ -15 3 47 11 7 17 -22 22 13 -3 23 31 33 13 -4 -3 -19 -2 -23 20 1 6 -25 -25 12 -9 -11 10 -19 -15 19 7 -17 4 -8 -10
4880a0nj3M9ol9K3k3K0MmK8k5K1nJ6l4mJ5K8l2rPjOpJ7l0K4k9Pk9K2K0nj8J0o
$$ -10 -15 -28 21 15 -24 -1 -24 -4 0 -4 24 -1 20 15 31 -3 -7 8 36 4 -5 2 1 7 0 17 -13 11 -18 -11 -40 -18 2 -3 -21 -11 -17
4917a7oK3k4L4rP%k4K3kJlJ8j0k5J8J9rj3LMl3L7k8j3K4K7jj9ORj7k2L6l8M7l0
$$ -17 -23 0 -24 10 1 8 8 -16 7 5 6 3 21 11 -14 4 23 14 1 4 8 -25 12 -16 -29 -5 22 21 2 8 17 0 -22 14 -24 23 -7
4954gL2j9m1N6ml4NoJ0J2j8PJj4RN%J0k5J4NL6Pn3K4J5j5J2k4J4l1K8J5qm1L2
$$ -7 25 6 -35 21 17 -17 -12 -18 -8 4 -14 -7 -6 -20 -11 -6 -6 4 -21 -7 -2 34 41 -12 12 27 12 24 0 14 -17 11 26 18 -23 9
4990Ij4Kk%j8rK5j4J6nLnKj5L9k6J3j7L3l4k3N9j2k0L3nPKNk8%k1J7QK6j3j5K2
$$ 9 -5 -3 -5 -5 -23 -32 -7 -21 -5 -10 -7 -12 -10 -25 14 -12 1 -16 17 -17 -40 19 7 -13 20 15 22 24 29 1 1 -20 -3 5 31 18 3 25
5028B5jj4k0K1jMk4K4j4k9K7Qml0K6j0nJ6j9K3k8N0m5J6QQm3M9l4J1M1m4L8j9
$$ 25 24 10 -10 11 10 14 -10 14 0 -29 -2 6 2 -28 -2 -12 -17 -1 -20 3 -25 25 -20 -4 4 12 -31 18 -16 -5 36 -8 30 11
5062A1%j8RpnK4l1J5L2l1j2L2m0L1Ok9J1k0K3l3OK4Mj3Lk0K4LNl4N2j8Lj9J8l8
$$ 11 11 -7 2 -5 -10 14 -17 -2 30 -1 -13 19 -21 10 16 -13 -2 -22 1 -32 -26 -2 2 -11 -8 -28 -4 -1 4 -30 22 4 7 -12 6 -32
5098c2L0j1qM3k7j1K4j8K2Pj5nJ9Jklj5Nj0K0%Ll7L1j9j8NL1k1j8JMK3K1k2J5
$$ -32 -2 -13 -21 22 -5 -16 8 -10 12 19 4 -1 18 19 17 14 -1 4 -6 14 14 17 -20 11 -8 -26 -21 10 -11 -29 -28 -24 -1 20 -2 13
5134A3j3k1qK6ONNk7Nj3L3j1K8k0QlJj1kj4K1K2k4k4L7Lj2J5l6pK5kl7L7j3pQ
$$ 13 0 -21 -29 -3 3 8 13 -14 -9 -22 11 0 28 8 16 13 14 3 1 -13 8 30 6 -18 19 22 10 25 -11 -18 7 5 -32 5 -8 -15 -7
5171gJ4LOk3mpL3j3poj5krN2j3j9K2J3pJ9m4J2K3%j7Pml2J2N1j7Pk1k7K6j4J4
$$ -7 7 10 16 -7 -11 -18 15 2 -5 -11 -26 -28 -37 15 2 -17 5 18 11 30 -14 -2 21 21 4 11 7 -25 -13 38 21 28 7 -20 6 -8 6
5208Fk4N6l9j9J8l2J6Rj7J7k0RJ7j2j4M5j6j6nJ8j3mK3J3kpJ1oJlj1j6K4J9j0
$$ 6 -18 38 -1 -20 -2 -34 -18 -9 -26 -9 -29 -20 -3 -15 -29 16 0 -16 -21 -3 -16 -20 3 16 14 7 18 12 13 10 -1 -17 7 26 16
5243A6qj4j0J8lk3L0j9J0Mj6j9L3k1RJ9l5J1j4L1oj6lK6j4L5k2nn%J1mJ8Mjk2
$$ 16 8 -6 -16 2 -1 -24 6 -13 -3 1 -15 -34 -1 -22 -13 6 -29 -18 -32 -1 -7 -23 -26 0 -14 21 -1 -6 -11 -11 0 -4 14 18 17 -5
5279ej4jRKM9j8oj3k1M1n1K7jj2OJK0m6jOK4j0Pol5K9K5k1j0J7j1NPK0l0K8rk
$$ -5 -19 -20 -11 -9 40 22 16 3 -18 23 -28 -1 -2 -14 -8 -7 13 -33 -34 -28 -4 -14 -7 -13 -48 -19 6 -15 -25 -8 -19 -14 -7 13 -17 11 2 0
5317@k2J9r%NK2k2pk2K4oqO5m7JNj4QJ0pj0L2k0k0K0Mk2k0J8nJRMK2o%K9j6k4
$$ 0 -22 -3 -12 -12 -7 15 -7 -14 -36 -12 -18 -26 39 -8 -7 -2 -16 -8 2 -5 -15 17 -3 -23 -3 1 -21 -41 -23 -28 -27 -18 -14 8 2 2 31 15 -9
5356iK3l8K2K3l0nK0l8M7k2J7K2m3J7j3KK7k0j6mL6l0J2l%kkJ2Nk9L3m6J9MK3
$$ -9 14 -24 -2 21 -9 -14 6 -32 15 -7 10 32 -11 6 -7 -5 22 2 -14 -18 18 -12 0 -3 -3 -5 -7 5 10 -19 14 -32 -13 -9 14
5391A4k4OK5l3QNk3J5MJ0j5LK3m0LK6k4L1p%K5j6ok2K4ojMk6K4jk6J2oK3j2Ql4
$$ 14 -10 -4 21 -12 -4 1 -22 -7 -3 7 -8 -5 18 -22 -19 7 -17 14 7 7 32 16 10 -12 12 6 5 9 -17 7 6 -20 -8 -14 9 -3 5 -29
5429b9K1lMrJ3moj6N2Mp0M5kj4PPk3RK5lqj0K6J4k4%Lj8J8j6K5j2lj6NJ1J6l6
$$ -29 -8 -11 -7 -16 -3 -7 -13 -29 23 27 -43 2 0 -14 -7 0 -23 -14 11 8 0 -10 16 30 6 6 9 -9 9 -7 18 6 3 -13 -8 3 19 -17
5467a7J4JnJ5l3Ok8L3NL2j6l7N8o1PL3j3ML4k6rPJ8j4J7l1%L5KJk7j2K0j9j9K3
$$ -17 -3 -2 -7 8 -25 -19 -47 -14 -9 23 7 -30 28 -33 -26 7 -6 -2 32 6 -3 4 22 8 25 -6 -6 29 31 32 5 -7 13 -6 -25 -2
5503bNJ6Pj1k8j6L3Pl6oK2nk4J6lJ9k2J1k2L9j5QLK0%j8j3j0L1NJ1ql3L7J4j4
$$ -2 3 19 26 15 -13 -29 4 11 -25 -31 -9 -14 -38 -22 -25 -6 -28 -17 -39 0 -15 -7 -4 16 16 -2 -15 -25 6 11 22 14 -19 18 32 18
5539A8k1NL9m6%j7okL5j6K1K0j9%l0k4L4l5J2J0mJ8J4j5j8M7Jk5L7k0k2qJ1kJ6
$$ 18 -3 2 41 -5 -5 -22 -28 -30 5 -11 10 30 11 11 -19 -43 -9 -44 -32 -22 -26 -8 6 -9 -27 20 21 -4 33 13 -9 -17 -6 -8 8
5574HpJ9%jl0RprL1j1k5J0jj5L6pnMMOk9K3J4l1J1k9M9k2mj3OK5l1jK4oK6j2k5
$$ 8 1 20 20 19 -11 -2 -9 -18 13 2 -23 -13 -14 -29 7 0 -5 -1 3 9 -20 3 17 -14 -3 -32 17 -5 -9 -22 -16 9 -22 -23 1 -5 21 9 -16
5613a6J1J6nj1NK3PpJ4k2oLNj9j7N3l0j7K8j6PnnnrNJ8m2K8L5m3j2J8kj8K7KQ
$$ -16 -5 11 6 -5 0 23 30 23 37 15 9 12 17 -2 -19 34 4 -13 15 -1 6 1 -4 -9 -18 -13 5 -37 -9 26 -17 -29 -11 -13 -31 -4 -2 6
5651Fj8J6j9J6J6Ok1qL0m0oK1KRjmk1Pj5OJ0llJMj%KNNqrPL%nj8L6lk1j5K4J3
$$ 6 -12 4 -15 1 17 23 2 -6 24 -16 -22 -1 1 10 9 5 -16 -9 -24 -18 -8 -11 -14 -13 -9 -10 -10 -8 -3 2 -6 -15 -8 -5 -5 -10 -28 8 5 -16 -31 -7 6
5694Fj2J7m5N3k1K2rLrqj7K3J3mK1m1K0j0M1j2mj9jj3l3K9nK5J0l1K4k6K5l2q
$$ 6 -6 11 -34 19 -2 20 11 14 5 -3 -20 3 16 12 33 -8 12 2 43 31 27 8 7 -6 -39 -10 -15 10 20 -11 13 -13 12 -20 -28
5729b8J2J2jPk0mJ7MJ2k0K4J1l0oqQJ5j6J8jj5QKL0Rk3k8J7j8OPjJ7j2k7LL2k0
$$ -28 -16 -4 -5 2 -18 -22 -5 -1 11 -9 15 26 -4 -10 -18 -10 5 -11 7 6 -9 -1 1 31 40 17 -11 6 -12 -6 1 0 17 5 -22 -19 13 -7
5767gJ1qj5J3l5OLL0rj6kJ5jlM5k9qKj3K4kok7K0K5lLjKoJ2k2nJ3prK9l7OJ2m2
$$ -7 4 -4 -19 -6 -41 -35 -32 -2 -11 -27 -29 -14 -15 -18 27 -2 -10 -8 -21 3 1 -5 -32 -12 13 10 13 12 14 8 20 -2 -7 6 -1 -10 19 -18 -12 0 -42
5808d2OK6K3k2rJ5j6LJ7pj2k6L2QJj5j5K6LK7k4j6J9rOKJ2rMJ0lJ0k4k3K5qNk
$$ -42 -36 -10 13 -9 -18 -3 -19 -16 1 -6 -18 -44 -12 -4 -3 -18 -33 -7 -4 23 -1 -17 2 -7 -1 1 13 4 8 18 15 25 1 -22 3 -5 0 -2
5846bj7ONJ3k3kKN1m9mL5k2pkJL3k6j5K7j5J0pK7lj0j0mPQPnQPl8PK7j4j0J2m
$$ -2 -19 -13 -8 5 -18 -20 -18 33 -16 -20 15 -7 -14 -16 -15 18 -8 -23 4 -11 -1 -8 19 16 6 -4 -8 -1 7 14 9 17 24 -14 -7 20 6 -4 8 4
5886DK4j0jkk0j5J4j1Pj9J9J8l8K2k4J8pK2kl2rJPM0rj8J7J1k7K9lMk1KmJ6Jj3
$$ 4 28 18 17 15 -5 -20 -6 -17 -10 -29 -10 8 -30 -8 -32 -14 -21 1 -1 -33 -42 -41 -34 6 -3 -21 -4 7 -20 9 6 10 -11 -9 -13 3 4 -9
5924iMJ7kppOk9K3kk2Nj6RNK9j4rkJ4j4MklK7k3L3l0J3j5J1Kj4K9k%j1Lj4jK0
$$ -9 -5 12 10 3 -4 2 -27 -4 -6 -28 -23 -39 -30 -25 4 -10 -19 -21 -7 -21 -17 -19 -22 5 -18 15 -15 -2 -17 -6 -4 -18 11 9 9 -2 1 -13 -14 6
5964FoqJ7ok8K6MqK5J1o3JJ5nj6L6j8L3qk2MrJ2j7lPJ5oK5oj9K8Rk1k9J6k3N5
$$ 6 0 -8 9 3 -25 1 5 -3 22 33 -30 -29 -14 -19 -35 1 -17 16 8 -14 -10 -19 -7 -24 -27 -20 -5 -11 14 8 -11 17 26 5 -24 -8 -31 24
6002B4k5lK2Lm6J7K2pLQnk6J2rJ4j0QMj9J0NOl2JK6kl6MJ0QlKNJQk4L2k9M5m7
$$ 24 -1 -4 18 21 -25 -8 14 7 10 18 13 -13 -1 -10 4 -6 2 6 -13 -3 2 8 -24 -23 3 1 -35 -31 -21 -13 -16 -14 -9 -8 0 -24 8 -21 24 -23
6042b3K0Lj0lJ9nJ1k0K4j0k1J0KK6j4J6m1j7M7nj7%k5J7NJ0%pj3qL7j4nk0N1n1
$$ -23 -3 0 -10 -13 6 1 12 -8 16 6 -15 -5 -3 23 9 25 -16 -33 14 9 -8 -8 -33 -16 -11 -1 -1 -8 -21 -29 8 -6 -11 -31 20 -31
6078c1K9j7JJMN6k0Nj9qLkJ4l0K6j7J1oK7j3k5QpkL6rj1k0J3qK1k2Kj8J0j1QL1
$$ -31 -2 -19 -18 -17 -13 43 23 28 9 1 4 2 16 -14 12 -5 6 0 27 14 -11 -3 -10 -12 24 15 4 -16 -3 -11 10 -12 -10 -28 -18 -29 -21 10
6116A0l7JJ0J5%JMk2J2LJNJ0k0%pjJ6jrkJ7j8J4L5k5%J7k0j4j5J6qK6k5j3L5k5
$$ 10 -27 -26 -16 -1 -1 0 4 -18 -6 -3 -2 3 13 -7 -7 -14 -15 1 0 -9 -11 6 -12 2 37 12 12 29 9 -5 -20 -4 -12 14 -11 -24 11 -14
6154a4Rj6K4k2k1L4j4J7k2J3%K3oj1J2nJ1kJ0k1J3j6NRlOk6K5j2j2J0J1j3LlK
$$ -14 -5 -21 3 -19 -40 -6 -20 -3 -25 -12 -12 11 5 -6 6 1 12 10 20 -1 12 -4 1 10 7 13 -13 12 0 -12 -2 9 -4 -1 -4 -2
6190bjOpl5K2L2k5kJ1%j9K1j7K2j8%nj5M1k6L6l1jK2NLmlJ7j5QmMk3QrM4l8j1
$$ -2 -3 3 -4 -39 -17 15 -10 -12 -1 -1 -20 1 -16 6 -12 -12 -17 -32 9 -17 19 -12 -13 9 14 17 13 10 27 12 20 16 20 -3 5 -4 40 2 -9
6229iJ1JrK7j5j0J3k5J9m8M5j2k2K0k6L0J5J%k5l0L2J6J5j9nK3m4L2j3N3k5J6
$$ -9 2 3 -6 21 6 -4 9 -16 3 -45 0 -12 -34 -14 -40 -10 5 6 6 -19 -49 -17 -1 14 -5 -10 13 -31 1 -12 41 16 32
6262C2k1k%%Rkkk2MJ1kk0L9qk7j4JL0lk5J3K7l0J5Mk3K2k9jL3jnKk7M8Lm1J9O
$$ 32 11 9 9 9 18 16 14 -8 -4 7 5 -15 24 16 -11 -25 -24 6 3 -22 -9 18 -12 3 7 -16 6 -23 -24 9 8 3 5 -22 26 29 -12 7 13
6301A3Jl1L1K8m9L7j6Nj4J9l0oK8k5PoJ6Ok1Rj6j0J0j6J2Pj5J0LNJ5l1RL2j7J6
$$ 13 14 -17 14 42 -7 30 14 19 5 24 -6 -12 16 -9 -2 -8 8 14 -7 2 -14 -24 -14 -30 -18 -11 -26 -16 -13 -8 7 -24 -15 17 0 16
6337A6mj0k1K2K7nj6nJ2K0l3qK6kl8K0l4M6j7ok4N0pl5L3jQl0rLJJ2OrJ7l6K0
$$ 16 12 2 -19 3 30 25 9 4 16 36 3 -5 21 19 -19 1 -33 13 -4 -10 -34 16 9 -26 7 6 14 -16 -25 -22 -21 -9 -3 -12 5 -31 -11
6374a1RPkk4J4J0k0RkJ9pjrJ7%j7NJ1qK5nOMj9Ok6K6J0k9K1kl9J3op%J5k3L0k
$$ -11 -2 5 3 -21 -7 3 -17 -8 -10 9 2 1 -8 9 9 -8 -3 8 0 25 20 26 30 11 17 -9 17 27 -2 19 17 -22 -9 -15 -22 -22 -7 -30 0 -2
6414bqqKJ0Kj8J7k6pN3k0k8M3j8k8L2PJ6Qj8KqRj6RLKJj0QMk8K5j1k7L1k3L1k7
$$ -2 -10 -18 -16 -6 -4 -22 -5 -31 -38 15 -5 -33 10 -8 -36 -4 3 19 27 9 11 3 12 -4 5 8 10 11 1 9 13 -15 10 -1 -28 3 -20 11 -16
6453a6j1J5Qj4J4j5mNL1k7J2lrj7L7QJl8K6OmLmJ0KK1j6J1k8Pkkk3POj4L5j6m
$$ -16 -27 -12 -4 -18 -4 -19 -23 -18 13 -14 -2 -5 -14 -31 6 14 15 -23 3 9 5 8 4 14 16 37 21 32 4 11 9 7 -16 -9 -3 -17 18 2 -2
6492bj6oJ7j1J5qk5N1j5j6K2k6mJ3NoRK1k7lJ0mL7j9k2JRM1l4Nj7LJ3Jrj2K0K4
$$ -2 -18 -24 -7 -18 -3 -11 -36 15 0 -16 6 -20 -24 -11 -6 -12 -3 18 -9 -12 -2 -6 31 12 -10 -9 0 41 7 12 -5 -2 11 12 3 -9 11 35
6530C5j8lk0k5ML4nk8QrK2k1M0k9L5m7K3L0k2j8J2oj%L5j8K7j9oKkj7K4j3Kj6
$$ 35 17 14 -6 -31 -27 7 2 -26 -18 -27 -5 -26 14 -15 20 -27 -4 26 4 -14 -2 -8 -9 -9 26 8 35 16 10 12 10 -7 17 4 6 -10
6566a0J6Mj7kjK9j7j3oK5k5J3k3M7j7l0K5jLl1N0pl0J9J4Nk5Rk8PJ5J6j3k3L1
$$ -10 6 10 -7 -9 -10 19 2 -11 -17 8 -17 -4 -27 20 3 -27 -2 -3 0 -31 19 12 -18 1 15 20 -5 4 -24 -17 -2 14 1 -22 9
6601INj7K6j7qjNQJ9%k7J1k9L6j4JJ2j7J8mk1kj7K0j3J7j6nJ2jnK3j2k2%J0J7
$$ 9 14 -3 23 6 -2 -3 2 10 29 29 2 13 -16 20 6 7 19 2 20 16 -5 -7 -24 -4 -17 0 -16 -21 -9 -10 -15 8 -4 -26 -26 -16 1
6638ArNj3L%J6k4K8J6Jj0j4kJ5K3rl4K4j5qJk5K6NpL7m0JrlK8j3J4qNj5k4K4K0
$$ 1 -8 -3 -16 -13 -13 3 -21 7 23 24 14 0 -2 13 36 27 -7 17 2 -6 -5 -30 -4 1 -6 31 -9 -8 -17 -20 8 -5 9 1 6 -9 -33 -9 11
6677A1%j3Kj2L6k6j4L5j3NJ3kj1%K1roj6J5j0jOmj2Qkj3pmLJ0K0k0j9M2mk7NL6
$$ 11 11 -2 0 -12 24 -2 -16 19 6 11 24 22 11 11 32 23 17 1 16 6 5 11 7 -5 3 1 -12 -19 -23 -20 -10 10 -10 -29 13 9 -18 -13 23
6716B3m4Jj9J9JJ3J7k1J5K4m0QoqM1l4K5k1J3j5J6l2NOL5Kk9JMRJl2L0Lj9J1k7
$$ 23 -21 -20 -39 -20 -19 -6 11 -10 5 29 -11 -3 -9 -17 24 -10 15 -6 7 -8 8 -24 -19 -13 22 24 -5 -4 0 9 10 -22 8 11 -8 3 -24
6753b4NJ2pK4k6mJJ0K0j3K4k6K1k3PK5m5K6m1N2k7M3Kj6j7K2j7OqJ4j7j0J3mJ4
$$ -24 -19 -7 -14 10 -16 -20 -19 -9 11 -2 22 -4 17 -6 1 26 -19 7 -34 18 -9 34 36 20 3 25 8 14 6 20 3 -7 6 2 16
6788A6k6j0QL7k8MJ7J7l7JJ4J0l5pkj1L1k5J1kJ2J2j2mK9k4Nj3L7l4K0l2M8k0
$$ 16 -10 -20 -12 25 -3 1 18 35 -2 -1 13 23 -12 -19 -21 -32 -1 -26 -15 -17 -5 7 -5 -9 20 -4 1 -12 25 -9 11 -21 27 7
6822GJ1j2Kj2J0J1k7JL9l0j2K3m7K7mJ8j4L1l9J6l8J1K6j8kMJ9Nk2J1J6lk6K2
$$ 7 18 6 8 -4 6 17 -10 -9 30 0 -12 11 -36 -9 -13 5 -9 22 -17 -1 -39 -28 -2 -20 -22 -18 1 6 -16 -5 11 8 -18 4
6856D%oRLK4Rm5K1Oj1J4j8lk0j0L5pJ2l9j3MQK8%j6kOmj2QM1n8M6j8j2J2lj1K2
$$ 4 4 -2 7 10 34 43 -2 19 25 14 28 10 7 -13 -23 12 5 17 -22 -35 -31 -23 5 5 -11 -13 -7 -11 -23 -15 26 -32 14 -4 -16 -4 -7 -18 4
6895Dj5K7j8j3K6Ok2%ok%J6j7NJ6Mr%K1l1KjL1Km8N8p4mM6j2OLRj7K6l0J0J1l
$$ 4 -11 16 -2 -15 11 17 -5 -5 -11 -13 -13 3 -14 -9 7 11 2 2 23 -8 -6 -7 24 26 -22 36 -38 -42 4 -8 -2 1 10 -7 19 -11 -1 10 7
6934Gj0J1Lj9j8K2J6Mkj6Rlj6J6JmOj4J5NomqJ5j4Oj7j3L1j3K3Ql7KNj0K4j7j8
$$ 7 -3 8 11 -8 -26 -4 12 16 14 -2 7 4 -12 4 5 1 7 -7 8 13 7 3 -5 10 -4 2 -15 -28 3 -10 13 21 -16 -14 -9 -19 5 -12 -30
6973c0J7rMj5L7mj2K0j5J6jRk4J2Lkk1K6k3j6K6nRkjmK2o4K7M1l8K1k4OoJ2j6
$$ -30 -13 -22 -18 -33 4 0 -12 8 -7 9 8 17 -7 5 8 6 -15 11 -12 -28 -2 -7 2 0 -1 -5 17 -47 -20 21 -17 4 -20 -14 -20 -8 -24
7010b4L1m0MJ2M2l6%J5KPl3J2QnK2j7llJ6Mj2mJ8j2j5J6PpJ2j9Nl3K1MRJ1rj8
$$ -24 7 -33 -29 -17 25 -11 -11 4 6 13 -20 -8 0 -5 17 0 -3 -6 10 14 2 -2 16 4 -11 5 12 5 17 -2 3 -30 -9 -5 4 15 6 -12
7048a2NrnJ8j0J1j1qmQK1j7K3j8MLLmkQJ8rn2L2J3K8m6KK3rJ2kj7NJ3mnomL1l6
$$ -12 -7 -16 -21 -3 -13 -2 -13 -21 -25 -17 4 -13 10 -8 -4 -1 2 -2 -4 4 22 13 -39 -7 6 34 -12 -10 13 4 16 14 -3 2 15 11 6 0 -4 27 -9
7089iJ8ql6L8k2jJ3ork1M9rj9K8j6%J0Oj4kK5k1K2k0J1pK6j8LJj4k1M8j0Jj0j5
$$ -9 9 1 -35 3 -19 -20 -7 -13 -22 -43 6 -3 -22 6 -10 -10 0 6 -8 -10 15 -6 16 -4 7 0 26 8 11 12 -2 -23 25 15 16 6 -9
7126iRk8OjJ5nJ9nOrk7L4KJm%J1m6L2j4mmNLoJ2J2MJ1j9J6onk1L4j8l4L5j6J4
$$ -9 0 -28 -22 -23 -8 -13 6 1 7 -2 -29 5 7 8 4 4 15 -31 1 -13 -17 -21 -16 -13 -19 -7 5 9 20 1 17 11 6 -15 19 1 -33 2 -14 0
7166@qNK9m7J0K5j1oJ1k3JpJ0qrN6n4K5l0L4JJ4lnj7kJK6p%lRj0rK%PJ5qj9J7
$$ 0 -8 -3 26 -21 -11 14 3 -3 8 -15 -14 -21 -11 -19 -28 28 -26 -1 -31 3 4 18 15 10 -7 -9 -8 18 11 11 8 17 7 -2 0 0 7 22 14 -5 12
7207A2j9M9l8j6L8m4NK6rJ6l3pLM7o2OJ1oJ9lk2K1qJ3j6J6pQJ0k9J8K2j5k0J6
$$ 12 -7 42 4 -12 26 -18 -13 13 4 20 -13 -20 -17 30 -32 -26 -15 -21 -2 -5 -27 -6 -14 -1 -17 -1 -8 0 10 -19 -1 21 6 -14 2
7242BK0j5j6J6j9M5n1J3J4J9k2L7q0N5j8jqJ1j6J9l3K5K4m3K6J3j2k2RrJrJ4O
$$ 2 22 7 -9 7 -12 33 -18 -5 9 28 6 43 -37 18 0 -1 -9 2 -14 5 -28 -3 21 -22 4 17 5 -17 -8 -17 -16 -25 -11 -5
7276ej5PM2qj7oK0jj8L5j5lj6N2o2K6J8qk3kLm2K5Q%J4k0J8nj2l0L6j5J1j2OK0
$$ -5 -20 -13 29 21 4 -2 18 17 -1 34 19 16 0 52 -10 16 34 26 3 1 4 -38 -13 -5 -5 9 -11 7 2 -10 -40 -4 -19 -8 -20 -14 6
7313Fk7M9k3j7K4mj5LKJ2j2mj6K9J7k3OK0l8J2L6l4k5J6J9KJk3K3Mj3lJ2j6rk5
$$ 6 -21 28 5 -12 12 8 -7 -4 -2 10 -2 -6 -22 7 24 1 7 27 -11 1 37 3 -22 -6 13 15 16 -7 16 20 7 4 16 0 -9 -34
7349c4K0nK3pk6K1j7J3oL4Nl1k7J7K5%K5ql8K6mJ0k0mM4l8%Kj0j1L8j4LKMJ3m
$$ -34 -14 -19 4 -3 -29 -8 -25 -12 -18 16 21 -10 -37 -20 5 5 30 22 -16 10 6 16 -4 -8 36 -2 -2 0 -10 -21 17 3 6 8 12 25 21
7386B1l6K1k8kK0j3klJ5J5j4k0J0OM3m2J9j1KMJ4mprK1j1KRlJ6k5k5K7pk6L2k9
$$ 21 -15 6 -22 -24 -4 -17 -19 -22 -7 8 -6 -26 -16 -10 33 -9 10 -1 1 5 19 15 8 -1 20 9 11 20 17 33 8 -17 10 3 -23 9 -20
7423b0K5rK7k6jK4k6nK6j8%pK3j8j1oL7j4k7J5K0k7qKL7k4j2L5Jrj1J7nk6K7K
$$ -20 5 -4 23 -3 -4 20 -6 -11 15 -3 -3 -10 13 -5 -16 -22 15 1 -26 -11 9 -18 -26 -24 13 -11 -23 12 13 4 -7 10 5 -21 6 8
7459HJj0j0J3OJkqkJ4j7Ol8L2LjJ0j8j0OJ5k7KMJ9jJ4lj6MJ2j2jK3k6J3lJJ2j0
$$ 8 9 -1 -11 2 8 9 7 -1 -3 11 -6 0 -38 -6 -3 -4 6 -12 -22 -16 -1 -28 -26 -22 -3 -4 10 7 -9 -5 7 -5 -6 17 -9 4 1 2 14 4
7499DnJ1rnJ5l5L2J7Joj0j2nj9K1Lj0J5prRlkK7m2K1Ol6K3k1L5k0K3K5l0MqJ5
$$ 4 -1 10 1 -4 11 -24 8 25 26 20 10 -2 -7 -26 -5 -2 -12 3 -4 -13 -4 -7 -9 18 -24 -3 3 -33 -10 -31 4 -16 7 32 2 6 -2 13
7537A3j1pj5J1PK7k9JJ5qj3K8kLk6jj2J3J2j9nk9M3J%OK3k0j8k7K8j5K1LqjMK
$$ 13 2 -5 -20 -9 -2 25 -4 -3 12 4 -9 19 17 20 -6 -7 -19 -6 6 -13 -18 -47 -4 -3 -3 3 26 6 -12 -39 -11 -26 -5 -2 -10 -11 -7 -5
7575eLrJ2j7K5mLqJ4j1joKJ0J2j5jNj9J6OLrk0J7Pj3J9l9J4J3k0RmK5j1j5j2K0
$$ -5 -2 -11 1 -16 9 5 8 0 14 3 2 -4 -2 8 20 5 4 9 -10 6 12 15 6 -14 3 10 -3 16 -23 -9 4 -16 -7 -11 14 3 -12 -24 -4
7614dJ6j1k9L7k4J1Pj6OJ1rlmrN7m7J6rK7k1K3k1nJ7j3l1K5lkMJ3Nqj0J1j2KM
$$ -4 12 1 -28 9 -15 -4 3 -13 -7 4 -5 -8 -12 -21 36 -11 5 -4 23 2 25 4 -1 16 3 -28 -3 -6 -8 -4 9 14 6 -4 7 -5 -3 1
7652Aj9MJ2kJ8l3OJ2mL2m3K7k0M4m5J5pJ8Qk3J0nK9nJl1Qk4pK1J4l1K8k4RpJ2
$$ 1 -18 -14 -2 -4 14 -19 -13 -1 -5 27 -16 11 -9 35 -10 5 -2 16 24 1 11 6 35 30 31 0 8 -16 -23 -2 12 -19 9 -15 -6 -13 -1
7689aj3KJ5j1j2J1J6k4L%j4PlLL4k6J4Nj5M4k5J9k9oK2l1L4J2k4J4qj7OJ0l4K9
$$ -1 -14 -12 3 -8 -20 -9 7 -17 -14 -14 -28 -21 -24 -21 13 -13 1 6 -9 35 10 29 0 -6 16 -15 19 31 7 21 13 -4 2 12 -22 7
7725GjplL0j9j9j6J4Lj6NKlRJ6kj1k0J2J1j7K5jk3L3rml3L1K1j5Pj2K3j7J7l1
$$ 7 6 -1 -4 26 7 -12 -28 -14 -11 -27 -22 -20 -23 -14 2 0 -11 -31 -19 -8 -25 0 -1 -24 9 0 -4 -37 -6 15 0 7 -5 18 1 18 -13
7762a3K0J3j9L7k1j6K0j3oJl3NK3klRj4J7j8K6j4jj3%J8l0NJ2L2j8MPJ2j9rJ7
$$ -13 7 20 1 38 17 1 21 8 2 3 -30 -25 -2 -4 -7 2 -12 5 -13 13 -1 -2 -15 -15 3 -27 -22 -10 22 4 8 15 27 8 -1 16
7798A6k1K3j9K2kl1mK0pK4k7L2l3J9j3J0l7%K4k2J0J3k5j0O1j4l5N0o3L6j9J3
$$ 16 -5 18 -1 21 19 -12 -16 4 -3 21 -6 26 -7 12 -1 9 -28 -28 -4 -26 -16 -3 -28 -38 23 9 -26 24 -39 -3 -22 -9
7830iJJ2rJ4k5K8Rk2J9Mj5k2J8MlKL4l8J1j4j1j4M4l6J0lopK8Lkk8oK3rMk6M8
$$ -9 -8 4 -5 9 -16 12 21 -1 18 22 7 -15 3 7 4 6 40 2 13 -1 -12 -26 18 -18 -8 -11 -17 -24 4 7 5 -23 -29 -6 -15 -11 -37 11
7868A1l4KL1l3J4lJ9J6l5J7j6j6N6l2J4Lk1L0j8J0nJ4l0LJ2J9l2j0NmJ5j2J4k
$$ 11 -23 -21 10 -23 -9 -12 7 23 -12 5 -11 -27 29 -3 11 14 -7 23 5 15 10 24 -6 -3 9 28 -4 -14 -9 -13 2 -10 4 2
7902Bj0MJ1m6K9j7L8k7J5l1MJ7lJ0k3N6l8K5j4nmqL0j4jJ7m9N4k6j%RNj7J4l6
$$ 2 -8 -4 7 -39 -10 -27 11 -16 -1 -32 -28 -11 -14 -4 -27 29 -9 16 2 -3 -7 -15 15 1 0 17 -32 22 -4 -5 -5 4 9 -8 6 -30
7938c0J4Q%J0nK9n9K7nJ8qkqj6J9K5m0K2k3L1rKJ9j8nJ4qLKJ5j8j0J4jKJJ7m3
$$ -30 -16 -8 -8 2 -3 26 -33 -6 -11 7 -1 -3 -11 -27 -8 17 -23 -1 -24 7 -2 0 19 1 -4 10 2 5 7 22 4 -6 8 7 9 10 27 -16
7976a6J5pLK8j8j5M5k7k2QOJ5Jok9jMJ9j4J4j7j3K4j9L1kj1j2J3L9k5qJ5lKj1
$$ -16 -1 -8 -5 23 5 -10 35 8 -14 -6 0 15 16 10 -19 -20 -16 3 -11 3 -14 -27 -3 -22 9 7 -4 -16 -3 36 11 3 18 15 17 6
8012FMk0J5%J2l2L4l5J9N9m3rknJ3m5RL5k4J6Mk0J8Oqk1J3%m1K6J0L1m6kK6K5
$$ 6 10 -10 5 5 17 -15 19 -16 3 62 19 10 8 3 16 -29 -20 15 -9 7 11 -9 9 15 7 -14 -1 -1 -42 -16 -6 25 -21 -23 3 28
8048B8j3oqkJ7Oj5j2nL0j8J1LmlMjjj3J5k2J9k5lJ7J0m5PJ7qK6l9K7m%K3l2J9
$$ 28 15 9 1 -1 16 22 7 -5 -10 20 2 13 16 12 9 13 12 11 -2 13 -9 10 -15 -18 -1 9 -36 -29 -12 -20 6 -33 -6 -10 -10 13 -19 0
8086@qj5MJ5j8J5K9k3J9k0OjPoJ7pJ0j4oJ3j4J2pj9L5k%Pl6%Pj4Rj9L3k3J2J6
$$ 0 -8 -23 -19 -4 -22 -7 22 -1 18 -2 4 3 10 4 21 14 24 10 4 17 3 15 8 -11 24 22 22 29 -7 -7 0 -14 -5 -24 9 -14 -2 14
8124A4qmj6Mj1K1kOJJk9L2J4qLj5OLJ0Ml7J8MK1l7M8l7NmnMMj6K4k1j5L5m3J3
$$ 14 6 2 -14 -10 -21 0 -2 4 5 6 -23 9 23 15 18 3 9 12 22 26 -11 7 11 32 -5 43 6 11 7 2 6 10 -6 18 -3 -18 17 -26 -13
8163a3mJ9pK0j0j4NK4k0Oj0j5L1qK5j3qK7j7j5K1l9K5OLjnQ
$$ -13 -17 2 -5 15 5 -9 -4 20 0 6 -4 -19 12 4 29 16 8 35 18 3 24 -15 10 16 19 18 13 21
8191B1
##END NTUPLES=NMR FID
##END=
