##TITLE=1H_Ser 7-4-i
 CDCl3,8 sc, 
 22.9.2021
##JCAMPDX= 6.0         $$ Bruker NMR JCAMP-DX V2.0
##DATA TYPE= NMR FID
##DATA CLASS= NTUPLES
##ORIGIN= UXNMR, Bruker Analytische Messtechnik GmbH
##OWNER= root
$$ XWIN-NMR		Version 3.5
$$ Wed Sep 22 13:30:43 2021 Russian Standard Time (UT+4h)  she@DPX200
##.OBSERVE FREQUENCY= 200.1314
##.OBSERVE NUCLEUS= ^1H
##.DELAY= (6, 6)
##.ACQUISITION MODE= SIMULTANEOUS
##.ACQUISITION SCHEME= undefined
##.AVERAGES= 8
##.DIGITISER RES= 18
##SPECTROMETER/DATA SYSTEM= spect
##.PULSE SEQUENCE= zg30
##.SOLVENT NAME= CDCl3
##.SHIFT REFERENCE= (INTERNAL, CDCl3, 0, 15.7039)
##AUDIT TRAIL= $$ (NUMBER, WHEN, WHO, WHERE, WHAT)
$$ ##TITLE= Audit trail, XWIN-NMR		Version 3.5
$$ ##JCAMPDX= 5.01
$$ ##ORIGIN= Bruker BioSpin GmbH
$$ ##OWNER= she
$$ F:/spectra/data/she/nmr/H-F/1/audita.txt
$$ ##AUDIT TRAIL=  $$ (NUMBER, WHEN, WHO, WHERE, WHAT)
(   1,<2021-09-22 13:29:19.76 +0400>,<she>,<DPX200>,
      <created by zg, POWCHK disabled, PULCHK disabled
       configuration hash MD5:
       00 E9 B6 7A A2 85 ED C7 34 08 36 98 17 FE 4E 26
       data hash MD5: 16K
       C2 4F B9 98 4F B0 CD C9 DD EE E5 5B 98 E7 72 C3>)
$$ ##END=
$$ 
$$ hash MD5
$$ 5F CB 08 CC FF BD 81 40 B5 09 27 B7 FA 31 9E A3
##$RELAX= 
##$RELAX= 
##$RELAX= 
##$RELAX= 
##$RELAX= 
##$RELAX= 
$$ Bruker specific parameters
$$ --------------------------
##$DU= <F:/spectra>
##$EXPNO= 1
##$NAME= <H-F>
##$PROCNO= 1
##$TYPE= <nmr>
##$USER= <she>
##$AMP= (0..31)
100 100 100 100 100 100 100 100 100 100 100 100 100 100 100 100 100 100 
100 100 100 100 100 100 100 100 100 100 100 100 100 100 
##$AQSEQ= 0
##$AQ_mod= 1
##$AUNM= <au_zg>
##$AUTOPOS= <>
##$BF1= 200.13
##$BF2= 200.13
##$BF3= 200.13
##$BF4= 200.13
##$BF5= 200.13
##$BF6= 200.13
##$BF7= 200.13
##$BF8= 200.13
##$BYTORDA= 1
##$CFDGTYP= 0
##$CFRGTYP= 5
##$CHEMSTR= <none>
##$CNST= (0..31)
1 1 145 1 1 1 1 1 1 1 1 1 1 1 1 1 1 1 1 1 1 1 1 1 1 1 1 1 1 1 1 1 
##$CPDPRG= <>
##$CPDPRG1= <>
##$CPDPRG2= <>
##$CPDPRG3= <>
##$CPDPRG4= <mlev>
##$CPDPRG5= <mlev>
##$CPDPRG6= <mlev>
##$CPDPRG7= <mlev>
##$CPDPRG8= <mlev>
##$CPDPRGB= <>
##$CPDPRGT= <>
##$D= (0..31)
0 1.2 0 0 0 0 0 0 0 0.06 0 0.03 0 0 0 0 0.0002 0 0 0 0 0 0 0 0 0 0 0 0 
0 0 0 
##$DATE= 1632302959
##$DBL= (0..7)
120 120 120 120 120 120 120 120 
##$DBP= (0..7)
150 150 150 150 150 150 150 150 
##$DBP07= 0
##$DBPNAM0= <>
##$DBPNAM1= <>
##$DBPNAM2= <>
##$DBPNAM3= <>
##$DBPNAM4= <>
##$DBPNAM5= <>
##$DBPNAM6= <>
##$DBPNAM7= <>
##$DBPOAL= (0..7)
0.5 0.5 0.5 0.5 0.5 0.5 0.5 0.5 
##$DBPOFFS= (0..7)
0 0 0 0 0 0 0 0 
##$DE= 6
##$DECBNUC= <off>
##$DECIM= 32
##$DECNUC= <off>
##$DECSTAT= 4
##$DIGMOD= 1
##$DIGTYP= 9
##$DL= (0..7)
0 120 120 120 120 120 120 120 
##$DP= (0..7)
150 150 150 150 150 150 150 150 
##$DP07= 0
##$DPNAME0= <>
##$DPNAME1= <>
##$DPNAME2= <>
##$DPNAME3= <>
##$DPNAME4= <>
##$DPNAME5= <>
##$DPNAME6= <>
##$DPNAME7= <>
##$DPOAL= (0..7)
0.5 0.5 0.5 0.5 0.5 0.5 0.5 0.5 
##$DPOFFS= (0..7)
0 0 0 0 0 0 0 0 
##$DQDMODE= 0
##$DR= 18
##$DS= 0
##$DSLIST= <SSSSSSSSSSSSSSS>
$$ [...]
##$SUBNAM2= <"">
##$SUBNAM3= <"">
##$SUBNAM4= <"">
##$SUBNAM5= <"">
##$SUBNAM6= <"">
##$SUBNAM7= <"">
##$SUBNAM8= <"">
##$SUBNAM9= <"">
##$SW= 20.0188988654967
##$SWIBOX= (0..15)
0 0 2 0 0 0 0 0 0 0 0 0 0 0 0 0 
##$SW_h= 4006.41025641026
##$TD= 16384
##$TD0= 1
##$TE= 0
##$TE2= 300
##$TE3= 300
##$TEG= 300
##$TL= (0..7)
0 120 120 120 120 120 120 120 
##$TP= (0..7)
150 150 150 150 150 150 150 150 
##$TP07= 0
##$TPNAME0= <>
##$TPNAME1= <>
##$TPNAME2= <>
##$TPNAME3= <>
##$TPNAME4= <>
##$TPNAME5= <>
##$TPNAME6= <>
##$TPNAME7= <>
##$TPOAL= (0..7)
0.5 0.5 0.5 0.5 0.5 0.5 0.5 0.5 
##$TPOFFS= (0..7)
0 0 0 0 0 0 0 0 
##$TUNHIN= 0
##$TUNHOUT= 0
##$TUNXOUT= 0
##$USERA1= <user>
##$USERA2= <user>
##$USERA3= <user>
##$USERA4= <user>
##$USERA5= <user>
##$V9= 5
##$VALIST= <valist>
##$VCLIST= <CCCCCCCCCCCCCCC>
##$VD= 0
##$VDLIST= <DDDDDDDDDDDDDDD>
##$VPLIST= <PPPPPPPPPPPPPPP>
##$VTLIST= <TTTTTTTTTTTTTTT>
##$WBST= 1024
##$WBSW= 4
##$XGAIN= (0..3)
0 0 0 0 
##$XL= 0
##$YL= 0
##$YMAX_a= 189231
##$YMIN_a= -221171
##$ZGOPTNS= <>
##$ZL1= 120
##$ZL2= 120
##$ZL3= 120
##$ZL4= 120
##$ABSF1= 10
##$ABSF2= 0
##$ABSG= 5
##$ABSL= 3
##$ALPHA= 0
##$AQORDER= 0
##$ASSFAC= 0
##$ASSFACI= 0
##$ASSFACX= 0
##$ASSWID= 0
##$AUNMP= <proc_1d>
##$AZFE= 0.1
##$AZFW= 0.1
##$BCFW= 1
##$BC_mod= 2
##$BYTORDP= 1
##$COROFFS= 0
##$CY= 11.3945322036743
##$DATMOD= 1
##$DC= 2
##$DFILT= <>
##$DTYPP= 0
##$F1P= 2.36226072786647
##$F2P= -0.459571619588291
##$FCOR= 0.5
##$FTSIZE= 0
##$FT_mod= 4
##$GAMMA= 1
##$GB= 0.15
##$INTBC= 1
##$INTSCL= 1
##$ISEN= 128
##$LB= 0.24
##$LEV0= 0
##$LPBIN= 0
##$MAXI= 10000
##$MC2= 0
##$MEAN= 0
##$ME_mod= 0
##$MI= 1.114404
##$NCOEF= 0
##$NC_proc= 0
##$NLEV= 6
##$NOISF1= 3.799351
##$NOISF2= 2.8
##$NSP= 1
##$NTH_PI= 0
##$NZP= 0
##$OFFSET= 15.70392
##$PC= 1
##$PHC0= -14075.91
##$PHC1= 14.00089
##$PH_mod= 1
##$PKNL= yes
##$PPARMOD= 0
##$PSCAL= 0
##$PSIGN= 0
##$REVERSE= no
##$SF= 200.130013532006
##$SI= 16384
##$SIGF1= 3
##$SIGF2= 2
##$SINO= 400
##$SIOLD= 16384
##$SREGLST= <1H.CDCl3>
##$SSB= 0
##$STSI= 0
##$STSR= 0
##$SW_p= 3612.71676300578
##$SYMM= 0
##$S_DEV= 0
##$TDeff= 0
##$TDoff= 0
##$TI= <>
##$TILT= no
##$TM1= 0
##$TM2= 0
##$TOPLEV= 0
##$USERP1= <user>
##$USERP2= <user>
##$USERP3= <user>
##$USERP4= <user>
##$USERP5= <user>
##$WDW= 1
##$XDIM= 8192
##$YMAX_p= 0
##$YMIN_p= 0
$$ End of Bruker specific parameters
$$ ---------------------------------
##NTUPLES= NMR FID
##VAR_NAME=  TIME,          FID/REAL,        FID/IMAG
##SYMBOL=    X,             R,               I
##VAR_TYPE=  INDEPENDENT,   DEPENDENT,       DEPENDENT
##VAR_FORM=  AFFN,          ASDF,            ASDF
##VAR_DIM=   8192,          8192,            8192
##UNITS=     SECONDS,       ARBITRARY UNITS, ARBITRARY UNITS
##FACTOR=    0.0002496,     1,               1
##FIRST=     0,             0,               0
##LAST=      2.0444736,     0,               0
##MIN=       0,             -221171,         0
##MAX=       2.0444736,     189231,          0
$$ Real data points
##PAGE= N=1
##DATA TABLE= (X++(R..R)), XYDATA
$$ [...]
$$ plain form
1940 256 1752 -1092 -721 1858 826 -1111 -173 1789 600 -970 775 2256 -692 -619 2120 957
1956 957 -1263 624 1833 24 -1120 754 1406 -1096 -1329 1425 314 -2153 -406 1142 -1168 -1655
1972 -1655 598 481 -1633 -1494 852 29 -2149 -473 1323 -930 -1812 1310 1114 -1272 -266 1588
1988 1588 609 -1251 527 2046 -328 -1102 1690 1236 -1518 -15 2137 53 -1468 451 1623 -632
2004 -632 -1193 1707 1290 -1659 -372 2285 -199 -1588 970 1324 -1224 -1434 1002 467 -2068 -739
2020 -739 1574 -944 -2557 564 923 -1985 -1079 1088 -157 -1657 -245 1720 -409 -1667 1226 1746
2036 1746 -1437 -245 2433 555 -1245 765 2009 -360 -981 1551 1800 -1235 -434 2244 236 -1558
2052 -1558 950 1991 -723 -1143 1313 1043 -1460 -774 1894 12 -2252 544 1254 -1785 -1366 1150
$$ packed form
1940B56J496k844L71K579j032j937R38J962j189j570J745J481k948P3K739j163
1956I57k220J887J209j809j144J874O52k502k33K754j111k467J747J548k310m87
1972a655K253j17k114J39K346q23k178J676J796k253q82L122j96k386J006J854
1988A588r79j860J778J519k374p74K792m54k754J503K152k084j521J919J172k255
2004f32n61K900m17k949J287K657k484j389K558L54k548k10K436n35k535J329
2020g39K313k518j613L121L59k908R06K167j245j500J412J965k129j258K893N20
2036A746l183J192K678j878j800K010J244k369o21K532K49l035Q01K678k008j794
2052a558K508J041k714m20K456k70k503O86K668j882k264K796P10l039M19K516
$$ plain form
2068 1150 128 -2099 -1030 902 -536 -2270 67 1147 -1998 -1693 1300 -18 -1909 -55 1552
2083 1552 -420 -1388 1050 1800 -1060 -712 2310 877 -1586 785 2485 -119 -736 1804 1608 -869
2099 -869 -453 2099 788 -1602 466 2083 -944 -1283 1565 864 -1448 -452 1336 -270 -1960 113
2115 113 1510 -1248 -1892 1178 426 -2361 -539 1131 -611 -1969 20 898 -1362 -1681 1179 626
2131 626 -2070 -440 1639 -799 -1372 1115 1416 -960 -534 1664 1181 -1242 313 2411 -224 -1124
2147 -1124 1493 1313 -977 -130 1733 471 -1532 126 1667 -618 -1478 1322 1098 -1631 -611 1572
2163 1572 -131 -1530 172 1302 -998 -1489 750 881 -1884 -876 1433 -668 -2009 294 1002 -973
2179 -973 -1261 784 545 -1596 -432 1680 -182 -1531 1017 1352 -875 -372 1565 667 -699 456
$$ packed form
2068A150j022k227J069J932j438j734K337J080l145L05K993j318j891J854J607
2083A552j972r68K438P50k860L48L022j433k463K371J700k604o17K540j96k477
2099h69M16K552j311k390K068J617l027l39K848p01k312R96J788j606j690K073
2115A13J397k758o44L070p52k787J822J670j742j358J989Q78k260l19K860n53
2131F26k696J630K079k438n73K487L01k376M26K198m83k423J555K098k635r00
2147a124K617j80k290Q47J863j262k003J658J541k285q60K800k24k729J020K183
2163A572j703j399J702J130k300m91K239J31k765J008K309k101j341K303P08j975
2179i73k88K045k39k141J164K112j862j349K548L35k227N03J937q98j366J155
$$ plain form
2195 456 1691 -48 -1000 1268 1304 -1145 -347 1471 5 -1275 295 937 -593 -1264 329 824 -1211
2212 -1211 -751 1110 -20 -1586 189 969 -835 -1211 293 545 -980 -946 1014 7 -1521 205
2228 205 1286 -835 -1220 747 531 -737 -241 1342 264 -1128 600 1680 -374 -563 1497 690
2244 690 -1063 553 1680 216 -709 660 1308 -528 -817 1296 278 -1581 6 919 -809 -1237
2260 -1237 427 356 -1133 -1007 591 -275 -1821 -199 1019 -952 -1211 514 -90 -909 -91 805 -158
2277 -158 -1181 -53 858 -522 -726 1028 469 -846 295 918 134 -415 417 1258 114 -239 1075
2294 1075 852 -367 271 1420 343 -544 398 907 -108 -271 582 362 -862 -510 811 -160 -1164
2311 -1164 -15 188 -1003 -699 370 114 -1094 -622 598 -411 -1109 227 616 -1154 -474 774 -106
$$ packed form
2195D56J235j739r52K268L6k449P98J818j466j280J570O42j530o71J593M95k035
2212a211M60J861j130j566J775P80j804l76J504K52j525L4J960j007j528J726
2228B05J081k121l85J967k16j268M96J583j078j392J728J080k054j89K060q07
2244F90j753J616J127j464r25J369O48j836k89K113j018j859J587R13j728m28
2260a237J664p1j489J26J598q66j546J622J218j971k59J725o04q19Q18Q96r63
2277a58j023J128R11j380k04J754n59j315J141O23p84n49Q32Q41j144l53J314
2294A075k23j219O38J149j077q87R42N09j015j63Q53k20j224L52J321r71j004
2311a164J149K03j191L04J069k56j208M72J220j009o98J336L89j770O80J248q80
$$ plain form
2328 -106 -999 -95 695 -172 -620 452 581 -704 -103 1442 108 -514 453 675 44 251 1040 762 -493
2347 -493 85 1033 375 -506 580 569 -428 122 576 20 -493 -57 156 -228 -763 -208 133 -1019 -450 247
2367 247 -343 -727 -391 -65 -163 -383 -309 201 -417 -613 576 379 -420 51 411 -90 -115 292 517 93 -475
2388 -475 617 591 -220 144 740 -26 -153 454 496 -28 -23 498 416 -364 -55 570 -123 -543 565 196 -645
2409 -645 -346 -71 -371 -544 -339 93 -441 -816 122 -2 -560 -181 199 -99 -247 414 246 -94 -307 113
2429 113 305 -219 178 491 1 25 322 12 108 155 151 617 516 109 339 295 -171 228 494 216 174 -35
2451 -35 243 231 -2 151 206 -520 -423 51 -332 -545 -341 -371 -395 -568 -451 -282 -488 -437 3 -152 -609 -24
2473 -24 9 -196 174 109 268 -14 -3 377 470 32 368 439 -10 46 509 294 181 277 260 183 -85 186 471
$$ packed form
2328a06q93R04P90q67m48J072J29j285O01J545j334o22R67K22o31K07P89k78j255
2347d93N78R48o58q81J086j1r97N50M54n56n13M36K13l84n35N55L41j152N69O97
2367B47n90l84L36L26r8k20P4N10o18j96J189j97p99M71L60n01k5M07K25m24n68
2388d75J092k6q11L64N96p66j27O07M2n24NN21q2p80L09O25o93m20J108l69q41
2409f45K99K75l00j73K05M32n34l75R38j24n58L79L80k98j48O61j68l40k13M20
2429A13J92n24L97L13m90K4K97l10R6M7mM66j01m07K30m4m66L99K66k78m2k09
2451c5K78j2k33J53N5p26R7M74l83k13K04l0k4j73J17J69k06N1M40j55m57N85
2473b4L3k05L70o5J59k82J1L80R3m38L36P1m49N6M63k15j13R6j7p7k68K71K85
$$ plain form
2496 471 47 -130 429 216 -198 140 268 103 120 -219 62 0 -496 -137 1 -496 -369 -346 -301 -461 -317
2517 -317 -209 -136 -698 -411 227 -406 -435 271 -115 -475 128 211 170 152 383 440 -143 -184 683 313 -294 268
2539 268 596 -6 28 254 358 35 -43 521 367 -286 142 831 -54 -321 318 334 -135 -181 104 227 -365
2560 -365 -207 80 -450 -755 216 -72 -756 -242 97 -309 -392 -405 108 -45 -474 245 290 -326 168 650 2
2581 2 -290 363 317 93 -119 377 451 -356 -112 692 302 -270 440 558 -211 -198 497 300 -178 -110 379 187
2603 187 -615 277 574 -449 -230 344 6 -422 -188 118 -132 -726 -36 323 -585 -612 481 52 -535 111
2623 111 406 -196 -415 211 411 -247 -191 513 318 -394 364 706 -35 47 474 528 55 -209 469 409 -436
2644 -436 201 846 -233 -504 426 112 -525 -213 431 -36 -638 79 448 -219 -665 354 212 -863 -168
$$ packed form
2496D71m24j77N59k13m14L38J28j65J7l39K81o2m96L59J38m97J27K3M5j60J44
2517c17J08P3n62K87O38o33k9P06l86l60O03Q3m1j8K31N7n83m1Q67l70o07N62
2539B68L28o02L4K26J04l23p8N64j54o53M28O89q85k67O39J6m69m6K85J23n92
2560c65J58K87n30l05R71k88o84N14L39m06q3j3N13j53m29P19M5o16M94M82o48
2581Bk92O53m6k24k12M96P4q07K44Q04l90n72P10J18p69J3O95j97m78O8M89j92
2603A87q02Q92K97j023K19N74l38m28K34L06k50n94O90L59r08k7J093m29n87O46
2623A11K95o02k19O26K00o58N6P04j95p12P58L42p41Q2M27N4m73k64O78o0q45
2644d36O37O45j079k71R30l14o37L12O44m67o02P17L69o67m46J019j42j075O95
$$ plain form
2663 -168 355 -497 -640 -188 306 -383 -659 300 199 -852 -277 632 -129 -429 446 578 -81 22 655 630
2683 630 -249 78 1056 372 -179 629 647 -189 23 628 268 -306 103 692 -214 -688 223 338 -603 -132
2703 -132 508 -122 -682 -23 329 -256 -750 21 134 -739 -412 448 -278 -908 45 335 -526 -617 138 301
2723 301 -627 -247 587 80 -680 189 608 -251 -166 631 352 -355 245 805 279 -421 520 865 -170 -306
2743 -306 910 424 -363 78 506 -27 -482 -10 514 -567 -628 669 -54 -878 -86 384 -463 -588 220
2762 220 361 -572 -360 342 6 -866 -118 493 -403 -742 606 268 -646 -182 379 84 -624 253 729 -77
2782 -77 -244 715 455 -302 184 704 141 -252 312 636 -85 -362 571 391 -702 -42 476 -296 -635 178
2802 178 108 -485 -618 255 289 -599 -197 491 -279 -646 388 419 -321 -430 231 177 -303 -203 509 -130 -693
$$ packed form
2663a68N23q52j43M52M94o89k76R59j01j051N75R09p61l00Q75J32o59J03O33k5
2683F30q79L27R78o84n51Q08J8q36K12O05l60n74M09N89r06m74R11J15r41M71
2703a32O40o30n60O59L52n85m94P71J13q73L27Q60p26o30R53K90q61r1P55J63
2723C01r28L80Q34n07p60Q69M19q59Q5P97k79p07O00N60n26p00R41L45j035j36
2743c06J216m86p87M41M28n33m55M72N24j081o1J297p23q24P92M70q47j25Q08
2762B20J41r33K12P02l36q72P48O11q96l39J348l38r14M64N61k95p08Q77M76q06
2782g7j67R59k60p57M86N20n63l93N64L24p21k77R33j80j093O60N18p72l39Q13
2802A78p0n93j33Q73L4q88M02O88p70l67J034L1p40j09O61n4m80J00P12o39n63
$$ plain form
2823 -693 231 560 -493 -153 750 105 -419 26 731 70 -471 466 770 -272 22 925 159 -408 404
2842 404 474 -258 -396 312 418 -499 -414 480 -126 -901 60 250 -660 -484 29 -3 -658 -210 487 -284 -740
2863 -740 119 328 -610 -329 481 27 -367 140 511 -35 -401 276 615 -248 -196 598 8 -528 407 449 118
2884 118 -212 456 588 257 2 646 353 -385 249 291 -303 -220 66 34 -251 -245 236 13 -441 -209 302 -288
2906 -288 -566 51 24 -583 -102 174 -33 -598 -243 472 -216 -641 382 147 -662 38 582 -131 -515 108
2926 108 331 -289 -224 389 281 -368 2 686 68 -357 432 361 -205 319 575 134 -352 125 711 -82 -386
2947 -386 416 28 -498 -46 338 -124 -242 -82 -34 -166 -402 -89 103 -490 -94 180 -113 -171 -62 189 -7
2968 -7 -161 56 338 -214 -120 459 191 -394 -116 270 -157 -92 207 150 -223 -123 611 328 -253 226 295 -277
$$ packed form
2823f93R24L29j053L40R03o45n24M45P05o61n41R37L04j042K94R03p66n67Q12
2842D04P0p32j38P08J06r17Q5Q94o06p75R61J90r10J76N13l2o55M48O97p71m56
2863g40Q59K09r38K81Q10m54l94N07L71n46l66O77L39q63N2P94n90n36R35M2l31
2884A18l30O68J32l31k55O44k93p38O34M2n94Q3K86l2k85OM81k23m54K32N11n90
2906b88k78O17k7o07M81K76k07n65L55P15o88m25J023k35q09P00N44p13l84O23
2926A08K23o20O5O13j08o49L70O84o18m25P89p1n66N24K56m41m86M77N86p93l04
2947c86Q02l88n26M52L84m62j18J60M8j32k36L13J92n93L96K74k93n8J09K51j96
2968gj54K17K82n52R4N79k68n85K78L86m27O5K99n7l73J00P34k83n81M79O9n72
$$ plain form
2990 -277 -59 248 319 -75 -92 369 -18 -394 208 264 -437 -179 414 98 -450 -80 -13 -170 -415 131 224 -327
3012 -327 -398 185 98 -301 -3 219 -303 -218 197 297 -139 -22 167 110 -196 160 283 -123 -199 310 235 -173
3034 -173 -90 278 84 -176 -21 266 172 -235 67 24 -324 -70 241 -121 -42 -65 142 -150 -527 27 161 -396
3056 -396 -200 -79 -216 -235 -101 -67 -90 -341 113 145 -309 -84 409 46 -74 141 312 75 160 252 263 38
3078 38 -86 268 215 -174 226 173 19 68 228 -4 -5 292 142 151 -218 3 269 -284 -38 95 -22 -85 1
3101 1 -31 -96 -208 -218 228 -257 -422 -130 -107 -491 -199 146 -103 -218 -208 -40 -83 1 88 262 -84 -23 318 26
3125 26 -107 289 319 82 133 77 347 12 39 349 189 -119 160 259 47 33 15 107 -6 -10 2 286 56 -136
3149 -136 32 -165 -157 -42 -50 -334 -158 -38 -113 -274 -214 -34 -519 -184 60 49 -97 44 35 -69 -45 -25 86 96
$$ packed form
2990b77K18L07P1l94j7M61l87l76O02N6p01K58N93l16n48L70O7j57k45N46R3n51
3012c27p1N83q7l99K98K22n22Q5M15J00m36J17J89n7l06L56J23m06p6N09p5m08
3034a73Q3L68j94k60J55K87r4m07L02m3l48K54L11l62P9k3K07k92l77N54J34n57
3056c96J96J21j37j9J34L4k3k51M54L2m54K25M93l63j20K15J71k37Q5R2J1k25
3078C8j24L54n3l89M00n3j54M9J60k32jK97j50Rl69K21K66n53K46J33j17o3Q6
3101Al2o5j12j0M46m85j65K92K3l84K92L45k49j15J0J68m3Q4Q7J74l46O1L41k92
3125B6j33L96L0k37N1n6K70l35K7L10j60l08K79R9k12j4j8R2j13mJ2K84k30j92
3149a36J68j97QJ15qk84J76J20p5j61O0J80m85L35K44j1j46J41rj04K4K0J11J0
$$ plain form
3173 96 -202 166 272 13 127 360 111 13 118 253 -22 -12 161 74 -124 -151 92 -83 -106 60 -29 43 -76
3196 -76 -78 56 -119 -111 28 -75 -255 -13 42 -139 -218 21 -57 -142 -242 -19 94 -164 -67 241 -154 -229 133 95
3220 95 -52 138 312 44 88 165 213 139 -41 291 218 23 163 178 -38 -119 -156 99 32 -295 113 62 -285 -34
3244 -34 -84 -144 -285 -105 168 -152 -238 -61 205 -190 -365 360 -175 -349 185 -64 -141 -137 9 -44 -69 -100 232
3267 232 3 -169 260 372 -85 -87 349 192 -4 142 531 222 -136 175 394 -106 -117 513 46 -315 -42
3288 -42 59 -140 -294 -106 183 -361 -449 209 -98 -408 14 39 -272 -221 -222 138 -229 -252 69 46 -351 -90 345
3311 345 -150 -182 302 8 -192 62 167 -66 -98 30 308 -7 -137 337 261 -254 79 412 340 118 74 425
3333 425 113 -156 325 209 -215 -33 306 -114 -311 45 165 -248 -344 158 64 -441 -371 131 83 -425 120
$$ packed form
3173I6k98L68J06k59J14K33k49r8J05J35k75J0J73q7j98k7K43j75k3J66q9P2j19
3196g6kJ34j75QJ39j03j80K42N5j81p9K39p8q5j00K23J13k58R7L08l95p5L62l8
3220I5j47J90J74k68M4P7M8p4j80L32p3j95J40J5k16q1l7K55o7l27M08n1l47K51
3244c4n0o0j41J80K73l20q6J77K66l95j75P25n35j74N34k49p7MJ46n3k5l1L32
3267B32k29j72M29J12m57kM36j57j96J46L89l09l58L11K19n00j1O30m67l61K73
3288d2J01j99j54J88K89n44q8O58l07l10M22K5l11N1jL60l67k3L21k3l97K61M35
3311C45m95l2M84k94k00K54J05k33l2J28K78l15j30M74p6n15L33L33p2k22m4L51
3333D25l12k69M81j16m24J82L39m20j97L56J20m13r6N02r4n05P0N02m8n08N45
$$ plain form
3354 120 81 -398 -35 310 266 -370 -16 196 -43 -406 178 347 -350 -63 323 62 -263 60 316 12 -250
3375 -250 428 396 -339 -173 447 61 -135 156 255 -146 18 367 304 -208 -103 267 -30 -296 255 89 -241
3396 -241 -252 19 -86 -235 -172 103 -19 -273 -113 32 -246 -225 80 -142 -323 -29 106 -81 -101 57 420
3417 420 -197 -180 221 210 -228 -24 256 -33 -274 264 284 89 -130 474 159 -216 134 283 -74 -305 411
3438 411 195 -50 -229 203 -29 -537 -171 312 -281 -603 10 34 -501 -133 109 -158 -465 -9 177 -199
3458 -199 -386 124 158 -256 181 364 -56 -53 143 33 -26 -112 238 148 -102 44 306 -122 -123 502 281 -187 -54
3481 -54 189 286 -158 36 313 -76 -373 245 104 -57 -119 34 -37 -269 -70 59 -143 -474 12 205 -376
3502 -376 -263 358 -125 -309 -60 100 -180 -207 200 374 -215 -191 311 63 -257 218 392 -13 41 119 198 -74
$$ packed form
3354A20l9m79L63L45m4o36L54K12k39l63N84J69o97K87L86k61l25L23K56l04k62
3375b50O78l2p35J66O20l86j96K91R9m01J64L49o3n12J05L70k97k66N51j66l30
3396b41j1K71j05j49O3K75j22k54J60J45k78K1L05k22j81K94J35j87k0J58L63
3417D20o17J7M01j1m38K04K80k89k41N38K0j95k19O04l15l75L50J49l57k31P16
3438D11k16k45j79M32k32n08L66M83n93l22O13K4n35L68K42k67l07M56J86l76
3458a99j87N10L4m14M37J83m20LJ96j10n9q6L50r0k50J46K62m28jO25k21m68J33
3481e4K43R7m44J94K77l89k97O18j41j61o2J53p1k32J99J29k02l31M86J93n81
3502c76J13O21m83j84K49J60k80k7M07J74n89K4N02k48l20M75J74m05N4P8P9k72
$$ plain form
3524 -74 55 493 264 -173 266 568 32 25 335 239 -108 -40 264 0 -267 202 310 -181 -219 32 -229 -390
3546 -390 -11 42 -354 -399 -128 -13 -95 -233 74 -51 -415 -125 102 -173 -206 -155 208 -144 -150 130 316 -108
3568 -108 -19 341 -110 -392 332 78 -34 -45 133 37 -129 69 504 259 -308 239 303 -307 9 110 53 -187
3590 -187 80 199 -10 -438 277 -40 -453 -264 230 -166 -371 22 21 -259 -313 43 299 -404 -153 271 -52
3611 -52 -345 262 73 -41 -33 259 -149 -228 174 398 -107 185 634 -95 218 -213 319 -30 -15 45 -7 -31 -145
3634 -145 55 214 -144 -163 212 -48 -385 214 -14 -79 -200 -212 152 -45 -284 -10 198 -268 14 205 -240
3655 -240 -13 67 23 -119 -195 237 39 -206 189 347 -11 -127 419 149 -87 -14 266 106 -10 1 63 10
3677 10 -131 89 141 -306 -234 192 25 27 -68 62 -185 -202 75 -57 -253 -98 132 -171 -272 6 -124 -273
$$ packed form
3524g4J29M38k29m37M39L02n36pL10r6l47O8L04k64k67M69J08m91l8K51k61j61
3546c90L79N3l96m5K71J15q2j38L07j25l64K90K27k75l3N1L63l52oK80J86m24
3568a08Q9L60m51k82P24k54j12j1J78r6j66J98M35k45n67N47O4o10L16J01n7k40
3590a87K67J19k09m28P15l17m13J89M94l96k05L93jk80n4L56K56p03K51M24l23
3611e2k93O07j89j14QK92m08p9M02K24n05K92M49p29L13m31N32l49J5O0n2k4j14
3634a45K00J59l58j9L75k60l37N99k28o5j21j2L64j97k39K74K08m66K82J91m45
3655b40K27Q0m4j42p6M32j98k45L95J58l58j16N46k70k36P3K80j60j16J1O2n3
3677A0j41K20N2m47P2M26j67Kr5J30k47j7K77j32j96J55K30l03j01K78j30j49
$$ plain form
3699 -273 -202 98 311 -147 -89 41 -96 -310 24 73 -142 -178 124 40 118 119 260 86 -136 206 311 -14 -78
3722 -78 311 44 19 23 93 -13 -40 -134 159 45 -212 4 -62 -315 -85 128 -15 -145 55 -54 -252 -322 66
3745 66 103 -285 47 84 -350 1 -102 -41 -84 -280 -104 29 -195 -153 185 0 -29 116 83 91 194 258 213 138
3769 138 41 432 158 87 316 207 -87 199 57 83 55 105 216 11 -149 256 68 -33 79 123 -63 68
3791 68 -125 -250 -137 -224 -28 -83 -183 -133 72 -79 -320 96 -26 -84 5 177 -34 -26 -25 143 55 -337 16 181
3815 181 -64 -59 164 66 -63 106 175 92 20 63 293 -55 -93 61 165 -95 -98 79 91 -89 102 29 -60 17 182
3840 182 -5 -143 -145 8 -139 72 128 -54 169 -86 7 -84 -208 -36 207 -252 -18 209 117 -84 123 99
3862 99 147 148 195 101 34 -52 280 -17 150 63 99 2 -84 -59 116 130 -100 239 245 -186 -197 114 61 -342 -135 -123
$$ packed form
3699b73P1L00K13m58N8J30j37k14L34M9k15l6L02q4P8JJ41j74k22L42J05l25o4
3722g8L89k67k5MP0j06k7r4K93j14k57K16o6k53K30K13j43j30K00j09j98p0L88
3745F6L7l88L32L7m34L51j03O1m3j96J76J33k24M2L38j85k9J45l3QJ03O4m5p5
3769A38r7L91k74p1K29j09k94K86j42K6k8N0J11k05j60M05j88j01J12M4j86J31
3791F8j93j25J13q7J96n5j00N0K05j51k41M16j22n8Q9J72k11QJJ68q8l92L53J65
3815A81k45NK23r8j29J69O9q3p2M3K30l48l8J54J04k60lJ77J2j80J91p3q9P7J65
3840A82j87j38kJ53j47K11N6j82K23k55R3r1j24J72K43m59K34K27r2k01K07k4
3862I9M8JM7r4o7q6L32k97J67q7L6r7q6K5J75J4k30L39Om31j1L11n3m03K07J2
$$ plain form
3888 -123 -134 -69 -32 102 -76 -420 133 -116 -321 -79 -142 -114 55 0 143 -61 -170 50 3 -270 49 263
3910 263 -53 48 170 176 -82 9 94 188 37 294 297 88 -1 319 182 124 77 92 64 74 -105 158 -51 -208
3934 -208 2 -206 -325 -62 -119 -144 -84 -96 -45 -220 -138 -114 13 -104 -164 67 -63 -296 -42 179 31 32 -110
3957 -110 125 128 -42 210 152 -153 -12 303 5 83 107 30 40 -4 248 267 -184 108 316 -194 -9 149 68
3980 68 17 135 234 21 -137 25 115 -132 -173 52 -169 -306 52 10 -22 -167 -97 67 54 -119 188 -22 -21 -129
4004 -129 158 -227 -56 31 -65 -53 -160 119 -86 -229 -26 283 80 -155 125 166 96 11 202 128 -112 -216
4026 -216 312 -30 -362 257 212 -135 -59 162 -60 -110 108 101 -355 -247 146 200 -382 -56 252 -69 -247 -136
4048 -136 218 -108 -63 232 281 -168 -76 226 7 -76 96 282 -78 -4 324 117 -56 -42 208 28 -106 -22
$$ packed form
3888a23j1O5L7J34j78l44N53k49k05K42o3K8J69n5J43k04j09K20m7k73L19K14
3910B63l16J01J22Ok58R1Q5R4j51K57Lk09q9L20j37n8m7J5k8J0j79K63k09j57
3934b08K10k08j19K63n7k5O0j2N1j75Q2K4J27j17o0K31j30k33K54K21j48Jj42
3957a10K35Lj70K52n8l05J41L15k98P8K4p7J0m4K52J9m51K92K08n10J85J58q1
3980F8n1J18R9k13j58J62R0k47m1K25k21j37L58m2l2j45P0J64j3j73L07k10Jj08
4004a29K87l85J71Q7r6J2j07K79k05j43K03L09k03k35K80M1p0q5J91p4k40j04
4026b16N28l42l32O19m5l47P6K21k22n0K18pm56J08L93N4n82L26L08l21j78J11
4048a36L54l26M5K95M9m49R2L02k19q3J72J86l60P4L28k07j73J4K50j80j34Q4
$$ plain form
4070 -22 74 -83 -186 243 160 -41 70 153 1 -134 24 58 -265 -128 78 -2 -62 -182 -15 -184 -252 128 39
4093 39 -49 -258 -2 61 -309 2 96 -24 -186 307 53 -52 -86 163 219 -50 58 336 6 -146 164 486
4115 486 -57 -84 261 187 -53 145 270 -137 -284 344 163 -257 201 338 -178 -100 -5 178 -114 -95 165 -127
4137 -127 -302 3 156 -196 -269 267 106 -244 -206 -125 128 -192 -90 200 -57 -157 125 103 -218 147 286
4158 286 -26 160 172 144 179 -158 150 103 -141 -111 303 83 -155 -92 279 85 -196 76 194 -65 -206 153
4180 153 142 -342 134 24 -216 -95 41 132 -110 -197 135 -21 -451 95 95 -78 -211 -12 23 -193 -34 234
4202 234 106 -281 82 299 42 -148 218 44 -54 246 266 -5 -58 49 89 44 -35 187 226 -226 212 250 14
4225 14 -302 235 -77 57 17 -56 153 -255 -182 16 -94 -172 137 -44 -192 -108 -118 -23 -174 -27 -33 -68 -45 140
$$ packed form
4070b2R6j57j03M29q3k01J11Q3j52j35J58L4l23J37K06q0o0j20J67j69o8L80q9
4093C9q8k09K56O3l70L11R4j20j62M93k54j05l4K49N6k69J08K78l30j52L10L22
4115D86n43k7L45p4k40J98J25m07j47O28j81m20M58J37n16P8R5J83k92J9K60k92
4137a27j75L05J53l52p3N36j61l50L8Q1K53l20J02K90k57j00K82k2l21L65J39
4158B86l12J86J2k8L5l37L08m7k44L0M14k20k38O3L71j94k81K72J18k59j41L59
4180A53j1m84M76j10k40J21J36R1k42q7L32j56m30N46%j73j33J99L5k16J59K68
4202B34j28l87L63K17k57j90L66j74r8L00K0k71n3J07M0m5p9K22L9m52M38L8k36
4225A4l16N37l12J34m0p3K09m08P3J98j10p8L09j81j48Q4j0R5j51J47ol5K3J85
$$ plain form
4249 140 -60 -155 241 241 -14 -70 48 14 59 19 248 202 61 0 263 17 -140 197 152 -78 -58 224 127 -6
4273 -6 123 185 -119 -331 164 -47 -156 13 153 -58 -203 -94 61 -23 -480 85 -45 -145 -385 126 -12
4294 -12 -138 -118 -14 40 -263 71 227 -14 -86 219 -39 -149 90 226 -89 55 264 406 -67 -11 290 119
4316 119 -122 214 224 35 31 111 95 -109 -156 -3 119 -182 91 140 -9 -171 71 95 -98 -86 -29 -164 -368
4339 -368 -4 -58 -152 -203 61 50 -180 -119 36 -102 -196 -102 60 -149 20 200 280 -184 56 198 47 5 293
4362 293 197 104 134 144 200 -63 16 450 171 -151 175 59 -87 -118 -22 -15 -18 -225 -6 -30 -75 24 26 -279 -70 117
4388 117 -45 -190 -213 37 71 -234 -70 101 -180 -160 285 -56 -106 51 189 -199 -106 149 228 119 -35 331
4410 331 163 -223 161 147 48 -4 146 234 6 30 198 158 -82 68 124 -222 -117 48 -104 -78 -119 -42 -169
$$ packed form
4249A40k00r5L96%k55n6J18l4M5m0K29m6j41o1K63k46j57L37m5k30K0K82r7j33
4273fJ29O2l04k12M95k11j09J69J40k11j45J09J55q4m57N65j30j00k40N11j38
4294a2j26K0J04N4l03L34J56k41p2L05k58j10K39J36l15J44K09J42m73N6L01j71
4316A19k41L36J0j89mQ0j6k04m7J53J22l01K73M9j49j62K42K4j93J2N7j35k04
4339c68L64n4r4n1K64j1k30O1J55j38r4R4J62k09J69J80Q0m64K40J42j51m2K88
4362B93r6r3L0J0N6k63P9M34k79l22L26j16j46l1R6Plk07K19k4m5R9Kl05K09J87
4388A17j62j45k3K50L4l05J64J71k81K0M45l41n0J57J38l88R3K55P9j09j54L66
4410C31j68l86L84j4r9n2J50Q8k28K4J68m0k40J50N6l46J05J65j52K6m1P7j27
$$ plain form
4433 -169 -260 -17 42 -109 -117 -102 -89 -77 57 42 -78 -80 48 115 -109 -147 220 218 -129 31 185 -231 -115 216 122
4458 122 61 -18 -29 144 27 178 214 239 20 101 116 136 -36 140 69 -100 -120 90 -105 -302 -249 87 -224 -153
4482 -153 41 -69 -194 -19 -82 -17 -146 -22 93 -187 -31 201 -30 -91 65 -22 60 -18 176 180 131 -80 209
4505 209 -42 -50 125 146 181 55 77 244 27 127 189 266 103 225 189 -72 -167 49 -188 -209 -122 -16 97 -146
4529 -146 -20 -4 -223 -316 7 -143 -225 -272 -63 -102 -77 -282 -101 50 -145 -116 -10 -123 -72 92 166 29 -92
4552 -92 104 96 62 131 111 -204 -18 162 182 -50 315 147 -73 77 110 44 23 10 29 21 -307 61 203 -66 -87
4577 -87 39 -84 -62 -110 -2 0 -78 -67 -127 -150 -167 29 -137 -267 -52 -167 -53 -187 100 -9 -53 -54 132 57 -30
4602 -30 109 -30 -21 31 141 75 172 -39 -82 111 -57 -86 122 14 42 225 140 78 -12 99 41 -172 -246 20 -49
$$ packed form
4433a69r1K43N9j51qJ5J3J2J34j5j20kJ28O7k24l8L67kl47J60J54m16J16L31r4
4458A22o1p9j1J73j17J51L6K5k19Q1J5K0j72J76p1j69k0K10j95j97N3L36l11P1
4482a53J94j10j25J75o3O5j29J24J15k80J56K32k31o1J56q7Q2p8J94Mm9k11K89
4505B09k51qJ75K1L5j26K2J67k17J00O2P7j63J22l6k61r5K16k37k1Q7J06J13k43
4529a46J26J6k19r3L23j50q2m7K09l9K5k05J81J51j95K9J06j13N1J64P4j37j21
4552i2J96ql4O9k0l15J86J80K0k32L65j68k20J50L3o6k1j3J9ql28L68J42k69k1
4577h7J26j23K2m8J08Kp8J1o0k3j7J96j66j30K15j15J14j34K87j09m4jJ86p5q7
4602c0J39j39RN2J10o6R7k11m3J93j68k9K08j08K8J83q5o2r0J11n8k13p4K66o9
$$ plain form
4627 -49 -131 26 33 -395 -95 -130 -285 -280 -31 73 -94 -246 6 106 -444 -95 145 -47 -179 36 138 -55
4649 -55 -155 139 367 -77 -53 224 81 -58 79 104 113 87 -100 86 44 57 96 53 -143 138 156 25 -148 111
4673 111 -215 -126 -85 -44 -28 -180 -108 121 -250 -318 -41 -75 -206 -82 -73 -182 -172 -197 34 48 -80 -16 321 -141
4697 -141 -78 125 141 -10 105 242 47 -127 131 372 -72 39 312 -10 34 154 49 138 -160 -61 226 -138
4719 -138 -84 308 -62 -220 93 195 -180 -3 15 170 -184 -110 -49 -170 -256 48 -101 -161 -268 -9 -118 -389
4741 -389 -32 14 -36 -81 4 -21 35 70 202 159 -46 329 295 128 23 -55 195 -41 16 269 -14 -24 -45 244
4765 244 116 104 -59 272 -64 -1 101 192 -83 53 108 -133 -130 31 62 -217 -171 4 268 -256 -32 19 -94
4788 -94 -443 153 -55 -210 195 -8 -96 94 -171 59 -43 16 159 122 -216 114 217 -36 -150 263 293 88
$$ packed form
4627d9q2J57Pm28L00l5j55NK49J04j67j52K52J00n50L49K40j92j32K15J02j93
4649e5j00K94K28m44K4K77j43j39J37K5Rk6j87J86m2J3L9m3j96K81J8j31j73K59
4673A11l26Q9M1M1J6j52P2K29l71o8K77l4j31J24Rj09J0k5K31J4j28O4L37m62
4697a41O3K03J6j51J15J37j95j74K58K41m44J11K73l22M4J20j05Q9k98R9K87l64
4719a38N4L92l70j58L13J02l75J77J8J55l54P4O1j21q6L04j49o0j07K59j09k71
4741c89L57M6n0m5Q5k5N6L5J32m3k05L75l4j67j05p8K50k36N7K53k83j0k1K89
4765B44j28j2j63L31l36O3J02R1k75J36N5k41LJ61L1k79M6J75K64n24K24N1j13
4788i4l49N96k08j55M05k03q8J90k65K30j02N9J43l7l38L30J03k53j14M13L0k05
$$ plain form
4810 88 147 120 62 -133 -16 267 -102 -116 151 31 -212 -109 162 -16 -36 -105 103 69 -193 89 60 -305 -107
4833 -107 -46 -59 -193 72 53 -43 -270 -63 72 -176 -113 489 74 -1 113 210 -42 136 77 164 59 86 261
4856 261 116 -174 151 255 -9 -229 160 26 -98 -37 182 74 -206 68 89 -241 -13 105 -226 -219 -86
4877 -86 -33 -137 -97 -126 209 -86 -277 15 -24 -82 -38 177 -4 29 -187 -31 25 -15 237 84 -60 4 201 71
4901 71 -15 40 173 71 51 123 179 69 147 197 -42 -3 194 146 -158 42 43 -92 -117 -83 47 -104 -345 43 -89
4926 -89 -268 -162 47 -138 -312 -89 -65 -25 -205 56 115 -286 -157 152 -43 -97 1 -72 -165 -117 182 194 74
4949 74 -103 273 -33 -164 216 251 -84 199 366 15 -59 311 188 332 -120 131 182 -134 -73 177 -48 -119
4971 -119 64 -277 -88 -129 -113 70 -278 -164 -130 -154 -209 -167 94 -103 -247 -108 37 -93 -130 128 -64 -281
$$ packed form
4810H8N9k7n8j95J17K83l69j4K67j20k43J03K71j78k0o9K08l4k62K82k9l65J98
4833a07O1j3j34K65j9r6k27K07J35k48O3O02m15p5J14R7k52J78n9Q7j05K7J75
4856B61j45k90L25J04k64k20L89j34j24O1K19j08k80K74K1l30K28J18l31PJ33
4877h6N3j04M0k9L35k95j91K92l9n8M4K15j81L3k16J56N6m0K52j53j44O4J97j30
4901G1q6N5J33j02k0P2N6j10P8N0k39L9J97m8l04K00Jj35k5L4J30j51k41L88j32
4926h9j79J06K09j85j74K23K4M0j80K61N9m01J29L09j95n4R8p3r3M8K99J2j20
4949G4j77L76l06j31L80L5l35K83J67l51p4L70j23J44m52K51N1l16O1K50k25p1
4971a19J83l41J89m1J6J83l48J14L4k4n5M2K61j97j44J39J45j30l7K58j92k17
$$ plain form
4993 -281 42 30 -73 -107 -8 106 -53 164 74 -22 -4 94 223 62 21 222 164 -58 122 98 161 -113 95 121
5017 121 -59 -94 -120 -62 -177 -213 232 -106 -212 18 -32 -35 -225 9 106 -127 -92 110 -205 -65 68 90 -115
5040 -115 71 186 -138 -247 -33 -34 62 -91 217 118 74 89 210 80 13 -156 126 9 30 159 168 -117 -108 272
5064 272 -78 -104 -5 62 8 -167 -242 25 -217 -157 92 -88 -293 -21 -20 -267 -2 -173 -159 -232 -229 49 -25 -20 54
5089 54 133 -90 -139 142 27 84 24 -35 83 -61 64 200 33 81 84 -63 138 332 87 261 82 11 182
5112 182 139 -6 218 25 -201 87 114 -140 -149 -29 -9 -105 -96 -104 33 -292 -146 -28 -228 -170 -64 -13 -137 -17
5136 -17 -88 80 61 -129 84 -59 -139 186 180 161 49 146 98 -2 -31 208 62 -284 84 222 29 -29 208 1
5160 1 -71 4 159 119 58 -131 156 -28 -90 91 138 -141 -98 53 -351 -75 -114 6 -147 -240 -31 -13 -186 12
$$ packed form
4993b81L23j2j03l4R9J14j59K17r0r6J8R8J29j61m1K01n8k22J80k4O3k74K08K6
5017A21j80l5k6N8j15l6M45l38j06K30n0lj90K34R7k33L5K02l15J40J33K2k05
5040a15J86J15l24j09K14jR6j53L08r9m4J5J21j30o7j69K82j17K1J29Rk85RL80
5064B72l50k6R9O7n4j75p5K67k42O0K49j80k05K72Jk47K65j71J4p3LK78p4NP4
5089E4P9k23m9K81j15N7o0n9J18j44J25J36j67M8Lj47K01J94k45J74j79p1J71
5112A82m3j45K24j93k26K88K7k54rJ20K0r6RqJ37l25J46J18k00N8J06N1j24J20
5136a7p1J68j9j90K13j43q0L25oj9j12R7m8j00k9K39j46l46L68J38j93n8K37k07
5160Ap2P5J55m0o1j89K87j84o2J81M7k79M3J51m04K76l9J20j53r3K09J8j73J98
$$ plain form
5184 12 -28 -222 -46 -4 -189 -146 19 -111 93 -68 -3 170 -83 192 388 97 8 229 166 25 -160 51
5206 51 149 90 39 72 120 -107 99 -12 -156 -64 88 64 108 -181 0 73 -25 -129 175 60 -124 40 10 -169
5230 -169 -46 -84 -118 -233 1 -19 24 -219 12 314 -39 9 137 58 155 -25 151 -7 -104 96 55 -98 21
5253 21 266 -23 83 88 -48 35 86 -51 33 -196 -11 144 91 -223 34 -104 -215 -216 -12 -160 -201 -69 72
5276 72 160 -190 -13 -111 -96 -168 23 -115 -187 -211 -64 -87 -21 -130 155 61 -92 139 73 -60 6 203 285 -135
5300 -135 90 89 129 36 203 -21 31 -117 34 92 19 -140 13 -1 -84 -34 93 -120 -81 134 -25 -125 101 51
5324 51 -13 -132 -282 -114 -110 -92 -5 -126 -298 7 57 -83 57 50 25 -12 125 148 243 -80 97 97 81 -55 107
5349 107 138 118 17 188 247 9 270 146 153 3 138 66 -141 -44 137 -247 37 -61 32 -175 -200 3 -212
$$ packed form
5184A2m0j94J76M2j85M3J65j30K04j61O5J73k53K75J96k91q9K21o3j41j85K11
5206E1R8n9n1L3M8k27K06j11j44R2J52k4M4k89J81P3r8j04L04j15j84J64l0j79
5230a69J23l8l4j15K34k0M3k43K31L02l53M8J28p9R7j80J76j58r7K00m1j53J19
5253B1K45k89J06Nj36Q3N1j37Q4k29J85J55n3l14K57j38j11jK04j48m1J32J41
5276G2Q8l50J77r8J5p2J91j38p2k4J47k3O6j09K85r4j53K31o6j33O6J97Q2m20
5300a35K25jM0r3J67k24N2j48J51N8p3j59J53j4q3N0J27k13L9K15j59j00K26n0
5324E1o4j19j50J68MJ8Q7j21j72L05N0j40J40pk5l7J37K3R5l23J77%j6j36J62
5349A07L1k0j01J71N9k38K61j24Pj50J35p2k07R7J81l84K84r8R3k07k5K03k15
$$ plain form
5372 -212 -241 -221 -88 -59 -251 -138 -42 -142 -53 -10 135 -168 36 110 -37 -232 147 94 -116 100 58 320 106
5395 106 145 120 -81 -93 237 200 -147 239 199 68 87 131 261 110 -120 -70 154 -47 -63 224 -71 -145 68
5418 68 -158 -182 -41 -28 -91 -103 -145 17 -105 -68 -70 78 -187 -216 133 -7 -2 -47 70 0 -108 -83 147 -107 103
5443 103 146 7 180 128 181 151 -114 267 81 5 91 133 4 -13 11 144 3 -57 103 -20 71 -173 166 -159
5467 -159 -145 69 66 -139 -69 -110 11 -113 -184 -56 -167 -204 101 -75 -184 30 26 -7 -80 -129 100 3 133 8
5491 8 145 -126 -283 99 185 -194 187 294 -119 51 105 154 -11 226 197 145 -189 -26 195 -30 -68 44 -139
5514 -139 -181 -183 -47 -40 -256 -64 217 -19 -199 74 24 -90 -131 -93 -69 28 76 101 -95 -282 116 84 -135 -53 60
5539 60 -78 -170 -49 171 63 15 250 222 113 11 189 259 -65 82 132 66 36 3 120 -162 -50 232 119
$$ packed form
5372b12k9K0J33K9j92J13R6j00Q9M3J45l03K04P4j47j95L79n3k10K16m2K62k14
5395A06L9k5k01j2L30l7l47L86m0j31J9M4J30j51k30N0K24k01j6K87k95p4K13
5418F8k26k4J41J3o3j2m2J62j22L7kJ48k65k9L49j40Nm5J17p0j08K5K30k54K10
5443A03M3j39J73n2N3l0k65L81j86p6Q6M2j29j7K4J33j41o0J60j23R1k44L39l25
5467a59J4K14lk05P0m1J21j24p1J28j11l7L05j76j09K14ml3p3m9K29r7J30j25
5491HJ37k71j57L82Q6l79L81J07m13J70N4M9j65K37k9n2l34J63K21k25l8J12j83
5514a39m2kJ36Pk16J92K81k36j80K73n0j14m1L8K4R7M8K5j96j87L98l2k19Q2J13
5539F0j38r2J21K20j08m8K35k8j09j02J78P0l24J47N0o6l0l3J17k82J12K82j13
$$ plain form
5562 119 -89 24 -173 -167 -303 -46 -181 -208 -47 -84 94 -217 -27 33 -342 -235 152 -46 -189 -27 -59 -41
5584 -41 -25 80 231 -15 -141 133 -9 -75 172 28 15 130 209 66 88 194 39 207 -38 47 142 48 77
5607 77 126 -28 36 -216 -67 107 -12 -59 85 -120 -159 -32 -51 -85 -49 -17 -139 -76 -133 49 -98 -131 170 -81
5631 -81 -188 -132 92 133 -86 116 293 9 -53 27 87 -20 144 186 29 -22 94 120 -78 106 100 135 -23 126
5655 126 -67 5 -196 84 174 -21 -35 -28 -152 -109 -17 -129 -129 -229 13 60 -98 -127 131 -120 -67 88 175 -167
5679 -167 -90 -112 106 -3 -40 169 110 -190 135 354 -117 70 12 105 -9 60 243 187 -278 9 214 10 -91
5702 -91 74 94 -56 146 87 -159 -119 -38 109 -71 -240 -22 69 -121 88 -66 -236 -142 -21 189 -153 -123 23
5725 23 -127 -56 -20 -75 -117 -101 -80 -108 120 -36 5 40 70 -31 221 -42 11 53 259 85 10 210 143 -85 46
$$ packed form
5562A19k08J13j97Oj36K57j35k7J61l7J78l11J90O0l75J07L87j98j43J62l2J8
5584d1J6J05J51k46j26K74j42o6K47j44j3J15P9j43K2J06j55J68k45Q5R5r4K9
5607G7M9j54O4k52J49J74j19m7J44k05l9J27j9l4L6L2j22O3n7J82j47l3L01k51
5631h1j07N6K24M1k19K02J77k84o2Q0O0j07J64M2j57n1J16K6j98J84oL5j58J49
5655A26j93P2k01K80R0j95j4Pj24M3R2j12%j00K42M7j58k9K58k51N3J55Q7l42
5679a67P7k2K18j09l7K09n9l00L25K19m71J87n8R3j14O9J83n6m65K87K05k04j01
5702i1J65K0j50K02n9k46M0Q1J47j80j69K18R1j90K09j54j70R4J21K10l42L0J46
5725B3j50P1L6n5m2J6K1k8K28j56M1L5L0j01K52k63N3M2K06j74p5K00o7k28J31
$$ plain form
5750 46 171 75 -21 34 138 -144 -60 -122 -65 138 161 21 -70 -173 -110 -7 -136 -103 -103 -109 -104 -188 109 11 -235 -200 71
5777 71 -103 -255 22 -238 -145 15 -34 -167 -177 -59 -15 -51 14 -102 175 172 38 157 43 25 231 94 72 4
5801 4 23 -6 -24 91 134 17 -45 187 -168 -49 -41 -38 31 -229 -84 -50 -55 -160 136 -62 -11 -31 -39 -214 -206 -102 29
5828 29 59 -32 -69 81 -124 -56 195 -102 -60 4 68 100 113 42 237 -120 -101 174 -21 -44 9 270 -113 62 107
5853 107 -32 120 48 -6 41 -169 -103 19 -279 -52 187 -83 -162 97 37 -43 -173 -14 -143 -33 -77 -55 -98
5876 -98 -172 1 -97 136 95 45 -148 92 -1 40 51 66 178 266 -27 71 189 154 35 112 103 184 16 77 241 -117
5902 -117 -14 80 127 46 16 94 -272 0 22 -194 -51 -219 165 109 -117 -23 -70 -155 -213 -172 34 -147 -112 -40 87
5927 87 30 -106 171 -98 9 4 -82 -14 14 18 135 98 184 91 -58 -13 159 93 21 173 203 162 119 266 63 -99
$$ packed form
5750D6J25r6r6N5J04k82Q4o2N7K03K3j40r1j03O3J03j29L3%oNq4K97r8k46L5K71
5777G1j74j52K77k60R3J60m9j33j0J18M4l6O5j16K77lj34J19j14j8K06j37k2o8
5801DJ9k9j8J15M3j17o2K32l55J19QLO9k60J45L4nj05K96j98N1k0qj75QJ04J31
5828B9L0r1l7J50k05O8K51k97M2O4O4L2J3p1J95l57J9K75j95k3N3K61l83J75M5
5853A07j39J52p2n4M7k10O6J22k98K27K39k70p9K59o0q0j30J59j29J10m4K2m3
5876i8p4J73r8K33m1n0j93K40r3M1J1J5J12Q8k93R8J18l5j19P7rQ1j68O1J64l58
5902a17J03R4M7q1l0P8l66K72K2k16J43j68L84n6k26R4m7q5n8M1K06j81L5P2J27
5927H7n7j36K77k69J07nq6O8K8MJ17l7Q6r3j49M5J72o6p2J52L0m1m3J47k03j62
$$ plain form
5953 -99 -7 102 276 -158 -112 60 -21 -46 -20 -169 130 0 -82 165 -52 -213 -7 -155 -202 21 -29 -92 -125 -95
5977 -95 -59 -160 -223 204 -114 -89 -62 -31 40 -43 -16 58 59 74 154 127 -21 -59 212 -56 138 81 152 -158 137 -53
6003 -53 8 65 3 88 -40 -105 75 81 -195 106 97 -171 99 -9 -299 -158 -7 12 -13 -106 -138 86 -39 29 180
6028 180 72 118 -2 25 63 114 185 -84 121 -77 1 130 29 29 -76 -102 59 -84 210 151 -68 -11 35 -138
6052 -138 -42 2 18 -25 147 143 -141 -72 -61 51 -189 -101 -134 -135 -156 -135 -47 -107 -145 200 -119 124 -91 118 187 -128
6078 -128 -183 -12 -165 -44 213 246 -56 5 -16 -66 104 -120 82 -6 61 -51 126 -46 199 67 -121 -24 10
6101 10 79 -94 -72 42 -93 -75 -155 99 -64 -70 31 -22 74 -325 38 15 -1 -135 -106 -94 35 135 -114 -56 38
6126 38 109 136 -21 -107 -7 -109 -54 237 205 114 100 31 -51 56 -48 134 15 -50 41 72 68 -14 161 -30 27 -93
$$ packed form
5953i9R2J09J74m34M6J72q1k5K6j49K99j30q2K47k17j61K06j48m7K23n0o3l3L0
5977i5L6j01o3M27l18K5K7L1P1q3K7P4JJ5Q0k7j48l8K71k68J94n7P1l10K95j90
6003e3O1N7o2Q5j28o5J80Ok76L01rk68K70j08k90J41J51J9k5r3l2K24j25O8J51
6028A80j08M6j20K7L8N1P1k69K05j98P8J29j01%j05k6J61j43K94n9k19N7M6j73
6052a38R6M4J6m3J72mk84O9J1J12k40Q8l3jk1K1Q8o0l8L45l19K43k15K09O9l15
6078a28n5J71j53J21K57L3l02O1k1n0J70k24K02q8O7j12J77j72K45j32j88R7L4
6101A0O9j73K2J14j35J8q0K54j63oJ01n3R6l99L63k3j6j34K9J2J29J00k49N8R4
6126C8P1K7j57q6J00j02N5K91l2r1j4o9q2J07j04J82j19o5R1L1mq2J75j91N7j20
$$ plain form
6152 -93 185 -28 -2 -18 166 -120 -94 257 9 -200 10 -15 -129 29 -78 15 -47 -99 -199 109 -170 8 91
6175 91 -34 -174 92 -94 204 28 -16 -33 -186 -44 190 -120 -26 53 50 10 76 238 41 11 -20 21 200 -47
6199 -47 35 8 -24 29 196 -1 -192 106 -88 5 -47 -93 6 -176 13 41 -157 -95 -32 47 4 33 -43 86 -50
6224 -50 102 -100 -40 -95 -30 82 -140 -16 -20 -77 21 -29 75 15 -113 47 139 -135 197 60 88 -39 105 109 32
6249 32 76 -46 64 -97 8 96 -11 -116 105 -145 -105 49 -167 -7 11 -138 -48 -41 94 -49 -9 -88 -54 38
6273 38 -64 16 190 -2 70 -175 -6 60 -31 17 89 31 -25 228 -23 181 165 -35 110 -13 -83 -27 -46 -237
6297 -237 110 204 129 107 20 -52 17 66 -51 15 -196 -174 151 -139 -3 146 33 -150 -129 62 -76 -132 115 -116
6321 -116 44 -109 -8 -21 -170 -171 -149 -24 140 175 1 177 32 87 102 127 95 100 -13 49 144 15 148 -83
$$ packed form
6152i3K78k13K6j6J84k86K6L51k48k09K10k5j14J58j07R3o2n2j00L08k79J78Q3
6175I1j25j40K66j86K98j76m4j7j53J42K34l10R4P9lm0O6J62j97l0l1M1J79k47
6199d7Q2k7l2N3J67j97j91K98j94R3n2m6R9j82J89K8j98O2O3P9m3K9p6J29j36
6224e0J52k02O0n5O5J12k22J24mn7R8n0J04o0j28J60R2k74L32j37K8j27J44Mp7
6249C2M4j22J10j61J05Q8j07j05K21k50M0J54k16J60J8j49R0PJ35j43M0p9L4R2
6273C8j02Q0J74j92P2k45J69O6r1M8P2n8n6K53k51K04j6k00J45j23p0N6j9j91
6297b37L47R4p5k2q7p2O9M9j17O6k11K2L25k90J36J49j13j83K1J91j38n6K47k31
6321a16J60j53J01j3j49jK2J25J64L5j74J76j45N5J5K5l2Nj13O2R5j29J33k31
$$ plain form
6345 -83 152 -126 178 41 9 79 26 115 -109 -12 -32 -116 24 -68 -77 95 -93 -136 -44 60 -160 -121 75 -28 -42
6370 -42 134 -35 -10 -93 -161 -57 -111 -34 51 40 132 63 21 -6 -97 57 73 35 -42 222 -4 -25 20 139 -61 137
6396 137 -73 -37 93 13 13 43 -36 121 135 -18 -86 -45 102 4 9 -208 6 -124 -54 132 19 -118 18 -111
6420 -111 10 -109 14 -173 -94 -105 -65 -135 15 9 -33 35 -52 -142 60 248 9 -115 -98 -60 109 53 27 29 -100
6445 -100 -27 14 46 106 143 164 17 -173 64 -44 -6 -2 121 108 -6 -9 92 79 -170 -149 49 93 10 -198 106
6470 106 4 -66 -44 -82 49 -29 -10 -105 -7 -11 -137 57 -106 168 8 57 -23 28 54 78 -33 -14 -64 -30 149 176
6496 176 -42 -158 -78 -79 -63 -10 -41 -104 -19 -95 0 -59 139 -212 2 -2 -99 72 -51 -9 37 -95 -204 -41 16 -113
6522 -113 -220 -167 208 -63 -187 91 -48 -147 -132 -131 -44 69 124 25 72 -27 -23 -78 72 -120 90 184 71 12 112
$$ packed form
6345h3K35k78L04j37l2P0n3Q9k24R7k0q4J40r2rJ72j88m3R2J04k20L9J96j03j4
6370d2J76j69K5q3o8J04n4P7Q5j1R2o9m2k7r1J54J6l8p7K64k26k1M5J19k00J98
6396A37k10L6J30q0%L0p9J57J4j53o8M1J47r8Nk17K14j30P0J86j13j37J36j29
6420a11J21j19J23j87P9j1M0p0J50om2O8q7r0K02J88k39j24J7L8J69n6k6Kj29
6445a00P3M1L2O0L7K1j47j90K37j08L8MJ23j3j14lJ01j3k49K1J98M4q3k08L04
6470A06j02p0K2l8J31p8J9r5R8mj26J94j63K74j60M9q0N1K6K4j11J9n0L4J79K7
6496A76k18j16Q0jJ6N3l1o3Q5p6R5n9J98l51K14mr7J71j23M2M6j32j09J63N7j29
6522a13j07N3L75k71j24K78j39r9J5JQ7J13N5r9M7r9Mn5J50j92K10R4j13n9J00
$$ plain form
6547 112 -47 37 -2 48 -164 83 -119 -23 -25 -28 -68 -138 -156 -17 -110 -24 -157 -225 23 129 -72 100 -80 -84 135
6572 135 -4 -131 13 -126 27 113 -38 24 141 -34 33 240 72 -64 113 130 81 -2 72 51 36 339 68
6595 68 -39 -21 113 14 54 -69 50 134 -44 2 -15 68 75 50 -6 114 -105 5 -39 -66 -83 -44 -34 32 44 -57
6621 -57 -28 147 -77 -92 -36 166 76 -20 -48 41 -27 -65 1 125 51 -75 37 202 24 -32 108 -172 238 -45
6645 -45 37 72 107 164 148 -351 18 116 -5 13 -71 -131 -79 -25 12 -144 -26 -66 4 5 -121 -10 -88 -31 71 -9 -53
6672 -53 48 -26 202 25 -92 -174 -8 9 95 109 108 48 58 37 -51 164 -11 43 42 6 19 41 169 -28 5 179
6698 179 -84 -12 38 108 -60 66 57 -46 -97 -135 -94 11 -125 -54 -29 48 -49 -235 38 -115 -28 7 38 149 -12
6723 -12 81 -1 343 -19 -13 113 -24 -39 45 -40 54 6 37 36 25 -5 24 111 103 -24 36 181 -102 -185 99 -154 -92
$$ packed form
6547A12j59Q4l9N0k12K47k02R6klm0p0j8J39r3Q6j33o8K48J06k01J72j80mK19
6572A35j39j27J44j39J53Q6j51O2J17j75O7K07j68j36J77J7m9q3P4k1j5L03k71
6595F8j07J8J34r9M0j23J19Q4j78M6j7Q3Pk5n6J20k19J10m4k7j7L9J0O6J2j01
6621e7K9J75k24j5N6K02r0r6k8Q9o8l8O6J24p4j26J12J65j78n6J40k80M10k83
6645d5Q2L5L5N7j6m99L69R8j21J8q4o0N2N4L7j56J18m0P0Jj26J11p8N7J02q0m4
6672e3J01p4K28j77j17q2J66J7Q6J4jo0J0k1q8K15j75N4jl6J3K2J28j97L3J74
6698A79k63P2N0P0j68J26rj03n1l8M1J05j36P1K5P7r7j86K73j53Q7L5L1J11j61
6723a2R3q2L44l62OJ26j37j5Q4q5R4m8L1jj1l0K9Q7qj27O0J45k83q3K84k53O2
$$ plain form
6750 -92 130 68 86 -84 19 148 -46 38 6 -114 -265 -16 70 78 3 76 -87 -209 76 64 38 -178 60 -52
6774 -52 54 53 -40 33 29 -157 84 3 -43 78 261 -51 96 -24 -3 65 0 -14 183 6 63 142 -86 8 -41 -90
6800 -90 129 -87 -54 -106 -29 -100 106 -77 -28 3 -140 -91 -108 -48 -83 -94 -36 58 57 6 45 -77 2 -124 31 -103
6826 -103 55 -63 39 -88 -29 2 -146 99 13 -30 -38 45 54 122 100 78 9 -113 75 199 -81 -142 124 -27 107
6851 107 -1 37 91 -165 -86 -29 -44 -172 0 -111 -29 -8 -12 -34 120 42 82 25 114 -96 -48 -8 71 -76 -58 -30
6877 -30 -50 89 41 -2 -13 89 161 -16 236 117 -40 -41 115 3 -41 -94 -87 39 -19 46 -48 -86 -296 62 -76
6902 -76 -8 -33 -71 -138 41 161 84 12 126 -4 93 1 -1 -51 -73 136 -58 13 53 -47 -20 131 -7 75 -59 49
6928 49 97 -101 77 112 -143 58 23 -79 194 31 -7 108 -32 -133 36 -170 118 57 18 2 30 89 83 -9
$$ packed form
6750i2K22o2J8j70J03J29j94Q4l2j20j51K49Q6Qp5P3j63j22K85j2k6k16K38j12
6774e2J06jr3P3mj86K41q1m6J21J83l12J47j20K1O8o5j4J97j77N7P9k28R4m9m9
6800i0K19k16L3n2P7p1K06j83M9L1j43M9j7O0l5j1N8R4jn1L9j22P9j26J55j34
6826a03J58j18J02j27N9L1j48K45q6m3qQ3RO8k2k2o9j22J88J24k80o1K66j51J34
6851A07j08L8N4k56P9N7j5j28J72j11Q2K1mk2J54p8M0n7Q9k10M8M0P9j47J8K8
6877c0k0J39m8m3j1J02P2j77K52j19j57jJ56j12m4n3PJ26n8O5r4l8k10L58j38
6902g6O8k5l8o7J79J20p7p2J14j30R7r2kn0k2K09j94P1M0j00K7J51j38Q2j34J08
6928D9M8j98J78L5k55K01l5j02K73j63l8J15j40j01J69k06K88o1l9j6K8N9or2
$$ plain form
6952 -9 47 -21 14 -53 27 -46 -24 -21 -65 111 -6 36 212 127 106 182 -108 -28 217 -4 66 141 12 -160 -32 -107 -21
6979 -21 37 -11 13 68 184 144 8 61 29 236 -6 -97 68 18 103 -116 -30 -45 -154 -145 227 2 -74 -64 46 75
7005 75 -13 -18 -45 16 -47 -117 -1 -131 -34 40 66 -123 6 0 -102 83 -100 -149 -91 -71 10 -21 3 -109 81 -113
7031 -113 158 219 105 17 -77 89 6 -58 -77 105 -102 -120 -81 -13 -41 86 25 -97 -37 18 -5 21 -116 73 16
7056 16 -108 49 -37 -143 -62 -30 -92 -138 12 -15 -111 93 -63 41 106 38 110 52 48 -32 69 288 -140 -118 116
7081 116 -6 92 56 -40 0 61 -30 28 -59 -46 -7 80 -112 -60 181 -38 -29 89 44 21 -29 112 -79 -20 -40 -60 -45
7108 -45 31 46 -185 -24 116 -41 34 -30 -69 8 -304 87 188 -20 -40 -140 27 87 15 20 -5 -62 126 17 -57
7133 -57 91 33 -70 59 40 -111 -34 13 18 136 117 -64 146 37 39 -42 -154 167 -84 -30 89 -88 -134 -148 -37
$$ packed form
6952iN6o8L5o7Q0p3K2Lm4J76j17M2J76q5k1P6k90Q0K45k21P0P5j29j72J28p5Q6
6979b1N8m8K4N5J16m0j36N3l2K07k42r1J65n0Q5k19Q6j5j09RL72k25p6J0J10K9
7005G5q8nk7O1o3p0J16j30R7P4K6j89J29oj02J85j83m9N8K0Q1l1K4j12J90j94
7031a13K71O1j14q8r4J66q3o4j9J82k07j8L9O8k8J27o1j22O0N5k3K6j37J89n7
7056A6j24J57q6j06Q1L2o2m6J50k7r6K04j56J04O5o8P2n8mq0J01K19m28K2K34
7081A16j22R8l6r6M0O1r1N8q7J3L9Q7j92N2K41k19RJ18m5k3n0J41j91N9k0k0J5
7108d5P6J5k31J61J40j57P5o4l9P7l12L91J01k08k0j00J67O0p2Nk5n7J88j09p4
7133e7J48n8j03J29j9j51P7M7NJ18j9j81K10j09Kq1j12L21k51N4J19j77m6j4J11
$$ plain form
7158 -37 133 -120 -29 74 -77 -106 -12 17 101 -55 -128 -133 104 -82 -68 -5 -75 -11 -29 29 87 48 -77 112 -221 -30
7184 -30 -74 114 65 -26 -116 8 -19 -7 62 -71 -59 81 -17 -46 -192 21 165 -119 -114 -41 -13 29 -80 -212 13
7209 13 46 4 152 83 -116 -51 14 -57 -61 -19 -60 -60 84 12 -23 77 177 -18 8 -7 -60 -14 30 41 0 -1 -59 -27 -69
7238 -69 -79 -28 -42 -74 -10 66 -31 23 -27 -13 -48 -128 53 41 -9 -27 -14 61 122 79 89 46 6 99 60 106 47 -19 -172
7267 -172 62 103 -62 145 -68 70 78 207 36 106 -63 -73 146 256 -93 31 -9 -73 -14 193 -148 -6 26
7290 26 159 -42 -25 -42 25 56 32 -14 93 33 233 126 -93 75 11 144 -82 45 109 67 79 -15 -30 19 41
7315 41 -9 -12 -11 40 42 -17 85 123 -56 131 -142 -47 8 19 48 104 98 103 -7 22 106 -45 -105 -76 84 174 147 90 -57
7344 -57 4 82 3 47 -141 -184 80 33 -75 -18 -24 132 -9 81 -33 -40 102 129 -199 173 145 -37 -73 -23 65 81
$$ packed form
7158c7J70k53R1J03j51k9R4K9Q4j56p3nK37j86J4O3p0O4j8N8N8l9j25J89l33J91
7184c0m4J88m9r1r0J24k7J2O9j33J2J40r8k9j46K13J44k84NP3K8M2j09j32K25
7209A3L3m2J48o9j99O5O5p1mM2m1%J44p2l5J00J00j95K6j5n3M6M4J1m1jn8L2m2
7238f9j0N1j4l2O4P6r7N4n0J4l5q0J81j2n0j8J3P5O1m3J0m3m0R3l9M6n9o6j53
7267a72K34M1j65K07k13J38QJ29j71P0j69j0K19J10l49J24m0o4N9K07l41J42L2
7290B6J33k01J7j7O7L1k4m6J07o0K00j07k19J68o4J33k26J27O4m2J2r4j5M9K2
7315D1n0lJN1Kn9J02L8j79J87k73R5N5J1K9N6oNj10K9Q4j51o0K9J60R0k7n7j47
7344e7O1P8p9M4j88m3K64m7j08N7oJ56j41R0j14pJ42K7l28L72k8j82l6N0Q8J6
$$ plain form
7370 81 169 143 -181 142 -110 15 -13 22 42 68 164 -105 160 -80 21 -46 -51 -62 49 134 111 36 48 -1 -48 80
7396 80 -135 167 28 40 68 136 4 -127 66 3 -44 206 87 -14 -93 -111 33 -55 41 22 -55 93 78 65 156
7421 156 64 -23 35 -10 8 -84 -15 -73 61 53 102 -40 -52 109 102 -33 125 -131 -58 144 153 46 44 14 -79 -57 -32 18
7449 18 -87 -74 63 98 -113 -127 115 1 98 107 108 36 -29 -77 14 177 84 87 147 -177 -37 146 21 76 -34 -54
7475 -54 16 -88 -72 132 -120 -35 76 27 -35 -101 6 -34 -112 183 -29 201 161 32 -47 117 14 -24 -39 16 16
7500 16 -84 2 -53 -135 -10 92 41 -27 45 -131 -45 -24 55 81 81 -42 -235 53 78 94 1 8 120 10 14 -120 -57
7527 -57 98 6 38 124 105 16 83 -136 46 -62 -17 -40 -20 -99 -58 11 -7 111 -145 43 -32 -130 -125 -73 46 -13 -9
7554 -9 39 -50 -115 -24 36 -20 -27 -110 59 -28 -122 -62 -73 -28 -117 122 -15 33 92 66 -101 -7 58 3 -59 78 -129 5
$$ packed form
7370H1Q8k6l24L23k52J25k8L5K0K6R6k69K65k40J01o7nj1J11Q5k3p5J2m9m7J28
7396H0k15L02j39J2K8O8j32j31J93o3m7K50j19j01p9j8J44q8R6j9p7J48j5j3R1
7421A56r2q7N8m5J8r2O9n8J34qM9j42j2J61pj35J58k56P3K02Rj07kl0r3K2K5N0
7449A8j05J3J37L5k11j4K42j14R7RJp2o5m8R1J63r3LO0l24J40J83j25N5j10k0
7475e4P0j04J6K04k52Q5J11m9o2o6J07m0p8K95k12K30m0j29p9J64j03l8j5N5%
7500A6j00Q6n5q2J25J02n1o8P2j76Q6K1P9K6%j23j93K88K5J6r3PJ12j10Mj34O3
7527e7J55r2L2Q6j9q9O7k19J82j08M5k3K0p9M1O9j8J18k56J88p5r8NN2J19n9M
7554iM8q9o5R1O0n6pq3J69q7r4O0j1M5q9K39j37M8N9k6j67R4O5n5o2J37k07J34
$$ plain form
7582 5 61 -77 -99 -81 225 -61 -41 -115 -83 -33 -39 46 -62 75 -75 121 13 31 -141 -105 -168 -76 -42 95 -108 10
7608 10 -28 -41 16 -158 -128 75 -137 -8 -21 -53 265 7 45 -16 18 -51 12 -93 -123 100 17 -199 60 -56 -81
7633 -81 88 -74 184 -49 -21 134 -38 47 96 41 216 5 15 12 -225 -34 30 -49 40 142 11 -135 50 44
7657 44 40 23 89 83 -170 -192 -55 68 -22 43 124 47 -167 -141 -5 -160 188 248 16 63 -165 -138 1 -51 83 16
7683 16 -113 90 85 -89 56 30 -116 -129 -33 -7 53 -58 89 -21 -24 -75 123 60 -77 86 -43 32 -98 -111 -86
7708 -86 5 90 -47 -34 102 86 28 54 38 -7 41 -332 47 5 -33 -77 16 3 4 -12 -63 162 133 -37 92 -88 -61
7735 -61 161 -125 -42 -47 -29 105 -21 118 -144 12 61 -129 -35 -133 -30 -40 -29 -8 -107 33 -25 -15 -91 28 159
7760 159 -91 -98 136 -64 -49 -56 -45 29 -39 -19 42 -77 98 40 -181 -52 40 -14 -9 -134 -30 -105 2 56 188 105
$$ packed form
7582EN6j38k2J8L06k86K0p4L2N0oQ5j08J37j50J96j08J8j72L6o3R2L4J37k03J18
7608A0l8j3N7j74L0K03k12J29j3l2L18k58L8o1L4o9O3j05l0K23q3k16K59j16k5
7633h1J69j62K58k33K8J55j72Q5M9n5J75k11J0lk37J91O4p9Q9J02j31j46J85o
7657D4mj7O6ok53k2J37J23r0O5Q1p7k14K6J36j55L48O0k32M7k28K7J39n2J34o7
7683A6j29K03nj74J45k6j46j3R6K6O0j11J47j10ln1J98o3j37J63j29P5j30j3K5
7708h6R1Q5j37J3J36j6n8K6j6m5M8l73L79m2l8m4R3j3Jj6n1K25k9j70J29j80K7
7735f1K22k86Q3nJ8J34j26J39k62J56M9j90R4r8J03j0J1K1r9J40n8J0p6J19J31
7760A59k50pK34k00J5pJ1P4o8K0O1j19J75n8k21J29R2n4Nj25J04p5J07N4J32q3
$$ plain form
7786 105 24 84 -56 -29 -135 18 34 -77 -45 -128 1 -41 -141 7 -31 -78 -49 108 -59 94 39 11 -21 101
7810 101 0 89 77 -15 62 -153 49 -58 45 98 -39 -9 22 -19 -19 6 -19 118 12 48 -93 5 48 -75 -19
7835 -19 265 -123 -92 75 0 106 72 78 162 19 143 -102 -101 -61 71 55 0 -32 55 -59 30 -97 36 96 -77
7860 -77 -68 -189 -51 -44 42 -52 64 22 -176 95 131 -157 -13 50 10 66 -120 2 45 131 -193 -8 -92 -28 -177
7885 -177 -92 -10 99 -97 19 -13 77 32 -58 105 -11 -33 52 79 -4 120 28 -72 -150 21 10 71 96 41 -6 81
7911 81 44 33 -49 -46 104 95 70 48 -39 -45 -234 94 -41 -97 -28 55 70 -139 -75 -16 35 -91 53 -21 250 -139 -3
7938 -3 6 116 -44 -1 78 -87 29 -46 123 -121 72 -18 130 131 -129 90 -37 -93 -73 86 -16 -60 -124 40 -34
7963 -34 -5 28 -53 -60 0 53 67 -8 17 -96 92 -91 53 -54 178 93 -72 -134 164 71 -110 -72 0 116 -85
$$ packed form
7786A05q1O0j40K7j06J53J6j11L2q3J29m2j00J48l8m7K9J57j67J53n5k8l2J22
7810A01j01Q9j2r2P7k15K02j07J03N3j37L0L1m1%K5k5J37j06L6j41R8M3j23N6
7835a9K84l88L1J67p5J06l4OQ4j43J24k45JM0J32j6n5l2Q7j14Q9j27J33O0j73
7860g7Rj21J38PQ6r4J16m2j98K71L6k88J44O3m0N6j86J22M3Q6l24J85q4O4j49
7885a77Q5Q2J09j96J16l2R0m5r0J63j16k2Q5K7q3J24r2j00p8J71j1O1K5n5m7Q7
7911H1l7j1q2LJ50rk5k2q7oj89L28j35n6O9Q3J5k09O4N9N1j26J44p4K71l89J36
7938cRJ10j60M3P9j65J16p5J69k44J93r0J48Jk60K19j27n6K0J59j02m4o4J64p4
7963c4K9L3q1pO0N3J4p5K5j13J88j83J44j07K32q5j65o2K98r3j81L8P2J16k01
$$ plain form
7988 -85 123 8 141 142 46 -166 113 96 23 -83 -121 83 -26 79 -183 183 96 -59 49 -48 -14 115 -46
8011 -46 77 98 -137 -144 -28 104 -157 -2 104 81 64 60 -31 211 -9 16 5 -97 18 -22 56 -57 -69 -14 -44
8036 -44 -109 172 -181 -38 -155 -58 -84 77 -93 92 35 -17 -58 149 130 106 -3 8 -14 42 102 -144 14 -120
8060 -120 56 -156 44 -38 -145 -19 -24 1 -132 117 -32 159 135 46 -10 -58 -49 -20 -29 6 -164 40 129 -105 -97 148
8086 148 -63 -59 8 -139 35 80 -185 -149 -1 30 48 32 -61 -107 40 31 -61 66 -17 88 -43 199 -71 -95 -109
8111 -109 47 40 -9 73 29 101 -158 60 151 62 23 80 173 28 -59 -9 20 35 -172 61 136 129 -71 -80 109 -17 -57
8138 -57 -203 138 57 -37 -34 41 -31 -133 59 -44 21 64 55 45 73 -65 42 91 -57 -117 93 34 -201 86 28 149
8164 149 -18 85 -130 -2 -219 102 110 -68 83 12 41 -218 6 99 196 209 -51 -152 -29 163 24 1 -134
$$ packed form
7988h5K08j15J33Jr6k12K79j7p3j06l8K04j09J05k62L66q7j55J08r7L4J29j61
8011d6J23K1k35pJ16J32k61J55J06k3j7mr1K42k20K5j1j02J15m0P8j13j2N5l0
8036d4o5K81l53J43j17R7k6J61j70J85n7n2m1K07j9k4j09J1k2N6O0k46J58j34
8060a20J76k12K00q2j07J26nK5j33K49j49J91k4q9n6m8RK9rL5j70K04Q9k34QK45
8086A48k11MO7j47J74M5k65L6J48L1J8j6r3m6J47rr2J27q3J05j31K42k70k4j4
8111a09J56pm9Q2m4P2k59K18R1q9l9N7R3j45q7N0K9J5k07K33P5pk00rJ89j26m0
8138e7j46L41q1r4LP5p2j02J92j03O5M3rj0K8j38J07M9j48o0K10n9k35K87n8J21
8164A49j67J03k15J28k17L21Qj78J51p1K9k59K24R3R7J3k60j01J23J92j39k3j35
$$ plain form
8187 -134 61 80 83 60
$$ packed form
8187a34J95J9Lk3
8191F0
$$ Imaginary data points
##PAGE= N=2
##DATA TABLE= (X++(I..I)), XYDATA
$$ plain form
0 0 0 0 0 0 0 0 0 0 0 0 0 0 0 0 8 -8 8 -8 8 -12 16 -16 16 -24 24 -32 36 -40 48 -56 64 -72 80 -90 103 -115
36 -115 129 -145 162 -179 198 -220 244 -271 297 -329 364 -401 441 -485 535 -591 650 -719 795
55 795 -883 981 -1097 1233 -1393 1590 -1833 2148 -2570 3166 -4062 5573 -8565 16691 -82403
70 -82403 -221171 73891 145519 -60309 -51662 127218 44601 -90702 57727 189231 -8217
81 -8217 -119746 71505 126253 -54103 -51027 81892 26957 -74863 8772 83543 -9278 -57952
93 -57952 41787 48484 -51232 -18609 56817 -17034 -62758 16115 21505 -53128 -30167 32831 -13909
106 -13909 -66527 9415 48960 -53027 -60567 59601 29874 -82137 -14289 81297 -4569 -73279
118 -73279 26796 70627 -44761 -54645 79945 44245 -104109 -30918 103201 3744 -96651
$$ packed form
0@%%%%%%%%%%%%%%Qj6J6j6J6k0K8l2L2m0M8n6O8p6Q8j04J20j36J52j70J93k18
36a15K44k74L07l41L77m18M64n15N68o26O93p65Q42r26J020j126J241j369J514
55G95j678J864k078K330k626K983l423L981m718N736p228R635j4138K5256r9094
70h2403j38768K95062P1628k05828Q647J78880q2617j35303J48429J31504j97448
81h217j11529J91251N4748j80356L076J32919n4935j01820Q3635P4771r2821m8674
93e7952R9739O697r9716L2623P5426p3851m5724P8873N390p4633K2961O2998m6740
106a3909n2618P5942L9545j01987p540J20168k9727j12011O7848R5586q5866o8710
118g3279J00075M3831j15388r884J34590l5700j48354P3191J34119r9457j00395
$$ plain form
129 -96651 12925 72854 -41209 -59698 70218 56367 -77559 -21869 104514 12598 -82388
140 -82388 33977 88932 -33581 -56178 52996 42781 -54529 -13797 66062 -13966 -72966
151 -72966 37201 66576 -51714 -49480 52136 24272 -47640 -1500 38952 -33012 -54771 36617
163 36617 33044 -73622 -49167 43270 -5974 -64022 6917 34606 -40253 -36667 48964 35162
175 35162 -43656 -3182 72039 9668 -43607 39362 62737 -25325 -20574 57369 27531 -43344
187 -43344 -1129 58267 -1729 -50523 22294 41527 -44879 -34377 47707 8451 -62682 -12864
199 -12864 40543 -14059 -50654 10450 25007 -44099 -28106 47286 3043 -64269 -1687 49112
211 49112 -11488 -38222 17333 20889 -32589 -10058 49864 5217 -51740 10597 50756 -15794
$$ packed form
129i6651J09576N9929j14063j8489J29916j3851j33926N5690J26383r1916r4986
140h2388J16365N4955j22513k2597J09174j0215r7310M0732P9859q0028n9000
151g2966J10167K9375j18290K234J01616k7864p1912M6140M0452p1964k1759R1388
163C6617l573j06666K4455R2437m9244n8048P0939K7689p4859L586Q5631j3802
175C5162p8818M0474P5221o2371n3275Q2969K3375q8062M751P7943k9838p0875
187d3344M2215N9396n9996m8794P2817J9233q6406J0502Q2084l9256p1133M9818
199a2864N3407n4602l6595O1104J4557o9106J5993P5392m4243o7312O2582N0799
211D9112o0600k6734N5555L556n3478K2531N9922m4647n6957O2337M0159o6550
$$ plain form
223 -15794 -26888 35431 21828 -31316 -2127 43867 3486 -33671 19753 40832 -24827 -23314
235 -23314 43576 18219 -37600 1446 37716 -8035 -29218 18911 23597 -32330 -21193 38012
247 38012 6374 -47257 -982 33342 -18377 -28184 22664 14706 -34597 -15321 33757 4308
259 4308 -39632 1948 29224 -25285 -31264 24745 11402 -37511 -13737 24237 -4286 -32812
271 -32812 5230 26614 -18281 -22814 28571 16187 -27231 3634 36085 1395 -16750 18509
283 18509 28564 -6389 -5929 32082 17220 -20375 8709 34373 -6751 -18866 19667 16136 -18954
296 -18954 -10724 15746 -2560 -27712 724 19241 -21553 -29301 13323 6297 -27499 -7502 15446
309 15446 -10679 -25387 4633 16538 -16269 -19425 17409 7693 -25819 -456 23868 -7637
$$ packed form
223a5794j1094O2319j3603n3144K9189M5994m0381l7157N3424K1079o5659J513
235b3314O6890k5357n5819L9046L6270m5751k1183M8129M686n5927J1137N9205
247C8012l1638n3631M6275L4324n1719r807N0848p958m9303J9276M9078k9449
259D308m3940M1580K7276n4509n979N6009j3343m8913K3774L7974k8523k8526
271c2812L8042K1384m4895m533N1385j2384m3418L0865L2451l4690j8145L5259
283A8509J0055l4953M60L8011j4862l7595K9084K5664m1124j2115L8533l531l5090
296a8954Q230K6470j8306k5152K8436J8517m0794p748M2624p026l3796J9997K2948
309A5446k6125j4708L0020J1905l2807l156L6834r716l3512K5363K4324l1505
$$ plain form
321 -7637 -17460 14288 15504 -12521 -7986 20804 10294 -17116 4460 25269 -6023 -14014 19826
334 19826 15467 -12354 -1235 19104 3813 -13776 4599 18778 -6883 -15519 12549 6931 -19924
347 -19924 -3722 13590 -6888 -16577 2121 6933 -10976 -11209 10494 5448 -16054 -1020 14262
360 14262 -6676 -9449 12639 6371 -12527 -4395 10498 916 -12820 84 9842 -10562 -12108
373 -12108 11804 2960 -16346 1092 14368 -2241 -8932 7389 12829 -2302 -2214 16771 8566
386 8566 -11137 5730 18518 -2756 -7233 9871 6026 -8940 -4914 7631 675 -12797 -1205
399 -1205 7658 -11469 -12335 7678 139 -14329 -3064 3342 -8107 -11082 678 3479 -10334 -9055
413 -9055 7210 -553 -12364 4954 11093 -5865 -2394 12193 7149 -3148 4157 14532 5183
$$ packed form
321g637r823L1748J216k8025M535K8790j0510k7410K1576K0809l1292p991L3840
334A9826m359k7821J1119K0339j5291j7589J8375J4179k5661q636K8068n618k6855
347a9924J6202J7312k0478r689J8698M812j7909k33K1703n046k1502J5034J5282
360A4262k0938k773K2088o268j8898Q132J4893r582j3736J2904R758k0404j546
373a2108K3912q844j9306J7438J3276j6609o691J6321N440j5131Q8J8985q205
386H566j9703J6867J2788k1274m477J7104l845j4966M026J2545o956j3472J1592
399a205Q863j9127q66K0013p539j4468J1265O406j1449k975J1760K801j3813J279
413i055J6265p763j1811J7318O139j6958L471J4587n044j0297P305J0375r349
$$ plain form
426 5183 -5041 8746 12275 -6683 -1477 15231 2628 -9280 3582 9368 -1811 -4389 7525
439 7525 7921 -7134 -2665 12405 -948 -12255 4846 6879 -12056 -11175 805 -3656 -13539 -7820
453 -7820 1122 -10675 -18103 1314 5655 -13618 -7739 9454 1010 -7006 4659 9796 -942 -3515
467 -3515 11319 10762 -9029 -3313 14910 1562 -9754 6502 8027 -8496 -4313 12164 7283
480 7283 -7685 806 16284 2029 -8282 13504 15114 -8488 -2090 15473 2293 -11378 1954
493 1954 11044 -6387 -14080 5730 5423 -17649 -7404 13050 -5078 -17729 2596 6877 -11539
506 -11539 -9736 7746 1641 -16469 -4715 11734 -8026 -17255 7927 8333 -14485 -5974 12171
519 12171 946 -9605 6435 15556 -3680 -9299 15411 14904 -9717 -122 18490 1091 -10353
$$ packed form
426E183j0224J3787L529j8958N206J6708j2603j1908J2862N786j1179k578J1914
439G525L96j5055M469J5070j3353j1307J7101K033j8935Q81J1980m461r883N719
453g820Q942j1797p428J9417M341j9273N879J7193q444q016J1665N137j0738k573
467c515J4834n57j9791N716J8223j3348j1316J6256J525j6523M183J6477m881
480G283j4968Q491J5478j4255j0311K1786J610k3602O398J7563j3180j3671J3332
493A954R090j7431p693J9810l07k3072J0245K0454j8128j2651K0325M281j8416
506a1539J803J7482o105j8110J1754J6449j9760r229K5182M06k2818Q511J8145
519A2171j1225j0551J6040R121j9236n619K4710n07k4621R595J8612j7399j1444
$$ plain form
532 -10353 7865 12604 -6268 -7800 11712 8784 -13305 -4152 16908 278 -13281 7149 10821
545 10821 -10468 -8227 10063 3766 -15139 -6523 10707 -6369 -20858 2472 8219 -16665 -11919
558 -11919 10212 -675 -16477 517 15408 -3289 -12915 11714 15935 -11152 -3418 22421 4772
571 4772 -14219 8633 18033 -7435 -10416 14909 11597 -15347 -5772 18586 -1906 -19140 9576
584 9576 15882 -15231 -11765 14915 5146 -16239 -1067 15663 -6744 -18577 10048 13881 -17279
597 -17279 -11050 15782 462 -17770 2268 12531 -10077 -14685 10574 10811 -16570 -9832 15374
610 15374 153 -16046 6383 13265 -11572 -10849 13952 11273 -10419 -3145 16360 2196 -12725
623 -12725 10784 18809 -8989 -9151 15906 9382 -11061 -54 15523 -1475 -14765 8083 16452
$$ packed form
532a0353J8218M739j8872j532J9512k928k2089R153K1060j6630j3559K0430L672
545A0821k1289K241J8290o297j8905Q616J7230j7076j4489K3330N747k4884M746
558a1919K2131j0887j5802J6994J4891j8697r626K4629M221k7087P734K5839j7649
571D772j8991K2852R400k5468k981K5325l312k6944R575K4358k0492j7234K8716
584I576O306l1113L466K6680r769k1385J5172J6730k2407j1833K8625L833l1160
597a7279O229K6832j5320j8232K0038J0263k2608m608K5259K37k7381O738K5206
610A5374j5221j6199K2429O882k4837P23K4801k679k1692P274J9505j4164j4921
623a2725K3509Q025k7798j62K5057o524k0443J1007J5577j6998j3290K2848Q369
$$ plain form
636 16452 -12405 -13024 15455 5946 -16951 56 14572 -7892 -17408 8355 13297 -15855 -15145
649 -15145 12822 1071 -22206 482 15231 -14087 -20117 9552 9478 -16500 -9011 15192 270
662 270 -19780 5639 19838 -9763 -12201 18491 11103 -13767 1644 20979 1600 -12113 11693
675 11693 19408 -8800 -8657 19628 8325 -15883 3409 18060 -6683 -14978 9344 11485 -13147
688 -13147 -9716 13387 1681 -19564 857 16069 -9373 -15008 10105 7780 -14612 -6480 13894
701 13894 1495 -17127 489 14117 -9887 -14941 11310 6856 -17729 -6272 13434 -1749
713 -1749 -16094 3084 13679 -8590 -12728 13901 9703 -15185 -873 19950 -300 -13292 9038
726 9038 15512 -7373 -7854 16274 9169 -15512 -806 19358 -3079 -14581 10844 12114 -13396
$$ packed form
636A6452k8857o19K8479r509k2897J7007J4516k2464r516K5763M942k9152P10
649a5145K7967j1751k3277K2688J4749k9318o030K9669p4k5978P489K4203j4922
662B70k0050K5419J4199k9601k438L0692p388k4870J5411J9335j9379j3713K3806
675A1693P715k8208J43K8285j1303k4208J9292J4651k4743q295K4322K141k4632
688a3147L431K3103j1706k1245K0421J5212k5442n635K5113k325k2392Q132K0374
701A3894j2399j8622J7616J3628k4004n054K6251m454k4585J1457J9706j5183
713a749j4345J9178J0595k2269m138K6629m198k4888J4312K0823k0250j2992K2330
726I038O474k2885m81K4128p105k4681J4706K0164k2437j1502K5425J270k5510
$$ plain form
739 -13396 -7420 14997 3792 -16297 -96 15706 -7164 -16011 10366 8986 -16608 -5518 14829
752 14829 -3117 -18086 2509 12992 -8908 -13955 9234 5817 -17072 -2913 16741 -4207
764 -4207 -16775 6988 13060 -8642 -8181 12836 7780 -11973 677 18228 -1515 -13148 11245
777 11245 14619 -8828 -5662 13320 4379 -11918 679 14337 -3868 -14761 6383 9775 -12820
790 -12820 -7269 12317 -684 -15757 -36 11091 -5609 -12547 6478 8207 -12793 -6601 13684
803 13684 47 -14854 3848 11855 -7817 -9969 9252 7102 -11420 -4092 13573 -306 -13966
816 -13966 5885 12565 -8453 -6495 13038 5451 -10945 580 15295 1112 -9925 7969 12421
829 12421 -8405 -4275 15417 3689 -12612 2253 12059 -4956 -11044 5844 7233 -11596 -7940
$$ packed form
739a3396N976K2417j1205k0089J6201J5802k2870q847K6377j380k5594J1090K0347
752A4829j7946j4969K0595J0483k1900n047K3189l417k2889J4159J9654k0948
764d207j2568K3763O072k1702M61K1017n056j9753J2650J7551j9743j1633K4393
777A1245L374k3447L166J8982q941j6297J2597J3658j8205j0893K1144L392k2595
790a2820N551J9586j3001j5073J5721J1127j6700o938J9025J729k1000O192K0285
803A3684j3637j4901J8702Q007j9672k152J9221k150j8522P328J7665j3879j3660
816a3966J9851O680k1018J958J9533p587j6396J1525J4715j4183j1037J7894M452
829A2421k0826M130J9692j1728j6301J4865R806j7015o088J6888J389j8829L656
$$ plain form
842 -7940 9693 -1696 -15711 1606 9895 -9093 -11464 6059 4923 -10477 -5220 9552 -404
855 -404 -13076 2685 10455 -8262 -9139 9123 4466 -10368 -2506 9384 -159 -8918 4834 11172
869 11172 -5566 -5955 12114 6960 -7298 3604 12710 -374 -5873 7790 10477 -4402 -4571 10427
883 10427 3835 -10201 1484 10090 -5298 -8920 5494 3976 -9646 -6012 6738 10 -11647
896 -11647 -1093 6777 -7908 -9833 6099 2540 -11008 -3365 6849 -1829 -9351 1367 7619
909 7619 -4996 -6875 7350 3773 -9047 831 10136 -1512 -7175 4376 7231 -3601 -3714 8161
923 8161 4321 -7349 1319 10625 -1324 -5215 7328 7152 -4331 -1774 7795 3315 -5678 969
937 969 7902 -3312 -7453 4794 3216 -8061 -3110 4680 -2136 -8063 -677 4093 -4261 -6687 3613
$$ packed form
842g940J7633j1389j4015J7317Q289j8988k371J7523j136j5400N257J4772r956
855d04j2672J5761P770j8717q77J8262m657j4834P862J1890r543q759J3752O338
869A1172j6738l89J8069n154j4258J0902R106j3084n499J3663K687j4879j69J4998
883A0427o592j4036J1685Q606j5388l622J4414j518j3622L634J2750o728j1657
896a1647J0554P870j4685j925J5932l559j3548P643J0214q678p522J0718O252
909G619j2615j879J4225l577j2820R878R305j1648n663J1551K855j0832j13J1875
923H161l840j1670Q668R306j1949l891J2543j76j1483K557R569m480q993O647
937I69O933j1214m141J2247j578j1277M951P790o816n927P386M770q354k426J0300
$$ plain form
952 3613 2493 -8212 -1704 6817 -1626 -5921 2940 4206 -4039 -3777 4910 3439 -5776 -1003 6839
967 6839 -1510 -5493 4801 4864 -4145 -1524 5776 2399 -3875 1004 7118 197 -4232 4578 4826 -4434
983 -4434 -481 6314 56 -4856 562 3424 -2381 -4832 1935 1430 -6591 -3141 3798 -2781 -6295
998 -6295 1040 1689 -4325 -3550 2089 973 -3917 -726 4953 -669 -4152 3545 4245 -2300 59 4424
1014 4424 1138 -2159 953 4337 827 -2505 2892 3453 -2943 -350 4715 384 -2032 1833 2340
1029 2340 -333 -1038 2032 2391 -1975 -906 3257 -905 -3729 1174 1183 -2937 -1992 -35 -1398 -3438
1045 -3438 -2172 861 -1550 -5020 -642 541 -3978 -1764 1741 -1399 -2708 -82 1427 -181 -1300
1060 -1300 2105 2877 -1411 281 4378 1143 -667 3264 2832 -24 1134 2572 1907 -211 977 3565
$$ packed form
952C613j120j0705O508Q521q443m295Q861J266q245K62Q687j471r215M773P842
967F839q349l983J0294O3r009K621P300l377o274M879O114o921m429Q810K48r260
983d434L953O795o258m912N418K862n805k451O767n05q021L450O939o579l514
998f295P335O49o014P75N639j116m890L191N679n622l483P697P00o545K359M365
1014D424l286l297L112L384l510l332N397N61o396K593N065m331k416L865N07
1029B340k673p05L070L59m366J069M163m162k824M903Rm120R45J957j363k040
1045c438J266L033k411l470M378J183m519K214L505l140j309K626J509j608j119
1060a300L405P72m288J692M097l235j810L931m32k856J158J438o65k118J188K588
$$ plain form
1076 3565 400 -1833 2384 1795 -1459 1370 2281 -785 -807 856 1131 -153 -948 369 -491 -3208 -697
1093 -697 335 -3343 -2568 -614 -3016 -3506 -1247 -1442 -2509 -2021 -769 -344 -2297 -1033 1697 -651
1109 -651 -1000 2499 911 -1223 963 2126 1517 811 733 1843 670 -408 2636 2299 -776 700 1811
1126 1811 44 751 1499 1335 638 -65 779 1717 -567 -279 1790 -796 -1227 1143 -231 -1830 -1134
1143 -1134 -94 40 -1882 -2024 209 -1890 -3017 1177 82 -4206 -1999 918 -770 -1860 -25
1158 -25 1046 -1487 -2260 2981 2844 -2550 521 4510 -52 -1356 3529 2794 -1401 -295 3907 1915
1174 1915 -2955 25 3726 -1481 -2461 3776 1191 -4504 -522 3261 -96 -2439 722 1915 -2383
1189 -2383 -2480 3547 1380 -4635 -422 2699 -2567 -2705 1650 196 -3486 -2311 1677 -208 -3960 -550
$$ packed form
1076C565l165k233M217n89l254K829R11l066k2J663K75j284p95J317q60k717K511
1093f97J032l678P75J954k402m90K259j95j067M88J252M25j953J264K730k348
1109f51l49L499j588k134K186J163o09p06p8J110j173j078L044l37l075J476J111
1126A811j767P07P48j64o97p03Q44R38k284K88K069k586m31K370j374j599O96
1143a134J040J34j922j42K233k099j127M194j095m288K207K917j688j090J835
1158b5J071k533p73N241j37n394L071L989m562j304M885p35m195J106M202j992
1174A915m870K980L701n207r80O237k585n695L982L783l357k343L161J193m298
1189b383r7O027k167o015M213L121n266j38M355j454l682J175L988j885l752L410
$$ plain form
1205 -550 2420 -2114 -2226 3249 1055 -2615 700 3647 1433 -1042 1428 3517 -191 -800 5078 3198
1221 3198 -3038 31 4090 638 -1623 1574 2593 -1879 -2950 2795 2490 -4636 -1912 3781 -1339
1236 -1339 -4627 1183 1978 -3581 -3384 2347 1139 -5121 -2384 3652 -1786 -5424 2150 2288 -5087 -3046
1252 -3046 3257 226 -4291 -229 3832 -1878 -4095 4149 4120 -3981 -536 6166 424 -2645 3958
1267 3958 5379 -1203 -1320 5043 3774 -3289 628 6299 -766 -3974 3816 3277 -3893 -1907 3714
1282 3714 803 -4365 -715 3381 -2278 -5146 2729 2678 -5519 -3125 3051 -700 -4445 -274 2603
1297 2603 -2825 -5280 1535 2500 -5122 -3196 3882 -668 -5237 794 3320 -2472 -3456 3013 3670 -3542
1313 -3542 -1668 6145 1612 -3694 3291 6016 -1761 -1880 5325 3784 -2467 69 5585 391 -4714
$$ packed form
1205e50K970m534j12N475k194l670L315K947k214k475K470K089l708o09N878j880
1221C198o236L069M059l452k261L197J019m472j071N745l05p126K724N693n120
1236a339l288N810P95n559J97N731j208o260K737O036n438l638P574J38p375K041
1252c046O303l031m517M062M061n710k217Q244k9q101L445O702n742l069O603
1267C958J421o582j17O363j269p063L917N671p065l208P790n39p170J986N621
1282C714k911n168L650M096n659k868P875n1q197K394O176l751l745M171K877
1297B603n428k455O815R65p622J926P078m550m569O031K526n792r84O469O57p212
1313c542J874P813m533n306O985K725p777j19P205j541o251K536N516n194n105
$$ plain form
1328 -4714 3064 5404 -4133 -3489 4674 754 -5532 -213 3958 -2265 -5497 1910 3469 -5361 -3796
1343 -3796 5032 -122 -6340 812 3795 -3706 -4582 3094 2627 -4855 -2838 4457 108 -5846 1925
1358 1925 4881 -3424 -3743 4405 2581 -3560 -257 5193 671 -4185 2669 5948 -2290 -2278 5652 2414
1374 2414 -3989 857 4987 -492 -3837 2092 3996 -3835 -3818 4166 1186 -6011 -197 4074 -3156
1389 -3156 -5144 2165 2500 -4183 -3233 3994 750 -6088 395 5184 -2646 -4527 3641 2429 -4474
1404 -4474 -1617 4833 613 -4923 872 5103 -2515 -3759 5052 3028 -4627 98 5597 36 -3382
1419 -3382 2768 5333 -1979 -2926 5057 3081 -4843 357 5858 -1509 -4570 2350 2742 -3861 -3015 3358
1435 3358 594 -6267 -1494 4041 -2908 -5399 2439 1872 -5238 -2403 3433 48 -4815 21 4220
$$ packed form
1328d714P778K340r537O44Q163l920o286N319M171o223l232P407J559q830J565
1343c796Q828n154o218P152K983p501q76P676m67p482K017P295m349n954P771
1358A925K956q305l19Q148j824o141L303N450m522m856O854L279q238J2P930l238
1374B414o403M846M130n479l345N929J904p831J7P984k980p197N814M271p230
1389c156j988P309L35o683R50P227l244o838O483M789p830j881Q168j212o903
1404d474K857O450m220n536N795M231p618j244Q811k024p655M725N499n561l418
1419c382O150K565p312r47P983j976p924N200N501p367l061O920L92o603Q46O373
1435C358k764o861M773N535o949k491P838n67p110K835N836l385m863M836M199
$$ plain form
1450 4220 -2049 -4355 3560 3172 -4268 -743 5011 -202 -3861 1917 4431 -1515 -2918 4162 3314
1465 3314 -3861 15 6330 245 -3435 3176 4420 -2227 -1641 4493 2729 -3449 -552 5013 -765
1480 -765 -4596 2472 3144 -4506 -2898 2781 -278 -5223 -1018 3007 -2339 -5478 1124 2016 -5032 -2517
1496 -2517 3944 -446 -4813 548 3204 -1796 -3375 2600 2877 -3807 -1652 4764 397 -3981 2079
1511 2079 4299 -2104 -2093 3439 2619 -2718 -238 5028 679 -3501 2682 4603 -1791 -1299 4363 1649
1527 1649 -3163 484 4190 -139 -3598 1449 2972 -3529 -2808 3238 2 -4710 -599 2257 -2510
1542 -2510 -3983 1102 1921 -3728 -2929 2840 206 -4411 737 3398 -2046 -2688 2388 1989 -2632 -808
1558 -808 3623 1020 -3623 1052 3732 -1631 -2150 3499 1811 -2575 -41 3485 503 -2310 1623
$$ packed form
1450D220o269k306P915l88p440L525N754n213l659N778K514n946j403P080q48
1465C314p175L876O315o085l680O611J244o647N86O134j764o178K897N565n778
1480g65l831P068O72p650J608N679l059m945M205M025n346l139O602Q92p048K515
1496b517O461m390m367N361K656n000j579N975K77o684K155O416m367m378O060
1511B079K220o403J1N532q20n337K480N266m349m180O183J921o394M92N662k714
1527A649m812L647L706m329l459N047J523o501P21O046l236m712M111K856m767
1542b510j473N085Q19n649P99N769k634m617N148K661n444o42N076l99m621J824
1558h08M431k603m643M675K680n363n19N649j688m386K534L526k982k813L933
$$ plain form
1573 1623 3418 -1734 -2233 3477 1657 -2928 308 3174 -1197 -2784 1231 2173 -2428 -2567 2201 333
1589 333 -4335 -571 2540 -2195 -3230 1351 974 -2889 -1542 2217 694 -2906 217 3002 -961
1604 -961 -2095 2901 2119 -1887 199 2938 458 -1544 1294 3185 -432 -1888 2235 1657 -2249 186
1620 186 2986 -257 -1942 972 1739 -1068 -1611 1622 1474 -2453 -817 2376 -937 -2541 795 1057
1636 1057 -2274 -2097 589 -85 -2801 -1435 1709 -1363 -3497 667 1312 -2449 -1180 1821 128 -1925
1652 -1925 301 2255 72 -1517 2020 2595 -1547 73 3390 666 -1120 1495 2221 -266 -489 1842
1668 1842 1685 -1329 -305 2600 -9 -1755 1255 1546 -939 -566 979 -44 -1276 -378 1323 -461
1684 -461 -2101 -167 414 -1953 -1053 472 -1011 -2136 -1120 -229 -960 -1626 -607 248 -1624 -1090 882
$$ packed form
1573A623J795n152m99N710j820m585L236K866m371j587M015R42m601j39M768j868
1589C33m668L764L111m735j035M581l77l863J347L759j523l600L123K785l963
1604i61j134M996p82m006K086K739k480k002K838J891l617j456M123n78l906K435
1620A86K800l243j685K914P67k807n43L233j48l927J636L193l313j604L336K62
1636A057l331J77K686o74k716J366L144l072k134M164O45l761J269L001j693k053
1652a925K226J954k183j589L537N75m142J620L317k724j786K615P26k487k23K331
1668A842j57l014J024K905k609j746L010K91k485L73J545j023j232Q98J701j784
1684d61j640J934N81k367R00J525j483j125J016Q91p31o66J019Q55j872N34J972
$$ plain form
1701 882 -28 -1067 485 1221 354 61 721 1330 372 139 2088 1494 -650 649 2000 526 261 1003
1719 1003 803 -476 -456 1340 1225 -892 -303 1242 -639 -929 1220 465 -1186 -486 366 -190 -1358
1736 -1358 -634 470 -1097 -1408 447 -433 -1993 -393 139 -956 -777 -270 -619 -1040 -492 650 226
1753 226 -912 68 685 -450 687 1583 141 185 743 696 684 834 465 478 247 498 706 133 11 478
1773 478 -113 81 434 -693 -403 106 -187 -161 116 -552 -424 -325 111 189 -810 -863 -126 -626 -955 265 -57
1794 -57 -1147 -605 -107 -322 -337 -29 50 -9 -431 668 890 -158 301 969 614 665 801 507 609 611 562 1189
1816 1189 322 -182 586 180 166 164 -209 -203 -331 -609 76 -98 -1054 -622 -101 -1085 -540 291 -503 -857 -690
1837 -690 -110 -7 -1132 -388 396 -1082 -871 725 -549 -1442 -45 623 -370 -503 357 533 -506 25
$$ packed form
1701H82r10j039J552P36q67k93O60O09r58k33J949n94k144J299J351j474k65P42
1719A003k00j279K0J796j15k117N89J545j881k90K149p55j651P00Q52n56j168
1736a358P24J104j567l11J855q80j560J600N32j095J79N07l49m21N48J142m24
1753B26j138R80O17j135J137Q96j442M4N58m7j2J50l69J3k31K51K08n73j22M67
1773D78n91J94L53j127K90N09k93K6K77o68J28R9M36P8r99n3P37n00l29J220l22
1794e7j090N42M98k15j5L08P9n9m22J099K22j048M59O68l55N1J36k94J02Km9O27
1816A189q67n04P68m06j4kl73Oj28k78O85j74r56M32N21r84N45Q31p94l54J67
1837f90N80J03j125P44P84j478K11J596j274q93J397O68r93j33Q60J76j039N31
$$ plain form
1855 25 1845 568 -879 1134 1638 -217 514 2014 880 -384 661 1723 620 -525 996 1220
1871 1220 -1035 -387 1234 -189 -1407 99 317 -1045 -1460 -289 1 -1570 -1100 710 -666 -2039
1887 -2039 -198 426 -949 -883 166 15 -1137 -915 827 286 -1411 -44 898 -966 -734 1157 688
1904 688 -597 -82 1287 924 -719 827 2064 238 -243 2192 1285 -726 646 2066 533 -646
1920 -646 670 1426 -611 -1103 1493 668 -2155 -502 1439 -934 -1781 457 531 -1708 -1361 835 91
1937 91 -2303 -568 1336 -1183 -1850 837 401 -1822 -725 998 -81 -1894 -158 1502 -533 -1197
1953 -1197 1629 1062 -1558 110 2115 416 -816 725 1808 -191 -849 1793 1763 -1098 126 2108
1969 2108 -97 -1134 1211 1243 -806 -852 971 473 -1682 -648 1489 -827 -2125 694 721 -2051 -1052
$$ packed form
1855B5J820j277j447K013N04j855P31J500j134j264J045J062j103j145J521K24
1871A220k255O48J621j423j218J506K18j362m15J171K90j571M70J810j376j373
1887b039J841O24j375O6J049j51j152K22J742n41j697J367R42j864K32J891m69
1904F88j285N15J369l63j643J546J237j826m81K435r07k011J372J420j533j179
1920f46J316P56k037m92K596q25k823J653J941k373q47K238P4k239L47K196p44
1937I1k394J735J904k519o67K687m36k223J097J723j079j813J736J660k035o64
1953a197K826n67k620J668K005j699j232J541J083j999o58K642l0k861J224J982
1969B108k205j037K345L2k049m6J823m98k155J034K137k316j298K819K7k772R99
$$ plain form
1986 -1052 1017 118 -1834 -606 1375 -435 -1685 1016 1422 -1602 -698 1904 145 -1485 283 1817
2002 1817 -482 -1499 1155 1617 -1379 -581 2470 251 -1583 1046 1923 -486 -761 1680 1342 -1268
2018 -1268 -346 2226 397 -1817 827 1442 -1709 -1338 1373 441 -1995 -857 1118 -785 -2478 291
2034 291 1128 -1817 -1616 1238 -73 -2166 104 1565 -523 -1591 1053 1560 -1285 -969 2262 667
2050 667 -1810 632 1957 -563 -920 1393 1568 -1006 -625 2034 627 -1628 816 2330 -697 -1007
2066 -1007 1814 1094 -1150 -198 1876 17 -1835 253 1642 -1299 -1745 1151 95 -2425 -1075 1136
2082 1136 -840 -2131 -216 832 -1588 -1884 999 449 -2458 -276 1547 -732 -1536 1131 1594 -1100
2098 -1100 -786 1771 846 -1380 369 2366 -306 -1175 1655 1451 -1041 -150 1858 681 -1241 466
$$ packed form
1986a052K069q99j952J228J981j810j250K701M06l024R04K602j759j630J768J534
2002A817k299j017K654M62k996P98L051k219j834K629Q77k409k75K441l38k610
2018a268R22K572j829k214K644O15l151L71K711r32k436J138J975j903j693K769
2034B91Q37k945K01K854j311k093K270J461k088j068K644N07k845L16L231j595
2050F67k477K442J325k520l57K313J75k574L81K659j407k255K444J514l027l10
2066a007K821p20k244R52K074j859j852K088J389k941m46K896j056k520J350K211
2082A136j976j291J915J048k420k96K883n50k907K182J823k279q04K667M63k694
2098a100L14K557r25k226J749J997k672q69K830k04k492Q91K008j177j922J707
$$ plain form
2114 466 2046 -434 -1166 1870 1358 -1510 -252 1722 62 -1432 389 1213 -914 -1690 928 718
2130 718 -2174 -916 1373 -928 -2108 147 716 -1313 -1397 817 584 -1864 -669 1825 -279 -1673
2146 -1673 1064 1402 -1096 -643 1543 703 -1188 109 1843 -58 -1426 1107 1709 -1096 -489 1869
2162 1869 337 -1272 332 1727 -289 -1192 911 1367 -1163 -691 1943 287 -1657 383 1321 -975
2178 -975 -1347 833 522 -1383 -925 1190 -322 -2124 405 1193 -1516 -1171 987 364 -1400 -131 1273
2195 1273 -7 -1361 851 1501 -824 -586 1633 638 -1126 346 1338 -26 -740 827 1400 -717
2211 -717 -944 1330 663 -1294 144 1255 -597 -999 666 792 -751 -724 889 227 -1697 -131 1227
2228 1227 -753 -1510 593 341 -1194 -716 669 -91 -1593 -273 1065 -797 -1381 976 738 -1260
$$ packed form
2114D66J580k480p32L036n12k868J258J974j660j494J821Q24k127p76K618k10
2130G18k892J258K289k301j180K255N69k029q4K214k33k448J195K494k104j394
2146a673K737L38k498M53K186q40j891J297J734j901j368K533O02k805O07K358
2162A869j532j609J604J395k016r03K103M56k530M72K634j656j944K040R38k296
2178i75l72K180l11j905M58K115j512j802K529P88k709L45K158o23j764J269J404
2195A273j280j354K212O50k325K38K219r95j764J472R92j364p14J567N73k117
2211g17k27K274o67j957J438J111j852m02J665J26j543K7J613o62j924J566J358
2228A227j980p57K103k52j535M78J385p60j502J320J338j862n84K357k38j998
$$ plain form
2244 -1260 -116 1166 23 -727 580 1523 -11 -835 1365 1006 -954 424 1980 78 -532 758
2260 758 1048 -550 -410 1195 439 -1148 -60 1180 -463 -1151 667 298 -1053 -426 570 -232 -1292
2277 -1292 -251 698 -669 -1370 210 141 -1209 -405 629 -677 -1299 -219 447 -395 -857 300 558
2294 558 -841 -196 1219 332 -414 539 1007 159 111 781 1069 -55 36 1504 578 -667 525 1119 -389
2313 -389 -440 640 405 -503 -100 979 224 -1001 55 682 -722 -782 907 -64 -1082 -313 388 -336
2331 -336 -903 -98 270 -1090 -848 567 -136 -1165 -111 232 -657 -700 163 100 -502 -262 912 376 -525
2350 -525 439 914 -226 269 1155 430 -14 226 787 297 41 354 663 -243 -331 701 24 -613 -107 130
2370 130 22 -506 -309 150 -145 -700 44 73 -685 -195 121 -165 -506 -132 47 -315 -624 186 398 -522
$$ packed form
2244a260J144J282j143p50J307R43j534q24K200l59j960J378J556j902o10J290
2260G58K90j598J40J605p56j587J088J240j643o88J818l69j351O27R96q02j060
2277a292J041R49j367p01J580o9j350Q04J034j306o22J080O66q42m62J157K58
2294E58j399O45J415q87p46R53M68q48m8O70K88j124R1J468r26j245J192N94j508
2313c89n1J080k35r08M03J079p55j225J056O27j404o0J689r71j018P69P01p24
2331c36n67Q05L68j360K42J415p03j029J054L43q89m3Q63o3o02K40J174n36r01
2350e25R64M75j140M95Q86p25m44K40N61m90k56L13L09r06q8J032o77o37N06K37
2370A30j08n28J97M59k95n55P44K9p58M90L16k86l41L74J79l62l09Q10K12r20
$$ plain form
2390 -522 -455 401 -150 -466 234 411 -217 -265 342 454 -111 -154 783 161 -334 722 686 -277 180 533 193
2411 193 -321 144 278 -34 -310 234 234 -862 -393 205 -398 -324 -109 -190 -311 -472 -188 213 -369 -440 95
2432 95 -193 -504 227 -16 -372 -185 -58 64 70 -119 94 157 -173 61 324 213 116 472 311 606 385 250
2454 250 640 249 256 727 440 -44 369 315 2 -24 -83 -46 -196 -565 -153 72 -591 -359 52 -536 -437 -196
2476 -196 -450 -505 -328 -188 -126 -537 -147 236 -344 -215 115 132 -216 154 263 53 -3 -164 382 192 -32
2497 -32 603 492 49 295 404 337 191 244 461 522 260 220 723 189 130 500 277 -171 -1 -108 8 -323
2519 -323 -312 195 -326 -509 -98 -57 -740 -277 -33 -529 -569 -161 129 -134 -619 -116 98 -555 -194 577 -113
2540 -113 -354 120 170 -141 -53 176 380 -187 -127 614 253 -66 587 527 -139 201 538 232 130 215 662 186
$$ packed form
2390e22O7Q56n51l16P00J77o28m8O07J12n65m3R37o22m95J056l6r63M57L53l40
2411A93n14M65J34l12k76N44%j096M69N98o03P4K15q1j21j61K84M01n82p1N35
2432I5k88l11P31k43l56J87J27J22Oj89K13O3l30K34K63j11r7L56j61K95k21j35
2454B50L90l91PM71k87m84M13n4l13k6n9L7j50l69M12K25o63K32M11n88R9K41
2476a96k54n5J77J40O2m11L90L83n80J29L30J7l48L70J09k10n6j61N46j90k24
2497c2O35j11m43K46J09o7j46N3K17O1k62m0N03n34n9L70k23m48J70j07J16l31
2519c23J1N07n21j83M11M1o83M63K44m96m0M08K90k63m85N03K14o53L61P71o90
2540a13k41M74N0l11Q8K29K04n67O0P41l61l19O53o0o66L40L37l06j02Q5M47m76
$$ plain form
2562 186 -386 432 401 -350 -143 336 -263 -485 -375 -15 -314 -594 -182 77 -668 -501 209 -69 -480 75
2582 75 233 -226 -279 194 148 -327 -236 553 200 -420 233 637 -144 -205 369 338 -279 -100 561 315 -303 95
2604 95 525 -193 -130 741 251 -260 14 545 17 -403 215 450 -301 -577 329 -37 -759 -168 180 -178 -643
2625 -643 -99 171 -572 -458 218 239 -775 -168 674 -84 -396 332 515 -256 -210 382 442 -271 237 819 -106
2646 -106 -302 567 467 -299 4 584 337 -229 58 709 241 -355 466 660 -343 -101 736 31 -422 -107
2666 -107 253 -278 -727 50 160 -729 -704 341 -434 -905 10 66 -660 -679 78 -37 -480 -348 700 -64
2686 -64 -756 306 651 -155 -81 767 319 -375 -12 929 299 -235 615 815 -236 -148 832 185 -411 85
2706 85 566 -38 -384 257 532 -427 -369 629 60 -637 81 450 -387 -505 118 29 -721 -525 191 -3 -1119
$$ packed form
2562A86n72Q18l1p51K07M79n99k22J10L60k99k80M12K59p45J67P10k78m11N55
2582G5J58m59n3M73m6m75R1P89l53o20O53M04p81o1N74l1o17J79O61k46o18L98
2604I5M30p18O3Q71m90n11K74N31n28m20O18K35p51k76R06l66p22N91L48l58m65
2625f43N44K70p43J14O76K1j014O07Q42p58l12P28J83p71M6N92O0p13N08N82r25
2646a06j96Q69j00p66L03N80k47n66K87O51m68n96Q21J94j003K42Q37p05m53L15
2666a07L60n31m49P77J10q89K5J045p75m71R15N6p26j9P57j15m43J32J048p64
2686f4o92J062L45q06P4Q48m48o94L63R41o30n34Q50K00j051Q8R80o47n96M96
2706H5M81o04l46O41K75r59N8R98n69o97P18L69q37j18O23q9p50J96P16j94j116
$$ plain form
2727 -1119 -124 346 -847 -688 130 87 -623 -223 478 190 -640 -105 674 -279 -390 613 424 -158 210
2746 210 654 165 -356 363 726 -191 -363 592 451 -570 49 717 -207 -377 131 419 -320 -480 372 387
2766 387 -603 -196 741 -325 -673 381 334 -549 -387 324 -199 -682 -287 382 -400 -895 412 82 -784
2785 -784 -272 794 100 -419 227 578 -141 -148 566 695 -462 27 836 64 -304 394 493 -161 -171 354 540
2806 540 -266 -197 635 -80 -629 259 494 -436 -432 260 77 -576 -185 415 -309 -818 274 539 -516 -494 444
2827 444 85 -565 -189 228 -56 -734 282 591 -417 -401 610 235 -665 360 543 -5 -128 552 613
2846 613 -146 -79 721 254 -443 486 550 -310 -400 541 206 -306 -78 356 -195 -624 66 284 -476 -620 371
2867 371 -187 -632 -239 230 -357 -552 1 391 -511 -500 476 -31 -459 -1 511 -123 -252 225 438 -124
$$ packed form
2727a119R95M70j193J59Q18m3p10M00P01k88q30N35P79r53j11J003j89n82L68
2746B10M44m89n21P19L63r17j72R55j41j021O19O68r24j70N08K88p39j60Q52J5
2766C87r90M07R37j066l48J054m7q83J62P11n23m83L95O69p82m95J307l30q66
2785g84N12J066o94n19O46L51p19pP14J29j157M89Q09p72l68O98R9o54j0N25J86
2806E40q06O9Q32p15n49Q88K35r30MO92j83o53L91O00p24n09J092K65j055K2R38
2827D44l59o50L76M17k84o78J016L09j008J6J011l75r00J025J83n48j23O80O1
2846F13p59O7Q00m67o97R29O4q60r0R41l35n12K28M34n51m29O90K18p60j44R91
2867C71n58m45L93M69n87j95N53L90r02J1R76n07m28M58N12o34j29M77K13n62
$$ plain form
2887 -124 -228 310 172 -357 332 853 43 -240 490 439 -88 106 505 473 -341 113 876 35 -347 371 164
2908 164 -433 -199 567 52 -527 -1 283 -223 -641 174 115 -562 -369 425 -249 -864 -92 229 -178 -514
2928 -514 54 136 -660 -289 586 -6 -507 48 185 -352 -94 394 49 -276 238 690 37 -244 408 464 -169
2949 -169 -90 582 50 29 69 499 206 -128 213 311 -253 -208 418 -86 -472 -133 130 -159 -337 58 95 -346
2971 -346 -299 246 159 -345 -34 145 -129 -195 217 233 -256 -391 267 157 -427 -17 423 -170 -204 363 244 -341
2993 -341 59 307 188 -218 79 275 -204 -182 623 334 -381 153 339 -116 -199 -100 298 -161 -302 170 137
3014 137 -413 74 95 -274 -307 108 -13 -456 -228 -83 -10 -272 0 136 -139 -221 245 135 -292 -130 196
3035 196 55 80 -41 186 -73 -275 125 225 -29 184 219 -36 -157 193 246 77 -81 193 266 -106 -62 105
$$ packed form
2887a24j04N38j38n29O89N21q10k83P30n1n27J94L99l2q14M54P63q41l82P18k07
2908A64n97K34P66n15n79N26K84n06m18Q15n9o77J93P94o74o15P72L21m07l36
2928e14N68Q2p96L71Q75n92n01N55J37n37K58M88l45l25N14M52o53k81O52N6o33
2949a69P9O72n32k1M0M30k93l34L41R8n64M5O26n04l86L39K63k89j78L95L7m41
2971c46M7N45q7n04L11J79k74o6M12J6m89j35O58j10n84M10M40n93l4N67j19n85
2993c41M00K48j19m06K97J96m79K2Q05k89p15N34J86m55q3R9L98m59j41M72l3
3014A37n50M87K1l69l3M15j21m43K28J45P3k62K72J36k75q2M66j10m27J62L26
3035A96j41K5j21K27k59k02M00J00k54K13L5k55j21L50N3j69j58K74P3l72M4J67
$$ plain form
3057 105 -3 -281 -122 -12 -153 -246 -121 115 -110 -449 -8 -282 -418 -88 185 -316 -218 69 63 -303 -172
3078 -172 219 150 -291 -18 146 -141 -25 355 238 -11 126 191 12 79 177 315 107 -63 277 239 -27 208
3100 208 192 150 -56 -23 233 178 85 108 -61 -211 20 170 -267 -46 14 -250 -238 -215 -131 -85 -316 -342 -66 -252
3124 -252 -339 122 -145 -46 -169 -84 35 -130 -32 274 27 -91 108 237 -72 115 178 291 53 -7 251 103
3146 103 -11 118 334 134 -34 347 18 -94 122 157 -101 -91 -65 129 125 -151 234 -125 -265 -284 -28 78
3168 78 -273 -171 -100 -183 -304 -141 77 -214 -161 -3 -119 -106 27 113 32 -49 126 192 -2 -64 291 174 -50
3191 -50 44 354 115 33 145 219 154 71 75 211 -192 212 269 -92 78 167 40 8 20 -44 62 -210 -287 48 -70
3216 -70 -404 194 -4 -529 -65 -17 -129 -136 -215 168 -92 -189 233 307 -229 90 360 177 -165 25 223 179 -91
$$ packed form
3057A05j08k78J59J10j41r3J25K36k25l39M41k74j36L30K73n01R8K87ol66J31
3078a72L91o9m41K73J64k87J16L80j17k49J37O5j79O7R8J38k08j70L40l8k66K35
3100B08j6m2k06L3K56n5r3K3j69j50K31J50m37K21O0k64J2K3Q4M6k31k6K76j86
3124b52q7M61k67R9j23Q5J19j65R8L06k47j18J99J29l09J87O3J13k38o0K58j48
3146A03j14J29K16k00j68L81l29j12K16L5k58J0K6J94mk76L85l59j40j9K56J06
3168G8l51J02P1q3j21J63K18k91N3J58j16J3J33Q6q1q1J75O6j94o2L55j17k24
3191e0R4L10k39q2J12P4o5q3MJ36m03M04N7l61J70Q9j27l2J2o4J06k72p7L35j18
3216g0l34N98j98n25M64M8j12pp9L83k60r7M22P4n36L19K70j83l42J90J98m4k70
$$ plain form
3239 -91 76 282 -45 162 374 -43 -95 149 108 59 -196 168 254 -97 -225 222 2 -310 11 328 -126 -182
3261 -182 -86 126 -304 -384 -19 -19 -210 17 -18 -217 -154 17 162 -322 -154 150 74 -248 34 381 -220 -184 481
3284 481 412 -165 227 356 149 -29 245 542 -8 86 178 107 -110 104 412 39 -143 122 84 -255 -365 72
3306 72 20 -322 -128 166 -243 -375 169 29 -332 -194 94 -37 -371 -284 56 -147 -492 145 58 -276 105
3327 105 111 54 -128 91 339 85 -77 46 376 -153 59 615 278 53 151 263 -68 -68 228 280 -59 -40 221
3350 221 25 -281 204 224 -190 -112 143 71 -160 -239 319 -109 -427 112 170 -262 -357 362 13 -233 -207 160
3372 160 -42 -355 124 156 -353 -190 241 89 -205 170 349 -14 -30 210 321 -131 58 305 143 -140 194
3393 194 418 -66 -18 464 184 -225 110 67 163 -227 109 258 -36 -295 2 101 -291 -233 262 41 -223 -33
$$ packed form
3239i1J67K06l27K07K12m17n2K44m1m9k55L64Q6l51j28M47k20l12L21L17m54n6
3261a82R6K12m30q0L65%j91K27l5j99O3J71J45m84J68L04p6l22K82L47o01L6O65
3284D81o9n77L92J29k07j78K74K97n50R4R2p1k17K14L08l73j82K65l8l39j10M37
3306G2n2l42J94K94m09j32N44j40l61J38K88j31l34Q7L40k03l45O37q7l34L81
3327A05On7j82K19K48k54j62J23L30n29K12N56l37k25R8J12l31%K96N2l39J9K61
3350B21j96l06M85K0m14P8K55p2k31p9N58m28l18N39N8m32r5P19l49k46K6L67
3372A60k02l13M79L2n09J63M31j52k94L75J79l63j6K40J11m52J89K47j62k83L34
3393A94K24m84M8M82k80m09L35m3R6l90L36J49k94k59K97R9l92N8M95k21k64J90
$$ plain form
3415 -33 87 -104 -355 281 122 -400 -224 336 -103 -269 133 377 -244 -415 114 326 -285 10 294 -46
3435 -46 -313 453 411 -2 -186 265 239 -94 -37 318 94 -444 264 353 -161 -109 114 -114 -398 49 182 -425
3457 -425 -324 48 80 -235 -250 295 -161 -398 -25 77 -169 -316 -69 248 -115 -32 243 34 -271 221 385
3478 385 -217 -102 129 153 -84 -26 392 192 -160 227 451 -147 77 260 249 43 82 273 274 -234 120 369
3500 369 -178 -159 97 72 -344 43 60 -212 -340 -75 115 -289 -465 71 -12 -400 -36 193 -320 -142 61
3521 61 -30 -218 -179 142 68 -276 52 442 -5 -302 353 188 -12 120 353 136 -224 257 487 143 67 458
3543 458 354 -152 272 395 -21 -125 126 57 -186 -346 -21 43 -174 -137 99 -261 -350 99 -177 -294 -189
3564 -189 -89 1 -331 -122 182 -40 -99 90 89 -208 -97 164 36 -52 41 177 73 -195 152 191 -153 -36
$$ packed form
3415c3J20j91k51O36j59n22J76N60m39j66M02K44o21j71N29K12o11K95K84l40
3435d6k67P66m2m13j84M51k6l33N7L55k24n38P08Q9n14N2K23k28k84M47J33o07
3457d25J01L72L2l15j5N45m56k37L73J02k46j47K47L17l63Q3K75k09l05M92J64
3478C85o02J15K31K4k37N8M18k00l52L87K24n98K24J83j1k06L9J91Jn08L54K49
3500C69n47J9K56k5m16L87J7k72j28K65J90m04j76N36q3l88L64K29n13J78K03
3521F1r1j88L9L21p4l44L28L90m47k97O55j65k00J32K33k17l60M81K30l44p6L91
3543D58j04n06M24J23m16j04K51o9k43j60L25O4k17L7K36l60q9M49k76j17J05
3564a89J00R0l32K09L04k22n9J89jk97J11K61j28q8R3J36j04k68L47L9l44J17
$$ plain form
3586 -36 315 -27 -170 223 282 164 -180 211 247 -359 -132 464 11 -284 -33 193 -246 -140 190 218 -327
3607 -327 -441 262 38 -497 109 247 -202 -158 301 -4 -571 -13 -196 134 -49 338 1051 271 48 196
3627 196 412 -112 277 83 246 -53 142 219 -112 -110 459 -43 -142 32 328 -274 17 266 190 -125 -100 154
3649 154 -39 -350 -1 89 -292 -400 -63 -100 -197 -221 -87 18 -309 -290 149 -28 -235 26 164 -78 7 148
3671 148 61 11 152 169 11 -100 346 159 -221 152 465 35 -188 147 161 37 -129 22 190 -8 -93 320
3693 320 21 -169 160 146 -176 -38 65 8 -255 -150 167 -126 -353 -131 170 -341 -323 -195 -106 -123 7 -54
3715 -54 -7 -455 -70 305 -196 -55 194 84 -63 93 243 141 -1 -51 285 32 -132 242 178 -138 232
3736 232 357 -113 10 39 98 165 -39 6 86 -74 -18 250 37 -4 -2 -226 -201 83 -9 73 -198 -195 121 -234 -201
$$ packed form
3586c6L51l42j43L93N9j18l44L91L6o06K27N96m53k95K51K26m39J06L30K8n45
3607c27j14P03k24n35O06J38m49M4M59l05n67N58j83L30j83L87P13p80k23J48
3627A96K16n24L89j94J63k99J95P7l31KN69n02r9J74K96o02K91K49p6l15K5K54
3649A54j93l11L49R0l81j08L37l7r7k4J34J05l27J9M39j77k07K61J38k42Q5J41
3671A48q7n0J41J7j58j11M46j87l80L73L13m30k23L35J4j24j66J51J68j98q5M13
3693C20k99j90L29j4l22J38J03n7k63J05L17k93k27K22L01n11J8J28Q9j7J30o1
3715e4M7m48L85L75n01J41K49j10j47J56J50j02j42n0L36k53j64L74o4l16L70
3736B32J25m70J23K9N9O7k04M5Q0j60N6K68k13m1Kk24K5K84r2Q2k71LL16l55L3
$$ plain form
3761 -201 -9 -28 -159 -80 -199 -213 -9 -162 134 -33 -241 179 -71 46 -39 163 13 -9 27 46 84 -6 152
3784 152 72 -1 -62 276 199 -133 73 97 64 93 31 13 -125 -84 -28 -158 -238 136 263 -40 -88 -127 1 -174 55
3809 55 -98 93 -240 -134 133 -95 -277 106 -36 -175 -71 174 54 94 -92 47 227 -15 303 205 53
3830 53 114 262 73 9 45 155 136 -198 158 125 -179 65 282 -227 20 75 -39 -16 -64 -130 30 -71 -64 74
3854 74 -181 -137 -109 -55 -229 -94 -135 19 -139 -32 4 -66 -164 -39 69 -23 155 271 93 45 230 22 116 -122
3878 -122 105 95 159 47 67 181 110 272 119 192 0 106 229 -36 -62 78 203 -362 -130 139 -240 -287
3900 -287 5 123 -130 -180 186 34 -300 -154 -17 -223 -230 87 18 -186 -119 -113 -109 -133 -130 8 5 -245 140 181 70
3925 70 -11 235 121 69 89 198 206 -56 199 382 54 40 143 -2 -83 126 101 156 -185 13 8 -155 -223 72
$$ packed form
3761b01J92j9j31P9j19j4K04j53K96j67k08M20k50J17q5K02j50k2L6J9L8r0J58
3784A52q0p3o1L38p7l32K06K4l3K9o2j8j38M1N6j30q0L74J27l03m8l9J28j75K29
3809E5j53J91l33J06K67k28j82L83j42j39J04K45j20M0j86J39J80k42L18r8j52
3830E3O1J48j89o4L6J10j9l34L56l3l04K44K17n09K47N5j14K3m8o6J60j01PJ38
3854G4k55M4K8N4j74J35m1J54j58J07L6p0r8J25J08r2J78J16j78m8J85k08R4k38
3878a22K27j0O4j12K0J14p1J62j53P3j92J06J23k65k6J40J25n65K32K69l79m7
3900b87K92J18k53n0L66j52l34J46J37k06pL17o9k04O7OMk4LJ38lk50L85M1j11
3925G0q1K46j14n2K0J09Qk62K55J83l28j4J03j45q1K09k5N5l41J98nj63o8K95
$$ plain form
3949 72 -81 -160 63 212 -187 -183 -156 125 -105 -220 43 -25 -225 -171 167 -130 -342 120 -50 -57 -84 119 -18
3972 -18 -223 -43 278 100 -94 158 156 -84 151 326 82 34 203 259 101 -26 112 301 -137 100 -29 -87
3994 -87 -72 78 -129 -54 -251 -188 -89 -174 -139 138 -11 -291 142 76 -59 -137 92 54 -106 -134 207 182 -243 154
4018 154 53 75 11 7 22 -119 9 165 193 -119 22 350 -111 118 411 188 -179 241 131 -27 -67 30 297
4041 297 -258 -193 270 47 -192 156 32 83 -38 140 17 -244 -324 34 46 -438 48 51 -231 -61 250 112
4063 112 -248 122 -81 206 -109 40 90 -287 -77 177 25 -123 19 135 -120 -13 98 105 49 110 276 236
4085 236 -96 -39 170 24 -2 9 19 49 -229 -24 86 -240 -102 -75 -142 -423 -70 -64 -182 -113 51 27 -220 -323
4109 -323 95 -123 -355 61 134 -234 -13 121 27 -202 60 298 -16 -142 225 281 -129 -6 290 100 -307
$$ packed form
3949G2j53p9K23J49l99MK7K81k30j15K63o8k00N4L38k97k12M62j70pk7K03j37
3972a8k05J80L21j78j94K52kk40K35J75k44m8J69N6j58j27J38J89m38K37j29n8
3994h7J5J50k07P5j97O3R9q5L5K77j49k80M33o6j35p8K29l8j60k8L41k5m25L97
4018A54j01K2o4mJ5j41J28J56K8l12J41L28m61K29K93k23l67M20j10j58m0R7K67
4041B97n55O5M63k23k39L48j24N1j21J78j23k61q0L58J2m84M86Lk82J70L11j38
4063A12l60L70k03K87l15J49N0l77K10K54j52j48J42J16k55J07J11Pn6O1J66m0
4085B36l32N7K09j46k6J1J0L0k78K05J10l26J38K7o7k81L53Oj18O9J64k4k47j03
4109c23M18k18k32M16P3l68K21J34r4k29K62K38l14j26L67N6m10J23K96j90m07
$$ plain form
4130 -307 114 36 -72 -142 135 303 -87 -139 373 29 -171 362 70 -198 -126 22 -55 -197 -133 -24 -35 -322
4152 -322 -41 59 -185 -229 -4 -190 -119 -44 58 -4 -53 56 210 -119 -148 300 112 -135 205 67 -158 -132
4174 -132 104 169 36 -107 369 237 -158 87 372 51 -212 89 270 -96 -131 219 191 -209 25 239 -202
4195 -202 -346 103 -65 -206 -47 54 -97 -331 -115 36 -314 -333 14 25 -175 -54 33 -188 -27 72 216
4216 216 -108 -218 156 148 -305 122 283 -65 -156 208 70 -118 -15 172 170 -46 -22 470 -29 -274 110 97
4238 97 -119 -63 43 35 -173 -49 117 -103 -185 90 63 -349 -250 98 -173 -320 57 -58 -80 -327 -80 186 -364
4261 -364 -96 197 151 -106 299 324 65 -7 22 318 24 0 370 234 -116 174 293 72 -3 249 -14 12
4283 12 -100 21 91 -158 -19 212 -28 -103 240 -74 -212 7 20 -2 -177 -111 47 -290 -351 -84 -51 -306 -47
$$ packed form
4130c07M21p8j08p0K77J68l90n2N12l44k00N33k92k68P2J48p7j42O4J09j1k87
4152c22K81J00k44m4K25j86P1P5J02o2m9J09J54l29k9M48j88k47L40j38k25K6
4174a32K36O5j33j43M76j32l95K45K85l21k63L01J81l66l5L50k8m00K34K14m41
4195b02j44M49j68j41J59J01j51k34K16J51l50j9L47J1k00J21Q7k21J61R9J44
4216B16l24j10L74qm53M27J61l48r1L64j38j88J03J87kk16K4M92m99k45L84j3
4238I7k16N6J06qk08J24J66k20q2K75k7m12R9L48k71j47L77j15k2k47K47K66n50
4261c64K68K93m6k57M05K5k59p2K9K96k94k4L70j36l50K90J19k21p5K52k63K6
4283A2j12J21P0k49J39K31k40p5L43l14j38K19J3k2j75O6J58l37o1K67L3k55K59
$$ plain form
4306 -47 214 -258 -325 26 85 -300 -154 172 183 -124 100 132 7 -157 87 46 125 -68 216 -128 -155 62 384
4329 384 16 142 199 -149 -28 80 192 123 -95 -83 298 -43 -142 130 196 -96 -110 -71 -101 -134 -15 209 69
4352 69 -314 18 196 -139 -114 0 -161 -120 18 68 -1 -60 143 94 3 -139 339 41 1 64 269 -77 81
4375 81 257 160 -112 45 295 188 -127 168 237 -112 -146 -37 68 -65 -20 83 -93 -89 -150 198 -38 -231 63
4398 63 113 -111 25 201 -15 -144 74 84 -162 -206 193 27 -182 51 180 -41 -98 204 28 -135 83 115
4420 115 213 -125 -155 107 75 140 86 130 -189 -6 58 69 2 -190 180 -141 -40 -4 -147 -151 -20 46 -124 -119 25
4445 25 -67 -19 -150 -3 57 -8 -240 -5 -130 -226 -71 -58 -188 -189 124 133 -137 -107 119 27 -215 11 233 -34
4469 -34 18 167 -86 286 61 224 191 -117 46 326 -169 19 121 -70 -142 -160 -46 -72 -5 -74 64 -248 -156
$$ packed form
4306d7K61m72o7L51N9l85J46L26J1l07K24L2j25j64K44m1P9j93K84l44k7K17L22
4329C84l68J26N7l48J21J08J12o9k18J2L81l41r9K72O6k92j4L9l0l3J19K24j40
4352F9l83L32J78l35K5J14j61M1J38N0o9n9K03m9r1j42M78k98m0O3K05l46J58
4375H1J76r7k72J57K50j07l15K95O9l49l4J09J05j33M5J03j76Mo1L48k36j93K94
4398F3N0k24J36J76k16j29K18J0k46m4L99j66k09K33J29k21n7L02j76j63K18L2
4420A15R8l38l0K62l2O5n4M4l19J83O4J1o7j92L70l21J01L6j43mJ31O6j70NJ44
4445B5r2M8j31J47O0o5k32K35j25r6J55J3j30jL13Rk70L0K26r2k42K26K22k67
4469c4N2J49k53L72k25J63l3l08J63K80m95J88J02j91p2j8J14k6O7o9J38l12R2
$$ plain form
4492 -156 -25 -26 -294 24 -253 -81 -243 -172 -314 -135 -168 -72 10 -247 95 67 -61 -169 7 21 -69 10 135
4515 135 86 -164 33 206 61 -18 246 260 205 293 256 183 -25 -212 385 46 -83 136 88 -47 -125 145 -13
4538 -13 -272 -71 38 6 -211 -134 -6 3 -64 -171 -52 -90 -115 -102 -94 -149 -96 14 -182 -327 117 -69 -239 188
4562 188 150 23 -12 -49 166 -54 -12 161 215 -211 214 344 35 -41 344 -74 -3 -28 181 198 -24 50 334
4585 334 -60 -165 138 -75 -369 -5 -3 -122 -147 -116 14 -89 -225 -67 269 -352 -136 -130 -93 -78 -40 -49 -189 -96
4609 -96 13 -49 -162 -69 -6 21 -183 146 43 133 62 65 105 -109 -82 129 332 -118 139 217 -164 -13 400 66
4633 66 12 -38 73 -43 -135 -79 21 -132 -48 123 -19 -216 -7 190 -2 -151 -86 14 -81 8 305 14 -263
4656 -263 84 70 -24 -198 -27 40 -43 -11 130 166 -255 91 202 18 -46 266 -89 178 244 27 33 -1 -66 24
$$ packed form
4492a56J31jk68L18k77J72j62P1j42J79l3R6Q2k57L42k8j28j08J76J4r0P9J25
4515A35m9k50J97J73j45p9K64J4n5Q8l7p3k08j87N97l39j29K19m8j35p8K70j58
4538a3k59K01J09l2k17P7J28Ro7j07J19l8k5J3Qn5N3J10j96j45M44j86j70M27
4562A88l8j27l5l7K15k20M2J73N4m26M25J30l09p6L85m18P1k5K09J7k22P4K84
4585C34l94j05L03k13k94L64Kj19k5L1J30j03j36J58L36o21K16OL7J5L8rj40R3
4609i6J09o2j13R3O3K7k04L29j03R0p1LM0k14K7K11K03m50K57P8l81J51M13l34
4633F6n4n0J11j16r2N6J00j53Q4J71j42j97K09J97j92j49O5J00r5Q9K97k91k77
4656b63L47j4r4j74J71O7q3L2J41L6m21L46J11j84o4L12l55K67O6k17Ol4o5R0
$$ plain form
4680 24 -35 115 240 130 -171 91 -18 -106 -45 -190 62 -137 -225 -37 7 -154 -321 82 -25 -170 -66 99
4702 99 20 -113 -70 23 -186 -46 137 -178 -53 51 156 -6 132 125 170 -40 -45 304 207 -103 409 419 -33 118
4726 118 250 104 22 -22 149 125 -159 -22 196 -101 -107 322 12 -72 -81 -76 -202 -253 12 -28 -380 -320 46 -202
4750 -202 -297 57 111 -241 38 72 -84 14 -86 141 261 -440 47 134 -47 -221 148 0 -120 -145 195 321
4772 321 -16 193 213 99 -213 208 -18 -133 96 216 72 -117 -55 111 -99 -307 -61 184 -295 -104 -8
4793 -8 -94 -59 -57 -25 -86 -306 88 -38 -196 -327 148 7 -462 24 218 -155 -136 86 -22 -18 69 331 114 -27
4817 -27 197 277 -46 7 115 221 -39 3 290 27 -108 50 240 -64 -167 126 -232 -162 -40 72 -57 -305
4839 -305 23 149 -142 -143 42 -222 -203 -159 -6 -43 -176 98 -47 -184 -12 231 45 -126 15 149 51 28
$$ packed form
4680B4n9J50J25j10l01K62j09q8O1j45K52j99q8J88M4j61j67M03j07j45J04J65
4702I9p9j33M3R3k09J40J83l15J25J04J05j62J38pM5k10nL49r7l10N12J0m52J51
4726A18J32j46q2m4J71k4k84J37K18k97oM29l10q4rNj26n1K65m0l52O0L66k48
4750b02r5L54N4l52K79L4j56R8j00K27J20p01M87Q7j81j74L69j48j20k5L40J26
4772C21l37K09K0j14l12M21k26j15K29J20j44j89O2J66k10k08K46K45m79J91R6
4793hq6L5KL2o1k20L94j26j58j31M75j41m69M86J94l73J9K22j08MQ7K62k17j41
4817b7K24Q0l23N3J08J06k60M2K87k63j35J58J90l04j03K93l58P0J22J12j29k48
4839c05L28J26k91jJ85k64J9M4J53l7j33K74j45j37J72K43j86j71J41J34r8k3
$$ plain form
4861 28 186 29 -77 -96 257 228 -149 60 172 -73 -229 134 -128 113 124 260 -110 63 -7 131 -3 -130
4883 -130 -58 26 -91 -193 229 -445 -247 -98 49 -112 -254 -40 -151 -228 45 191 -309 -131 -152 -92 -313 -170
4905 -170 41 242 -35 182 141 62 -18 99 277 -107 122 273 73 269 67 281 -9 -22 322 207 -254
4926 -254 -10 192 -14 -88 87 7 6 -252 27 -73 -306 -282 4 -43 -233 -65 -109 -158 -172 -295 -119 -191 -237 -4
4950 -4 -73 -402 86 278 -288 -134 145 178 -38 51 119 45 51 -61 174 17 -37 284 114 32 192 137 88 -116
4974 -116 130 7 -163 -29 184 -130 -284 48 108 -82 -169 -196 -5 -50 -108 -56 167 -158 -69 144 -82 -98 93
4997 93 103 -164 55 99 77 -66 0 145 34 -219 41 -91 -104 28 185 76 -23 213 201 8 -118 157 115
5020 115 -33 97 328 121 -284 125 153 -86 -48 -36 45 -277 40 78 -10 -202 61 -76 -208 0 170 -12
$$ packed form
4861B8J58j57j06j9L53k9l77K09J12k45j56L63k62K41J1J36l70J73p0J38j34j27
4883a30P2Q4j17j02M22o74J98J49J47j61j42K14j11p7K73J46n00J78k1O0k21J43
4905a70K11K01k77K17m1p9q0J17J78l84K29J51k00J96k02K14k90j3L44j15m61
4926b54K44K02k06p4J75q0jk58K79j00k33K4K86m7j90J68m4m9j4j23J76p2m6K33
4950do9l29M88J92n66J54K79L3k16Q9O8p4Oj12K35j57n4L21j70q2J60n5m9k04
4974a16K46j23j70J34K13l14j54L32O0j90q7k7J91m5n8N2K23l25Q9K13k26j6J91
4997I3J0k67K19M4k2j43O6J45j11k53K60j32j3J32J57j09r9K36j2j93j26K75m2
5020A15j48J30K31k07m05M09K8k39L8J2Q1l22L17L8q8j92K63j37j32K08J70j82
$$ plain form
5042 -12 -86 -238 108 -53 -274 29 88 -126 37 184 -179 -115 59 196 103 -65 -23 198 -171 -21 103 172
5064 172 -30 200 179 71 -43 218 285 -87 -46 206 140 -67 107 134 -179 -229 24 -195 40 -129 71 -20
5086 -20 -309 -19 57 -179 -252 -23 -26 -293 -17 66 81 -259 -164 2 -39 -156 157 25 -182 96 71 -77 -126 22
5110 22 141 -58 96 269 254 66 257 258 -30 128 194 85 -77 227 94 82 23 -25 -71 -223 -190 106 -51
5133 -51 -322 -150 -124 -299 -203 -140 33 -176 -135 -262 94 69 -147 140 -63 16 -9 -35 -90 -154 6 376 12 6
5157 6 209 218 -18 48 196 6 221 70 222 67 -119 271 345 -32 92 288 -184 -181 152 218 -137 -169 183
5180 183 175 -59 -56 162 -156 -7 100 -237 -218 -112 -73 -172 -204 -257 243 102 -289 155 57 -47 -3 -22 -17 -150 46
5205 46 -79 150 -81 70 -2 -127 17 63 4 40 70 -21 81 77 -43 184 107 -62 236 34 -187 81 147 24
$$ packed form
5042a2p4j52L46j61k21L03N9k14J63J47l63O4J74J37r3j68M2K21l69J50J24O9
5064A72k02K30k1j08j14K61O7l72M1K52o6k07J74K7l13n0K53k19K35j69K00r1
5086b0k89K90P6k36p3K29lk67K76Q3J5l40R5J66m1j17L13j32k07K78k5j48m9J48
5110B2J19j99J54J73j5j88J91Jk88J58O6j09j62L04j33j2n9m8m6j52L3K96j57
5133e1k71J72K6j75R6O3J73k09M1j27L56k5k16K87k03P9k5k6n5o4J60L70l64o
5157FK03Rk36O6J48j90K15j51J52j55j86L90P4l77J24J96m72LL33O6l55l2L52
5180A83qk34LK18l18J49J07l37J9J06L9r9l2n3N00j41l91M44r8j04M4j9Nj33J96
5205D6j25K29k31J51p2j25J44M6n9L6L0r1J02mj20K27p7j69K98k02k21K68O6j23
$$ plain form
5229 24 -110 2 49 67 21 109 -23 -299 -56 -31 -161 -106 -46 54 -167 -34 82 -67 -91 78 58 -89 -22 66
5253 66 -41 -117 3 -89 247 12 -152 270 146 -49 235 56 26 222 88 -40 75 284 10 -78 -25 79
5275 79 79 -102 143 20 -71 -152 -85 -11 -29 29 -110 15 -17 -125 64 -67 -267 19 33 -109 -145 -48 -110 38 -48
5300 -48 114 171 -166 164 135 -294 -32 130 34 47 128 197 155 -5 -5 253 4 77 264 111 -170 18 72 65 56
5325 56 90 121 -73 102 -31 140 -206 -82 -39 -179 13 -67 -94 -152 -85 -68 -149 -170 23 -115 -139 -75 -15 -116 -159
5350 -159 -31 99 -140 45 55 85 43 -65 195 228 -75 101 279 -103 61 126 255 71 -27 211 130 -65
5372 -65 -31 190 -34 -28 48 -42 62 -5 122 -33 -53 -36 148 -261 -249 -59 -91 -89 -176 -89 -58 -272 -122 17 -111
$$ packed form
5229B4j34J12M7J8m6Q8j32k76K43K5j30N5O0J00k21J33J16j49k4J69k0j47O7Q8
5253F6j07p6J20r2L36k35j64M22j24j95K84j79l0J96j34j28J15K09k74q8N3J04
5275G9%j81K45j23r1q1O7P4j8N8j39J25l2j08J89j31k00K86J4j42l6R7o2J48q6
5300d8J62N7l37L30k9m29K62J62r6J3Q1O9m2j60%K58k49P3J87j53k81J88N4pr
5325E6L4L1j94J75j33J71l46J24M3j40J92q0k7n8O7J7q1k1J93j38k4O4O0j01m3
5350a59J28J30k39J85J0L0m2j08K60L3l03J76J78l82J64O5J29j84r8K38q1j95
5372f5L4K21k24OP6r0J04o7J27j55k0J7J84m09J2J90l2Kq7Q7L1k14J50J39j28
$$ [...]
8191i8
##END NTUPLES=NMR FID
##END=
