##TITLE=1H_Ser 7-4-i-H
 CDCl3,8 sc, 
 29.9.2021
##JCAMPDX= 6.0         $$ Bruker NMR JCAMP-DX V2.0
##DATA TYPE= NMR FID
##DATA CLASS= NTUPLES
##ORIGIN= UXNMR, Bruker Analytische Messtechnik GmbH
##OWNER= root
$$ XWIN-NMR		Version 3.5
$$ Wed Sep 29 08:59:29 2021 Russian Standard Time (UT+4h)  she@DPX200
##.OBSERVE FREQUENCY= 200.1314
##.OBSERVE NUCLEUS= ^1H
##.DELAY= (6, 6)
##.ACQUISITION MODE= SIMULTANEOUS
##.ACQUISITION SCHEME= undefined
##.AVERAGES= 8
##.DIGITISER RES= 18
##SPECTROMETER/DATA SYSTEM= spect
##.PULSE SEQUENCE= zg30
##.SOLVENT NAME= CDCl3
##.SHIFT REFERENCE= (INTERNAL, CDCl3, 0, 15.7039)
##AUDIT TRAIL= $$ (NUMBER, WHEN, WHO, WHERE, WHAT)
$$ ##TITLE= Audit trail, XWIN-NMR		Version 3.5
$$ ##JCAMPDX= 5.01
$$ ##ORIGIN= Bruker BioSpin GmbH
$$ ##OWNER= she
$$ F:/spectra/data/she/nmr/H-F/1/audita.txt
$$ ##AUDIT TRAIL=  $$ (NUMBER, WHEN, WHO, WHERE, WHAT)
(   1,<2021-09-29 08:58:11.78 +0400>,<she>,<DPX200>,
      <created by zg, POWCHK disabled, PULCHK disabled
       configuration hash MD5:
       00 E9 B6 7A A2 85 ED C7 34 08 36 98 17 FE 4E 26
       data hash MD5: 16K
       28 12 FF 5C 90 7C 37 C4 93 31 23 79 D6 39 72 C8>)
$$ ##END=
$$ 
$$ hash MD5
$$ E9 58 33 8D 7F D5 E3 E6 59 D2 E0 29 5E 67 B8 A6
##$RELAX= 
##$RELAX= 
##$RELAX= 
##$RELAX= 
##$RELAX= 
##$RELAX= 
$$ Bruker specific parameters
$$ --------------------------
##$DU= <F:/spectra>
##$EXPNO= 1
##$NAME= <H-F>
##$PROCNO= 1
##$TYPE= <nmr>
##$USER= <she>
##$AMP= (0..31)
100 100 100 100 100 100 100 100 100 100 100 100 100 100 100 100 100 100 
100 100 100 100 100 100 100 100 100 100 100 100 100 100 
##$AQSEQ= 0
##$AQ_mod= 1
##$AUNM= <au_zg>
##$AUTOPOS= <>
##$BF1= 200.13
##$BF2= 200.13
##$BF3= 200.13
##$BF4= 200.13
##$BF5= 200.13
##$BF6= 200.13
##$BF7= 200.13
##$BF8= 200.13
##$BYTORDA= 1
##$CFDGTYP= 0
##$CFRGTYP= 5
##$CHEMSTR= <none>
##$CNST= (0..31)
1 1 145 1 1 1 1 1 1 1 1 1 1 1 1 1 1 1 1 1 1 1 1 1 1 1 1 1 1 1 1 1 
##$CPDPRG= <>
##$CPDPRG1= <>
##$CPDPRG2= <>
##$CPDPRG3= <>
##$CPDPRG4= <mlev>
##$CPDPRG5= <mlev>
##$CPDPRG6= <mlev>
##$CPDPRG7= <mlev>
##$CPDPRG8= <mlev>
##$CPDPRGB= <>
##$CPDPRGT= <>
##$D= (0..31)
0 1.2 0 0 0 0 0 0 0 0.06 0 0.03 0 0 0 0 0.0002 0 0 0 0 0 0 0 0 0 0 0 0 
0 0 0 
##$DATE= 1632891491
##$DBL= (0..7)
120 120 120 120 120 120 120 120 
##$DBP= (0..7)
150 150 150 150 150 150 150 150 
##$DBP07= 0
##$DBPNAM0= <>
##$DBPNAM1= <>
##$DBPNAM2= <>
##$DBPNAM3= <>
##$DBPNAM4= <>
##$DBPNAM5= <>
##$DBPNAM6= <>
##$DBPNAM7= <>
##$DBPOAL= (0..7)
0.5 0.5 0.5 0.5 0.5 0.5 0.5 0.5 
##$DBPOFFS= (0..7)
0 0 0 0 0 0 0 0 
##$DE= 6
##$DECBNUC= <off>
##$DECIM= 32
##$DECNUC= <off>
##$DECSTAT= 4
##$DIGMOD= 1
##$DIGTYP= 9
##$DL= (0..7)
0 120 120 120 120 120 120 120 
##$DP= (0..7)
150 150 150 150 150 150 150 150 
##$DP07= 0
##$DPNAME0= <>
##$DPNAME1= <>
##$DPNAME2= <>
##$DPNAME3= <>
##$DPNAME4= <>
##$DPNAME5= <>
##$DPNAME6= <>
##$DPNAME7= <>
##$DPOAL= (0..7)
0.5 0.5 0.5 0.5 0.5 0.5 0.5 0.5 
##$DPOFFS= (0..7)
0 0 0 0 0 0 0 0 
##$DQDMODE= 0
##$DR= 18
##$DS= 0
##$DSLIST= <SSSSSSSSSSSSSSS>
$$ [...]
##$SUBNAM2= <"">
##$SUBNAM3= <"">
##$SUBNAM4= <"">
##$SUBNAM5= <"">
##$SUBNAM6= <"">
##$SUBNAM7= <"">
##$SUBNAM8= <"">
##$SUBNAM9= <"">
##$SW= 16.8808012054999
##$SWIBOX= (0..15)
0 0 2 0 0 0 0 0 0 0 0 0 0 0 0 0 
##$SW_h= 3378.37837837838
##$TD= 16384
##$TD0= 1
##$TE= 0
##$TE2= 300
##$TE3= 300
##$TEG= 300
##$TL= (0..7)
0 120 120 120 120 120 120 120 
##$TP= (0..7)
150 150 150 150 150 150 150 150 
##$TP07= 0
##$TPNAME0= <>
##$TPNAME1= <>
##$TPNAME2= <>
##$TPNAME3= <>
##$TPNAME4= <>
##$TPNAME5= <>
##$TPNAME6= <>
##$TPNAME7= <>
##$TPOAL= (0..7)
0.5 0.5 0.5 0.5 0.5 0.5 0.5 0.5 
##$TPOFFS= (0..7)
0 0 0 0 0 0 0 0 
##$TUNHIN= 0
##$TUNHOUT= 0
##$TUNXOUT= 0
##$USERA1= <user>
##$USERA2= <user>
##$USERA3= <user>
##$USERA4= <user>
##$USERA5= <user>
##$V9= 5
##$VALIST= <valist>
##$VCLIST= <CCCCCCCCCCCCCCC>
##$VD= 0
##$VDLIST= <DDDDDDDDDDDDDDD>
##$VPLIST= <PPPPPPPPPPPPPPP>
##$VTLIST= <TTTTTTTTTTTTTTT>
##$WBST= 1024
##$WBSW= 4
##$XGAIN= (0..3)
0 0 0 0 
##$XL= 0
##$YL= 0
##$YMAX_a= 116474
##$YMIN_a= -119114
##$ZGOPTNS= <>
##$ZL1= 120
##$ZL2= 120
##$ZL3= 120
##$ZL4= 120
##$ABSF1= 10
##$ABSF2= 0
##$ABSG= 5
##$ABSL= 3
##$ALPHA= 0
##$AQORDER= 0
##$ASSFAC= 0
##$ASSFACI= 0
##$ASSFACX= 0
##$ASSWID= 0
##$AUNMP= <proc_1d>
##$AZFE= 0.1
##$AZFW= 0.1
##$BCFW= 1
##$BC_mod= 2
##$BYTORDP= 1
##$COROFFS= 0
##$CY= 11.3945322036743
##$DATMOD= 1
##$DC= 2
##$DFILT= <>
##$DTYPP= 0
##$F1P= 2.36226072786647
##$F2P= -0.459571619588291
##$FCOR= 0.5
##$FTSIZE= 0
##$FT_mod= 4
##$GAMMA= 1
##$GB= 0.15
##$INTBC= 1
##$INTSCL= 1
##$ISEN= 128
##$LB= 0.24
##$LEV0= 0
##$LPBIN= 0
##$MAXI= 10000
##$MC2= 0
##$MEAN= 0
##$ME_mod= 0
##$MI= 1.114404
##$NCOEF= 0
##$NC_proc= 0
##$NLEV= 6
##$NOISF1= 3.799351
##$NOISF2= 2.8
##$NSP= 1
##$NTH_PI= 0
##$NZP= 0
##$OFFSET= 15.70392
##$PC= 1
##$PHC0= -14078.7
##$PHC1= 15.00089
##$PH_mod= 1
##$PKNL= yes
##$PPARMOD= 0
##$PSCAL= 0
##$PSIGN= 0
##$REVERSE= no
##$SF= 200.130013532006
##$SI= 16384
##$SIGF1= 3
##$SIGF2= 2
##$SINO= 400
##$SIOLD= 16384
##$SREGLST= <1H.CDCl3>
##$SSB= 0
##$STSI= 0
##$STSR= 0
##$SW_p= 3612.71676300578
##$SYMM= 0
##$S_DEV= 0
##$TDeff= 0
##$TDoff= 0
##$TI= <>
##$TILT= no
##$TM1= 0
##$TM2= 0
##$TOPLEV= 0
##$USERP1= <user>
##$USERP2= <user>
##$USERP3= <user>
##$USERP4= <user>
##$USERP5= <user>
##$WDW= 1
##$XDIM= 8192
##$YMAX_p= 0
##$YMIN_p= 0
$$ End of Bruker specific parameters
$$ ---------------------------------
##NTUPLES= NMR FID
##VAR_NAME=  TIME,          FID/REAL,        FID/IMAG
##SYMBOL=    X,             R,               I
##VAR_TYPE=  INDEPENDENT,   DEPENDENT,       DEPENDENT
##VAR_FORM=  AFFN,          ASDF,            ASDF
##VAR_DIM=   8192,          8192,            8192
##UNITS=     SECONDS,       ARBITRARY UNITS, ARBITRARY UNITS
##FACTOR=    0.000296,      1,               1
##FIRST=     0,             0,               0
##LAST=      2.424536,      0,               0
##MIN=       0,             -119114,         0
##MAX=       2.424536,      116474,          0
$$ Real data points
##PAGE= N=1
##DATA TABLE= (X++(R..R)), XYDATA
$$ [...]
1921F69j134m79K327k483P79J181j617N59Q59r26n72J797o14j502K537j434r04
$$ 669 -465 -944 1383 -1100 -321 860 -757 -198 661 -265 -837 960 346 -1156 1381 -53 -957
1938i57K235j432J64O35j42j278J519r6j749K106o77j296J990p91o72M68P33j619
$$ -957 1278 -154 10 645 503 -775 744 648 -1101 1005 328 -968 1022 231 -441 27 760 -859
1956h59Q45R26k213J839l1j789J647l31q92N26M87o81p6J439k022P04J468k351
$$ -859 -14 912 -1301 538 507 -1282 365 34 -858 -332 155 -526 -602 837 -1185 -481 987 -1364
1974a364J349L16q29K1J014p50r67K425j823j24J749j917L06J233q37n65J361
$$ -1364 -15 301 -528 -507 507 -243 -1210 1215 -608 -732 1017 -900 -594 639 -198 -763 598
1991E98j55j454K173j189j011K334j603k21J186n33m67O00O22j907J944j20j494
$$ 598 443 -1011 1162 -27 -1038 1296 -307 -528 658 125 -342 258 880 -1027 917 797 -697
2008f97J595p69n78J230m21p57N46O74j737J480J62k306J962J20q96L10M16p00
$$ -697 898 129 -449 781 360 -397 149 823 -914 566 728 -1578 384 504 -392 -82 334 -366
2026c66j35J183j366o4J879j881P49N83j367R48L13p09m34J443j117m87K109j716
$$ -366 -501 682 -684 -748 1131 -750 -1 582 -785 163 476 -233 -667 776 -341 -828 1281 -435
2044d35j17J578j342l6P22qj139J465k40j370K268j373n32J428j056l2O43R3j090
$$ -435 -552 1026 -316 -352 370 362 -777 688 448 -922 1346 -27 -559 869 -187 -219 424 517 -573
2063e73Q72O12k086K102l49j399J455n53n44M02L46j064J82J484k128J306K44
$$ -573 299 911 -1175 927 578 -821 634 81 -463 -61 285 -779 -597 887 -1241 65 309
2080C09j383J286J36q61QJ153j329j05J900j914M76R73j331N55O35m73o20J240
$$ 309 -1074 212 348 -513 -505 648 -681 -786 1114 -800 -324 649 -682 -127 508 35 -585 655
2098F55l53r48J463j286QJ329j451N87M10l95m36J028k57j338K122p97j069J733
$$ 655 302 -646 817 -469 -461 868 -583 4 414 19 -417 611 354 -984 1138 341 -728 1005
2116A005j002l43O18K92j037N27O73j760J287K45j708J899p49m79N95K78r79J63
$$ 1005 3 -340 278 570 -467 60 733 -1027 260 505 -1203 696 -53 -532 63 341 -638 -475
2134d75J449j886R56P27j893J136J19o18K24P49o69m33J229j275L20J329j639
$$ -475 974 -912 44 771 -1122 14 133 -485 -261 488 -181 -614 615 -660 -340 989 -650
2151f50M99Q26q48K18M97l8r97J472j190n94J933j184m5M81l46p6L90L92j274
$$ -650 -151 675 -173 45 542 504 -493 979 -211 -805 1128 -56 -101 380 34 -42 348 740 -534
2170e34J361l77j488J828q14m65J147n10m92K11Q65j558O40Q13j661J594l36q77
$$ -534 827 450 -1038 790 -24 -489 658 148 -344 -133 732 -826 -186 627 -1034 560 224 -653
2188f53P53o4k54m96J437j379K74J221j772J195r7r11Q01K70n27n12J569r53n54
$$ -653 100 36 -218 -714 723 -656 -382 839 -933 262 165 -746 55 325 -202 -714 855 -98 -652
2207f52J389j425N15Q80j044M07J68k82l21Q46l27p80J612j137l06J259j119R0
$$ -652 737 -688 -173 707 -337 70 238 -44 -365 481 154 -626 986 -151 -457 802 -317 -227
2225b27N62j61q89J014L39j504J492n28o47J102n71l94L79M20r01O86M84j653
$$ -227 335 174 -715 299 638 -866 626 98 -549 553 -18 -412 -33 387 -514 172 656 -997
2243i97J184K75j321Q92m9k90P8P92j120lJ326j608R76N13j122Q12r9m60m4P33
$$ -997 187 462 -859 33 -16 -306 -228 564 -556 -559 767 -841 135 648 -474 338 239 -221 -265 468
2263D68l80l95J292j163j11J175j538K48O74r7n94J080l80q82J520r66m68J248
$$ 468 88 -307 985 -178 -289 886 -652 -404 270 173 -421 659 279 -603 917 -49 -517 731
2281G31q78O6K56J41p72O28J54q54J324o54j066J498o71l42N78o8m08J79Q31j519
$$ 731 -147 -81 175 316 -456 172 326 -528 796 142 -924 574 -97 -439 139 71 -337 -158 673 -846
2301h46R43N47j457J010l9p95O33P9k41k52J148j251K86J170j979J025M77p77
$$ -846 97 644 -813 197 158 -637 -4 75 -166 -418 730 -521 -235 935 -1044 -19 458 -319
2319c19P1P63o10m59J476j025k10J099j143K95O34o22K65K67j13r58J284n19p05
$$ -319 -248 515 -95 -554 922 -103 -313 786 -357 -62 572 -50 215 482 369 -589 695 176 -529
2338e29J416j153j46J031n31l54L25M09r27N70M40j328J141j98p35Q51m59M9J3
$$ -529 887 -266 -412 619 88 -266 59 468 -459 111 551 -777 364 166 -569 282 -177 -128 -115
2357a15M58r53J54J029j628J239J14r93R16n3k20L1M70n08k82J056j069O24L15
$$ -115 343 -610 -456 573 -1055 184 298 -695 221 168 -52 -21 449 -59 -341 715 -354 270 585
2376E85j026O06M21n76n78J281n12q90J659j267O6J158r67K90J91l55m47N22m4
$$ 585 -441 165 586 10 -568 713 201 -689 970 -297 -231 927 -40 250 441 86 -361 161 117
2395A17o19J051n88n76J313q13j93K46K43m99K32M92j311J038m2q98J090m24j34
$$ 117 -502 549 -39 -615 698 -115 -308 -62 181 -318 -86 406 -905 133 91 -807 283 -141 -275
2414b75J45M14o36M81P24j357O02M29j257O79L04m66P7M96n80j86J287j429L86
$$ -275 -130 284 -352 129 853 -504 98 527 -730 -51 253 -213 -136 360 -220 -406 881 -548 -162
2433a62Q77j205N24J5k03K11M87l91m83J056n60l30Q89q20j14P79l54n06M62L09
$$ -162 715 -490 34 49 -154 57 544 153 -330 726 166 -164 725 -95 -209 570 216 -290 172 481
2453D81j498J407q2r78J057l95j98J50k78n2K63K39p76Q52P9j220J443n19l22
$$ 481 -1017 390 308 -670 387 -8 -206 -56 -334 -386 -123 116 -660 192 271 -949 494 -25 -347
2472c47L96O2n25P4Q88r27K04O39j038P73j14k67K8K08K53n52N96m80p6R02j165
$$ -347 49 111 -414 -340 548 -379 -175 464 -574 199 85 -182 -154 54 307 -245 351 -129 -205 697 -468
2493d68L95P54q80L35K68l31o27J142k59q12J320r38N5N58n39J89m7Q1o62P36
$$ -468 -73 681 -199 136 404 73 -554 588 329 -483 837 -101 -46 512 -27 162 115 196 -466 270
2513B70Oq64Q67l18m63Q45l77k11O9N90q30K04R52j326N99L13n96L49J04k42J12
$$ 270 276 -588 279 -39 -502 343 -34 -245 -176 414 -416 -212 740 -586 13 326 -270 79 183 -59 53
2534E3J34n83L17O75j106O08M53r87N95q8j57K01J03j07m79J004q81J20N87n86
$$ 53 187 -396 -79 596 -510 98 551 -436 159 71 -86 115 218 111 -368 636 -245 -125 462 -124
2554a24J80K07j28p2L29k70n24R96o37k89J001p11j46M96o1n75K22M77j083Q34
$$ -124 56 263 135 63 392 122 -402 594 -43 -332 669 -42 -188 308 247 -328 -106 371 -712 122
2574A22j1r42J107n02j5O3P6k82J90N25p96L78L17q83P27J57m66J82N1K30n58
$$ 122 111 -831 276 -226 -241 -178 -102 -384 -194 331 -465 -87 230 -653 74 231 -235 -53 -2 228 -330
2595c30P70o89N8P25p90N09j07l43M32p8p3l20J070p77m56J048o12k89O05m65
$$ -330 440 -249 -191 534 -256 253 146 -197 235 157 84 -236 834 57 -399 649 37 -252 353 -112
2615a12M7L19L00j043P54l53l80R41m47k70N69m53j58K22L05o03L02K64n89P81
$$ -112 -65 254 554 -489 265 -88 -468 473 26 -244 325 -128 -286 -64 241 -362 -60 204 -385 396
2635C96m84j97J25R8k45M1O62q74K29N21r28R11l09j73N48j61k3l30M89l16j82
$$ 396 -88 -285 -160 -62 -307 -266 396 -478 -249 272 -656 255 -54 -227 321 160 137 -193 296 -20 -202
2656b02P04q36L77n8K6M0K95j20n77P07l67l63R60n86k6K72p9j86R6J93o81K82
$$ -202 502 -334 43 -15 11 51 346 226 -351 356 -11 -374 586 0 -26 246 167 -19 77 270 -411 -129
2678a29L93q53Q74k4o66O53m89M1j5L65l78k3N44o90L92K57o57Q37n01K5l67Q19
$$ -129 264 -589 285 261 -405 248 -241 -200 -215 150 -228 -251 293 -397 -5 252 -405 432 -69 -44 -411 408
2700D08o95k81R39m60Q6L60o24L93j80K80l40O02o11k03R32q75M48K57o08J86
$$ 408 -287 -568 371 -89 -3 357 -267 126 -54 226 -114 488 -123 -326 606 -269 179 436 -172 14
2720A4J83k59k66Q02j23p35O18j99l28R28q40j79N88l14r2J48J89n74N89j45o61
$$ 14 197 -62 -328 474 351 -384 234 35 -293 635 -205 -384 204 -110 -202 -54 135 -439 150 5 -656
2741f56Q61l84J91p1J69j89l18Q63j025O74L49j013P25rk64O1K47o9l28N73l37
$$ -656 205 -179 12 -59 110 -79 -397 466 -559 115 464 -549 176 167 -97 -36 211 142 -186 387 50
2762E0r3M57p64N39MK3j28j03J77n30R81n26m80Q57n87M03N9n18J04KL01o44N49
$$ 50 -43 414 -350 189 193 216 88 -15 162 -368 613 87 -393 464 -123 280 339 -179 -75 -73 228 -416 133
2785A33k07j31N84l74k08K86k79j33K10J10m69O34R6p95P69m11j55N15j96j53
$$ 133 -74 -205 379 5 -203 83 -196 -329 -119 -9 -478 156 252 -543 226 -185 -340 175 -21 -174
2805a74N6L79p93L53M64o61N43jn43M08j35R0j38M12k84k32Q42q74L89L69k61
$$ -174 -118 261 -532 -179 285 -376 167 166 -377 31 -104 -14 -152 260 -24 -256 586 -288 101 470 209
2826B09o5p9J83l59P6K32m49N31m16n6O90m57j07J08K38m13J49J64p05Q76k36
$$ 209 144 65 248 -111 -35 197 -252 279 -137 -193 497 40 -67 41 279 -134 15 179 -526 350 114
2847A14l66O36p05J27JK44k56R8L67n99L01J6l91O40l93M10j99nm3j18M60m91
$$ 114 -252 384 -321 -194 -193 51 -205 -107 260 -339 -38 -22 -413 227 -166 244 45 40 -3 -121 339 -152
2869a52p0M52l67M61l84O7o9K00n2l13P33n49q5M78n90K92J55kj70j71L48o25
$$ -152 -222 230 -137 324 -60 7 -62 138 86 -227 506 -43 -128 350 -240 52 207 205 35 -136 212 -413
2891d13N44L4l82N34m24K8K67k35k57L21o1j70K95Q1n19O14n18K18K23o5k26M9
$$ -413 131 165 -217 317 -107 -79 188 -47 -304 17 -44 -214 81 162 -357 257 -261 -43 180 115 -111 -62
2913f2J25n45N12J51n33N16k39J53r3n1K43m04N72l52o9O38r76N61J4k95K47K5
$$ -62 63 -482 30 181 -352 164 -75 78 -15 -66 177 -227 345 -7 -76 562 -414 147 161 -134 113 138
2935A38Q2m91M52j18J01M53p32R2J77k07O0k12N63p01N56q1m91N84k46l64L85
$$ 138 220 -271 181 63 164 617 -115 -23 154 -53 7 -205 358 -343 213 132 -359 225 -21 -385 0
2956@J35l51l1L19k59J6L33l81L79j69m8J73l80J28j29L31l45oP51p92N56n5j77
$$ 0 135 -216 -247 72 -187 -171 162 -219 160 -9 -57 116 -264 -136 -265 66 -279 -285 466 -326 230 175 -2
2979bP8j8J06k19M53j75n41Q13o36L16J81l91J08M16n86p0M99q8l51P20o42m05
$$ -2 76 58 164 -55 398 223 -318 495 -141 175 356 -35 73 489 -97 -167 332 244 -107 613 -29 -434
3001d34O17k45l6qK42n16L56k5l73N92l37k04M30k07j4L70q2m61P4N45n92K87
$$ -434 183 -62 -98 -106 136 -380 -24 -49 -422 170 -167 -371 59 -148 -162 208 126 -335 -261 284 -308 -21
3023b1K36o05N67l67K07p8K23J04n74O38m75K1K83n04N48k93J19j44K22K12p14
$$ -21 215 -390 177 -190 17 -61 162 266 -308 330 -145 -124 159 -345 203 -90 29 -115 107 319 -395
3044c95Q41m10N6J47k43j1K77j10j98J01O3j46L66k03m59P88n74J15O6l41L19
$$ -395 446 36 92 239 -4 -15 262 152 -46 55 118 -28 338 135 -324 464 -110 5 71 -270 49
3065D9k55K68l33J76M8n04Q60j56k85J41n6Nj61K22l34N45q0k66K47o0l89L96
$$ 49 -206 62 -271 -95 -47 -551 309 153 -132 9 -47 -42 -203 19 -315 230 150 -116 131 71 -318 78
3087G8j61J62k69K96o4j50K22k93K50L4k48K50p0J05k6n9L9l08Q02n77R7J22m26
$$ 78 -83 79 -190 106 42 -108 114 -179 71 105 -143 107 37 142 116 57 96 -212 590 13 110 232 -194
3110a94r3K84L71l56m6N04n75M39n73P1N35o53L06R1J9m60Q6N93o03L27k9k42
$$ -194 -287 -3 368 12 -34 470 -105 334 -239 -168 367 -286 20 111 130 -330 -244 349 -254 73 44 -198
3132a98M33k04N1k79N53l20m03O59n02L92Q7k31nk91M32m5M8j21l18P34n00O6
$$ -198 235 31 82 -197 356 36 -367 292 -210 182 269 38 33 -258 174 129 177 56 -262 472 -28 38
3154C8L31o04J63J33R1p6N7P7m31N02k68l01L11q5o1o5M5K02J93p5o05Q58l45
$$ 38 369 -235 -72 61 152 76 133 210 -221 281 13 -288 23 -62 -123 -188 -143 59 252 177 -428 430 85
3177H5k43K21j32j48J07J20k57j40N68n28L10K66o63N99l96J30j13L60j50J00
$$ 85 -158 63 -69 -217 -110 10 -247 -387 181 -347 -37 229 -434 165 -231 -101 -214 146 -4 96
3197I6J31l78K58K45m83L7J60k68L22J0J14l58L65l07m7N08l96M03k35k7R0j64
$$ 96 227 -151 107 352 -131 -94 66 -202 120 130 244 -114 251 -56 -103 405 9 412 177 150 240 76
3219G6l6l84N42j00m79O12l73L79m17L08k26l4M88p55K76J73l57N25l78J45J06
$$ 76 40 -344 198 98 -381 231 -142 237 -180 128 -98 -132 356 -399 -123 50 -307 218 -160 -15 91
3240I1m62L05k37M36n46K99K86n93N18Rk20K22lJ10m86O19l54j58N06l90J29j73
$$ 91 -371 -66 -303 133 -413 -114 172 -421 97 106 -114 108 105 215 -271 348 -6 -164 342 -48 81 -92
3262i2J78J86k06o1L3J06j0k96N59o36K10R4p2J23r2K37m75L95J5n05O19n52Q5
$$ -92 86 272 66 5 38 144 134 -162 397 -239 -29 65 -7 116 24 261 -214 181 196 -309 310 -242 -157
3285a57L09k76J1j98L02k18J69K95n81K72N3l49L74J4j35P7Q0k10j42N55l47K97
$$ -157 152 -124 -113 -311 -9 -227 -58 237 -344 -72 -19 -368 6 20 -115 -38 42 -168 -310 245 -102 195
3307A95K2l95K98j31j3j6J83j35j14M49o91K86P34p99K59J32j81kQJ21o95M47
$$ 195 217 -178 120 -11 -24 -40 143 8 -106 343 -348 -62 672 -127 132 264 83 81 89 210 -485 -38
3329c8j67M3N14l87r2K41l5l90M13j77l81N44M0n25M89k25K08k88M54m01j12L87
$$ -38 -205 -162 352 -35 -127 114 79 -311 102 -75 -456 88 128 -397 92 -133 75 -213 241 -160 -272 115
3351A15n88O27j70k39N04k66R4j68M5J61l74M70l79L41K28o35L54o2j97M2K05
$$ 115 -473 154 -16 -255 249 -17 77 -91 -46 115 -259 211 -168 173 401 -234 120 58 -139 -97 108
3372A08P7m35M15J04l85O29n26K71k71j28k4L23j54l97L19J92m91P49k76k02J07
$$ 108 185 -250 165 269 -116 513 -13 258 -13 -141 -165 158 4 -393 -74 118 -373 376 100 -102 5
3393Ek19M17k86n9N1J74J59n86M40k10k08M70k63K15m12M46k01j81K15l08K67
$$ 5 -214 203 -83 -142 -91 83 242 -344 96 -114 -322 148 -115 100 -312 134 -67 -248 -33 -341 -74
3414g4K8N6K24m30N9R8K80n58J04O66m42m0J19n8N2j24M13m28R2jn23P12k75J30
$$ -74 -46 10 234 -196 -137 -39 241 -317 -213 453 11 -29 90 32 84 -40 373 -55 37 36 -487 225 -50 80
3438H0K8k1L6l17K04%J67j28m71N28n9k64L0Q3J95n6k60K42j94K38k35J23M28
$$ 80 108 87 123 -194 10 10 177 49 -422 106 47 -217 -187 -104 91 35 -225 17 -177 61 -174 -51 377
3461C77o88M57l35K65q0N2j85J37J56l08N48l37k30L35k84%K01j13J13n8M24n18
$$ 377 -311 146 -189 76 -4 48 -137 0 156 -152 396 59 -171 164 -120 -120 81 -32 81 23 447 -71
3483g1K3J88q4P1k14J26j77N0J17J1K59j67k30M34k14j97O6o5R0K63l45j80N03
$$ -71 -48 140 56 127 -87 39 -138 -88 29 40 299 132 -98 336 122 -75 -9 -74 16 279 -66 -246 257
3506B57m3o55O14k58j11J32LK4n2L21m36J0J14j20O6J64q1O5N1k22K58k3O2m4
$$ 257 214 -441 173 -85 -196 -64 -61 -37 -89 232 -204 -194 -80 -200 -134 30 -51 14 65 -157 101 78 140 96
3530I6K97p16K62J59j52R1j37M2j3M30n33L5K68J3k48K22k2J49j57K40m50J41
$$ 96 393 -323 -61 98 -54 37 -100 -58 -71 359 -174 -139 129 142 -106 116 94 243 86 326 -124 17
3552A7K57n04K80j87j19N92l98J03j20J83j25O0q0l57O07m98J16J71l0j19q2N06
$$ 17 274 -230 50 -137 -256 336 -62 41 -79 104 -21 39 -41 -398 209 -289 -173 -2 -32 -151 -233 273
3574B73m42J04N27n76J03P2k59M73j10j28j03K94k08o4N33p30J89R4r6P6K4o1
$$ 273 -169 -65 462 -114 -11 61 -198 275 165 37 -66 228 20 -44 489 -241 -52 42 -54 22 46 -15
3596a5J80J73k32l80N17l23J82J96m02L08k43J94j82K24j1m20K55m2l00L78R1
$$ -15 165 338 106 -274 243 -80 102 298 -104 204 -39 155 -27 197 186 -234 21 -21 -321 57 148
3617A48k20%o1l4O3K66n99M94m1k89L89k79R2j2N7J77k05L31n55M32j44j38K68
$$ 148 -72 -72 -133 -167 -104 162 -437 57 16 -273 116 -163 -71 -83 -26 151 -54 277 -278 154 10 -128 140
3640A40j55l0%J96k87j00O42n01Q4L07m75J50J54l06L61k28R8l81P35l78l19N30
$$ 140 -15 -45 -45 151 -136 -236 406 -95 -11 296 -179 -29 125 -181 180 -48 50 -331 404 26 -293 237
3662B37l13L74l69L19k15n0N5K9M0k01k72N83m31K10l8K26k1r1M9k41K89m8k62
$$ 237 -76 298 -71 248 33 -17 38 67 107 -94 -366 217 -214 -4 -42 184 163 72 121 -120 169 121 -141
3685a41K32j06k96J55j02K60k80L88k99J39K64k78P6L32o81N20k78P1N9J30k38
$$ -141 91 -15 -311 -156 -258 2 -278 110 -189 -50 214 -64 12 344 -337 183 -95 -24 35 165 -73
3706g3l10N42l94M37m4l89J67O1O5k18L53r5l48N87n84J55M09m50J92J4K4l14
$$ -73 -383 159 -235 202 158 -231 -64 -3 62 -156 197 102 -246 341 -243 -88 321 -129 63 77 101 -213
3728b13K40O10j016O39p9m65M01l55O4J38J55k38m9L78n94O16j82l26K24N8m9
$$ -213 27 637 -379 260 181 -284 117 -238 -174 -36 119 -119 -168 210 -384 232 50 -276 -52 6 -43
3749d3j11M46m49K24J90l58K44K44m12J54j78j07P1K24P6j02J73l94j90P19m73
$$ -43 -154 292 -157 67 257 -101 143 387 -25 129 -49 -156 -85 139 215 113 286 -108 -298 421 -52
3770e2Q7n0J37j88K5L6j66L23j80q4J77j01K0L8J2n53M24O2m52M13N6m13O21k68
$$ -52 35 -15 122 -66 -41 -5 -171 152 -28 -112 65 -36 -16 22 34 -519 -95 -33 -485 -72 -16 -429 192 -76
3794g6L9N2n8j15J91K72l43J4Q8k55M41q5k55L35j76j01l8K81j95P5J68l87J57
$$ -76 -37 15 -43 -158 33 305 -38 -24 64 -191 250 165 -90 245 69 -32 -70 211 16 91 259 -128 29
3817B9J31k44J2J66l6k62M22k19k60L20j83J72J94k01J55m66K89k98M07p1k11
$$ 29 160 -84 -72 94 58 -204 218 -1 -261 59 -124 48 242 41 196 -270 19 -279 128 57 -154
3838a54M91o06L4J73j5j41J79j60K67Q4J49m34J33j12m8M22k99m4K0Q3j92J86
$$ -154 337 -269 -235 -62 -77 -218 -39 -199 68 152 301 -133 0 -112 -160 262 -37 -81 -61 22 -170 16
3860A6O9l17N93k64n95M99L3K25l83M10j5m64L14m52L61L36n17J99r4J08L1m2
$$ 16 85 -232 361 97 -498 1 34 259 -124 286 271 -193 121 -331 30 366 -151 48 -46 62 93 51
3882E1j13j88N52k76O9j17j12kQ8J04k26J33Q3o21P27m24P6J21l2np9K83l02L37
$$ 51 -62 -250 302 26 95 -22 -134 -136 -48 56 -170 -37 46 -575 152 -272 -196 -75 -107 -112 -191 92 -210 127
3906A27J40m65J59N7j27K90j98p3M7R1j19M4K29o02M78j7j72L43O6j10k32J94
$$ 127 267 -198 -39 18 -109 181 -17 -90 -43 48 -71 -27 202 -400 78 61 -111 232 298 188 -44 150
3928A50j01k81M03o0J58j4m77N22n39J74J18l3k4J5K92l95m2M52n54L43k14o7
$$ 150 49 -232 171 111 269 255 -222 300 -239 -65 53 20 -4 11 303 -92 -134 318 -236 107 -107 -174
3950a74Q9NP9n4J48j5k40K98j12l88K99l6J12p2L24n31J79K48m65N82q8l87K98
$$ -174 -85 -80 -1 -55 93 78 -162 136 24 -364 -65 -101 11 -61 263 -268 -89 159 -306 276 188 -199 99
3973I9Q3J62m72K74k95J31K34l00J10N3J2Qj45J89j69K32k53j24L06l16J38L86
$$ 99 182 344 -128 146 -149 -18 216 -84 26 79 91 99 -46 143 -26 206 -47 -171 135 -181 -43 343
3995C43o15J49L62k99l20K44K01k73J80k65L0M02k98J58j1Q2l08K36J21l64M20
$$ 343 -272 -123 239 -60 -380 -136 65 -208 -28 -293 -263 139 -159 -1 -12 70 -238 -2 119 -245 175
4016A75k86O8L24l62J75j85J15M5k31M33l99J83J29j07K9k75J50J60J06k89p9
$$ 175 -111 -43 281 -81 94 -91 24 69 -162 271 -128 55 184 77 106 -169 -19 141 247 -42 -121
4037a21L66k29J83o7k11K42j07J44l32K28n0k17K97l97N4N20n66K85O6m1k43K47
$$ -121 245 16 199 132 -79 163 56 200 -132 96 46 -171 126 -271 -217 303 -263 22 88 47 -196 51
4059E1J39n25K36P4k67N05m26J74K26j29k55J40M12p58M37O3j42K31j03m9no7
$$ 51 190 -335 -99 -25 -292 213 -213 -39 187 58 -197 -57 355 -403 34 97 -45 186 83 34 29 -38
4081c8p1j39L51j50R9J44n28P21l12L7m9m4j9o6N88k78k62J90k09L75k28j32L7
$$ -38 -109 -248 103 -47 52 196 -332 389 77 114 65 21 2 -64 524 246 -16 174 -35 340 112 -20 17
4104A7L1J54k97K16r2n47N74j15o3l5P8M43l30K32m38L33q7m86K94j26J5M69k43
$$ 17 48 202 -95 121 29 -518 56 -59 -122 -157 -79 364 34 266 -172 161 74 -412 -118 -244 -229 240 -3
4127cj72J30qk84N29l6m72N99l5n70N48j63j70o2L91Pj91k2k01L34j23o5K40j12
$$ -3 -175 -45 -53 -337 192 156 -316 283 248 -322 226 63 -107 -169 222 229 38 16 -185 149 26 -39 201 89
4151H9q4j09J78N0l43L37k72K30j22j4K4J05j76J71K8Rk21L84m34L48M0l59L5
$$ 89 5 -104 74 124 -219 118 -154 76 -46 -60 -36 69 -107 64 92 101 -120 264 -170 178 218 -141 -106
4174a06L0K61m90M52k26k3L9J40l71L63k79n8L99j45J27k24M9k36M48k7k44J99
$$ -106 -76 185 -305 147 -79 -102 -63 77 -294 69 -210 -268 131 -14 113 -111 -62 -298 150 123 -121 78
4196G8p2K7k12L52lp8K67m76L00M6k65L1R2J59k10o1J52l96M41k61q4j0J9K88
$$ 78 6 33 -179 173 170 92 359 -117 183 229 -36 -5 87 246 36 -25 127 -269 172 -89 -173 -183 -164 124
4220A24j32m7J16l8j89j02J20K29j31J6l11M36k50j97K60K25j34r2L11p0j91J29
$$ 124 -8 -55 61 23 -166 -268 -148 81 -50 -34 -345 91 -159 -356 -96 129 -5 -97 214 144 -47 82
4242H2j33QK62j23pj79J59l22K05K32k66L51m38L60k94L2J32l36L16k58J76L49
$$ 82 -51 -43 219 96 89 -90 69 -253 -48 184 -82 269 -169 191 -103 -71 61 -275 41 -217 -41 308
4264C08k68R2j14pl8j27K21j13J26J39l39J91m3J9r6n7M2RJ51k47J27J6l17L77
$$ 308 40 132 18 11 -27 -154 67 -46 80 219 -120 71 28 47 -49 -106 -64 -55 96 -151 -24 -8 -325 52
4288E2K91m21N40n00Q6n9Q4k75J53L30k40J36j01l5J80Kk18L3J43l10m0M14m17
$$ 52 343 -78 462 -38 48 -11 73 -202 -49 281 41 177 76 41 221 223 5 38 181 -129 -169 245 -172
4311a72L62j05mK3j70L08m37K59Lk97L66p6KQ8l56J96j68J82J7K74l69n4L35m90
$$ -172 190 85 81 104 -66 242 -195 64 67 -230 136 60 62 150 -206 -10 -178 4 21 295 -74 -128 207 -283
4335b83K06R1J05r2J27J7m73L34J82l79L86l11P5K10k15q8J34l20N36nN7m61M25
$$ -283 -77 14 119 27 154 171 -302 32 214 -165 221 -90 -15 195 -20 -108 26 -294 242 237 294 -167 258
4358B58k11Q9J34j61m0j38R6J29m42K88k23Q0J65r5K54L1k09j4J06m2q4O5J91
$$ 258 47 136 270 109 69 -69 27 156 -286 2 -221 -141 24 -71 183 214 5 -9 97 55 -29 36 227
4381B27k58J51m92M43J25k75J8L6R6l09M13k75j96L20j57K04p2m0L2p5J93m13
$$ 227 -31 120 -372 71 196 -79 -61 -25 71 -238 175 -100 -296 24 -133 71 -1 -41 -9 -84 109 -304
4403c04M09K9j77K04J33l57QM3j00J67J04j62o0J92n6J80k99M42l71mOn7O4m50
$$ -304 105 134 -43 161 294 -63 -55 -12 -112 55 159 -3 -63 129 73 253 -46 396 25 21 27 -30 34 -416
4427d16L33M74m14J71k28n1k1M7K47l78M81j56l23J98j53J71J2P9j83Q0J75l60
$$ -416 -83 391 -23 148 -80 -131 -152 -105 142 -236 245 89 -234 -36 -189 -18 -6 73 -110 -30 145 -215
4449b15K30n4l65M39J18k68K54m25N1n6L15j96k0M30n12N21l00j09L42j77K33
$$ -215 15 -39 -404 35 153 -115 139 -286 -235 -291 24 -172 -192 238 -274 247 -53 -162 180 3 236
4470B36k55K66k67q2K08j80N9J80k81K74k51l7J49J64j82j57L50l33K93J7l06
$$ 236 -19 247 -20 -102 106 -74 -15 165 -116 158 -93 -130 19 183 1 -156 194 -139 154 171 -135
4491a35K02k40q3L2K86k76J16J93k47R2O1N0j43J85j26K09k62K56l20K37j97K52
$$ -135 67 -173 -256 -224 62 -214 -98 95 -152 -60 1 51 -92 93 -33 176 -86 170 -150 87 -110 142
4513A42K15m56kO5J59r1Q6rk48K05j63Q8J03j11K02j18J56k05k9J41q0O9o9o6
$$ 142 357 -99 -101 -36 123 32 118 109 -139 66 -97 -9 94 -17 185 67 223 18 -11 130 50 119 50 -16
4537a6Q2j25J79k29j30J16j7L43J30m57K69m84K54J03pk53K30R6j57J29m6l7J62
$$ -16 66 -59 120 -109 -239 -123 -140 203 333 -124 145 -339 -85 18 11 -242 -12 84 -73 56 10 -27 135
4560A35r1r4J12k75K24O1P2j34%K47o24L65k27K53K28l79K13k35K20l54L31Q2
$$ 135 44 -50 62 -213 11 72 144 10 10 257 -367 -2 -229 24 252 -127 86 -149 71 -283 48 130
4582A30o3k64K59J92j3j82j71n2L83j33j00L86n95L36r5p6o9J55P3j2k7j05k23
$$ 130 67 -197 62 254 241 59 -112 -164 219 86 -14 372 -223 113 18 -58 -127 28 101 89 62 -43 -266
4605b66N23n65J39J43o3Q2j84L20k27J85l62J21R9L8Q8r5m9l7K05j27O5K3K31
$$ -266 257 -308 -169 -26 -89 -7 -191 129 -98 87 -275 -154 -55 -17 71 -24 -73 -110 95 -32 33 56 287
4628B87n24N59m30L79j75k20J02n6K18o8j86J0J8N4J79l54M35l64J53n3J64l69
$$ 287 -237 322 -108 271 96 -124 -22 -78 140 72 -114 -104 -86 -32 147 -207 228 -136 17 -36 128 -241
4650b41J99L74k49k3M4m9L70l56O0j02q1J15q2Q5l01p6K46k16J90J71k0j04K17
$$ -241 -42 332 83 60 104 55 425 69 129 27 -54 61 -21 64 -237 -313 -67 -283 -93 78 58 -46 171
4673A71l95N5J51j29J35J59j63L06k91J03O9j72J43j60n8J78j42M8o3L43N4k78
$$ 171 -224 -169 -18 -147 -12 147 -16 290 -1 102 171 -1 142 -18 -76 102 -40 8 -55 288 342 64
4695F4k7O0m2j16K35j96m5J98j02P2j03k72M31j37j13P8r1K51k88K34m4r5j14
$$ 64 37 97 55 -61 174 -22 -67 131 29 101 -2 -274 157 20 -93 -15 -106 145 -143 91 47 -48 -162
4718a62K88p1k15L56j28l6p2n2N3J45j36k0j09K75K6mKk27L81k68k93J08M18J4
$$ -162 126 55 -160 196 68 32 -40 -92 -39 106 -30 -50 -159 116 142 138 140 -87 294 26 -267 -159 259 273
4742B73l35N15k88k31L31k71L6J02k04K67k54K38k80K60k95K27N4l73M43l3k64
$$ 273 -62 453 165 -66 265 -6 30 132 -72 195 -59 179 -101 159 -136 91 145 -228 215 182 -82
4763h2Q8K3m9k2p8M5p6L44k81J20J25k57K45k26kr7K2J35j18K26k7L8K53k69p0
$$ -82 6 29 -20 -42 -120 -75 -151 193 -88 32 157 -100 145 -81 -83 -180 -158 -23 -141 85 58 96 349 80 10
4788A0n3K93l94J29J03l33L43Mj73K90j94n5L06k36k17J72J77j99J42L1k89J21
$$ 10 -43 250 -144 -15 88 -245 98 102 -71 219 25 -30 276 40 -177 -5 172 -27 115 146 -143 -22
4810b2J86n21K22K17k0n5J16l22M08k1p3K80m76K89j62J18m3k88m5R9l7K06k94
$$ -22 164 -357 -135 82 62 7 123 -199 209 188 115 395 -81 208 46 164 121 -167 -212 -113 -150 56 -238
4833b38J44K60k67J75o3j11o7J10K0p5J98k6Ko1k4K17j09R8l32L58q2j36K67l49
$$ -238 -94 166 -101 74 11 -100 -167 -57 -37 -112 86 60 62 1 -23 194 85 183 -149 209 127 -9 258 -91
4857i1q2K17M3j17Q4J46j62j71P8k03L06m8j02J86n3k47L43K9j40j35R0o2K38
$$ -91 -173 44 87 -30 54 200 38 -133 -55 -258 48 0 -102 84 31 -216 127 156 16 -119 -29 -91 147
4880A47p5k32M4J85l7k13K16j07j57M52n73K79qo8J68l64M33R6j99L8q3P3J81
$$ 147 72 -160 -116 69 32 -181 35 -72 -229 223 -350 -71 -79 -147 21 -343 90 186 -13 25 -58 15 196
4903A96l41L35k57j7lJ92m7j27J15J24P7k14K7m1j43K32k14J65L6%p5j43J79k5
$$ 196 -145 190 -67 -84 -87 105 58 -69 46 170 247 33 60 19 -124 108 -106 59 95 95 20 -123 56 31
4927C1J37q4p3k7mj05J5p0J71Q3m5m0K31q4k48J00j75J62m3K6K10k38N1J64K2
$$ 31 168 84 11 -16 -20 -125 -110 -180 -9 74 29 -11 220 136 -112 -12 -187 -25 -68 -42 168 -70 -19 145 167
4952A67j96K35j36Kk34K34nK32l79J17J20k58L49k73K0J93j99jq7J88Q3k08K92
$$ 167 -29 206 70 72 -162 72 67 299 -80 37 157 -101 248 -25 -5 188 -11 -12 -99 89 172 -36 256
4975B56m7j81k17K0M03l07J54m71L41J77j70K88l52J19l0K58j99k76K09Q2Q2J67
$$ 256 209 28 -189 -169 234 -73 81 -390 -49 128 -42 246 -106 13 -17 241 42 -234 -25 57 139 306
4997C06l45Qp6J09j37j36L52k40L96r3k61J85J20J1l9j50pj32M93n40K87j40K9
$$ 306 -39 -31 -107 2 -135 -271 81 -159 237 144 -117 68 188 199 160 10 3 -129 364 -176 111 -29 0
5020@K17k19k59K35K47m1j97K50j65o4mj7K88j32k1j14k20J49J06P8k05R0J25
$$ 0 217 -2 -261 -26 221 180 -17 233 68 4 0 -17 271 139 118 4 -216 -67 39 117 -88 2 127
5043A27m02J2R4jM1q7R1J67J08k17n2L84k56L7J08l26R2M5J29N7N8k43j71K06
$$ 127 -275 -263 -169 -170 -129 -216 -125 42 150 -67 -119 265 9 46 154 -172 -80 -35 94 151 209 -34 -205 1
5067Ar8K42m8j71K68k05j30K32r2R0j29J74Qr0J48n14N62k35O4L2P2k6k17N4L14
$$ 1 -97 145 97 -74 194 -11 -141 91 -1 89 -40 134 142 52 200 -314 248 13 77 109 181 155 -62 -8 306
5092C06l80J50O9k59j58L25j6j23L90l52k2k5j60J53J9o8P5K6O5l62N86m07j7
$$ 306 -74 76 145 -114 -272 53 37 -86 304 -48 -70 -95 -255 -102 -83 -151 -76 -50 15 -347 239 -168 -185
5115a85K08j10K0J14l72M36J2j20J5N8j50J20Q8k21J12j58J66k66L13J36l11J32
$$ -185 23 -87 -67 47 -325 111 123 3 18 76 -74 46 134 -87 25 -133 33 -233 80 216 -95 37
5137C7J0l70N19k09J73n3j10j5o0K65l73K55j41p2K17l7j89N8J66J22m36K24l2
$$ 37 47 -323 196 -13 160 107 -3 -18 -78 187 -186 69 -72 -144 73 36 -153 -95 71 193 -243 -19 -51
5160e1K47j89k95L25L8N2r3j90J10p6k8q5J6L64l78L01j35j22M52k36m9J05j8
$$ -51 196 7 -288 37 75 127 34 -156 -46 -122 -150 -235 -219 145 -233 68 -67 -189 263 27 -22 83 65
5183F5k70L21k72J07j16L27l2J48m17L14Lk98L34l44L75j52K4k03O2J48l66K18
$$ 65 -205 116 -156 -49 -165 162 130 278 -139 175 178 -120 214 -130 245 93 117 -86 -24 124 -242 -24
5205b4L6P2O7p3p0k32L62j72j21m6KL11j28l77N22l35N3K87k10l8J10J47k74l9
$$ -24 12 84 151 78 8 -224 138 -34 -155 -201 -199 112 -16 -393 129 -206 -153 134 -76 -114 -4 143 -131 -170
5229a70K95l06L67j67m6K08j33j46K24p5j14J56p2o2O6j8R3j56q0J16r6J01J27
$$ -170 125 -181 186 19 -27 181 48 -98 126 51 -63 93 21 -41 25 7 100 -56 -136 -20 -116 -15 112
5252A12r0K13l63M81m62NR4l0J20k27M61n16K42m3m6m5j09J59M91k88j56j15K81
$$ 112 22 235 -128 353 -109 -104 -10 -40 80 -147 314 -202 40 -3 -49 -94 -203 -44 447 159 3 -112 169
5275A69k85k2K63k71J78k34J12K35k22K14k78k3L99l54J82o2N1Q9l97K29n3L33
$$ 169 -116 -138 125 -146 32 -202 -90 145 -77 137 -141 -164 235 -119 63 1 52 141 -256 -27 -80 253
5297B53j95j83L11l81M24j27k78K75L4l62K29K36k80R5p8M7NJ18l20K18l86K20
$$ 253 58 -125 186 -195 229 102 -176 99 133 -229 0 236 -44 51 -27 20 25 143 -177 41 -345 -125
5319a25R7p8J01j72K32n3j4J21k54P6Q9o1j20L46j28l01J38K58m12N49l42m2j8
$$ -125 -28 -106 -5 -177 55 2 -12 109 -145 -69 20 -41 -161 185 57 -244 -106 152 -260 289 -53 -95 -113
5342a13O4K05j92n5k1J98Q2m29J89M5R4O2J86k96j79J13J21q4K48m09K67J23r6
$$ -113 -49 156 -36 -91 -112 86 168 -261 -72 -27 67 129 315 19 -160 -47 74 -10 238 -171 96 219 123
5365A23k22j9L96k80n8J08J22k54p1k1q9M68o8k00J67l45O3J59Q1M5k43P3L9q3
$$ 123 -99 -118 278 -2 -60 48 170 -84 -155 -176 -265 203 135 -65 102 -243 -180 -21 60 105 -138 -65 -26 -109
5389a09J11R8j50l11M17o1r9L02l62P0L90j75j22j6m2o7J69R2k05J78k86N30o6
$$ -109 2 100 -50 -361 56 -5 -104 198 -164 -94 296 121 -1 -17 -59 -126 43 135 -70 108 -178 352 286
5412B86l77J67q1J65m15K11L63n50O98n10J7J68k98J08Q1Q3O7j10M2k67Q4Lq4
$$ 286 -91 76 -5 160 -255 -44 319 -231 467 -43 -26 142 -156 -48 33 116 183 73 115 -152 -68 -65 -149
5435a49J34k01K50K6O2k88K55o0j70K82p6q5m4q1L46k99k6L09k64K9j6K3J3l1
$$ -149 -15 -216 34 60 122 -166 89 29 -141 141 65 -20 -64 -145 201 -98 -124 185 -79 -50 -66 -43 -30 -61
5459f1j8O3kK53m19M02k95L00n1k14K32l90J45k56J96Q8m7L16j7j92J22k48J63
$$ -61 -79 -16 -18 235 -184 218 -77 223 172 -42 190 -200 -55 -311 -115 -27 -74 242 225 33 155 -93 70
5482G0j44L3P1o6j0k78M97l92K12J73k20j57K17k10K25MJ19j92K32j93k16J19
$$ 70 -74 -41 30 -36 -46 -324 173 -219 -7 166 -54 -211 6 -204 21 25 144 -48 184 -9 -225 -106
5504a06KJ58l7j44KJ58o7j00J58J03m50M55j09k11K88L9l0m5M1k07n8K12k64K57
$$ -106 -104 54 17 -127 -125 33 -34 -134 24 127 -323 132 23 -188 100 139 109 64 105 -102 -160 52 -212 45
5528D5j2J94j28k06J16P5L09n83K3o5J71p7P9l6l9J83l4l52M96m9LJ7k44On3J70
$$ 45 33 227 99 -107 9 84 393 -190 -167 -232 -61 -138 -59 -95 -134 49 15 -337 159 110 113 130 -114 -108 -161 9
5554Im4L6n2J18j70K46J21j91k8J78k91q2J10OJ67o8p4O2q5N8J93k59j47J54Q5
$$ 9 -35 1 -51 67 -103 143 264 73 45 223 -68 -150 -40 -34 133 65 -9 53 -32 26 219 -40 -187 -33 52
5579E2k6J02j89N9K21m39P7L32m03L48m33M73l08j15M56k03O7k14J90j58j76M35
$$ 52 26 128 -61 -2 219 -220 -143 189 -214 134 -299 174 -134 -249 207 4 71 -143 47 -111 -287 148
5601A48j04K47l39J35M5n10N23j06p7j30K33j06J34j6k69K89j04n4K88j91j37
$$ 148 44 291 -48 87 132 -378 145 39 -38 -168 65 -41 93 77 -192 97 -7 -61 227 36 -101
5622a01K25j05K27j34j52J17o0K41n64L76j1k32L60m59J94K81m5rk25K25k80J06
$$ -101 124 19 246 112 -40 77 17 258 -306 70 59 -173 187 -272 -78 203 158 149 -76 149 -131 -25
5644b5j00K15j33q5M0n1R3J67j22oo5J25L7k24K44o3K0r2K0J15k57L8K14J35l55
$$ -25 -125 90 -43 -128 -88 -139 -46 121 -1 -7 -72 53 90 -134 110 47 67 -25 -5 110 -147 -109 105 240 -115
5669a15Op1M07k84J5P4J58o14N29k54J05K7k38J97R2J57k02l7J09k59Q5J16l1
$$ -115 -109 -180 227 -57 -42 32 190 -424 105 -149 -44 -17 -255 -58 34 191 -11 -48 61 -198 -113 3 -28
5692b8l6M3Ol3j39J87j67L25p9k07J49o4j91K04l2M5P2j47M1L2J97k95oj48K31
$$ -28 -64 -21 -15 -48 -187 0 -167 158 79 -128 21 -43 -234 -30 -62 -17 55 -92 -51 -19 178 -117 -123 -271 -40
5717d0J51j90K1RK12N9P7k38l72M15j01K08j01O5j75o8m1J77k0n1J0J93j79j43
$$ -40 111 -79 -58 -49 163 222 299 61 -311 104 3 211 110 175 0 -68 -109 68 48 -3 7 200 21 -122
5741a22N0N1o6M6J54L3k27K14l78L30j78o6K75N3n13M02j36n9J88r7j37L15k38
$$ -122 -72 -21 -87 -41 113 146 -81 133 -245 85 -93 -159 116 169 -344 58 -78 -137 51 -46 -183 132 -106
5764a06J8L29j40l06K09j41J38j89J95o3o6J20k25K00k10J45n1K10j31j13J30
$$ -106 -88 241 101 -205 4 -137 1 -188 7 -56 -122 -2 -227 -27 -237 -92 -143 67 -64 -177 -47
5785d7j16K81j50k7K19l19K78k23K33K16l44J31oj14k2J51j73K07j74r4o1J74
$$ -47 -163 118 -32 -59 160 -159 119 -104 129 345 1 132 126 12 -10 141 -32 175 1 -93 -154 20
5807B0k29L21K1k20R4q7K85l1P1p8r7L8J54l39J38PJ01k19M0k53K74R6k01K86
$$ 20 -209 112 133 -87 7 -80 205 174 245 167 70 108 262 -77 61 68 169 -50 -10 -263 11 107 -94 192
5831A92k38k56L47k19j47M37l50L41j60N3j84K03K68k79J65k46P1PK7k4J24l96
$$ 192 -46 -302 45 -174 -321 116 -234 107 -53 0 -184 19 287 8 173 -73 -2 5 32 8 132 -264
5853b64J72M1j4J61K3k38R5m3P3Pq7J08p0N6L5j38J43m1k69K69k65L43j23n1J05
$$ -264 -92 -51 -65 96 119 -119 -24 -67 6 13 -74 34 -36 20 55 -83 60 19 -250 19 -246 97 -26 -77 28
5878B8j53L03k59kj67K57r0J14n3J20j22k3K48j52P6k49M28o11K43J14L8N8j46
$$ 28 -125 178 -81 -83 -250 7 -83 31 -22 98 -24 -47 201 49 125 -124 304 -307 -64 50 88 146 0
5901@K5P7J2p9j79L08j28L72m46j82K22K4K00j60J8J23j7J9l34J24j77K10J19
$$ 0 25 102 114 35 -144 164 36 408 -38 -220 2 26 226 66 84 207 190 209 -125 -1 -178 32 151
5924A51r3j02k0LJ72k09Q1j0r8O0J18k5J4j26k14Q2J97q7J20Mr3P5k9J88j50J17
$$ 151 58 -44 -64 -61 111 -98 -17 -27 -125 -65 53 28 42 -84 -298 -216 -19 -106 14 18 -75 0 -29 159 9 126
5950A26j35j24J90k33J03K58j87R4M3L6p3j13K57l69J02Q9J16q9k24Q1p6M2L56
$$ 126 -9 -133 57 -176 -73 185 -2 92 135 171 98 -15 242 -127 -25 64 180 91 -133 -52 -128 -86 270
5973B70k97K54l03N04o06J57J3Q5j14j6K44k44N2J87k54K64o0k32K11k92R3O1
$$ 270 -27 227 -76 428 -178 -21 -8 77 -37 -53 191 -53 -1 186 -68 196 136 -96 115 -177 -84 -23
5995b3L26l60M0L9l8J12r1n5J36j1k4j94o7P7J41N4j56o1L54j52k3n3J85k59J70
$$ -23 303 -57 -17 22 -16 96 5 -50 86 75 51 -143 -210 -133 8 62 -94 -155 199 47 24 -29 156 -103 67
6020F7J16j16o7p8j4K21n3p9O3J40m81L16j89j62L48j48L33r9k58J57j78K89L4
$$ 67 183 67 0 -78 -92 129 76 -3 60 200 -281 35 -154 -316 32 -116 217 118 -140 17 -161 128 162
6043A62l69R9K79k84J37k10K11j92J38l9J25J23j23R7l26K99j34j5Q2mk84K27
$$ 162 -207 -108 171 -113 24 -186 25 -167 -29 -68 57 180 57 154 -172 127 -7 -22 60 56 -228 -1
6065aq8K9p5L66k83l2J91j01L14m77K79k7r3j74J86j02J22K34k40Q6j85J63k34
$$ -1 -89 -60 -135 231 -52 -84 107 6 320 -157 122 95 2 -172 14 -88 34 268 28 114 -71 92 -142
6088a42J02J45j65j51J2K04p2J37P9o5m5O1k14R9K4j34J65Q0k55K52J4j84J65
$$ -142 -40 105 -60 -211 -199 5 -67 70 149 84 39 100 -114 -15 9 -125 40 120 -135 117 131 -53 112
6111A12o6j22j60L37K42m10j26L03j48j46m1J53R7O5k67M98l11o7J31l37J57J6
$$ 112 46 -76 -236 101 343 -67 -193 110 -38 -184 -225 -72 25 90 -177 321 10 -57 74 -263 -106 -90
6133i0P2J2n5P3j61J1L88m23J07P2l02K42K85l78K95o0k01J86j99K06j61J06o8
$$ -90 -18 -6 -61 12 -149 -138 250 -173 -66 6 -296 -54 231 -147 148 88 -113 73 -126 80 -81 25 -43
6156d3JJ18p0k3k18K97j48N7l7Pj9K1J13L0j84J99L25m43M2M7Lj80K25l46O7L06
$$ -43 -42 76 6 -17 -235 62 -86 -29 -66 -59 -78 -57 56 86 -98 101 426 -17 25 72 75 -105 120 -226 -159 147
6182A47j88rR8L8k83K62o1O7J54j51O7k41K38j22J1k45J10oK8K58j48J83j40p8
$$ 147 -41 -50 48 86 -197 65 4 71 225 74 141 -100 138 16 27 -218 -108 -114 -86 172 24 207 67 -11
6206a1l3Qj26J16o3P2J43k43J64j08J20j55q9J6L56J45n26K24J32k27j06J71r
$$ -11 -44 -36 -162 -46 -109 -37 106 -137 27 -81 39 -116 -205 -189 167 312 -214 10 142 -85 -191 -20 -29
6229b9m8M1J62l84L48j45J78k50N4P7R5j62P6J42J8k81n3L27k71J49J5L23l73
$$ -29 -77 -36 126 -258 90 -55 123 -127 -73 4 99 -63 13 155 173 -108 -161 166 -105 44 59 382 9
6252Ij09M5N9j98J23J8K9K57j48m7m9J10k35J30j02J97L1J4j62J25r9J38j44m5
$$ 9 -100 -55 4 -194 -71 -53 -24 233 85 38 -11 99 -136 -6 -108 89 120 134 -28 97 -2 136 -8 -53
6276e3J2J01j53K42MN0k95K51j54J09k64J48j27K24J4J64k92m1K06k37r6N8J84
$$ -53 -41 60 -93 149 153 203 -92 159 5 114 -150 -2 -129 95 109 273 -19 -60 146 -91 -187 -129 55
6299E5N2j43K00j61J43M8m14L92j53K9O0P7l02K88o1Q0m15L17j43N1Q5j45K6q7
$$ 55 107 -36 164 3 146 194 -220 172 19 48 108 185 -117 171 110 190 -225 92 -51 0 85 -60 -34 -121
6323a21K32p7j84K3K29k5r2J57M4m74K30R5mjN3J33j80J31j01Q7p7N7j07n9L6
$$ -121 111 34 -150 -127 102 77 -15 142 186 -288 -58 37 33 32 85 218 38 169 68 155 78 135 28 -31 5
6348E%L5J31j56m5p0kJ30J11o0j23o8J87k8P4ll67K12p4L9O1j5J6L2m5J45k49
$$ 5 5 40 171 15 -30 -100 -102 28 139 79 -44 -112 75 47 121 118 -249 -37 -111 -72 -11 -26 -10 22 -23 122 -127
6375a27R3J89l28J21j27j3K10R9k58l1ML46oj63K67j31j22Q9l48n8M38j48j14
$$ -127 -34 155 -173 -52 -179 -192 18 117 -141 -172 -168 178 172 9 276 145 23 112 -236 -294 144 -4 -118
6398a18K96l19o4K80k13J94Qo5N7m2k7j42K88j10n4J64j60J07j13r7J33o0J09
$$ -118 178 -141 -205 75 -138 56 64 -1 56 14 -13 -155 133 23 -31 133 -27 80 -33 -130 3 -57 52
6421E2lj88L88l84K77kj15N6j35qk91L30k48J56n7r0K90o6J25Rj6%m7Q6o4l41
$$ 52 49 -139 249 -135 142 140 25 81 -54 -62 -353 -23 -271 -115 -172 -262 28 -38 87 96 80 80 33 119 55 -286
6447b86L61Jp6k37K54m7m8O1Mj69PK55M8j17N5N0j45k6j46P4N0J92j16l4K2j0
$$ -286 75 76 0 -237 17 -30 -78 -17 -13 -182 -175 80 128 11 66 116 -29 -55 -201 -127 -77 115 -1 -35 -13 -23
6473b3J51j50P1k8k55L85k84J4J35l04M06k5L5j59jn7j25L56l43O0Qo7K97r4j91
$$ -23 128 -22 49 21 -234 151 -133 -119 16 -288 118 93 128 -31 -32 -89 -214 142 -201 -141 -133 -200 97 3 -188
6498a88K90k31K10Q3k60P3J2r3j7N9jJ33j28O1j10k1K01J65l76K68j92Q9k08J97
$$ -188 102 -129 81 164 -96 -23 -11 -104 -121 -62 -63 70 -58 3 -107 -128 73 238 -138 130 -62 27 -181 16
6522A6n6k8p2L30p3j2p6J57l35J39L77l42L4k09J93o8l3J53l89M24J32m15R6j21
$$ 16 -40 -68 -140 190 117 105 29 186 -149 -10 367 25 59 -150 43 -25 -58 95 -294 130 262 -153 -57 -178
6546a78M59l07j91N76n38M16j31j99K93p9j96N8j3o9K48j14j14l9pL13k25l04
$$ -178 281 -26 -217 359 -179 237 106 -93 200 121 -75 -17 -30 -99 149 35 -79 -118 -125 188 -37 -341
6568c41M44j7L6l9Q0l09J44Q8j09j66J73L3P9q7j5J8k51L00q5k9N0M7R5l88K65
$$ -341 103 86 122 83 163 -146 -2 86 -23 -189 -16 17 96 9 -6 12 -239 61 -24 -53 -3 44 139 -249 16
6593A6j45QM4k01J26O9K48j66J20j79J4j59L80O2m17L31j84k06J30R6J4OJ60j68
$$ 16 -129 -121 -77 -278 -152 -83 165 -1 119 -60 -46 -205 175 237 -180 151 -33 -239 -109 -13 1 7 167 -1
6617aJ15J2j16M2M4l89P0K35L4J9k4K8k1R0k48K17L36k87l25K87p1j4l5j05L35
$$ -1 114 126 10 52 96 -293 -223 12 46 65 41 69 48 138 -110 107 443 156 -169 118 47 33 -2 -107 228
6642B28k75K76k90M30l35k7J12k36K79o9K1k84J32j16J93R3k05M1K52k23K1k58
$$ 228 -47 229 -61 369 34 7 119 -117 162 93 114 -170 -38 -154 39 132 -73 -32 220 -3 18 -240
6664b40L15J75l32M2J76k99K42j97J58p8j58L04R9k87MJ71l89J14N6K93l30L18
$$ -240 75 250 -82 -40 136 -163 79 -118 40 -38 -196 108 207 -80 -76 95 -294 -180 -124 169 -161 157
6686A57k75P5m4J91j58O1r2J24K05k79J88j14%j26J32K7k65K18l58J87L26l98
$$ 157 -118 -43 -87 104 -54 7 -85 39 244 -35 153 39 39 -87 45 72 -193 25 -333 -146 180 -218
6708b18J48K40l89K81l01O0L71k35J59k20K94p7j70L43j90j37kpJ90J4l59J50
$$ -218 -70 170 -219 62 -239 -179 192 -43 116 -104 190 113 -57 286 96 -41 -43 -50 140 154 -205 -55
6730e5j4J10l8K0J7q3o3M4J75j69M4q3L8L22j88o8q9l1J04j36J41k2K72J3j94
$$ -55 -69 41 3 23 40 -43 -106 -62 113 -56 -12 -95 -57 265 77 9 -80 -111 -7 -143 -2 -24 248 261 67
6755F7p3k09L83j56N5m0K2l29K41r8P8Q7P7j57J71p0j04O6k28R2j08K67o0j58
$$ 67 -6 -215 168 12 67 27 49 -280 -39 -137 -59 28 105 -52 119 49 -55 11 -217 -125 -233 34 -26 -184
6779a84M40l36r0K07j30M3J75J51j85N6O3n45N53p9j56m7K45j9j77J56k13m1J46
$$ -184 256 -80 -170 37 -93 -50 125 276 91 147 210 -335 218 139 -17 -64 181 162 -15 141 -72 -113 33
6802C3rj12J02r1L32k46O4M7k98L51m45J91m9K23j37j67R8K77L0k17r4J55J88
$$ 33 24 -88 14 -77 255 9 73 120 -178 173 -272 -81 -130 93 -44 -211 -113 164 194 -23 -117 38 226
6825B26m65J28nJ07q8L23l87J99j92q1L43j91n4j6Q1J30k4nQ9j8p3k32L93l71
$$ 226 -239 -111 -116 -9 -97 226 -161 38 -154 -235 108 -83 -137 -153 -72 58 34 29 118 100 27 -205 188 -183
6849a83M47l75L5L26l14J47P3Qj68N0N5L24j26j86j88j12K70j34k35L50J20j89
$$ -183 264 -111 -76 250 -64 83 156 164 -4 46 101 425 299 113 -75 -187 83 -51 -286 64 184 -5
6871eJ09k41J69K1l45L24J24j91L24l34l5M1R2R1k7k02j1L20j94j88J01kK93j28
$$ -5 104 -137 32 53 -292 32 156 -35 289 -45 -80 -39 53 144 117 -85 -96 224 30 -158 -57 -59 234 106
6895A06l72K97K2P3PP5l12k35N30m59M00j83J99K1l51L86m59K31O1q4J7l4J88
$$ 106 -266 31 53 126 133 208 -104 -339 191 -268 132 -51 148 169 -182 204 -255 -24 37 -47 -30 -64 124
6918A24j73K13j00j91PK05R1l06K6J09LJ91j72m6K4j40L5K15j42j17k9J67k68
$$ 124 -49 164 64 -127 -120 85 176 -130 -104 5 8 199 27 -19 5 -135 -100 115 -27 -144 -173 -6 -274
6941b74M26k07J06r0R9j63K63n8j2o6l2M1o9J41j75J62q4Q8j64O6j46N5O6K16
$$ -274 152 -55 51 -39 60 -103 160 102 90 24 -8 33 -36 105 -70 92 8 96 -68 -2 -148 -93 -27 189
6965A89j32K25j04l78J52j21J41L0K09j24m6l5k07L77l04J91j77J67l8n8M1j53
$$ 189 57 282 178 -200 -48 -169 -28 2 211 87 41 6 -201 176 -128 63 -114 53 15 -43 -2 -155
6987a55J34J8j71L53n02J87N7K03p9o7p4n6K43Q8l03J56J60n7M0j72k4O1j75L9
$$ -155 -21 -3 -174 179 -323 -136 -79 124 45 -22 -96 -152 91 179 -124 32 192 135 175 3 -21 40 -135 -96
7011i6Q0R9J46k88K6N9Q5j37k94M39k68Q0J4J02j68j2J81k33J61M7r4p8QJ46o5
$$ -96 -16 83 229 -59 -33 26 111 -26 -320 119 -149 -69 -55 47 -121 -133 48 -185 -24 23 -71 -149 -141 5 -60
7036f0P6o0p7j5K37n9p5lp5l0L04j8p0k04K14o6J69k12KP8J51k43R9j95K98j14
$$ -60 16 -44 -121 -136 101 42 -33 -36 -111 -141 163 145 75 -129 85 19 188 -24 -22 56 207 -36 63 -132 166 52
7062E2n0m9k34J11L51l54J77k93M61k77OL40m18L88j39l36M43k11M0N5J28N0M1
$$ 52 2 -47 -281 -170 181 -173 4 -289 172 -105 -99 241 -177 211 72 -264 179 -32 8 63 191 241 282
7085B82m01Q4j24j19L41n9J47k9j33N7K6j35J74k01K74l8k39J26j41r6J90M7M6
$$ 282 -119 -35 -159 -278 63 4 151 122 -11 46 72 -63 111 -90 184 146 -93 33 -108 -204 -14 33 79
7108G9n4J11J27k07j43M39n31J66j2J49j63J23j2n4k19K30rK3K57j22j36n0J51
$$ 79 25 136 263 56 -87 352 -179 -13 -25 124 -39 84 72 18 -201 29 20 43 300 178 42 -8 143
7131A43k4k8l24M70q0l6jj38K29l20O7q2m3L69m5k13J16J3P4k2l02J25J5L02k44
$$ 143 119 91 -233 237 157 121 120 -18 211 -109 -42 -124 -167 202 157 -56 60 73 147 125 -177 -52 -37 265 21
7156B1l82L20l8j9P5j59R2K1m8j01K84J4l4k17L65j16Kj98J89j51j08L67q7J32
$$ 21 -361 -41 -79 -98 -23 -182 -90 -69 -117 -218 66 80 46 -171 194 78 80 -118 71 -80 -188 179 92 224
7180B24O2k05k04K03k4K71l73q9p6L87r3O8j67K9J14k89r1N42k30O9k68L93j71
$$ 224 286 81 -123 80 56 327 -46 -135 -211 176 83 151 -16 13 127 -162 -253 289 59 128 -140 253 82
7203H2r9p2J52j50l23L75m6QJ8P6J1N0q5K64j80j49j6n9M01j77J5q6p9J79k21
$$ 82 -17 -89 63 -87 -410 -35 -81 -73 -55 21 32 82 -3 261 81 -68 -84 -143 258 81 96 10 -69 110 -111
7228a11K24k24J67R2k58K01j1J31l43J82k12Q2J44j05j24J39K1r7mK38j09J94
$$ -111 113 -111 56 148 -110 91 80 211 -132 50 -162 -80 64 -41 -165 -26 -5 -102 -106 132 23 217
7250B17k02p4J16L1j30j6J19l7k9j07R2j79L19k32j80L77l8k10J61M8j48r6K78
$$ 217 15 -59 57 88 -42 -58 61 24 -5 -112 -20 -199 120 -112 -292 85 47 -163 -2 46 -102 -198 80
7273H0j76K61k65K10p1O2q4L6r9L5L6j52j4n1L57j03m6j50O0J46k4k82J94q7J83
$$ 80 -96 165 -100 110 39 101 17 53 -46 -11 25 -127 -141 -192 165 62 16 -134 -74 72 48 -234 -40 -127 56
7298E6j59J77j79K25j02lJ27j24P3k68K63l80M47j33j67O2r0N5K14j46J48j43
$$ 56 -103 74 -105 120 18 15 142 18 91 -177 86 -294 153 20 -147 -85 -175 -120 94 -52 96 -47
7320d7r0j00M31j33l9Rl32J88R2J4p9m7j3L50k22l1Pnj4j39L18k28Q2q2j73R3
$$ -47 -137 -237 194 61 22 31 -301 -113 -21 -7 -86 -133 -146 204 -18 -49 -42 -47 -61 -200 118 -110 -28 -110 -283 -190
7346a90q1M33J7k43K11M9K1l74N1K11p0L5J03o5j18N4L4j88o2ML41j29L35l06
$$ -190 -271 162 179 -64 147 196 217 -157 -106 105 35 70 173 108 -10 44 78 -110 -172 -168 173 44 379 73
7370G3j47J36K06k29N3m4J05K29l79J97l85L17j46qj38K87n5j20Mj7J26Qj33J70
$$ 73 -74 62 268 39 92 48 153 382 3 200 -185 132 -14 -22 -160 127 72 -48 -44 -61 65 73 -60 110
7394A10j94j24K84r7kk5J45o3m1j6j18L29m39K68K41j13j93R8R4Ql41j68L90p
$$ 110 -84 -208 76 -21 -23 -48 97 34 -7 -23 -141 188 -251 17 258 145 -48 50 144 152 -189 -357 33 26
7418B6J95j08r2j4l4j57K88j95K2O5k0K3J07j51K36l40J36M5r4J28R2q8j06p9
$$ 26 221 113 21 7 -27 -184 104 -91 -69 -4 -24 -1 106 -45 191 -149 -13 32 -62 66 158 70 -36 -115
7442a15J04n0K69k26n1J06j51j32j9L64k1k22R0J61j60l2J86k48J76MR3j64M8
$$ -115 -11 -61 208 -18 -69 37 -114 -246 -265 99 78 -144 -54 107 -53 -85 101 -147 29 33 126 -38 10
7465A0l9J5J10k27O9K1nj1p3J50j19q7J39j74L6K07j23J57j03j10J93k97K45r6
$$ 10 -29 -14 96 -131 -62 -41 -46 -57 -130 20 -99 -186 -47 -221 -185 22 -101 56 -47 -157 36 -261 -16 -112
7489a12j4J64j91J53j38J68p0L1J72nk93M4r3J27Q6J15p6k29K97j02p2J62j85
$$ -112 -126 38 -153 0 -138 30 -40 -9 163 158 -135 -91 -184 -57 29 144 68 -161 136 34 -38 124 -61
7512f1J69j07O5o5K2o5J03J1P1j74J84p5l9q0o3K43k05M8l7j72L1L12j41J24j49
$$ -61 108 1 66 1 23 -42 61 72 143 -31 153 78 39 -41 -104 139 -66 -18 -55 -227 -196 116 -25 99 -50
7537e0nM5k54J34L8K0l4jk17L81j04P2l0k99L44k93N74r5j03q6Q2k19K6Pl8K30
$$ -50 -55 -10 -264 -130 -92 -72 -106 -107 -324 57 -47 25 -5 -304 40 -253 321 226 123 37 119 -100 -74 -67 -105 125
7563A25j00j43K47l2m20M94l32K05j09J64P3j06k0l34L79p5lP3J47l33J81j95
$$ 125 25 -118 129 97 -323 171 -161 44 -65 99 172 66 46 -288 91 16 13 86 233 -100 81 -114
7585a14R3J5J00k25L0J75j00j02n7K39j52J53j07j94P7K07Pj16j22M20J17k08
$$ -114 -21 -6 94 -131 -101 74 -26 -128 -185 54 -98 55 -52 -246 -169 38 45 -71 -193 227 344 136
7607A36k89L18K2j54k17J60J52Lr5J17k43R7k8k20K99p1J36k18J22J04k76K28
$$ 136 -153 165 187 33 -184 -24 128 131 36 153 -90 7 -21 -241 58 -13 123 -95 27 131 -145 83
7629H3j68J90j09L91l90j0J2l8j43M67m34K12o5j39K17n9J21j16r8K15Jj96R3
$$ 83 -85 105 -4 387 -3 -13 -1 -39 -182 285 -149 63 -2 -141 76 17 138 22 -76 139 140 -56 37
7652C7P4j46j5K09j44O9k87J19J59k54J73K41j12k65J89J92pj80q9L0O9q0K30
$$ 37 111 -35 -50 159 15 84 -203 -84 75 -179 -6 235 123 -142 47 239 232 52 -37 -7 62 -18 212
7675B12j83q3o9L07O3j67j52J12r5L81n0k97O5J6K46m46J25k46J96J09j76K12
$$ 212 29 -54 -123 184 247 80 -72 40 -55 326 276 -21 44 60 306 -140 -15 -261 -65 44 -132 80
7697H0k19O2K20q2K6n2K1J20k20k60L7L58j59j85K36m9K67j61j52K27k31K28l12
$$ 80 -139 -77 143 61 87 35 56 176 -44 -304 -267 91 -68 -253 -17 -66 201 40 -112 115 -116 112 -200
7720b00J44J45j95P0PJ00j01K8L9N4r9J19j41J8L2n2Qm8O5m1J56k04LL26j19l11
$$ -200 -56 89 -106 -36 -29 71 -30 -2 37 91 -8 111 -30 -12 20 -32 -24 -72 -7 -48 108 -96 -93 233 114 -197
7746a97k2L68j72J45j57r3J73N1m7q1j44K8L74o2q8k1O0n2k10M5J58j14l1L63
$$ -197 -219 149 -23 122 -35 -128 45 96 49 -32 -176 -148 226 164 76 55 115 63 -147 -102 56 -58 -89 274
7770B74k22kL4o6p3Nj81M57k57N4k41K68k66O8K06j17M8KN3k00K22j2Jk00K79
$$ 274 52 50 84 18 -55 -50 -231 226 -31 23 -218 50 -216 -148 58 -59 -11 -9 44 -156 66 54 55 -145 134
7795A34J37j98k1J9P8j46J06j78N8L7n9l0n0J49j04p8M17k41j85J03OM8p7K7p1
$$ 134 271 73 52 71 149 3 109 -69 -11 26 -33 -63 -113 36 -68 -146 271 30 -155 -52 -46 2 -75 -48 -119
7820a19J63l7j20J37j52Nq2J43no1J36k23K27k26M95l12K03k14j08J95J0J60J38
$$ -119 44 7 -113 24 -128 -123 -205 -62 -67 -128 8 -215 12 -214 281 -31 172 -42 -150 45 55 215 353
7843C53j64k2rk41j5j11P4J69m3J91k09J58j29j43J86Q2j9k6J47j56j01J21j22
$$ 353 189 167 158 -83 -98 -209 -135 34 -9 182 -27 131 2 -141 45 127 108 82 229 73 -28 93 -29
7866b9N4k43Q5K21k61K46j32J06Q4j6m78L22j33R8j81N5l9J99j5j31K62k24P2
$$ -29 25 -218 -133 88 -173 73 -59 47 131 115 -363 -41 -174 -76 -257 -202 -241 -42 -57 -188 74 -150 -78
7889g8p3Q5L31l77N9L12l92K67L6k18J14O0k63k9l6J42J83l8PJ42m32J40J09Q3
$$ -78 -151 -66 265 -112 -53 259 -133 134 170 -48 66 126 -137 -166 -202 -60 123 85 92 234 -198 -58 51 134
7913A34k22J20K07k57J47j3M3k22J20o2N8m5J24j26mK37l88L44l07M1j27J51J12
$$ 134 -88 32 239 -18 129 116 159 -63 57 -5 53 8 132 6 2 239 -149 195 -112 -71 -198 -47 65
7936F5k2O5k27M9P2j4J20O8o4l37J19J45m4l5J51k03MJ62K02n86L71Jj68J88R1
$$ 65 43 108 -119 -70 2 -12 108 176 112 -225 -106 39 -5 -40 111 -92 -88 74 276 -310 61 62 -106 82 173
7961A73j96J93q3k66K57N3j28l5K14k54N4K7j57j8L2k23M52L1n25M64K5J3j90
$$ 173 -23 170 87 -179 78 131 3 -32 182 -72 -18 9 -148 -166 -134 -357 95 126 -399 65 90 103 -87
7984h7J51K06l98J61J11j83P2l9J60q0k10Q6L6K1R5j41O4j43K7m6Q9K62k79O2
$$ -87 64 270 -128 33 144 -39 33 -6 154 74 -136 -50 -14 7 102 -39 25 -118 -91 -137 -48 214 -65 -3
8008cL5k62K84j51KJn6K78k27J73rJ15l4k20R1j03N9j6M58l93j33K07k79j7J12
$$ -3 32 -230 54 -97 -95 -94 -150 128 -99 74 65 180 146 -74 17 -86 -27 -43 415 22 -111 96 -183 -200 -88
8033h8J88j72K04k51k8j18L88k7j21K3J86q9j06K64j35R2j12j79k8J11K28l12
$$ -88 100 -72 132 -119 -147 -265 123 96 -25 -2 184 95 -11 253 118 210 98 -81 -109 2 230 -82
8055h2k7J17j1j37J60O5k4j74L8q6K19J98l32r0O9K37j76L2P1n6k64R1J23K64
$$ -82 -109 8 -3 -140 20 85 61 -113 -75 -161 58 256 -76 -166 -97 140 -36 -4 67 11 -253 -162 -39 225
8079B25l25K12k13j51M61k42j40M09k23k7J96Qj69j76J70J74m4j33Jj01K50k24
$$ 225 -100 112 -101 -252 209 -33 -173 236 13 -14 182 190 21 -155 15 189 145 12 13 -88 162 -62
8101f2J46j6k13J18O1J67m6j05L6J28k12p2n0J37j54K47k53L3J91j59J04J86j61
$$ -62 84 68 -145 -27 34 201 155 50 86 214 2 -70 -120 17 -137 110 -143 -110 81 -78 26 212 51
8124E1k7m0j13N8P3n2m4K53q5k98K86k23K4r1K12K17k64J10K2r7J13l8j38L3L
$$ 51 24 -16 -129 -71 2 -50 -94 159 74 -224 62 -161 -137 -228 -16 201 -63 47 69 -28 85 47 -91 -58 -55
8149e5j24K9jJ35N4M3j14j03J99K2km4k44K26Jm2j00K2m3J58J88j63k05L59j13
$$ -55 -179 -150 -151 -16 38 81 -33 -136 63 85 83 39 -205 21 22 -20 -120 -98 -141 17 205 42 -163 196 83
8174H3j57J64r8L14m68J96O6m0Kj9j46K04p8k85J69K40j23
$$ 83 -74 90 -8 306 -162 34 100 60 62 43 -103 101 23 -262 -93 147 24
8191B4
$$ Imaginary data points
##PAGE= N=2
##DATA TABLE= (X++(I..I)), XYDATA
0@%%%%%%%%%%%%%%%qJ6j6J6j6K0k8L2l6M4n0N8o8P6q8J04j20J34j50J69j88K12
$$ 0 0 0 0 0 0 0 0 0 0 0 0 0 0 0 0 -8 8 -8 8 -8 12 -16 16 -20 24 -26 32 -36 40 -48 56 -64 70 -80 89 -99 113
37A13k37K63k93L26l62M02m43M86n38N95o56P22p96Q78r68J066j174J299j440
$$ 113 -124 139 -154 172 -190 212 -231 255 -283 312 -344 378 -418 460 -508 558 -616 683 -757
56g57J599j785K003k259K569k953L440m080M959o249Q316j2108K1158p8737n4230
$$ -757 842 -943 1060 -1199 1370 -1583 1857 -2223 2736 -3513 4803 -7305 13853 -64884 -119114
71a19114K17439q3965o9335J03049l0593n9730J14191l5850j15768J22028O574
$$ -119114 98325 14360 -54975 48074 17481 -42249 71942 36092 -79676 42352 48926
82D8926j03551P4067P230n0601L1139J9780m7574K2863L1065n3278L5548P761
$$ 48926 -54625 19442 26672 -23929 7210 26990 -20584 2279 33344 -19934 15614 23375
94B3375m0906M6016k2766k8699L3152k276k5641K1402M680m0597O1951l751p6616
$$ 23375 -17531 28485 5719 -22980 10172 7896 -17745 3657 8337 -32260 29691 25940 -50676
107e0676P2301J0615n5363L8814J1051n1676L0894M2991q8113J9885O3106p8457
$$ -50676 21625 32240 -23123 15691 26742 -24934 5960 48951 -39162 -19277 43829 -34628
119c4628K2188M3030n6321J2632M7880m4950j6382P1589m8737k4957P2797m7871
$$ -34628 -12440 30590 -25731 -13099 34781 -10169 -26551 45038 -3699 -28656 44141 -3730
131c730q335M3827m5867p088N4693l1352m8681P2290r285n2116O1154k3606k8757
$$ -3730 -12065 31762 -14105 -21193 33500 2148 -46533 25757 16472 -35644 25510 1904 -26853
144b6853N2110j9418l2234M2065L838n5957M7384J5866o4237M3592L297l5912
$$ -26853 25257 5839 -26395 15670 19508 -36449 10935 26801 -37436 6156 9453 -26459
156b6459M2480n044m1369L2700L0218n6416J5878L2944n3360L2522J5849n0094
$$ -26459 16021 10977 -30392 2308 32526 -23890 -8012 24932 -28428 4094 19943 -30151
168c0151K6417J6681l4022Q825K7937m3867J0152M7289n6162J2906L7862m4467
$$ -30151 -3734 12947 -21075 -12250 15687 -28180 -18028 29261 -26901 -13995 23867 -20600
180b0600J2997K8228l3780m233M5872l5178k0324O1578l7895j8630M5669k8308
$$ -20600 -7603 20625 -13155 -17388 28484 -6694 -27018 34560 -3335 -21965 23704 -4604
192d604n838L3039k0524k4750M5325n484m1509M3664j5947k4106M7591k2330k9427
$$ -4604 -10442 22597 2073 -22677 22648 17164 -24345 19319 3372 -20734 26857 4527 -24900
205b4900L5499P687l6399K2042J2256m1468L8346M206m2811L6205L398l1009J8801
$$ -24900 10599 18286 -18113 3929 16185 -25283 13063 17269 -25542 10663 14061 -16948 1853
218A853J5276l3121J0484K5936m2488K3865K0759m8393K4547K1222l2534M886
$$ 1853 17129 -15992 -5508 20428 -22060 1805 22564 -25829 -1282 19940 -12594 -7708
230g708K4737k6850k053M0174l9438k292L7529l5295O231K4520k6986m272L2110
$$ -7708 17029 -9821 -11874 28300 -11138 -13430 24099 -11196 -4965 19555 -7431 -11703 20407
243B0407j5866k1441L8719k3058j4190M2408k9665j1187L3003j4526j7755K7518
$$ 20407 4541 -16900 21819 -1239 -15429 26979 -2686 -13873 19130 4604 -13151 14367
255A4367l204l2658L6066l740l0833L7673j3146k1947K9855l303k4849J8819J0257
$$ 14367 11163 -21495 14571 10831 -20002 17671 4525 -17422 12433 9130 -15719 3100 13357
268A3357l5058K8167J0423m3030L0949O908l0585J9765R205k7403R640K6318l4654
$$ 13357 -21701 6466 16889 -26141 4808 11716 -18869 896 10101 -17302 -7662 18656 -15998
281a5998P180K5450l7478J8047J8050l1382Q373J9126j8814l089K7170k8458m181
$$ -15998 -8818 16632 -20846 -2799 15251 -16131 -7758 11368 -7446 -10535 16635 -11823 -16004
294a6004L8489l2718j217K6422k3037n65K2493j3604j6896K9495j0630j8455L4567
$$ -16004 22485 -10233 -11450 14972 -8065 -8630 13863 259 -16637 12858 2228 -16227 18340
307A8340k1282j1608K9915j4980j1640J9338l955k0843K7626j06l2113L2819m602
$$ 18340 -2942 -14550 15365 385 -11255 8083 4128 -16715 10911 10805 -21308 11511 6909
320F909k3570K7565n040k0935J6815J1396k6760J2370J4209l2231K2174Q669k8428
$$ 6909 -16661 10904 5864 -15071 1744 13140 -13620 -1250 12959 -19272 2902 11571 -16857
333a6857J9350O407j9455Q898J6631k4962K974K5488l0333R688J9072l0010J0063
$$ -16857 2493 8900 -10555 -1657 14974 -9988 -7014 18474 -11859 -2171 16901 -13109 -3046
346c046J7567j7617m760K0215j3861o871K9619k4604m895K7949k1565j508J7843
$$ -3046 14521 -3096 -7856 12359 -1502 -8373 21246 -3358 -8253 19696 -1869 -3377 14466
359A4466j3381j0291K2854o608k0763K8451j2254j6305K9669j2685j3078J8077
$$ 14466 1085 -9206 13648 7040 -13723 14728 2474 -13831 15838 3153 -9925 8152
371H152j268j4424J5549J773k5545K4018Q79k4107K2261n191j5772J7895K634
$$ 8152 6884 -7540 8009 9782 -15763 8255 9134 -14973 7288 2097 -13675 4220 6854
384F854k0791J0238J5013k5628J4622J1463k8902J8175Q999k0312O182J0530j4841
$$ 6854 -13937 -3699 11314 -14314 308 11771 -17131 1044 10043 -10269 -4087 6443 -8398
397h398L30J8687k2537M415J9858k5508Q912J5371j7263L50J4633r396o984K1739
$$ -8398 -8068 10619 -11918 -7503 12355 -13153 -4241 11130 -6133 -5783 8850 -546 -7530 14209
411A4209j8051q919K7881j7942o728J5541r182m156J3451m390j4872K1512l612
$$ 14209 -3842 -12761 15120 -2822 -9550 5991 -3191 -7347 6104 1714 -13158 8354 4742
424D742j6304K3469j0527j1350J8979n145j2310J0659L594j8932J6768M460k4346
$$ 4742 -11562 11907 1380 -9970 9009 3864 -8446 2213 5807 -13125 3643 8103 -16243
437a6243K0025J757j5951J3903K156j3526O658J1622j8607O856J1586k4902J5325
$$ -16243 3782 5539 -10412 3491 5647 -7879 -1221 10401 -8206 -1350 10236 -14666 659
450F59R358k1731Q199R965j1556R23J5264j6670o18K2535j9699J669J3838j5705
$$ 659 10017 -11714 -3515 6450 -5106 -4183 11081 -5589 -6207 16328 -3371 -1702 12136 -3569
464c569L208J1099j0059o939J6230q741r102K1363j5838m318J9344j2572l964
$$ -3569 -361 10738 679 -6260 9970 1229 -7873 13490 -2348 -6666 12678 106 -3858
477c858J2952m664j2433J6268n50j8581J8594m754j2393J6337n877q955R679K496
$$ -3858 9094 4430 -8003 8265 7715 -10866 7728 2974 -9419 6918 1041 -7914 1765 4261
491D261j2814J0379O864k0662J4764M404j6365J2481j137j0989Q716P622j6192
$$ 4261 -8553 1826 8690 -11972 2792 7196 -9169 3312 2175 -8814 -98 7524 -8668
504h668J538J6281j7431N613J0251j6904Q412P987r757L03R302r412k880J7936
$$ -8668 -7130 9151 -8280 -2667 7584 -9320 -908 7079 -2678 -2375 6927 -2485 -5365 12571
518A2571j6918k850J7123j3834N23R456q152m075J2329m313j1203J7940q338q857
$$ 12571 -4347 -7197 9926 -3908 -3385 6071 -2081 -6156 6173 1860 -9343 8597 259 -8598
532h598J7682r169n552R334l721n687R711j202j4468J6825j225j5053J7241m675
$$ -8598 9084 -85 -5637 3697 -24 -5711 4000 2798 -11670 5155 3930 -11123 6118 1443
546A443r973J1643J602j0981M926O957j4718J0177M924j8347J3267L260j1949
$$ 1443 -8530 3113 4715 -6266 -1340 5617 -9101 1076 6000 -12347 920 4180 -7769
559g769O268M362q473J888J0762j3804M093J1845j7578P313R278j2017Q02Q464
$$ -7769 -1501 2861 -5612 -3724 7038 -6766 -2673 9172 -8406 -1093 8185 -3832 -3030 5434
573E434n213m958J3371r431m651J5327j1772L28R214r343r93R826k709j0616J1944
$$ 5434 221 -4737 8634 -797 -5448 9879 -1893 -1565 7649 -1694 -2687 7139 4430 -6186 5758
588E758k384q981J5473r990o554J3991m190p145N782K464j0294R667K281j4731
$$ 5758 3374 -5607 9866 -124 -6678 7313 3123 -4022 1760 4224 -6070 3597 5878 -8853
602h853J2801r16q822J0136k905p373O566N587j3117N225R654j6085Q633M823
$$ -8853 3948 3032 -5790 4346 1441 -5932 634 6221 -6896 -1671 7983 -8102 531 5354
616E354j1324O845K635p341J839R412j0136k051J3242j1930K659P154j1399M648
$$ 5354 -5970 875 3510 -3831 -1992 7420 -2716 -4767 8475 -3455 -796 6358 -5041 -393
630c93O355o766l107R910o245n812J5050j0633m401J2466p531j687N915k804n703
$$ -393 5962 -804 -3911 5999 -246 -6058 8992 -1641 -6042 6424 -1107 -2794 3121 317 -5386
645e386Q697l74j1123J2822m001q101J1963m879m402N555k25o914O894L223j3555
$$ -5386 3311 2937 -8186 4636 635 -7466 4497 -382 -4784 771 546 -6368 526 3749 -9806
660i806J0765K463j1098Q589o57o148N278L865q206J439Q080j0946O024N363j3215
$$ -9806 959 3422 -7676 913 256 -5892 -614 3251 -4955 -3516 4564 -6382 -358 5005 -8210
675h210P922L952o607R19N685n971j363J1372j0603m95J0298j0190K880O146o577
$$ -8210 -288 3664 -2943 -2024 3661 -2310 -3673 7699 -2904 -3399 6899 -3291 -411 5735 -842
690h42j642P008j832o275R537o086l522J1678r007j505P382m003l797O249O75
$$ -842 -2484 4524 2692 -3583 5954 -132 -3654 8024 -983 -2488 4894 891 -2906 3343 4018
705D018r630R526m30r064J0572l674n688O732j40m859K610L591q943O433L861
$$ 4018 -5612 3914 3484 -5580 4992 1318 -4370 2362 2222 -2637 -27 3564 -5379 1054 4915
720D915j1340Q647L1o184O250Q81o777J269Q779r053l74Q611j0265M878M495p640
$$ 4915 -6425 2222 2253 -3931 2319 3200 -3577 -2308 6471 -2582 -2956 5655 -4610 268 4763 -2877
736b877J844M401k984l000P999o080k711J0102q868P60O353o726k00N256j655
$$ -2877 -1033 3368 384 -2616 5383 -697 -3408 6694 -2174 -1414 4939 -1787 -1987 3269 1614
751A614n940P647k086o238J0964o622m037Q383l592k499L286M8o027O845R03j0241
$$ 1614 -4326 3321 1235 -5003 5961 -661 -4698 3685 93 -2406 880 928 -5099 1746 2649 -7592
767g592R669j767o583Q227j421n306L316M232p440K660O067j0585O476K969p676
$$ -7592 2077 310 -6273 1954 533 -4773 -1457 2775 -4665 -2005 4062 -6523 -47 2922 -4754
782d754M890O36l381J013M854n750q55Q325r022L737N392r151L562M340l593k583
$$ -4754 136 772 -2609 -1596 3258 -2492 -3347 4978 -4044 -307 5085 -4066 -504 3836 243 -2340
798b340N702k879m221R743p109j991P899o215P03L449j981l185N083J22o955Q816
$$ -2340 3362 483 -3738 6005 -1104 -3095 4804 -1411 -708 2741 760 -2425 2658 2780 -4175 4641
814D641l981n433R704m587l444L894L64m193L220K989q932P119J920p789O743
$$ 4641 660 -4773 4931 344 -3100 794 1158 -3035 185 3174 -5758 1361 3281 -4508 2235
829B235j464l540L844J376n016R90N645q248M358L948r084N620J925m334J312
$$ 2235 771 -2769 1075 2451 -2565 -1575 4070 -4178 180 4128 -4956 664 2589 -1745 -433
844d33L670l689j751P538o235p05O994p705K767L626m797j00L877k104l591P772
$$ -433 3237 -452 -2203 5335 -900 -1605 5389 -2316 451 4077 -720 -820 3057 953 -2638 5134
860E134n204l291R245o232j050M381k798j745L623M06o898O153k26o021P713l921
$$ 5134 -70 -3361 5884 -348 -1398 2983 185 -1560 2063 2469 -4429 1724 1498 -4523 3190 -731
876g31k951M922j050k533K048K047o385N211K729r231O774om824M225N58l612
$$ -731 -3682 1240 190 -2343 -295 1752 -4633 578 3307 -5924 850 844 -3980 245 803 -2809
892b809M14N161n309M81N137p429M345K833n622K356J933j974j252N628n055j828
$$ -2809 -2395 2766 -2543 -2062 3075 -4354 -9 2824 -2798 -442 1491 -483 -1735 3893 -1162 -2990
908b990P800o699N42M627n012Q54L024j246l652M768j039m359P413n060j836N964
$$ -2990 4810 -1889 -1347 3280 -1732 -878 2146 900 -2752 2016 977 -3382 4031 -1029 -2865 3099
924C099m006q23K970m62m527M760J574p479P451k155m195O217j811k481J138K590
$$ 3099 -907 -1730 1240 778 -3749 1011 2585 -4894 2557 402 -3793 2424 613 -1868 -730 1860
940A860m170J696L547p339N056J580n276M307n13k324J628L132m478m03N993o477
$$ 1860 -2310 -614 2933 -4406 650 2230 -3046 1261 748 -1576 52 3184 -1294 -1697 4296 -2181
956b181K066M431o110K003K289j522j514L064j674l089O922m394j536N126m637
$$ -2181 -115 4316 -1794 209 2498 976 -538 2526 852 -2237 4685 291 -1245 3881 -756
971g56J244K311k047k281L699J78n527O533k752m017O947l401j897K502J20k540
$$ -756 488 2799 752 -1529 2170 2348 -3179 3354 602 -3415 3532 131 -1766 736 856 -1684
987a684J963J796o327N407L98n830N761j545k817K916O78k905O32L959o095L088
$$ -1684 279 2075 -4252 1155 1553 -4277 1484 -61 -2878 38 716 -2189 -1557 2402 -3693 -605
1003f05L607o885M032Q46k860J228J658j581j747N234m253l11M973o410L193K604
$$ -605 3002 -3883 149 995 -1865 -637 1021 -560 -2307 2927 -1326 -1637 3336 -3074 119 2723
1019B723l706q2K528o06l221N546l240l196O505m051l72K667k107n37J798R55
$$ 2723 -983 -1065 1463 857 -2364 3182 -58 -3254 3251 -800 -1172 1495 -612 -1149 649 1604
1035A604m461L848p1l994N759l626j911M394j355k136J181K519n127L281K706
$$ 1604 -2857 991 920 -3074 2685 -941 -2852 1542 187 -1949 -768 1751 -3376 -95 2611
1050B611o297M472o7l527L738k7k046j74L770l917N58M265o479L685J991m258
$$ 2611 -3686 786 719 -2808 930 903 -1143 -1317 2453 -1464 -906 3359 -3120 565 2556 -1702
1066a702K210J039j879p55M453l336k345O515m704J7L158l575J349J830j345k255
$$ -1702 508 1547 -332 -1087 3366 30 -2315 4200 -504 -487 2671 -904 445 2275 930 -1325
1082a325L689j147l594N951l720j647M590l323k81K098j4l410K876J343n419M985
$$ -1325 2364 1217 -2377 3574 -146 -1793 2797 -526 -807 1291 1277 -2133 743 2086 -3333 1652
1098A652r81l423M164j534j141J040R21k732J844K346o191M544J646m928L473
$$ 1652 671 -2752 1412 -122 -1263 -223 698 -2034 -190 2156 -4035 509 2155 -2773 700
1113G00j72k014Q55K639k889r56M947n087J486L296n121K409J313j336p24K261
$$ 700 528 -1486 -631 2008 -881 -1837 3110 -1977 -491 2805 -2316 93 1406 70 -654 1607
1129A607j417k131N208m118r14M854m353O61K493j676k154L094M51m308M588j785
$$ 1607 190 -1941 3267 -851 -1765 3089 -1264 -603 1890 214 -1940 1154 1605 -2703 1885 100
1145A00k861N420l284p93J899k21k165J822J706n156M165K12m405M792j469k112
$$ 100 -2761 2659 -625 -1418 481 260 -1905 -83 1623 -3533 632 844 -3561 1231 -238 -2350
1161b350K016J200k418Q6L130m239K299K207m614L376j0k340J931P25j620r28
$$ -2350 -334 866 -1552 -1466 1664 -2575 -276 1931 -2683 693 683 -1657 274 999 -621 -1549
1177a549M331l787NM004m980K134J908k192k35J617k6k869M351k434k282N028
$$ -1549 2782 -1005 -1000 3004 -1976 158 2066 -126 -361 1256 1230 -1639 2712 278 -2004 3024
1193C024l453K44K087k329K07J233L45l514L935m01m264N529k503k121L040n72
$$ 3024 -429 -185 1902 -427 -220 1013 1358 -2156 1779 1378 -2886 2643 140 -1981 1059 487
1209D87j711J155J698m114K528K230n066L584j71k515K744k94j683M21K547l268
$$ 487 -1224 -69 1629 -2485 43 2273 -2793 791 620 -1895 849 555 -1128 -707 1840 -1428
1225a428Q44L329n315K783J811l556K035P69j459o24K825k173j576M493l815R22
$$ -1428 -584 2745 -2570 213 2024 -1532 503 1272 -187 -811 2014 -159 -1735 2758 -1057 -135
1241a35K404l545Q72J668p30k027L250j527k679N362l069j737L728k607j21J334
$$ -135 2269 -1276 -404 1264 534 -1493 1757 230 -2449 2913 -156 -1893 1835 -772 -893 441
1257D41j41k529K155J303m247M060j199k477L746j532j485J351J200k618J216
$$ 441 300 -2229 -74 1229 -3018 1042 -157 -2634 1112 -420 -1905 -554 646 -1972 -756
1272g56K391m987L293J093l458K687K59k035Q05K208k218r05L788l947J508K438
$$ -756 1635 -3352 -59 1034 -2424 263 522 -1513 -708 1500 -718 -1623 2165 -1782 -274 2164
1288B164m035K254R11j839O7K244j794j803M898l024j171L954l615M80K181j494
$$ 2164 -1871 383 1294 -545 -478 1766 -28 -1831 3067 43 -1128 2826 -789 -309 1872 378
1304C78j210K067R0l240M016j430k711M283k362j098K294o79j798J723J547m356
$$ 378 -832 1235 1325 -1915 2101 671 -2040 2243 -119 -1217 1077 398 -1400 323 1870 -2486
1320b486L104M33l659M010r04k038J689N84j655K02K478m035K230K149m420K954
$$ -2486 618 1051 -2608 1402 498 -1540 149 733 -922 -720 1758 -2277 -47 2102 -2318 636
1336F36O69k750J621J432k279p01L802l139j37L648m184J469J659k368M76J239
$$ 636 1305 -1445 176 1608 -671 -1372 2430 -709 -846 2802 -1382 87 1746 -622 -146 1093
1352A093o78j576L546k311j874M763l709J32K569k219q60K019n5k800L021k06
$$ 1093 415 -1161 2385 74 -1800 2963 -746 -614 1955 -264 -1124 895 840 -1960 1061 855
1368H55l559M522j788k027K878q52j387J138R68l370K585J469m250L400l73k604
$$ 855 -2704 1818 30 -1997 881 29 -1358 -220 748 -2622 -37 1432 -2818 582 209 -2395
1384b395L033j43k026Q15K267k952O93K906m796K519J555k936J440Q97j529M1
$$ -2395 638 495 -1531 -716 1551 -1401 -708 2198 -2598 -79 1476 -1460 -20 877 -652 -611
1400f11K376k350n58L769l913O54K939l426P21J711q77j627K903j210k442M201
$$ -611 1765 -585 -1143 2626 -1287 -633 2306 -1120 -399 1312 435 -1192 1711 501 -1941 2260
1416B260k127j076K709k252p2J525k97k323K412N39l796M074j052k903L687j132
$$ 2260 133 -943 1766 -486 -558 967 670 -1653 759 1298 -2498 1576 524 -2379 1308 176
1432A76j531J385Q05k332J179J989m261K611J444l382K696m11j439Q99J608k317
$$ 176 -1355 30 835 -1497 -318 1671 -2590 21 1465 -1917 779 368 -1071 -172 1436 -881
1448h81L15K639l749J681K310m071K025J275j951K21J962j508j356L717k972m46
$$ -881 -566 2073 -1676 5 2315 -1756 269 1544 -407 -186 1776 268 -1088 2629 -343 -789
1464g89L299l550P47K046j620q08J461l12k030L736j982k313L930k287n88K098
$$ -789 2510 -1040 -293 1753 133 -675 786 474 -1556 2180 198 -2115 1815 -472 -1060 1038
1480A038j002j370J326J194l054K382K8l023L700j333j406J936j18j567P22J840
$$ 1038 36 -1334 -8 1186 -1868 514 542 -2481 1219 -114 -1520 416 298 -1269 -547 1293
1496A293l538J844J806l686K547N54k154J484R28j771o70K914k342J52K736l572
$$ 1293 -2245 -401 1405 -2281 266 820 -1334 150 1078 -693 -1363 1551 -791 -639 2097 -1475
1512a475J552J415k568J006R01q52j107L268k434j223M029l289j19K707k335m14
$$ -1475 77 1492 -1076 -70 831 -21 -1128 2140 -294 -1517 2512 -777 -896 1811 -524 -938
1528i38J674k86k054K672n54k600L645j539j450K789j591r36J671J96k711K300
$$ -938 736 450 -1604 1068 514 -2086 1559 20 -1430 1359 -232 -1168 503 699 -2012 288
1544B88J055l654L099k29k764K936l12j283N98J225k087P41K360l779J992J391
$$ 288 1343 -2311 788 559 -2205 731 419 -864 -266 959 -1128 -387 1973 -1806 186 1577
1560A577k746J700N65j452mK081j859r59L587l503R67K400l037P63R77p17p43
$$ 1577 -1169 531 1096 -356 -360 1721 -138 -1097 2490 -1013 -46 2354 -683 80 1057 340 -403
1577d03J955j382j582L465k201q03K829k332k86J914n85j885K005K95k952L294
$$ -403 1552 170 -1412 2053 -148 -951 1878 -454 -740 1174 589 -1296 709 1004 -1948 1346
1593A346q84k439L236j215j436J653J91j508J002J128l286K844J48k862K748m54
$$ 1346 462 -1977 1259 44 -1392 261 452 -1056 -54 1074 -2212 632 780 -2082 666 212
1609B12j566J207Q01j542L6K502l176J247K117l432J651O59j496N73J267j403
$$ 212 -1354 -147 654 -888 -852 1650 -1526 -279 1838 -1594 57 716 -780 -207 1060 -343
1625c43o69K741k071k98K806l138Q05J761j795l43J774j011j779L302j567k065
$$ -343 -1012 1729 -342 -640 2166 -972 -167 1594 -201 -544 1230 219 -1560 1742 175 -1890
1641a890L614k413k10J695j322p33J760j63k133K545j09k499L016j186j550K057
$$ -1890 1724 -689 -899 796 -526 -1259 501 338 -1795 750 641 -1858 1158 -28 -1578 479
1657D79k69j296P55J336k690J650J437l189K248J92j757J496K58j284K58J943
$$ 479 210 -1086 -331 1005 -1685 -35 1402 -1787 461 653 -1104 392 650 -634 -376 1567
1673A567k304K42K403l413J840J284k268R50Q41j017n02K348j985r90K997k655
$$ 1567 -737 -495 1908 -1505 335 1619 -649 301 1142 125 -377 1971 -14 -1004 1993 -662
1689f62L35J867j749l46J415n52j416J718k52k252L442j758j149K509j420m22
$$ -662 -327 1540 -209 -555 860 308 -1108 610 358 -1894 1548 -210 -1359 1150 -270 -692
1705f92J081M03k310J867O04l049K888o04j714K373n96j108O20Q74j889J202J513
$$ -692 389 792 -1518 349 953 -2096 792 188 -1526 847 251 -857 -237 637 -1252 -50 1463
1722A463l300K176P39k592K152J93j697M87J498j630l32K615k697Q33J883k512
$$ 1463 -1837 339 1078 -1514 638 831 -866 -379 1119 -511 -843 1772 -925 -92 1791 -721
1738g21Q37P93r13k26J431j269j278L394k570n91K854k307J47J331r95j121J685
$$ -721 116 909 -4 -230 1201 -68 -1346 2048 -522 -1113 1741 -566 -419 912 -83 -1204 481
1755D81L8k022K473q04j830K575j453l87J435p55j141J363O70k588K608j93k283
$$ 481 519 -1503 970 166 -1664 911 -542 -929 506 -249 -1390 -27 643 -1945 663 470 -1813
1772a813K647o90j346J299M10j450O88J623k386J138J349k882K056N3j445Q16
$$ -1813 834 144 -1202 97 507 -943 -255 1368 -1018 120 1469 -1413 643 696 -749 67
1788F7O96j004l46K182k264K06K427k719Q84J157j809R7J137l91j202K273j498
$$ 67 763 -241 -587 1595 -669 -463 1964 -755 129 1286 -523 -426 711 320 -882 1391 -107
1805a07o52K192j608k38J551j436l83J084K60j960K156n09k257L164j171j344
$$ -107 -759 1433 -175 -413 1138 -298 -681 403 663 -1297 859 350 -1907 1257 86 -1258
1821a258J731n43o73Q12O88k166J690Q12k631K316k56j321J415O8j421O36J254
$$ -1258 473 -70 -743 69 757 -1409 281 1093 -1538 778 522 -799 616 684 -737 -101 1153
1838A153k012P02J701k840J653P35j998J295L72p58k98J400j310n60K194k245
$$ 1153 -859 -157 1544 -1296 357 1092 -906 389 761 3 -295 1105 -205 -765 1429 -816
1854h16L86J835k016O56N24o59p77J566n61j217K163j275r16K179j689j52R61
$$ -816 -430 1405 -611 45 569 -90 -867 699 138 -1079 1084 -191 -1107 1072 -617 -769 192
1871A92P0j271J163K63j900K177n22j641K375j203p45J083M27j805Q81J553k642
$$ 192 262 -1009 154 417 -1483 694 172 -1469 906 -297 -1042 41 468 -1337 -456 1097 -1545
1888a545J827N77k105J681j21j050L59J344j295M6J646k343J290J190k508J041
$$ -1545 282 859 -1246 435 314 -736 -377 967 -328 -282 1364 -979 311 1501 -1007 34
1904C4P48j123J70J181j167q11K500j968j95K135k027M74Q61q88l68P93n3j407
$$ 34 782 -341 -171 1010 -157 -968 1532 -436 -631 1504 -523 -49 812 -76 -444 349 296 -1111
1922a111K200j113j010K316j796K6R55n15n78R45M28k119J834p4j926K466p91
$$ -1111 1089 -24 -1034 1282 -514 -488 467 -48 -626 319 747 -1372 462 388 -1538 928 137
1939A37j085J417m15m38K34Q64j850J414R61k570J873K3j044P99O52r99l44J683
$$ 137 -948 469 54 -384 -150 714 -1136 278 1239 -1331 542 565 -479 320 972 -27 -371 1312
1957A312k158N58J638k090J061P79j545L36P63o40o87J663j462m84K546k302N3
$$ 1312 -846 -288 1350 -740 321 1100 -445 -109 654 14 -673 990 -472 -956 1590 -712 -659
1974f59J457j297N7P60j12j506J770k63j511K299j116p26J572q73k46N83K48j522
$$ -659 798 -499 -442 318 206 -1300 470 207 -1304 995 -121 -847 725 -148 -394 189 437 -1085
1992a085J100P15k225K138m41j451J856j01j050N03P93j447O47J004k162J443
$$ -1085 15 730 -1495 643 202 -1249 607 506 -544 -41 752 -695 -48 956 -1206 237
2008B37O78j779J196m4l79N1J078j173k72K006k146P46R54j599N20M96n64l52
$$ 237 915 -864 332 288 -91 -40 1038 -135 -407 1599 -547 199 1153 -446 74 570 6 -346
2026c46J066p64j074K276j670l04J635j395L25P31n30o29R24j10j158J830q72
$$ -346 720 -44 -1118 1158 -512 -816 819 -576 -251 480 -50 -679 245 135 -1023 807 -65
2043f5j086K158j110n23O59L91j079M86P37j573J405J9j252J372m60l07N27L69
$$ -65 -1151 1007 -103 -626 33 424 -655 -169 568 -1005 400 419 -833 539 79 -228 299 668
2061F68r58Q9J436j920J031P80k145J261N62j143J53J096o55p41J707j271k35
$$ 668 -290 -201 1235 -685 346 1126 -1019 242 804 -339 -186 910 255 -486 1221 -50 -285
2078b85J290j993J055L34q22J24O34m01q68J705j035p76K029j427o4J183p76m66
$$ -285 1005 -988 67 401 -421 -297 337 -64 -932 773 -262 -1038 991 -436 -500 683 -93 -559
2096e59Q36L71j439J265j58j316J732q48n40J216n27l46K64N81j213J065P76k444
$$ -559 277 648 -791 474 316 -1000 732 -116 -656 560 33 -313 -49 532 -681 384 1160 -1284
2114a284J720j00j064J092J36p35p2R74j131N63J061j796Q40N32j272Q81J85n75
$$ -1284 436 336 -728 364 500 -235 -307 667 -464 99 1160 -636 204 736 -536 345 530 -45
2132d5l50J129j260q7J817j855K26R04r57K18M32j58n76P25k17j092K051j509
$$ -45 -395 734 -526 -613 1204 -651 -425 479 -478 -260 172 14 -562 163 -54 -1146 905 -604
2150f04j16J390j139O5R95l03j266J322K28j886K005p68p90J487n21k27L06K18
$$ -604 -720 670 -469 -404 591 288 -978 344 572 -1314 691 -77 -867 620 99 -128 178 396
2168C96q42N73Q27j640R31M60j250J187j69q84O33P25j273K89J281j924O55J080
$$ 396 -446 127 954 -686 245 705 -545 642 473 -411 222 947 -326 -37 1244 -680 -25 1055
2186A055j774Q58J50n71Q3Q81q33m84J658j567J15J211j426L66O67n31j88O59
$$ 1055 -719 139 289 -282 -199 682 -151 -635 1023 -544 -429 782 -644 -278 389 -142 -330 329
2204C29p4j098J559p71q23J439r74q5O16k09l82N27L09j373J305J85j500J849
$$ 329 255 -843 716 -55 -878 561 -413 -498 118 -91 -473 54 363 -1010 295 480 -1020 829
2222H29r20m36J037j08p00K52Q03j683R84R85j956J485k33p20P19r2k31j02R62
$$ 829 -91 -527 510 402 -298 -46 757 -926 58 1043 -913 572 339 -381 338 246 15 -87 875
2241H75j488M62J263k072R04O27j068M76M64l69q62J280q46k94J423j336K78N32
$$ 875 -613 -151 1112 -960 -56 571 -497 -21 443 74 -788 492 -354 -648 775 -561 -283 249
2259B49n16N6J23k2p45J360n71j167J845q72k28J068m34o89N91K82r95P07L64
$$ 249 -267 -211 -88 -110 -855 505 -66 -1233 612 -260 -488 580 146 -543 48 330 -665 42 406
2278D06j169J356l41p71J007j60l93J54O76j250Q34M48j604J198K84j247Q67q3
$$ 406 -763 593 252 -519 488 328 -65 89 765 -485 349 797 -807 391 675 -572 295 212
2296B12l26l12J276j085k66J472j250N75L77j081M18K95o25n6R22p41m79J552
$$ 212 -114 -426 850 -235 -501 971 -279 296 673 -408 10 305 -320 -376 546 -195 -674 878
2314H78j290k68J267j078lP63k12q45R69J30j110J534r81l44R78n82q6P61l66
$$ 878 -412 -680 587 -491 -494 269 57 -788 181 311 -799 735 -246 -590 388 -194 -280 481 115
2333A15o20P69K08j199J052o7q05R54j23n57N06J51l79m29J127j048N61N90j290
$$ 115 -505 264 472 -727 325 258 -547 407 284 -273 233 384 5 -424 703 -345 216 806 -484
2352d84P09p9j90q8N46n94k75J133j268L75N20r34O51m2k04k85N55k31m71J317
$$ -484 225 146 -44 -132 414 -180 -455 678 -590 -215 305 -629 22 -20 -224 -509 46 -185 -656 661
2372F61r76l43J369j227J91O02m85k16N13K65j086R82J26q08Q80j74o68Q80l00
$$ 661 -315 -658 711 -516 -325 277 -208 -424 89 354 -732 250 376 -432 448 274 -394 486 186
2391A86l95L10M93j191P03N19j337J432p32l62P28N1o23J68Q06j027J77O39j223
$$ 186 -209 101 594 -597 106 625 -712 720 -12 -374 354 405 -218 -50 756 -271 -94 545 -678
2410f78P36K66l74K06r3J45o25R73p64j09Q14j087N12N53p06k00P48j59o68R19
$$ -678 58 324 -50 156 63 208 -417 556 -208 -317 497 -590 -78 475 -231 -431 317 158 -510 409
2430D09k93r20J275o89m07J061p62O0L34O1m65M56K12q37J265m89p09R47n03k68
$$ 409 116 -804 471 -218 -625 436 -326 -266 68 129 -336 120 332 -505 760 271 -438 509 6 -262
2450b62N10K68q39M07O16j213R41J16o17L48Pn92L70M11n01k93Q52j077N90L56
$$ -262 248 516 -323 84 700 -513 428 544 -73 275 282 -310 60 471 -30 -323 529 -548 42 398
2470C98j116Q12J20n08j67N88j18p11J244r58J04P26p76J94J73r9l19N24J9p40
$$ 398 -718 94 214 -294 -461 127 9 -702 542 -416 -312 414 -362 -168 5 -94 -413 111 130 -610
2490f10J139p41n04J415j035J3M87N7o05O02J98j010J012j33n09M32p9Pm9M15
$$ -610 529 -212 -716 699 -336 -323 164 221 -384 218 416 -594 418 285 -224 208 129 136 87 502
2510E02m53j76P69j183Q42K20j213J060k1o84J71M62k81m31J119r19J16N15q66
$$ 502 49 -127 642 -541 301 521 -692 368 347 -337 -166 296 15 -416 703 -216 -100 415 -451
2529d51N43J97n59k0K86P9l05O15o37k28J004p63j06P21o75K95j9K18o90P57l30
$$ -451 92 289 -270 -290 -4 75 -230 385 -252 -480 524 -239 -345 376 -299 -4 -23 195 -495 262 -68
2550f8n05Q65l11j54L78j46j12R1J48p37Q95J06j017J102m16n33P55k09j51J4
$$ -68 -573 292 -19 -173 205 59 -53 38 186 -551 344 450 -567 535 119 -414 341 132 -19 -5
2570eN08q17K43O99j224P50N0m60K35m6r7P8N98q91o7J036j069J24P06p15J43
$$ -5 503 -314 -71 628 -596 154 204 -256 -21 -67 -164 -86 512 -379 -446 590 -479 -355 351 -364 -221
2591b21J18j39m70Q31j44o01Q99l03j24K22N2j31j20K62n87P83J40q86J012p05
$$ -221 -103 -242 -712 119 -25 -626 273 -30 -154 68 120 -11 -131 131 -456 327 467 -419 593 -112
2611a12k48O96l21j22J98K94l17kL09o15N03o3q46J077l02K03k92J58l54J15O72
$$ -112 -360 336 15 -107 91 385 68 66 375 -240 263 200 -646 431 129 332 40 198 -156 -41 631
2632F31j275N18M13n00L06K52m92L2L45k66m93R40o71o2N79o14M16j59j1k07K45
$$ 631 -644 -126 287 -213 93 345 -147 -115 230 -36 -529 411 -260 -322 257 -357 59 -100 -111 -318 -73
2653g3J31o23R27m97m43R20m04oL37j59LJ8L76p61O01J23r03J135o16P7j16M4
$$ -73 58 -565 362 -135 -578 342 -62 -68 269 110 113 131 507 -254 347 470 -433 702 86 163 47 91
2675I1l1k48O40r02M61N18r74O42q4m59M75L4j97k22M78n1l78N84r30R91l24m21
$$ 91 60 -188 452 -450 11 529 -445 197 113 -346 129 163 -34 -256 222 171 -207 377 -553 438 114 -307
2697c07K35L6qm06O87m57k09Q85r31L61K46p9j99m5L55l88M27k0k77K10j97K55
$$ -307 -72 -36 -44 -450 237 -220 -429 456 -475 -114 132 53 -146 -191 164 -224 203 183 -94 116 -81 174
2719A74Q5k90j2o9L97m06M12K37j069R95n71l02O76N6j22o6q1J61m04M70l33O8
$$ 174 259 -31 -43 -112 285 -121 291 528 -541 454 -117 -419 257 313 191 125 44 205 -199 271 -62 6
2741FK66n30K71J70m58J22M87n12m56J084p69Q5M95o06J54K5J13l22M62m05k73
$$ 6 272 -258 13 183 -275 -153 334 -178 -634 450 -319 -234 261 -345 -191 -166 -53 -375 87 -318 -591
2762e91Q80m20j17N66n14Q2J02p1mJ71K1m75O83m9n05N40l84L40k60J59j02pJ67
$$ -591 289 -131 -248 318 -196 -114 -12 -83 -87 84 105 -370 313 264 -241 299 -85 255 -5 154 52 45 212
2785B12o65P32J35p63O29l00j81L18J28k97KO54r50K54L01l31J74k16j21L12K18
$$ 212 -453 279 414 -349 280 -20 -201 117 245 -52 -50 604 -346 -92 209 -122 52 -164 -285 27 245
2806B45k41k13N86p52K39N58q69L82K11j54l76L13J48k74K83j30k78P88n44r1
$$ 245 4 -209 377 -375 -136 422 -447 -65 146 -8 -384 -71 77 -197 86 -44 -322 466 -78 -169
2826a69L32r2j99L70r6l49N36k05m43O63l04O8J52j18J00m73P33o07K43J79m39
$$ -169 163 71 -128 242 146 -203 333 128 -315 348 44 112 264 146 246 -227 506 -101 142 321 -118
2847a18K69m61L41L83l64j09K08L18r05L13O08r37K43M2o5L40l16K16k99N49m54
$$ -118 151 -310 31 414 50 -59 149 467 -438 -125 483 -454 -211 -169 -234 106 -210 6 -293 256 -198
2868a98k6O62r07J85N75m41K46j99Q3j19M11j97m33Q07m90J26l5J50j20O9J44
$$ -198 -224 438 -469 -284 291 -150 96 -103 -20 -139 272 75 -358 449 -41 85 50 200 80 149 293
2889B93k53J48R4o43P34m02J13L65m72j3P1L23n24K80M08o81J46M69r33M12j4
$$ 293 40 188 282 -361 373 -29 84 449 -23 -36 35 358 -166 114 522 -159 -13 456 -477 -65 -79
2910g9K50k63L79k74m08O74p42M31J29l87k8J78Q5p5L97l00l22Q78o13k23N83
$$ -79 171 -92 287 13 -395 279 -463 -32 97 -290 -318 -140 -55 -130 267 -33 -355 523 -90 -313 270
2931B70l47n6L43j28k04J89L02p04N15k25l89Q69o65J49M06n52M19o0M61p80N32
$$ 270 -77 -133 210 82 -122 67 369 -335 180 -45 -434 435 -230 -81 325 -227 192 132 593 -187 345
2952C45l3l43L44j76n8N4J87k62j61L25n14J93K64m81L33J9j60J48q8jJ7M34n35
$$ 345 312 -31 313 137 79 133 320 58 -103 222 -292 -99 165 -316 17 36 -124 24 -64 -65 -48 386 -149
2975a49j66L91l35K12j41J49q6K22k42j2J98m1m03P13k60K5m6l17J32K61M3l96
$$ -149 -315 76 -259 -47 -188 -39 -125 97 -145 -157 41 0 -403 310 50 75 29 -288 -156 105 148 -248
2997b48N56J01m04K52q3m28M30j26j47N2K89n68M42N3l09L70j37j76L00k02l9
$$ -248 308 409 5 257 174 -254 176 50 -97 -45 244 -324 118 171 -138 232 95 -81 219 17 -22
3018b2k50M73m08J22M11o94L95l9q9J27j44K91l46J01k5M4L38p18M69L05k45k30
$$ -22 -272 201 -207 -85 326 -368 27 -12 -101 26 -118 173 -173 -72 -97 -53 285 -433 36 341 96 -134
3040a34K95j76k18M52k06j07K29j45l21O12n57L71l8K4j5J44p9k58N84l33k30
$$ -134 161 -15 -233 219 13 -94 135 -10 -331 281 -276 95 57 81 66 210 131 -127 457 124 -106
3061a06N72l13Pk56N92m91p6M19p38M24K41m05K42n2p4j84M73o99L6Q96j006L36
$$ -106 466 153 160 -96 496 5 -71 348 -390 34 275 -130 112 60 -14 -198 275 -424 -388 508 -498 -162
3083a62L18o00M86j15r6K24J6j06n08P17k31k31N42n63N17k79r9J79j03M35n56
$$ -162 156 -444 42 -73 -169 55 71 -35 -543 174 -57 -288 254 -309 208 -71 -170 9 -94 341 -215
3104b15N98k84m08N19j54j25J24J7ql24N25m88K78J23k12K57j69l4o1N4j4J1R0
$$ -215 383 99 -309 210 56 -69 55 72 64 -260 265 -223 55 178 -34 223 54 20 -41 13 -1 10 100
3127A00k33J82J62n25M02R1j42l78L11Q5n54O11j62J9K31k92J03p0O5N5l31M22
$$ 100 -133 49 211 -314 88 179 37 -341 -30 55 -499 112 -50 -31 200 -92 11 -59 6 61 -270 152
3149A52m64M64j61l52L77j44J01K92l07p2ML86m28J08J55l25N10m32J98K56q0
$$ 152 -312 152 -9 -361 16 -128 -27 265 -42 -114 -110 276 -152 -44 111 -214 296 -136 62 318 238
3170B38j00P4J11n37J34M17p32N71L5n08K90K48k38j99L38l11j3M12m85K18K5
$$ 238 138 212 323 -214 -80 337 -395 176 211 -297 -7 241 3 -196 142 -169 -182 230 -255 -37 -12
3191a2j81K68l51K69q9K93l34j04M65n28J59M49m10K33rK8j68J2J98n85Q56m74
$$ -12 -193 75 -276 -7 -96 197 -137 -241 224 -304 -145 304 -106 127 118 146 -22 -10 188 -397 459 -15
3213a5k33O14l84J36n7K27l87J53M90o75J19M85o67L12j86Oo7K33j85K1M27p31
$$ -15 -248 366 -18 118 61 288 -99 54 544 -131 -12 473 -194 118 -68 -62 -129 104 -81 -60 367 -364
3235c64M47P1m46M97J13l48n6N0j50l19R68o07j78N46l92J89j6j33j69M19k6l45
$$ -364 83 154 -292 205 318 -30 -86 -36 -186 -505 463 -144 -322 224 -168 21 5 -128 -297 122 96 -249
3257b49P13n13L7J11j42j15l1L05j0J82k14m09O10k7m21N12k27j78R9J18j37p6
$$ -249 464 -49 -12 99 -43 -158 -189 116 106 288 74 -335 275 248 -173 339 112 -66 33 151 14 -62
3279f2L31m70M77o1n39O56m9k90J47J21k06l8L61n17m8N54o61R9L74k01J63j81
$$ -62 269 -201 276 215 -324 332 283 -7 140 261 55 17 378 -139 -187 367 -294 -195 179 -22 141 -40
3301d0l55J38M03l47o6N65n32J51J79j29j27K13J96m75M98k73l54P31n16nK92
$$ -40 -395 -257 146 -201 -267 298 -234 -83 96 -33 -160 53 249 -226 272 -1 -355 376 -140 -145 147
3322A47j74j62j48O03k45PN6k84P18o33n2M56m21L66k68J84r0%K99p19M20L53
$$ 147 -27 -189 -337 266 21 28 84 -200 518 -115 -167 289 -132 234 -34 150 60 60 359 -360 60 413
3344D13m41O4K9J44l07J55J33l43M77o74J30L45j22j64K38J12l19J96k98N2M75
$$ 413 -28 36 65 209 -98 57 190 -153 324 -350 -220 125 3 -161 77 189 -130 66 -232 -180 295
3365B95l80j00L21k63m7O6k2J76J22J36o18P13n13j83R16p98K62O3K48l30K38
$$ 295 -85 -185 136 -127 -174 -108 -130 46 168 304 -314 399 -114 -297 619 -179 83 146 394 64 302
3386C02J0m89N51j61k59K63j23J68n9Q8l23J04K10l14j62L57m27L93J7l72R6J04
$$ 302 312 -177 374 213 -46 217 94 262 203 291 -32 72 282 -32 -194 163 -264 129 146 -226 -130 -26
3408b6p9M3P77r49K01N4m97Q00m76l6KJ39J5l05L49j15j33M09j10j51O0j68j03
$$ -26 -105 -62 715 -234 -33 21 -476 324 -152 -188 -186 -47 -32 -337 12 -103 -236 173 63 -88 -28 -196 -299
3431b99L01K46m46K42p7o9L15j27l7k8pK15l58J23k71M13Nm31M28r7k77K59n9
$$ -299 2 248 -198 44 -33 -102 213 86 49 21 14 229 -129 -6 -277 136 141 -290 138 41 -236 23 -36
3454c6K76k87K73l32J30J19m78M50K6l01L25k64j05J16R3Q9k86N15m10j4P5o4
$$ -36 240 -47 226 -106 24 143 -335 115 141 -160 165 -99 -204 -88 5 94 -192 323 -87 -101 -26 -90
3476i0J16r0L43m19K79k16k80N07n48M97J33k71K97m70L97k02J69L33o83M50j65
$$ -90 26 -64 279 -140 139 -77 -357 150 -398 99 232 -39 258 -212 185 -17 152 485 -198 252 87
3497H7j90N25l30R2j13O9l35Q8L73o39M77J7o6R7l33j3l01P14l35J55J39n08L31
$$ 87 -103 422 92 184 71 140 -195 -107 266 -373 104 121 55 152 -181 -194 -495 219 -116 39 178 -330 1
3520AK54m81L46k58K10k42J13L46q05P47q2l59K75k14M6R9L70n67L55J41n54N51
$$ 1 255 -226 120 -138 72 -170 -57 289 -516 231 149 -210 65 -149 -103 -4 366 -201 154 295 -259 292
3542B92k65j45L57j79l2O1O0j80j24M13m05M87n9m62K28j62J84k04L34k45K45
$$ 292 27 -118 239 60 28 89 149 -31 -155 258 -147 340 281 -181 47 -115 69 -135 199 -46 199
3563A99K88r09P67k33m29L25r2K78m54L45P8l26L49m89L02J94l15O1M1k4LJ48
$$ 199 487 -422 345 112 -317 8 -84 194 -260 85 163 -163 186 -303 -1 193 -122 -61 -20 -44 -41 107
3585A07j72l41N27j61j52N29n78oL24j24R7m9P8j3k9P9j14J01J44l20K81l89r3
$$ 107 -65 -406 121 -40 -192 337 -241 -247 77 -47 50 1 79 66 37 116 2 103 247 -73 208 -181 -274
3608b74N1P63p47M07K49n48K05k20P3J58J17Pl72K63l7j17L82m44J5J21k20J92
$$ -274 -223 540 -207 200 449 -99 106 -114 -41 117 234 241 -131 132 95 -22 360 -84 -69 52 -168 24
3630B4J63m91J26L96j44k90N16m53K20Q8j12k57J34R5l50K21K31l29N17o02K36
$$ 24 187 -304 -178 218 74 -216 300 -153 67 155 43 -214 -80 15 -335 -114 117 -212 305 -297 -61
3651f1P4n5L8R1K31n49L19M6j75J50K16l96L41k24m8R5m5Q1QJ67m94J66K04m31
$$ -61 13 -42 -4 87 318 -231 88 134 -41 109 325 -71 270 46 -2 93 48 129 137 304 -190 -24 180 -251
3675b51L11J44j25j75P4k3j87N68n81K16j24k9K26l91L18q2J52K35n07L53l77
$$ -251 60 204 79 -96 -22 -45 -232 336 -245 -29 -153 -182 44 -347 -29 -111 41 276 -231 122 -255
3696b55K65L99n42L84k03r5k7K4M41o02M41l20N4J63j32K29j06Rj63R7J98m92
$$ -255 10 409 -133 251 48 -47 -74 -50 391 -211 230 -90 -36 127 -5 224 118 127 -36 61 259 -233
3718b33L46j11j55M45k07j05j3K25j91j07K26l50K04J49k49L38j75j0m6R1j48
$$ -233 113 2 -153 292 85 -20 -33 192 1 -106 120 -230 -26 123 -126 212 37 27 -19 72 -76
3739g6l03M66l16J35J85m18K52o2N6J3j3o3n3L37l84K44K95n98M62j43j88J45
$$ -76 -379 87 -229 -94 91 -327 -75 -137 -81 -68 -81 -144 -197 140 -244 0 295 -303 159 16 -172 -27
3761b7K10j23k02L75j40k65R72q17P4J74k14k1j59K62k24Q7M81m34L04m49j54
$$ -27 183 60 -142 233 93 -172 800 -17 57 231 17 -4 -163 99 -125 -38 443 9 313 -136 -290
3782b90L26j14K04o7J44l98L50R9m39J45L2k37L35j12Q6j4k3k78L1L52l41J92
$$ -290 36 -78 126 59 203 -195 155 254 -185 -40 -8 -245 90 -22 64 50 27 -251 -220 132 -209 -17
3804a7J32j37P4k06qj1K12K8l07N32l00k43M77l08o6K89j62l62M95P6n22N61J45
$$ -17 115 -22 52 -154 -162 -173 39 67 -240 292 -8 -251 226 -82 -148 141 -21 -383 112 188 -334 227 372
3827C72k87K83l19j70K74O9m32K94R7m50O12l26R2m7%p6j6q2R0j75L38o63K82
$$ 372 85 368 49 -121 153 222 -210 84 181 -269 343 17 109 62 62 -14 -30 -112 -22 -197 141 -522 -240
3850b40O16m72K48j72j18J27J77j54L9J23j96k35N90o45L42R6MP5p7p9l45N56
$$ -240 376 -96 152 -20 -138 -11 166 12 51 174 -22 -257 333 -312 30 126 130 205 128 49 -296 260
3872B60j24m25M38l39L15J76k46j60R2L28l72M20n69L9N26o44K89Ol7l0j46O29
$$ 260 136 -289 149 -190 125 301 55 -105 -13 315 -57 363 -206 -167 359 -285 4 10 -27 -57 -203 426
3894D26l77R0n5l26K22L53n12J76j92L32k75J01l2l1M68n17L51j57m0j86LM91
$$ 426 49 139 84 -242 -20 333 -179 -3 -195 137 -138 -37 -69 -100 368 -149 202 45 5 -181 -178 313
3916C13o24M84j20j85J56n77R04k23l49K54k27K55j49K1L69n42N01l88L38J25
$$ 313 -311 173 53 -132 24 -553 351 128 -221 33 -194 61 -88 -67 302 -240 261 -127 211 336
3936C36l56J73j36O6j28K47p1k81L55j45j68L11m51L86l30J32j60m7L37k49J56
$$ 336 -20 153 17 83 -45 202 131 -150 205 60 -108 203 -248 138 -192 -60 -220 -267 70 -179 -23
3957b3J44k82L07j94l3N5K40k37l43P80o61J96K00k99J11j4n7P2J14L3l19M56
$$ -23 121 -161 146 -48 -81 -26 214 -23 -366 414 -247 -51 149 -150 -39 -53 -110 -38 76 109 -210 246
3979B46k79m8K03j58J65k85K27j29P6K3j44L35n18L99P8k31P4J49l33%L10J08
$$ 246 -33 -81 122 -36 129 -156 71 -58 18 41 -103 232 -286 113 191 -40 34 183 -150 -150 160 268
4001B68n56N30J17o82N21k73J79j24n4R4m40M44m17M21K42l44L39k60p6m2J46
$$ 268 -288 242 359 -323 198 -75 104 -20 -74 20 -420 24 -393 28 270 -74 265 5 -71 -113 33
4022C3J4j17K82m59L71j39j47J87Qj69k5K01o8p4K37j41K5K85m39j8K09q5K87
$$ 33 47 -70 212 -247 124 -15 -162 25 33 -136 -161 40 -28 -102 135 -6 19 304 -135 -153 56 -29 258
4045B58l52K38l82M14j46N0L20m52k6J78k34J79k0R3k22K89n9m04M95k52N0l5
$$ 258 -94 144 -238 176 30 80 400 -52 -78 100 -134 45 25 118 -104 185 126 -278 217 -35 15 -20
4067b0j89J59k71M29k29j19J78l74N79m05r1M15j71K11m40M33l82O5O68m13l6
$$ -20 -209 -50 -321 108 -121 -240 -62 -436 143 -262 -353 62 -109 102 -338 95 -287 -222 446 33 -3
4088cL1k73J02K36N1k61Q4K38l91L87l29J09L13k81J45j29j97KL07P5n51M04Q3
$$ -3 28 -245 -143 93 144 -117 -33 205 -186 201 -128 -19 294 13 158 29 -168 -166 141 216 -335 69 152
4111A52l72M06k99L0L1K97m5l27L56m39J4l1Q8K39m06L12k20J13p6NN38n93J01
$$ 152 -220 186 -113 -83 -52 245 200 -127 229 -210 -196 -227 -139 100 -306 6 -214 -101 -177 -172 366 -227 -126
4134a26K36k87K55k39J80n5j0j69J2L76k11j07L80m78J66L14k25j81J71J91l98
$$ -126 110 -177 78 -161 19 -36 -46 -215 -203 173 -38 -145 235 -243 -77 237 12 -169 2 193 -205
4155b05N47k25j14M2k84J42R0L43m14j42N35m04K97k16L9L4l72L83q5J8l65R5
$$ -205 342 117 3 45 -239 -97 -7 336 -78 -220 315 -89 208 -8 31 65 -307 76 -9 9 -356 -261
4177b61M23k47n1J38k17J80J30k9l35K11o0k8K75k73n3L48l29L41j35k26QJ02
$$ -261 162 -85 -136 2 -215 -35 95 66 -269 -58 -118 -146 129 -144 -197 151 -178 163 28 -198 -190 -88
4199h8K57Nn4j91j48M64m1oj10k56K02L9p6p4K04j52l4L87m61n7M10m00M48l66
$$ -88 169 174 120 -71 -219 245 204 198 88 -168 34 73 -3 -77 127 -25 -59 328 -133 -190 220 -180 268 -98
4223i8N21o27P5N33m39J39j89J45m2k97L76r9M3k72l0N18l48K99l20l55L03N0
$$ -98 423 -204 -129 404 -35 104 -85 60 18 -279 97 -2 41 -231 -261 257 -91 208 -112 -467 -164 -114
4245a14J69k05L93j88j84J76j35n2L56m39L27j60K06j80J19n3j51L16j62lJ43
$$ -114 55 -150 243 55 -129 47 -88 -140 216 -223 104 -56 150 -30 89 36 -115 201 39 36 179
4266A79j50J20K0j52P5j5K17m95L22N8k29J62m05L99o3P4j92q2R8o9J99j01j85
$$ 179 29 149 169 17 92 77 294 -201 121 179 -50 112 -293 106 43 117 -75 -157 -59 -128 71 -30 -215
4289b15K9K05O5j21l1q0J8L30j98k52J68j78J91M6J33k45P4q2K96kk87J91K35
$$ -215 -186 19 84 -37 -68 -148 -130 200 2 -250 -82 -260 -69 -23 110 -135 -61 -143 153 151 -136 55 290
4312B90l26K76k16O1k40M06j06k82L07k58N3Q5j37K63j07j9k32J93L24m66P7Q3
$$ 290 -36 240 24 85 -155 251 145 -137 170 -88 -35 50 -87 176 69 50 -182 11 335 -131 -54 29
4334B9l51N06k96k1K69k50L34l08J94l75M35Q3l85L50l13j2q4M4L81n16L70j37
$$ 29 -322 184 -112 -133 136 -114 220 -88 106 -269 166 249 -136 214 -99 -111 -195 -151 230 -286 84 -53
4356e3Q0j81k06K78J26l19N32k37J05k44K54k32r9K96k30L33m48M41j00K37l98
$$ -53 27 -154 -360 -82 44 -275 257 20 125 -119 135 -97 -196 100 -130 203 -245 196 96 333 -65
4377f5p7J31J73k86L46l86j40O00k51r1k5l5J84j4r9j79K03K0n1J23lk54J50O1
$$ -65 -142 -11 162 -124 222 -164 -304 296 45 -46 -71 -106 78 64 -35 -214 -11 9 -42 81 78 -176 -26 35
4401C5L6j62K84n57L07r0n1N46k83k9j75K60j93q2K63l49R0L04m05M70k38N3o3
$$ 35 71 -91 193 -364 -57 -147 -198 348 65 36 -139 121 -72 -154 109 -240 -150 154 -251 219 -19 34 -29
4424b9K05k44O5K49l56O5P3L0J0K06J80m55m0P3j29K3K17j58L31m66m3J50n7M0
$$ -29 176 -68 -3 246 -110 -45 28 58 68 274 454 -1 -41 32 -97 -74 143 -15 316 -150 -193 -43 -100 -60
4448f0J53O4k63K04j2l84L07j21J22j63K84l26P9P3J40l04J01k09L63l0qp5j9
$$ -60 93 157 -106 98 86 -298 9 -112 10 -153 131 -195 -116 -43 97 -207 -106 -315 48 18 10 -65 -84
4471h4K17l21M16m01J2K50k17K73k36J93N8l13K49l05J62J4n1L42l21L8N6k1Q3
$$ -84 133 -188 228 -173 -161 89 -128 145 -91 102 160 -153 96 -209 -47 -33 -84 258 -63 -25 31 10 93
4494I3j88K52k44J69J5j26J96j45J23M9j87Q9k71P4O0k2J6j58J98o7m0K29j03
$$ 93 -95 157 -87 82 97 -29 167 22 145 194 7 96 -175 -101 -41 -63 -47 -205 -7 -74 -114 115 12
4517A2j45K21N3j04k51M03j79K48l38L8K87L4k35k78L30j80J78L5k55K26R2l52
$$ 12 -133 88 141 37 -214 189 10 258 -80 -42 245 279 44 -234 96 -84 94 129 -126 100 192 -160
4539a60K18K5O4k4l1J93m31K91j59J03m0N4j73P3J3q4J53J8l38L64k87j21L15
$$ -160 58 83 147 123 92 285 -146 145 -14 89 49 103 -70 3 16 -68 85 103 -235 129 -158 -279 36
4562C6Jj09J24J6k30j18N89m35L42k37l63M18l56N00k09P7ojK73m02m0P6j84M27
$$ 36 37 -72 52 68 -162 -280 309 -126 216 -21 -384 34 -322 178 -31 46 40 39 312 -90 -130 -54 -238 189
4586A89l80O12n20J19j47J24K2k7J15J79l56Q3M7k7qJ18O0m11L50j35j76K90l12
$$ 189 -191 421 -99 20 -127 -3 19 -8 107 286 -70 13 60 33 25 143 203 -208 142 7 -169 121 -191
4609a91L68mq8L1j39k0Q0J6l1n2k0J59q0J16j97J31q0O9k06r9J45k24J93J00r2
$$ -191 177 173 85 116 -23 -43 37 53 22 -30 -50 109 29 145 -52 79 -1 68 -138 -237 -92 -316 -123 -23 -115
4634a15q8J1K58l58N84l34R0K06n73L52R6O0j33J44j78L6J21j85MJ45k53J70j4
$$ -115 -203 -192 66 -292 292 -42 48 254 -319 33 129 189 56 200 22 58 179 -6 -2 143 -110 60 46
4657D6J73k31J40k48J13J21j07k59M36k26pK60m20L59j88K18l27j79N08l62N94
$$ 46 219 -12 128 -120 -7 114 7 -252 184 -42 -49 211 -209 150 -38 180 -147 -326 182 -180 414
4678D14k28k31k3q6J72pr8p5m0M67j53k90J43k03K81j5J70m0q5J97m20L68j90
$$ 414 186 -45 -68 -154 18 11 -87 -162 -202 265 112 -178 -35 -238 43 28 198 158 73 270 -150 218 28
4701B8k5J1j69J90j00J01j86K46j08j37L20j10nj1k23L40j13j2l43L19P8m00K26
$$ 28 3 14 -155 35 -65 36 -150 96 -12 -149 171 61 56 45 -178 162 49 37 -306 13 91 -309 -83
4724h3L4j41M8LK58k32Q3O3r2m8O6p3K97l25J43K73n41n1M05K4j16k06J88J3J65
$$ -83 -49 -190 -142 -139 119 -113 -30 33 -59 -107 -41 -114 183 -142 1 274 -267 -318 87 111 -5 -211 -23 -10 155
4749A55k96J85k34K12J30k72J80l51L90k18R7K63k93Q3o3K84k16lj70N9J30j68
$$ 155 -141 44 -190 22 152 -120 60 -291 99 -119 -22 241 -52 31 -32 252 36 33 -137 -78 52 -116
4771a16M18N1m41l7o6J77kj37M22m67J29N4j22K06k40K05j48J80k12k1J84l9K41
$$ -116 302 353 -88 -125 -191 -14 -16 -153 269 -198 -69 -15 -137 69 -171 34 -114 66 -146 -167 17 -22 219
4794B19r2k39J83J85l63P2J14j01j49K08j03r9J38p9K00n2j33K83l76L55r9pP9
$$ 219 127 -112 71 256 -107 -35 79 -22 -171 37 -66 -165 -27 -106 94 42 -91 192 -184 171 72 65 144
4817A44l16L10k03K30n4k08J40l3j03K86Nk50j40L82k09O4K1%n8L9j30K28q9k53
$$ 144 -172 138 -65 165 111 -97 43 10 -93 193 198 -52 -192 190 -19 45 66 66 8 47 -83 145 56 -197
4841a97P7K65k81R3K86l00J48j73M6j50J16J90l36K78Q7l03O1k03L01J42q5j04
$$ -197 -120 145 -136 -43 243 -57 91 -82 -36 -186 -70 120 -216 62 149 -154 -93 -296 5 147 62 -42
4863d2K6J76k48l5K13N8K6L6j35j47J41K1k05K88j04K3j06l38O09l21M82k97P5
$$ -42 -16 160 -88 -123 90 148 174 210 75 -72 69 90 -115 173 69 92 -14 -352 257 -64 418 121 196
4886A96j52j44L72q9j35q4p2J93J69k92K52l59K38n61O06l01N5L29m38L74k48
$$ 196 44 -100 272 183 48 -36 -108 85 254 -38 214 -145 93 -468 138 -163 -108 221 -217 157 -91
4907i1O6J4N8R9m38L10n9j98J82j28J71j50K61j4nK13l75J72R0j00ql5K2J16k38
$$ -91 -25 -11 47 146 -292 18 -41 -239 -57 -185 -14 -164 97 83 78 291 -84 88 178 78 70 35 57 173 -65
4932f5Q2k92K90J07j36M03n08K91j60j28J92l59L13P5j26o6o7L45l48L26l14J46
$$ -65 17 -275 15 122 -14 389 -119 172 12 -116 76 -283 30 105 -21 -87 -154 191 -157 169 -145 1
4954AK08k79N9j65K20J88m39M03l51N5J67j00n7J36J33k71m6J85J05k03J38l14
$$ 1 209 -70 -11 -176 44 232 -207 196 -155 -100 67 -33 -90 46 179 -92 -138 47 152 -51 87 -227
4976b27N14l77J79j47M04j00l72M19l54J95p8k21R5J91o7k26L59l71R0J83l15
$$ -227 287 -90 89 -58 346 246 -126 293 -61 134 56 -165 -70 121 54 -172 187 -184 -94 89 -226
4997b26L54K71n14K00r9j24K70q2O9m80K00l4L4J53N4K3k36J70rL1J52l41J53
$$ -226 128 399 -115 85 -14 -138 132 50 119 -361 -161 -195 -161 -8 46 69 -167 3 -6 25 177 -164 -11
5020a1J16j38j6o8K07M3l2k44K50J1m31M95k08j30K43j43J44P5j21l31L60K0m17
$$ -11 105 -33 -49 -117 90 133 101 -143 107 118 -313 182 -26 -156 87 -56 88 163 42 -289 71 91 -326
5043c26L74j7k32L21r6j37Q1o8J81j46J71m29K48K14k74J85o2kQq1L65m97L73
$$ -326 48 31 -201 120 24 -113 -32 -100 81 -65 106 -323 -75 139 -135 50 -12 -14 -6 -87 278 -219 154
5066A54q2j08R5j54J89k27O8J44r4K06l70K95L4l76M93l60J72K4k33J97r0K90
$$ 154 72 -36 59 -95 94 -133 -65 79 -15 191 -179 116 150 -226 267 -93 79 103 -130 67 -23 267
5088B67n41L70M9l27J58nJ19K20m18L13m04J99j6j48K31j4j84K8L2PK04j20k67
$$ 267 -274 96 145 -182 -24 -29 90 310 -108 205 -199 0 -16 -164 67 53 -131 -103 -71 -64 140 20 -247
5111b47K96j12k18K79k06M9R0Qn6r4l7L20l21L94k08L98m30q3J28j47L25j05J19
$$ -247 49 -63 -281 -2 -208 -159 -69 -61 -117 -211 -248 72 -249 145 -63 335 -95 -178 -50 -197 128 23 142
5134A42j00k45J45N8J37k52M55j75j12l5J18j50K68j01J46k77m6J71j94R2k7J30
$$ 142 42 -203 -58 0 137 -115 340 165 53 18 136 -14 254 153 299 22 -24 147 -47 45 18 148
5156A48j37N8m6Q9j46L4j80j21J99J4P5J51k53l6L33m73L90j64k09M52o0j88J76
$$ 148 11 69 23 112 -34 0 -180 -301 -102 -88 -13 138 -115 -151 182 -291 99 -65 -274 178 118 -70 106
5179A06o2j7j02j19LO4N1l7N47o30J96J2K68j96j53L44m28J81J18k68q4J92O3
$$ 106 44 27 -75 -194 -191 -127 -76 -113 434 -196 0 12 280 84 -69 275 -153 28 146 -122 -206 -14 49
5202D9p0n7L29l36J71Q9j72Q9N1J9k35o0J56r4K30m25M33l42K49j0n5k27J11K30
$$ 49 -21 -78 251 -85 86 175 3 92 143 162 -73 -133 23 -71 159 -266 167 -175 74 64 9 -218 -107 123
5226A23j90mO4jl8k5Q7o4J1j44j04N46l02r6O9j31K15L37m48K72j25j40J6PK27
$$ 123 -67 -71 -7 -8 -46 -71 16 -48 -37 -181 -285 261 -41 -137 -68 -199 16 353 -95 177 52 -88 -72 -65 162
5251A62r4N7o1l0j00J00q0Q3J6%J06r2m0J99k49j13K90j86M9k00J71l3j28K21
$$ 162 68 125 64 34 -66 34 -46 37 53 53 159 67 27 226 -23 -136 154 -32 17 -183 -12 -45 -173 48
5275D8P2j5r4J25j94q3P8p3J86l0j46J30j95N7K64l40K07o6O4m7J85j47l09M64
$$ 48 120 105 11 136 -58 -141 -63 -136 50 20 -126 4 -191 -134 130 -210 -3 -69 -5 -52 133 -14 -323 141
5299A41k0m20L45p5J29N1l36M19k68J85j62mm21K27L13k83K27K2Mj31J91j2j71
$$ 141 121 -299 46 -29 100 151 -185 234 -34 151 -11 -15 -436 -209 104 -179 48 70 74 -57 134 122 -49
5322d9J9p6J62m1M4J40r2k20J73O2M8j74k09N5k26M35Q6r1K42k20J42k80J84j26
$$ -49 -30 -106 56 15 59 199 107 -113 60 122 170 -4 -213 -158 -384 51 137 46 288 68 210 -70 114 -12
5346a2o4K68l57K94l35J07j3R1j64J81p4L01J8j43O1k02j2J83N4k85K57m5k59
$$ -12 -76 192 -165 129 -206 -99 -112 -21 -185 -4 -78 223 241 98 159 -43 -55 128 182 -103 154 109 -150
5369a50N26n24N27l40k75L04l03K27O0j49N6L4o0j72J45J24k36o7R6N89m78J7
$$ -150 376 -148 379 39 -236 68 -235 -8 52 -97 -41 -7 -67 -239 -94 30 -206 -273 -177 412 -66 -49
5391d9p1J73k73j6L76m54N37k49P3n1J55k06r4pJ87J7J12k2l29l4J81m0k7J31
$$ -49 -120 53 -220 -236 140 -314 223 -26 47 -4 151 -55 -149 -156 31 48 160 138 -191 -225 -44 -84 -111 20
5415B0O9o9K3k9j05J81l24L51k24m5K95q0j19P9j73k13L07L4J25Q6j54k6K67l32
$$ 20 89 20 43 14 -91 90 -234 117 -107 -152 143 63 -56 23 -150 -363 -56 -22 103 189 35 9 276 -56
5439e6N7j09J97j33N2K1j03J40j26O6N6k43L33k32J30q6N3R0k05K18%j72K6J86
$$ -56 1 -108 89 -44 8 29 -74 66 -60 6 62 -181 152 -80 50 -36 17 107 -98 120 120 -52 -26 160
$$ [...]
8191C5
##END NTUPLES=NMR FID
##END=
