##TITLE=1H_Ser 7-4-i-4
 CDCl3,8 sc, 
 28.9.2021
##JCAMPDX= 6.0         $$ Bruker NMR JCAMP-DX V2.0
##DATA TYPE= NMR FID
##DATA CLASS= NTUPLES
##ORIGIN= UXNMR, Bruker Analytische Messtechnik GmbH
##OWNER= root
$$ XWIN-NMR		Version 3.5
$$ Tue Sep 28 09:24:41 2021 Russian Standard Time (UT+4h)  she@DPX200
##.OBSERVE FREQUENCY= 200.1314
##.OBSERVE NUCLEUS= ^1H
##.DELAY= (6, 6)
##.ACQUISITION MODE= SIMULTANEOUS
##.ACQUISITION SCHEME= undefined
##.AVERAGES= 8
##.DIGITISER RES= 18
##SPECTROMETER/DATA SYSTEM= spect
##.PULSE SEQUENCE= zg30
##.SOLVENT NAME= CDCl3
##.SHIFT REFERENCE= (INTERNAL, CDCl3, 0, 15.7039)
##AUDIT TRAIL= $$ (NUMBER, WHEN, WHO, WHERE, WHAT)
$$ ##TITLE= Audit trail, XWIN-NMR		Version 3.5
$$ ##JCAMPDX= 5.01
$$ ##ORIGIN= Bruker BioSpin GmbH
$$ ##OWNER= she
$$ F:/spectra/data/she/nmr/H-F/1/audita.txt
$$ ##AUDIT TRAIL=  $$ (NUMBER, WHEN, WHO, WHERE, WHAT)
(   1,<2021-09-28 09:23:36.78 +0400>,<she>,<DPX200>,
      <created by zg, POWCHK disabled, PULCHK disabled
       configuration hash MD5:
       00 E9 B6 7A A2 85 ED C7 34 08 36 98 17 FE 4E 26
       data hash MD5: 16K
       65 F5 CC 7C 16 6B 8A 0B 1E C2 B1 4F 85 3D FC 9F>)
$$ ##END=
$$ 
$$ hash MD5
$$ 7F 42 00 F0 17 21 C9 40 BB B6 92 B8 E5 15 98 68
##$RELAX= 
##$RELAX= 
##$RELAX= 
##$RELAX= 
##$RELAX= 
##$RELAX= 
$$ Bruker specific parameters
$$ --------------------------
##$DU= <F:/spectra>
##$EXPNO= 1
##$NAME= <H-F>
##$PROCNO= 1
##$TYPE= <nmr>
##$USER= <she>
##$AMP= (0..31)
100 100 100 100 100 100 100 100 100 100 100 100 100 100 100 100 100 100 
100 100 100 100 100 100 100 100 100 100 100 100 100 100 
##$AQSEQ= 0
##$AQ_mod= 1
##$AUNM= <au_zg>
##$AUTOPOS= <>
##$BF1= 200.13
##$BF2= 200.13
##$BF3= 200.13
##$BF4= 200.13
##$BF5= 200.13
##$BF6= 200.13
##$BF7= 200.13
##$BF8= 200.13
##$BYTORDA= 1
##$CFDGTYP= 0
##$CFRGTYP= 5
##$CHEMSTR= <none>
##$CNST= (0..31)
1 1 145 1 1 1 1 1 1 1 1 1 1 1 1 1 1 1 1 1 1 1 1 1 1 1 1 1 1 1 1 1 
##$CPDPRG= <>
##$CPDPRG1= <>
##$CPDPRG2= <>
##$CPDPRG3= <>
##$CPDPRG4= <mlev>
##$CPDPRG5= <mlev>
##$CPDPRG6= <mlev>
##$CPDPRG7= <mlev>
##$CPDPRG8= <mlev>
##$CPDPRGB= <>
##$CPDPRGT= <>
##$D= (0..31)
0 1.2 0 0 0 0 0 0 0 0.06 0 0.03 0 0 0 0 0.0002 0 0 0 0 0 0 0 0 0 0 0 0 
0 0 0 
##$DATE= 1632806616
##$DBL= (0..7)
120 120 120 120 120 120 120 120 
##$DBP= (0..7)
150 150 150 150 150 150 150 150 
##$DBP07= 0
##$DBPNAM0= <>
##$DBPNAM1= <>
##$DBPNAM2= <>
##$DBPNAM3= <>
##$DBPNAM4= <>
##$DBPNAM5= <>
##$DBPNAM6= <>
##$DBPNAM7= <>
##$DBPOAL= (0..7)
0.5 0.5 0.5 0.5 0.5 0.5 0.5 0.5 
##$DBPOFFS= (0..7)
0 0 0 0 0 0 0 0 
##$DE= 6
##$DECBNUC= <off>
##$DECIM= 32
##$DECNUC= <off>
##$DECSTAT= 4
##$DIGMOD= 1
##$DIGTYP= 9
##$DL= (0..7)
0 120 120 120 120 120 120 120 
##$DP= (0..7)
150 150 150 150 150 150 150 150 
##$DP07= 0
##$DPNAME0= <>
##$DPNAME1= <>
##$DPNAME2= <>
##$DPNAME3= <>
##$DPNAME4= <>
##$DPNAME5= <>
##$DPNAME6= <>
##$DPNAME7= <>
##$DPOAL= (0..7)
0.5 0.5 0.5 0.5 0.5 0.5 0.5 0.5 
##$DPOFFS= (0..7)
0 0 0 0 0 0 0 0 
##$DQDMODE= 0
##$DR= 18
##$DS= 0
##$DSLIST= <SSSSSSSSSSSSSSS>
$$ [...]
##$SUBNAM2= <"">
##$SUBNAM3= <"">
##$SUBNAM4= <"">
##$SUBNAM5= <"">
##$SUBNAM6= <"">
##$SUBNAM7= <"">
##$SUBNAM8= <"">
##$SUBNAM9= <"">
##$SW= 20.0188988654967
##$SWIBOX= (0..15)
0 0 2 0 0 0 0 0 0 0 0 0 0 0 0 0 
##$SW_h= 4006.41025641026
##$TD= 16384
##$TD0= 1
##$TE= 0
##$TE2= 300
##$TE3= 300
##$TEG= 300
##$TL= (0..7)
0 120 120 120 120 120 120 120 
##$TP= (0..7)
150 150 150 150 150 150 150 150 
##$TP07= 0
##$TPNAME0= <>
##$TPNAME1= <>
##$TPNAME2= <>
##$TPNAME3= <>
##$TPNAME4= <>
##$TPNAME5= <>
##$TPNAME6= <>
##$TPNAME7= <>
##$TPOAL= (0..7)
0.5 0.5 0.5 0.5 0.5 0.5 0.5 0.5 
##$TPOFFS= (0..7)
0 0 0 0 0 0 0 0 
##$TUNHIN= 0
##$TUNHOUT= 0
##$TUNXOUT= 0
##$USERA1= <user>
##$USERA2= <user>
##$USERA3= <user>
##$USERA4= <user>
##$USERA5= <user>
##$V9= 5
##$VALIST= <valist>
##$VCLIST= <CCCCCCCCCCCCCCC>
##$VD= 0
##$VDLIST= <DDDDDDDDDDDDDDD>
##$VPLIST= <PPPPPPPPPPPPPPP>
##$VTLIST= <TTTTTTTTTTTTTTT>
##$WBST= 1024
##$WBSW= 4
##$XGAIN= (0..3)
0 0 0 0 
##$XL= 0
##$YL= 0
##$YMAX_a= 261478
##$YMIN_a= -335855
##$ZGOPTNS= <>
##$ZL1= 120
##$ZL2= 120
##$ZL3= 120
##$ZL4= 120
##$ABSF1= 10
##$ABSF2= 0
##$ABSG= 5
##$ABSL= 3
##$ALPHA= 0
##$AQORDER= 0
##$ASSFAC= 0
##$ASSFACI= 0
##$ASSFACX= 0
##$ASSWID= 0
##$AUNMP= <proc_1d>
##$AZFE= 0.1
##$AZFW= 0.1
##$BCFW= 1
##$BC_mod= 2
##$BYTORDP= 1
##$COROFFS= 0
##$CY= 11.3945322036743
##$DATMOD= 1
##$DC= 2
##$DFILT= <>
##$DTYPP= 0
##$F1P= 2.36226072786647
##$F2P= -0.459571619588291
##$FCOR= 0.5
##$FTSIZE= 0
##$FT_mod= 4
##$GAMMA= 1
##$GB= 0.15
##$INTBC= 1
##$INTSCL= 1
##$ISEN= 128
##$LB= 0.24
##$LEV0= 0
##$LPBIN= 0
##$MAXI= 10000
##$MC2= 0
##$MEAN= 0
##$ME_mod= 0
##$MI= 1.114404
##$NCOEF= 0
##$NC_proc= 0
##$NLEV= 6
##$NOISF1= 3.799351
##$NOISF2= 2.8
##$NSP= 1
##$NTH_PI= 0
##$NZP= 0
##$OFFSET= 15.70392
##$PC= 1
##$PHC0= -14080.08
##$PHC1= 16.60089
##$PH_mod= 1
##$PKNL= yes
##$PPARMOD= 0
##$PSCAL= 0
##$PSIGN= 0
##$REVERSE= no
##$SF= 200.130013532006
##$SI= 16384
##$SIGF1= 3
##$SIGF2= 2
##$SINO= 400
##$SIOLD= 16384
##$SREGLST= <1H.CDCl3>
##$SSB= 0
##$STSI= 0
##$STSR= 0
##$SW_p= 3612.71676300578
##$SYMM= 0
##$S_DEV= 0
##$TDeff= 0
##$TDoff= 0
##$TI= <>
##$TILT= no
##$TM1= 0
##$TM2= 0
##$TOPLEV= 0
##$USERP1= <user>
##$USERP2= <user>
##$USERP3= <user>
##$USERP4= <user>
##$USERP5= <user>
##$WDW= 1
##$XDIM= 8192
##$YMAX_p= 0
##$YMIN_p= 0
$$ End of Bruker specific parameters
$$ ---------------------------------
##NTUPLES= NMR FID
##VAR_NAME=  TIME,          FID/REAL,        FID/IMAG
##SYMBOL=    X,             R,               I
##VAR_TYPE=  INDEPENDENT,   DEPENDENT,       DEPENDENT
##VAR_FORM=  AFFN,          ASDF,            ASDF
##VAR_DIM=   8192,          8192,            8192
##UNITS=     SECONDS,       ARBITRARY UNITS, ARBITRARY UNITS
##FACTOR=    0.0002496,     1,               1
##FIRST=     0,             0,               0
##LAST=      2.0444736,     0,               0
##MIN=       0,             -335855,         0
##MAX=       2.0444736,     261478,          0
$$ Real data points
##PAGE= N=1
##DATA TABLE= (X++(R..R)), XYDATA
$$ [...]
2211a220M61K429j799j638K847N04k842P17J721n89j081M17J640j515j427K028
2227F53J439k958j95K848j444j603J631P61j318j277J923J206k697k06L061j593
2243B31k488K954R64l009o5K618p1k137q7K648j572k128K942J184l766M53L130
2260A801j618j520J866N66j847r57K700O26l538R38K837k492j162K818K90k907
2276a599P27J659l23j934O75K135j830j186K964k47k636J156J713r91p59R19L33
2293G76r56o75J996K54k354L75K095j213p21J392k82q97m42J212R06j824o94K034
2311I82p08j876J916N56j690j59J282M37j442o13K129m67k042K264R99l190m3
2328a665K821r31j389J040J148j477j298K096J310l071k91L355j820j913K709
$$ y = [-1220, -759, 1670, -129, -1767, 1080, 1584, -1258, -541, 1180, 591, -490, -73, 1567, 52, -1375, 653, 2092, -866, -1061, 1787, 343, -1260, 371, 1132, -186, -1463, 460, 1666, -1031, -1237, 1824, 231, -2257, 697, 1661, -1348, -1413, 1205, 1134, -1003, -1090, 1558, -14, -2142, 800, 1984, -1782, -1329, 1801, 183, -1337, 529, 1095, -752, -1709, 991, 1617, -1921, -983, 1854, -638, -1800, 1018, 1308, -1599, -872, 787, 464, -1470, -795, 1340, -490, -1676, 1288, 1041, -1595, -439, 1274, 283, -476, 443, 776, -180, -855, 1141, 1395, -959, -584, 1511, 298, -423, 969, 687, -210, -652, 560, 1466, -358, -1052, 982, 274, -1602, 314, 870, -820, -979, 303, 740, -702, -1315, 814, 347, -1695, 569, 1568, -1622, -1665, 1156, 225, -1164, -124, 1024, -453, -1751, 345, 1655, -1416, -1707, 1648, -172, -2085, 624]
2343F24J097k944J38K291O5k088O21K125j726j567L024R8l147R80J928j205j143
2360h29J531N36j355j273K419P06l260J059J902k079m57K079p63j540L79R15P11
2377F81j389l6J151p26j157K066j29j616O96O56J28n76l2P02k32j156J503P77
2395A311k202M2J452j65p99M06N44n38j457J603J674k462p66K513o50j767K129
2412H68L20j806m77J871M80j716k11J895o77k224K275J115k929L11K201r85j283
2429i72J077O77q60j390K327R95l301M32K586j595j564K554q6k289N42J483L03
2446I19j762RK034j112j332K391j57k227O75J589n93j006M82M43n34q15J722J96
2464I22j992L79J633j086l65Q26J54m59q75J107O63j479k78J614n79j480J737
$$ y = [624, 1721, -1223, -1085, 1206, 1271, -817, -196, 1929, 203, -1364, 1660, 1758, -1389, -409, 1519, 314, -829, 702, 1238, -117, -1390, 1029, 1735, -1525, -466, 1436, -643, -1100, 979, 216, -1324, -945, -30, 681, -708, -744, 407, -319, -1476, 590, 461, -1155, -459, 197, 325, -251, -283, 419, 187, -969, 534, 1311, -891, -849, 603, 438, -361, 45, 589, 51, -1406, 197, 1871, -591, -1357, 1156, 506, -1261, 868, 1188, -618, -1095, 776, 1256, -460, -671, 1224, 547, -1677, 598, 1713, -1216, -905, 1296, 311, -972, 105, 782, -78, -1468, 859, 1854, -1447, -1015, 1571, -24, -1588, 966, 880, -1409, -867, 616, 919, -843, -834, 1200, 88, -1244, 1147, 990, -1237, -562, 1027, 434, -572, -90, 353, -181, -996, 726, 922, -1070, -691, 942, -144, -509, 317, 471, 12, -863, 244, 907, -572, -850, 764, 185, -1295, 442]
2481D42K17j172m5R40M54j316q8J451j4j986J516J338k270K12J298m91j067N89
2499HJ087p93j379J530R65k169q5K125j088j476J852L5j176k98J211N41j908K07
2517h11K009j017k170K535M68k134K20J459m93j039M77J107o95j313J825O32k216
2534a156O32J565j088q10J074M92q40n44R40P27j524K82J441r81j226J747M44
2551A175j494M24O92P8j138P3J287p28j096J303O21j857K39J426q38j021N05Q14
2569D65o47q07J094P94j468l66J851j169r76J221L83j217L4J040M22j339nJ567
2587H77j062j046J787L10j827M89J196o36m22J15R01n03j340J583P27j887J28
2604f10J784j092q52J176K87o98n10Q02O33j295l76J928r12j188J631L18j601
$$ y = [442, 659, -513, -558, 382, 836, -480, -568, 883, 869, -1117, 399, 1737, -533, -321, 977, 486, -581, 8, 1095, 302, -1077, 453, 1418, -751, -836, 1289, 201, -1275, 577, 612, -564, -862, 349, 890, -1018, -811, 1198, 181, -1989, 546, 1014, -1120, -900, 559, 66, -973, -496, 611, -84, -1397, 428, 1060, -1156, -524, 1041, -47, -857, 217, 709, -131, -675, 265, 992, -532, -250, 1191, 210, -1016, 731, 1175, -319, 105, 797, 875, -263, -190, 1097, 369, -727, 576, 1197, -660, -421, 1005, 167, -854, -349, 465, -182, -989, 105, 899, -569, -935, 916, -253, -1229, -8, 375, -842, -808, 232, 654, -685, -690, 877, -185, -1231, 556, 866, -961, -472, 724, 88, -334, -219, 682, 179, -1161, 422, 1149, -738, -610, 1174, 82, -770, 406, 693, -5, -515, 287, 920, -375, -751, 1177, 265, -923, 708, 1026, -575]
2621e75O63N62k51r40K23R83l73j572J312Q81j779K32J377n25j015R08P47r63
2639a05q30J054Q01j841m0J829q90j085J043N94j228K61N02M57j350J02J375m86
2657A63j189K131j16j871J35J395p68l53Q94L15m76q21M81J412k004o0J493p62
2675al57Q17J30o96j96L06R71j629j31J955j114j421J592N97j302J05J100l35
2693C91j258N71J128p32j369J756J044k461P79J394j260j101J329N48p00r54R52
2710E7O37j262k25J921j230j378J690M5r22J29R84j03r50R2J288m91j587J217
2728h8R16j641J96J282n52r38L57N07N44j628J059J939k474O50n8k40L1O28l48
2747A42l14j69O66N73j158q2J530m64j496Q07J071j545K7P92o8q06k6J600q56
$$ y = [-575, 88, 650, 399, -541, -318, 665, 292, -1280, 32, 913, -866, -634, 743, 218, -797, 111, 858, -105, -935, 119, 920, -921, -961, 868, -22, -1107, -64, 530, -698, -437, 65, 522, -828, -726, 649, 163, -1026, 1105, 989, -882, -747, 648, -120, -473, 421, 736, 260, -561, -80, 1332, -672, -732, 761, -1, -358, 459, 589, -107, -303, 3, 974, -655, -786, 1169, 55, -1366, 226, 823, -479, -374, 726, 391, -867, -296, 832, 100, -1269, 487, 1531, -930, -151, 1243, -17, -1118, 211, 759, 59, -895, 57, 694, -568, -793, 1128, -102, -1480, 210, 255, -667, -538, 446, 343, -607, -515, 773, 282, -1305, -88, 828, -813, -617, 665, 113, -825, -468, 39, 583, -1045, 14, 1953, -521, 129, 71, -169, -138, 490, 142, -172, -341, 325, 898, -260, -342, 1188, 724, -772, 35, 1106, -439, -412, 380, 312, -494, -520, 1080, 224]
2766B24j365J237Q86j637K16J165m84j177J115L76q17m75M57P68j183j68J729
2783H67r66p62J363N0j170L08M16K00q71L10J104n07j195J162M10j140L81P93
2801G53q58k64L28N06j26o19M77N47p25m05J090o10p60N16N80L4n59O9N27o08
2821a07m17J306r7j548P32Q10r81j89P43m6p22kJ044Qj521O25J345j422j74J338
2841G25p65r39N02J299m03j320P75M49r19J45J439q68j122J125N31r88J66N61
2859C93j35q14O0J454o85j262J125M89j430O73Q60r19k64L65O12o42m25P44O6
2878B65o84K98P71o41n93R39Q0m74J12l4J93l17j93P59j41j029O69N10o62p3L24
2899G9n0l23j72P69k2j118O09Q22q60m50J119m6j152K39R31N1p48jJ022j063l60
$$ y = [224, -1141, 96, 982, -655, -439, 726, 242, -935, 180, 556, -261, -736, -279, 489, -694, -862, 867, -99, -861, 502, 552, -618, -310, 106, 306, -565, -255, 849, 342, -853, 309, 719, -421, -40, 753, -105, -369, -41, 465, 339, -280, 197, 744, 19, -386, 704, 94, -666, -150, 430, 464, -95, -26, 501, -107, -524, 782, 685, -863, -131, 679, -302, -491, 252, 206, -516, -518, 526, 534, -987, -362, 983, -439, -613, 725, -40, -979, -477, 822, 419, -901, -126, 323, -596, -451, 988, 120, -1002, 123, 654, -334, -168, 393, 258, -556, -496, 958, 273, -989, 136, 625, -805, -132, 728, -191, -455, -90, 522, -120, -545, 199, 265, -419, -121, 650, 9, -584, 355, 435, -39, 73, 39, 232, -85, -278, 481, 340, -689, -20, 490, -172, -245, 79, 29, -294, -466, 303, 281, -837, -228, 594, -266, -716, 403, 357, -795, -556, 375, 426, -322, -323, 699, -364, -724]
2920g24J751l70j551N13J058q34n5N04J89p25j61J290l36j553J340N09j388K8
2938e15J271n12r25K73R41l35o02P29M35j130r2J639j113q53J049K26n08o3K72
2957A87on72L6J023n61n93M07L10o74L68N64q16O6K12J92n8o33K52Q09j045L04
2978b28N91l96n85N68J31L87m43k36N03m59j69P25L5j433R91N95o25j5K24K54
2998D15k36r21J433j93j069L72P00m91k99P93l29p62K24Q34r4p98M41Q59j046
3017a67m02J559p24r63Q56M55m96n10P37J30q80Q2P67k07j083P82N25r42L19O13
3037D51m95n06J42N71p1o01N00M91r71J70Q81o12k89M43l7j23p9L03K86m84l51
3058c81Q93m33l93L12K30m87K35K18nk13o7L13k0o56L91P15o94j50M07J19l85
$$ y = [-724, 1027, 657, -894, -381, 677, -157, -212, 292, 481, -244, -405, 885, 549, -1004, 336, 845, -543, -515, 756, 244, -681, -408, 533, 198, -404, 325, 760, -370, -462, 1177, 64, -789, 260, 486, -22, -85, 187, 181, -391, -355, 668, 107, -486, -79, 231, -443, -75, 489, -327, -261, -49, 143, 85, -548, -296, 513, -532, -228, 363, -33, -618, -50, 81, 468, 25, -211, 292, -167, -336, 389, 424, -1009, -18, 577, -48, -63, 161, 415, 179, -742, 691, 498, -571, -199, 501, 10, -289, 504, 175, -587, -363, 471, 377, -421, 20, 879, -167, -569, 990, 266, -697, 159, 614, 118, -392, 345, 475, -405, -323, 444, 237, -846, -64, 461, -481, -162, 451, -44, -550, -408, 163, 92, -509, -9, 482, -489, -319, 562, -50, -339, 104, 67, -56, -135, 168, 454, -30, -381, 512, 79, -314, -2, 228, -259, -24, 194, 189, -24, -91, 222, 202, -454, -63, 652, -42, -192, 215, 334, -51]
3079e1m1N50j64m58J0P57j101J74J069n82o54M15M72l48j6J08K8m69r4P68j13
3100B60q61N67O68r94O5N26j08m82l5P37k91n78L51M76o72O7O60j07p01L91L65
3121C04m19l27J30N78m95j30P61l2j023R29L48j159N97Q8j08l10j04N93Q9o49
3141c39M81L37r04K16Q21m36j35J13J10R4n23K8Q97q57l48R18m54q35J068J92
3161D44o40J5l6K98k50J2M72l0p69L10N98p76K0L33%j35Q3L87P8j065N78N08q70
3184d35R9R32l02j052N86N00n54P9J41L69o45l0R09l24l89L60L07p50p5O17j43
3205B00m07Q7P94m63o63M75N50r16K2P98k82l25j08M50p7o54N10L38m53o05J193
3226D64m84m04M9O95n49R8K27j4N2n12O91j11j038Q66M94j065M96M48l64k14J21
$$ y = [-51, -92, 458, 294, -164, -154, 603, -498, -324, 745, 163, -491, -76, 396, 48, 32, 140, 168, -301, -395, 373, 260, -601, -34, 634, -360, -295, 231, 123, -359, -394, 343, 52, -526, -175, 301, -371, -304, 356, 249, -452, -61, 304, -115, -442, -312, 266, -229, -359, 402, 370, -653, 276, 624, -535, 62, 150, 42, -268, -372, 221, 310, -339, 142, 479, -425, -209, 612, 176, 41, 154, 264, 358, -165, -137, 760, -97, -445, 473, 19, -816, 252, 444, -196, -181, -217, 81, -169, -157, 315, 285, -484, -174, 424, -352, -332, 1, 1, -134, -51, 336, 414, -651, -73, 435, -435, -336, 596, 294, -758, -172, 328, -226, -147, -6, 363, -282, -312, 597, 273, -116, 244, 551, -199, -274, 343, 200, -207, -120, 674, 211, -452, 23, 573, -343, -321, 477, 195, -130, -238, 212, 135, -519, -9, 329, -124, -729, 464, -20, -424, -375, 320, -229, -131, 96, 82, 134, -378, 313, 202, -836, 30, 524, -541, -45, 403, 39, -175, -54]
3247e4K69q4l47O5N48n35k35Q73n10l37M46L10l58j07J3N07l45m92Q91l58n40
3268c80N25M33m66j25M31r9l46k15N54j22o11N42L35j112K96P22l44j89K97J85
3288C11l68j39K74K58o13o0N63o6j068Q79L08n37K22K53M5m43m2L98K16q20O23
3309A94J19o78j6N06J23m90Q6J63j73j2k43O15k54n26N66N9l98P78l12%j38J69
3331A38P5n0p22R80r9q01O68J35m77J53K35n5j39k50O61k45m37j14J030p93l27
3352d34Q32l99k51K98l3m8m22M37O20q02j96P32j61j150R86J19m43j6L41R7k37
3373a30K31J53k84o86R90J35j016L24O40j48o72M49J83k33j85J71O10p91J23M80
3393C44j71n29L60J21p9M2j65M12J9p79N67L8k70L57K72r16K70M16r5l1m76K85
$$ y = [-54, 215, 131, -216, -151, 397, -138, -373, 500, -10, -347, 99, 409, 51, -56, -43, 464, 119, -373, 518, 160, -380, 145, 578, 112, -13, 418, 319, -27, -242, 312, 190, -421, 121, 456, -656, -360, 362, 18, -171, 126, 311, -57, -196, 78, 336, -277, -337, 226, 160, -908, -29, 279, -258, -36, 217, 262, -181, -223, 175, 391, -429, 194, 313, -365, -381, 125, 248, -242, -156, 7, -166, -178, -421, 194, -60, -586, -20, 39, -359, 419, 107, 107, -31, 138, 213, 163, -559, 421, 322, -479, 189, 324, -153, 0, 235, 180, 41, -209, 452, 207, -230, -344, 686, -107, -434, 398, -1, -252, 46, 13, -35, -457, -20, 600, -202, -398, 334, 173, -977, 9, 128, -315, -331, 10, 107, -130, 101, 254, -30, -716, 274, 409, -607, -283, 357, 209, -463, -14, 169, -64, -249, -78, 532, -259, -136, 344, 173, -356, 4, 125, 46, 88, -77, 335, 354, -425, 142, 180, -90, 267, 539, -377, -107, 309, 214, 183, -293, -8]
3415hK63l45J94P68r60m15L82L36l63J55J55J12l78J30L72m57o10R47R5p33M11
3436E1jl24l29O67M8M2n76P73m5q68O05N12j016m6J122l38q65O45L98m08l73K76
3458e0M46p51K09N33k89m05L73J32m35K26J58k6j04j51J31m6L1J61K73j056P46
3479A06q4j24L21k41k87K58p02N58N90m98j75O17k27m3j19l22N71n81J67N00l0
3500B55q25O41P3n86L32N11n78k12L83M7j27j53L16J29r51P32M75n29l93P61j1
3521B90q63M89K93k13n08N05N56q67j98P37r1l49L34M82j003Q6M45K23m3m79O86
3542E12n17m10P28K54r84M75J71l64k44M48K95n03O4O7K91o63J27M72m08K60L44
3563D15l82q1k97L86J27k32l05N50K6n54K97R1j66j89K29J98j51j98O4M29m13
$$ y = [-8, 255, -90, 104, 872, -88, -503, -121, 215, -148, 7, 162, 274, -104, 26, 398, -59, -669, 278, 373, -360, 51, 50, -274, -603, 64, 112, 154, -422, 351, 306, -562, 43, 555, -461, -507, 615, 277, -588, 57, 455, 47, -326, -50, 396, -355, -146, 387, 98, -307, 66, 198, -237, -11, 147, 121, 17, -134, -3, -49, -18, 143, 416, -640, 106, 22, -102, 219, -22, -309, -51, -753, -195, 395, -103, -278, 339, 112, 69, -50, -372, 199, -382, -215, 285, 255, -570, 71, 144, -442, -110, 401, -177, -389, -6, 41, -86, -239, 77, 206, -745, -13, 462, -67, -460, 301, 290, -573, -84, 209, -4, -512, -7, 549, -318, -516, 221, 130, -219, 115, 597, -406, -320, 125, 348, 305, -174, 512, -5, -415, 313, 567, -417, 58, 229, -135, -379, 69, 364, -139, -75, -8, 283, -380, -253, 219, -189, 71, 415, 33, -48, -345, 41, 168, -64, -369, 181, 207, -347, -50, 41, -125, -314, -85, 113, -38, -236, -172, 257, -156]
3584a56P1M35m88J45J92j21k3j58O3K92l79J02N33q05j21O42o1o44M90K31k17
3605B3l44L25K67n02j60N40K06o27K58M17q01K3M88m2j27l3J59j77l84M29M80
3626D18n84k44Q79o79l38P43j0l44j74M0L33k71n5O62l35l42N29j01k08j23L34
3647A30j08q7K8J42M61m49N0J31k11j23J41k06j67K92j34M55l12k66M80k12k40
3668b05M42l38p6P9M36l01m09M16J56o1k02K99p2n93O73K34r12J76M18k43r8j53
3690c34L31M03o79K03K28l33j63J83K91o01M87R8k06q9L13J64l93n79Q81K37r76
3711e34M58R07j048L37k4L52l34m10M97r3k96K21L02n70j00N20J08l55l6K09j13
3732bk66k56J070l95l79N86J66r90J62M82n53j48L73k33N86p44J043l72L7j60
$$ y = [-156, -85, 350, -138, 7, 199, 78, 55, -103, -40, 252, -127, -25, 508, -297, -418, 224, 163, -481, 9, 240, 23, -321, 4, 271, -231, -391, 149, 355, -272, -14, 403, -398, -375, 113, 71, -56, -89, 70, -107, -491, -62, 418, -166, -410, 469, -210, -548, 195, 185, -159, -333, -293, 40, -231, -286, 376, 41, -301, 228, 127, -81, -204, 130, 22, -65, -37, 105, 566, 117, 167, 298, 87, -36, 105, -101, -268, 24, -110, 345, 33, -233, 247, 35, -205, 237, -101, -177, -98, 338, 37, -372, 44, 200, 139, -63, 236, 164, -429, 244, 478, -434, -258, 160, -83, -181, -334, -3, 400, -279, -76, 152, -181, -344, -161, 130, -471, 16, 114, -92, -181, 132, 296, -97, -676, 205, 442, -534, -76, 831, -217, 120, 96, 448, 114, -296, 201, 108, -188, 33, 335, -235, -335, 185, 293, -62, -98, 111, -2, -268, -524, 546, 151, -228, 358, 524, -466, -304, 178, -375, -523, -150, -383, 203, -541, 502, 130, 167, 7]
3752GO39n15n09Q75m69J42j66l53O26n59m4N47j71J17J07K91j260J186K16J29
3772H36o28m90J182j094K60M66n04p24J148k83k07m85N64q7K34J32k45L68n78
3791a35L00J34k49l73N62k60j07mK55l18q8J93K79l37j63O76l88l53J68P24n88
3812g2J34l85M35n6l95L71J03o06N34O56j013M00k58p3K64N7j69J20k02P0L42
3833B57j17p50Q05q8l54J65L49j62l0j43N24j26l15J85rl89K90K01m44j03L62
3854A08J0j89rp2M55k60l76P20n26N5K37K1m94M58k9j91J17J33k64r2OK10K75
3877C03p42L43J59k28K5P5m7j63k89M87K46m12L46P6j91m2k72M78l23O40n41j20
3899a92J71J25L22l52n1L14n4n28K80M9j05K01r4j01J4o29N94K16l12J18P0k4
$$ y = [7, 646, 131, -378, 497, 28, 170, 4, -349, 277, -282, -326, 221, 50, 167, 274, 565, -695, 491, 707, 836, 208, -282, 900, -194, 66, 532, 28, -696, 452, 169, -38, -523, 41, -46, 188, 320, 75, 443, -135, 165, 299, 50, -323, 239, -21, -128, -132, 123, -195, -283, -90, 189, -148, -311, 365, -23, -376, -208, 516, -72, 62, -323, 112, 56, -339, 32, 135, -471, 63, 719, -294, 106, -152, -225, 39, 96, -73, 47, -155, -85, 257, 140, -610, 195, 107, -247, -82, 267, 105, 75, -68, 456, 330, 15, 200, 191, -198, 92, 293, -151, -254, 108, 118, -71, -80, -152, 303, 43, -333, 387, -139, -84, 153, 174, -320, 138, 109, -82, 35, 168, -96, -188, -182, 28, 303, -439, -96, 63, -165, -140, -65, -112, -275, -564, -77, 169, -243, 103, 179, -12, -54, -326, 152, -171, 469, -72, -192, -21, 104, 426, 74, 23, 337, 283, -245, 35, 84, -21, 180, 86, -15, -1, -630, -36, 180, -132, -14, 56, 32]
3921C2j2q5R0j11l98P64k81m18K69N10o69K55L59k74m6J25P2k15J12K5J83n09
3943b22M0O42k61l90J47L33l42M5m6K57l07o3M07P6p79K53M51n89M20j3k05k85
3965d31K68L09Q9l83j31K18L04k20M17n48k12K92J94r3l45L33k34R8q9J52l3j03
3987a48L40j85lR3P0R6p4k20J14Q8j35j09P0K24k55M17l92j42j29O10p1k11Q9
4010A37q8L7l88M19J15j38n49M73m21L36K9o3Q8k68J35Q9n23L55M03k98J63J86
4032B29m32j08L59k2R9m1R6j5k68L5M37k67k46P1L81j24j52m9P0j7K9K48k45l49
4056b81O26p9l44K86m9k92mQ6j25L94k35p1K11k75m0L32l94m2N62n51L18p7j88
4079b32K16j83qM33M23r14L91L1k63O7j9k06M78l94M48J51p95P4Q20k05p12O66
$$ y = [32, 20, -65, 25, -86, -484, 280, -1, -419, -150, 360, -309, -54, 305, 31, -15, 110, 182, -33, 79, 104, 287, -222, -182, 460, 199, -191, -44, 289, -53, -8, -54, 203, -104, -167, 240, 316, -463, -210, 241, -348, 72, 59, -146, -431, -163, 146, 235, -148, -279, -61, 243, 23, 440, -108, -320, -28, 166, 73, -272, 61, -173, -75, -164, -12, -45, -148, 192, 7, 4, 97, 167, 263, 189, -31, 83, 171, 36, -73, -3, 221, -34, 383, -9, -151, -280, 330, 259, 48, 137, 49, 86, -302, 117, 232, 94, -455, 18, -403, -67, -38, -101, -13, -281, -146, -57, -580, -225, 178, -120, 43, 229, -203, -311, 48, 26, 125, 84, 180, 165, -103, -68, 369, 102, -144, -73, 308, 184, 32, -17, 53, 36, 65, 313, 68, -281, 345, 266, -78, 208, 159, -133, -137, -51, -176, 218, -17, -88, 123, -152, -192, 140, -254, -296, 266, -285, 33, -44, -232, -16, -199, -207, 226, 649, -265, 126, 157, -106, -39, -58, -264, 214, -180, 268, 419, -376, -302, 518, 313, -399, 267]
4101B67n1m08J42K95j16q8K88l2l60l3M32J74p71M23k00J43o83O21L5l00p8L78
4123G8K84l37kN25q11O8L00k60j39K45L16k29j59M04j68j58K5K0j78k68M78j03
4145f9K28k22K61l50K95j40J10n2M7n1J94k47J56l52J01K05l11J98K3q0J11L34
4167C89l37j04j12N53m91o8P3R3Pr7N30j68k49r8J1NJ76J0j94N3J46k30l7J15
4191b4L27jo67N11J83j42n31O61L7j69j50N9L22m00q4L91l75k53L16m9l49L89
4213BJ23l03K06j42L79l61m78N86k07r9N1M41k34j78J08J71k53j53K70j69p5L49
4235C4J39j27Q6J45l27K15o09O10K21n60Q8Q9P8l57L88K3j61LL82j94n9j60J10
4258E7L66j06l80P53q74L21j22Q5p44N24L79l66J31M21M9o91J42M08m35j05K61
$$ y = [267, 216, -192, -50, 245, 129, 41, 329, 297, -63, -96, 336, 510, -261, 162, -38, 105, -578, 43, 78, -222, -300, 78, 362, 25, 23, 548, -263, -195, 105, -155, -294, -49, 267, 38, -121, 283, 115, -43, -18, 2, -176, -444, 34, -69, 159, -63, 198, -152, 143, 3, 113, 61, 108, 57, 251, 4, 160, -192, -91, 114, -197, 1, 24, -56, 55, 389, 52, -52, -164, 389, -102, -170, -97, -4, 3, -94, 436, 268, 19, -79, -68, -63, 113, 123, -71, -18, 128, -102, -139, -24, 303, 302, -365, 146, 329, 187, -344, 317, 354, 185, 35, 94, 416, 16, -68, 323, -52, -305, 11, -38, -387, 2, 125, -178, 28, -114, 265, -96, -574, 12, -195, -294, -243, 198, -36, -214, -106, 65, -188, -341, -71, -240, -315, 34, 173, 46, 132, 277, -50, 165, -444, 166, 387, -173, -85, 4, 82, -275, 113, 136, -25, -22, 360, 166, 107, -53, 57, 423, 317, -63, 690, -184, 137, 15, 100, -644, -120, 259, -107, 24, 445, 494, -197, -55, 353, -82, -187, 74]
4279G4J58n36J61k4j6j01J3K83K55m68L65K81p09J63K98m7J22K8n22K07J80n56
4301c91L85j72N5L11j51j92M11l74N9K7N4l0k24J68L34m85O29m84P3j12L43j28
4323A06m0N46n96j03M43l94J99J40k62K98k68J68j86J93j51o2o2P0K7m08K13M92
4345C63p28L33L25k37o08J80L42k6lq5K00K51o79M25r2J01k60M21j10k87K70M
4367A00j00q2K79j07m61N34J67m45m0O1j62L98K97l00j4l04j04L68k06K43P8K55
4389D55q36N17j22k07K65J69K01J56q24L85M0N7J34m22k94L10N1l20Q0L31l53
4410b27j84L9J83J45J09m72J8L81ok96J29J77r1J50L11k72l02L81J14k17m92O34
4432B12M03r12K47L3L09j33P3N8l54J00M35m88q1k58O71m23K18k59O14n52O6q1
$$ y = [74, 232, -304, -143, -167, -183, -284, -271, 12, 267, -201, 164, 445, -264, -101, 197, 150, 272, 300, -222, -15, 165, -391, -6, -178, -123, 188, 37, -155, 256, -118, -59, -32, 22, -8, -232, -64, 270, -215, 414, -70, 3, -109, 234, 106, 66, 612, 16, -87, 356, -38, 161, 301, 39, 337, 69, 237, 51, 244, 93, 31, -31, 39, 66, -342, -129, 363, -365, -32, 293, 56, -552, -372, -30, -56, -59, -144, 56, 307, -372, 53, -39, 62, -198, 223, 113, -174, 96, 100, 0, -82, 197, 90, -371, 163, 330, -115, -155, -94, -256, 142, 439, 139, 125, -179, -283, 85, -121, 122, 200, 455, -381, 136, 14, -193, 72, 241, 442, 598, -226, 159, 199, 256, 390, -32, -326, -16, 35, -285, -205, 126, -227, -411, -372, -189, -44, 65, -407, -389, -8, -14, -310, -181, -4, -95, 55, 366, 94, -208, 173, 287, 70, -422, 212, 615, -297, -50, -17, 292, 159, 232, 290, -64, 36, 471, -17, -98, -356, 315, -108, 110, -149, 465, -87, -21, -102]
4454a02O7l21P32k07n91J13M69m65K82O1j90L85m15QK85k84K91J49l17q8J75K36
4476B73k51Q4Lk30Q6L09l13k6l11M7K86P0P0K1j79J00Rm11P86r3K24J68n11j17
4500I4m8Q6J32j6n57M31n6L4m3K74m36L43K57l82j75M14m07p0j75L27j50J60J51
4523A88J04m90K99R5k61k15J92M3j35M8j40O34n27L82l17p1L09m75l31J052J2
4544C96l19j14m34R79k62p82L19N57l55m13N23k08j59K15J96l07j99J04L24R5
4564A56l03J75J33l72K28L22j22j87M5l47l8M00j47j3q4K73N15o74l40O9Q9k25
4586d47Q59p9j58j81J99k67M06n29L02J88j46M2K21k99M2n0p7N0o36K79M91j57
4608E3m54Q87n22l93N12J88l17j02J47k84l4K13M64m48j5K07k0L6K34k46P2j83
$$ y = [-102, -35, -356, 376, 169, -422, -309, 160, -305, -23, 38, -152, 233, -182, -174, 111, -173, 118, 267, -50, -138, 37, 273, 22, 106, 109, -121, -35, 274, -39, -65, -376, -329, -43, 27, 97, 118, -61, 39, 48, -363, 423, 330, 554, 722, 211, 94, 46, 132, 264, 248, -309, 122, 66, 100, 57, 331, -105, 238, 495, 113, -62, 352, -55, -125, -300, 27, -123, 37, 188, 292, -198, 101, 196, -65, -280, -88, -45, -180, -132, -272, 362, -165, 217, -100, -171, 138, -337, -668, 384, 396, 77, -37, -471, 508, 246, -536, -217, 340, -15, -428, 95, -113, -272, -57, 139, -168, -367, -263, 61, 156, -147, 28, 161, -211, 17, 339, 217, 30, 75, -272, -310, 90, -57, -70, -154, 119, 634, -40, -380, -311, -222, -447, 412, 333, 175, -6, 193, -74, 332, -197, 105, 293, 147, 189, 410, 111, 153, 103, 26, 76, -560, -281, 210, 53, -401, 486, -36, -429, 83, 271, -46, -148, -1, -285, -319, -106, 358, -90, -105, 102, 82, 118, 352, 106, 178, -5]
4630eJ83k11rJK9p0K3l4M27o00J29K20k76K77J26k17j2K44m90M23n5k39K70l80
4654b46J37L46j47N9m9J23k45L00m05K88k24K08j03r1L9j37Q9K04k84J21j92R0
4676a19J00k27L44k64oM50K5m71N51m37Q8L39n31K82k10Pj08K72l60N32j10k41
4698i4J68j75L48l19K0K55j55j4j2K34l90J63o5K65l02K35k45Pj89N15j58K61
4720C53l95J82o7j52L37o1o14k7O89k04m4o56J222J82j152Q2Q48o88l56Q07l45
4741e9R51q49N79m72l92J05p3J00n28J37O41l43m61M26j08M20M92j24k49j135
4761i42L28J125q01O01m30L86o55N40J1J1m62K18l8K79l10L09l59L23N5J48j74
4782A63m20O9M16l82M30M3k52k81M87j93l98J20R3L2K99k04j91K03j74L59j37
$$ y = [-5, 178, -33, -42, -41, -12, -82, -59, -93, 334, -266, -137, 83, -193, 84, 210, -7, -19, 225, -265, 158, 103, -136, 134, -246, -109, 237, 90, 149, 100, 223, -22, 278, -127, 161, -63, 145, 42, -49, -10, -147, -58, 146, -138, -17, -209, -119, -19, -246, 98, -166, -172, 278, 303, -168, 383, -54, 34, 373, -158, 124, -86, -79, -187, 85, -275, 257, 147, -94, 74, -101, 247, -72, -52, 203, 48, 34, 22, 256, -134, 29, -36, 229, -73, 162, -83, -76, -265, 250, 92, 353, -42, 140, 73, -79, 258, 197, -417, -444, 245, 41, -3, -659, 563, 745, -407, -325, 523, -165, -521, 286, -59, 892, 43, 622, 150, -242, -137, -210, -110, -638, -501, 140, -203, -664, -238, -346, 74, 566, 442, 193, -942, -614, 511, -290, 311, -119, 267, -388, 152, 163, 174, -288, -70, -108, 171, -139, 170, -189, 134, 189, 337, 163, -257, -188, 228, -154, 276, 319, 67, -214, 273, 80, -318, -198, -105, -73, 226, 22, -169, 34, -140, 219, 82]
4803H2j7R1o1n51N62k70K60k94K86j02r1L15l57j1j10K84J39O22m43M55n79q21
4825f11R39j034R32P5l66L36p5m14q9P55k38J70m53l59P28Rl55Q0O67p76J61o
4847G6M5K76l52j59K57p6L1j75K2rL28k73R7J48p58N34J92l83J78j79j3R5l5J95
4871F2j28j55p1R04q50N8l8O95l03l90J72L24K82j51P4m95K22l96J133m01k46
4892C02L45O91j613M65J33j74K43p80O00M4N0k84k9j77M65j47j37k44j34N27L4
4913A80j33M6k29j33M06j11J4J5k22L86k40k8J28o7j47J75N6r9j59J05j44P9K30
4936A08k97K03j51K3J94l9l81J44K34j96L14o5k6k94K76r5J76j80J22J49m62L36
4958I3j57k3N7l9K21j00j86j24L77l09L2M54n98K92J81l80R3R3j22J36J09j37
$$ y = [82, 65, 156, 95, -456, 106, -164, 96, -198, 88, -14, -105, 210, -147, -158, -268, 16, 155, 777, 334, 789, 210, -611, 328, -706, 226, 301, -65, 271, 196, -218, -307, 448, 210, 380, -73, -432, 296, 305, -50, 30, 697, -79, 82, 76, 121, 397, 45, -114, 143, 67, 98, -77, -55, -64, 264, -9, 88, 236, -522, 12, 204, -179, -1, -180, -193, -98, -133, 62, -66, -221, -292, 612, -238, -180, -218, 477, 174, -216, -44, 280, 562, 411, 485, -10, 212, -184, 949, 548, 302, 647, 1338, -275, 190, 323, 149, 392, -388, 212, 256, 306, 22, -7, -184, 281, 134, -3, -247, -381, 146, 180, 47, 93, -136, -269, 137, 26, 40, 55, -167, 219, -21, -49, 79, 12, -135, 40, 96, -3, -162, -57, -201, -122, 108, -189, 14, -137, -114, 80, 41, -340, -196, 38, -158, 156, 91, 65, -229, 47, -48, 128, -52, 70, 219, -243, 93, -64, -87, -30, -69, 152, 52, -134, -258, 119, -190, -158, 296, -302, -10, 171, -209, -116, -23, -145, -9, 100, -37]
4980c7j30QK25j15P7J0J99l29K06j71J64L7j53K7k97L92o7O0P8o0M3l9j22J37
5004A43m92K2L77k70K53K3k10J37q2L7j9P5K44k94N7o4J95j11l92M04k6k20R8
5027a15J81k28l9L92J60k71k08K24m0m24M38J88k99K5K71o7m12J96J15RJ35k15
5049A6J68j79j6L81l29k85O48m30k26M29j80k17j09L15J20pn17N07k38P1Oj54
5071b26P0K86l00K52j83K60M9K0k65j38K43q7J65l41P3k40M48m10J22K08J4k21
5093b01K93j93lk08N13m04K19J00J89o44L48K15m06L18j42j57K26j65Q1n1J02
5114C0k82M41k31M5L01k11k59K65n7j34K65j47j47O3q8J71j32J35R9j04k22M58
5136B59j8m32J89m3O7j13L22k39j60K07j5J4k6k16K67l32K62K02k50j0L43k33
$$ y = [-37, -167, -159, 66, -49, 28, 38, 237, -92, 114, -57, 107, 144, -9, 18, -279, 113, 46, 106, 184, 124, 167, 128, 6, 143, -349, -327, 50, -220, 33, 56, -154, -17, -99, -62, -81, -6, 238, -56, 1, -63, 132, 21, -371, 33, 7, -213, -115, 66, -162, -201, 191, 351, 80, -128, 96, 56, -368, 70, 258, -41, -16, 255, 188, -224, -28, 87, 96, 231, 16, 184, 5, -11, 370, 41, -244, 404, -26, -252, 177, -3, -220, -329, -14, 106, 99, -418, 89, -149, -78, -72, -226, -156, 130, -170, 82, -101, 159, 208, 228, -37, -175, 68, -19, 146, -195, -122, -362, 86, -324, -202, 6, 20, -201, 92, -101, -104, -312, 201, -203, 16, 116, 305, -339, 9, 224, -182, 136, -6, -163, 63, -102, -21, -72, 30, -252, 189, -42, 3, 304, 93, -166, 99, 42, -92, 173, 26, -121, -58, -146, 25, -107, 28, 127, 23, -199, 259, 241, -191, -2, -45, 22, -91, 231, -8, -168, 39, 24, 38, 12, -204, 63, -269, -7, 195, -55, -65, 278, 45]
5158D5n3j71K97P6j28P6j09J27l93N62n11K2J91N8j42j4K6j25J50k26J47j4J37
5181B8o1j3j63J49R7l19M76K4m50K19O7K8j80N0P7j66J16J82j05l31L19P1l71
5204b56L57J88m53j26L22J46j09J13l01J10j00J74J94n47K16K55j23j64J53L51
5224D00n29L90j33j87L10n59P28l77j40L54j01n89R38k83m91O12l15r8M1J64j88
5245e3K22j76p1L27j88q0n5J28l6q3k0m3J20m61K92R3j16K42N0j08K14m30L03
5268G1P4k95J17j15J04K5k33K35k54J95K83k55l08L26J41m3J9K58m20j08N65m6
5290C36l47l1O3J63j6m83N81m63K85j47K12n58K93K13j35k43L45k53L31o8k55
5311a77N3J22K47m85l5J81K14k84L1k28L53K3J15n20J79K67k33R1R4r1O8J45k21
$$ y = [45, -8, -179, 118, 194, 66, 142, 33, 160, -233, 329, -182, -160, 31, 89, -53, -67, -41, -166, -16, -242, -95, -109, 28, -33, -46, -209, -60, 37, -282, 194, 218, -232, -13, 54, 82, -98, -48, 29, -137, -21, 161, 56, -275, 44, 115, -256, 101, 289, -164, -290, 32, 178, 69, 182, -119, -9, -109, 65, 259, -288, -72, 183, 60, -104, 49, 400, -129, 261, 128, -59, 251, -308, 420, 43, -97, 257, 156, -433, 505, 222, -269, 343, 28, -70, -29, 135, -53, 169, -7, -78, 249, 61, -19, -74, 54, 18, -65, -85, -128, -8, -469, -177, -84, -200, 42, 92, -16, 198, -232, 71, 145, -150, -33, -148, -44, -19, -252, -17, -271, -76, 207, -48, -356, -30, 111, 68, 87, 345, -75, -183, 382, 336, -11, -42, 21, 184, 168, -315, 266, -197, 88, -59, 153, -405, -112, 101, -34, -277, 68, -185, 146, 78, -177, -124, -2, 245, -240, -275, -94, 120, -164, -133, -361, -8, 15, 130, -390, -211, 56, -177, -86, 8, -83, -15, 130, -91]
5334i1J63j25Q5J28n69L87L56k80L1m6j08J61J97m28K45P6k08J74l2o9L9l9o4
5357a7o6K34j57o9L27m01J1J69n5L5k10K2M04l11K69K7l73L91k20L5J03k71K95
5380A72q8p1K12j89K5l81P83m58j41K55j71O9j18j12J00j0J37j9J38n1r5j3j02
5403a28J65J35k11J58m36K79P3j11R0K8k15K04J54m32K01j30PJ16l5R4J56k16
5425e4J66K39k95k05O2R0J98l52K80k08J70r1N4N8k30J83J7q1j26k1J39k99R7
5448b09K26L0J90m32M14k42L6j96K49j62L0j17J12J20j85J06p1K48k65K36l48
5469b30K70q5o1J64j58L47j32k39L05K97p07K57Qj11K12M3k20J37N9l0J5j01j30
5492i0O0Q3l9K3L7K22k62l5p2q5J62K2q4j9N6l4q2J15KK1j11L68k42k48K02lN6
$$ y = [-91, 72, -53, 32, 160, -409, -22, 334, 54, 85, 39, -69, 92, 289, -139, 106, 182, -26, 148, 116, 47, 86, 47, -17, -83, 151, -6, -75, 252, -149, -138, 31, -24, 11, -199, -177, 227, -84, 185, 212, -161, 230, 10, 45, 148, -123, 172, 84, 13, 225, 36, 61, -320, 463, 5, -136, 119, -52, 17, -101, -213, -113, -123, 14, -5, 133, 82, -13, -26, -128, 37, 172, -39, 119, -317, -38, 35, -76, 14, 42, -173, 31, 185, -247, -46, -176, -169, -53, -88, 6, 162, -54, 112, 351, 56, -149, -87, 3, 201, -151, 129, -79, 91, 0, 54, 112, -118, 65, 82, 1, -125, -146, -7, -306, -209, 17, 47, 237, -195, 219, -23, 13, -183, 66, -96, -66, -183, -71, 49, -136, -30, -101, 147, -118, 118, -230, 40, -45, -106, 58, -100, 247, 115, -124, 181, 478, -229, 28, 36, -75, 137, 180, -40, 97, 156, 126, 141, 40, -90, -30, 53, 14, 37, 74, 296, 34, -1, -73, -158, 4, 26, -58, -77, -21, -55, -137, -22, -20, 1, -110, 258, 16, -232, -30, -33, 23]
5519B3J31q7N5l22J28j30K25k97K70q7M3P0R4J2l4q1m8J78j21j57K32k57K2J23
5543a5j29p2K01L0p4K19j53j54K36j4j17q9O6N3K82Q8l90k13P2J58j24R2j9k5
5567i1MR7lJ6J07j77J02r9J21j92M7J78ql20R9K65k31J89Km30L85j06j23M5N4
5592f9m6K69M9k18l0K7J36k8m12K31J21m0om9q0j5J00J42MO5n7j63K99J7K86n23
5618A0j06m2L40k12n8k42K48L23j26J45m21K19j02K85k13k38K13kj20K79j86l3
5640c9j5J36j01J12np9o7q1J54K13n33L39k06J9K97j44K0J33l25LJ49k6P4j93
5664a65J33J51m1j21p2k67L60O8J3o7J58j20j87L12J27j43j0N5j38j03n9K47k73
5687a42Q7K38k88j5O42m40K2J23l09L34k99r3J83L6k05K09M8k25j64L73m4j94
$$ y = [23, 154, 67, 122, -200, -72, -202, 23, -274, -4, -91, -48, 22, 116, 128, 94, 13, -35, 143, 22, -135, 97, -160, -138, -15, -144, -216, -15, 15, -59, 160, 7, -147, 89, 75, -42, -131, -65, -12, 270, 358, -32, -245, -173, -15, -139, -47, -66, -91, -87, 10, 7, 23, 130, -47, 55, -44, 77, -115, -68, 110, 102, -218, -119, 146, -85, 104, 106, -324, 61, -45, -168, -123, -69, -115, 154, 203, -15, -45, -18, 118, 90, -322, -91, 30, -10, -16, -65, -145, -160, -60, 82, 86, 151, 94, -69, 230, 247, 533, 10, -96, -138, 202, -10, -68, -310, -62, 261, 135, 280, -141, 78, -24, 261, 48, -190, 23, 21, -99, 180, -6, -39, -54, 82, -19, 93, 88, 9, -58, -139, 15, 228, -305, 34, -172, -153, 144, 0, 20, 153, -172, -169, -20, -46, 28, -165, -32, 119, 78, -43, -115, -382, -22, 46, 59, -8, 150, 30, -157, 155, 282, 139, 129, 184, 46, -57, -116, 131, -142, -55, 183, -105, -120, 522, 82, 104, 227, -82, 252, -47, -140, 43, 79, -126, 83, 131, -94, -258, 115, 71, -123]
5709a23J42K33k72k11K08Mk30J39K27k78k32M26j02K07l36K22P7j59o6PJ23j86
5731a80J87K10k90K73j55k68M9K47J45j40j69J21j62J58J07R3l22J67O8k9q3N8
5753H5k08L65j33J6k14K79j38J21j24j50K1j71K59R2j06M4J26k18k50K55J50J52
5775B53n65oM07j12J42K8j39k60N56j92l82L90j14j4k5O0L3k98L14p5O4k2K9J98
5799B70j29j25L8j68m2J19Ql0M9K1J61q1j06j20J23J95J23n26L62n2j82J89j4
5822H3l37L70O5p6K8j25K8k8J01k11P4r4J69R8Nk37J43l7j91Q2J02p5j14J33J22
5847G8j78R2k79R1K21l37M89m46L33j59J2q5L15l57K20k33K93J60n57J53M17j54
5869H9J3O8k71P6J72j02j04k0J11Q3k88K88Rl01J41J85j25K3J63j66k17J94n4
$$ y = [-123, 19, 252, -20, -231, -23, -19, -249, -110, 117, -161, -393, 33, -69, 138, -198, 24, 101, -58, -124, -117, 6, -180, 7, 217, -73, 200, 45, -223, -174, 73, 218, 78, -91, 30, -132, 26, 133, 226, -96, 71, 139, 110, 27, 85, -123, 242, 109, 125, -89, 190, 52, 173, 49, -101, -80, -251, 8, 100, -6, 38, 164, -54, -304, -49, 101, 253, -312, -318, 89, -23, 119, 147, 8, -252, 304, 112, -270, 120, 6, -8, -33, 27, 60, -238, 76, 1, 65, 43, 72, 270, 141, 16, 54, -114, -156, -37, -29, -59, -10, 11, 172, 91, -15, -135, -12, 183, 306, -220, 142, 90, -92, 97, 83, -254, 116, 181, 105, 133, 8, 36, 8, 109, -102, -28, -122, 47, 145, 150, -87, 56, 19, -172, -90, 12, -63, -177, -44, 78, -100, -8, -287, -196, 25, -312, 177, -269, 64, -95, -83, -168, 147, -210, 10, -223, 70, 230, -327, -174, 243, 89, 102, 170, -101, -25, 147, 45, -59, -79, 32, 115, -173, 115, 124, -177, -36, 149, 24, 47, 210, 44, -173, 21, -33]
5892c3Lj58o7J17R7P9J22l5k17R2J01k74J01p8J84k33J85R4m0l56M83J9k41l4
5916h9R9j71J2K41l97N68l44J67j33j05J69j9q7r7L10r9J37j64qJ78M4M2q8p9
5940H7O2k36J55j37R0j22K8L79k79J69k91J6P1l1O5M1J14l76K86j3j62N2J26j88
5964i4K24j95k41L90k41L2P0K07j18k52K97J09Q7l47k5j5L16j76j67Q7J70j17
5986AP9m4K1L93k27l46K76m9j76L43j57p1j53K89k52K32R6l18K43j20k54J53K08
6009A67k84O3K44j50J48k51K92j92k09M2K26k29Q5K51k25j79M25p7l38J59j71
6030b03M36k38PJ82q1j86R6J0j22J77j20LR3k03N6r6K78L3j13j43k85M91j38Q3
6054A7K28n48M04j46J40o7Km22M64j5j19P7j08J92r1K43l28k75N42J0k17j51P4
$$ y = [-33, -30, -188, -255, -138, -41, 38, 160, 125, -92, 0, 101, -173, -72, -150, 34, -199, -14, 80, 40, -316, 167, 186, -55, -89, 10, -161, -149, 92, -305, 263, -81, 86, -47, -152, 17, -2, -89, -186, 124, 25, 162, -2, -10, 168, 212, 254, 166, 87, 149, -87, 68, -69, 21, -101, -73, 306, 27, 196, -95, -79, -8, -39, 26, 67, 181, -195, 91, 78, -84, -32, 94, -94, 130, -65, -306, 84, -157, -125, -55, 152, 34, -218, 79, 188, 275, -72, -97, -112, 204, 28, -139, -52, 118, 1, 80, 36, 57, 450, 223, -123, 153, 104, -72, 271, 114, 43, -110, 179, -73, 159, 255, -63, 180, 60, -194, -41, 167, -117, -54, 190, 40, 188, -63, 229, 37, -172, -130, 96, -133, -48, 203, -22, -201, 224, 147, -191, -32, -203, 233, -5, 2, 184, 103, -83, 13, 23, -99, 78, -42, -39, 54, -149, -93, -189, 89, 122, 9, -134, -419, 72, -66, 17, 245, -303, 101, -45, 95, 28, 30, -392, 72, 57, -62, 15, -93, 99, 8, 251, -77, -352, 190, 200, -17, -168, -94]
6077i4K86j97L18k59l5J91l76o1J31k7J76j45K37j29L50k87l07L25j22J39j47
6098c3j99j34M70J4r7K71k88K02k45j4J46k20JN9j78J80k45J62J35J27q8k16K27
6121C7J13l36K53j20L6k6l4L21j12l22J58J71j06j29K90k83j3K49k86J51K19j89
6143D2j11K4J6J69k28M48k85j18M8Lj22J60J38J6l15l22N56k32K06j75M13m32
6165a01M3P1j27J71r0k19J33L02j09op7r2M07j19m45M68k94R5K6k20J03K03j13
6188A0r9J47k1q2O0j5M9o9j48q5M51n30N97L7m96K80J02k71J09m9r5J50R1j68
6212d5J31o5J18Mon6J32j93l69M72Oj84K92k20ll36Q0M15O4m59R9j1K77l1m32
6237c20M03j6m9OL7k67K54k6k45M97l11QJ45j35k05l8J32M0m4j45K68J23j95j82
$$ y = [-94, 192, -5, 313, 54, 19, 210, -166, -227, -96, -123, 53, -92, 145, 16, 366, 79, -228, 97, -25, 114, -33, -232, -366, 104, 118, 21, 292, 4, 206, -39, -53, 93, -127, -126, -67, -245, -65, -310, -148, -13, 114, 26, -190, 37, 150, -186, 67, -53, -17, -43, -77, 244, 132, -190, -32, 139, 33, -96, 194, -89, -102, 147, -139, 12, 231, 42, -69, -45, -29, 140, -88, 360, 75, -43, 5, 8, -114, 46, 184, 200, -115, -437, 119, -113, 93, -82, 331, -101, -58, 13, -114, 57, -33, -252, -119, 183, 74, 68, -9, -101, 306, 187, -258, 210, -84, 11, 37, -183, -80, 123, 10, -89, 58, 37, -45, 15, 0, 49, -20, -168, -253, 198, -332, 265, 302, -194, 86, 188, -83, 26, -23, -118, 32, 123, -45, 86, 21, 139, 143, 137, 81, 213, 20, -349, 123, 129, -55, 237, 17, 14, -322, -242, 173, 237, -222, -123, -134, 143, 112, -320, 83, 67, 18, 24, 61, -206, 48, 22, -223, 274, -37, -29, 116, -19, -224, -262, -130, -90, -134, -279, -11, 112, -83, -265]
6261b65K92l84J05N37m17k9K65p4k0R2j09Oj68K27o6M4l8o7J86n5l04L31r0J49
6285A48r9J8k0m2m3Q3j04Q7k28J43j00K55p4J8j23j5J62l9j41l9J78j14P5k01
6309b15M05k22k17J33P4K5j43l1J64J26k67K42K02m91K72K14k53j90M45j71m3
6330E9k08J90j5K53j08j32j5k0N8K27k75k80L05q6J91k52Q8M6k1j52M39j14j27
6353E1n2r9K74k27k5Q4J35j28N8J55m30L32n6l22Q1M13l9k76J11J74n1p0l44J13
6377a38O3M2L15l45j6J49j18R4K78n79J34k5K66j74Q6R0k08j38k7L58K6k51j32
6400b50K69q8m8p1K71j11r8R5p9r8K54k20J73K21j30l07K54R9l31K58J62k72J21
6423G4J41l93K65o4k9J6N4P1k9l43K07L22l46Lj16k8l5J89K07n6j54j70J25R8
$$ y = [-265, 27, -357, -252, 285, -132, -161, 104, 30, 10, 102, -7, -1, -169, 58, -8, 36, -2, -69, 117, 62, -242, 89, -1, 148, 49, 67, 47, 5, -38, 45, -59, 28, -200, -57, -157, 98, 24, 42, -81, -96, 66, 27, -114, -153, 25, -89, -14, -215, 190, -32, -249, -116, -42, -17, -160, -191, -27, 99, -168, 74, 276, -215, 57, 271, 18, -172, 273, 102, 59, -149, 41, 26, 279, 171, 39, 24, 4, 62, 289, 14, -266, 39, -47, 144, -108, -20, 26, 5, -147, 292, 178, 51, -1, -100, 174, -53, -78, 6, 141, 13, 71, 226, -204, 128, 72, -250, -169, 244, 205, -71, 40, 214, 163, 93, -251, -138, -75, -33, 282, -63, -79, 70, -48, 46, 324, -255, -121, -146, 120, -54, 32, 122, -86, -224, -251, 107, 133, -118, -250, 19, -69, -117, -188, 83, -28, -126, -31, -110, -208, 46, -174, -1, 220, 90, -217, 37, 136, -195, 63, 225, -47, 74, 215, -178, 87, 23, -6, 10, 64, 135, 106, -237, -30, 292, -54, -51, -167, -195, -230, -41, 166, 110, -44, -214, -89, 9]
6447IO3J59m19J98k41J83j69N08l84N5J62j39o3L09k62J61m52L64N84o41k0O7
6469C2j56M89k95J7N64K49j129J43L41m39K53m93j86P89M55r99L38O5J04K69o25
6490b14j9J63m4r3J72j61PM31Ok51J59kn2l42K57L3n4K56j49j79K6n3J3RK32q7
6516F4j63n3J14J01K54k57j35K85j14Jk06M58j95q8j93R9O3o7J9K22m52K84j01
6539f0J13J09l09j3M9J31o6K90j86j45j03K6rK71j54l40N07k64J35k02L15M8k04
6562f1o4K96l30Q4k1J16Q6j92l5K69R7m08K18p3K2J23q2P4j93N8p6J36j66K43
6586A21k46K6J21K00J3m58K72J8j11M5N8j43J40l0N8Q0k22K10k02L21n77L13J33
6609A40k05J40o6J09j37J86j05l0J58l29P5J2p4jK66l09m0K15K05k16O0J23j59
$$ y = [9, 72, 231, -188, 10, -231, -48, -217, 291, -93, -38, 124, -15, -78, 231, -31, 130, -322, 42, 626, -15, -35, 32, -124, 365, 70, 87, 651, 900, -229, -86, 255, -184, 69, -424, -610, 179, 634, -365, -27, 38, 142, 411, -214, -233, -70, -114, -207, -35, -196, -189, 242, 248, -3, 156, 154, 102, -240, 17, 50, -4, 252, 103, -76, -50, -103, -90, -81, 151, 64, -99, -152, -38, 63, 317, 60, -75, 210, 96, 97, -109, 349, 154, 66, -127, -28, 35, -32, -13, 209, -243, 41, -60, 53, 162, -147, -160, -111, 20, -46, 244, 58, -87, -190, -164, -173, 98, -56, -396, 111, -153, -18, -220, 95, 143, -61, -125, 171, -159, -75, -96, 20, 106, -86, -121, 148, 245, -163, 55, -18, 4, 127, 45, 119, -74, -16, -92, 44, -122, 121, -125, -99, 22, 222, 235, -223, 49, 67, -44, 1, 59, -84, 56, 26, 84, 164, -58, 152, -50, 271, -306, 7, 140, -65, 75, 9, 118, -19, 167, 62, 32, 190, -139, -64, -52, -126, -127, 139, -170, -210, 5, 210, -6, 54, 177, 18]
6632A8N8p7p1j25L02l8j46j88L08k41J26L10l82K76j0j12j86L38q6j41K32j86
6654b1L33k08j77m8L11k03R2j93M4J8O8j13N5j12R2K59l23R0J89n7m6j82J03k5
6678e4K01k69o2j21K21j69J02P1R1J24k44j1L18L5l94L13n79J76q6L61k27l21
6700e24J068o55k36M4J56M24n5n43J3L30m5K86O3j24o79O80%p94Q29j5k76l01
6722c54P37o38M44l02p6J26O58n81L9K21k24j03N2J04l24K26N6k7k36L32j13L
6744B0k4n8k86M33j15j13L99j81j14L05l44J16J63l31j91J62K01nK6k75j08M29
6766A09l72J99K48O0k14q3J05j37J46N4j39rk2J24o4O9L1k05O7j91K11J27j43
6789b9M7M3N3K96j32k28p7K07mm51O25j97l83K81J13j90L2j95M30J0m08J80m2
$$ y = [18, 76, -1, -72, -197, 105, 67, -79, -267, 41, -200, -74, 236, -146, 130, 120, 8, -178, 160, 74, -67, 165, -21, 312, 104, -73, -121, 190, -13, 79, -114, -70, -52, 16, -97, -42, -154, -62, 197, -126, -36, 153, 96, 50, -132, -29, -54, 147, -122, -184, -305, -84, -253, -151, -80, 11, 135, -109, -120, 198, 233, -161, 152, -427, -251, -337, 24, -203, -524, 544, -111, -347, -303, -147, 277, 222, -321, -308, 22, -23, 263, 326, 202, -477, 203, 203, -591, 238, 223, -53, -354, 383, -255, 189, -113, -189, -63, 595, 14, 53, 274, 50, -53, -1, 103, -221, 5, 61, 34, -202, 130, 17, 20, -4, -62, -348, 85, -30, -143, 256, 75, -39, 266, -78, 38, 201, -130, -321, -159, 42, 37, 63, -212, -320, 109, -263, -64, 184, 244, 30, -53, 52, -85, 61, 115, -24, -33, -55, 69, 5, 74, 105, -100, -33, -224, -13, 114, -29, 18, 61, 114, 410, 278, 50, -27, 180, 176, -275, 350, 153, -230, 51, 164, -26, 6, -189, 241, 251, -157, 23, -19]
6812a9r7J53q7K22j32n0k6j5q1M0r3o7M95k86QR9j13p1p0L83p9k46M19k76l2r7
6838a18p5L66j18l33M13j01L9n9j27K23J14l19K81j03k21N22j79j86k27J71n7
6859i4O5M7K0Jn1R6J0Qk89K37r9J79k74J55J5k3M7L4K84j21k66K8j99L35k8k5
6885I2j15q3J9K55l35OR0L45k78l0K27k34J18l6po2Q5K54l39j49K74q5R0j62o
6910f6J00j01P9pJ43k47K63k79j1K50p1k47L69k60l70M08L5M29p6k28k52K7J37
6933B5JO9k4j5P2k63J9J66k68J14K57J54l88o0oP0P3K03m52J8L42o7o63O85O04
6958F66l74m19n79J218p56n47J218p56k48O54r2J79J96j09O3n04k70N81n97K55
6978b21K36l49P09j25l60J51r1O3L8o4N5k27N44j86j43k62j2L35J4O5j70j19k5
$$ y = [-19, -116, 37, -50, 172, 40, -10, -36, -51, -132, -92, -185, -252, 243, -43, -35, 64, -49, -120, -190, 193, 114, -132, 287, 11, -21, -118, -193, 173, 55, -278, 135, 34, 73, 14, -113, 110, 224, -95, 186, 83, -138, 384, 205, 19, -208, -37, -94, -29, 18, 38, 39, -12, 84, 94, 102, -187, 50, -49, 130, -144, 11, 26, 3, 50, 84, 368, 247, -19, 9, -190, 145, 117, 92, -23, -106, -87, 168, -167, -161, -71, 274, -4, -34, 193, -41, 77, 41, 34, -28, 57, 311, -28, -177, 97, 12, 102, -60, -66, 34, -67, 12, 5, 148, -99, 164, -115, -126, 124, 53, -194, 175, -85, -455, -47, -12, 417, 341, 113, -139, -112, 25, 26, 95, 71, 56, 128, -135, -116, 50, -218, -104, 153, 307, -81, -141, -147, -77, -4, 199, -253, -235, 107, 40, -623, 62, 666, 292, -127, -706, 512, -244, -791, 427, -329, -577, 77, -15, 164, 360, 251, 314, -190, -460, 121, -476, -221, 15, -334, 375, 250, -110, 41, -50, 13, 51, -13, 42, -185, 359, 173, 30, -232, -244, 91, 105, 170, 0, -119, -144]
7001a44K73NJ16m08P7J45k3J9j01j5k41M70q9J5M6k50J17J18j18j38Q9kK60k80
7025e9j5K05j06j20L9J59j16j36l2%J88RR8k11K97k16N4R9k43K46j84K34k81J09
7049A8k76L11l03N59j96q5K56l13m2L18j96j85K22M1k93K67n2j21K17j08l00K22
7071c9J5k02K21k93L58j4o7J21j33j21O4K42j85K6k19M1L73k93K90n0m61K52l8
7094a12o7K72k42Q6M7J05j70K39j43k44J29j25L03N8n9Q5k9k84K67PJ64m44o2
7117b19J46L06j96j13j14K7J92R2j20j89O65n10n1J10J29p1j5j68l8M5M3j13K51
7140H9m2o2j6J91l40j83L44J76j48j32K23k83M44j72q1k90K91r9k6R1J57l76J93
7163e1l77K80M6J96j01J64J92j45k88m04R49k80k41l61K98R7j60p9O14j36j30
$$ y = [-144, 129, 134, 250, -158, -81, 64, 41, 60, -41, -56, -297, 173, 84, 99, 145, -105, 12, 130, 12, -126, -37, -39, 221, -59, -74, 131, 25, -95, -56, 103, -13, -149, -181, -181, 7, 16, 114, -97, 200, -16, 38, 137, -106, 140, -44, 190, -91, 18, -258, 53, -250, 309, 113, 28, 284, -29, -71, 247, 51, -134, 88, 129, -164, 103, 51, -70, 147, 39, -261, -39, -24, -226, -5, -298, 60, 46, -21, 100, -33, -154, -90, 152, -33, -7, -226, -185, 188, -105, 185, 135, -326, -74, -112, -179, 93, -149, -63, -16, 89, -81, 158, 15, -229, -100, -225, 78, 136, 77, 162, 133, -151, 116, 123, 287, -157, -219, -73, 233, 37, -76, -190, -163, 29, 121, 1, -188, 477, -33, -84, 26, 155, 84, 69, -99, -137, -92, -49, -162, 89, 47, -15, -31, 160, -180, -363, -19, 157, 9, -123, 100, -183, 261, 89, 8, -282, 9, -90, -116, -25, 132, -244, -51, -428, -148, -102, 94, -7, 157, 349, 204, -84, -488, 461, 181, -60, -421, -123, -26, -186, -265, 349, 213, 83]
7184H3j48J40j8n33J00M45p0k8J40K09p22O88k68j7m61J076q20L1l24O51l93K10
7206b9N32q85J160p3k76n00k41M48k36k06k45J62L75k21J225r70P7r6m9k17P96
7227E31m02j47M67k40n21L74q3L50l72J08k82M05k10J75j23j51j21Q16n71j46
7247a43J67N1J43J07Ln08K22jm0j56K43l84K96j19l15N46o5k6N9l31M9j3K73j76
7271a18J33K49l19J74P1n54N49m35J72j61M16r5j55j3P3o3K13K0k1k54L40j64
7293E8j4l9L8j23J01m49L35j21j02L21N1j67K50j54k11L26k30R8M62k58l69O13
7315D16m45K19j19j58n1P8k59N97l35N3J36k09L46k11j9k48J93K15l33J31k57
7336b60L79j99J20j73J88o2O2J02m38K32r0P5N4j2j97K1J58j28L70j28m90L76
$$ y = [83, -65, 75, 57, -476, -376, 69, -1, -29, 111, 320, -402, 286, 18, 1, -460, 616, -204, -173, -497, 154, -239, -29, 503, -382, 778, 705, 429, -71, -312, 136, -100, -306, -551, -389, -14, -235, 990, 20, 97, 1, -48, -265, 531, 129, -18, 449, 209, -312, 62, -21, 329, -43, 65, -217, 188, -22, 153, 30, -121, -242, 574, 3, -143, 24, 75, 218, 325, 328, -180, 42, 41, 1, -155, 88, -296, 0, -119, -434, 112, 47, 21, 80, -251, -202, -215, 58, -118, 15, 264, -55, 119, 190, -364, 185, -250, -78, -239, 177, 82, -73, -86, -13, -76, 137, 157, 136, -118, 222, 58, 44, 5, 43, -80, 21, -428, -93, -214, -316, 5, 56, -111, 139, -15, -226, 100, -130, -32, 430, 172, -197, 416, -29, 190, 71, -87, -138, -60, -319, 278, -57, -4, 132, -77, 269, 58, 39, -209, -16, 199, -134, -3, -260, 119, -80, 40, -133, 55, -7, 55, 157, -281, -49, -139, -64, -10, -22, -219, -198, -40, -168, 202, 74, -416, -40]
7358d0J62p2j10K27l74K51k8l30L90j96J85r8L4K63j38j18J30k58j73L7K28m9
7380g7O9m3k50M27K2l33J61L5K6q3o8L9N1N2K23k50K9j33J71l57J14L86O7J85
7404D63k36k89o4j04L4q6M83p0K21l10m68Q44n24O59j343J92N70n30O66k53N51
7425D06M20k89m23l22m76N25N89k03k47J10j6mj13J32j34Q0j79k34m3M81j64K79
7447A75j60k36L30k42J40J84j63j44L8O6QK92l70l5M50l04l25L44o4O1m7k85L45
7470E8J34n10N59n42L80R3l43L44l20K84J41l65m4O1M4J22k83K46L8j84L6k6Q1
7493Dk55K31j43L85l56J85J62k63K50j4m44L67J0j57J27K89p6k36l87NN76l92
7515a32r4K26k76L37J23l73K62j68K43J9j70mq1K00k30K17j51q3J28j40L31j71
$$ y = [-40, 122, 50, -60, 167, -207, 44, 16, -314, 76, -120, 65, -33, 1, 264, 126, 8, 138, -120, -293, -256, -28, -77, -8, -51, -301, 126, 148, -185, -24, 11, 37, -46, -114, -75, -24, 28, 251, 1, 30, -103, 68, -289, -175, 211, 278, 463, 227, -62, -126, -230, -196, -282, 201, 131, 352, 42, -426, 418, -106, 553, -790, -598, -28, -558, 108, -145, 406, 826, 537, 114, -208, -684, -159, 430, 227, -20, 90, 74, 70, -43, 89, -45, 35, -144, -378, -421, 60, -104, 175, 15, -221, 109, -133, 7, 191, 28, -116, -78, -12, -4, 288, -82, -117, 333, 29, -296, 48, -16, 45, -2, -287, 58, 192, -318, 241, -301, 79, 172, -171, 173, -147, 137, 278, -87, -131, -70, -26, 96, -187, 59, 97, -87, -51, -77, 4, -251, -20, -163, 222, -134, 51, 213, -50, 200, 186, -258, 109, 119, -38, 89, 378, 302, 66, -321, -316, 260, -132, -226, 0, -276, 61, 184, -189, 73, -95, 148, 167, -3, -7, -88, 112, -118, 99, -52, -135, -7, -147, 184, 13]
7537A3P8J59m07J68k27J23j94J83J95j31O7Q1l73J49q2J51L10l61P6K66k27J11
7559A28k5j57J95j78r7J93k13K06J15j93k5M37k01k80o1K82M5l4l9j60k15N73
7581B96l8j58j5j26Q1k60L58o2j81qJ28Q4O7l12J96K6k23P9K53m78L35K8k14M2
7605a02J12J22r8l6J11l00L28j21mk7k26N34k92j80L95k75K67j71J2k2j36K82
7627A73L5j78J63k33Q8r0p5J12J68k98M20Pj67j85P0k32N5L6K66o1k60R7K42k11
7651e8J77j63JJ95k95j0K68O5k94JR8Q7r2R8j28j22K42J33l57J06p7K97l29K21
7675F4q1l51M66m04K59J04m57L70o9J22J9K95m92M3q0q0M50l07K3j84L70j62K13
7698A31q2j95J91k47j02K94m8p6K47k67L91j06r6j74J99j7j30N7n7p0M21k40O
$$ y = [13, 91, 250, -157, 11, -216, -93, -287, -104, 91, -40, 27, 108, -265, -116, -198, -47, 263, -98, -22, 244, 17, 128, 103, -54, 141, -37, -134, 59, -154, 52, 167, -26, -51, 386, 185, -95, -156, 126, 171, 137, 98, -62, -277, 296, 258, 100, 85, -41, 40, -220, 138, 76, -105, -113, 15, 99, 166, -146, 50, 76, -147, -68, 185, -293, 42, 70, -144, -102, 10, 132, 34, -2, 109, -191, 137, 16, 12, -15, -241, 293, 1, -179, 216, -59, 208, 37, 49, 27, -109, 173, 208, 30, 193, -40, 48, -42, -117, -5, 163, -135, 285, 292, 125, -60, 10, -222, -167, -131, 135, 74, -186, -89, 153, -58, 119, -44, -43, 152, -143, -153, 115, 180, -114, -113, -15, 72, -20, 78, -50, -172, 70, 203, -154, -48, -125, 172, -157, 64, -17, -368, 98, -306, -47, 57, -400, -30, -99, 23, 42, 337, -155, -112, -192, -272, 178, -129, -106, -290, 80, -82, 131, 49, -146, 45, -202, -304, -10, -58, -134, 113, -154, 237, 131, 35, -139, 60, 43, -87, -30, -87, -157, 264, 24, 30]
7721C0k35J93j07M5M04k23j33q6M6j1K7j08n8J65J66k55K75j66N5k03L15k98l1
7744a93O7R5J23j63L8J87l76L94p9j39K17k25m7L75p6k36J39n1j27P2J0M0j2R4
7768A27j72j2j19K12J61j85m7k36L34n8j47J51k13K4J98P2j24J09j30L2R0j44
7790g7J19m2J35o1k44r3Q8J00J30j75J19j40n8L88j7j95J7m8K50j72j20J43O7
7813A14J31j81j73O0j52L43l07R7m3K0K28oO3k13OO4l0j13l1l5J70j74L68l6p3
7838I7j57jJ39r0l5n4L00j25j21K00k76J99j13K07q4j52L4J70l23J72J19K5k42
7861a11N7k10K23j39L3K81j0l56K97J36m10M11p7j02j20k37K91R7Qj46L48l40
7883g6j56L83M2k78O5O6m9j29M21n25M07k77M86n03k5J65j8o8k9J21j81J34j04
$$ y = [30, -205, -12, -119, -74, 330, 107, -26, -112, -66, -77, -50, -158, -216, -51, 115, -140, 135, -31, 24, -179, 136, -162, -193, -126, -31, 92, -71, -33, 154, -222, 172, 93, -46, 171, -54, -101, 274, 198, -38, 101, 50, -77, -5, 5, 45, 33, 127, -45, -57, -176, 36, 197, 12, -35, -271, 63, 5, -142, 9, -204, -180, 18, 90, -34, 75, -55, -23, 67, -77, 42, 0, 135, 74, -170, -263, -175, -75, 55, -120, -1, -141, -199, 189, 172, -23, -6, -54, 196, 24, -96, 47, 114, 245, 64, -109, -49, -201, 142, -165, -68, -111, -91, 137, 131, 194, -19, -13, 51, 21, -92, -123, -158, 12, -162, 206, 170, 97, -60, -61, 78, -12, -47, -101, 199, 74, -47, 153, -123, 76, -37, 170, 86, -66, -32, 138, -185, -13, 106, 131, -111, -54, -264, -41, -180, -147, 134, 124, -232, 65, 201, -209, 202, 125, 23, -97, -334, -43, 54, 62, -84, 264, -76, -232, 151, 193, -85, -20, 46, -3, -132, 289, -236, 171, -106, 380, -123, -148, 17, -1, -69, -98, 23, -158, -24, -128]
7906a28J58r1K28j55J65q4o9J21j79J26N3j6O0j51k60L81K1q8k2r5N5p6J90p3
7930G1l50K1N22k71L40J23o20l4P3Q6J94n1j21J47l60L26l0K12l81J46K22m13
7952a48L34j69J66k72j11J12J08J16m3j80K79j76J35L6j19K5k05R6N46n71K16
7973A75j58p7K38l96J43L4j17K9K56l3j85J50r4k28M18Pl28L1J89k36J15p9Q3
7996f3k1R4P7J56l03m7J28j20J31L4M4l94K32L1J06j10k02M31m96N38k40J8q6
8019f2J47k31N6j6p4K53L7M4j34l9p2j7j07K34j79L69k72K4O9m7l5J94j13o5j92
8044b28L89j15o0o9J72MO1K6k05O7m3m97M84Q9M5j11j47K94j59J57j98K05l51
8067a90K5J05r0l7K32j41J05L1L9P0L5j82K55m89R0ML46j82J65k32o3L6j50K56
$$ y = [-128, 30, -61, 167, 12, 177, 93, 24, 145, -34, 92, 145, 129, 189, 38, -222, 159, 180, 92, 70, -25, 30, -46, 144, 71, -279, -258, 264, -7, 333, 456, -164, -198, -125, -39, 155, 104, -17, 130, -230, 96, 66, 278, -103, 43, 265, -148, 186, 17, 183, -89, -200, -88, 20, 136, 93, -87, 192, 16, 151, 187, 68, 93, -112, -16, 530, -41, 175, 17, -60, 178, -218, -75, -41, -158, -129, 127, 94, -91, 59, -35, -263, 155, 162, -166, -135, 54, -182, -67, -146, -63, -84, 10, 87, 243, -60, -107, 21, -99, 32, 66, 110, -284, -52, -21, 85, -25, -227, 204, -292, 246, 6, 24, -62, 85, -146, -90, -106, -180, 73, 110, 154, 20, -19, -91, -108, -215, 19, -160, 209, -63, -39, 30, -17, -52, 142, 29, -36, -228, 161, 46, -14, -83, 89, 93, 154, 180, -25, 42, -1, -498, -14, 75, 120, 9, -138, 156, -3, 154, -44, 161, -190, -165, -60, -150, -187, 45, -96, 9, 40, 79, 149, 184, 2, 257, -232, -142, -138, 208, 26, 191, -41, -104, -68, -218, 38]
8091C8J4j37J81M0k18P3j04K67k49k3j09K74j43Q5L2J60mpj70M2o7J22Q9k96j25
8116b35Q7p5K77p5J85l84K95j18j1J74j90K89j02m09n7L71KJ55j43j17q6K49l31
8139b49K43Q6k01j3L19l20K74m7j37j99N55l59k42L56k44QL64j88j29M89l14O6
8161A18j47J77j62M0K79k70J22k80J95J20j41J83k09k0r6M47l09k74J99J17k86
8182a97q2M86l72L37j10Q5k69j94N02
$$ y = [38, 52, -85, 96, 136, -82, -9, -113, 154, -95, -118, -227, 47, -96, -11, 21, 181, 177, 170, 0, 42, -25, 97, 186, -110, -235, -148, -223, 54, -21, 164, -220, 75, -43, -54, 120, -70, 219, 117, -292, -349, 22, 24, 179, 36, -81, -167, 82, -249, -6, 80, -121, -134, 185, -135, 139, 92, -45, -244, 311, -48, -290, 66, -178, -170, 194, 6, -123, 366, 52, 118, -29, 148, -14, 26, 305, 35, 157, -123, 72, 192, 51, 234, 25, 5, -91, 356, 47, -227, -28, 89, -197, -279, 207, -165, 172, 62, 147, -122, -316, 186]
8191A86
$$ Imaginary data points
##PAGE= N=2
##DATA TABLE= (X++(I..I)), XYDATA
0@%%%%%%%%%%%%Pj5J6j6J6k3L1l4M1m8N6p0Q4r7J12j28J46j67J91k17K46k80L16
35A67l53L96m44M98n58O20o87P61q43R33j028J132j250J378j517J671j842K031
53A065k240K475k741L045l393L800m285M866n582O490p680R320j1723J5585k2767
68a3765M0404j60742k01752M44864J07534k87770o74K33844j11604j66682K04643
79H8300J73178k83152j59392K64823Q9444k38476j6537J59993m8410j13993Q5312
90A090Q8604r0167o5556R5052K1586q8880K8254N5427p7369k2514P0979k1599
102e093n2145M7559K7076o6164j1268R6282J415j15888M2881J34953q1521j13346
114i5259J23485Q5221j28278m6965J27674J0398j43072K6141J59136q6775j79404
$$ y = [0, 0, 0, 0, 0, 0, 0, 0, 0, 0, 0, 0, 0, 7, -8, 8, -8, 8, -15, 16, -18, 23, -25, 31, -39, 45, -52, 60, -68, 78, -89, 102, -115, 131, -149, 167, -186, 210, -234, 264, -294, 326, -361, 400, -443, 490, -538, 594, -656, 722, -795, 876, -966, 1065, -1175, 1300, -1441, 1604, -1789, 2011, -2274, 2592, -2990, 3500, -4180, 5140, -6583, 9002, -13765, 26639, -134103, -335855, 109009, 216543, -71227, -71901, 161943, 50339, -116343, 88300, 261478, -21674, -181066, 83757, 173201, -65275, -81812, 78181, 29771, -84222, 1090, 89694, -473, -66029, 29023, 50609, -38271, -10017, 45410, -31959, -54473, 16506, -5093, -57238, -9679, 17397, -48767, -60035, 36247, 37662, -78226, -35345, 99608, 18087, -95259, 28226, 113447, -14831, -61796, 65878, 76276, -66796, -40655, 118481, 31706, -147698]
125a47698J24731J49231j52000j05436J47976M9903j43648L508J56137m3243j56232
136a16771R9560J49541j36291j00145J59881M6435j52971j655J26220l4957j01730
147f2883O6268P2300j12621m1635J49036K469j48145L4296J13190n5557n8266
158d1548P0416R939r6063J6781J12606m7265j25501O8029R4000r2087m0324J02452
170C1435j0321r1673N2702R2130o3104p7178Q8993O4168j05357k9019J16376j7342
182E1810j09001N3591P9293p8056n8827Q4344L7521r4522j8665J00985j8186j02199
194g1912N7456Q4921r1013n8228R3148L2374q3828q966P5104k2587p3931O4472
206b990P4362r6958n5852J10914K9101q9747O223O6789l4023n0334O6084M9103
$$ y = [-147698, -22967, 126264, -25736, -131172, 16804, 66707, -76941, -73433, 82704, 39461, -116771, -17211, 132330, -3961, -104106, 55775, 102210, -50761, -52416, 73804, 38847, -62883, 3385, 75685, -36936, -78571, 70465, 72934, -75211, -40915, 72275, 16718, -41548, 28868, 38807, -57256, -40475, 72131, 24866, -100635, -32606, 61394, -30693, -71017, 31435, 21114, -70559, -17857, 74273, 11169, -66009, 22984, 87152, -18205, -47224, 69152, 51810, -57191, -3600, 75693, -2363, -61190, 23154, 60675, -33847, -52512, 48473, 30287, -71912, -14456, 70465, -20548, -78776, 14372, 46746, -37082, -46048, 29056, 6469, -67462, -2990, 71372, -25586, -81438, 29476, 58577, -31170, -24947, 41842, 7819, -42515, 23569, 72672]
218G2672r0868m0133J07133J1685j00511K5819P3068n8177m9634P4283K5047q4068
230c3684j1182Q7395j5152r0144M7786P7523p7382m9803R0704J2860q1120J6871
242b5328P3610l9359o9984O1878O3961q2996m2005R5836M276q9559L5656P3209
254E9195n9662n5886P1679M2123p8304k6105Q5015m872q9333L9538P5369o8533
266i776n0377P3446K5622p1967m633P0874j3154p1225L9718O5962o3352m2254
278e1116P9733J3510p6791J4212O4643k9170n0974M2601M2893n9728k7015P7169
290C9967J862q1548K4951O7146m7751m2403N3721K0846o3615p601P1229j1137
302B5667p8273L2834O6546n7043m1101P0252J1322p2503J2891O7145k3318o2725
$$ y = [72672, -18196, -58329, 48804, 60489, -40022, -14203, 58865, 688, -48946, 25337, 50384, -33684, -44866, 42529, 27377, -62767, -14981, 62542, -14840, -64643, 26061, 38921, -42199, -25328, 48282, 8923, -61061, 817, 64778, -18218, -60223, 35613, 39889, -49670, -14014, 59195, -467, -56353, 15326, 57449, -20855, -46960, 38055, 33183, -56150, -16612, 58757, -9776, -60153, 13293, 38915, -33052, -37685, 33189, 20035, -51190, -11472, 54490, -8862, -51116, 28617, 42127, -34664, -20452, 44191, 15021, -35953, 6648, 49541, -10187, -37202, 39967, 41829, -39719, -14768, 52378, 4627, -37776, 15945, 36791, -26824, -34425, 36804, 25667, -52606, -19772, 46774, -10269, -51370, 18882, 30204, -42299, -29408, 37737, 14419, -48306]
314d8306L9631N5392n8830l4572P6573P582p8908K3180O7181l9232m9555M7358
326G494L7537n7936k3303O7848K878p6028K2905O6830m8664m4963N8764K2911
338C6273o1151o775O1265p280o1738K7463N5743m8807l7949O2583J3993o3847
350c0227R136N5876k2788m7493L5094M0201m4633k8823O0286N962o4660K1516
362a0553N5909m1886m0892M8641K4165n2067j3861N2805l210o0387K6112N5514
374D0290n0878l7978O2949J8120o0983J352N7669j5562n0446L0372M7190m7197
386e102l5143O2792J3035o6242R955N7147k7345m3071L5699L2725m3888k1714
398c1152N4263N707o0767J6676N5500l6288l8720M6210J8543m9046n189M5889
$$ y = [-48306, -8675, 46717, -12113, -46685, 29888, 37470, -41438, -18258, 48923, 9691, -39864, 7494, 45031, -12905, -36208, 31640, 34518, -41510, -18605, 48225, -439, -45402, 13362, 36273, -24878, -31653, 29612, 22332, -39406, -11943, 43800, -5007, -42956, 19627, 33620, -30227, -21091, 34785, 11997, -35496, -402, 39799, -4834, -33657, 26629, 32591, -32069, -10553, 45356, 3470, -37422, 11219, 35384, -16683, -30544, 22261, 19051, -41336, -15224, 40290, -10588, -48566, 14383, 32503, -28480, -27128, 30541, 14979, -35467, -5095, 42095, -5102, -40245, 22547, 35582, -30660, -20705, 36442, 9097, -33974, 1725, 34450, -9438, -31152, 23111, 28818, -31949, -15273, 40227, 3939, -34781, 11429, 29972, -19074, -24263, 21626]
410B1626o978m9632K1253M6017l9457l1933N5007J0529n3903J0835N1117k1070
422A3411l9449L0663L4210l9367k5000M9836P130n9499J6865M9731l6001l8514
434c5984M1272K1839m2659j2616M6188J184m7782J6980M6898l7625l3425N0364
446A4634J3952n0047l095M4273r193m1898J8820L5579l4144k6630N0403J2939
458B5593n4885P528M9911j6151l5158K6996K6386l3025j7113M6315M223n4958
470b4338R514N0349k9902l7257L7942J6708m1772m626M4877m327m5425J6916M6791
483C5450l2971l3170M8765J4004n3436N439M6818j9059m0945K5455L1474l6268
495h444k4616M6808R189n3952J2827M9625k8609l3352L7578K1179l8466j0086
$$ y = [21626, 14648, -34984, -13731, 32286, -7171, -39104, 15903, 26432, -27471, -16636, 34481, 13411, -26038, 4625, 38835, -532, -25532, 24304, 31434, -28065, -11200, 38531, 2530, -35984, 5288, 27127, -15532, -28148, 18040, 19224, -28558, -11578, 35320, -2305, -35730, 14634, 28586, -21461, -24556, 19717, 10524, -31374, -12554, 23025, -11119, -37749, 12654, 25593, -29292, -21764, 28147, 11996, -23162, 3834, 30220, -2805, -19918, 26397, 30620, -24338, -14824, 35525, 5623, -31634, 6308, 23016, -18756, -23382, 21495, 17168, -28257, -11341, 35450, 2479, -30691, 18074, 32078, -21358, -15919, 30899, 11840, -29105, -3650, 27824, -8444, -33060, 13748, 22937, -31015, -18188, 31437, 2828, -30524, 7054, 28233, -10233, -20319]
507b0319M0417j11m5347J6080L8251l4594k8878M3597J0791m4985L007L8848j2069
520D688k9680K0668K9130l0090j9315M4409Q555m5868Q253L8204j8454k9735K4966
533E731J8357k9864j5932L5778P326m3956O467M2014k0411l2654L2288J8685l3044
546i215r393L4973Q40l8169P514L8241k3241l3471L6058J7763m1445k273L8604
559A6786q517l2929J9521L1434k7243k4765M1247J4641m6351K795M4652k1241
571A0030l4150L1917J9666l8946j1822M0642J980m4601R906M1353k7588k9872
583c1485M2058J1954m5033J245M1724j0062l4550J8106K7538k8526j9672M1115
595A4412N983m5061Q059L8626j6622k5317K3999J4274k6722o502L4518J574l8382
$$ y = [-20319, 20098, 19987, -25360, -9280, 28971, -5623, -34501, 9096, 19887, -25098, -22091, 16757, 4688, -24992, -4324, 24806, -5284, -24599, 19810, 28365, -17503, -9250, 28954, 10500, -19235, 5731, 24088, -5776, -21708, 14070, 21396, -22560, -16093, 25921, 5510, -27144, 5144, 23829, -9215, -18608, 16365, 17205, -20964, -13450, 24791, 1550, -31921, 4137, 21900, -19545, -21818, 16786, 8269, -24660, -5139, 26295, -948, -25713, 15534, 30175, -16176, -13381, 31271, 10030, -24120, 7797, 27463, -11483, -23305, 17337, 19317, -25284, -15378, 25975, -1613, -31485, 10573, 22527, -22506, -21261, 20463, 10401, -24149, -6043, 21495, -7031, -26703, 14412, 20395, -24666, -16607, 22019, 5397, -19920, 4079, 18353, -8369, -14871, 19647, 21221, -17161]
608a7161N845L5616j7328k2520K4732P646k9475j876L0414j041l1193L872K9200
621A6731j3500k2515K7395J1001l5143j81L3367m131k7436Q320K1890j5713j8824
634a8739K8996J1509l9144j860L9644j0820k9331J9406J8747k7129j2696L3823
646A2406P399l9418M96L9596j7078l0274L0945J6316l8830l452L8466l575l4393
659b1396J0811L1370k0803k3143L5143J2006m0938L347L8407j4225k8520K2643
671D702J8076k6521j2712L1805N208l5276N016L2156j9601k3332K9264R588l0775
684a2402k826K8746l069k6742P668K4575j8034k0458K8408J0550l2254J610K7854
697A3626q564k0112J2288J7994j6143j5901K3612J1047k9097l23K8419j1621k2530
$$ y = [-17161, -11316, 24300, 6972, -15548, 9184, 16830, -12645, -14521, 15893, 14852, -16341, -12469, 16731, 3231, -19284, 8111, 19112, -16031, -16212, 17155, 13024, -14412, -6092, 15798, 85, -18739, 10257, 21766, -17378, -19238, 20406, 9586, -19745, -339, 18408, -8721, -21417, 12406, 19805, -19613, -19117, 20479, 3401, -26873, 4072, 20388, -18442, -21894, 16572, 12997, -21396, -10585, 20785, -18, -23161, 11982, 23988, -16950, -13603, 24804, 10579, -17941, 4702, 22778, -3743, -16455, 15350, 20558, -14718, -9702, 22454, 2853, -20479, 8785, 18373, -12402, -15228, 13518, 10449, -16293, -8625, 15950, -2084, -22542, 5866, 16416, -15838, -14228, 13626, 5062, -15050, -2762, 15232, -911, -16812, 6800, 17847, -11250, -11573, 16846, 5225, -17305]
710a7305J8115J5865k1090j1932K2482Q275k6721L85K8847j2861k6480K4069J8161
723A9810k8677p949K7531Q69k5485N219K6703j4712k4800K6156J7331l2815m281
736a5100L3040q269k5927J5967K0259k0814j6190K6380J0121l1654O52L0765j4554
749D676k4482K4782J3186k9435n652K8274P5k6301N164K4224j4880j9474K7145
762G302R601l2733J442L0341p640k3301J0905J7621j4907j3120K2858P441k9424
775a3614R74L0062j0175k3085J6450J3207j8477p692K0378M683k3895j29K5291
788A3978q816k2019J8273J3517k3804l976K2319K76k0750L007K0202q884j8956
801a5633J9288J2684k5976l015K7135n900k1769J1434J6689j4642j3536J9279
$$ y = [-17305, 810, 16675, -4415, -16347, 6135, 14410, -12311, -11926, 16921, 4060, -22420, 1649, 19810, -8867, -16816, 10715, 11584, -13901, -8682, 18021, 3309, -21491, 4665, 21996, -10819, -15100, 17940, 9671, -16256, -289, 19970, -844, -17034, 9346, 19467, -12187, -11535, 19230, 4676, -19806, 4976, 18162, -11273, -16925, 11349, 11424, -14877, -9713, 14511, -369, -19843, 7302, 16903, -15830, -14388, 15953, 8313, -14988, -4083, 13538, -1369, -14489, 8369, 15810, -13614, -12640, 17422, 7247, -15838, 612, 13819, -4658, -12350, 8028, 12711, -11184, -11313, 13978, 5162, -16857, 1416, 14933, -8871, -12847, 9472, 9748, -11002, -7995, 12207, 3323, -15633, 3655, 16339, -9637, -12652, 14483, 8583, -13186, -1752, 14937, 295, -13241, 6038]
813F038J0221k5257k260K6848r365k3359J8818J4229k3043p085K2129K864k2249
826a1471K330K2207j0216j9950K1125J2599k7102k262K6125m946k1806R436J7282
839A3351j3067j5113J8792J0071k5634o46K6998r353k2615J5725J5471j6648r808
852a2476J7268N484j9381M89K2645r446k1789J7261J4905k0921n609J8269n1j6858
866a0210M596J7739r104j7188J6269J3690k1342l284K2144n492j8128J1023J3878
879A4591j3017j2218J4844Q760j9739k915K2554q107k0132J5594J3098j8310p019
892a2016J7706K916j7588J100J8982q063j8706J6568J2668k2476m246K2055l527
905E373j8584P354J5265r166j3417J4965J0549k0844j859K4014o649j9701J2415
$$ y = [6038, 16259, -8998, -11258, 15590, 6225, -17134, 1684, 15913, -7130, -14215, 7914, 10778, -11471, -9141, 13066, 2850, -17100, 4025, 16624, -10478, -12740, 13385, 8439, -13367, -3931, 13351, 284, -14829, 3963, 14034, -11600, -12246, 14752, 5399, -17216, -1491, 13980, -2668, -12476, 4792, 10276, -9105, -8616, 14029, 4583, -17206, 55, 14960, -5961, -11570, 6699, 6648, -10210, -5614, 12125, 3021, -14167, 2102, 15792, -5550, -8834, 13310, 7818, -10310, 713, 14591, 1574, -10644, 4200, 12960, -6779, -9694, 12860, 4753, -15379, 215, 13313, -4997, -12016, 5690, 8606, -8982, -7882, 11100, 3037, -15669, 899, 13567, -8909, -13155, 8900, 5373, -13211, -5857, 9408, 242, -13175, 1790, 12339, -8505, -10364, 13650, 7001, -12700, -285]
918b85J3714j4217q409J4523N185j7777j266K0394o739j9459J4387J3789j8506
931d666n533J7618M35j5200L165J5109o846j5304J3271J1633j9394l987J9636
944I937l869j6619Q502J1787j1136r065J3451P159j7295k214K0258n857j7439
957a2400J2994J0920j5958n394J5400J864j5700M24J6432n493j6736J3069J2186
970A1608j8513l875J8532j433j6151N936J3318p061j2174J1456J0041j6983l673
983h972J9605m428j7114R809J1615j2386p325J2786M672j4328j800J7946n077
996E003j7229J2585J1860j6586m411J6047q10j4605L648J4088o761j3881J2182
1009A130J0733j6878l708J8373m117j5258Q922J0752r796q366J0942O521j4705
$$ y = [-285, 13429, -788, -9197, 5326, 10511, -7266, -8532, 11862, 5123, -14336, 51, 13840, -4666, -10199, 7419, 7854, -7346, -4181, 10928, 4082, -11222, 2049, 13682, -5712, -9699, 9937, 6068, -10551, -2049, 9738, -1398, -10463, 2988, 10147, -7148, -9362, 10896, 5039, -12400, 594, 11514, -4444, -9838, 5562, 7426, -8274, -7850, 8582, 3089, -13647, -578, 11608, -6905, -10780, 7752, 6319, -9832, -3896, 9422, 2361, -9813, 1643, 11684, -5299, -8972, 10633, 6205, -10909, -1100, 10515, -1871, -9196, 3590, 8262, -6066, -7866, 10080, 5003, -12226, 359, 12219, -4367, -8778, 7269, 6459, -8146, -4498, 9590, 2829, -11052, 1130, 11863, -5015, -8723, 9650, 5533, -9725, -803, 9949, 153, -8213, 2729, 9250, -5455]
1022e455k408J7153n311j5703J1392R738j3415m290J2392N27j1261R91J3151m475
1036C026j4287J0549J0411j4324l828J5258k623j2353M953J1142o227j0678Q817
1049a64R516j3322m510J6566k866j4883Q298J0994r958p369J0231N555j2542k816
1063g270J5588k383j6247R536J2453j4179n344J4166O41j3355J931J3303m587
1076D253j3965R582J1226j5284l529J6395l872j4520P926J0932r273p482R304
1089A693O020j3146j530J5462m879j4602J0458R549j4123k279J2089j346j0887
1102g521K678J1855n298j1637R618Q266j3242j176J3875m808j0409N989Q842n643
1116A389p924P109P410j1650k482J4128l102j2846O688Q784o823n572P033L585
$$ y = [-5455, -7863, 9290, 3979, -11724, -332, 9406, -4009, -8299, 4093, 4620, -6641, -5650, 7501, 3026, -11261, -712, 9699, -4625, -8453, 6805, 4182, -8171, -3218, 7924, 1697, -8981, -164, 9352, -3970, -8480, 8086, 5220, -9663, -1365, 9629, -329, -7698, 2533, 8088, -4454, -7270, 8318, 5935, -10312, -776, 11677, -2502, -7846, 6320, 6961, -6394, -4463, 8840, 4253, -9712, -130, 11096, -4188, -7717, 8678, 4806, -9714, -1788, 9144, -129, -7611, 1693, 7713, -5433, -6963, 8499, 3620, -10982, -524, 9025, -5098, -7377, 4712, 3366, -7521, -4843, 7012, 1714, -9923, -305, 7961, -5281, -6457, 7418, 2610, -7799, -1810, 7032, 1389, -6535, 574, 7984, -3666, -6148, 7980, 4878, -7968, -1280, 7504, 681, -4891, 2142, 5727]
1130E727p651l335J1603k98j3383O219Q864r220l949R103J163j0486O11J1386
1144F354j408j3131N901J0129j0623m445J4207k084j4333O288J1652o708r225
1157g426O796P229j1457k983J6356l852j6113R322J1003j1474m524J1577N18j1404
1171f432J164J3424n378j3085R695R871j3310k038J3610m369j2285P311J0020
1184H198p806p308P170N739r561r09J2778m456j2044Q456P616q518l205P202J020
1199D372p018p54Q946j612j0822O214O839p765k193P456p08p356J345P446j147
1214C243q658L089P621p034l685J0209q16j0827M142R152m825p133M432O695q175
1229b570m029J2867j227j4061O253J1272r136o282R408K698j0067n02J1448k148
$$ y = [5727, -1924, -5259, 6344, 6046, -7337, -1118, 7746, -1474, -5423, 3680, 4843, -5643, -5032, 6354, 4946, -8185, -2284, 7845, -2778, -7223, 6984, 4900, -9433, -3145, 8507, 1799, -7426, -630, 6599, -4858, -7841, 8515, 4663, -11450, -2128, 8875, -2599, -7123, 4454, 4972, -6432, -5268, 8156, 2778, -10307, -612, 9259, -4051, -6089, 7521, 3152, -9133, -1822, 8198, 392, -6916, 254, 5993, -3568, -4477, 8301, 3845, -8199, 257, 7873, -645, -3850, 3352, 4372, -2646, -3400, 5546, 3934, -6888, -674, 6165, -1600, -3793, 3663, 2955, -4401, -3056, 4390, 3243, -5415, -2326, 5295, -1739, -5424, 4785, 3969, -6858, -2716, 6436, 1611, -5522, -1090, 5605, -2570, -6599, 6268, 5041, -9020, -2767, 8505, -631, -6913, 2495, 5193, -4874, -5376, 6072, 3924]
1243C924j2857O288J1414j1904n022J3889j094j2069L949J0544m846r024P289
1256D81O730j0699k425J3779l110j2833P351Q864r202l113Q276P45r148R47R965
1271F608l148j0439P200O480r579j415R870l120q247L713P189l854o591M520N623
1286D810p601k033R933k555q720M353O511m255m652L701M014o173k712R682l7
1301D266j1346L899R413p112m654P633J211p049p52Q891J17j0990L705R867p943
1316h44n372J0694N77r920K360Q338k538q156M551P455p685n172J2225r50j2432
1331f869N613R242p627n467P559K433q033q37R684j994j1408O078R188j0415k999
1346e852R723j128q763L199P874l933p387N031P224r130k640R966j606r176N252
$$ y = [3924, -8933, -2645, 8769, -3135, -8157, 5732, 4638, -7431, -3482, 7062, 2216, -6808, 481, 7211, -3488, -5913, 7866, 4756, -8077, -726, 8138, -1064, -4177, 4099, 4844, -4304, -3357, 6608, 3460, -6979, 221, 6701, -2878, -4293, 5577, 2457, -5790, -2077, 5112, 1258, -5333, -813, 4810, -2791, -4824, 5109, 2554, -6166, -1813, 4698, 443, -4209, -508, 3506, -2667, -5379, 4303, 4266, -7080, -3181, 6232, -880, -5534, 2099, 3310, -3739, -4491, 4400, 4517, -6473, -2768, 7099, -844, -6216, 4478, 5055, -4865, -2505, 5833, 3295, -4861, -310, 7145, -540, -5712, 6513, 5563, -6869, -1256, 7986, 359, -5108, 2451, 4884, -3149, -3986, 5698, 3704, -7704, -1626, 7562, -2853, -5852, 3871, 2743, -6020, -2821, 5053, 1120, -6267, -1236, 5988, -3142, -5782, 4184, 2578, -6598, -1346]
1361a346O964n953m410N601L455o420k249Q822j442r188N163P508p581l557O972
1376B339Q96n879j33O862r61p636K786P731o789m293R062o70p914L213O277l698
1392A193n576L979O176o483m818R989J55j0207M032P307n924m638O543L021o825
1407b076k436Q388J98r499L753Q084p894m168Q929N82p710Q41O832k104o821M392
1423g09O530o832n002R702L33q838L111O233n005m233N425L909o838l140Q943
1438C589N68r579L890P215p115l411P298P56o434jO885j019p148L918O307p095
1454a376l066Q432n58p831K761O032l564m450L977M970o089l877Q566L37q931
1469d667L515O640n824l826N727K379n479k037O639Q17q762L234P215o989l577
$$ y = [-1346, 5618, -335, -4745, 856, 4311, -2109, -4358, 4464, 3022, -6166, -1003, 6505, -1076, -4633, 2339, 3235, -2644, -2777, 4085, 3124, -4512, -1726, 6005, -784, -5077, 3985, 3315, -4599, -1386, 4891, 1193, -4383, -404, 5772, -711, -5529, 4460, 4615, -5592, -1560, 5747, -177, -4815, 1728, 4749, -2076, -4512, 3876, 4074, -5425, -1672, 6412, -1482, -5650, 3279, 3861, -3849, -3008, 3824, 1720, -5101, -709, 5821, -1011, -6013, 3689, 4022, -4816, -1705, 4528, -477, -4710, 715, 4624, -2214, -5354, 3589, 4157, -5422, -1532, 5683, -1432, -4843, 2455, 3211, -3223, -3224, 3661, 2642, -4506, -588, 5719, -1376, -4442, 3990, 3432, -4399, -1638, 4394, 830, -3620, 357, 5327, -762, -4639, 3927, 4264, -4667, -1152, 5488, -336, -4162, 1565, 3944, -1535, -3572, 3067, 3884, -4878, -1644, 5571, -1418, -4995]
1484d995P350N45o982J300N951j951o013L628N841n962m566Q679J14p643K437
1499b267O143m062m194M347M390o041k803P638M70q507L544O683n567l669O166
1514B271J548o235k30N750L36p213K839O994o588l671P451R4o977K999N159l630
1530H97m454L943M587n592l436P499p22o810K777O288n470l922N505K302n336
1545a944j960O006J92p202L590O019o176l583O767Q37o160O33N345o71n698K486
1561a519N789n215m303P832N88p110K099O076m062m062M652K830m063l210O729
1576C051M84p242K711O102n450l821O718J208n699o06N301l67n844K154O335n802
1592g67l996P701L69p042K389M912k973m267L295M686m728l511O317P76p299L371
$$ y = [-4995, 2355, 2900, -4082, -2782, 3169, 1218, -4795, -1167, 4674, -1288, -5854, 2825, 2939, -4704, -2267, 3876, -186, -4380, -33, 4357, -1684, -4487, 3151, 3621, -4886, -1342, 5341, -226, -3895, 2271, 3819, -2416, -2646, 3104, 3440, -3773, -934, 6060, -528, -4199, 3252, 3346, -3631, -632, 4527, 897, -3557, 386, 4973, -619, -4055, 3444, 2722, -4088, -1311, 4977, -493, -4415, 1090, 3392, -1944, -3904, 2102, 2294, -4908, -1318, 4701, -1475, -5058, 1709, 2546, -3614, -2981, 2364, 1693, -4005, -1519, 4270, -945, -5248, 2584, 3172, -3938, -1839, 4237, 175, -3887, 765, 3595, -468, -3678, 3051, 3535, -3707, -996, 5106, -344, -4165, 2553, 3761, -1938, -2544, 2757, 2390, -3454, -1300, 5035, -767, -4763, 2938, 3307, -3735, -1346, 3566, 593, -3674, -379, 4307, -421, -3932, 2385, 3161, -4138, -767]
1608g67N173n525k256M874J379m348j123M709J26n687K415N276n565k963O163
1623A881P26n434J017M048j216l921J873M390l752l992O149J386o228J419M586
1638B932k659l243L002L108l324l043M869J642o422J305O288m250l928N002K048
1653C327m620j105M863K56n859J624O242m548n032P094J407o432J281N056k606
1668I48m515L338M486m772m113O692J092p043K500N863n110l326N207J807m217
1683a163j699M687l74n295L099N091o220k599O442m0m710J483L449k283k861K720
1699b73L435m054l000N680O39n365K804K973l110j960K886K031k267k423L334
1714A330J158m245J102M441l250l342L854J824k803j809K707J067l608J24N294
$$ y = [-767, 4406, -1119, -3375, 1499, 2878, -1470, -2593, 2116, 2242, -3445, -1030, 4246, -1319, -4282, 1881, 2607, -2827, -1810, 2238, 1022, -2899, -1026, 3364, -388, -4380, 1769, 3155, -3073, -1654, 2932, 273, -2970, 32, 3140, -184, -3227, 1642, 3284, -3138, -1833, 4455, 205, -3723, 1279, 3327, -1293, -2398, 2465, 2721, -3138, -1514, 4728, 180, -4852, 2242, 3649, -2783, -1502, 3554, 948, -3567, -229, 4257, -515, -4628, 2064, 3156, -3887, -1387, 4476, -634, -3960, 1247, 3054, -1163, -2862, 1825, 1451, -3844, -745, 4346, -1874, -4473, 1969, 1929, -2781, -1298, 2151, -132, -2993, -273, 3162, -892, -3892, 1788, 2427, -2938, -134, 2839, -271, -2231, 655, 2686, 419, -2004, 1330, 2488, -1757, -655, 3786, 536, -2806, 1048, 2872, 69, -1740, 967, 2034, -1574, -1450, 3844]
1729C844l131m833M791K621m866l50M223j584l774J826M788l564m316M805L059
1744C539o534J197N516l930m143M576L105m586k392N138Q54o199K515N733n155
1759g66m223O552J591n711J067M079j946m081L565M047n242k833O317P61n943
1774b766K157L946l637k158M361Q53l214j123L412L79m093J455M033m381k197
1789b973M610N17l037J34J672ok824J838K559k381l116L393J481l231j99L311
1805A748j837j929J312K833j239m742L552K597m597O62M640k499l652K900L706
1820C455l871k718M111J666m651J48N844l253n065M982K306m187o06M072q63l645
1836b275J391M668l570m014N307J442n895K286L880l464k904M310K478l887k528
$$ y = [3844, 713, -4120, 671, 3292, -1574, -1924, 2299, 715, -3059, -1233, 3555, -9, -4325, 480, 3539, -2995, -1798, 3718, -212, -4355, 221, 3326, -1260, -3652, 1486, 2340, -3859, -1344, 4389, -766, -4989, 1563, 3154, -2557, -1490, 2589, 643, -3438, 127, 4174, -1068, -3901, 2416, 3177, -2766, -609, 3337, -300, -2458, 1903, 2756, -458, -1581, 1831, 2210, -1883, -428, 3605, -776, -2973, 1637, 2154, -883, -749, 923, 917, -1907, -69, 2490, 109, -3007, 386, 1867, -1364, -1563, 1748, -89, -2018, -706, 2127, 888, -3854, -302, 2295, -2302, -1640, 3000, 501, -3151, -251, 3455, -416, -3134, 977, 2643, -2008, -1860, 3984, 731, -4334, 648, 2954, -1233, -1839, 2233, 1370, -2275, -884, 3784, 214, -3800, 1507, 2949, -2946, -660, 3220, -244, -3148, 1162, 3640, -247, -2775]
1851b775M312M24m225J563M465m235l075N315M52l505P18K015j076k805K036M108
1867C712m521k239M198P61l614J264K178k385j005J413K485j939l125L165J277
1882A625l533Q77L237k792j590K292R99k003j259K930R24l646J91M379k275l632
1898c276L529K347l781m84K814K4l004L71M840k723l370L171K285m024K41L711
1914B671k022k460K635J832k750j990L244J463m720R25M866l346k935M277N46
1929B236l446N0K669j79l054O11L740l009k700M875N02m657Q56L350j878k413
1945b447J960K071k597j326L157R64m209J004L290k436j773K796R94k372p35K562
1961I03O31l409O97L835k415k498L374J053l617R17K127p85k152Q31K834j871
$$ y = [-2775, 1537, 1961, -2264, -701, 3764, -471, -3546, 1769, 2221, -1284, -566, 1449, 373, -2432, -396, 3712, -809, -3048, 1150, 1911, -1703, -439, 1739, -646, -1651, -238, 2247, 308, -2817, 348, 1625, -1908, -1031, 2206, -586, -2176, 116, 1115, -888, -2147, 783, 1707, -1939, -1748, 2631, 356, -3276, 253, 2600, -1181, -1665, 1149, 1173, -1831, -1460, 3380, 657, -2713, 458, 2743, -1281, -1040, 2671, 649, -1811, 824, 2656, -94, -2084, 1160, 2623, -2097, -1172, 3694, 348, -2587, 1690, 2236, -1210, -1160, 1509, 1330, -1724, -1113, 2627, -382, -3082, 1793, 2295, -2362, -1506, 1844, -34, -2447, -487, 1584, -1013, -2339, 818, 1782, -2427, -1423, 1867, -569, -2342, 454, 1448, -924, -1659, 903, 1534, -1875, -1178, 2657, 242, -2256, 1118, 2171, -1446, -529, 1598, 813, -1339, -508, 2326, 455]
1977D55k781L407J526m211Q00L328k105k157J736K022k273j788K822J128l949
1992b040N23M035k629k750L864J053l695L05K432j85k791Q95L313k103k920L637
2008I44R94m066O47L729j960k862K161K239k077k360L459J365l950O16L760k371
2024B68k407K593J159k165q51K174R12l404N78L659k391k643L568N99l351P33
2040i69K507p74k346R76K788j836k769L590J141m229R70L140k066j960K210J120
2056A493j866j430K633J203l732M82L778k052k878L371P94l073P2K584n2k908
2072a581P44K828j682k384K549J510m201Q08K910j293j929J360J904j729j963
2087b149K846R52l348N75L339k103k560K759J198k612l07K367N30l008K98L641
$$ y = [455, -2326, 1081, 2607, -1604, -804, 2524, 419, -1738, -2, 2020, -253, -2041, 781, 1909, -2040, -1517, 2518, -111, -2861, 1003, 2056, -1639, -1334, 1098, 913, -1878, -983, 2330, 227, -2693, 944, 1938, -2128, -1481, 2248, 288, -2574, -413, 1826, -251, -2611, 848, 2213, -1737, -1121, 2639, 268, -2139, 454, 1613, -552, -1403, 771, 1683, -1721, -1143, 2516, 125, -2518, 1050, 1649, -1702, -969, 1538, 764, -1582, -606, 2182, 346, -2423, 1167, 2308, -1921, -951, 2189, 123, -1837, 373, 1493, -373, -1803, 830, 2033, -1699, -1217, 2561, 509, -2369, 1002, 1796, -1277, -1205, 1379, 1327, -1581, -837, 1991, 309, -2075, 474, 1984, -2217, -1409, 1501, 208, -1721, -361, 1543, -186, -2149, 697, 1649, -1699, -1124, 2215, 112, -2448, 311, 1509, -1103, -1410, 957, 1487, -1521, -1223, 2418]
2103B418j936k819L361J097l524M18K795p28k120O33K245j375k522L240J163m003
2119a657Q49L059j983j811K176O05j485j441K338J091l307J48L614k049k325K655
2135D77J041k595k71K152J35k621L45K711j123k655K372J559l134L53K203m42
2151E07j862J089J573j185k050K184J699l023m91L780j646k438K064J393k255
2166f61o49K356Q09k849m3L367j572k654K653J478l391p4L040q22k283R37K055
2183A697j185k398K666J178l315L07K811j812j406J639R59j881m61K032K88k471
2199a352J27L026j544k138K438P86k839M34J930k98j641J07J791n50k322K480
2215D35R87k472J21K053j036j197R53J174o40j472J318J434k593m39L003o81k042
$$ y = [2418, 482, -2337, 1024, 2121, -1403, -985, 1810, 1082, -1038, -405, 1840, 465, -2057, 1183, 2346, -1657, -808, 2251, 268, -1543, 633, 1238, -247, -1688, 650, 1741, -1566, -1418, 2196, 147, -2178, 477, 1518, -1077, -1348, 804, 939, -1682, -1337, 1374, 251, -2404, -32, 1527, -1607, -1254, 949, 507, -1355, -266, 1307, 122, -1928, 256, 1955, -1068, -1559, 2221, 575, -1863, 201, 1594, -661, -1310, 1046, 1855, -994, -1037, 2330, 758, -1896, 757, 2235, -1156, -1230, 1810, 988, -1295, -358, 1697, 512, -1886, 780, 1958, -1357, -1050, 1761, -51, -1457, 182, 1141, -740, -1201, 831, 1119, -1352, -1225, 1801, 257, -1881, 557, 1343, -1496, -1062, 868, 570, -1071, -964, 827, 277, -2045, 435, 1422, -1050, -929, 1124, 88, -1109, -156, 1018, 378, -1094, 224, 1658, -935, -1374, 1629, 948, -1094]
2232a094J384J153j693q28J547J318k530p61L292r28k898K310J601l064j39K492
2248A162m1k236M02K050q96k311K460J721l712o67L965j153k267J833Q22j439
2264c07j192K620P02l052l34L468j664k348K654Q77k863J86K176k90j977L13J958
2281I27j266j399K364R06l528P56K437j361p60Q63M86p01m73J319P80k346m31
2298a427K644l64j569J201q6m33n12R87O51j155q65J831J77j827J177R89k035
2315f16J49J321Q9j258k52J375o0k139J369J893k466j233K926l9k174Q89J189
2332I63r45j537J729J441k493j318L640r61k594K391Q84k724l27K556J6k069M1
2349a307K436j111j949K564R64l290N32L088j534j431J637L76j286m20J585Q20
$$ y = [-1094, 290, 1443, -250, -1078, 469, 1787, -743, -1504, 1788, 860, -2038, 272, 1873, -1191, -1330, 1162, 1121, -1115, -713, 1337, 441, -1870, 590, 2311, -1401, -2068, 1897, 744, -1523, 310, 1132, -307, -1499, 1121, 1823, -1229, -1563, 1905, 241, -2107, 547, 1424, -1439, -1253, 923, 633, -1344, -1031, 927, -339, -1738, 626, 1532, -1996, -1240, 1197, -164, -924, -61, 425, -276, -749, 570, 1350, -996, -1427, 1217, 853, -716, 485, 399, -34, -546, 441, 1092, -63, -928, 903, 1080, -747, 430, 1419, -616, -467, 854, 943, -315, -567, 808, 748, -1391, -22, 1871, -595, -1828, 1098, 1059, -1115, -226, 963, 18, -1519, 210, 1651, -842, -2160, 1480, 519, -2075, 316, 1200, -1524, -1851, 705, 721, -1348, -1307, 1129, 18, -1931, 633, 1597, -1693, -1161, 1927, 393, -1038, 599, 975, -311, -731, 854, 1674]
2365A674k406R0K319q25j381J911j87j938M21J265J9j289l59J374m89j104J557
2382F52J32k154O24R54j29o11L2N52J54j049Q36R77j874m68K239n21j135O56M61
2401C28l48q36Q23J303j560j485K619m5k276J556J267k143l61J630P50j718p01
2418a197K026k23k162J952J220k762l34L054p85k013J173J018j068l82J043J234
2434A794k823p7K675r93j839K051R5j691J17J817n04j511k51K063p32j508J619
2451C02O47k194O91J858j187m92M59N78l99q66J222R56k176q7K029j115j061R70
2469A35J56m96m36O46Q55j255n62J866n25j697J453N49j770K53M32Q45q72q64
2487a287J636l1j441P49J311j474l87J925o19j131R70O18k62j184Q01J124j846
$$ y = [1674, -732, -642, 1677, 852, -529, 1382, 1195, -743, -322, 943, 962, -327, -686, 688, 199, -905, 652, 784, -1370, -746, 208, 79, -532, -500, 52, 206, -843, -7, 970, -904, -1372, 867, 346, -789, -133, 328, -20, -856, -33, 1270, -290, -1775, 844, 799, -1477, 79, 1346, -797, -1158, 472, 1222, -496, -1197, 829, 606, -1556, 396, 1616, -1146, -1480, 1574, 789, -1224, -51, 967, -101, -483, 560, 1794, -1029, -1106, 1569, 576, -1263, 788, 883, -808, -691, 1126, 622, -889, -1140, 923, 191, -1317, 302, 949, -1245, -554, 1304, 117, -375, 84, 662, 263, -603, 619, 1575, -601, -688, 1341, 226, -835, 135, 291, -205, -641, 5, 860, -395, -957, 909, 384, -1313, 140, 689, -1081, -828, -396, 449, -423, -1287, 349, 318, -1123, -374, 937, -537, -924, 1001, 382, -749, 221, 839, 577, -607, 194, 1318, -528]
2504e28k22K123o69j529J184Q26j451o14J609K14j389l96J897n42j684J426R23
2521A178k060K2J775p58r99M07J129p80r95J139R81j878l78K131r49j337J057
2538c15R73j073l77Q06N51j617l6J633k99j498J219Q23j538M51Q58n28j84l27
2556d78J075j99j327J111J323k064J88J691p53q78O97L95n38o32O12P51j225m02
2574f53J769o92j626J360Q78j343l19P49M11j051l53J419k05j731J359J241k067
2591h54j18J446l70p82K25R84m31j292J387Q70j649n98K161q62j243J568K16j108
2609d50k43P91M15j097m54J733N1j800R95J132j786K33J060k71n77j21J207l25
2627D93j314R61R43j510k57J501n48q78P01M15p16k74K90P77r79n03J983r53j318
$$ y = [-528, -750, 1373, 704, -825, 359, 1185, -266, -880, 729, 943, -446, -842, 1055, 513, -1171, 255, 1178, -882, -860, 915, 157, -842, -435, 694, -86, -1081, 58, 1039, -839, -1217, 914, -35, -1372, -315, 658, -415, -792, 14, 565, -1052, -1088, 545, 246, -1252, -33, 790, -748, -297, 561, 33, -151, -478, 597, 398, -929, 182, 1505, -559, -371, 1320, 567, -311, 386, 781, 243, -389, 223, 974, -251, -653, 1116, 424, -1202, 158, 1036, -307, -626, 123, 534, -517, -870, 549, 344, -1387, -28, 1213, -854, -972, 474, 104, -678, -453, 531, 100, -1192, 195, 1065, -584, -1182, 979, 117, -1126, 442, 658, -450, -693, 98, 513, -584, -1038, 695, 746, -1054, -59, 1073, -713, -480, 580, 309, -268, -389, 818, 493, -821, 140, 1083, -427, -684, 817, 269, -609, 92, 507, -209, -483, -193, 584, -395, -898, 1085, 132, -1186]
2646a186J154P74j124pO28J10n94l32J335k22j670J173J189k140J51J398n50q68
2664g81O72J003j691L17N37O48q74j323K647j274r90J100P48o91p48Q13N86j318
2682f19n45J922m67j544J166J067j444k42J452l67r57J64N87K30j068O94J238
2699A267j777o91J843o20q79O22J050o12r61J161K03p02m31J413m35j179P39R97
2717A008j568N44O35l97k16m81P79m70r88J293M89j162L10L83n02n22J147k2j37
2736A23n47O33p75J29j50K282j791p34Q49P1j67q33P66R28q59p65J190%j381J120
2756H9J054j201n06J174J71j325J86J163j92j185N73J031j091n06J391l89j254
2773h17R56N96q62n73P70O74j101n60J723o06j037Q81N00r48j56J034o08l88n8
$$ y = [-1186, -32, 742, -382, -389, 239, 349, -245, -577, 758, 536, -1134, 39, 1228, -912, -761, 637, 87, -781, -109, 894, -797, -480, 57, 705, -169, -1492, 1155, -119, -1109, -9, 739, 48, -700, 113, 699, -619, -1164, 758, 291, -1253, -87, 980, -464, -706, 746, 379, -578, -414, 173, 403, -665, 29, 1267, -510, -1201, 642, 22, -857, -235, 815, 203, -758, 403, 606, -96, -527, 886, 451, -728, 11, 1008, -560, -16, 619, 222, 6, -475, 304, -166, -1154, 139, 628, -534, -224, 159, -343, -865, 282, 260, 123, -424, 209, -566, -437, -587, 1695, -96, -830, 19, 90, -77, -910, -144, 784, -75, -840, 350, 350, -1031, 89, 1143, -58, -564, 610, 781, -544, -358, 805, 613, -572, 1, 1032, -59, -565, 826, 437, -817, 139, 735, -127, -700, 70, 744, -357, -917, 806, 200, -837, 44, 544, -404, -560, 474, -134, -522, -580]
2792e80J114k47j518J176P85j493L90J032p83n74O94L61k32o77L41Q55o91p92
2810h39J502k16r28N09L37k21m74J42Q15n12m92P78N8j405R13J068q96m22P13
2829D30o6n83J06P12K53j781M34J230o13q12J263j05j304O66P69m66p01L99J027
2848H58r50n50J414j33j931J112J170j221j95P61J43r18J08J400n80j458R47Q32
2866H09j246k8J169r18n46O80O09m58p49N83L76o73M6P96p29o82J146K16n26Q8
2886c7J10P8p7j52K37L67j158O26N50m68j80O16n30J32K9L59r7p39j57J270m41
2907C38q70R81j55p49lO87L99j049N1P44l18r76J324Q3j433M79R72o43m80Q30
2927B12K13q87m4J020k00j488R83J297j668n5J325n03r62N95Q82p70o95O02P72
$$ y = [-580, 534, 287, -1231, -55, 730, -763, -373, 659, -124, -698, -4, 357, 125, -552, -211, 644, -47, -839, 663, 447, -481, 28, 365, 144, -330, -188, 627, 115, -377, 401, 459, -946, -33, 1035, 139, -283, 430, 364, -219, -113, 599, 852, -929, -495, 735, 122, -690, 573, 468, -836, -170, 599, 133, -568, -169, 858, -92, -642, 772, 639, -1292, -180, 990, -231, -426, 335, 478, -440, -332, 1068, 488, -970, -23, 809, -437, -465, 704, -214, -760, -80, 529, 71, -678, -95, 281, -392, -346, 450, -279, -961, 185, 401, -125, -37, 73, 151, 74, -78, 159, 526, -632, -6, 544, 76, -104, 512, -18, 114, 143, 502, 405, -334, -491, 779, 338, -532, 449, 294, -455, -458, 229, 628, -421, -370, 374, 56, -920, 404, 487, -946, -467, 505, -138, -618, 212, 425, -462, -506, 514, 314, -1174, -191, 1106, -562, -617, 708, 205, -757, -162, 720, -50, -745, -143, 629]
2946F29j096l0J310o10j396J314O74q85J07L48pm92N5P74j19j012N25N96j016
2965c31L34L24m24P4J25J87k43l66PO65o20p4O48l48n38N28j0J35k35j19O09l95
2987f7m46Q64q1q47M10N43j79l43J09K92o09O6P19K61j688Q75Q91q86o14J126
3007C96l43m93K40O34N6j110J29R27l25o87J062R2j588Q16R83j019J74L25j7k99
3027d7KN77k1j117P09O26p77l10Q48m31j89J07L50n25j97K66M30p96J97R50o43
3048Im78P54k60m69K04K37k9p1k17N75J42j006O10O65r06J49M6O7m7j51O87l20
3070A91n64M53O24o29o03Q10j79n64K46L15J16n56J37O19m91k42Q18Q7j186M22
3090a76N97m79k50K84N56n72l83O01L12r85K56Q52p99l33O53J16p82M60M16k82
$$ y = [629, -467, -497, 813, 203, -1193, 121, 795, -90, 17, 365, 358, -134, -79, 695, 576, -436, 89, 685, -331, 3, 327, -97, -23, 102, 289, 46, -320, -313, 352, -268, -342, 306, -42, -580, -52, -62, 73, -162, -281, 328, -67, -513, 351, 270, -577, -167, 376, 197, -146, -37, 255, -354, -288, 431, 692, -996, -121, 770, -116, -730, 396, 53, -440, -200, 434, 490, -620, -491, 436, 111, -576, 486, 578, -1010, -194, 789, -230, -56, 269, 252, -47, -45, 532, 511, -606, 103, 729, -48, -358, 490, 59, -130, -23, 327, -198, -395, -129, 301, -495, -298, 652, 9, -469, 285, 25, -444, -240, -3, -32, -103, -320, 255, 397, -609, 1, 666, -240, -91, -45, 22, -25, -176, 511, 191, -373, 80, 704, 75, -528, 282, 103, -461, -215, 100, 216, -340, -203, 416, -75, -317, 501, 588, -598, -176, 421, -58, -308, -24, 532, -40, -423, 178, 490, -495, -239, 613, -186, -519, 134, 250, -532, -72, 344, 62]
3110F2n28K94O50q42J37Q02m13p95N73K96m41n7J64J69j33k11L47R1q33N34O57
3131E23p13k18N20q6k69L7L36J54o85J76N88n37j72N58l04l25O66l4m9j89r9M25
3153C03j89p55R05J93j005N72M45l37k20L48j4j63k23L63N7o67K94P69r64j13
3173d01P48pq94M40M24k50m95P1P99o12n31Q00R1r97O57J69k23k49M16K76k60
3194b8l90O02j24m98M6Q25q08P2L38k4j27r5M59K06o40R8Q18p80k06N01k85k0
3216f0J62J88J7l13K28L37l17m04N53n2q65Q08R4m30m09N70K84l73j78K93J12
3237B45o02K78M77n71k05Q30m77j07J13K02p6o4j62N40n74m62P17L20r29M86K40
3258B19l77j04M43k33o1l48P89K1o41L14N94q91nL60k81L63k76M39k33o91N56
$$ y = [62, -466, -172, 478, -364, -227, 575, 162, -633, -60, 236, -205, -262, -98, 71, -62, -273, 74, 165, -668, -134, 523, -190, -408, 112, 26, -243, -206, 130, 284, -401, -225, 363, -174, -346, 212, -92, -417, 249, 215, 166, -23, -122, 303, 114, -641, 264, 457, -548, 24, 469, 132, -88, 260, 246, 83, -140, 223, 280, -387, -93, 676, -288, -401, 347, 340, -554, -114, 310, 60, -435, -364, 435, -177, -708, 92, 183, -814, -157, 12, -211, -460, -44, 232, -28, -418, 184, 60, -438, -392, 433, -375, -303, 35, 11, -116, -211, 248, 454, -186, -88, 730, -50, -256, 245, -40, -60, 102, 290, 307, -6, 222, 559, 242, -162, 391, 339, -526, 282, 376, -54, -463, 107, 391, 18, -160, 133, 245, -357, -79, 398, -173, -378, 452, -25, -132, -19, 183, 107, 43, -119, 421, -153, -615, 102, 422, -507, -21, 219, -158, -262, 181, -52, -113, -461, 328, 349, -292, 22, 616, -275, -280, 80, -201, 162, -114, 325, 92, -599, -43]
3279d3N15p14M8N77l54k69M12k83L3q5K08J3l59M1O34k6o29L69M61o72j54M92
3301B15q0l45j03K97K08o26M51L58n06j68N03Q0o72K51J74p4J6j48N14m37l91
3322d83P63K08q00M03L34p39J3K29L87o15K0M19J27n19K09N15o44k44P45r2l73
3343a37j35M04L78n31r0P87n91o20J014j75m41K36K05j37j81K24K56n14j20M99
3363C31j60m83N64K44m72j87M93k05m12r3N25j40l78L93K93m57j47R90p22l65
3383c88M29j18j47q8J73O21n56n80R68l3n09J09K49j85m0K04KJ54n61J19L26n67
3405d18Q2N77n02k51R07m27R1q6p7L56m18R8N34l48m88Q29j74m67J20K46j88l57
3427c61L67L83m28p63P80N32j021J66Q78o91k56O13J30m76m69O38J64n51K71O40
$$ y = [-43, 472, -242, -194, 383, 29, -240, 172, -111, -78, -163, 45, 58, -301, -260, 374, 348, -281, 88, 549, -123, -277, 215, 135, -210, -313, -16, 192, -434, 17, 375, -131, -299, 204, 284, -388, -137, 37, -37, -21, -169, 345, -92, -483, 280, 488, -312, 91, 425, -314, -301, -72, 315, -300, -280, 139, 266, -253, -44, 471, -173, -417, 328, 236, -137, -272, 132, 510, -21, -111, 676, 85, -535, 479, 304, -137, 99, 304, 167, -14, 210, 466, -48, -168, 331, 171, -312, 252, 496, 24, -163, 330, 125, -287, -380, 145, 5, -373, 20, 313, -144, -291, 699, -23, -388, 41, -77, -224, -312, -139, 482, -74, -654, 314, 281, -228, -119, 130, -55, -95, 109, 111, 265, -296, -177, 149, -418, -336, 241, -261, -512, 395, -32, 59, -27, -104, 252, -166, -68, 466, 118, -370, 459, 285, -182, -62, 184, -4, -361, 6, 389, -39, -802, -22, 510, -511, -345, 533, -158, -414, 199, 329, -147, -616, 22, 186, -365, -94, 546]
3447E46r16j89R99n53k52J81M08k81k83N20J27o74n3O65l04l01R95l44n47k1N56
3468B79r0k37J3J60M2n16M58Nj66M4J89r2K1l11K4M75j16J65K06o31m45O82J42
3491C01l47K43Rm26o4L17K33j32q60Q33N62r90N03L7m59L6L28L21m8q26L45K78
3513A94m06P1N03n14l20O18J84n21j28L05Q1k31J84L40n56l93J016j82o52N33
3533A26k7l23j72M58K02k63m77O77j6m32K87L79n93l34J023m95l68N44j03j7N2
3554A28L4L31n00k13L70r5l38K97M63o61L50l6J3k2m73N48K09o49J99J4j39J38
3576c2Q7k35L70n45L52L24m27J3K21k43m27M60M22n48j03K11K42k60n1P85n32
3597H4q91J130L1p76Q2P63l45l11M76j65j62l47N35M05r37O34J82m96k40P53K21
$$ y = [546, -370, -559, 440, -113, -365, -184, 224, -57, -340, 180, 307, -367, -420, 245, -59, -360, 635, 291, -256, -277, 279, 189, -48, -35, 125, 167, -349, 109, 114, -52, -8, 181, 89, 110, -201, -177, 298, 182, 347, 553, -78, -523, 159, 301, -46, 197, 206, -220, -284, 33, 266, 134, -726, 107, 669, -321, 182, 219, -240, -204, 124, 445, 397, -429, -84, 194, -212, -141, 362, -152, -472, 146, 330, -191, -319, -14, 67, -164, 20, 360, -196, -589, 427, 245, -407, 126, 99, -224, -396, 62, 264, 1, -476, 201, 185, -247, 40, 419, -174, -508, 515, 20, -348, 196, 93, 76, 128, 162, 493, -7, -220, 150, 55, -283, 14, 477, -184, 166, 130, 143, 121, -352, 196, 405, -244, -45, -31, -170, -32, 55, -180, 190, -355, -3, 321, -106, -93, 128, -115, -542, -82, 340, -208, -311, -100, 142, -118, -169, 616, 84, -807, 323, 354, -422, -340, 423, 78, -233, 243, 78, -84, -431, 104, 509, -428, 206, 388, -108, -348, 405, 626]
3618F26j100M86l3L28n37L26K07j89m04M73J64r41O37K47m37k61J73K15k06k16
3638d42L60L20o22m8O96n95J44K92l42K95J10k28K37Rn62P54k30n06L32L37n88
3659b77L46k1J10J90o13Q03l77k91L08K60p56O90l30j56j89N49j87O7j20K2N30
3680E58p34j4M00k08m48O99j27k57nK14L3k99mN32m34k42N22K25q58O31K47o54
3702b23n8K13O3j7o08O79qk4j79R29m23l53K63n9m11K82P3k28M8j06N55n68J68
3725HL56l37o77Q53j60J9m86j09O47n81M96q4N59q14L2Q16j467P02Q4K65N44l15
3747C51K04J29j190O02j14K61l58M17p93K86L92j98J81l96j5J37Q16j206N37n67
3767e24M59Q85n99j61P3p33rL64l3O47m08k28J11M78l88mRJ53l37M24q8J39j83
$$ y = [626, -474, 12, -21, 307, -230, 96, 303, 114, -290, 183, 347, -594, 43, 290, -147, -408, -235, -20, -226, -442, -82, 238, -384, -432, 264, -331, -187, 105, -237, 58, 168, -60, 177, 186, -376, 378, 148, -358, -26, 311, -277, 69, 48, 158, 348, -265, 538, 161, -130, 178, 438, -318, 372, 42, -114, -303, 246, 59, 126, 6, 28, 558, -176, -190, 210, 2, -446, 253, 126, -131, -136, 78, 111, -188, -192, 340, -94, -336, 186, 411, -447, 184, 431, -223, -281, -68, -5, -22, -630, 49, 41, 17, -162, 767, 344, -9, 254, 195, -216, 66, 139, -89, -41, -147, 408, -160, 8, 364, 27, -650, 203, 43, 62, -424, -533, 114, -467, 29, -55, 504, -310, -278, 538, -929, -227, -143, 122, 666, 351, 555, 684, -506, 96, -18, 243, -115, 302, -491, -205, 187, -11, 170, -226, -241, -104, 712, -494, 43, -524, -65, 820, 221, 60, 133, -600, -609, -245, -278, 369, -39, -267, -156, 322, -66, -70, -61, 92, -245, 179, 91, 230, 47]
3790D7k14N76m05k23N35l13m25M96P5k1k21o9L42n58M19L84j92m35L53J48n6j93
3812E0Q9r8k14L89n61N58m56N5N21q31K93O52l9n94K35j37J75l49N94j05k21m13
3834d07O65j21o32K93M61j17l56J18O2j41j2o6K15k88J83N37n66k2J53J48k09
3855a02K30o4J45l15j9L89j32k24L64j02j97Q5L35j92J0k39K10k0j33J24P3l77
3877a51N2J66k59n1K63K62m26J75M19m46k53K73K99n77P9M99l16m0K10n3j5N1
3899A61k30P1k39J53k66L36m06K46Q6j84K21J12j35J07m07J78L24k73K18M1j81
3920f7J8J48k23k11M5L23l4L6j35M53k82m95O35k0l92L54J18k28J01q3L4j7m29
3943c51M36J64n91N21J21l85N5L37k53k42K10K30j05k49J8L82n67J55O36m59l32
$$ y = [47, -167, 409, 4, -219, 316, 3, -422, 74, 149, 128, -93, -162, 180, -378, 41, 425, 233, -202, 151, 299, 243, 50, 139, 41, -173, 216, -345, 213, -243, -188, 333, -498, -205, 447, 408, -186, 49, -88, 87, -262, 332, 227, 6, -407, 258, 137, -495, -202, 259, 142, -214, -96, -34, -175, -187, -253, -38, -326, -143, 394, -172, -194, -41, 107, -102, 128, 64, 209, -106, -125, 264, 132, -92, 272, 170, -27, 58, 393, 201, 211, -28, 182, 162, 29, 153, 226, -151, -99, 67, -192, -243, 20, 282, -144, 31, 450, 4, -249, 24, 323, -254, -175, 324, 8, -32, 178, 125, 110, 161, -69, 2, -237, -84, -350, -14, -420, -174, -88, -272, -51, 61, -74, 33, -374, -196, 128, -145, 73, 114, -67, -49, 99, -124, -335, -290, 33, -1, 35, -100, 353, 71, -424, 211, 191, -201, 153, 271, 43, 144, 61, 95, 78, -351, 85, 249, -342, 179, 300, -85, -30, 307, 54, -188, 22, 252, 147, -102, -84, 298, -269, -114, 522, 63, -269]
3964b69L58K12l30j53K0L69l67PJ14K43n22Q3K53j29K17j63j96J20K27q2K08k98
3986g8j10O2J80m72M32J6j99L31J9pj00n6j50L44j48K48m45Q9K55k94K16l69K11
4009b5L68j99l12M8M15m71J65M09l14l13L77N7k72j22L65j5l98L39n8Q1o62M87
4031e0J59l00k77N54k11j22P6L17j30l87M61M05q33J12L14o12L99P8j38J07n8
4052a36M36r2n81M80P8n12L28K96k90J7K09l7r7k07N9J06j47l3M52Rm24O2K50
4075B26j93j50j05K91pj52K66J11o92N81K31l79k73J17L47j13j04L6L68L4q54
4096d14J070o60m88M16K47q7j53M6K39k36K3J81o0l86M77l5n69K06M42l37O1r0
4118a07J74K9J27J40K34j011K88K85k16j15M37l42l27M60J58j53n04Q4M79j89
$$ y = [-269, 89, 301, -29, -182, -162, 207, -160, -153, -39, 204, -318, -235, 18, -111, 106, -57, -253, -133, 94, 12, 220, -78, -188, -126, 54, -418, 14, 30, -169, 162, 181, 174, 74, 18, -132, 212, 64, 312, -133, -44, 211, -83, 133, -236, -25, 343, 144, -168, -120, 295, -176, -11, 398, 84, -229, 148, 205, -67, -189, 176, 161, -237, 102, 44, 125, -537, -50, 109, -191, -468, 86, -125, -247, -171, 146, 16, -371, 90, 495, -338, -226, 88, -524, -125, -47, -185, -78, -136, 300, 208, -373, 107, 185, -327, 1, 297, 7, 24, 233, 196, 99, -108, -49, 57, -90, -123, 329, 338, -86, -24, 226, 33, -117, -222, 69, 62, -90, 176, 287, -405, 176, 407, 28, -245, -128, 219, 106, 2, 38, 406, 440, -414, 656, -4, -492, -76, 171, 84, -69, -23, 216, -20, 3, 184, 124, -262, 215, 180, -389, -183, 259, -78, -17, -107, 67, 96, 223, 363, 597, -414, -126, 159, -57, -172, 265, -77, -404, 56, 214, 61, -443, -359, 120, -69]
4138f9J47K71m23k95Q67k95k17j00n6l3J97L7oJ80n18M19J17o53L21L91l71q3
4160a72K21k47L07P8o22M45J91p3m0k8k46J59R1k31L3j19K88j42j36M0L01l46
4182b48L15n9K87p57K69L38o0l65L50K02n70J23K56k04m79Q50M5m14K3L83l45
4203f0M3J91R4j96l09M15K86m49J10J1j05k31M23k02ORK22J7o90J40N88m99r3
4226b79L65K6j09L86k00jm33p4L70j5p8K07j67%Q6p7L93m71j92J37K17O6j70q9
4250a02l74P80j02j65KJ93j07k3J1l32N19r36P14J61r2OK0j77m65K87K87j3l74
4273b82R6M45j32k42O5O0l51N54k05J8mm66N48R5j47k72L54k69j66R16k45n21
4295a51O10m50M80m74J8K12n89K69Q5n2R3J71J91j31k95J78k68j47J03j5k21N24
$$ y = [-69, 78, 349, -74, -369, 498, 203, -14, -114, -170, -203, -6, 31, 25, 205, -313, 106, 223, -430, -109, 282, -89, -172, 49, -198, 109, 187, -435, 10, 201, 128, 88, 60, -186, -27, 64, -167, -134, -253, 35, -107, -243, -203, 98, -248, 67, 8, 295, -462, -193, 145, 85, -280, 70, 272, -298, -175, 81, -123, -602, 248, 293, -121, -98, 285, -60, -17, 174, 268, 72, -237, 178, 464, 15, 125, 136, 31, -200, 223, 21, 27, 36, 258, 275, -415, -275, 313, -186, -279, 86, 112, 3, 389, 189, 188, -245, -319, 51, 36, -42, 165, -2, -2, 84, 7, 400, -71, -263, -126, 91, 157, -13, -102, -476, 304, 202, 37, 39, 232, 125, 102, 113, -219, 300, -636, 78, 239, 147, 153, 173, -4, -469, -182, 105, 92, -282, -186, 259, 127, -115, -50, 10, -341, 213, 8, 26, 22, -444, 104, 199, 52, -220, 134, -135, -301, 615, 370, -151, 459, 9, 489, 15, 33, 245, -344, -75, 10, -42, 51, 222, 413, 282, -13, 165, -103, -250, -147, -162, -383, 141]
4317A41J23m03J96n30M41M7L57l96M4p5l33O8M00M6K28qK7n90J86j03K9Q6NJ81
4341A67j24j24M06k70L97m98L5q6j40M09k92K11K08n36Q0J39R6K95p30M79K85
4362D07m15n54P50n6j78n5k4L6l57L86N3J04k01J82j15k01o25Q16l55L13m73P5
4384d87P49j09k72L66o59J83K34j62O11n64L15j52M8q4M59o19J31M54l64l23L92
4405A47K38p41K51m3J92Q30p46q72M93P7M64l86k35L21J09J38j64k70o3L72J07
4426B19k69K25l47J76M0K33o04QN47l49K69k02J2L1l06JJ46K47QJ88o12P20k12
4449A69k79M89p42Q03j39k80m3K85q34k3O57J59j46q6R6L5p1o18Q87p29N24M22
4471E36o91J82J28j03k06N96n90J42p8J04K64k05m52L8K21l87lO08m51M4N33j59
$$ y = [141, 264, -139, 57, -473, -32, 15, 372, -24, 20, -55, -388, -320, 80, 126, 354, 346, 373, -217, -31, -134, -105, -19, -14, 167, 43, -81, 325, 55, 452, -46, -11, -97, -237, 172, -120, 91, 299, -237, -157, -18, 78, 373, -357, 122, 407, -8, -562, 188, 132, -46, -101, -125, -89, -446, -60, -7, 97, -104, 78, -37, -238, -863, -47, -402, -89, -562, -487, 262, 153, -119, 247, -412, -229, 5, -157, 454, -110, 205, 53, 101, 17, 476, -143, -12, 442, 78, -245, 147, 385, -356, -105, -148, 44, 874, 128, -744, -251, -174, 290, -96, -331, -10, 99, 237, 73, -197, -260, 112, 219, -50, 175, -172, 4, 44, 277, -327, -319, 228, -121, 148, -54, -42, -11, -317, -316, -170, 77, 85, 273, -339, 381, 169, -110, 379, -363, 440, 301, 21, -22, 263, -571, -594, 63, 222, 76, -10, 86, 121, 50, -568, 319, -410, 114, 536, -155, 27, 155, 52, -154, 442, -148, -6, -84, 20, 284, 79, -373, -335, -114, -501, -504, 104, -347, -303, 230, 71]
4493G1M21p11L89L69k69l58J51Nl99M10j49l8M9M0j98M88l99J73L76p54L90pj58
4516a08N4M8l6j06J69J72n2o79R59m46N0j98R4m0j94L06j01M18m82l78R27j82
4538A95j72M93j027M17R54q79K01R00j08r74M47n75M21k63l46L85L6j39J58O0
4558A84m20K04J94m96k4N08l81J40L8j8O1R4l3N0m96J63N22l63K12Nj13O1q7J16
4582A21K51l96j27M7K40m34J31M7K2J3J26O2l8l46M69o3n9k28J13N14m98p6J7
4605i2l7M16j82j14J48k05J19j66J63j6j9K35k85K3Q0j65j91L03O4j60k75O67
4627C11n37LJ51K87j04p8J1J79Om36K93j92kJ04j31j38L25Jk30j70M98R0m15n
4651a79M06j66j95K69q9j10K60n8j8J26o02M83k56J98j86K14m45L18j13J51l78
$$ y = [71, 492, -219, 170, 539, 270, -88, 63, 68, -331, 79, -70, -108, -59, -19, -217, 271, -128, 45, 421, -333, 57, 50, -108, -54, -6, -42, -148, 21, 193, 141, -538, 421, -25, 25, -173, -79, -119, -313, -7, -108, 310, -172, -550, 377, 195, 23, 516, -511, -94, 860, -19, 182, 1082, 974, 0, 447, -128, 293, 30, -316, 69, 105, -34, 124, 184, -236, -32, 162, -334, -358, 150, -231, -91, -53, -71, -10, 84, 51, 101, -395, -232, 290, -73, 139, 144, 31, 92, 5, 121, 372, -24, -151, -104, 136, -298, -167, -120, -98, -85, 41, 103, 65, -281, 188, 125, 66, -162, -49, 465, -33, -109, -92, -129, 287, 105, -9, 139, -66, 53, -113, 50, 34, 15, 250, -35, -12, 68, -97, -288, 15, 79, -81, -356, 311, -226, -223, -72, 215, 111, 33, 44, 223, 229, -207, 86, -106, -108, -4, -135, -273, 52, 53, -177, -347, 151, 241, -174, -179, 227, 61, -134, 135, 46, -64, 196, 138, 120, 246, -356, 127, -129, 69, -117, 97, -348, -30, -143, 8, -370]
4672c70L83j63J69J36k31P3o1j6M7k82L80l37P9L62J9Jl9L5n94M09J4l83K26J99
4696E6j79N9J73j37L67ko03O10l80j09M35j53j11K78J2n54J36j56K87k70J19O84
4718E62l49m11j0O93o10M19n85R3J023q35K88j66n62P63k41k55J58j08j06M22
4738A83K68q94N58P54p97K78j61o68O8L1O64j105K181j377K60m7N12p37j75l57
4758e61R41k62j23m20K25O00m06K35l4M07l07q3m58J50L15j60K15N3j25k30K11
4779A83l5j47j61K2K89k74N7k09L01j43K35J05k25L00Qj91K77l97J06q9K6k14
4801a76L56j82k47K09J19l60M70n04K53j13L00k76L33m6J62k50k84K9K91j71M50
4822C63o49J65P48l94o64O26k40k56J2k75j2K52M19o19L48l24N50M10m37k08L24
$$ y = [-370, 13, -150, 19, 155, -76, -3, -64, -80, -33, -315, 65, -272, -193, 169, 188, 189, 150, 185, -409, 0, 14, -369, -143, 56, -123, -64, 109, -28, 339, 337, -266, 344, -36, -145, 290, 137, 26, 304, 316, -238, -102, -258, 29, -241, -122, 562, 213, -198, -208, 485, -125, 294, -291, -198, 825, -10, 278, 112, -450, 313, 72, -183, -25, -133, -239, 183, 451, -443, 115, 869, 72, 350, 189, -479, -411, -380, 284, -821, 1360, -17, 243, 196, 708, -29, -204, -561, 380, 118, -5, -425, -200, 400, -6, 229, 195, 602, 295, 212, -246, -96, 219, 59, 274, 327, 202, -28, 183, 148, 1, -160, -138, 151, -123, -66, -275, 26, -117, 118, 223, -2, 298, 306, 115, 392, -5, 101, 12, 38, -176, 180, -2, -249, -40, 79, -281, 189, -315, -62, -175, 125, -151, 182, 136, 298, 48, -236, -207, 84, -87, 363, -286, -121, 627, 233, -431, 195, -45, -301, -289, -564, -576, -324, 95, -524, -176, -500, 50, 460, 23, -185, 139]
4843A39l2j54Q7L00k31j38n00P62l07m3J35k44N05R2k16k39N74o20L10mJ71k62
4865H5L08l33j6j13j66J56J72k55O78j24k77J69l74P9o66P89j12l00L00L66n34
4886a68l31J208l83P5n61N18l49M21N4n6j063O44K14j29N41m66j06k70j32K22
4906a17K58k31K12n14N13K4k53M65n0p03N01o3l19M24k57j03P4J6o14Q07J15l58
4928a73L52q0q9j6J04J4l83L66k24J28j0k96M63j30J34j17j15K68q8j10J06k37
4950a33K67k28J55j49J77m04M71r2j68j71K68j82J66J65K85j93m89J38J47j21
4970i1j08K17k27J15j81N61k97l2J18L23m92K0M41j93k82pL13m45J04J6J65N5
4992I3j07k12M59m03J05M2m8j78K10m6k76L99o7J91k95O0Q4j84L05J0j81j44J78
$$ y = [139, 107, -47, 40, 340, 109, -29, -529, 233, -74, -117, 18, -226, 279, 371, 155, -84, 490, -130, 180, 176, 347, 85, 393, 60, 44, -69, -235, -79, 93, -162, 516, 392, 115, 284, -90, -11, -677, 112, 0, -300, 0, 366, -168, -499, 709, 326, 401, -160, 358, 9, 430, 484, 428, -635, 9, 223, 94, 635, 169, 63, -207, -339, -117, 141, -90, 122, -392, 121, 145, -108, 357, 307, -396, 105, 42, -277, 147, -110, -213, -139, -123, -737, 70, 185, -173, 179, 99, 10, -6, 98, 112, -271, 95, -129, -1, -11, -307, 156, 26, 160, 43, -72, 196, 108, -2, 104, -133, 134, -94, 61, -88, 89, -315, 156, 64, -104, -275, -7, -189, -23, 142, 427, 234, -255, -117, 30, -91, -199, 18, -209, -94, -275, 286, -11, -43, 75, 398, -94, -74, 367, 174, -108, -115, 198, -247, -143, -127, 38, 93, -14, -226, 233, -170, -65, -23, -71, -249, -39, -85, -361, 38, -29, 162, -133, -73, 11, -173, 132, 142, -39, -183, -5]
5015eJ66k12k02n4Q9k05K88k03K87K0j68L81m03L64j83O7q5k5J27J53k08o9J18
5038C8k16L01j05j6L8q6m2pL79k59K00k00j20M1Q3k47K88J09k34J50Q2k89Q2J25
5062I5j12k25L33l4K30l56K12J6k35L0j5j6m6K62l38M47m28K9J85N6k30J14k05
$$ y = [-5, 161, -51, -253, -307, -218, -423, -135, -338, -51, -31, -199, 182, -221, 143, -40, 27, -58, -83, 44, 197, -11, -80, 38, -178, 123, 18, 2, 40, -46, -88, -95, 284, 25, 225, 25, -95, -54, 29, -218, 70, 179, -55, 95, 177, -112, -30, 95, -17, -242, 91, 57, 287, -69, 143, 159, -76, -46, -61, -77, -123, 139, -199, 248, -180, -151, 34, 90, -140, -26, -231]
$$ [...]
8191a77
##END NTUPLES=NMR FID
##END=
