##TITLE=1H_Ser 7-4-i-3
 CDCl3,8 sc, 
 24.9.2021
##JCAMPDX= 6.0         $$ Bruker NMR JCAMP-DX V2.0
##DATA TYPE= NMR FID
##DATA CLASS= NTUPLES
##ORIGIN= UXNMR, Bruker Analytische Messtechnik GmbH
##OWNER= root
$$ XWIN-NMR		Version 3.5
$$ Fri Sep 24 12:13:08 2021 Russian Standard Time (UT+4h)  she@DPX200
##.OBSERVE FREQUENCY= 200.1314
##.OBSERVE NUCLEUS= ^1H
##.DELAY= (6, 6)
##.ACQUISITION MODE= SIMULTANEOUS
##.ACQUISITION SCHEME= undefined
##.AVERAGES= 8
##.DIGITISER RES= 18
##SPECTROMETER/DATA SYSTEM= spect
##.PULSE SEQUENCE= zg30
##.SOLVENT NAME= CDCl3
##.SHIFT REFERENCE= (INTERNAL, CDCl3, 0, 15.7039)
##AUDIT TRAIL= $$ (NUMBER, WHEN, WHO, WHERE, WHAT)
$$ ##TITLE= Audit trail, XWIN-NMR		Version 3.5
$$ ##JCAMPDX= 5.01
$$ ##ORIGIN= Bruker BioSpin GmbH
$$ ##OWNER= she
$$ F:/spectra/data/she/nmr/H-F/1/audita.txt
$$ ##AUDIT TRAIL=  $$ (NUMBER, WHEN, WHO, WHERE, WHAT)
(   1,<2021-09-24 12:10:13.17 +0400>,<she>,<DPX200>,
      <created by zg, POWCHK disabled, PULCHK disabled
       configuration hash MD5:
       00 E9 B6 7A A2 85 ED C7 34 08 36 98 17 FE 4E 26
       data hash MD5: 16K
       E9 79 36 53 9D 43 8C 8A 31 87 A4 A3 8C FA 94 6D>)
$$ ##END=
$$ 
$$ hash MD5
$$ C2 DD 4F 3C DF 41 4B 28 92 E2 23 E7 60 F1 37 99
##$RELAX= 
##$RELAX= 
##$RELAX= 
##$RELAX= 
##$RELAX= 
##$RELAX= 
$$ Bruker specific parameters
$$ --------------------------
##$DU= <F:/spectra>
##$EXPNO= 1
##$NAME= <H-F>
##$PROCNO= 1
##$TYPE= <nmr>
##$USER= <she>
##$AMP= (0..31)
100 100 100 100 100 100 100 100 100 100 100 100 100 100 100 100 100 100 
100 100 100 100 100 100 100 100 100 100 100 100 100 100 
##$AQSEQ= 0
##$AQ_mod= 1
##$AUNM= <au_zg>
##$AUTOPOS= <>
##$BF1= 200.13
##$BF2= 200.13
##$BF3= 200.13
##$BF4= 200.13
##$BF5= 200.13
##$BF6= 200.13
##$BF7= 200.13
##$BF8= 200.13
##$BYTORDA= 1
##$CFDGTYP= 0
##$CFRGTYP= 5
##$CHEMSTR= <none>
##$CNST= (0..31)
1 1 145 1 1 1 1 1 1 1 1 1 1 1 1 1 1 1 1 1 1 1 1 1 1 1 1 1 1 1 1 1 
##$CPDPRG= <>
##$CPDPRG1= <>
##$CPDPRG2= <>
##$CPDPRG3= <>
##$CPDPRG4= <mlev>
##$CPDPRG5= <mlev>
##$CPDPRG6= <mlev>
##$CPDPRG7= <mlev>
##$CPDPRG8= <mlev>
##$CPDPRGB= <>
##$CPDPRGT= <>
##$D= (0..31)
0 1.2 0 0 0 0 0 0 0 0.06 0 0.03 0 0 0 0 0.0002 0 0 0 0 0 0 0 0 0 0 0 0 
0 0 0 
##$DATE= 1632471012
##$DBL= (0..7)
120 120 120 120 120 120 120 120 
##$DBP= (0..7)
150 150 150 150 150 150 150 150 
##$DBP07= 0
##$DBPNAM0= <>
##$DBPNAM1= <>
##$DBPNAM2= <>
##$DBPNAM3= <>
##$DBPNAM4= <>
##$DBPNAM5= <>
##$DBPNAM6= <>
##$DBPNAM7= <>
##$DBPOAL= (0..7)
0.5 0.5 0.5 0.5 0.5 0.5 0.5 0.5 
##$DBPOFFS= (0..7)
0 0 0 0 0 0 0 0 
##$DE= 6
##$DECBNUC= <off>
##$DECIM= 32
##$DECNUC= <off>
##$DECSTAT= 4
##$DIGMOD= 1
##$DIGTYP= 9
##$DL= (0..7)
0 120 120 120 120 120 120 120 
##$DP= (0..7)
150 150 150 150 150 150 150 150 
##$DP07= 0
##$DPNAME0= <>
##$DPNAME1= <>
##$DPNAME2= <>
##$DPNAME3= <>
##$DPNAME4= <>
##$DPNAME5= <>
##$DPNAME6= <>
##$DPNAME7= <>
##$DPOAL= (0..7)
0.5 0.5 0.5 0.5 0.5 0.5 0.5 0.5 
##$DPOFFS= (0..7)
0 0 0 0 0 0 0 0 
##$DQDMODE= 0
##$DR= 18
##$DS= 0
##$DSLIST= <SSSSSSSSSSSSSSS>
$$ [...]
##$SUBNAM2= <"">
##$SUBNAM3= <"">
##$SUBNAM4= <"">
##$SUBNAM5= <"">
##$SUBNAM6= <"">
##$SUBNAM7= <"">
##$SUBNAM8= <"">
##$SUBNAM9= <"">
##$SW= 20.0188988654967
##$SWIBOX= (0..15)
0 0 2 0 0 0 0 0 0 0 0 0 0 0 0 0 
##$SW_h= 4006.41025641026
##$TD= 16384
##$TD0= 1
##$TE= 0
##$TE2= 300
##$TE3= 300
##$TEG= 300
##$TL= (0..7)
0 120 120 120 120 120 120 120 
##$TP= (0..7)
150 150 150 150 150 150 150 150 
##$TP07= 0
##$TPNAME0= <>
##$TPNAME1= <>
##$TPNAME2= <>
##$TPNAME3= <>
##$TPNAME4= <>
##$TPNAME5= <>
##$TPNAME6= <>
##$TPNAME7= <>
##$TPOAL= (0..7)
0.5 0.5 0.5 0.5 0.5 0.5 0.5 0.5 
##$TPOFFS= (0..7)
0 0 0 0 0 0 0 0 
##$TUNHIN= 0
##$TUNHOUT= 0
##$TUNXOUT= 0
##$USERA1= <user>
##$USERA2= <user>
##$USERA3= <user>
##$USERA4= <user>
##$USERA5= <user>
##$V9= 5
##$VALIST= <valist>
##$VCLIST= <CCCCCCCCCCCCCCC>
##$VD= 0
##$VDLIST= <DDDDDDDDDDDDDDD>
##$VPLIST= <PPPPPPPPPPPPPPP>
##$VTLIST= <TTTTTTTTTTTTTTT>
##$WBST= 1024
##$WBSW= 4
##$XGAIN= (0..3)
0 0 0 0 
##$XL= 0
##$YL= 0
##$YMAX_a= 140351
##$YMIN_a= -122115
##$ZGOPTNS= <>
##$ZL1= 120
##$ZL2= 120
##$ZL3= 120
##$ZL4= 120
##$ABSF1= 10
##$ABSF2= 0
##$ABSG= 5
##$ABSL= 3
##$ALPHA= 0
##$AQORDER= 0
##$ASSFAC= 0
##$ASSFACI= 0
##$ASSFACX= 0
##$ASSWID= 0
##$AUNMP= <proc_1d>
##$AZFE= 0.1
##$AZFW= 0.1
##$BCFW= 1
##$BC_mod= 2
##$BYTORDP= 1
##$COROFFS= 0
##$CY= 11.3945322036743
##$DATMOD= 1
##$DC= 2
##$DFILT= <>
##$DTYPP= 0
##$F1P= 2.36226072786647
##$F2P= -0.459571619588291
##$FCOR= 0.5
##$FTSIZE= 0
##$FT_mod= 4
##$GAMMA= 1
##$GB= 0.15
##$INTBC= 1
##$INTSCL= 1
##$ISEN= 128
##$LB= 0.24
##$LEV0= 0
##$LPBIN= 0
##$MAXI= 10000
##$MC2= 0
##$MEAN= 0
##$ME_mod= 0
##$MI= 1.114404
##$NCOEF= 0
##$NC_proc= 0
##$NLEV= 6
##$NOISF1= 3.799351
##$NOISF2= 2.8
##$NSP= 1
##$NTH_PI= 0
##$NZP= 0
##$OFFSET= 15.70392
##$PC= 1
##$PHC0= -13989
##$PHC1= 14.60088
##$PH_mod= 1
##$PKNL= yes
##$PPARMOD= 0
##$PSCAL= 0
##$PSIGN= 0
##$REVERSE= no
##$SF= 200.130013532006
##$SI= 16384
##$SIGF1= 3
##$SIGF2= 2
##$SINO= 400
##$SIOLD= 16384
##$SREGLST= <1H.CDCl3>
##$SSB= 0
##$STSI= 0
##$STSR= 0
##$SW_p= 3612.71676300578
##$SYMM= 0
##$S_DEV= 0
##$TDeff= 0
##$TDoff= 0
##$TI= <>
##$TILT= no
##$TM1= 0
##$TM2= 0
##$TOPLEV= 0
##$USERP1= <user>
##$USERP2= <user>
##$USERP3= <user>
##$USERP4= <user>
##$USERP5= <user>
##$WDW= 1
##$XDIM= 8192
##$YMAX_p= 0
##$YMIN_p= 0
$$ End of Bruker specific parameters
$$ ---------------------------------
##NTUPLES= NMR FID
##VAR_NAME=  TIME,          FID/REAL,        FID/IMAG
##SYMBOL=    X,             R,               I
##VAR_TYPE=  INDEPENDENT,   DEPENDENT,       DEPENDENT
##VAR_FORM=  AFFN,          ASDF,            ASDF
##VAR_DIM=   8192,          8192,            8192
##UNITS=     SECONDS,       ARBITRARY UNITS, ARBITRARY UNITS
##FACTOR=    0.0002496,     1,               1
##FIRST=     0,             0,               0
##LAST=      2.0444736,     0,               0
##MIN=       0,             -122115,         0
##MAX=       2.0444736,     140351,          0
$$ Real data points
##PAGE= N=1
##DATA TABLE= (X++(R..R)), XYDATA
$$ [...]
2338A818O90k305k572K97K655J840r32k395j526J079K831J183k091k623j34K207
$$ 1818 2508 203 -2369 -2072 583 2423 1491 -904 -2430 -1351 1480 2663 572 -2051 -2185 22
2354B2K121k13k325k001O63K807J584j652k666o01J758K313M15k159k330K46K651
$$ 22 2143 1930 -395 -2396 -1733 1074 2658 1006 -1660 -2261 -503 1810 2225 66 -2264 -2018 633
2371F33J868j107k615j124J364K446R30j884k560j31K371K101n76k505j534R76
$$ 633 2501 1394 -1221 -2345 -981 1465 2395 511 -2049 -2180 191 2292 1716 -789 -2323 -1347
2387a347K442J328j471k726n67K114K243q5k201j905M93K393J692j060k738r91
$$ -1347 1095 2423 952 -1774 -2341 -227 2016 1931 -270 -2175 -1682 711 2403 1343 -1395 -2386
2403b386J836K256M12j851k246nK278K029o53k655j382J386K258R02j397k432
$$ -2386 -550 1706 2118 267 -1979 -1984 294 2323 1670 -985 -2367 -981 1277 2179 782 -1650
2419a650o62K169K269k66k366j689P97K232J381j009k564j049J864K422R5k024
$$ -1650 -2312 -143 2126 1860 -506 -2195 -1398 834 2215 1206 -1358 -2407 -543 1879 1974 -50
2435e0j890K03K162J773o95k521j372J541K388N16j645k090l29K006K130m09k390
$$ -50 -1940 -1737 425 2198 1503 -1018 -2390 -849 1539 2055 410 -1680 -2009 -3 2127 1718 -672
2452f72j596J060K368R62j330k221p55J798K322J2k247j778N33K247J435r81k215
$$ -672 -2268 -1208 1160 2122 792 -1429 -2184 -386 1936 1948 -299 -2077 -1544 703 2138 1157 -1058
2469a058j178J396K489M58j961j992N9K003J785m39k234j529R89K477R29j645
$$ -1058 -2236 -840 1649 2107 146 -1846 -1787 216 2001 1562 -672 -2201 -1212 1265 2194 549
2485E49k088l86J694K033Q8k198j793O92K298J290j241k157p67J309K278M92k055
$$ 549 -1539 -1925 -231 1802 1890 -308 -2101 -1409 889 2179 938 -1219 -1986 -677 1601 2093 38
2502C8j971L16K105J558p58k143j213J046K323Q84j807k153j7J858J756k24k081
$$ 38 -1933 -1617 488 2046 1288 -855 -2068 -1022 1301 2185 378 -1775 -1792 66 1822 1598 -483
2519d83j580P49K250J190j379k205m72J550J935K90j853j977L75K194J486r09
$$ -483 -2063 -1314 936 2126 747 -1458 -1930 -380 1555 1845 -8 -1985 -1610 584 2070 1161
2535A161k163r94J210K055P50j602k148o2K017J662m29k025j388Q41K121J055
$$ 1161 -1002 -1996 -786 1269 2019 417 -1731 -1793 224 1886 1457 -568 -1956 -1115 1006 2061
2551B061j271k267m62J839J817o9j820j673M45K098J330r88k223p92J528J922
$$ 2061 790 -1477 -1939 -100 1717 1648 -172 -1845 -1400 698 2028 1040 -1183 -1975 -447 1475
2567A475K76j569j898kK060J605p01k080j156J104K015P41j348j984m46J870J865
$$ 1475 1751 182 -1716 -1718 342 1947 1246 -834 -1990 -886 1129 1870 522 -1462 -1908 -38 1827
2584A827l66j918j393N99K013J144j014k076p94J547K018P8j697j620J32J929
$$ 1827 1461 -457 -1850 -1251 762 1906 892 -1184 -1978 -431 1587 1665 -32 -1652 -1520 409
2600D09J522o97k144j025J211K030N28j483j769k57J730J808m09k060j266Q65
$$ 409 1931 1234 -910 -1935 -724 1306 1834 351 -1418 -1675 55 1863 1454 -606 -1872 -1007
2616a007J990Q62j199j906n48J553J887k4j895j451M76J825J276q04k041r09J295
$$ -1007 983 1845 646 -1260 -1808 -255 1632 1608 -287 -1738 -1262 563 1839 1035 -1006 -1915 -620
2633f20K012L44j674j642J13J644J527l62k024j235J013J979P38j333j859k86
$$ -620 1392 1736 62 -1580 -1467 177 1704 1342 -682 -1917 -904 1075 1813 480 -1379 -1665
2649a665J496J732Rj935j476O93J906J021r64j868p35J302J896L06j750j679L57
$$ -1665 -169 1563 1572 -363 -1839 -1146 760 1781 817 -1051 -1786 -484 1412 1718 -32 -1711 -1354
2666a354J789J252n31j909j065J079J929O04j473j790m0J623J440j91j792j354
$$ -1354 435 1687 1156 -753 -1818 -739 1190 1794 321 -1469 -1509 114 1554 1363 -429 -1783
2682a783P56J984Q27j165j821m42J403J613K14j681j615M30J921J080q08j767
$$ -1783 -1027 957 1784 619 -1202 -1644 -241 1372 1586 -95 -1710 -1280 641 1721 913 -854
2698h54q99J126J815M82j427j779L2J774J323m39j680j211P51J922Q03j202j824
$$ -854 -1753 -627 1188 1670 243 -1536 -1504 270 1593 1154 -526 -1737 -986 936 1739 537 -1287
2715a287l44J540J510m3j598j399L84J890J084r60j780o09J187J675L03j422j591
$$ -1287 -1631 -91 1419 1376 -222 -1621 -1237 653 1737 777 -1003 -1612 -425 1250 1553 131 -1460
2732a460P5J775J314o92j723q74Q71J744O34j277j689k09J554J538l40j657j099
$$ -1460 -1385 390 1704 1012 -711 -1585 -714 1030 1664 387 -1302 -1511 43 1581 1241 -416 -1515
2749a515M82J719J014j005j783n17J321J622Q0j468j387J55J613J310o62j848
$$ -1515 -1033 686 1700 695 -1088 -1605 -284 1338 1418 -50 -1437 -1282 331 1641 979 -869
2765h69p46J007J638M96j259j574j74J528J516l94j729r99P34J590Q23r91j729
$$ -869 -1615 -608 1030 1526 267 -1307 -1481 47 1563 1169 -560 -1559 -825 765 1588 597 -1132
2782a132m44J405J586p6j614j169M09J552J045o72j819o98J232J612K00j351j410
$$ -1132 -1576 -171 1415 1339 -275 -1444 -1035 517 1562 890 -929 -1627 -395 1217 1417 66 -1344
2799a344J10J472J259l88j756r25Q83J624N31j055j550k86J330J491j20j594j261
$$ -1344 -1234 238 1497 1109 -647 -1572 -689 935 1466 411 -1139 -1425 -95 1396 1276 -318 -1579
2816a579O44J623Q05p73j628o40J172J606J72j435j403K83J519J055m61j582r41
$$ -1579 -935 688 1493 720 -908 -1548 -376 1230 1402 -33 -1436 -1153 366 1421 960 -622 -1563
2833a563Q96J716M07j213j477n5J373J246j97j519j151O30J742O34j011j452l73
$$ -1563 -667 1049 1456 243 -1234 -1289 84 1330 1133 -386 -1537 -907 835 1469 458 -994 -1367
2850a367J144J436J02j456j305L84J630Q71p23j394p49Q73J618L87j358j389J09
$$ -1367 -223 1213 1315 -141 -1446 -1062 568 1439 716 -678 -1427 -554 1064 1451 93 -1296 -1187
2867a187J432J116l78j442r66O38J651O21j113j438k22J211J301o1j349j191L90
$$ -1187 245 1361 983 -459 -1425 -787 864 1485 372 -1066 -1288 -77 1224 1163 -186 -1377 -987
2884i87J586Q53q57j478m88J021J411K81j284j360J75J467J071n89j475p22P46
$$ -987 599 1452 595 -883 -1371 -350 1061 1342 58 -1302 -1127 340 1411 822 -653 -1375 -629
2901f29J463N55j106j442r8J329J218k93j396r27N33J381Q51q84j546l45J173
$$ -629 834 1389 283 -1159 -1257 72 1290 997 -399 -1326 -793 588 1439 555 -991 -1336 -163
2918a63J278M8j266j143K26J385J058o08j600n85R88J292L79j051j356j07J384
$$ -163 1115 1163 -103 -1246 -1020 365 1423 815 -785 -1370 -382 910 1289 238 -1118 -1225 159
2935A59J173l60j489p90O45J317O44q08j457m17J318J281j33j314j030L33J369
$$ 159 1332 972 -517 -1307 -662 655 1299 491 -966 -1383 -65 1216 1083 -231 -1261 -928 441
2952D41Q61n84j511n90J089J309J28j091j166K4J326J058m00j473p69Q38J364
$$ 441 1302 718 -793 -1383 -294 1015 1143 52 -1114 -1090 236 1294 894 -579 -1348 -510 854
2969H54L85r04j301k36J201J221j82j397r62N39J347O96p10j347n03J009J365
$$ 854 1239 335 -966 -1202 -1 1220 1038 -359 -1321 -782 565 1261 551 -796 -1299 -290 1075
2986A075R8j284j114K36J299R20m75j348p62P96J476L37j104j194o4J169J127
$$ 1075 1173 -111 -1225 -989 310 1230 755 -593 -1355 -559 917 1254 150 -1044 -1108 61 1188
3003A188j93j345r55N55J489N57q96j229l57R96J259Q6j284j104L60J370P46o48
$$ 1188 995 -350 -1305 -750 739 1296 400 -829 -1186 -190 1069 1155 -129 -1233 -873 497 1243 595
3021E95j240n67P63J391L13j202j205J88J190R48l47j252q31N85J394N59j013
$$ 595 -645 -1212 -449 942 1255 53 -1152 -964 226 1174 827 -425 -1256 -671 723 1282 269
3038B69j259j19J033J117n4j205j005L46J392P67p32j362l83Q71J218K64j089
$$ 269 -990 -1109 -76 1041 987 -218 -1223 -877 515 1282 550 -812 -1195 -324 894 1158 69
3055F9j223J78J255R21m46j305o46O89J255N00r44j329l3J167J003k34j174q83
$$ 69 -1154 -976 279 1200 754 -551 -1197 -508 747 1247 303 -1026 -1059 108 1111 877 -297 -1180
3073a180M98J219O76p32j345k77J023J073L3j026j064K04J260Q44n59j297n46
$$ -1180 -682 537 1213 481 -864 -1141 -118 955 988 -38 -1102 -898 362 1206 647 -650 -1196
3090a196Q43J142K59q82j155p3J227R72l41j227p57N76J214N51p14j305l17J094
$$ -1196 -353 789 1048 166 -989 -1062 165 1137 796 -431 -1188 -612 602 1153 439 -866 -1183 -89
3108h9J154j41j104q75K54J214P34n18j328n19R31J187R6r58j016N7J108R72m14
$$ -89 1065 924 -180 -1055 -801 413 1147 629 -699 -1218 -287 900 996 38 -978 -921 187 1159 745
3127G45j253o40O34J232L37q39j058k01J035J063j78j176p95M61J141N69o13j136
$$ 745 -508 -1148 -514 718 1055 216 -842 -1043 -8 1055 877 -299 -1094 -633 508 1077 464 -672
3145f72m37Q92J152N9j097r06J67J123P90m15j177n98O52J222L00r41r84o1R58
$$ -672 -1109 -217 935 994 -103 -1009 -842 281 1071 656 -521 -1119 -467 755 1055 114 -870 -931 27
3164B7R82j66j194p84N26J184N13p71j098k36Q28J088M7j094r16L02J129O52m77
$$ 27 1009 843 -351 -1135 -609 575 1088 317 -781 -1017 -189 899 946 -148 -1064 -762 367 1019 542
3183E42j129m60P01J105K83j006j031J67J000Q32k86j115o51N47J144M38q31j061
$$ 542 -587 -1047 -346 759 1042 36 -995 -828 172 1004 718 -397 -1048 -501 643 1081 250 -811
3201h11j10R17R30o4j026q57L50J146N88n81j136l46P72J005J95r25j041J82J105
$$ -811 -921 -4 926 862 -164 -1021 -671 475 1063 482 -654 -1000 -228 777 972 47 -994 -812 293
3220B93P01m03j064n94O31J076L44p88j074p6J049Q51k10j008p36M04J105N09
$$ 293 994 591 -473 -1067 -436 640 984 196 -878 -954 95 946 736 -272 -1008 -604 501 1010
3238A010o44j058l08R12R33k2q96q61J75J105O69n16j050m18O74J003K04p88r54
$$ 1010 366 -692 -1000 -88 845 823 -73 -934 -759 346 1015 499 -551 -969 -295 708 912 124 -830
3257h30kR73Q62l48j046n53M55J050M47p07j020j83Q66R41j40r40p48K66J029
$$ -830 -832 141 1003 655 -391 -944 -489 561 1008 301 -719 -902 -36 905 765 -175 -923 -657 372
3276C72O29n39j075l61P35R89R9q80q40Q8R72P86m09j017n28N95R64L40p36r37
$$ 372 1001 462 -613 -974 -239 750 849 -31 -871 -783 189 975 566 -451 -979 -384 580 920 184 -753
3296g53j05Q52Q96j90r94o34M04R76M91n83j012k50P55R56jr02p78K18R46O24
$$ -753 -858 -6 890 700 -294 -928 -524 452 943 360 -652 -902 -147 809 808 -94 -872 -654 292 916
3316I16l98r92m64O39R52K28p79q90k3R12P47j73j025n63M71R42M11o21r73j85
$$ 916 518 -474 -938 -299 653 881 102 -788 -811 101 848 675 -350 -913 -442 500 911 290 -683 -868
3336h68P76Q84mr02p69K72R61N40m07j001l86O91Q86J67q18q37J07Q88O59k22
$$ -868 -92 792 788 -114 -883 -611 350 890 483 -518 -904 -213 673 840 22 -815 -708 180 839 617
3356F17r77n71N21R33L24o70q67r7P66P80r3q43p27L44R76M06n15q68k87O65Q65
$$ 617 -360 -931 -410 523 847 177 -690 -787 -21 759 666 -177 -904 -560 416 822 307 -561 -848 -183 682
3377F82R7q00q03J59R39N69l27r23n08N88R13K39o78q41o5Q13P48j71q72o17L46
$$ 682 779 -21 -824 -665 274 843 516 -407 -915 -327 586 825 147 -694 -759 54 802 631 -241 -858 -512
3398e12R63M28n78q88k29O98Q02Np98p10J94R10N54m65q55l31N63Q38J68o99p59
$$ -512 451 879 301 -587 -816 -118 684 689 -109 -819 -625 285 839 374 -481 -812 -249 589 757 58 -701
3419g01K7Q10O69k54r12m51M09Q59L69o09q81r0P38P49r0p91o22K30Q29N55m60
$$ -701 -674 136 805 551 -361 -812 -403 456 825 216 -665 -755 -17 732 642 -149 -771 -541 288 843 383
3440C83r20k57O35Q06J01p04p89R9Q27O43l45q79m32N19P81L14n94q73l4P36P09
$$ 383 -537 -794 -159 647 748 44 -745 -646 181 824 479 -400 -832 -313 468 782 188 -685 -719 17 726
3461G26j26q36n35L23P78M38m56q95k03O60P80Mp19o90K02P99N26l25q74l71N88
$$ 726 600 -236 -771 -448 330 768 312 -583 -786 -126 654 658 -61 -751 -549 250 776 451 -423 -794 -206
3482b06P58J52o08p65OP79O50j98q43m98L58Q49L25n21p91j94O76P30j8p51o84
$$ -206 552 704 96 -669 -663 116 766 568 -275 -773 -415 434 759 238 -553 -747 -71 659 641 -110 -794
3503g94K87P99M44l47q15l68N47Q01J52p07p11Q3P38O04k34p47n21M18Q54K56
$$ -794 -507 292 736 389 -426 -794 -247 554 706 -1 -712 -629 109 713 479 -268 -789 -371 483 739
3523G39n77p06j16O43O94q0p72n77L07Q14L52m45o67k91N07P82P1p43o14J21P47
$$ 739 162 -544 -660 -17 677 597 -175 -752 -445 369 721 276 -391 -682 -175 607 678 -65 -679 -558 189
3544A89N16k84p49m07M05Q20K22o26p09k0O73O50j41p78n30L23Q02L81n04p70
$$ 189 705 421 -328 -735 -330 490 712 86 -623 -643 30 680 539 -239 -769 -446 356 737 233 -537
3564e37j42N58P25Mp09o08J93P38M95l71p51k90M64P21J75o17o68N2O73N92k20
$$ -537 -679 -121 604 608 -101 -709 -516 222 717 346 -405 -695 -231 490 665 48 -620 -568 105 697 477
3585D77p29m47L47P11L66n19p54j00O36O25m5o77n62K34O86M75l69p76k41N19
$$ 477 -252 -699 -352 359 725 206 -548 -648 -12 613 568 -109 -671 -437 249 724 355 -421 -662 -143
3605a43O29J32n55o93O0P05N46k31p47l83L76P10K47m44p62q8O67N67p0o67n40
$$ -143 486 618 63 -630 -570 135 681 450 -297 -680 -304 406 653 209 -553 -641 26 593 523 -144 -684
3626f84K73P07L78l57p62k47N52O71L9n83n84R0O68M85k56p34l39M37O86J39m81
$$ -684 -411 296 674 317 -445 -692 -140 531 570 -13 -597 -507 161 646 390 -344 -683 -246 440 579 98
3647I8o54m4O42N89j59o99m31K99O85K84m06o31k45N71O67k5n97n66J57O67M62
$$ 98 -556 -600 42 631 472 -227 -658 -359 326 610 204 -427 -672 -101 566 541 -56 -622 -465 202 664
3668F64l09o59l32M19P09J16n58n73J3N99M93q1p14m70L42P22K57m79o19j26N23
$$ 664 355 -304 -636 -217 492 608 50 -523 -510 89 582 501 -213 -683 -341 381 638 159 -460 -586 -63
3689f3O16k5o44m86K13O47L64l67o35k36M23O46J16o09n33J04O14M22k23o13l36
$$ -63 553 528 -116 -602 -389 258 622 255 -380 -616 -193 453 569 -40 -573 -469 145 567 344 -269 -605
3710f05K97P22J91m95n97l1N59M98l4o19n03K41O74L59m27o30j55M34N58J35n97
$$ -605 -308 414 605 110 -487 -518 41 539 505 -114 -617 -376 298 657 230 -400 -555 -121 437 572 -25
3731b5n66J61N90M53k75o33l29L65O42J95m65o61oN99M80j11o01l91K33O18K91
$$ -25 -591 -430 160 613 338 -295 -624 -259 383 578 113 -548 -554 45 525 414 -187 -578 -345 273 564
3752E64l53o42j46N41N29k1n29n05J30O23M11k92o55k41M22N71J03m15o12OO13
$$ 564 211 -431 -577 -36 493 472 -57 -562 -432 191 602 310 -345 -586 -164 407 510 95 -517 -511 102
3773A02M44j75o18l32K92O22K35m04o16r6N52N29r1n47m28J43O02L73l20o36k04
$$ 102 546 371 -247 -579 -287 335 570 166 -450 -546 6 535 444 -103 -531 -388 214 587 267 -369 -573
3794e73M25O08M9n04n19L4N88M55k07o44l01L37N83K05m49n20p1N00N16n9n96
$$ -573 -148 460 509 5 -514 -480 108 563 356 -288 -589 -252 331 536 87 -433 -504 -4 512 453 -143
3815a43l90K06N79L16l84n43k09M29O00L3n65m34R3N39M10k25o08k75L40O14J60
$$ -143 -533 -327 252 568 184 -359 -568 -139 461 494 -71 -505 -412 127 537 312 -296 -571 -231 383 543
3836E43m99n04l8N18M72q8n73l77K54N81K46l42n69j37M35N47M7n91m62J75N76
$$ 543 44 -460 -498 20 492 404 -169 -546 -292 289 535 193 -376 -513 -78 469 516 -75 -537 -362 214
3857B14L20k43n99k16L47N52J62m97n41O6N22M09j14n65l57K72N83K36m29n38
$$ 214 534 291 -308 -524 -177 375 537 40 -501 -435 87 496 382 -183 -540 -268 315 551 122 -416
3877d16n6M24M88n1m99m23J83N51L33k95n81j74L61N00J41m65n22Q2N36M04j76
$$ -416 -472 -48 440 389 -110 -533 -350 201 534 239 -342 -516 -155 345 486 21 -501 -419 117 521 345
3898C45n92k97L00N77K08l97n59p3N26M25p2m70m25J83N47L02k95n71j94M58M72
$$ 345 -247 -544 -244 333 541 144 -415 -488 38 463 391 -79 -504 -321 226 528 233 -338 -532 -74 398
3919C98M6m88m52R4N62L77k89n28k56L31N52J32m01n05o4N26M33j25n14l03J69
$$ 398 444 -44 -496 -402 160 537 248 -280 -536 -205 347 479 78 -427 -491 35 468 343 -171 -474 -305
3940c05N67K22k91n70j34M91M73l2m74m15R7N23L83k64n57k15L63N03P7l80m73
$$ -305 262 484 193 -377 -511 -20 453 421 -53 -468 -371 152 535 271 -286 -501 -138 365 442 62 -411
3961d11l0M92M26j27n45l19K62N40J92l46n27j05M46M77k9n38l50J65M97K96k36
$$ -411 -441 51 477 350 -195 -514 -252 288 480 134 -393 -498 -52 425 396 -142 -492 -327 170 466 230
3982B30n63j59L35N34P7m50m27M8M41L84j38n14k62K25N22K22l80n04k5L84M86
$$ 230 -333 -492 -157 377 454 4 -423 -375 66 450 312 -202 -464 -239 283 505 125 -379 -404 -20 466
4003D66n5n23l62J96N17K70l00n31j70L83M83P5m67m81J36N10L32k23m99k54K96
$$ 466 411 -112 -474 -278 239 509 209 -322 -492 -109 374 449 -18 -499 -363 147 479 256 -243 -497 -201
4024b01N37J26l76n41K4M63M02q5n09l25K01N20K36l27m62j20L82M31K8m39m33
$$ -201 336 462 86 -455 -431 32 434 349 -160 -485 -284 236 472 145 -317 -437 -55 376 404 -35 -468
4045d68J54M76L27k45m68k25K98M75R9l33n17K7M90L64j21m74l53K27N32J96l28
$$ -468 -314 162 489 244 -224 -449 -151 324 423 90 -427 -400 90 454 333 -141 -494 -267 265 461 133
4066A33m89j08M50M20k3m67l94J44N22K92k83m76j90L26M97O0m21m05M2M67L53
$$ 133 -356 -464 -14 406 383 -84 -478 -334 188 480 197 -279 -469 -143 354 414 -7 -412 -370 97 450
4087D50j59m90k73K58N05J84l82m58q5M11M61n1m78l52J69M57K87k75m75j52L45
$$ 450 291 -199 -472 -214 291 475 93 -365 -450 -39 422 371 -107 -459 -290 167 454 179 -296 -448 -103
4108a03M64L5m16l55M0M16L58j63n27k53L36M39J56l54m58m7M36M07o8m83l12
$$ -103 361 396 -20 -375 -335 81 439 276 -251 -504 -168 271 427 73 -385 -432 4 411 343 -140 -452
4129d52J94M56K62k56n03j34L62M38K2m09l82O4M74K95j58m96k34L33M25N3k81
$$ -452 -258 198 460 204 -299 -433 -71 367 389 -20 -402 -338 136 431 273 -223 -457 -124 301 354 73
4150G3m48j9M34L45j08m23k94J90M86J75k98m43r5L75L99Om39l66J37M81K48j97
$$ 73 -375 -394 40 385 277 -146 -440 -250 236 411 113 -330 -425 -50 349 355 -84 -450 -313 168 416 219
4172B19m38k41L10M59P6l27m51M8M09L60j31m19l15K69M32J75l26m37n9L71L90
$$ 219 -219 -460 -150 309 385 58 -393 -345 64 424 293 -126 -441 -172 260 435 109 -328 -387 -16 374
4193C74k2m44l19J34M62K33k61m10j81L16M60J9l67m10O6M25L27j73m11k49K33
$$ 374 352 -92 -411 -277 185 418 157 -253 -434 -118 342 361 -6 -416 -350 75 402 229 -182 -431 -198
4214a98M65J27l06m33j8L73L74r3m00k78J10M91K27k92m02j20K99L89M2l51m01
$$ -198 267 394 88 -345 -363 10 384 291 -109 -387 -277 214 441 149 -253 -373 -74 315 357 6 -395
4235c95O1M43L27j95m60j76K42M07J30k98m29k7M05L43q7m12k60J37M58K12k88
$$ -395 -334 109 436 241 -219 -395 -153 254 384 86 -343 -370 35 378 291 -121 -381 -244 214 426 138
4256A38m33j18L61M02k0m20l13J12M03L16j99m68j63K79M03Q0l20m01KM20L07
$$ 138 -295 -413 -52 350 330 -90 -403 -291 112 428 229 -239 -402 -123 280 360 40 -361 -359 61 368
4277C68p2m32k88K18M06J59k32m37o8L77L70m5m00l10J31M14K30j54m85j70L55
$$ 368 296 -136 -424 -206 200 359 127 -310 -378 -1 369 324 -76 -386 -255 159 389 235 -250 -420 -65
4298f5L57O0l34l69L6L95L15j59l88k88K67M26J18k96l86n9L51L73l9m14l03J48
$$ -65 292 352 18 -351 -315 80 395 236 -152 -440 -173 253 371 75 -311 -370 -19 354 315 -99 -402 -254
4320b54M32J92k23l99j33L26L89Nl63l46O6M03K98j27m29k30K18M66R3l49l52
$$ -254 178 370 147 -252 -385 -59 330 335 -28 -374 -308 95 393 266 -163 -393 -175 291 384 35 -317
4341c17k1L66L13n8l94k95J38M50K01k63l89q7K94L99Ml81l21N5M54K16j49m18
$$ -317 -338 28 341 283 -111 -406 -268 182 383 120 -269 -356 -62 337 341 -40 -361 -306 148 364 215 -203
4363b03j96K71M03J21l78l42j0L90L04j03l72k56J85M11J61k86m01pK94L22J2
$$ -203 -399 -128 275 396 18 -324 -334 56 360 257 -115 -371 -186 225 386 100 -301 -308 -14 308 320
4384C20l63l23P3M08K81k28m07j05K18L96R1l46l53K7L68K87j13l88k31K05L64
$$ 320 -43 -366 -293 115 396 168 -239 -344 -126 270 361 15 -338 -311 57 344 231 -157 -388 -183 181
4405A81K11k88m02o3L55L27l2l61k99J52L76K19j90m02j31K91L45L4l42l22O8
$$ 181 392 104 -298 -361 -6 321 289 -72 -371 -219 157 376 186 -216 -347 -56 289 323 -19 -341 -273
4426b73L44K97j14m21j93K53L56R3k65l71n7L65L35p1l88k56J32M02J60j97l94
$$ -273 71 368 254 -167 -360 -107 249 342 77 -294 -351 14 349 278 -110 -366 -234 168 328 131 -263
4447b63r0K80L76j3l06l29N3L85K47j38l97k18K55M26P7l01l09o1L47L27r2l54
$$ -263 -353 -73 303 290 -16 -345 -292 93 340 202 -195 -413 -158 268 345 44 -265 -326 21 348 256 -98
4469i8k54J62L76J48k06l68j17L21L61j8l39l07P4M02K23k00l49j68K25L78P8
$$ -98 -352 -190 186 334 128 -240 -357 -36 325 307 -32 -339 -265 137 360 160 -189 -357 -132 246 324
4490C24l23l06j1L33L32j05l90k07J49M04J38k38l56p0K92L51n2l30k83Q1M11
$$ 324 1 -305 -316 17 349 244 -146 -353 -204 200 338 100 -256 -326 -34 317 265 -65 -348 -267 144
4511A44K00j79l85j19K55L71N5l25l36O2L25K80j08m20j70J66M09J68l45l67k1
$$ 144 344 165 -220 -339 -84 287 342 17 -319 -257 68 348 240 -180 -350 -184 225 393 48 -319 -340
4532c40L55K93m0l59k51J15L52K30k18l82r7K78L45L0l15l39Q7L39K75j52l84
$$ -340 15 308 268 -91 -342 -227 125 355 137 -245 -342 -64 281 311 -4 -343 -256 83 358 206 -178
4553a78j56K08L52J03k70l43rL18K95r0l25k58J90L24J89k44l61p7K93L68m1l33
$$ -178 -334 -126 226 329 59 -284 -293 25 320 230 -95 -353 -163 161 350 106 -255 -332 -39 329 288 -45
4575d5k85Q4L28K59j41l94j86K67L47Q3k71l43m3L81K83q4l61k45J71M04J24k18
$$ -45 -330 -246 82 341 200 -194 -380 -113 234 317 46 -297 -340 41 324 240 -121 -366 -195 209 333 115
4597A15l41r8K79L72o6l29k87J33L58J67j35l33j59K11L84M3k84l14jL51K68j16
$$ 115 -226 -324 -45 327 261 -68 -355 -222 136 303 168 -165 -324 -113 271 314 30 -284 -285 66 334 218
4619B18l46k29J95L73R8k44k95p1K92L10m5l53k51J24L78J86k16l28j32K49L92
$$ 218 -128 -357 -162 211 309 65 -230 -301 -9 301 256 -97 -348 -224 154 340 124 -204 -336 -87 305
4640C05j8l11k92P1L19K59j01l83j84K23L29J27k75l30k7L13K90l7l48k50J29
$$ 305 287 -24 -316 -245 74 333 232 -151 -335 -112 217 344 69 -261 -288 25 315 278 -70 -320 -191
4661a91L51J96k20l58o9K51L23J5l32k81M3L64K44j67l60j48K05L51P8k43l45
$$ -191 160 356 136 -222 -291 -40 283 298 -34 -315 -272 92 336 169 -191 -339 -134 217 295 52 -293
4682b93rL47K73j02l26k22J63L43J35k11l56k2K54L29j9k78l25R5L83J89j62l84
$$ -293 -302 45 318 216 -110 -332 -169 174 309 98 -258 -280 -26 303 284 6 -319 -224 159 348 186 -198
4704a98j32K57L39K6k64l22J7L63K35j12l46k17K20L17J48k54l46n9L50K65n6
$$ -198 -330 -73 266 292 28 -294 -277 86 321 209 -137 -354 -134 183 331 77 -269 -328 22 287 231
4725B31l16k05R2L16K20j99l62j09K35L63lk91k74L0L64K15j05l33j90J68L57
$$ 231 -85 -290 -198 118 338 139 -223 -332 -97 266 263 -28 -302 -272 92 307 202 -131 -321 -153 204
4746B04J19k59l47jL01L00n7l63k35J62L58J39j91l23j45L02L60m5l34k30N2L50
$$ 204 323 64 -283 -284 17 317 260 -103 -338 -176 182 321 130 -193 -338 -36 324 279 -55 -285 -233 117
4768A17K05j52l41j49J96L53N8k70l16K1L18K63p7l29k31J51L35J64k20l10r4
$$ 117 322 170 -171 -320 -124 229 287 17 -299 -278 40 303 226 -103 -334 -183 152 316 96 -214 -308
4789c08K68L11k1l03k65J07L08K24j73l47j14K01L44N0k85l01K1L32K57r2l49
$$ -308 -40 271 250 -53 -318 -211 97 321 148 -199 -313 -112 232 282 -3 -304 -283 49 306 214 -135
4810a35k29K05L48J08k19l51j2K57L38l8l50k73J41L25J84j59l52j08K33L37K6
$$ -135 -364 -159 189 297 78 -273 -285 -28 310 272 -78 -351 -210 115 299 140 -212 -320 -87 250 276
4831B76k77l03Q9K81K64j44l36j63K03L16J00k56l33qL12K50o2k99k38J37L50
$$ 276 -1 -304 -215 66 330 186 -150 -313 -110 206 306 50 -283 -291 21 271 209 -90 -328 -191 159
4852A59J28j65l38j01K74L33m0k93k79P0L56J91j57k87j51J79L59O4k85l26N2
$$ 159 287 122 -216 -317 -43 290 250 -43 -322 -252 104 295 138 -149 -300 -121 238 302 17 -309 -257
4873b57K70K79j11k84k14J58L35J13j98l30n7K76L07m0l16k20M3L70K13j93l02
$$ -257 13 292 181 -103 -317 -159 176 289 91 -239 -296 -20 287 247 -69 -289 -246 124 337 144 -158
4894a58j24K14K86M9k45k91J4L09K48r1l49j58J64L09J02k19k98m9K67L10o1l24
$$ -158 -282 -68 218 267 22 -269 -255 54 302 211 -138 -296 -132 177 279 60 -238 -287 -20 290 229 -95
4916i5k23J12L17J97j92l26p2K17L15jk78k93R3K97K48j38l38j31J60L43J09k51
$$ -95 -318 -206 111 308 116 -210 -282 -65 250 249 -29 -322 -229 68 316 178 -160 -291 -131 212 321 70
4938G0l12oK71K78n7l20k35J67L11J47k36k86o9K52K89k4k77k32N8K92J74j11
$$ 70 -242 -248 23 301 244 -76 -311 -144 167 314 78 -208 -277 -25 264 240 -37 -269 -211 81 255 144
4960A44l09j56K26L11M4k13l22L6K71K41n9l14j99J55L24J02k08l09n1K78K62
$$ 144 -165 -321 -95 216 260 47 -275 -239 32 273 214 -100 -299 -144 180 282 74 -235 -286 -8 254
4981B54Lk98k50R7K94J81j17l15j51K34K88O1k77k80P1K49K41j02k90j78J54L04
$$ 254 257 -41 -291 -194 100 281 164 -151 -302 -68 220 281 4 -276 -205 44 285 183 -107 -285 -131 173
5003A73J13k00l39j5K53K59o2k91j90Q1L31J86j93k80j15K28K86M2k55k70N1K82
$$ 173 286 86 -253 -268 -15 244 182 -109 -299 -218 113 299 106 -174 -289 -61 225 267 12 -258 -207 75
5025G5J87r2l17j30J57L15J11k26l04k3K78K67j08k86j85J17L30J23j91l24o2
$$ 75 262 170 -147 -277 -120 195 306 80 -224 -247 31 298 190 -96 -281 -164 166 289 98 -226 -288
5046b88K47K83qk55k60N6L16K16j63l21j22K30K58Q6k61k86J8K65K77p6l07k03
$$ -288 -41 242 234 -21 -281 -225 91 307 144 -177 -299 -69 189 275 14 -272 -254 11 288 212 -95 -298
5068b98J38L57R5k13k67p6K77K71m8k95j81N3L03J80j51l07j06K05K95L7k76k42
$$ -298 -160 197 292 79 -188 -264 13 284 236 -59 -240 -187 116 296 145 -162 -268 -63 232 269 -7 -249
5090b49K0K98K27j34k83j81J71L10O9j98l07rK68K60l0l04k39J33L25J33j80k68
$$ -249 -229 69 296 162 -121 -302 -131 179 248 50 -257 -266 2 262 232 -72 -311 -178 147 280 100 -168
5112a68j32K36K75M4k71k55O7K67K00j12k80j72J94L01O4k25k54l2K62K70p0l12
$$ -168 -300 -64 211 255 -16 -271 -204 63 263 151 -129 -301 -107 194 258 33 -221 -253 9 279 209 -103
5134a03k05J19L57Q3j73k93o4K27K97k4k69k28Q7K92J67j22l08j20J89L14Nk10
$$ -103 -308 -189 168 251 78 -215 -279 -52 245 221 -48 -276 -189 103 270 148 -160 -280 -91 223 228 18
5156A8k77M3K71K10j13k67j54J48K98Q0j78k54q2K67K44m0k83j69N9L03J83j72
$$ 18 -259 -216 55 265 152 -115 -269 -121 177 257 79 -175 -257 10 254 214 -69 -238 -179 124 307 135
5178A35l11r1J91K89L6k71k28M3K60K17j02k98j46J59K70J07k19k87k2K70K71
$$ 135 -176 -267 -76 213 249 -22 -250 -207 53 270 168 -130 -276 -117 153 260 41 -246 -268 2 273
5199B73o3k83k12J10L02J30j73l15k8K37K40K2k75k38P3K90J75j10l07r9J59K92
$$ 273 210 -73 -285 -175 127 257 84 -231 -259 -22 218 240 -35 -273 -200 90 265 155 -152 -251 -92 200
5221B00Q7k50l03O4K59K01n7l22j50J30K74J33j79l01l0K40K59m3k53k29O4K92
$$ 200 287 37 -266 -202 57 258 201 -121 -271 -141 133 266 87 -214 -244 -4 255 212 -41 -270 -206 86
5243H6J65j41l05q8K25K43O5k77k57O3K55K24r6k99j45J64K73J22k14k92k6K63
$$ 86 251 110 -195 -283 -58 185 250 -27 -284 -221 34 258 162 -137 -282 -118 155 277 63 -229 -255 8
5265HJ94rk56k27J08L03J35j48k80j03K29K69rk61k01N6K30K18j06k73j48J72
$$ 8 202 193 -63 -290 -182 121 256 108 -172 -275 -46 223 214 -47 -248 -192 38 256 150 -123 -271 -99
5287i9K94O5k54k10l5K59K35l7l04j97J44K61J45j76k87o6K43K45J3k81k04P5
$$ -99 195 260 6 -204 -239 20 255 218 -86 -283 -139 122 267 91 -196 -262 -19 226 239 -42 -246 -171
5309a71K70J53j24k54j33J74K79N7k40k39MK60K14j04k45j83J22K98J22k25k39
$$ -171 99 252 128 -126 -259 -85 194 251 11 -228 -224 36 250 146 -99 -282 -160 138 260 35 -204
5330b04n1K41K25K1l10j95J12K93J33j57l03m1J86K57M0k62k26L6K52K25j01k89
$$ -204 -255 -14 211 232 -78 -273 -161 132 265 108 -195 -236 -50 207 247 -15 -241 -205 47 272 171 -118
5352a18j42J59K87O1j91k77NK30K37l9l13j69J00L07J04j50k91n5K21K20J2k11
$$ -118 -260 -101 186 247 56 -221 -216 14 251 212 -101 -270 -170 137 241 91 -200 -255 -34 186 198 -13
5374a3k51M9K97J85j41k77j41J77L12J7j93k52J0K57J94n6k91j61J49K64J25j98
$$ -13 -264 -215 82 267 126 -151 -292 -115 197 214 21 -231 -221 36 230 174 -117 -278 -129 135 260 62
5396F2k66o6K56K62o5k30k17J28K32J78j44k77j15K03K60J2k05k33KK76K13r8
$$ 62 -204 -270 -14 248 183 -47 -264 -136 96 274 130 -147 -262 -59 201 213 8 -225 -223 53 266 168
5418A68k74j34J42K62J00k08k60l1K26K26Jk96j81J12K57J36j59k61o9J87K48
$$ 168 -106 -240 -98 164 264 56 -204 -235 -9 217 218 -78 -259 -147 110 246 87 -174 -243 -56 192
5439A92J9k45j84K3K51J82j16k71j05J72K60O8j98k62J4K10K34m9k92j62J16K90
$$ 192 211 -34 -218 -195 56 238 122 -149 -254 -82 178 246 48 -214 -200 10 244 195 -97 -259 -143 147
5461A47Q8j56k61n1K18K18J0k65k05Q3K58J46j09k76p2J41K37P5k24k32J6K62
$$ 147 235 79 -182 -233 -15 203 213 -52 -257 -174 84 230 121 -155 -227 -86 151 226 2 -230 -214 48
5483D8J81o2k72j43J37K56P5j59k72k3K28K08rk42j81R8K54J18j42k73q6K15K34
$$ 48 229 167 -105 -248 -111 145 220 61 -211 -234 -6 202 193 -49 -230 -132 122 240 98 -175 -261 -46 188
5506A88J6k19k36N0K52J70j00k16j66J32K90M5j64k61j3K51J93j7k55j91Q9K99
$$ 188 204 -15 -251 -201 51 221 121 -95 -261 -129 161 206 42 -219 -232 19 212 195 -60 -251 -162 137
5528A37Q9j25k54p7K07K05K4k21k26P2K49J43q5k61j24J47K86O9k30k27m4K80
$$ 137 226 101 -153 -230 -23 182 206 -15 -241 -169 80 223 138 -123 -247 -100 186 255 25 -202 -246 34
5550C4J81o9k45j76J69K46Q7j71k46l8K21K46l1k61j77M8K78J64j54k85n8J75
$$ 34 215 146 -99 -275 -106 140 227 56 -190 -228 -7 239 208 -53 -230 -182 96 260 106 -179 -237 -62
5572f2K39N0k34k06oK78J71n4k81j30J27K82M7j79k28k3K33K00m6k34j65R7K19
$$ -62 177 227 -7 -213 -219 59 230 176 -105 -235 -108 174 221 42 -186 -209 24 224 178 -56 -221 -124 95
5595I5J61j61k56p2K00K42k1k00k20O3K45J64j07k37j49J48K65O6k22k01MK04
$$ 95 256 95 -161 -233 -33 209 188 -12 -232 -169 76 240 133 -104 -253 -105 160 226 4 -197 -193 11
5617A1J91m7k44j77J71K04J20j71k45m9K37J90J5k39k15Q5K46J54j03k79j03J73
$$ 11 202 155 -89 -266 -95 109 229 58 -187 -236 1 191 206 -33 -248 -163 83 237 134 -145 -248 -75
5639g5K56K2j69k26%K29J79m6k96j12J35K48O6j51k51j2K27K16p5k27j72O5K80
$$ -75 181 203 34 -192 -192 37 216 170 -126 -238 -103 145 211 60 -191 -203 24 240 165 -62 -234 -169 111
5662A11J04j40k49q7K12K43J2k08k07L3K32J77p0k85j23J63K51M1j97k10j6K31
$$ 111 215 75 -174 -261 -49 194 206 -2 -209 -176 56 233 163 -122 -245 -82 169 210 13 -197 -213 18
5684A8K19q0k06j82J26K44J20j87k35l7J86K05K0k40j76M8K31J50j18k41q2J33
$$ 18 237 157 -49 -231 -105 139 259 72 -163 -200 -14 191 211 -29 -205 -157 74 224 106 -135 -217 -84
5706h4K32P0k24k18QK41J90p0k32j38J12K55J01j76k46m7K03K31ok64j56P4K52
$$ -84 148 218 -6 -224 -216 25 215 145 -87 -225 -113 142 243 67 -179 -226 -23 208 202 -62 -218 -144 108
5729A08J26j40k39o5J68K26K3k27j66L8K00J87j51k14o9Q5K53R3j92k30mK13K06
$$ 108 234 94 -145 -210 -42 184 207 -20 -186 -148 52 239 88 -126 -195 -110 143 236 44 -186 -190 23 229
5752B29l0k89j40J13K24J30j61k42p4K05K29j4k00k05R9J97J65j10k41r8J23K55
$$ 229 199 -90 -230 -117 107 237 76 -166 -240 -35 194 180 -20 -225 -126 71 236 126 -115 -213 -90 165
5774A65M0j79k38J3K36J66n5k22j85J71K21J26k13k14n3K04K13k3k21j80J04K09
$$ 165 205 26 -212 -199 37 203 148 -74 -259 -88 133 259 46 -168 -221 -17 196 173 -48 -228 -124 85
5796H5J34j11k58p9J89K11J2j84j89lK31J61o9k31j27J27K55P7j78k31nJ71K17
$$ 85 219 108 -150 -229 -40 171 183 -1 -190 -193 38 199 130 -101 -228 -101 154 231 53 -178 -183 -12 205
5819B05k3k40j72Q3K48J37j61k00j00J70K54j0k15j96N8K39J71j62k35p6J32K42
$$ 205 182 -58 -230 -147 101 238 77 -123 -223 -53 201 191 -24 -220 -162 77 248 86 -149 -225 -93 149
5841A49M7j80k24J2K26J78r1j83j49P8K51R1j70j98o1K01K05qk20k06P1K59J47
$$ 149 196 16 -208 -196 30 208 117 -66 -215 -137 114 205 35 -163 -224 -23 182 174 -46 -252 -181 78 225
5864B25j14k65n6J59K09N0j93k25N9K08J41o2k40r5P4K62R7j85k20pK02J57k7
$$ 225 111 -154 -210 -51 158 208 15 -210 -151 57 198 136 -104 -199 -125 137 234 49 -171 -178 24 181 154
5887A54k25j14M6K24J11j46k38l5J96K23%k48j90O5K20J62j06k43r6J58K20N8
$$ 154 -71 -185 -139 85 196 50 -188 -223 -27 196 196 -52 -242 -177 43 205 99 -144 -240 -82 138 196
5909A96j61k39L1J85K34p9k28j29Q0J96J25j58j95o4J96J99k4j99j83O1K34J29
$$ 196 35 -204 -173 12 246 167 -61 -190 -110 86 211 53 -142 -206 -10 189 165 -34 -217 -156 78 207
5931B07j08k41n5J63J97J1j69j92j7K22J88r9j98j36J19K50O0j77j76k9J71K09
$$ 207 99 -142 -197 -34 163 174 5 -187 -204 18 206 107 -91 -227 -108 142 202 25 -151 -180 -9 200
5953B00k7k37j72J23K37J03j44k32n3J61J87K7j83j83J6K28J75j19j95j30J30
$$ 200 173 -64 -236 -113 124 227 83 -149 -202 -41 146 173 -10 -193 -177 51 226 107 -88 -218 -88
5974h8K40K8j51j99j8J95J96n4k11j37Q0K08J11j39k15n5K07J82k4k14j55Q1K21
$$ -88 152 180 29 -170 -188 7 203 149 -62 -199 -119 89 200 61 -154 -209 -2 180 156 -58 -213 -132 89
5997H9J06j04k36q3J59K23N4k16j87N2K11J65j07k02j32J36K16Q3j72k27k1J74
$$ 89 195 91 -145 -228 -69 154 208 -8 -195 -143 68 233 126 -76 -208 -72 144 227 55 -172 -193 -19
6019a9K02l9j72k12J15K17J11j28k14q7J66K02J2j73j90K1K49J57j33j94j07J26
$$ -19 183 144 -28 -240 -125 92 203 75 -139 -226 -60 142 154 -19 -209 -188 61 218 85 -109 -216 -90
6041i0K31M7j57k24RK00J81p6j79j55R4K23Q4j50k28K1J89J57Jk05j70O5K29Q3
$$ -90 141 188 31 -193 -184 16 197 121 -58 -213 -119 104 188 38 -190 -169 20 177 178 -27 -197 -132 97 180
6065A80q9k23p3J42K12K6j54k02k0K30J46p3j92j12R2K45M9j53k14l6K01J99l7
$$ 180 91 -132 -205 -63 149 175 21 -181 -201 29 175 102 -90 -202 -110 135 184 31 -183 -219 -18 181 144
6088A44k17j32O7K20J36j32k01r0J90J80Jj87j68MK36J59j16k30n6J50J78L8j73
$$ 144 -73 -205 -138 82 218 86 -115 -205 -15 165 166 -21 -189 -185 51 210 94 -136 -192 -42 136 174 1
6111Aj69m1K31J74o4k10j23J05J43J53j65j91m8J88K01k5k16j68Q8J92J44j29
$$ 1 -168 -209 22 196 132 -78 -201 -96 47 200 35 -156 -204 -16 185 160 -56 -224 -136 56 200 71
6133G1k09p3J38K35J9j96j84L7K06J49p7k04r7Q9K20Q9j85k00j6J84J88l1k05
$$ 71 -138 -211 -73 162 181 -15 -199 -162 44 193 116 -88 -185 -96 124 213 28 -172 -188 -4 184 153 -52
6156e2j43P9K10J26j31k37p0J86J79J7j70j84K0J96J54p4k10j16J18K18R0j80
$$ -52 -195 -116 94 220 89 -148 -218 -32 147 164 -6 -190 -170 26 180 106 -104 -220 -102 116 206 26
6178B6k37J9J66J84l1k02j50R5K39Q9j28k27m7J70J92lj68j73L3K50R0q3k16j04
$$ 26 -211 -192 -26 158 127 -75 -225 -130 109 198 70 -157 -204 -34 158 155 -13 -186 -153 97 187 104 -112 -216
6202b16J65J89N7j58k43K1K05J30lk19j26R8K38N0j53j98m7J99J42jj81j62Q5
$$ -216 -51 138 195 37 -206 -185 20 150 147 -72 -198 -100 138 188 35 -163 -210 -11 131 130 -51 -213 -128
6225a28K01J15j12k03q0J66J81K8k10j56M1K12J23q5k05p5Q6K45M4j85j89PK11
$$ -128 73 188 76 -127 -207 -41 140 168 -42 -198 -157 55 178 93 -112 -187 -101 144 188 3 -186 -179 32
6248C2J51m9k19j14R6K08J08j50j94m9J73J61Rk16j47O2J96J35p9k45o2J08K45
$$ 32 183 134 -85 -199 -103 105 213 63 -131 -180 -7 154 163 -53 -200 -138 58 193 114 -131 -193 -85 160
6271A60L9k06j80K7J66J76m6k14j10J02K06Q8j74k06QJ67J54J0k13j46N1K13J06
$$ 160 199 -7 -187 -160 6 182 136 -78 -188 -86 120 208 34 -172 -164 3 157 167 -46 -192 -141 72 178
6294A78j07k13o0J75J87K0j78k00N1J87J29n4k17j09J41J87O6j55j86j8J78J57
$$ 178 71 -142 -202 -27 160 180 2 -198 -147 40 169 115 -102 -211 -70 117 183 28 -158 -176 2 159
6316A59k4k03j13N1K07J04j27j91o8J91J71J2k07j46N1J91J38j01k03j04J58K05
$$ 159 135 -68 -181 -130 77 181 54 -137 -205 -14 157 169 -38 -184 -133 58 196 95 -108 -212 -54 151
6338A51N5j93j58j6K00J98j35j78j29J07K24O3j58k01j3K09J27k3j82j41O3K08
$$ 151 206 13 -145 -161 39 237 102 -76 -205 -98 126 189 31 -170 -183 26 153 130 -52 -193 -130 78
6360G8J10r9k18o7J39J98J9j86j39qK18J40j09j61j26J19K24N2j59j83k6J75K02
$$ 78 188 89 -129 -196 -57 141 160 -26 -165 -173 45 185 76 -85 -211 -92 132 184 25 -158 -184 -9 193
6383A93o8j74j27M6K20J03j48j98l0J67J79L9k27j60P2J59J52q1k22r2J37J90
$$ 193 125 -49 -176 -130 90 193 45 -153 -183 -16 163 202 -25 -185 -113 46 198 117 -105 -197 -60 130
6405A30L1j51j96L7K00J17l3k05j35J20J68J11j37k26lJ20K29k4j77j49N4K07
$$ 130 161 10 -186 -149 51 168 135 -70 -205 -85 83 194 57 -169 -172 -52 177 153 -24 -173 -119 88
6427H8R8o8k38q2J59J93O0j99j87K8K01J34q3k04q8J09J98O4j69j66m5K15J26
$$ 88 186 118 -120 -202 -43 150 210 11 -176 -148 53 187 104 -100 -188 -79 119 183 14 -152 -197 18 144
6450A44Jk12j36Q0K06R2j37k09l1J75J71J8j92j55O5J75J18r7k05o7J32J88O1
$$ 144 145 -67 -203 -123 83 175 38 -171 -202 -27 144 162 -30 -185 -120 55 173 76 -129 -196 -64 124 185
6473A85j81j91qK49J60r9j84j06P2K30L9j16j97k1J69J62rk08j23O5K14O0q3j97
$$ 185 4 -187 -195 54 214 115 -69 -175 -103 127 166 50 -147 -168 1 163 154 -54 -177 -112 102 162 79 -118
6497a18q5J39K09lj38j74NK03J58r0k14p6J04J86P6j39j71m2J97J56m0k17j05
$$ -118 -203 -64 145 142 4 -170 -165 38 196 106 -108 -184 -80 106 182 43 -128 -170 27 183 143 -74 -179
6520a79Q7J99Q3j39j85l8J88J25J6j76j51J5K31J19j17j94p7J11J93O6j40j84
$$ -179 -92 107 190 51 -134 -172 16 141 157 -19 -170 -155 76 195 78 -116 -193 -82 111 177 37 -147
6542a47k5J86J64n6j79j28O2K14J02j28k33QJ33J74j9j95r3L3J82J33j14j61r5
$$ -147 -172 14 178 122 -57 -185 -123 91 193 65 -168 -160 -27 147 128 -67 -160 -127 55 188 74 -87 -182
6565a82J30J98N4j89j79M3J92J34q6k00r9J35J70O3j42k13kJ79J57j7j72j46Q2
$$ -182 -52 146 200 11 -168 -125 67 201 115 -85 -184 -49 121 184 42 -171 -173 6 163 146 -26 -172 -90
6588i0K03O7j19j85p5J63J88k3j94j41L8K29R2p9j76q0J25J67M3j59j37j9J90
$$ -90 113 180 61 -124 -199 -36 152 129 -65 -206 -168 61 153 74 -102 -182 -57 110 153 -6 -143 -162 28
6611B8J50m9k02r6O3K13Q8j57j65m7J92J71k6j73j68N3J98J19j33j54q1J47J80
$$ 28 178 129 -73 -169 -106 107 195 38 -127 -174 18 189 163 -10 -178 -125 73 192 59 -95 -176 -29 151
6634A51J1j63j55PJ81J40p1j86j04J10J92Q6j88j45l4J62J78m5k16j04J23J43
$$ 151 162 -1 -156 -149 32 172 101 -85 -189 -79 113 199 11 -134 -168 -6 172 127 -89 -193 -70 73
6656G3J16j12k06j7J40J81k0j86j19KK15J06n4k42m2J13J93L4j69j70L4J61J61
$$ 73 189 77 -129 -146 -6 175 155 -31 -150 -148 67 173 119 -123 -165 -52 141 175 6 -164 -130 31 192
6679A92o4k06j25J18K06N5j38j95j9J55J67l8j46j62O9K22P2r3j85n3J43J85l0
$$ 192 128 -78 -203 -85 121 176 38 -157 -176 -21 146 108 -38 -200 -131 91 163 70 -115 -168 -25 160 130
6702A30j14j72J6J75J59r3j80r2J01K07L7j30k00J1J62J21oj80j35Q0J85R4j20
$$ 130 16 -156 -140 35 194 101 -79 -171 -70 137 174 44 -156 -145 17 138 132 -48 -183 -103 82 176 56
6725E6j72o0J69J66j8j64j63O9J59J27r4j83r7J46K01J7j58k03M0J67J28m4j73
$$ 56 -116 -176 -7 159 141 -23 -186 -117 42 169 75 -108 -205 -59 142 159 1 -202 -162 5 133 89 -84
6748h4j03R8K21N9j76j46m5J78J54nj90j47J05J63J02j11j84o5J28K01Mj71j71
$$ -84 -187 -89 132 191 15 -131 -176 2 156 151 -39 -186 -81 82 184 73 -111 -176 -48 153 157 -14 -185
6771a85O1J68J20o5j85j20J31J95L7j32k29M1J78J23j1j83j41R2J90J00j19j99
$$ -185 -124 44 164 99 -86 -206 -75 120 157 25 -204 -163 15 138 127 -56 -197 -105 85 185 66 -133
6793a33k0J36J71Lj70j30RJ74J33o9j92q8J25J91K4j39j75L4J77Q1j4j98q9N7
$$ -133 -153 -17 154 157 -13 -143 -134 40 173 104 -88 -176 -51 140 164 25 -150 -116 61 142 128 -70 -159 -102
6817a02K18O1j23k19J7J37J36Qj83j31N6J68J36r9j94n5J40J71J5j47j90K4J81
$$ -102 116 177 54 -165 -148 -11 125 133 -50 -181 -125 43 179 80 -114 -169 -29 142 157 10 -180 -156 25
6840B5J35n6j81j04J30J64P2j24j86k5J56J72l8j85j15J07J45Q1q7j86o6J59J76
$$ 25 160 104 -77 -181 -51 113 185 61 -125 -150 6 178 140 -45 -160 -53 92 173 86 -100 -166 -7 169
6863A69l4j51j37M4J65J20r9j87n9J16J81K4j64j51K3J27J80n9j57j34J15J81
$$ 169 135 -16 -153 -109 56 176 77 -110 -169 -53 128 152 -12 -163 -140 -13 167 108 -49 -183 -68 113
6885A13L8j11j97J2R1K21k9j64j34N9J67Q4r2j73l2J08K06pj71j57N9J57J45r3
$$ 113 151 40 -157 -145 -54 167 138 -26 -160 -101 66 150 58 -115 -147 -39 167 160 -11 -168 -109 48 193 100
6909A00k04m8Q9J82M0j29j59J0J25J68l4k21j01J04J49Q0j06j90qJ42J32J1j58
$$ 100 -104 -152 -63 119 159 30 -129 -119 6 174 140 -81 -182 -78 71 151 45 -145 -153 -11 121 132 -26
6932b6j70R0J58J23r0j98m0J01J63M0j51j86L5J69J63o9k14o7J19J56P5j54j66
$$ -26 -196 -106 52 175 85 -113 -153 -52 111 151 0 -186 -151 18 181 112 -102 -169 -50 106 181 27 -139
6955a39J2J26J71ok13j49R0J76R0r9k07l1J65J61j9j17j84M3J76J12q4j47j15
$$ -139 -127 -1 170 164 -49 -198 -108 68 158 59 -148 -179 -14 147 128 11 -173 -130 46 158 74 -73 -188
6978a88J36J80L1j49j37oJ51J41n6j50j21P5K09N5j17j84l2J58J76j8j74j27M1
$$ -188 -52 128 159 10 -127 -133 18 159 103 -47 -168 -93 116 171 54 -130 -162 -4 172 154 -20 -147 -106
7001a06J61J24j21j45p7J27J74J7j41j80j1K00J37o6j64j26R9K15M1j48j22n1
$$ -106 55 179 58 -87 -164 -37 137 154 13 -167 -178 22 159 93 -71 -197 -98 117 158 10 -112 -163
7023a63J45J45Jj88j34J19J68Q3j23j51o1J31J44J4j50j39J3K24R6p1j90r8J25
$$ -163 -18 127 128 -60 -194 -75 93 176 53 -98 -159 -28 116 130 -20 -159 -146 78 174 103 -87 -185 -60
7046f0J84P1j81j49kJ38J54mk15j25Q3J85O7j13j57l7J41J56mj77j38P8J49J12
$$ -60 124 195 14 -135 -137 1 155 151 -64 -189 -106 79 146 33 -124 -161 -20 136 132 -45 -183 -105 44 156
7070A56p6j67r0J30J69jj32j31%J78J55p7k04r2J21J82M6j31k10J3J67J46j0j98
$$ 156 80 -87 -177 -47 122 121 -11 -142 -142 36 191 114 -90 -182 -61 121 167 36 -174 -161 6 152 142 -56
7094e6j14P6J89N8r0j76l0J49J29Kj80j23N3J57J17m9j95q3R2J75M7j15j77pJ40
$$ -56 -170 -94 95 153 63 -113 -143 6 135 137 -43 -166 -113 44 161 112 -83 -166 -74 101 148 33 -144 -151 -11
7119a1J67l8j87j19R5J73P7j23j91l9J79J73k3j36j46O0J54J10j13j38r5J25J91
$$ -11 156 118 -69 -188 -93 80 157 34 -157 -196 -17 156 133 -3 -149 -89 65 175 62 -76 -171 -46 145
7142A45K1k05j01K4J68R5p4j61j05R5J79N4j05j62j9J54J50m2j48j39N0K03R0
$$ 145 166 -39 -140 -116 52 147 73 -88 -193 -98 81 135 30 -132 -151 3 153 111 -37 -176 -126 77 167
7165A67j04j89k8J24J54j7j15j45M0J64J25p8k02n3O9J96O2j78j35pJ68J55o9
$$ 167 63 -126 -154 -30 124 107 -8 -153 -113 51 176 98 -104 -157 -88 108 170 -8 -143 -150 18 173 104
7188A04j57j00J02J45P0j29j55k2J52J30j7j71j07L5J61R0p5j73l8J07J58K5j65
$$ 104 -53 -153 -51 94 164 35 -120 -142 10 140 123 -48 -155 -120 41 131 56 -117 -155 -48 110 135 -30
7211c0j29J9J74J13m2j64j02N8K22M2j25j78oJ53J43j7j47j40P1J65O5q6j81k6
$$ -30 -159 -140 34 147 105 -59 -161 -103 119 161 36 -142 -148 5 148 131 -16 -156 -85 80 145 59 -122 -148
7235a48J57J21Rj48j62O1J50J09o8j66j09J44J51L9j22j86NJ86J32m8j88j00J24
$$ -148 9 130 139 -9 -171 -110 40 149 81 -85 -194 -50 101 140 18 -168 -163 23 155 107 -81 -181 -57
7258e7J47N3r6j57k5J53J33j6j58r4J5J58R2o7j87n8J27J86oj52j23j1J74J19
$$ -57 90 143 47 -110 -135 18 151 135 -23 -117 -102 56 148 81 -106 -164 -37 149 143 -9 -132 -143 31 150
7282A50n5j56j10J10J54R0j49j70pJ42J47rj98j14N7K02N9r9j79n7J38J43M2j71
$$ 150 95 -61 -171 -61 93 183 34 -136 -143 -1 146 137 -61 -175 -118 84 143 44 -135 -192 -54 89 131 -40
7306d0j06NJ83R1n2j59p2J05J54L8j40j59mJ77J38l8j81r3R3J67N5j15j95kJ77
$$ -40 -146 -141 42 133 81 -78 -150 -45 109 147 7 -152 -156 21 159 121 -60 -153 -60 107 162 47 -148 -150 27
7331B7J31n3j54j22O7J61J04o7j93n3R6J52M8j41j74L3J68J15p0j36j07Q2J87
$$ 27 158 105 -49 -171 -104 57 161 94 -99 -152 -56 96 144 3 -171 -138 30 145 75 -61 -168 -86 101
7354A01M2j20j72j0J78J28n0j48j28J06J57Q3j15j48m9J53J38K0j90j34L6J84
$$ 101 143 23 -149 -159 19 147 97 -51 -179 -73 84 167 52 -96 -145 8 146 166 -24 -158 -122 62
7376F2J11p1j78q5J49J04O3j57j56KJ58J73m5k03q6O9J53Q3q6j92j7J18J47j1
$$ 62 173 102 -76 -161 -12 92 155 -2 -158 -156 2 175 130 -73 -159 -90 63 146 60 -132 -149 -31 116 105
7400A05j59r6L2J97Q9j08j63o3J52J30Lj06j38K6J43J21p5j81p4J24J60O5j48
$$ 105 -54 -150 -118 79 168 60 -103 -166 -14 116 119 13 -125 -99 44 165 90 -91 -165 -41 119 184 36
7423C6j68J1J00J55l6j44j16R9J31P8j09j41m5J28J23K0j60j41M2J89J30j30j54
$$ 36 -132 -121 -21 134 98 -46 -162 -63 68 146 37 -104 -149 -21 102 122 -38 -179 -137 52 182 52 -102
7446a02o0R7J43Q7j77r7k9J61J33p3j33j23J09J51N9j20j22o1J38J75j8j66j37
$$ -102 -162 -65 78 165 -12 -109 -138 23 156 83 -50 -173 -64 87 146 26 -96 -157 -19 156 138 -28 -165
7469a65L4K05Q9r5j96l7J25J63N3j83j30K0J29J05k2j76r4J05J54N4j27j43J6
$$ -165 -131 74 163 68 -128 -165 -40 123 176 -7 -137 -117 12 117 95 -81 -175 -70 84 138 11 -132 -116
7492a16J18J05j3j52j25P5J77J06r7j87m3J34J35M7j81j46N8J72R7o4j62q1J05
$$ -116 2 107 94 -58 -183 -108 69 175 78 -109 -152 -18 117 164 -17 -163 -105 67 164 100 -62 -143 -38
7515c8J74K2j63j28kJ69J30p7j31j35R0J38R7j45j13m4J44J28l7j31r0M9J42J13
$$ -38 136 158 -5 -133 -135 34 164 87 -44 -179 -89 49 146 1 -112 -156 -12 116 79 -52 -142 -93 49 162
7539A62r3j88m5J37J29L2j47j32L2J26J65r1j54q0Q2J93L3j37j44j6J33J48m6
$$ 162 69 -119 -164 -27 102 134 -13 -145 -113 13 178 87 -67 -147 -65 128 161 24 -120 -136 -3 145 99
7562I9j37r0M5J77P4j22j74k8J50J40j3j54j20P5J32Q3n9j78o0Q6J90j2q1j55
$$ 99 -38 -128 -83 94 168 46 -128 -156 -6 134 121 -33 -153 -78 54 137 78 -100 -160 -74 116 104 23 -132
7586a32j6J65J19n0j39j02Q3J77O9j24j78jJ15J48J2j71j19O5J35Q0n6j66m8J19
$$ -132 -148 17 136 86 -53 -155 -72 105 174 50 -128 -129 -14 134 146 -25 -144 -79 56 136 80 -86 -134 -15
7610a5J42L9j64j34L3J18J64r7j43j08Q4J90K2j02j71J0J29J37k8j49j04M4J68
$$ -15 127 166 2 -132 -99 19 183 86 -57 -165 -81 109 131 29 -142 -132 -3 134 106 -43 -147 -103 65
7633F5Q4q6j79m0J64J48m0j47j22N8J40J07o3j83l5R3J49M7j29j86M2J54J24n1
$$ 65 149 63 -116 -156 8 156 116 -31 -153 -95 45 152 89 -94 -129 -36 113 160 31 -155 -113 41 165 114
7657A14j76r8J05J39N2q4j75l4J24J82l7j48j42Q2J51J04p5j92m9R1J80Oj40j12
$$ 114 -62 -160 -55 84 136 52 -123 -157 -33 149 112 -36 -178 -96 55 159 84 -108 -157 -66 114 120 -20 -132
7681a32MJ91P3n6j47q9R8J94L9j36j41j6J10J58k5j78r3O2J39Q4p3j79k3Q6J84
$$ -132 -128 63 136 80 -67 -156 -58 136 175 39 -102 -118 -8 150 125 -53 -146 -84 55 139 66 -113 -136 -50 134
7706A34j1j22j53M0J73R0q9j48n6R0J73K0j54j03j1J38R7j4j49j09O4J99N0r7
$$ 134 123 1 -152 -112 61 151 62 -86 -142 -52 121 141 -13 -116 -127 11 108 94 -55 -164 -100 99 149 52
7730E2j74j3J35R6J6j51q0J9J74O9q2j46l5R1J55J7j43j40K3J43J16m1j76j05
$$ 52 -122 -135 0 96 112 -39 -119 -100 74 143 61 -85 -120 -29 126 143 0 -140 -117 26 142 101 -75 -180
7754a80J32J73K2j17j52l2J55J03J2j65j23P8J55P7j14j27m4J38R7M9j79j12L0
$$ -180 -48 125 147 30 -122 -154 1 104 116 -49 -172 -94 61 138 24 -103 -147 -9 88 137 -42 -154 -124
7777a24J82J04j07r7j32J12J77J0j05j90O0J36J24n7j59q8O0K02N3r8j67LJ05
$$ -124 58 162 55 -42 -174 -62 115 125 20 -170 -110 26 150 93 -66 -154 -94 108 161 63 -104 -101 4
7800DJ42j9j44j26O0J38J07j20j10q1J09J29L7j40j45K4J76Q7n2j65n6J03J43
$$ 4 146 127 -17 -143 -83 55 162 42 -68 -149 -40 89 126 -14 -159 -135 41 128 76 -89 -145 -42 101
7823A01J8r8j27m3J59J33j3j81r2N9J59R8j23j60RQ3J54J7j68j22L0J44R8n9j51
$$ 101 119 21 -106 -149 10 143 130 -51 -143 -84 75 173 50 -110 -101 -18 136 153 -15 -137 -107 37 135 76 -75
7848g5p5J18J22P4j48j52j1J28J78m8j53j29Q7J74L6r5j70KJ33J13Kj43j50Q6
$$ -75 -150 -32 90 164 16 -136 -147 -19 159 111 -42 -171 -84 90 126 31 -139 -137 -4 109 111 -32 -182 -96
7872i6J57Q0p6j66m2J01J69Kj29j57K1J64J19k8j83r3J03J60L2q6k14LJ56J46
$$ -96 61 141 65 -101 -143 -42 127 129 0 -157 -136 28 147 119 -64 -157 -54 106 138 52 -162 -159 -3 143
7896A43m3j42j21N6J65J03j04j65%R5J64j9j34j52M7J06J35n9j61n8P9J71L4j29
$$ 143 100 -42 -163 -107 58 161 57 -108 -108 -13 151 132 -2 -154 -107 -1 134 75 -86 -144 -65 106 140 11
7920A1j43j1J78J02m0j54q2N6J59R0j07j65m5J84J18m9r5j54L2J86J10r8j81o0
$$ 11 -132 -143 35 137 97 -57 -139 -83 76 166 59 -106 -151 33 151 102 7 -147 -115 71 181 83 -98 -158
7944a58J09J41L6j16j48MJ47J38p7j56p6N8J79N2j25j14m0J32J42j4j63j16Q1
$$ -158 -49 92 128 12 -136 -132 15 153 76 -80 -156 -98 81 133 8 -106 -146 -14 128 114 -49 -165 -84
7967h4J50Q4j03j61j3J26J32Lj39j25J3J38J50q5j75n6J12J40L0j09j73J6J27
$$ -84 66 150 47 -114 -127 -1 131 134 -5 -130 -117 21 171 86 -89 -145 -33 107 137 28 -145 -129 -2
7990bJ52m8j87m1N4J36J06j42j54n1J63J16K1j48j36L2J84R8r6j67m0J36J26M3
$$ -2 150 102 -85 -126 -72 64 170 28 -126 -177 -14 102 123 -25 -161 -129 55 153 57 -110 -150 -14 112 155
8014A55j72j16L1J27J36n5j70p6J14J18J06j70j50OJ11J50k7j53j32R8J61N7p7
$$ 155 -17 -133 -102 25 161 106 -64 -140 -26 92 198 28 -122 -116 -5 145 118 -35 -167 -69 92 149 72
8037G2j72l4J15J34j3r3j99Q4J68P0l4k01n5J10J33K7j07j70K1J71J35n7j58q7
$$ 72 -100 -134 -19 115 102 9 -190 -106 62 132 98 -103 -158 -48 85 112 5 -165 -144 27 162 105 -53 -140
8061a40Q6J39M8p4j75m0J40J49j7j51j13K3K14Q4j10j15q0Q1J82pj67o0j3J34
$$ -140 -54 85 133 59 -116 -156 -16 133 116 -35 -148 -125 89 173 63 -52 -132 -51 131 124 -43 -103 -116 18
8085A8J32n4j54j07J12J36L5j06j39lJ36J22rj64j03O4J44Q1q7j48m1J18J49R
$$ 18 150 96 -58 -165 -53 83 118 12 -127 -130 6 128 119 -45 -148 -84 60 141 54 -94 -135 -17 132 141
8109A41j70j03K8J43Q5o3j26q8R5J67M7j31j54J8J47J10l5j73j13J13J68M1j11
$$ 141 -29 -132 -104 39 124 61 -65 -153 -58 109 156 25 -129 -111 36 146 111 -62 -175 -62 106 147 36
8132C6j49m0J44J33J1j80j26P3J40J23j15j46o1J16J51L4j45j57L9J55Q4l2j71
$$ 36 -113 -153 -9 124 135 -45 -171 -98 42 165 50 -96 -157 -41 110 144 -1 -158 -119 36 120 88 -83
8155h3q1J08J21N7p5j95K1J35J32k7j39j30O5J62Q0n7k13l0J35J45J4j49j37K6
$$ -83 -164 -56 65 122 47 -148 -127 8 140 113 -26 -156 -91 71 151 94 -119 -149 -14 131 145 -4 -141 -115
8179a15J74J18r0j27j31J16J36N5j21j44J7R8
$$ -115 59 177 87 -40 -171 -55 81 136 15 -129 -112 -14
8191a4
$$ Imaginary data points
##PAGE= N=2
##DATA TABLE= (X++(I..I)), XYDATA
0@%%%%%%%%%%%%%%%Qj6J6j6J6k4L2l2M0m8N6o4P2q8J01j10J25j48J68j85K09k38
$$ 0 0 0 0 0 0 0 0 0 0 0 0 0 0 0 0 8 -8 8 -8 8 -16 16 -16 24 -24 32 -32 40 -48 53 -57 68 -80 88 -97 112 -126
37a26K66k97L33l69M10m58N06n60O20o84P54q31R16j008J111j223J349j493J649
$$ -126 140 -157 176 -193 217 -241 265 -295 325 -359 395 -436 480 -528 583 -640 709 -784 865
56H65j827K032k268K543k871L269l761M393n238O428q246J1389j8340O1279m1676
$$ 865 -962 1070 -1198 1345 -1526 1743 -2018 2375 -2863 3565 -4681 6708 -11632 49647 7971
71G971j30086N7505J02305O4276l7727r3720q0136N1981J31237M5502j10689j05643
$$ 7971 -122115 -64610 37695 101971 64244 -29476 -109612 -57631 73606 119108 8419 -97224
83i7224J4369R4368O9673q496r3086p9713L3605J17021N2572p0617j01958j7830
$$ -97224 -82855 11513 81186 72690 -20396 -100109 -66504 50517 103089 32472 -69486 -87316
95h7316P0638Q7721J2208q7164q8759K1631R9246N8720m0489q9728m4977N0924
$$ -87316 -16678 71043 83251 -3913 -92672 -71041 28205 86925 46436 -43292 -88269 -37345
107c7345R7144L1788p9885r1677J0939Q6957N8848j8634p6298o2010K8308R7521
$$ -37345 59799 91587 11702 -79975 -69036 17921 76769 58135 -18163 -80173 -51865 45656
119D5656M6663o7429r3053l776P1865N9675L26o1161p2466P918R3479N9147n1279
$$ 45656 92319 24890 -68163 -71939 -74 59601 59927 -1234 -73700 -65782 27697 86844 35565
132C5565q7800j7969N5651O3020J7901n0627p9630o575Q6800O4324l7010p8644
$$ 35565 -52235 -70204 -14553 48467 66368 15741 -63889 -70464 16336 80660 43650 -34994
144c4994l0763L6524O4865L2536m3321q1150j4716P5636O2973k1640o4291l9596
$$ -34994 -65757 -29233 35632 68168 24847 -56303 -71019 4617 67590 45950 -18341 -57937
156e7937J7458O4017M4690l5311p8216k1353N9628N9814l922n0557m9618j202
$$ -57937 -40479 23538 68228 32917 -45299 -66652 -7024 52790 48868 -1689 -51307 -52509
168e2509O1342N5734k5579p3882k8656M2961N8417J5501l8431n8467j5087N8330
$$ -52509 8833 64567 38988 -34894 -63550 -20589 37828 53329 14898 -43569 -58656 -326
180c26O3436j5706o8707l5031K7533N4984L0060k8626o4292k5455N1845O4896
$$ -326 63110 47404 -21303 -56334 -28801 26183 56243 27617 -36675 -62130 -10285 54611
192E4611n737o0048l8983J3376M8812M1251j6352o4548l3130M2858O2529N183
$$ 54611 48874 -11174 -50157 -36781 12031 53282 36930 -27618 -60748 -17890 44639 49822
204D9822m8166m2497j102M1513M9369n104o3072l9851L3122N8218J5534l5272
$$ 49822 1656 -40841 -41943 -430 48939 43835 -19237 -59088 -25966 32252 47786 12514
216A2514m5972j3909L6769N5496L993n8961m3500K3641N2218K4092k2184m8207
$$ 12514 -33458 -47367 -10598 44898 48891 -10070 -53570 -29929 22289 46381 24197 -24010
228b4010k5751L1798N7762J0239n1755m4777J2118M4206L1706q656m8050l6018
$$ -24010 -49761 -17963 39799 50038 -1717 -46494 -34376 9830 41536 32880 -15170 -51188
240e1188K5931N7911J6093m1530m4156q98L5655L8957L372m6439m3921J8970N5730
$$ -51188 -25257 32654 48747 7217 -36939 -37837 -2182 36775 40147 -6292 -50213 -31243 24487
253B4487K0898l0709m2215j2974K7721M4621J2426m2936m7517J1822N1435K5221
$$ 24487 45385 14676 -27539 -40513 -12792 31829 44255 1319 -46198 -34376 17059 42280
265D2280k0168l9404k3013K0203M8042J8859l8560m8063L679M4563K9405r917
$$ 42280 22112 -17292 -40305 -20102 27940 46799 8239 -39824 -36145 8418 37823 27906
277B7906l6708l1605J2625M9735K4230l3143m6583m511L6111L4042Q36l4201l8416
$$ 27906 -8802 -40407 -27782 21953 46183 13040 -33543 -38054 -1943 32099 32935 -1266 -39682
290c9682N784M9629K9072k6729m3760j2160K6494L7709J1500l1329m3303m39M6465
$$ -39682 -33898 15731 44803 18074 -25686 -37846 -11352 26357 37857 6528 -36775 -37214 9251
303I251L2377j8697l9418j9099J6105L9174K1214k7184m5736n988M0395L3889
$$ 9251 41628 22931 -16487 -35586 -19481 19693 40907 13723 -32013 -38001 2394 36283
315C6283r168l4246k5553O389L8825K9021k2259m6207j1026L2778L4125J034k8975
$$ 36283 27115 -7131 -32684 -26295 12530 41551 19292 -26915 -37941 -5163 28962 29996 1021
328A021l1604j597L7676L4365j6330m4681j5615K4826L3693J0940k3266l6658
$$ 1021 -30583 -32180 5496 39861 23531 -21150 -36765 -11939 21754 32694 9428 -27230
340b7230q175L5602L7321r653m1178k0606J6291L2648J9635j7298m0509j4258
$$ -27230 -35405 197 37518 27865 -13313 -33919 -17628 15020 34655 17357 -23152 -37410
352c7410L2154L7924k596l5390k5454P055L1071K6739j0991m1771j9225K7534
$$ -37410 -5256 32668 30072 -5318 -30772 -23717 7354 34093 23102 -18669 -37894 -10360
364a0360L6685M050k7768k8896k191K8724L1964n276m0519k3012K1618L4143J0108
$$ -10360 26325 30375 2607 -26289 -28480 244 32208 26932 -13587 -36599 -14981 19162 29270
377B9270j9455l0893j0830K6108L5615j9l6963k5701J4572L1418J6014j1940l2303
$$ 29270 9815 -21078 -31908 -5800 29815 29796 -7167 -32868 -18296 13122 29136 17196 -15107
390a5107j8325K2805L7652M205l2620k7683O328K8440K1990n675l2907k3931J9096
$$ -15107 -33432 -10627 27025 31230 -1390 -29073 -22745 5695 27685 22010 -10897 -34828 -15732
403a5732L8302Q462k6646k8176k023K4653K7598J94l2323k7592J4054L6346J2592
$$ -15732 22570 31032 4386 -23790 -25813 -1160 26438 26632 -5691 -33283 -19229 17117 29709
416B9709j9833k7749j0280J9539L1898N942l0321k9345Q343L2745J7188j2107
$$ 29709 9876 -17873 -28153 -8614 23284 29226 -1095 -30440 -22097 10648 27836 15729
428A5729k6709j7246J4178L4476J1127k7411l0019K265K7442K1073m855k6194
$$ 15729 -10980 -28226 -14048 20428 31555 4144 -25875 -23610 3832 24905 20050 -6144
440f144k2859R359L5028J5406k3447k9619l088K2187K4763K585k5104k6942N489
$$ -6144 -29003 -19644 15384 30790 7343 -22276 -25364 -3177 21586 24171 -933 -27875 -22386
453b2386L3984J8939j8194k8794q696J6359K7022R295k3544l0259J483L1240K1458
$$ -22386 11598 30537 12343 -16451 -25147 -8788 18234 27529 3985 -26274 -24791 6449 27907
466B7907j1819k6977j4202J0847K8549J5485k0741l2050k247K7304K2636m755
$$ 27907 16088 -10889 -25091 -14244 14305 29790 9049 -23001 -25248 2056 24692 19937
478A9937k4199j9694N129K8564J9724j7092l2102o035K2044K2648K647k0116k4252
$$ 19937 -4262 -23956 -18827 9737 29461 12369 -19733 -25768 -3724 18924 21571 1455 -22797
491b2797J49K8208K2612j2505l0007r957J6174K2752R417j6361k8326m682K7021
$$ -22797 -22648 5560 28172 15667 -14340 -24297 -8123 14629 24046 7685 -20641 -25323 1698
504A698K4023p939k7111j4667R997K3596J5337j3095l0565q388K5019K4962k721
$$ 1698 25721 17782 -9329 -23996 -13999 9597 24934 11839 -18726 -27114 -2095 22867 20146
517B0146k3191j8824L993K4340J9729j0251l0835j1956K0944K4830K276j8897
$$ 20146 -3045 -21869 -17876 6464 26193 15942 -14893 -26849 -5905 18925 21201 2304
529B304k2009k101K3487K3104o579k8891j4761J5720K4209P528j3964k3471p849
$$ 2304 -19705 -21806 1681 24785 18206 -10685 -25446 -9726 14483 22011 8047 -15424 -23273
542b3273K1175K5543k888k6352j7123R597K2511J2309r475k4515j2874J8274K7288
$$ -23273 -2098 23445 20557 -5795 -22918 -13321 9190 21499 12024 -12491 -25365 -7091 20197
555B0197Q71k3157j8321L730K0434J7458m965k5390j6438J5468K7439M327j9387
$$ 20197 21068 -2089 -20410 -16680 3754 21212 16247 -9143 -25581 -10113 17326 21653 2266
568B266j9306k498J7753K2029r49k6040j8751J2247K5988Q406j4194k0209q252
$$ 2266 -17040 -19538 -1785 20244 19295 -6745 -25496 -13249 12739 21145 6951 -13258 -21510
581b1510J5304K5686K988k5042j9957Q006K2912J2535q521k1311j3390J2480K6797
$$ -21510 -6206 19480 22468 -2574 -22531 -14525 8387 20922 12401 -8910 -22300 -9820 16977
594A6977O250k2270k0482L027J9166J6331k816k1633j6959R752K6202R294j7838
$$ 16977 23227 957 -19525 -16498 2668 18999 16183 -5450 -22409 -12657 13545 22839 5001
607E001k0725k136J5478J8987K283k0931k0095O524K4616J2144j2984k0698o977
$$ 5001 -15724 -17860 -2382 16605 18888 -2043 -22138 -15614 9002 21146 8162 -12536 -19513
620a9513J2333K0972P012j9024k2469L346K3111J4503q055j9940j1616Q807K2228
$$ -19513 -7180 13792 20804 1780 -20689 -17343 5768 20271 12216 -7724 -19340 -10533 11695
633A1695J0776j6750k4005l26K0410J5799k956j7975j6032M836K3034J3849j3895
$$ 11695 22471 5721 -18284 -18610 1800 17599 14643 -3332 -19364 -14528 8506 22355 8460
646H460k3551l670J6611J6665K421j5260j9748R23K3036J5521j0739k1527p243
$$ 8460 -15091 -18761 -2150 14515 16936 1676 -18072 -17149 5887 21408 10669 -10858 -18101
659a8101J1595J7443P468j2869k2088k348K1711J6625o985j8624j0750O562J8485
$$ -18101 -6506 10937 18405 5536 -16552 -18900 2811 19436 12451 -6173 -16923 -10361 8124
672H124J1628j1037k3025n135J9060J7259k850j6073j4237J914J9270J4961r279
$$ 8124 19752 8715 -14310 -19445 -385 16874 14024 -2049 -16286 -14372 4898 19859 10580
685A0580k2759p585J5532J7988J730j3645j6708k034J8862J7677o775k1700r804
$$ 10580 -12179 -19764 -4232 13756 15486 1841 -14867 -16901 1961 19638 12863 -8837 -18641
698a8641J1337J7894O122j1086j8363n597J7081J9365l576j9883j1594O896J6848
$$ -18641 -7304 10590 16712 5626 -12737 -18334 -1253 18112 14536 -5347 -16941 -10045 6803
711F803J0250p783j9384q659J4629K0016j82j7352j3062K322J5100J3979m480
$$ 6803 17053 9270 -10114 -18773 -4144 15872 15690 -1662 -14724 -12402 2698 16677 12197
724A2197k0223j1113J2332J9592L056j4099j4401j986J3553J7241j271k0535j2936
$$ 12197 -8026 -19139 -6807 12785 15841 1742 -12659 -14645 -1092 16149 14878 -5657 -18593
737a8593R910J8415O266j0148j5877o335J2104J9390J517j9628j4362O754J6421
$$ -18593 -8683 9732 15998 5850 -10027 -16362 -4258 15132 16649 -2979 -17341 -10587 5834
750E834R446n825j7001j0254J0639K0322M045j7041j5341K684J4329J2423j673
$$ 5834 15280 9455 -7546 -17800 -7161 13161 17206 165 -15176 -12492 1837 14260 12587
763A2587j7222j3388Q574J9974O330j3360j5637j720J2000J4685J878j6382j5548
$$ 12587 -4635 -18023 -9449 10525 16855 3495 -12142 -13862 -1862 12823 14701 -1681 -17229
776a7229O108J8794Q221r365j5280n898R523J6329M889j4822j6886L059J7215
$$ -17229 -11121 7673 15894 6529 -8751 -14649 -5126 11203 16092 1270 -15616 -12557 4658
789D658J0054n469j4523r768O786J7675P520j3144j7493j22J5182J1816j808j3548
$$ 4658 14712 9243 -5280 -15048 -8262 9413 16933 3789 -13704 -13826 1356 13172 11364 -2184
803b184j3064L957J8591R730j1212j7168l044J2255J3353K023j2279j5453J126
$$ -2184 -15248 -11291 7300 17030 5818 -11350 -14394 -2139 11214 13237 958 -14495 -13369
816a3369J8294J1506q680j5899n847Q512J4321N760j0742j6795j466J6586J2728
$$ -13369 4925 16431 7751 -8148 -13995 -5483 8838 14598 3856 -12939 -14405 2181 14909
829A4909n399j4129q573M635J4940R171r310j7368l592J4113J3426j770j2488
$$ 14909 9510 -4619 -13192 -8557 6383 15554 6244 -11124 -14716 -603 12823 11053 -1435
842a435j1048J267J5052J1850p715j7368n303J1397J3654J952j0707j3126j494
$$ -1435 -12483 -11216 3836 15686 7971 -9397 -14700 -3303 10351 12303 1596 -11530 -13024
855a3024J4601J3854n517j6847p078Q354J3519N548q662j4936m081J3416J4943
$$ -13024 1577 15431 9914 -6933 -14011 -5657 7862 13410 4748 -10188 -14269 -853 14090
868A4090k744j5485q950N032J2901Q865o149j6047o338J1818J5149J17j3209j0697
$$ 14090 11346 -4139 -13089 -8057 4844 13709 7560 -8487 -14825 -3007 12142 12259 -950 -11647
882a1647J557J2024J1510l613j6497q328R922J4551K780j0267j2041j915J1129
$$ -11647 -10090 1934 13444 9831 -6666 -14994 -5072 9479 12259 1992 -10049 -11964 -835
895h35J3442j187j5928r816P671J3718N254p231j3066n130J0212J4713P47j4708
$$ -835 12607 11420 -4508 -14324 -6653 7065 12319 5088 -7978 -13108 -2896 11817 12564 -2144
909b144j1123M863J2820P597m453j3763p971R109J5545K490j2786j1847J732J1699
$$ -2144 -13267 -8404 4416 12013 7560 -6203 -14174 -5065 10480 12970 184 -11663 -9931 1768
923A768R837j836j3741j0258P424J5572M150j0280j2066j702R945J1815O57j3093
$$ 1768 11605 9769 -3972 -14230 -6806 8766 12916 2636 -9430 -11132 -1187 10628 11285 -1808
937a808j1772N160J4797N973p344j1762m992P869J3397L017j2083j2642K590J3359
$$ -1808 -13580 -8420 6377 12350 5006 -6756 -11748 -3879 9518 12535 452 -12190 -9600 3759
951C759P783m469j1489p866N712J4539M990j0948j2870K04J1563R603j565j1207
$$ 3759 11542 7073 -4416 -12282 -6570 7969 12959 2011 -10859 -10655 908 10511 8946 -2261
965b261j0050L836J4943O892r516j2751k090R303J0987J309j0796j1693J951J4362
$$ -2261 -12311 -8475 6468 13360 3844 -8907 -10997 -1694 9293 10602 -194 -11887 -9936 4426
979D426Q445p247j2336m367O839J1973M276r857j2883J51J2944R587m374j1517
$$ 4426 12871 5624 -6712 -11079 -4240 7733 12009 2152 -10731 -10580 2364 11951 7577 -3940
993c940o719M153J2277O842q473j3524j734J0941J0178j150j0304q935J849J2263
$$ -3940 -10659 -6506 5771 12613 4140 -9384 -11118 -177 10001 8851 -1453 -10388 -8539 3724
1007C724Q821o705j3579l353Q822J0437J935q997j0907j79J1988J0055m801j3079
$$ 3724 12545 5840 -7739 -11092 -2270 8167 10102 1105 -9802 -9981 2007 12062 7261 -5818
1021e818n244O636J0640M555p435j2451j995J1401J0799k652j1944p145M362J0746
$$ -5818 -11062 -4426 6214 10769 3334 -9117 -11112 289 11088 8436 -3508 -10653 -6291 4455
1035D455O810n845j3231l905J0234J1085l64j0314q779J663J0556Q687l931j3076
$$ 4455 11265 5420 -7811 -11716 -1482 9603 9239 -1075 -9854 -8191 2365 11052 7121 -5955
1049e955n762Q491J1162J826q132r944j114R939J0181k104j2441p254O221J0904
$$ -5955 -11717 -3226 7936 9762 1630 -8314 -9428 511 10692 8588 -3853 -11107 -4886 6018
1063F018L920o061j0689l795R141J1310n60j1310q213L671J0370O088m041j1226
$$ 6018 9938 3877 -6812 -10607 -1466 9844 9284 -2026 -10239 -6568 3802 9890 5849 -5377
1077e377n927Q058J2060Q55r917q847R63R538Q251k318j1507p433O611J2176K584
$$ -5377 -11304 -3246 8814 9669 -248 -9095 -8132 1406 9657 7339 -4168 -11601 -4990 7186 9770
1092I770q107r300j616Q418J0163n27j1230q369M635J1454M601o010r648m020
$$ 9770 1663 -7637 -9253 -835 9328 8801 -2429 -10798 -6163 5291 9892 3882 -5766 -9786
1106i786P020J1181J302j0343r005K361J0205O540l661r852n887N391J1551L201
$$ -9786 -2766 8415 9717 -626 -9631 -7270 2935 9475 5814 -4038 -9925 -4534 7017 10218
1120A0218q975r487K22Q745Q068j313r812p550L899J1424M895p516r867j603P346
$$ 10218 1243 -8244 -8022 723 8791 7478 -2334 -9884 -5985 5439 10334 2818 -7049 -8652 -1306
1135a306R029R47r434r011K548J1103O154n665r901l433N749R731L093q713j0134
$$ -1306 7723 8670 -764 -9775 -7227 3876 10030 4365 -5536 -8969 -3220 6511 9604 891 -9243
1150i243J170J0220O955l374r352n529M056J0244M913p496j0646l95Q859P534
$$ -9243 -8073 2147 9102 5728 -3624 -9153 -5097 5147 10060 2564 -8082 -8477 382 7916
1164G916p91q395p603K341J0374O197n962j0436k251P066Q087J638p430r156P46
$$ 7916 7125 -1270 -8873 -6532 3842 10039 4077 -6359 -8610 -1544 6543 8181 751 -8405 -7659
1179g659J0172O930m171r674m182N185Q789L523o524j0041p84R516P625k393q868
$$ -7659 2513 9443 5272 -4402 -8584 -3399 5390 8913 2389 -7652 -8436 1080 8705 6312 -2556
1194b556n944L311R312N094n515j0338k398Q375Q300n68p919p272J394R366O527
$$ -2556 -8500 -5189 4123 9217 3702 -6636 -9034 -659 7641 7073 -846 -8118 -6724 2642 9169
1209I169m253j0211l885O863Q769J238o769q089o29Q793P876k835r781n038M974
$$ 9169 4916 -5295 -9180 -2317 6452 7690 921 -7168 -7797 996 8872 6037 -3744 -8782 -3808
1224c808Q718L118n348q666k533P894Q838j381q964n836K841Q283N099l905r281
$$ -3808 4910 8028 2680 -5986 -8519 -625 8213 6832 -2132 -7968 -5127 3156 8255 4350 -4931
1239d931l947O889R301J03p926o534P10P706O973k523r755n032N799R194J723
$$ -4931 -8878 -1989 7312 7415 -511 -7045 -6335 1371 8344 5821 -3934 -8966 -3167 6027 7750
1254G750o496p416j211P103Q400j224r736n810M351Q623L576m874q256k914O414
$$ 7750 1254 -6162 -7373 -270 8130 6906 -2830 -8640 -4289 4334 7910 3036 -5220 -8134 -1720
1269a720R076K21q912o592K498P858N269k994q711m494N379R211J778p512p306
$$ -1720 7356 7577 -1335 -7927 -5429 2429 7698 4704 -4007 -8501 -3122 6089 7867 355 -6951
1284f951O07P018O514j133q634n911M218R077L190n957p842j188O142P419N17
$$ -6951 -6344 674 7188 6055 -2579 -8490 -4272 4805 7995 2038 -5804 -6992 -850 6569 7086
1299G086q152p088K947Q807M234m375p916k990N175Q154J908p523p953J618Q308
$$ 7086 -1066 -8154 -5207 3600 7834 3459 -4457 -7447 -2272 5882 7790 267 -7686 -6068 2240
1314B240N090k669p651m831L994Q844L142o645q319J31P324N945q24p106o434
$$ 2240 7330 4661 -2990 -7821 -3827 5017 8159 1514 -6805 -6674 650 6595 5771 -1335 -7769
1329g769K637R113M188n460q101j583N856O793R82o436p583J160Q869N072m018
$$ -7769 -5132 3981 8169 2709 -5392 -6975 -1119 5674 6656 220 -7363 -6203 2666 7738 3720
1344C720p526l245M201P573K656n900q079j83Q043N884k363o991m723K637Q019
$$ 3720 -3806 -7051 -2850 4723 7379 1479 -6600 -6783 1260 7144 4781 -2210 -6933 -4296 3723
1359C723M053n208q332j357O936O558p33o479n876J219Q083N353m376q326k434
$$ 3723 7776 2568 -5764 -7121 -185 6373 5640 -839 -6715 -5496 2587 7940 3564 -4762 -7196
1374g196N587O977J036n789o824j81P701O364l093q058l488M009P019K845m783
$$ -7196 -1609 5368 6404 615 -6209 -6390 1311 7675 4582 -3476 -6964 -2955 4064 6909 2126
1389B126p597j499O946P019j606p405m432K318O740M524l632q074k650O004P166
$$ 2126 -5471 -6970 -24 6995 5389 -2016 -6448 -4130 2610 7134 3502 -4572 -7222 -1218 5948
1404E948n1o390n372O41O386N885k434q308l606N064P028J434n222o263q26O135
$$ 5948 5897 -493 -5865 -5224 1162 7047 4613 -3695 -7301 -2237 4791 6225 1003 -5260 -6086 49
1420D9O696j315q103m445L875O806K790l903p009k256N761P258j94p423n190K422
$$ 49 6745 5430 -2673 -7118 -3243 3563 6353 2450 -4559 -6815 -1054 6204 6010 -1413 -6603 -4181
1436d181O442M080k490p394l594N109P435R13o254n796O80N888N210j059p342
$$ -4181 2261 6341 3851 -3543 -7137 -2028 5407 6320 66 -5730 -5050 838 6048 4989 -2353
1451b353m848M049P536J980m904o123j078N138O236J77o915n739K820P249K984
$$ -2353 -7201 -3152 4384 6364 1460 -4663 -5741 -603 5633 5810 -1105 -6844 -4024 3225 6209
1466F209l518o190k760M348P027J167o413o210J560O692L983k168o164m125L462
$$ 6209 2691 -3499 -6259 -1911 5116 6283 -130 -6340 -4780 1912 5895 3727 -2437 -6562 -3100
1481c100P540K125n796o277J59N857M965p86o030n198K417P681L074m800o312
$$ -3100 4440 6565 769 -5508 -5349 508 5473 4687 -1343 -6541 -4124 3557 6631 1831 -4481
1496d481j179M699N869O38n719o006J290P315M018l551o100k528L427O419K114
$$ -4481 -5660 -961 4908 5546 -173 -6179 -4889 2426 6444 2893 -3207 -5735 -2308 4111 6225
1511F225n326o497K83O514M739k110n801l689K198O632L385m717o731o61N577
$$ 6225 899 -5598 -5315 1199 5938 3828 -1973 -5662 -3464 3168 6553 1836 -4895 -5556 21
1526B1N199n76n434m748J150O647M362l884o865j525M545N478R30m922n748K67
$$ 21 5220 4644 -790 -5538 -4388 2259 6621 2737 -4128 -5653 -1108 4370 5300 378 -5370 -5103
1542e103O453M994k824o662k546L456N637K315m167o468p51O002N390j515o060
$$ -5103 1350 6344 3520 -3142 -5688 -2232 3405 5720 1553 -4915 -5666 336 5726 4211 -1849
1557a849l617K120N626L582l183o840j827N303N553j93n120m561P10N527M616
$$ -1849 -5466 -3346 2280 5862 2679 -4161 -5988 -685 4868 4675 -445 -5006 -4296 1231 5847
1572E847k130o898k782M431N578J027m127n317o38N377N313j313o533l583L279
$$ 5847 3717 -3181 -5963 -1532 4046 5073 946 -4371 -5009 368 5681 4368 -2165 -5748 -2469
1587b469N549K172l137n854j892N081N855o12n910m163J985N413L241k248o100
$$ -2469 3080 5252 2115 -3739 -5631 -550 5305 4693 -1217 -5380 -3395 2018 5259 3011 -3089
1602c089k895M519O109K65n087m630N65N051M330j340o062l738L556O181J326
$$ -3089 -5984 -1465 4644 4909 -178 -4808 -4243 808 5138 3798 -2264 -6002 -2446 3735 5061
1617E061m124m907r08M507N250l84n792m303K361N937K410l104n052k146L752
$$ 5061 937 -3970 -4878 -371 4879 4495 -1297 -5600 -3239 2698 5108 2004 -3048 -5194 -1442
1632a442N829O58n376m724J259N396L407j951n152l212K962O202J578m894m982
$$ -1442 4387 5045 -331 -5055 -3796 1600 5007 3056 -2096 -5308 -2346 3856 5434 540 -4442
1647d442K59M704M186q18n208m039K223O237K410m184n136p34L880M819M51n105
$$ -4442 -4183 521 4707 3889 -1319 -5358 -3135 3102 5512 1328 -3808 -4542 -662 4157 4608 -497
1663d97m743J452N949L114l053n105j864K948N286J637m720n278O93N285L638
$$ -497 -5240 -3788 2161 5275 2222 -2883 -4747 -1799 3487 5124 404 -4874 -4181 1104 4742
1678D742j664m891l071K107N546K602m066n519k12M479M156l07m606m076J340
$$ 4742 3078 -1813 -4884 -2777 2769 5371 1305 -4214 -4426 53 4209 3902 -704 -4780 -3440
1693c440N552L226l176n512j285L780M525P96m195m868N62N419L725k236n359
$$ -3440 2112 5338 2162 -3350 -4635 -855 3670 4466 271 -4597 -4035 1384 5109 2873 -2486
1708b486k230K946M856J716l642n314l55N098M183j301m969l186J988M977K628
$$ -2486 -4716 -1770 3086 4802 1160 -4154 -4509 589 4772 3471 -1498 -4684 -2696 2281 4909
1723D909k890n618j291M539M556l55m382l819P83M903L595k169n587k176L735
$$ 4909 2019 -3599 -4890 -351 4205 3850 -532 -4351 -3568 1335 4930 2761 -2826 -5002 -1267
1738a267M716O53l514m394m85M720M356j457n316k775K655M722J786k803m857
$$ -1267 3449 4102 588 -3806 -4291 429 4785 3328 -1988 -4763 -2108 2614 4400 1597 -3260
1753c260j500M429M841p70m835l263J471M592K924k208n172k161L845N059R9m295
$$ -3260 -4760 -331 4510 3740 -1095 -4358 -2887 1705 4629 2421 -2751 -4912 -1067 3992 4091 -204
1769b04l723L60M381L833j538n247k695L077M986J123l541m225o39L971M477o78
$$ -204 -3927 -3567 814 4647 3109 -2138 -4833 -1756 3230 4353 812 -3413 -4052 -81 4396 3718
1785C718n057l259K005M808K188k710m523j600L398M830L33m639l755J102M417
$$ 3718 -1339 -4598 -2593 2215 4403 1693 -2830 -4430 -1032 3798 4131 -508 -4263 -3161 1256
1800A256L042j731m711k432K745N045J197m061m190K62L986L609p43m615l241
$$ 1256 4298 2567 -2144 -4576 -1831 3214 4411 350 -3840 -3578 408 4017 3274 -1341 -4582
1815d582K146N023J919l364m419n81L427M058K54m483l891J579M884K406k441
$$ -4582 -2436 2587 4506 1142 -3277 -3858 -431 3627 3881 -602 -4493 -2914 1970 4376 1935
1830A935m424j617K811M488J116m140m314Q30M438K898j369m239k706K165M774
$$ 1935 -2489 -4106 -1295 3193 4309 169 -4145 -3315 1123 4021 2652 -1587 -4293 -2128 2646
1845B646J757l499m450j18L811L426k73m010l539J429M843K317k711m392j147
$$ 2646 4403 904 -3546 -3664 147 3573 3300 -710 -4249 -2820 2023 4340 1629 -2763 -3910
1860c910L121L927O41l687m043O30M621K877j914m263k024K425M273J352l273
$$ -3910 -789 3138 3779 92 -3951 -3321 1300 4177 2263 -2000 -4024 -1599 2674 4026 753
1875G53m327r1M264L338j173m018k717J659M440K074k784m467r14L760L722l06
$$ 753 -3574 -3665 599 3937 2764 -1254 -3971 -2312 2128 4202 1418 -3049 -3963 -203 3519 3213
1891C213l682l267P53M368K872k219m462j554K995L946O35l242l708j66M126L497
$$ 3213 -469 -3736 -2983 1385 4257 2038 -2424 -3978 -983 2963 3598 356 -3352 -3518 608 4105
1907D105j492m324k132K033M025J646k631m164q70L710L866p32l983k654J173
$$ 4105 2613 -1711 -3843 -1810 2215 3861 1230 -2934 -3804 -94 3772 3040 -943 -3597 -2424
1922b424L890K544k066m479j400L222L944J12l526l195L57L784L171j467m506
$$ -2424 1466 4010 1944 -2535 -3935 -713 3231 3343 -183 -3378 -3021 763 3934 2467 -2039
1937b039j930K645L936R95k948l686m03L521L646q01m314k501J923L815J819k215
$$ -2039 -3969 -1324 2612 3607 659 -3027 -3430 91 3737 2936 -1378 -3879 -1956 1859 3678 1463
1953A463m046j185L159L914L6l875l066J069L652K507j399m200j938K692M048
$$ 1463 -2583 -3768 -609 3305 3341 -534 -3600 -2531 1121 3628 2229 -1971 -3909 -1217 2831
1968B831P29l307l418J98L340L083o71m051k632K124M097J293k603l644o85L015
$$ 2831 3560 253 -3165 -2967 373 3456 2785 -1266 -3898 -1774 2323 3616 1013 -2631 -3316 -301
1984c01L540k7l879l100J510L962J836j911l717j554K663L896N34l543l387P63
$$ -301 3239 3212 -667 -3767 -2257 1705 3541 1630 -2087 -3641 -978 2918 3452 -91 -3478 -2715
2000b715L717K377j197l630k273K076M148J119l107l506o2L260K923m02l546k867
$$ -2715 1002 3379 2182 -1448 -3721 -1645 2503 3622 515 -2991 -3053 207 3130 2728 -818 -3685
2016c685J442M148J715k498l503r01K668L396L60l305l252P39L967K230j777l476
$$ -3685 -2243 1905 3620 1122 -2381 -3282 -614 2782 3142 -163 -3415 -2676 1291 3521 1744 -1732
2032a732j616K005L777J062l076l544J84L572K707j101l322k259J415L900J673
$$ -1732 -3348 -1343 2434 3496 420 -3124 -2940 632 3339 2238 -1084 -3343 -1928 1972 3645
2047C645k670l638m02L034L034k72l184k777Q43L809K261k195l707r55K447L229
$$ 3645 975 -2663 -3065 -31 3003 2731 -453 -3230 -2387 1422 3683 1488 -2219 -3174 -727 2502
2063B502N81k924l248K45L616K714j497l620j587J776L327J423k445l654l48L257
$$ 2502 3083 159 -3089 -2844 772 3486 1989 -1631 -3218 -1442 1885 3308 863 -2791 -3139 118
2079A18K993o94l319k197J084L324K116j936l823r37K847L106N3k872k758M21
$$ 118 3111 2417 -902 -3099 -2015 1309 3425 1489 -2334 -3271 -424 2682 2735 -137 -2895 -2474
2095b474L283K598j395l841j448K376L129P52k417l176k46L206K902r04l599j938
$$ -2474 809 3407 2012 -1829 -3277 -901 2228 2980 563 -2613 -2859 347 3249 2345 -1254 -3192
2111c192J766L160J361j907l458q90K995L152l60l256k384J015L090J993j378
$$ -3192 -1426 1734 3095 1188 -2270 -3160 -165 2987 2627 -629 -3013 -1998 1092 3085 1707
2126A707l544j557K592L339K17k728k707J72K943K554q17l486k042K002L392Q63
$$ 1707 -1837 -3394 -802 2537 2754 26 -2681 -2509 434 2988 2171 -1315 -3357 -1355 2037 2900
2142B900k228k920o05K664L072l39l332k351J327L318J412j680l026j298K336
$$ 2900 672 -2248 -2853 -189 2883 2544 -788 -3139 -1812 1506 2918 1238 -1788 -3086 -750
2157g50L424J71l096k641P85L045J989j138l129j784J894L549P19k815k731J08
$$ -750 2674 2845 -251 -2892 -2107 938 2927 1789 -1340 -3124 -1230 2319 3038 223 -2508 -2400
2173b400K670K475m83l151k256J460L491J244k278k831o11K220K948J81l055k636
$$ -2400 270 2745 2262 -889 -3145 -1685 1806 3050 772 -2059 -2670 -450 2498 2679 -376 -3012
2189c012R58L250J741j603k913j264J753L209Q41k839k892M33K924K187r37k917
$$ -3012 -2054 1196 2937 1334 -1579 -2843 -1090 2119 2960 121 -2771 -2338 586 2773 1836 -1081
2205a081j810J355L276J322k450l053p4K571K438k14k810k332R52L277J693j968
$$ -1081 -2891 -1536 1740 3062 612 -2441 -2515 56 2494 2280 -530 -2862 -1910 1367 3060 1092
2221A092l096o22K179K626M29k592k750N07L167K002j373l095j149J719K758J002
$$ 1092 -2004 -2626 -447 2179 2608 16 -2734 -2227 940 2942 1569 -1526 -2675 -956 1802 2804
2237B804k232l085QK955K280q04k814j764J114K888J547j773l253o06K617K502
$$ 2804 572 -2513 -2505 450 2730 1926 -888 -2652 -1538 1350 2897 1124 -2129 -2735 -118 2384
2253B384j84k433k316M45K946K044j383l201j118K163K590M39k046k696j40K939
$$ 2384 2200 -233 -2549 -2104 842 2886 1503 -1698 -2816 -653 1937 2376 330 -2366 -2506 433
2269D33K367j040l015j453J537K705J048j748k922n71K713K578o11k681j855Q73
$$ 433 2800 1760 -1255 -2708 -1171 1534 2582 834 -2088 -2659 54 2632 2021 -660 -2515 -1642
2285a642K735J619j459k972j024K321K701K3k392k199K66K607K143j027k978j465
$$ -1642 1093 2712 1253 -1719 -2743 -422 2279 2302 -90 -2289 -2023 584 2727 1700 -1278 -2743
2301b743J783K791O37k008k462l39K324K525m41k881j868J251K765J184j580k598
$$ -2743 -960 1831 2468 460 -2002 -2341 -17 2508 2067 -814 -2682 -1431 1334 2518 938 -1660
2317a660q75J993K820N7k732k104P45K568J593r99k665j385J688K936N28k483
$$ -1660 -2535 -542 2278 2335 -397 -2501 -1756 812 2405 1406 -1259 -2644 -956 1980 2508 25
2333B5k222K56K250K042m94k739j780J431K887Q72j975k370l22J917K392L7k691
$$ 25 -2197 -1941 309 2351 1857 -882 -2662 -1231 1656 2528 553 -1817 -2139 -222 2170 2207 -484
2350d84k106J041K718J261j361k493r61J669K616N20k429k387N84K420J671p37
$$ -484 -2590 -1549 1169 2430 1069 -1424 -2385 -716 1900 2420 -9 -2396 -1812 608 2279 1542
2366A542k493j571J378K752Q82k047k455l1K177J961k07k420j953R91K739J218
$$ 1542 -951 -2522 -1144 1608 2490 443 -2012 -2043 134 2095 1888 -532 -2485 -1494 1245 2463
2382B463j584k541n70J921K193K53k219k245N46K643J526j172k499r99J511K404
$$ 2463 879 -1662 -2232 -311 1882 2135 -84 -2329 -1783 860 2386 1214 -1285 -2284 -773 1631
2398A631O32j911k488Q3K525J810p92k301j484J039K491J168j655k578l93K205
$$ 1631 2263 352 -2136 -2053 472 2282 1490 -811 -2295 -1256 1235 2403 748 -1830 -2223 -18
2414a8K030k33k067j846M64K514J592j314k555q54J781K203L38j822k157o3K475
$$ -18 2012 1779 -288 -2134 -1670 844 2436 1122 -1433 -2287 -506 1697 2035 213 -1944 -2007 468
2431D68J920j001k435j110J188K310Q59j588k383l83K235K100n53k246j482P46
$$ 468 2388 1387 -1048 -2158 -970 1340 2199 611 -1772 -2155 80 2180 1627 -619 -2101 -1355
2447a355K299J356j368k468o52J849K237j6k100j764L15K218J732j005k522r75
$$ -1355 944 2300 932 -1536 -2188 -339 1898 1882 -218 -1982 -1667 551 2283 1278 -1244 -2219
2463b219J491K249N10j799k012j24K033K020n40k434j376J132K221R78j367k291
$$ -2219 -728 1521 2031 232 -1780 -1904 129 2149 1609 -825 -2201 -1069 1152 2130 763 -1528
2479a528n40J794K212k8k313j668O73K128J346q92k379j029J558K346L59k023
$$ -1528 -2068 -274 1938 1910 -403 -2071 -1398 730 2076 1184 -1195 -2224 -666 1680 2039 16
2495A6j912K56J979J634m88k342j387J344K249O71j545k091k14J783J919j01k233
$$ 16 -1896 -1640 339 1973 1485 -857 -2244 -900 1349 2020 475 -1616 -1830 -47 1872 1771 -462
2512d62j686R42K231R78j138k086q01J572K148K46k011j917M89K095J324p04k089
$$ -462 -2148 -1206 1025 2003 865 -1221 -2022 -450 1698 1944 -67 -1984 -1495 600 1924 1220 -869
2529h69j279J250K315N65j683k001k4J850J709l03k033j611Q93K298R61j373k055
$$ -869 -2148 -898 1417 1982 299 -1702 -1726 124 1833 1530 -503 -2114 -1221 1077 2038 665 -1390
2546a390n33J630J955R8j882j842M47K285J269j048k010r18J256K128N09j764
$$ -1390 -1923 -293 1662 1760 -122 -1964 -1517 768 2037 989 -1021 -1939 -683 1445 1954 190
2562A90j965J05K089J512o56j955j222Q62K219Q61j509k036k39J718J794k16j857
$$ 190 -1775 -1670 419 1931 1275 -680 -1902 -1040 1179 2040 531 -1505 -1744 -26 1768 1552 -305
2579c05j539M82K170J268j214k093o24J421J903K90j713j795J50K014J522q16
$$ -305 -1844 -1362 808 2076 862 -1231 -1855 -434 1469 1759 46 -1749 -1599 415 1937 1121
2595A121k042r87J061J975P54j459j990k44J858J734m12j913j298P05J981J099
$$ 1121 -921 -1908 -847 1128 1882 423 -1567 -1811 47 1781 1369 -544 -1842 -1137 844 1943
2611A943j174k090m94J643J767L9j736j613L46J946J366q61k155p52J301J830
$$ 1943 769 -1321 -1815 -172 1595 1634 -102 -1715 -1369 577 1943 1082 -1073 -1825 -524 1306
2627A306M70j515j825j4J826J570m71k055j125R77J849P90j158j982m25J649J791
$$ 1306 1776 261 -1564 -1578 248 1818 1347 -708 -1833 -856 993 1783 625 -1357 -1782 -133 1658
2644A658j62j817j437N54J877J117q35k022q36J440J877J97j579j617R4J781J432
$$ 1658 1496 -321 -1758 -1204 673 1790 955 -1067 -1903 -463 1414 1611 32 -1585 -1491 290 1722
2661A722n50j944j115J121J944N09j328j726k89J671J637k55j854j341P69J906
$$ 1722 1172 -772 -1887 -766 1178 1687 359 -1367 -1656 15 1652 1397 -457 -1798 -1029 877
2677H77Q50j012j824o41J406J859N2j738j446L68J786J157o85j821r85J145J933
$$ 877 1727 715 -1109 -1750 -344 1515 1567 -171 -1617 -1249 537 1694 1009 -812 -1797 -652 1281
2694A281M14j503j607l4J591J501l53j814j245P98J975P26j235j656m48J361J729
$$ 1281 1695 192 -1415 -1449 142 1643 1290 -524 -1769 -971 1004 1730 495 -1161 -1609 -248 1481
2711A481L0j751j426M93J812J042q66j742p26J062J839M09j597j583J70J649J318
$$ 1481 1511 -240 -1666 -1173 639 1681 815 -927 -1653 -591 1248 1657 60 -1523 -1353 296 1614
2728A614n45j741r92Q09J874O85j372j698o7J411J472j14j677j302N75J808R99
$$ 1614 1069 -672 -1664 -855 1019 1704 332 -1366 -1433 -22 1450 1336 -341 -1643 -1068 740 1739
2745A739j071j757m49J188J601K63j513j533K68J717J212o91j713q04R02J654
$$ 1739 668 -1089 -1538 -350 1251 1514 1 -1532 -1264 453 1665 974 -739 -1543 -641 1013
2761A013O51j289j769k4J570J347k93j611j164N94J745R04j042j828l57J402J449
$$ 1013 1664 375 -1394 -1418 152 1499 1206 -405 -1569 -975 770 1674 632 -1196 -1553 -151 1298
2778A298M2j429j427K83J759J097q16j737o35J111J546L40j243j580%J667J262
$$ 1298 1340 -89 -1516 -1233 526 1623 807 -930 -1565 -454 1092 1432 189 -1391 -1391 276 1538
2795A538n29j636r17P90J635O49j051j671k91J491J463k74j485j142M25J658R19
$$ 1538 1009 -627 -1544 -754 881 1530 479 -1192 -1483 8 1471 1197 -288 -1430 -1005 653 1572
2812A572q21j694n98J183J606J23j327j359P3J536J271n75j676q70R34J617M60
$$ 1572 751 -943 -1541 -358 1248 1371 44 -1315 -1242 294 1565 990 -686 -1556 -622 995 1455
2829A455j112j496k29J346J468k74j611j061O57J585O96q37j530n64J199J635
$$ 1455 343 -1153 -1382 -36 1432 1158 -453 -1514 -857 728 1424 587 -943 -1507 -308 1327
2845A327j4j549j141L46J447J014o01j586p87J033J639K64j316j260k1J300J277
$$ 1327 1313 -236 -1377 -1031 416 1430 829 -757 -1544 -511 1128 1392 76 -1184 -1205 95 1372
2862A372k58j622r86Q01J535N77r99j422l16J129J484j2j522j204N33J469Q61
$$ 1372 1114 -508 -1494 -693 842 1419 420 -1002 -1318 -189 1295 1283 -239 -1443 -910 559 1420
2879A420o90j557o07R84J550K94j395j336K68J327J060l55j537q49P81J526N58
$$ 1420 730 -827 -1434 -450 1100 1394 -1 -1337 -1069 258 1318 963 -574 -1423 -642 884 1442
2896A442j138j464k0J227J164j02j423j102N76J537P05q86j457l58J072J318J59
$$ 1442 304 -1160 -1180 47 1211 1109 -314 -1416 -840 697 1402 516 -941 -1299 -227 1091 1250
2913A250j283j328L00J525Q96o33j410o44Q21J407M47j122j450J6J429J021l03
$$ 1250 -33 -1361 -1061 464 1360 727 -683 -1327 -506 901 1348 226 -1224 -1208 221 1242 939
2930I39j326r60N32J528P03r72j473k43J202J205n1j169j204K69J545Q94p64j449
$$ 939 -387 -1347 -815 713 1416 444 -1029 -1272 -70 1135 1084 -85 -1289 -1020 525 1419 655 -794
2948g94m80R02J317K85j059j324jJ416J063n04j353p31O43J381N48r56j373k20
$$ -794 -1274 -372 945 1230 171 -1153 -1154 262 1325 821 -532 -1263 -620 761 1309 353 -1020 -1240
2966a240J268J193k61j243r22L95J337Q31p82j424m13J005J279Q4j164j074J18
$$ -1240 28 1221 960 -283 -1205 -810 527 1358 576 -848 -1261 -256 1023 1107 -57 -1131 -1013
2983a013J290J050n25j444o76Q23J343M12j004j273j55J153J285k50j447q52N96
$$ -1013 277 1327 802 -642 -1318 -495 848 1260 256 -1017 -1172 -19 1266 1016 -431 -1283 -687
3000f87J295O47p50j353m34J068J324j0j274j001L22J235Q42m88j422o14R20J306
$$ -687 608 1255 505 -848 -1282 -214 1110 1100 -174 -1175 -853 382 1224 736 -686 -1300 -380 926
3018I26K29j108j089K2J138J040k27j439q24P63J320M60q70j197k85J043J211
$$ 926 1155 47 -1042 -1020 118 1158 931 -508 -1332 -569 751 1211 341 -856 -1141 -98 1113
3035A113j8j330j025N21J278O68n76j327n34Q99J309K07j181j126J87J196Q83
$$ 1113 1095 -235 -1260 -739 539 1207 631 -696 -1230 -331 978 1185 4 -1122 -935 261 1144
3052A144l38j301q07P31J369M06r90j210r3J070J052q7j223r85M71J426N60p73
$$ 1144 806 -495 -1302 -571 798 1204 214 -996 -1089 -19 1033 946 -277 -1262 -791 635 1195 422
3070D22j232l33R19J172J15j105j091K16J337P59n34j233n61P25J280L45j032
$$ 422 -810 -1143 -224 948 1063 -42 -1133 -917 420 1179 645 -588 -1149 -424 856 1201 169
3087A69j167QJ190R22k95j142q18M78J315N72q57j208k54R87J117o8j062r93K35
$$ 169 -998 -990 200 1122 827 -315 -1133 -655 660 1232 375 -833 -1087 -100 1017 949 -113 -1106 -871
3106h71J295P85o72j228m37P94J163K43r83j134K8J218R51m35j196o45N50J188
$$ -871 424 1209 537 -691 -1128 -334 829 1072 89 -1045 -1017 201 1152 717 -479 -1124 -574 614
3124F14N06q14j207j58J089J014j89j132p61L08J174P21o66j222l58R01J096R1
$$ 614 1120 306 -901 -1059 30 1044 855 -277 -1038 -730 444 1165 499 -723 -1081 -180 916 1007
3142A007j049r56J49J100Q87m33j278n29P00J127L19q25j111q7J021J021j99j228
$$ 1007 -42 -998 -849 251 1138 705 -573 -1102 -402 725 1044 219 -892 -979 42 1063 864 -364
3160c64p26N00J135N43o38j217l41R61J085J2j080q54K46J069P20m18j240n05
$$ -364 -1090 -590 545 1088 450 -767 -1108 -147 938 950 -130 -984 -738 331 1051 633 -607 -1112
3178a112Q06J118J58q95r73J9J051Q21k21j191o87O37J088L54o93j035k27R07
$$ -1112 -306 812 970 75 -898 -879 172 993 772 -419 -1106 -469 619 973 280 -755 -982 -75
3196g5J031p0j068q44L83J113N64n60j073m41P56J137R5r59r57J57J032P67l18
$$ -75 956 886 -182 -1026 -643 470 1034 474 -599 -1040 -284 853 948 -11 -968 -811 221 988 670
3215F70j088o58O23J134L56q34j018q0R36R05j19j065p72L93J165M94o82j020
$$ 670 -418 -1076 -453 681 1037 203 -815 -895 41 946 827 -238 -1010 -617 548 1042 360 -660
3233f60k90P66J018K6r34q89K19J081O68m94j025m72O04J112K36q67r93L2R71
$$ -660 -950 -184 834 860 -74 -963 -744 337 1005 511 -514 -986 -382 730 966 99 -894 -862 109
3252A09Q02k65j017o22M36J125M20p08j030j57Q42R04k8r60q07K84J068O60n90
$$ 109 911 646 -371 -993 -557 568 988 280 -750 -907 -65 839 811 -149 -956 -672 396 1056 466
3271D66j057l35O75R90K01q69r52J07R94P66l39j065n15N29J007M01p47j047p4
$$ 466 -591 -926 -251 739 940 71 -881 -774 220 986 647 -418 -933 -404 603 1004 257 -790 -864
3290h64Q92Q47j36r76o83L39J005N41n87j064k38P71R12L9q53q19J72R67O53l96
$$ -864 28 875 739 -237 -920 -581 424 965 378 -686 -924 -153 759 798 -55 -874 -702 265 918 522
3310E22j023m18O35R22K40p37r27k6R11P61j91r58o42M70R40M39n80j001k25P99
$$ 522 -501 -919 -284 638 878 141 -786 -812 99 860 669 -289 -931 -461 479 918 338 -663 -888 -89
3330h9Q98p0q64p31K36R44O11m38r74m74O83R47J43p34q57J8Q75P54l00r49n31
$$ -89 809 739 -125 -856 -620 324 935 497 -477 -951 -268 679 822 88 -769 -751 124 878 578 -371 -902
3351i02N20R36K99o35q58j93Q16Q43j47q69o62L23Q99M91m82r16l20O73Q98N1
$$ -902 -382 554 853 218 -640 -833 -17 826 679 -190 -852 -529 370 861 379 -537 -857 -184 714 765
3371G65q17p31J13Q60O64l35q97n03N34R23K54p24p81q3P62Q26j67r29n82L65
$$ 765 -52 -783 -670 190 854 519 -378 -881 -347 576 830 106 -675 -758 4 830 663 -266 -848 -483
3391d83R21M12n32r16k36O95Q61K3q12p29K03Q52N93m02q86l95N22Q98K22p35
$$ -483 438 850 318 -598 -834 -139 722 745 -67 -796 -593 259 852 450 -436 -831 -309 589 811 76
3411G6p99M0Q37O32k21q45n34M14Q74L88o03q93p3O64P44j5q12o65K59Q65M91
$$ 76 -723 -683 154 786 565 -280 -814 -400 474 862 259 -634 -707 -43 701 686 -126 -791 -532 333 824
3432H24m40q85k90O04P94J48p19q25J21Q63N62k54q30n34M65R16K77n79r08k8
$$ 824 384 -501 -791 -187 607 755 36 -789 -668 195 757 503 -327 -861 -396 520 797 218 -690 -718
3452g18P59O89j18p68o65L25Q92M13m76q61k49O48P77O8p17p41J66Q37N60l76
$$ -718 41 730 612 -156 -821 -496 396 809 333 -528 -777 -129 648 716 -1 -742 -576 261 821 445
3472D45q36m05N31Q03J91o02q30K8Q00O27k39p60n26L25Q64L33m98q11k04O68
$$ 445 -391 -796 -265 538 729 127 -703 -675 125 752 513 -247 -773 -448 416 749 251 -560 -764 -96
3492i6Q02q1p20o31K03P78N24l76q66k96N61Q22J06o66p15j1P87O40k37q53m32
$$ -96 706 625 -95 -726 -523 255 779 403 -463 -759 -198 624 730 64 -651 -662 125 765 528 -325 -757
3513g57M12P77L09n26p61j63O67P55j06p75n72K55P54M86m29q03k68N89P72K6
$$ -757 -345 432 741 215 -546 -709 -42 713 607 -168 -740 -485 269 755 326 -477 -745 -156 616 642
3533F42o88o10R0P26N54k73q15l70M56P61K18n56p35k1O29O70p2q12n58L45P81
$$ 642 -46 -656 -566 160 714 441 -374 -744 -288 473 691 135 -600 -621 8 678 606 -206 -764 -419 362
3554C62L62m21p57k57N95P28L7p15o19J88P33N20k86q17l87M78P64J89o39o91
$$ 362 724 303 -454 -711 -116 612 649 -66 -685 -497 236 756 470 -347 -734 -256 508 697 58 -633
3574f33L1O49O12j52p62m83L36Q06K74m93p41r6N74O73j3o94n79K02P66M09l50
$$ -633 -602 47 659 507 -255 -738 -402 404 678 185 -556 -652 -78 595 582 -112 -691 -489 277 686 336
3595C36p26k78M91O81J26n75o72Q5P11M97k46o69m36L23P78K61m84p50q8O36N96
$$ 336 -390 -668 -177 504 630 55 -617 -532 179 676 430 -239 -675 -352 426 687 203 -547 -635 1 597
3616E97o7o57n41K00P99L59m28o94k44N29O70J06o13o16L3P61M60k80p05l35M01
$$ 597 530 -127 -668 -468 331 690 262 -432 -676 -147 523 629 16 -600 -567 194 654 374 -331 -666 -265
3637b65O77K41n08p16k9O21O02j58o61m35K63O70L69m47p04j36N64O19J2o31n11
$$ -265 412 653 145 -571 -600 21 623 465 -196 -631 -368 302 671 224 -480 -616 -52 567 579 -52 -563
3658e63J07O60M70l23p23k47M03O90J49n55o07l5O50N68j73p29l79L16O56L16
$$ -563 -456 204 674 351 -372 -619 -216 474 623 68 -539 -574 76 644 471 -258 -637 -321 335 651
3678F51m14p38j09N40O19j7o44m83J97O19M08k84p24k62M89O39Q2n63n78J23N68
$$ 651 237 -501 -610 -70 549 532 -112 -595 -398 221 629 345 -379 -641 -152 487 569 6 -572 -449 119
3699A19M67j48p26l70M24N97K17m33o31q4N35N90r5o23m74K74O15L18l33o28k26
$$ 119 586 438 -288 -658 -234 363 580 147 -484 -568 -33 557 462 -161 -635 -361 254 572 239 -389 -615
3720f15M73O21J01o08n80J35O53M00k20o22l82L86O79K09n20o01MN35N12q3o25
$$ -615 -142 479 580 -28 -608 -473 180 580 360 -262 -644 -258 421 630 110 -491 -487 48 560 477 -148
3741a48m68K96O49K71l73o10k06M97O29k9n51n68J58O71L38k89n59l17M08O18
$$ -148 -616 -320 329 600 227 -383 -589 -92 537 508 -43 -611 -453 218 556 267 -292 -609 -201 417
3761D17J23m96n64L4N74M31j35n92l74K67O54K64m34n96j19N14N10m3n38m68J34
$$ 417 540 44 -520 -486 88 519 384 -208 -582 -315 339 603 169 -427 -546 -32 478 435 -103 -571 -437
3782d37O51M05l53o25j76L91N78J31n33n30K0O10M49j84o61k71K61N92K79m76
$$ -437 214 619 266 -359 -535 -144 434 565 32 -498 -478 132 581 397 -264 -535 -274 318 597 121
3802A21n56m5M97N31j25n72l86J81N93L43l41o61j23M52N33L8m87m96O6N51M64
$$ 121 -435 -480 17 548 423 -149 -535 -354 239 582 241 -420 -543 -91 442 480 -7 -503 -437 114 578
3823E78k66o41k44L71N68J73m32n69l4N16N04j04o05l96K81N80K84l29o02j78
$$ 578 312 -329 -573 -202 366 539 107 -462 -496 20 524 420 -185 -581 -300 280 564 235 -367 -545
3843e45M61N64nn41m54J40N42L77k08o38k89M27N68R6m38n22J6M86M93j51n79
$$ -545 -84 480 475 -66 -520 -380 162 539 331 -307 -596 -169 399 495 57 -465 -449 37 530 379 -200
3864b00l56K75O10J86l64n34j45M91N39n1n26m56J76N60L13k73n27k72M26N59
$$ -200 -556 -281 329 515 151 -383 -528 -37 502 451 -75 -531 -355 205 518 245 -282 -554 -128 431
3884D31O2m76m84P0M99M14j76n40l68L44N65J88l96n26r3M95M85p4n32m20J84
$$ 431 493 17 -467 -397 102 516 340 -200 -568 -224 341 529 133 -393 -486 9 494 420 -112 -532 -348
3905c48O02K82l31n59j84M07N51K6m76m57R0N35L83k27n34k62K69N89J69m38n12
$$ -348 254 536 205 -354 -538 -131 420 446 -30 -487 -397 138 521 294 -240 -502 -233 356 525 87 -425
3926d25j9M69M66j33n05l16J83N66K48l55n50j11M45M38L3m45m71J10N44L52k70
$$ -425 -444 25 491 358 -147 -463 -280 286 534 179 -371 -482 -37 401 434 -11 -482 -372 172 524 254
3947B54n30k04L05N15J27m21n18L1M84M24j06n70l02K64N12K52l56n69r4M69M64
$$ 254 -276 -480 -175 340 467 46 -472 -441 43 467 361 -209 -511 -247 265 517 161 -408 -502 -33 431
3968D31m2m74m17J76M91L32k54n48j98M06M78P4m52m25K6M94L72j60m98l11K85
$$ 431 389 -85 -502 -326 165 497 243 -305 -503 -97 381 455 3 -422 -396 98 470 310 -188 -499 -214
3989b14N13J84l39m93r6M45M53l7n31l48J51N13K98k91n09k17M16N00K0m25m69
$$ -214 299 483 144 -349 -445 0 453 416 -115 -463 -312 201 499 208 -301 -518 -102 398 418 -7 -476
4010d76J13N11L30j59n18l07K96N45J33l64m56q5M56M39q2n02l70K01N85K05l27
$$ -476 -363 148 478 319 -199 -506 -210 335 468 104 -352 -437 19 458 376 -126 -496 -295 290 495 168
4031A68m75j48L78M96qm31m17R1M88L18k04m87k55K91N32P2l85m24j2M46M30j61
$$ 168 -307 -455 -77 419 411 -20 -437 -346 142 460 256 -231 -486 -195 337 409 24 -400 -412 34 464 303
4053C03m58l11K04N16K30l76m60j03M12M70rm60l96R3N43K77k32m99j91K92N56
$$ 303 -155 -466 -262 254 484 108 -352 -455 -43 427 418 -42 -438 -345 198 475 243 -256 -447 -155 401
4074D01O3m15m37j0M62L84j22n16k73K20N07K36l82m58p5L78M23qm68l53J55M42
$$ 401 464 49 -388 -398 64 448 326 -190 -463 -243 264 500 118 -340 -415 -37 386 378 -90 -443 -288 154
4096A54L02k81m58j67L50M23P9l88m44P0M73L46j76m95k44K80M64J55l66m73K7
$$ 154 456 175 -283 -450 -100 323 402 14 -430 -360 113 459 283 -212 -456 -176 288 443 77 -396 -369
4117c69M17L72r0m20l22J65M69K42k28n39j02L64M10L5m21l94R7M45L38k30m83
$$ -369 48 420 330 -90 -412 -247 222 464 236 -303 -405 -41 369 404 -17 -411 -314 131 469 239 -244
4138b44j98K85M89J03l95m19m6M74L56j05m15l35J98M85K17k80m85j34L99M34
$$ -244 -442 -157 332 435 40 -379 -425 49 405 300 -115 -450 -252 233 450 170 -315 -449 -50 384
4158C84m9l53l93J08M62K92k19m68j90L18M23Q8l67m06K1L97L50q0m90k53K21
$$ 384 335 -18 -411 -303 159 451 232 -236 -426 -108 315 403 36 -370 -349 48 398 318 -172 -425 -204
4179b04M60J63l54l77j03L69M43m4m69l12J63M50K40k34m67j41L23M32P2m15l79
$$ -204 256 419 65 -312 -415 -46 397 353 -116 -428 -265 185 425 191 -276 -417 -94 338 410 -5 -384
4200c84N2M08K90j05m41k32K47M48J29l19m09n0L43L93l1m26l05J25M32K49k54
$$ -384 -332 76 366 261 -180 -412 -165 283 412 93 -316 -366 -23 370 339 -87 -392 -267 165 414 160
4221A60m28j41L14M52M0m14l75O3M37K92j78m28k15K38M35J35l58l68j9L94L29
$$ 160 -268 -409 -95 357 397 -17 -392 -329 108 400 222 -206 -421 -183 252 387 29 -339 -358 36 365
4242C65m0m46k96J84M28K17l04m10j06L81L46L3m02l44J22L96K95k07m60j43K81
$$ 365 325 -121 -417 -233 195 412 108 -302 -408 -27 319 352 -50 -394 -272 124 419 212 -248 -391 -110
4263a10L93R1k96m26K7M10K79q8l85l14J89M38J71k58m31o8L54L49k7l51l30Q0
$$ -110 283 374 78 -348 -321 89 368 280 -105 -419 -230 208 379 121 -310 -378 -24 325 298 -53 -383 -303
4285c03M71K21j84m69j37K99L92Q3l74l56K8M15L31j90l70k46J76M54J69l06m06
$$ -303 168 389 205 -264 -401 -102 290 373 -1 -357 -329 86 417 227 -143 -389 -213 241 410 104 -302
4306c02p2L69L94q8l96k91J11M53K13k15m31j32K91M26K6l79l17K6L82L22j84
$$ -302 -374 -5 389 301 -95 -386 -275 178 391 176 -255 -387 -96 330 356 -23 -340 -314 68 390 206
4327B06m01k11K47M06J22l28l74k8L57L68o5m50k48J69L89K39k62l94j11L18L59
$$ 206 -195 -406 -159 247 369 41 -333 -361 -4 364 299 -151 -399 -230 159 398 136 -258 -369 -51 308
4348C08L9l68l46Q4L69K77j30m50j92K31M61J02l37l66KL25L70q1m42k36J83L80
$$ 308 347 -21 -367 -283 86 363 233 -217 -409 -178 283 385 48 -318 -316 9 379 298 -144 -380 -197 183
4370A83J80k43m30n2L13L39M5l90l03R8L85K47j54m31j38K29L82J19l52l88M1
$$ 183 363 120 -310 -362 -49 290 335 -55 -358 -260 125 372 218 -213 -351 -122 260 379 27 -361 -320
4391c20L71K79p0m15k30J90M33J35k49m01m7L34K82J0l38l58J49M34J77k11l82
$$ -320 51 330 260 -155 -385 -195 238 373 124 -277 -324 10 292 302 -36 -394 -245 189 366 155 -227
4412b27j22K63L69M4l30l78O1L86K76j10l85k49K22M03J31k79l85m2L61L23q0
$$ -227 -349 -86 283 327 -3 -381 -320 66 342 232 -153 -402 -180 223 354 75 -310 -352 9 332 252
4433B52l01l40J36M08K08k10l95j11K87L65J9l50k98K2M21K33j45l77j77K11L68
$$ 252 -49 -389 -253 155 363 153 -242 -353 -66 299 318 -32 -330 -308 113 346 201 -176 -353 -142 226
4454B26J22k88l51m4L82K97q7l73k63J67L91J92k43l77j20L15L53j3l33k92O2
$$ 226 348 60 -291 -335 47 344 257 -116 -379 -212 179 371 128 -249 -369 -54 299 286 -47 -339 -277
4475b77M05K41j86l77j77K86L29R4k97l40%L54K92j08l74k10J69L97J20k24l63
$$ -277 128 369 183 -194 -371 -85 244 338 41 -299 -299 55 347 239 -135 -345 -176 221 341 117 -246
4496b46p0K95L37Ml93k82J31L52K57k38l31j37K07L72P5l25l29M9L33K60j06l62
$$ -246 -316 -21 316 320 -73 -355 -224 128 385 147 -184 -321 -114 258 333 8 -321 -272 61 321 215 -147
4518a47k37K13L76J46k98l26l3L17K62J6l57k78J16L80K24k33l69j08K57L92k
$$ -147 -384 -171 205 351 53 -273 -306 11 273 289 -68 -346 -230 150 374 141 -228 -336 -79 313 311
4539C11l32l20Q5L74K22j49l29k16J91M21P1k76l58RL20K90p9l21k73J60L74J69
$$ 311 -21 -341 -256 118 340 191 -138 -354 -163 258 329 53 -305 -296 24 314 235 -86 -359 -199 175 344
4561C44k29l65p7K53L54pl04l01N1L94K48j90l58j67K24L64R1k90l38%L55K69
$$ 344 115 -250 -327 -74 280 273 -31 -332 -281 113 361 171 -187 -354 -130 234 325 35 -303 -303 52 321
4583C21j04l22k35J50M21J24k25l80l8K89L23k5l51k42O2L71K17j68l53j82K34
$$ 321 217 -105 -340 -190 231 355 130 -250 -288 1 324 299 -52 -294 -232 139 356 188 -165 -347 -113
4604a13L43N9k77l06M7K90K67r3l94j54J60L71J51k35l62r0L39L08m6l62k39J53
$$ -113 230 289 12 -294 -247 43 310 217 -177 -331 -171 200 351 116 -246 -336 3 311 265 -97 -336 -183
4626a83L28J84j74l76j18K54L40O1l28k89N8L10K66j21l78j80K06L46J32k73l39
$$ -183 145 329 155 -221 -339 -85 255 316 -12 -301 -243 67 333 212 -166 -346 -140 206 338 65 -274
4647b74l2L21L02l4l67k66J37L69J76j91l82j15L00K89N4l25k73N0L34K65j57
$$ -274 -306 15 317 283 -84 -350 -213 156 332 141 -241 -356 -56 233 287 -38 -311 -261 73 338 181
4668A81l67j51K48K96R7k61l04j9L23K79n9l60k18J66L56J15j91l55o9K51L14
$$ 181 -186 -337 -89 207 304 43 -261 -280 43 322 263 -97 -315 -149 207 322 131 -224 -293 -42 272
4689B72K0l57k69R9L90J64j76l18j76K56L56O7k98l44L2L38K55j08l21k15J44
$$ 272 292 -65 -334 -235 155 319 143 -175 -351 -95 261 328 30 -314 -282 56 311 203 -118 -333 -189
4710a89L95J25k76l35jK80L02k0l37k49R3L36K27k25l17j27K69L38J1k88k96N0
$$ -189 206 331 55 -280 -281 -1 301 281 -56 -305 -212 124 351 126 -191 -318 -49 289 300 12 -284 -234
4732b34L09K77j61l21j79J56L40J14k38l12m2K89K96k8l64k37J40L42J74k27l25
$$ -234 75 352 191 -130 -309 -153 187 301 63 -249 -291 -2 294 266 -98 -335 -195 147 321 94 -231
4753b31j02K60L51jl14k93N0L48K77j52l86j28K43L44O2k62l31LL11K77r2l54
$$ -231 -333 -73 278 277 -37 -330 -280 68 345 193 -193 -321 -78 266 328 66 -265 -262 49 326 234 -120
4775a20j80J52L25J61k09l72l8K71K80j2l21k27P7L44J81j60l49j13K24L20O6
$$ -120 -300 -148 177 338 129 -243 -281 -10 270 258 -63 -290 -213 131 312 152 -197 -310 -86 234 300
$$ [...]
8191A31
##END NTUPLES=NMR FID
##END=
