##TITLE=1H_Ser 7-4-i-3
 CDCl3,8 sc, 
 24.9.2021
##JCAMPDX= 6.0         $$ Bruker NMR JCAMP-DX V2.0
##DATA TYPE= NMR FID
##DATA CLASS= NTUPLES
##ORIGIN= UXNMR, Bruker Analytische Messtechnik GmbH
##OWNER= root
$$ XWIN-NMR		Version 3.5
$$ Fri Sep 24 09:34:57 2021 Russian Standard Time (UT+4h)  she@DPX200
##.OBSERVE FREQUENCY= 200.1314
##.OBSERVE NUCLEUS= ^1H
##.DELAY= (6, 6)
##.ACQUISITION MODE= SIMULTANEOUS
##.ACQUISITION SCHEME= undefined
##.AVERAGES= 8
##.DIGITISER RES= 18
##SPECTROMETER/DATA SYSTEM= spect
##.PULSE SEQUENCE= zg30
##.SOLVENT NAME= CDCl3
##.SHIFT REFERENCE= (INTERNAL, CDCl3, 0, 15.7039)
##AUDIT TRAIL= $$ (NUMBER, WHEN, WHO, WHERE, WHAT)
$$ ##TITLE= Audit trail, XWIN-NMR		Version 3.5
$$ ##JCAMPDX= 5.01
$$ ##ORIGIN= Bruker BioSpin GmbH
$$ ##OWNER= she
$$ F:/spectra/data/she/nmr/H-F/1/audita.txt
$$ ##AUDIT TRAIL=  $$ (NUMBER, WHEN, WHO, WHERE, WHAT)
(   1,<2021-09-24 09:33:17.79 +0400>,<she>,<DPX200>,
      <created by zg, POWCHK disabled, PULCHK disabled
       configuration hash MD5:
       00 E9 B6 7A A2 85 ED C7 34 08 36 98 17 FE 4E 26
       data hash MD5: 16K
       AB 00 A3 1F 51 69 C9 BE D4 96 5B D5 47 55 2E 26>)
$$ ##END=
$$ 
$$ hash MD5
$$ 9B 9A 38 59 6D 6C 3A D0 98 EE E3 3C 6C 1A 30 24
##$RELAX= 
##$RELAX= 
##$RELAX= 
##$RELAX= 
##$RELAX= 
##$RELAX= 
$$ Bruker specific parameters
$$ --------------------------
##$DU= <F:/spectra>
##$EXPNO= 1
##$NAME= <H-F>
##$PROCNO= 1
##$TYPE= <nmr>
##$USER= <she>
##$AMP= (0..31)
100 100 100 100 100 100 100 100 100 100 100 100 100 100 100 100 100 100 
100 100 100 100 100 100 100 100 100 100 100 100 100 100 
##$AQSEQ= 0
##$AQ_mod= 1
##$AUNM= <au_zg>
##$AUTOPOS= <>
##$BF1= 200.13
##$BF2= 200.13
##$BF3= 200.13
##$BF4= 200.13
##$BF5= 200.13
##$BF6= 200.13
##$BF7= 200.13
##$BF8= 200.13
##$BYTORDA= 1
##$CFDGTYP= 0
##$CFRGTYP= 5
##$CHEMSTR= <none>
##$CNST= (0..31)
1 1 145 1 1 1 1 1 1 1 1 1 1 1 1 1 1 1 1 1 1 1 1 1 1 1 1 1 1 1 1 1 
##$CPDPRG= <>
##$CPDPRG1= <>
##$CPDPRG2= <>
##$CPDPRG3= <>
##$CPDPRG4= <mlev>
##$CPDPRG5= <mlev>
##$CPDPRG6= <mlev>
##$CPDPRG7= <mlev>
##$CPDPRG8= <mlev>
##$CPDPRGB= <>
##$CPDPRGT= <>
##$D= (0..31)
0 1.2 0 0 0 0 0 0 0 0.06 0 0.03 0 0 0 0 0.0002 0 0 0 0 0 0 0 0 0 0 0 0 
0 0 0 
##$DATE= 1632461597
##$DBL= (0..7)
120 120 120 120 120 120 120 120 
##$DBP= (0..7)
150 150 150 150 150 150 150 150 
##$DBP07= 0
##$DBPNAM0= <>
##$DBPNAM1= <>
##$DBPNAM2= <>
##$DBPNAM3= <>
##$DBPNAM4= <>
##$DBPNAM5= <>
##$DBPNAM6= <>
##$DBPNAM7= <>
##$DBPOAL= (0..7)
0.5 0.5 0.5 0.5 0.5 0.5 0.5 0.5 
##$DBPOFFS= (0..7)
0 0 0 0 0 0 0 0 
##$DE= 6
##$DECBNUC= <off>
##$DECIM= 32
##$DECNUC= <off>
##$DECSTAT= 4
##$DIGMOD= 1
##$DIGTYP= 9
##$DL= (0..7)
0 120 120 120 120 120 120 120 
##$DP= (0..7)
150 150 150 150 150 150 150 150 
##$DP07= 0
##$DPNAME0= <>
##$DPNAME1= <>
##$DPNAME2= <>
##$DPNAME3= <>
##$DPNAME4= <>
##$DPNAME5= <>
##$DPNAME6= <>
##$DPNAME7= <>
##$DPOAL= (0..7)
0.5 0.5 0.5 0.5 0.5 0.5 0.5 0.5 
##$DPOFFS= (0..7)
0 0 0 0 0 0 0 0 
##$DQDMODE= 0
##$DR= 18
##$DS= 0
##$DSLIST= <SSSSSSSSSSSSSSS>
$$ [...]
##$SUBNAM2= <"">
##$SUBNAM3= <"">
##$SUBNAM4= <"">
##$SUBNAM5= <"">
##$SUBNAM6= <"">
##$SUBNAM7= <"">
##$SUBNAM8= <"">
##$SUBNAM9= <"">
##$SW= 20.0188988654967
##$SWIBOX= (0..15)
0 0 2 0 0 0 0 0 0 0 0 0 0 0 0 0 
##$SW_h= 4006.41025641026
##$TD= 16384
##$TD0= 1
##$TE= 0
##$TE2= 300
##$TE3= 300
##$TEG= 300
##$TL= (0..7)
0 120 120 120 120 120 120 120 
##$TP= (0..7)
150 150 150 150 150 150 150 150 
##$TP07= 0
##$TPNAME0= <>
##$TPNAME1= <>
##$TPNAME2= <>
##$TPNAME3= <>
##$TPNAME4= <>
##$TPNAME5= <>
##$TPNAME6= <>
##$TPNAME7= <>
##$TPOAL= (0..7)
0.5 0.5 0.5 0.5 0.5 0.5 0.5 0.5 
##$TPOFFS= (0..7)
0 0 0 0 0 0 0 0 
##$TUNHIN= 0
##$TUNHOUT= 0
##$TUNXOUT= 0
##$USERA1= <user>
##$USERA2= <user>
##$USERA3= <user>
##$USERA4= <user>
##$USERA5= <user>
##$V9= 5
##$VALIST= <valist>
##$VCLIST= <CCCCCCCCCCCCCCC>
##$VD= 0
##$VDLIST= <DDDDDDDDDDDDDDD>
##$VPLIST= <PPPPPPPPPPPPPPP>
##$VTLIST= <TTTTTTTTTTTTTTT>
##$WBST= 1024
##$WBSW= 4
##$XGAIN= (0..3)
0 0 0 0 
##$XL= 0
##$YL= 0
##$YMAX_a= 268617
##$YMIN_a= -261579
##$ZGOPTNS= <>
##$ZL1= 120
##$ZL2= 120
##$ZL3= 120
##$ZL4= 120
##$ABSF1= 10
##$ABSF2= 0
##$ABSG= 5
##$ABSL= 3
##$ALPHA= 0
##$AQORDER= 0
##$ASSFAC= 0
##$ASSFACI= 0
##$ASSFACX= 0
##$ASSWID= 0
##$AUNMP= <proc_1d>
##$AZFE= 0.1
##$AZFW= 0.1
##$BCFW= 1
##$BC_mod= 2
##$BYTORDP= 1
##$COROFFS= 0
##$CY= 11.3945322036743
##$DATMOD= 1
##$DC= 2
##$DFILT= <>
##$DTYPP= 0
##$F1P= 2.36226072786647
##$F2P= -0.459571619588291
##$FCOR= 0.5
##$FTSIZE= 0
##$FT_mod= 4
##$GAMMA= 1
##$GB= 0.15
##$INTBC= 1
##$INTSCL= 1
##$ISEN= 128
##$LB= 0.24
##$LEV0= 0
##$LPBIN= 0
##$MAXI= 10000
##$MC2= 0
##$MEAN= 0
##$ME_mod= 0
##$MI= 1.114404
##$NCOEF= 0
##$NC_proc= 0
##$NLEV= 6
##$NOISF1= 3.799351
##$NOISF2= 2.8
##$NSP= 1
##$NTH_PI= 0
##$NZP= 0
##$OFFSET= 15.70392
##$PC= 1
##$PHC0= -14239.56
##$PHC1= 19.40088
##$PH_mod= 1
##$PKNL= yes
##$PPARMOD= 0
##$PSCAL= 0
##$PSIGN= 0
##$REVERSE= no
##$SF= 200.130013532006
##$SI= 16384
##$SIGF1= 3
##$SIGF2= 2
##$SINO= 400
##$SIOLD= 16384
##$SREGLST= <1H.CDCl3>
##$SSB= 0
##$STSI= 0
##$STSR= 0
##$SW_p= 3612.71676300578
##$SYMM= 0
##$S_DEV= 0
##$TDeff= 0
##$TDoff= 0
##$TI= <>
##$TILT= no
##$TM1= 0
##$TM2= 0
##$TOPLEV= 0
##$USERP1= <user>
##$USERP2= <user>
##$USERP3= <user>
##$USERP4= <user>
##$USERP5= <user>
##$WDW= 1
##$XDIM= 8192
##$YMAX_p= 0
##$YMIN_p= 0
$$ End of Bruker specific parameters
$$ ---------------------------------
##NTUPLES= NMR FID
##VAR_NAME=  TIME,          FID/REAL,        FID/IMAG
##SYMBOL=    X,             R,               I
##VAR_TYPE=  INDEPENDENT,   DEPENDENT,       DEPENDENT
##VAR_FORM=  AFFN,          ASDF,            ASDF
##VAR_DIM=   8192,          8192,            8192
##UNITS=     SECONDS,       ARBITRARY UNITS, ARBITRARY UNITS
##FACTOR=    0.0002496,     1,               1
##FIRST=     0,             0,               0
##LAST=      2.0444736,     0,               0
##MIN=       0,             -261579,         0
##MAX=       2.0444736,     268617,          0
$$ Real data points
##PAGE= N=1
##DATA TABLE= (X++(R..R)), XYDATA
0 0 0 0 0 0 0 0 0 0 0 0 0 0 8 -8 8 -8 16 -16 24 -24 32 -40 45 -49 58 -72 80 -96 112 -126 144 -162 185 -209
34 -209 238 -266 298 -337 375 -419 467 -519 575 -636 705 -778 858 -946 1043 -1148 1264 -1394
52 -1394 1538 -1697 1874 -2074 2304 -2565 2870 -3231 3665 -4196 4868 -5745 6945 -8695 11502
67 11502 -16723 29776 -133441 -132183 210467 196080 7836 -185704 -182915 -19969 207772
78 207772 200392 -58959 -259653 -111994 149017 213627 55117 -128382 -189695 -40389 174326
89 174326 200077 -19814 -208278 -143213 79756 195385 108261 -90492 -196455 -74669 148823
100 148823 194492 18993 -161060 -153361 18016 172216 139979 -58082 -202749 -105457 114731
111 114731 178071 33283 -129864 -157814 -29935 140927 161150 -19644 -186870 -121514 87499
122 87499 172147 63850 -85674 -144687 -60973 112543 174848 17374 -164835 -134976 49333
133 49333 151891 83984 -55573 -144765 -92758 82816 174109 39768 -142185 -137884 15966
144 15966 129972 105592 -22036 -136808 -106407 64023 165704 56162 -110808 -129206 -14262
155 -14262 101215 117099 5872 -127524 -116306 41599 147196 70509 -74303 -119085 -43201
166 -43201 76261 130674 37893 -111124 -121989 19130 128323 86108 -39622 -115721 -75932
177 -75932 48853 132702 56147 -100790 -131419 -7433 105187 94724 -10015 -107769 -96372
188 -96372 30172 133215 74609 -77588 -124623 -24619 84655 100231 18909 -92159 -109888
199 -109888 7863 121948 83552 -54254 -115884 -45608 58915 101262 44445 -73464 -116303
210 -116303 -10322 111495 93013 -27492 -101666 -63062 35900 102221 63175 -60048 -121049
221 -121049 -28925 93781 92941 -7306 -88843 -80337 11865 99984 77060 -45236 -115919 -41339
233 -41339 74957 93203 17007 -69714 -90574 -9734 95027 87976 -29185 -106158 -53706 50681
245 50681 89936 39402 -51810 -97979 -29325 86485 95354 -12076 -92545 -62556 27412 85620
257 85620 58290 -36271 -101056 -44838 72837 95343 1732 -80224 -71185 4033 77054 70851
269 70851 -23870 -100338 -55767 57114 92852 18512 -63890 -75775 -14367 70670 83910 -7936
281 -7936 -93679 -61876 41793 89022 37174 -45794 -79881 -31590 62231 92027 6023 -86135
293 -86135 -68084 23445 79940 52223 -28419 -83532 -47888 51062 93604 18454 -74778 -72099
305 -72099 4229 67489 63799 -10357 -83084 -60878 38313 89759 29847 -58926 -72991 -14003
317 -14003 55055 72761 7223 -77700 -68738 26646 84224 41290 -39702 -71166 -29824 44824
329 44824 79771 22155 -69760 -73717 13705 75620 49776 -22343 -70087 -46360 32663 81480
341 81480 32114 -61216 -77715 -2282 64021 56631 -5587 -66833 -60137 20934 81531 41911
353 41911 -47763 -75624 -16917 52037 63936 12029 -59599 -68843 9337 78046 49189 -32780
365 -32780 -69624 -30596 37442 68132 27315 -50736 -72959 -2008 70822 54423 -17223 -61426
377 -61426 -42562 21727 68944 38935 -42650 -75305 -15018 58271 56184 -3978 -55012 -53963
389 -53963 6200 67495 48608 -33263 -73228 -24519 46901 60422 12448 -46212 -60556 -4840
401 -4840 65570 56687 -22636 -68685 -33812 32016 60497 26399 -38690 -66473 -16196 58673
413 58673 60640 -10493 -60603 -40729 17212 59040 40515 -28053 -68085 -25289 49050 61114
425 61114 1877 -51916 -48747 875 53356 49541 -18819 -68439 -33746 37853 59810 15482
437 15482 -40188 -52587 -9920 50694 58633 -6757 -63230 -38377 27934 57438 27256 -29723
449 -29723 -57640 -22246 44031 60974 1134 -58995 -45300 14650 52244 37038 -18653 -59974
461 -59974 -32143 37971 62827 11317 -49665 -49075 1805 46698 45289 -7810 -60337 -41837 28757
474 28757 60125 18864 -39106 -51597 -11770 40122 52484 3878 -55217 -46080 20752 57356
486 57356 28086 -24652 -49835 -23677 32726 56630 12511 -49912 -50082 8800 49491 33902
498 33902 -12963 -49441 -35458 24907 59641 20850 -41532 -50094 -1336 44157 42905 -355
510 -355 -47272 -43488 17525 59567 26966 -33934 -51247 -14347 34777 47624 8209 -45911 -49770
523 -49770 8672 55895 32980 -23345 -48350 -23708 26349 52017 18584 -40164 -51982 -596
535 -596 48664 37178 -12990 -45595 -33613 14452 50985 26403 -33895 -52837 -9196 40557
547 40557 41376 -334 -39247 -38882 6489 51479 35439 -25065 -50782 -15766 31904 43488 10969
560 10969 -34768 -45619 -2247 48563 39987 -17684 -48150 -22552 22370 44971 22706 -28739
572 -28739 -49757 -8205 45449 43069 -8435 -43603 -30295 11307 43928 30624 -24519 -53978
584 -53978 -16535 37126 42020 644 -38214 -37918 961 42527 37283 -16958 -51723 -21688 29217
597 29217 41990 11750 -29944 -42504 -7605 39759 41047 -9096 -47370 -27322 19694 40864
609 40864 21185 -21366 -44427 -14733 36617 44749 172 -40556 -31247 11067 39782 29082
621 29082 -13893 -45823 -22869 30323 44926 5908 -36049 -36660 18 35802 34434 -7349 -45834
634 -45834 -29434 24095 45010 13279 -27731 -37716 -9257 32081 40584 323 -42992 -33507 16197
647 16197 41641 19295 -19091 -38539 -19304 26052 43831 6407 -38731 -35022 7618 36751
659 36751 26038 -9533 -37857 -26549 20508 44921 11970 -32888 -35678 -1878 30412 31460
671 31460 -1778 -37633 -32050 14808 43734 17515 -25348 -35204 -9638 25926 37584 6349
683 6349 -35472 -34655 9681 41419 23308 -17385 -35357 -17552 19981 39981 12565 -32935 -37550
696 -37550 2705 36269 27181 -9456 -34487 -24187 13732 40275 18603 -27791 -38483 -3920
708 -3920 30320 29874 -969 -31917 -30040 7064 38810 23335 -21585 -37825 -10299 23697 31934
721 31934 7955 -27897 -34415 1722 37424 27301 -14417 -35370 -16231 17062 33446 15701
733 15701 -24237 -38371 -3907 34464 29105 -7785 -32562 -22815 9693 34383 22149 -20007
745 -20007 -39936 -9111 30124 30773 312 -27882 -28257 2759 34697 27376 -14712 -38817 -14421
758 -14421 23691 31615 8238 -22943 -32695 -4235 32903 30563 -9051 -35628 -19435 15796 31353
771 31353 15194 -17812 -34866 -10624 29144 32185 -3248 -31296 -23475 7638 30015 21072 -12774
784 -12774 -35583 -16043 24222 33005 2691 -26642 -26581 -155 28206 26743 -7533 -35170 -20193
797 -20193 19207 33349 9097 -21182 -28634 -7037 26054 31698 -2205 -33757 -23273 13494
809 13494 31900 15102 -15320 -30225 -13637 22247 34221 2823 -30792 -25406 6598 28312
821 28312 20379 -8843 -30759 -18940 17716 34356 7782 -25969 -26730 -469 24108 24920 -2550
834 -2550 -30495 -23042 13229 33148 12639 -20051 -27411 -6817 20548 28836 3573 -28949 -25857
847 -25857 9094 31136 16790 -13772 -27813 -13097 16562 30764 8432 -26801 -28567 3612
859 3612 27738 20050 -7469 -27528 -19010 12148 31720 13321 -22489 -29606 -1973 23889 23183
872 23183 -422 -25726 -24055 7364 31254 16977 -17243 -29228 -7981 18991 25507 6071
884 6071 -22900 -27345 2990 30010 20039 -11187 -26919 -13141 13913 27276 11724 -19760 -29418
897 -29418 -1896 26977 21707 -5977 -24932 -18508 7995 27808 15897 -16788 -30164 -6397
909 -6397 23340 23739 -130 -22162 -22320 3153 28198 19985 -13199 -29610 -10596 18475 24929
922 24929 5483 -19437 -25572 -2096 26649 22767 -8898 -27534 -14321 12663 25233 11422
934 11422 -15579 -27262 -6682 23773 24654 -3942 -24720 -17778 6125 24156 16502 -11866 -28164
947 -28164 -10911 19684 25400 1621 -20959 -20218 713 23291 21255 -7484 -27744 -13633 15922
960 15922 25521 6979 -17288 -22840 -4415 21494 24186 -3727 -27118 -16731 11163 24412 11817
973 11817 -12986 -24747 -9056 19239 26100 716 -24525 -19022 6049 22464 16009 -8455 -25931
986 -25931 -13688 15617 25989 4649 -21101 -21388 149 19918 19631 -3345 -25267 -17071 12191
999 12191 25521 9091 -15737 -22009 -5155 17436 22536 1366 -23705 -19740 8079 23873 12342
1012 12342 -10812 -22600 -10395 14710 24450 5214 -21313 -21347 3901 22223 15831 -5809 -22276
1025 -22276 -14734 11894 25548 8434 -18339 -22402 -937 19655 18582 -1429 -21510 -18300 8268
1038 8268 25501 11592 -14368 -22324 -5815 16248 20958 3154 -19754 -20974 3864 23853 14199
1051 14199 -10281 -21738 -10823 11459 21994 7206 -17603 -22663 -540 21191 16632 -5450
1063 -5450 -20132 -14392 7392 22984 11416 -14782 -22875 -4014 18175 18610 -465 -18365 -17589
1076 -17589 3568 23076 14760 -11738 -22372 -7088 14563 20278 4820 -16281 -19966 405
1088 405 22255 17398 -7920 -21361 -10498 10147 20708 9189 -14307 -22088 -3430 19420 18453
1101 18453 -3730 -19859 -14119 5525 20192 12882 -11208 -22657 -6747 16010 19209 1172
1113 1172 -17282 -16902 1439 19169 15733 -7732 -22251 -9840 12360 19255 5406 -14390 -19054
1126 -19054 -2305 17929 17933 -3986 -21024 -12436 9253 19203 9245 -10989 -20362 -5877 16532
1139 16532 19534 -686 -19344 -14673 5552 18572 12573 -7623 -20963 -9279 14637 20348 2610
1152 2610 -16410 -16322 1135 17330 15608 -4112 -20811 -12242 11437 19836 5686 -12883 -17611
1165 -17611 -3796 15406 17917 -1154 -19685 -14349 7634 18736 8965 -9107 -18415 -7970 13350
1178 13350 19383 1566 -17641 -15812 3348 17262 12058 -5860 -18786 -11108 10961 19992 4434
1191 4434 -15162 -16705 -544 15822 15173 -2646 -18352 -13302 8327 20203 7781 -12131 -17185
1204 -17185 -4113 13909 17471 866 -17417 -15258 5101 19329 10583 -8981 -17363 -7541 10912
1217 10912 18623 4395 -15739 -16747 1772 17341 12809 -5235 -16846 -10749 7586 18940 7629
1230 7629 -13589 -17595 -1453 14615 14334 -1150 -15947 -13680 4748 18734 10035 -11048 -17690
1243 -17690 -4457 11802 15690 2834 -15009 -16161 2418 18172 11947 -7819 -17289 -7600 9167
1256 9167 16903 6353 -13544 -17788 23 16716 13384 -4170 -16282 -10893 6365 17591 9187
1269 9187 -11259 -18353 -2876 14480 14666 -31 -14601 -13732 3305 17476 11466 -8237 -17919
1282 -17919 -6098 11522 15449 3498 -12583 -15738 -101 16379 13264 -5290 -17049 -9089 8318
1295 8318 15792 6529 -10452 -17001 -3410 14945 14733 -2506 -15775 -11417 5017 15816 9453
1308 9453 -8116 -17684 -6186 13204 15844 420 -13813 -13001 1494 15526 12384 -5711 -17594
1321 -17594 -8429 10737 16169 3502 -11406 -14564 -2299 14246 14662 -3158 -16871 -10292 7324
1334 7324 15647 6909 -8584 -15469 -5456 12597 16119 -363 -15274 -11665 3791 14555 9985
1347 9985 -5895 -16114 -7997 10463 16520 2388 -13231 -12913 405 13317 12589 -3256 -16153
1360 -16153 -9850 8376 16357 5141 -10819 -13942 -2587 11969 14417 -586 -15694 -11627 5947
1373 5947 15609 7616 -8116 -14742 -5543 10155 15528 2174 -14538 -13115 3106 14308 9815
1386 9815 -4936 -14773 -8518 8027 16000 4725 -12405 -14055 79 12443 11540 -1488 -14233
1399 -14233 -11110 5736 15940 6896 -9659 -14167 -3002 10488 13163 1772 -13189 -13040 3570
1412 3570 15390 8633 -6948 -14016 -5983 8393 14271 4278 -11934 -14344 1174 14452 10273
1425 10273 -4085 -13432 -8775 6232 15094 6535 -10410 -14878 -1451 12572 11542 -1125 -12487
1438 -12487 -11206 3530 15119 8475 -8353 -14697 -4173 10099 12581 2000 -11103 -13007 813
1451 813 14524 10337 -5828 -13981 -6632 7139 13238 4984 -9534 -14185 -1815 13127 11610 -3258
1465 -3258 -12958 -8748 4309 13478 7664 -7920 -14620 -3814 11495 12616 -461 -11593 -10425
1478 -10425 1755 13376 9990 -6052 -14719 -5507 9430 13051 2485 -10043 -11891 -777 12628
1491 12628 11803 -3861 -14265 -7304 6797 12883 5346 -8004 -13174 -3331 11291 12852 -1408
1504 -1408 -13264 -9121 3859 12173 7989 -5751 -13970 -5720 9522 13192 1180 -11416 -10547 915
1518 915 11225 10072 -3311 -14020 -7691 7679 13076 3510 -9201 -11617 -1810 10219 11713 -1054
1532 -1054 -13536 -9244 5757 12779 5751 -6789 -12309 -4337 9361 12900 1133 -12317 -10512
1545 -10512 3372 12119 7826 -4299 -12507 -6834 7815 13571 3118 -10604 -11288 568 10914
1558 10914 9589 -1612 -12165 -9035 5704 13596 5066 -8359 -11630 -2408 9143 10969 741
1571 741 -11420 -10762 3344 12944 6606 -6224 -11722 -5163 7141 12084 2799 -10578 -11690 1208
1585 1208 11982 8172 -3781 -11301 -7367 5363 12938 4799 -9261 -12021 -832 10482 9641 -1236
1599 -1236 -10628 -9072 3474 13141 6734 -7537 -11931 -2887 8611 10903 1492 -9780 -10552 1462
1613 1462 12503 8395 -5278 -11551 -5121 6303 11462 4110 -8578 -11607 -766 11131 9606
1626 9606 -2780 -10987 -7149 3842 11389 6339 -7104 -12242 -2768 9431 10228 -350 -9974 -8951
1640 -8951 1593 11045 8109 -5460 -12481 -4490 7727 10496 2013 -8672 -10284 -353 10685 9536
1654 9536 -3548 -12077 -5947 5939 10626 4416 -6909 -11308 -2337 9998 10422 -1412 -10965 -7431
1668 -7431 3641 10409 6666 -4965 -11862 -4217 8734 10914 778 -9217 -8735 1105 9964 8442
1682 8442 -3038 -11757 -6011 6788 10830 2868 -7425 -9900 -1598 9114 9636 -1381 -11117 -7542
1696 -7542 4666 10502 4735 -5745 -10552 -3701 8090 10474 230 -10161 -8679 2461 10193
1709 10193 6463 -4104 -10713 -5611 6741 11128 2015 -9001 -9408 316 9437 8093 -2007 -10329
1723 -10329 -7087 5096 11429 3975 -7276 -9541 -1767 8039 9494 181 -9793 -8442 3133 11042
1737 11042 5693 -5335 -9611 -4013 6363 10413 2251 -9056 -9406 1301 9877 6968 -3165 -9572
1751 -9572 -5979 4671 10957 3868 -8119 -9755 -490 8530 8126 -1015 -9457 -7637 3284 10931
1765 10931 5212 -6618 -9948 -2352 7014 9134 1104 -8981 -8862 1749 10223 6496 -4667 -9933
1779 -9933 -4311 5551 9749 3138 -7847 -9686 101 9278 7769 -2206 -9437 -6090 3881 9966 5051
1794 5051 -6239 -10136 -1830 8078 8598 -63 -8589 -7603 1952 9674 6495 -4567 -10308 -3618 6729
1809 6729 8965 1839 -7374 -8771 19 9277 7652 -3031 -9964 -5128 5069 9108 3579 -6073
1823 -6073 -9696 -1732 8584 8443 -1471 -9206 -6458 3043 9007 5371 -4753 -10072 -3419 7532
1837 7532 8875 280 -7784 -7587 819 8807 6975 -3211 -9870 -4830 5756 9098 2310 -6305 -8489
1852 -8489 -1263 8214 8189 -1613 -9165 -5927 3829 8971 4234 -4889 -8941 -2990 7180 8932 -44
1867 -44 -8393 -6893 1868 8599 5843 -3564 -9123 -4391 5902 9276 1583 -7408 -7670 175 7979
1882 7979 7067 -2061 -9033 -5623 4404 9329 3178 -6164 -8204 -1620 6913 8122 -191 -8657 -6813
1897 -6813 2848 8822 4723 -4390 -8421 -3395 5549 8783 1510 -7801 -7657 1188 7970 5990 -2466
1912 -2466 -8427 -5105 4252 9061 3070 -6612 -8046 -511 6968 6974 -513 -8141 -6421 3035 8952 4285
1928 4285 -5165 -8225 -2132 5874 7800 1090 -7565 -7369 1758 8504 5213 -3590 -8214 -3822 4737
1943 4737 8232 2490 -6708 -8079 238 7823 6239 -1700 -7807 -5331 3399 8607 3931 -5387 -8255
1958 -8255 -1311 6729 7028 27 -7096 -6672 1742 8413 5060 -4071 -8273 -3028 5350 7511 1616
1973 1616 -6255 -7582 80 7914 5992 -2713 -7953 -4378 3796 7742 3114 -5330 -8111 -1259 7150
1988 7150 6766 -1265 -7281 -5486 2239 7907 4576 -4286 -8189 -2450 6180 7340 312 -6407 -6345 740
2004 740 7635 5840 -3092 -8144 -3561 4754 7527 2069 -5423 -7029 -804 7006 6872 -1625 -7631
2019 -7631 -4682 3123 7434 3746 -4217 -7684 -2327 6038 7332 -203 -7081 -5682 1423 7027 5022
2034 5022 -3062 -7941 -3544 5009 7509 1224 -6113 -6451 -3 6396 5966 -1777 -7953 -4510 3908
2049 3908 7359 2506 -4991 -6920 -1376 5835 6782 -457 -7422 -5303 2676 7140 3853 -3508 -7155
2064 -7155 -2718 5171 7337 994 -6513 -6006 1270 6654 4976 -1938 -7190 -4138 4124 7525 2150
2079 2150 -5443 -6466 -360 5911 5866 -506 -6888 -5346 2921 7429 3200 -4171 -6696 -1970 4882
2094 4882 6502 653 -6454 -6107 1563 7008 4118 -2957 -6721 -3410 3987 7027 1698 -5804 -6556
2109 -6556 314 6353 4917 -1643 -6421 -4509 2848 7288 2833 -4855 -6677 -954 5566 5770 -22
2124 -22 -5913 -5481 1735 7241 3975 -3604 -6556 -2279 4381 6351 1443 -5328 -6184 417 6683 4968
2140 4968 -2338 -6329 -3484 3044 6622 2772 -4585 -6594 -811 5933 5548 -1068 -5973 -4460 1814
2155 1814 6529 3822 -3835 -6820 -1813 4968 5837 214 -5524 -5299 644 6268 4659 -2913 -6857
2170 -6857 -2661 3945 5965 1599 -4724 -6040 -403 5949 5393 -1669 -6485 -3577 2723 6026 3060
2185 3060 -3627 -6522 -1578 5256 5851 -293 -5757 -4440 1534 5905 4245 -2478 -6673 -2532 4411
2200 4411 6033 990 -4858 -5268 93 5572 5031 -1528 -6483 -3556 3430 6046 2053 -3941 -5835
2215 -5835 -1110 5046 5511 -600 -6115 -4374 2308 5822 2973 -3006 -6116 -2336 4397 5904 421
2230 421 -5499 -4984 1038 5557 3960 -1867 -5987 -3465 3533 6225 1509 -4669 -5303 -254 4931 4835
2246 4835 -609 -5826 -4382 2528 6298 2485 -3568 -5363 -1587 4176 5642 561 -5400 -4852 1521
2261 1521 5891 3440 -2432 -5414 -2839 3366 6079 1355 -4932 -5216 397 5231 4142 -1315 -5383
2276 -5383 -3722 2546 6136 2252 -4200 -5416 -683 4441 4861 -201 -5266 -4496 1608 5951 3114
2291 3114 -3246 -5495 -1806 3591 5283 1009 -4760 -5051 536 5427 3999 -1993 -5396 -2880 2667
2306 2667 5444 2170 -4006 -5523 -477 4879 4543 -772 -5061 -3634 1731 5449 3253 -3087 -5750
2321 -5750 -1344 4227 4886 321 -4505 -4397 635 5322 3977 -2318 -5718 -2183 3386 4926 1389
2336 1389 -3786 -5042 -242 5091 4365 -1424 -5285 -3012 2317 4944 2422 -3106 -5490 -1239 4503
2351 4503 4633 -434 -4678 -3866 1113 4956 3370 -2225 -5620 -2102 3745 4865 734 -3964 -4543 -35
2367 -35 4726 4063 -1384 -5327 -2936 2796 4986 1729 -3178 -4851 -1000 4319 4605 -532 -4868 -3532
2383 -3532 1791 4877 2588 -2470 -4932 -1822 3733 4939 316 -4435 -3986 814 4692 3289 -1655
2398 -1655 -4935 -2691 2940 5138 1193 -3879 -4310 -211 4116 4063 -746 -4871 -3383 2092 5098 2003
2414 2003 -3102 -4484 -1231 3499 4700 256 -4585 -3885 1233 4740 2880 -2095 -4545 -2204 2832
2429 2832 4991 1102 -4159 -4188 329 4222 3468 -1107 -4630 -2971 2143 4978 1882 -3518 -4399 -527
2445 -527 3677 3999 -129 -4455 -3581 1510 4821 2503 -2589 -4555 -1380 3079 4364 772 -4077 -4047
2461 -4047 755 4509 3151 -1603 -4474 -2318 2381 4569 1667 -3429 -4435 -168 4072 3622 -640
2476 -640 -4249 -3121 1661 4659 2423 -2656 -4657 -1093 3511 4014 302 -3802 -3758 748 4500 3004
2492 3004 -1971 -4578 -1835 2789 4107 1053 -3291 -4211 -172 4246 3424 -1308 -4339 -2563 1941
2507 1941 4268 1866 -2768 -4522 -971 3842 3788 -467 -3876 -3157 1031 4261 2602 -2130 -4525 -1591
2523 -1591 3185 4195 524 -3407 -3606 144 4133 3373 -1345 -4340 -2286 2316 4277 1488 -2766
2538 -2766 -4038 -766 3645 3818 -518 -4080 -2824 1428 4139 2295 -2171 -4238 -1517 3123 4120
2553 4120 170 -3695 -3331 602 3881 2945 -1544 -4294 -2098 2449 4170 936 -3226 -3657 -282 3490
2569 3490 3471 -734 -4225 -2617 1793 4079 1736 -2594 -3920 -1035 3069 3881 141 -3883 -3125 1068
2585 1068 3954 2503 -1644 -4026 -1744 2517 4180 914 -3310 -3545 249 3624 3102 -770 -3978
2600 -3978 -2520 1945 4169 1622 -2687 -3825 -630 3135 3485 -43 -3756 -3131 1213 4041 2139
2615 2139 -2084 -3893 -1420 2613 3738 589 -3412 -3524 533 3778 2522 -1319 -3826 -2103 2023
2630 2023 3889 1315 -2951 -3750 -253 3385 3037 -446 -3619 -2800 1338 4018 1917 -2262 -3883 -1072
2646 -1072 2889 3504 310 -3209 -3281 605 3910 2521 -1556 -3665 -1652 2239 3786 1141 -2851 -3572
2662 -3572 -59 3647 3027 -888 -3522 -2270 1557 3831 1737 -2478 -3714 -674 3134 3302 -291
2677 -291 -3293 -2797 832 3695 2307 -1902 -3830 -1330 2468 3465 517 -3023 -3212 72 3513 2826
2693 2826 -1300 -3759 -1952 1840 3586 1339 -2463 -3570 -556 3202 3251 -490 -3512 -2456 1167
2708 1167 3562 2097 -1872 -3740 -1162 2696 3501 319 -3141 -2874 509 3380 2641 -1232 -3746 -1718
2724 -1718 2228 3554 964 -2659 -3197 -188 3059 2956 -613 -3576 -2309 1673 3447 1537 -2102
2739 -2102 -3427 -920 2709 3243 -36 -3340 -2775 917 3291 2094 -1429 -3591 -1694 2286 3514
2754 3514 626 -2940 -3069 126 3139 2651 -756 -3484 -2281 1720 3588 1212 -2308 -3193 -607 2772
2770 2772 3151 -49 -3244 -2714 1149 3551 1792 -1653 -3290 -1343 2343 3404 526 -2972 -2898 486
2786 486 3279 2304 -1072 -3215 -1875 1845 3544 1005 -2519 -3080 -268 2895 2742 -386 -3180 -2393
2802 -2393 1227 3499 1620 -2045 -3208 -887 2321 3081 272 -2934 -2816 591 3310 2175 -1489
2817 -1489 -3274 -1506 1892 3294 922 -2599 -3167 -87 2995 2598 -827 -3152 -2057 1164 3303
2832 3303 1591 -2167 -3320 -586 2625 2854 -85 -2867 -2430 729 3267 2093 -1564 -3310 -1012
2847 -1012 2202 3019 622 -2507 -2821 176 3080 2535 -1080 -3219 -1587 1598 3025 1235 -2146 -3206
2863 -3206 -470 2762 2723 -438 -3008 -2182 981 3035 1840 -1612 -3345 -1061 2365 2837 267 -2624
2879 -2624 -2629 327 2997 2299 -1100 -3355 -1577 1910 2987 900 -2201 -2945 -326 2787 2615 -541
2895 -541 -3055 -2057 1306 3072 1378 -1704 -3028 -891 2473 2899 42 -2806 -2334 757 2936 1794
2911 1794 -1215 -3031 -1455 2007 3073 490 -2485 -2590 100 2673 2345 -614 -3022 -1951 1493
2926 1493 3117 1020 -1995 -2684 -615 2309 2782 -119 -2933 -2366 986 3061 1578 -1493 -2828 -1229
2942 -1229 1974 3087 443 -2669 -2529 379 2742 2049 -844 -2883 -1754 1530 3109 940 -2246
2957 -2246 -2629 -175 2451 2434 -299 -2839 -2092 1113 3087 1398 -1828 -2885 -740 2047 2743 193
2973 193 -2723 -2482 542 2873 1892 -1263 -2906 -1285 1639 2826 881 -2315 -2728 51 2662 2339
2989 2339 -680 -2779 -1854 1199 2908 1439 -1869 -2940 -531 2326 2511 -55 -2602 -2284 640 2897
3005 2897 1865 -1392 -3017 -1021 1936 2639 519 -2199 -2645 83 2811 2151 -917 -2896 -1482 1394
3021 1394 2672 1090 -1895 -2913 -469 2538 2407 -460 -2591 -2008 876 2744 1607 -1506 -2955
3036 -2955 -974 2157 2592 156 -2288 -2416 244 2729 2115 -997 -2871 -1387 1729 2792 801 -1953
3052 -1953 -2602 -363 2530 2411 -507 -2743 -1848 1204 2826 1279 -1563 -2755 -841 2198 2720 -80
3068 -80 -2521 -2107 613 2678 1688 -1151 -2773 -1253 1836 2765 400 -2209 -2326 105 2325 2144 -666
3085 -666 -2810 -1717 1308 2778 955 -1867 -2530 -530 2179 2495 -131 -2636 -2045 768 2732 1440
3101 1440 -1333 -2641 -1033 1799 2780 450 -2415 -2354 368 2531 1940 -822 -2627 -1554 1403 2766
3117 2766 897 -2007 -2518 -126 2178 2241 -233 -2530 -1867 982 2756 1290 -1611 -2559 -663 1853
3133 1853 2406 269 -2431 -2228 539 2628 1627 -1123 -2677 -1205 1516 2530 702 -2064 -2530 -32
3149 -32 2359 1996 -570 -2462 -1711 1028 2678 1234 -1680 -2672 -533 2125 2239 44 -2314 -2100 572
3166 572 2661 1656 -1257 -2643 -1065 1736 2527 545 -1975 -2358 80 2530 2007 -710 -2516 -1422
3182 -1422 1234 2513 974 -1675 -2471 -336 2245 2211 -290 -2294 -1752 737 2546 1494 -1312 -2558
3198 -2558 -830 1860 2338 184 -2132 -2185 226 2374 1785 -905 -2574 -1283 1425 2489 701 -1795
3214 -1795 -2353 -335 2203 2197 -415 -2428 -1686 965 2440 1220 -1408 -2444 -758 1942 2439 48
3230 48 -2278 -1901 477 2355 1693 -939 -2488 -1149 1561 2528 537 -1913 -2124 29 2190 1999 -487
3247 -487 -2429 -1485 1124 2413 989 -1535 -2342 -455 1916 2231 -62 -2351 -1849 761 2328 1374
3263 1374 -1104 -2428 -989 1593 2390 415 -2074 -2183 219 2194 1769 -642 -2403 -1459 1258 2414
3279 2414 838 -1709 -2306 -309 2003 2072 -179 -2259 -1805 861 2402 1209 -1280 -2357 -725 1700
3295 1700 2215 286 -2002 -1974 407 2365 1541 -810 -2278 -1186 1394 2350 671 -1769 -2158 -69
3311 -69 2139 1872 -329 -2161 -1589 898 2419 1086 -1443 -2257 -573 1825 2088 64 -2083 -1929 492
3328 492 2354 1477 -1077 -2298 -1044 1401 2235 526 -1769 -2110 -39 2225 1808 -675 -2261 -1372
3344 -1372 999 2290 991 -1482 -2257 -439 1915 2049 -179 -2028 -1630 520 2288 1348 -1151 -2249
3360 -2249 -726 1610 2119 323 -1842 -1887 140 2161 1689 -778 -2237 -1112 1174 2248 811 -1629
3376 -1629 -2176 -224 1949 1922 -359 -2117 -1450 742 2199 1174 -1258 -2273 -672 1660 2042 133
3392 133 -1928 -1774 336 2146 1589 -825 -2261 -1050 1254 2135 584 -1672 -2044 -88 1967 1811
3408 1811 -358 -2185 -1362 997 2227 908 -1285 -2101 -508 1746 1905 0 -2062 -1671 592 2101
3424 2101 1239 -990 -2171 -888 1435 2098 371 -1787 -1951 132 1970 1578 -550 -2147 -1325 1149
3440 1149 2228 691 -1420 -2058 -389 1749 1940 -76 -2075 -1656 703 2177 1119 -1070 -2014 -848
3456 -848 1574 2107 262 -1798 -1845 275 2006 1434 -741 -2078 -1166 1098 2205 635 -1556 -1881 -140
3473 -140 1829 1735 -321 -2011 -1439 773 2159 950 -1307 -2030 -582 1513 1986 68 -1818 -1670 417
3490 417 2139 1376 -951 -2070 -971 1236 2063 520 -1744 -1945 -37 1920 1642 -532 -2099 -1239
3506 -1239 887 2084 991 -1422 -2086 -396 1720 1885 -35 -1835 -1541 525 2150 1348 -1074 -2123
3522 -2123 -684 1401 1972 428 -1706 -1807 96 1997 1544 -665 -2154 -1066 1051 1942 752 -1435
3538 -1435 -2083 -249 1732 1646 -261 -1966 -1472 691 2010 1090 -1072 -2153 -623 1535 1892 128
3554 128 -1674 -1724 281 1969 1458 -718 -2144 -1024 1238 2017 585 -1446 -1939 -125 1899 1670 -345
3571 -345 -2003 -1349 864 2083 927 -1184 -2024 -562 1643 1858 66 -1744 -1572 472 1930 1246
3587 1246 -815 -1955 -860 1344 1956 347 -1578 -1763 75 1765 1537 -489 -1955 -1241 974 2032
3603 2032 682 -1341 -1886 -422 1507 1808 -118 -1857 -1555 597 1955 1044 -1042 -1946 -781 1324
3619 1324 2052 273 -1751 -1676 195 1833 1365 -579 -1874 -1137 1072 2022 661 -1444 -1776 -190 1620
3636 1620 1618 -181 -1831 -1332 669 2004 978 -1135 -1839 -459 1357 1812 171 -1727 -1572 431 1868
3653 1868 1265 -801 -1884 -865 1118 1840 565 -1527 -1822 76 1678 1468 -388 -1880 -1273 753
3669 753 1876 902 -1267 -1953 -381 1450 1643 62 -1703 -1543 410 1886 1183 -886 -2001 -771
3685 -771 1274 1739 396 -1485 -1801 72 1868 1401 -553 -1856 -1048 1066 1843 783 -1195 -1835 -242
3702 -242 1636 1616 -219 -1672 -1325 623 1853 1063 -930 -1894 -570 1474 1795 139 -1514 -1554 157
3719 157 1769 1306 -678 -1903 -949 1065 1830 506 -1301 -1824 -308 1594 1592 -371 -1871 -1248 700
3736 700 1822 840 -1080 -1834 -545 1464 1806 -75 -1645 -1438 356 1797 1235 -808 -1851 -788
3752 -788 1144 1893 395 -1459 -1599 54 1690 1507 -392 -1865 -1119 897 1872 689 -1204 -1730 -352
3769 -352 1432 1658 -109 -1725 -1343 618 1824 1088 -888 -1831 -779 1229 1816 298 -1624 -1596 192
3786 192 1666 1374 -558 -1845 -1074 963 1973 631 -1338 -1727 -84 1513 1522 -200 -1773 -1342 658
3803 658 1826 920 -1027 -1796 -492 1323 1643 226 -1572 -1538 368 1770 1132 -692 -1777 -802 1048
3820 1048 1733 509 -1386 -1688 7 1660 1385 -352 -1704 -1131 754 1860 880 -1093 -1815 -297
3836 -297 1459 1589 46 -1593 -1464 414 1833 1119 -830 -1842 -796 1177 1715 319 -1416 -1634
3852 -1634 40 1733 1392 -501 -1742 -1019 773 1761 688 -1200 -1762 -312 1554 1516 -259 -1609
3868 -1609 -1269 483 1872 989 -947 -1794 -624 1293 1722 204 -1451 -1524 176 1729 1276 -615 -1805
3885 -1805 -884 993 1777 512 -1303 -1621 -132 1579 1577 -275 -1729 -1175 675 1728 923 -988 -1781
3902 -1781 -483 1337 1671 58 -1601 -1343 331 1711 1187 -699 -1830 -876 1096 1761 466 -1458
3918 -1458 -1609 -45 1540 1431 -370 -1742 -1103 853 1781 713 -1160 -1636 -301 1429 1556 -42
3934 -42 -1671 -1319 559 1703 1003 -827 -1815 -690 1232 1726 301 -1524 -1547 232 1599 1250 -483
3951 -483 -1721 -977 994 1790 646 -1294 -1688 -146 1514 1495 -121 -1716 -1290 673 1819 891 -970
3968 -970 -1785 -537 1320 1608 136 -1546 -1435 333 1720 1158 -652 -1742 -858 1040 1723 472 -1336
3985 -1336 -1627 -51 1612 1362 -350 -1669 -1134 711 1804 784 -1108 -1707 -364 1430 1578 -43
4001 -43 -1571 -1368 354 1723 1055 -869 -1740 -699 1173 1719 349 -1448 -1618 44 1633 1343 -557
4018 -557 -1777 -971 860 1790 716 -1204 -1728 -281 1501 1532 -141 -1577 -1228 528 1796 1032 -958
4035 -958 -1778 -497 1229 1678 217 -1513 -1426 223 1645 1291 -672 -1725 -833 1033 1695 560 -1247
4052 -1247 -1624 -96 1544 1409 -309 -1672 -1183 648 1702 882 -1047 -1763 -454 1350 1540 60
4068 60 -1590 -1383 366 1715 1136 -758 -1825 -783 1135 1712 400 -1462 -1567 64 1573 1345 -357
4085 -357 -1812 -1064 821 1692 659 -1104 -1667 -310 1468 1539 -12 -1611 -1310 593 1719 918 -790
4102 -790 -1700 -653 1205 1673 245 -1449 -1467 177 1649 1221 -471 -1710 -994 922 1799 447 -1160
4119 -1160 -1572 -184 1458 1487 -208 -1610 -1232 620 1744 814 -947 -1702 -564 1287 1631 99 -1526
4136 -1526 -1459 331 1709 1070 -657 -1703 -866 1020 1650 414 -1335 -1453 -37 1515 1383 -336 -1639
4153 -1639 -1105 717 1821 700 -1051 -1563 -321 1312 1578 -36 -1535 -1257 463 1668 1031 -848
4169 -848 -1673 -692 1119 1710 323 -1384 -1515 116 1551 1277 -504 -1760 -957 827 1728 670 -1171
4186 -1171 -1687 -157 1430 1419 -204 -1643 -1234 491 1711 958 -1000 -1760 -486 1231 1561 211 -1438
4203 -1438 -1429 221 1558 1103 -606 -1713 -790 1004 1635 422 -1225 -1596 -35 1557 1333 -304 -1586
4220 -1586 -1087 712 1732 784 -972 -1680 -331 1395 1495 22 -1495 -1350 388 1582 1065 -675
4236 -675 -1708 -695 1142 1659 366 -1301 -1546 34 1642 1287 -458 -1749 -1022 809 1654 626
4252 626 -1087 -1689 -322 1420 1445 -175 -1559 -1269 486 1645 938 -793 -1721 -583 1200 1584 116
4269 116 -1368 -1324 128 1546 1204 -569 -1657 -899 833 1682 473 -1210 -1565 -235 1417 1427 -228
4286 -228 -1542 -1102 642 1773 816 -985 -1589 -516 1273 1625 98 -1514 -1341 393 1632 1131 -719
4303 -719 -1682 -809 1001 1776 396 -1379 -1532 -51 1468 1307 -380 -1685 -1110 705 1722 693 -1066
4320 -1066 -1585 -291 1276 1472 -86 -1557 -1321 500 1576 919 -814 -1647 -598 1112 1591 312
4336 312 -1374 -1509 217 1576 1219 -430 -1656 -874 828 1666 602 -1195 -1612 -101 1422 1390 -125
4353 -125 -1574 -1190 632 1744 886 -922 -1663 -455 1241 1521 185 -1416 -1502 240 1639 1107 -650
4370 -650 -1696 -781 950 1597 482 -1289 -1544 -110 1583 1301 -378 -1512 -1069 701 1656 760 -955
4387 -955 -1645 -400 1306 1377 -74 -1458 -1312 309 1696 1030 -789 -1723 -645 1160 1573 291 -1304
4404 -1304 -1481 64 1547 1235 -449 -1680 -936 844 1733 644 -1050 -1548 -256 1415 1450 -198 -1540
4421 -1540 -1175 487 1681 892 -819 -1650 -577 1174 1611 119 -1415 -1323 207 1497 1176 -515 -1675
4438 -1675 -835 934 1629 463 -1163 -1496 -152 1376 1382 -244 -1694 -1071 643 1589 752 -964 -1617
4455 -1617 -392 1204 1529 79 -1470 -1233 384 1569 969 -674 -1628 -747 1096 1645 341 -1387
4471 -1387 -1456 69 1445 1316 -363 -1668 -1009 831 1671 699 -1132 -1565 -317 1362 1456 -89 -1557
4488 -1557 -1266 515 1594 910 -816 -1618 -540 1220 1555 246 -1364 -1446 191 1593 1144 -582 -1616
4505 -1616 -895 874 1642 561 -1222 -1552 -180 1446 1330 -295 -1516 -1158 608 1690 811 -943
4521 -943 -1675 -480 1225 1498 69 -1464 -1346 322 1689 1073 -695 -1674 -783 976 1635 412 -1260
4538 -1260 -1510 -45 1513 1303 -430 -1507 -1013 645 1645 733 -1030 -1563 -313 1325 1462 -92
4554 -92 -1445 -1202 344 1614 1012 -784 -1631 -543 1051 1540 217 -1290 -1410 60 1519 1213 -522
4571 -522 -1608 -840 805 1646 513 -1070 -1523 -206 1355 1423 -217 -1585 -1100 581 1581 874 -902
4588 -902 -1574 -421 1229 1508 91 -1471 -1352 270 1450 1048 -554 -1656 -750 968 1593 460 -1213
4605 -1213 -1446 -98 1314 1288 -247 -1572 -1043 731 1564 736 -923 -1583 -386 1257 1507 15 -1441
4622 -1441 -1212 446 1507 994 -646 -1599 -713 1063 1525 310 -1206 -1433 47 1459 1220 -378 -1551
4639 -1551 -920 801 1634 558 -1075 -1519 -289 1340 1406 -120 -1541 -1133 506 1592 795 -818 -1554
4656 -1554 -559 1091 1452 208 -1340 -1365 156 1524 1029 -606 -1488 -834 849 1527 494 -1141 -1459
4673 -1459 -105 1448 1287 -303 -1387 -1034 605 1580 739 -908 -1481 -370 1182 1422 36 -1322
4689 -1322 -1288 312 1564 1010 -701 -1508 -593 933 1546 383 -1261 -1393 39 1465 1257 -440 -1517
4706 -1517 -929 673 1546 648 -1091 -1511 -269 1239 1285 -121 -1402 -1142 459 1498 918 -877 -1513
4723 -1513 -536 1056 1443 224 -1275 -1340 120 1437 1152 -483 -1530 -808 816 1457 469 -1098 -1449
4740 -1449 -118 1325 1308 -191 -1471 -1022 623 1518 789 -849 -1538 -363 1191 1450 128 -1335 -1280
4757 -1280 367 1519 966 -632 -1560 -734 1017 1556 340 -1194 -1363 -20 1376 1171 -357 -1539
4773 -1539 -913 745 1533 606 -947 -1508 -308 1251 1274 -70 -1406 -1129 451 1478 878 -681 -1597
4790 -1597 -616 1064 1438 152 -1235 -1331 114 1447 1064 -520 -1506 -855 774 1555 517 -1033 -1449
4807 -1449 -223 1334 1294 -194 -1442 -1015 577 1534 793 -848 -1497 -420 1115 1455 92 -1315 -1261
4824 -1261 250 1511 995 -587 -1506 -672 824 1458 359 -1134 -1379 -56 1313 1199 -317 -1447
4840 -1447 -974 544 1523 657 -915 -1423 -327 1142 1343 50 -1400 -1133 365 1476 961 -712 -1554
4857 -1554 -580 988 1444 313 -1244 -1344 98 1410 1130 -406 -1501 -791 787 1509 601 -1061 -1451
4874 -1451 -135 1246 1333 -93 -1408 -1038 515 1468 809 -795 -1454 -423 1046 1413 203 -1230 -1218
4891 -1218 203 1361 971 -593 -1416 -740 848 1435 419 -1067 -1415 -91 1281 1139 -306 -1406
4907 -1406 -989 615 1493 617 -853 -1461 -369 1170 1348 43 -1320 -1143 343 1502 946 -700 -1419
4924 -1419 -653 996 1441 270 -1132 -1275 32 1352 1126 -369 -1435 -847 719 1504 538 -1006 -1415
4941 -1415 -292 1265 1286 -150 -1289 -1041 418 1447 767 -749 -1408 -528 1027 1373 139 -1202 -1211
4958 -1211 151 1359 1094 -450 -1424 -789 797 1399 350 -1038 -1341 -130 1261 1184 -269 -1408 -922
4975 -922 579 1428 683 -906 -1448 -412 1117 1344 -43 -1372 -1107 323 1406 917 -606 -1453 -616
4992 -616 912 1373 322 -1171 -1231 71 1209 1116 -370 -1391 -899 697 1421 605 -937 -1336 -251
5009 -251 1098 1269 -92 -1343 -1019 500 1412 807 -738 -1398 -517 960 1326 228 -1168 -1238 177
5026 177 1324 1003 -428 -1405 -817 795 1362 464 -1064 -1385 -92 1231 1134 -149 -1281 -999 517
5043 517 1405 756 -843 -1386 -411 1070 1300 122 -1204 -1184 191 1412 872 -519 -1354 -642 758 1341
5061 1341 337 -1078 -1275 19 1240 1014 -357 -1253 -844 585 1422 546 -864 -1298 -251 1104 1235
5078 1235 -111 -1164 -1005 330 1431 834 -736 -1366 -458 898 1319 235 -1115 -1150 83 1260 1016
5095 1016 -456 -1372 -700 724 1382 422 -959 -1269 -109 1124 1145 -182 -1299 -918 482 1325 695
5112 695 -738 -1376 -422 999 1276 92 -1147 -1063 188 1246 949 -503 -1399 -665 782 1250 400 -984
5130 -984 -1197 -38 1072 1077 -249 -1378 -805 567 1244 587 -751 -1265 -298 1053 1176 22 -1201 -1029
5148 -1029 339 1276 813 -591 -1374 -509 893 1306 224 -1029 -1148 20 1232 1010 -300 -1284 -747
5165 -747 724 1316 473 -936 -1244 -232 1048 1105 -94 -1220 -975 436 1267 636 -684 -1320 -455 921
5183 921 1155 155 -1077 -1158 157 1261 806 -492 -1284 -763 720 1312 366 -993 -1163 -5 1208
5200 1208 1028 -238 -1177 -899 574 1316 563 -790 -1258 -259 995 1194 47 -1094 -954 250 1348
5217 1348 848 -575 -1221 -494 820 1337 291 -1046 -1195 58 1175 968 -330 -1260 -762 609 1268
5234 1268 484 -874 -1185 -169 945 1085 -51 -1177 -934 373 1242 746 -723 -1245 -441 791 1163
5251 1163 115 -1092 -1107 110 1208 929 -380 -1239 -601 715 1215 436 -962 -1174 -53 1143 1064
5268 1064 -183 -1197 -822 508 1289 654 -729 -1319 -304 989 1136 53 -1058 -996 267 1212 863
5285 863 -499 -1275 -566 828 1128 264 -936 -1166 24 1084 938 -317 -1195 -794 632 1161 455 -711
5303 -711 -1226 -253 1004 1057 -84 -1157 -852 339 1187 687 -639 -1228 -483 919 1162 123 -983 -1099
5321 -1099 90 1217 843 -396 -1176 -677 664 1222 383 -877 -1085 -60 1039 1099 -156 -1113 -837
5338 -837 439 1258 602 -667 -1138 -353 896 1141 76 -1016 -990 213 1183 824 -438 -1168 -572 671
5356 671 1181 311 -917 -1059 -33 1043 938 -259 -1117 -759 509 1206 494 -798 -1158 -273 886 1029
5374 1029 -17 -1100 -902 267 1158 671 -602 -1190 -459 726 1160 235 -1024 -1056 150 1147 903 -358
5392 -358 -1168 -607 547 1146 429 -796 -1084 -73 983 936 -94 -1071 -771 377 1169 622 -650 -1201
5410 -1201 -346 783 1100 141 -977 -926 199 1108 761 -460 -1228 -563 686 1063 325 -864 -1064 -8
5428 -8 1041 890 -213 -1118 -761 513 1165 527 -718 -1116 -287 909 976 -61 -1069 -903 291 1085
5446 1085 686 -548 -1166 -382 706 1121 166 -859 -971 35 1059 818 -318 -1117 -651 607 1132
5463 1132 365 -744 -1110 -194 963 980 -127 -1016 -821 379 1118 656 -606 -1018 -382 819 1049 125
5481 125 -938 -920 133 999 774 -419 -1180 -512 679 1133 230 -851 -969 -56 958 946 -178 -1068
5499 -1068 -698 487 1106 451 -689 -1031 -252 847 1058 55 -1008 -830 243 1050 668 -509 -1138
5516 -1138 -384 684 992 252 -856 -890 20 928 814 -261 -1086 -604 538 1089 413 -713 -1041 -144
5534 -144 912 914 -55 -1071 -771 364 1105 579 -564 -1032 -346 736 987 137 -883 -937 136 988 742
5553 742 -324 -1067 -571 674 1017 346 -832 -1025 -107 929 831 -203 -983 -691 410 1091 484 -638
5571 -638 -1046 -299 818 955 25 -959 -845 217 1006 572 -393 -1061 -492 698 987 209 -813 -913 44
5590 44 939 799 -265 -983 -645 529 1032 392 -660 -988 -176 855 869 -102 -955 -761 285 981 620
5609 620 -499 -1037 -364 759 944 144 -881 -744 177 1006 757 -423 -1012 -478 499 1043 342 -742
5627 -742 -949 -83 896 877 -161 -925 -627 338 1037 504 -606 -947 -234 768 922 -2 -975 -808 179
5646 179 959 656 -445 -1054 -417 620 942 223 -835 -896 0 950 753 -218 -988 -637 492 1043 422
5665 422 -629 -995 -147 839 892 -65 -928 -758 333 1055 598 -438 -1008 -308 701 963 109 -803 -814
5684 -814 102 953 706 -260 -962 -514 529 976 272 -742 -965 -34 803 740 -166 -983 -723 366 979
5703 979 401 -509 -957 -290 733 881 70 -866 -760 182 937 591 -393 -991 -454 670 966 241 -817
5722 -817 -898 8 886 788 -207 -930 -590 484 952 389 -588 -889 -181 762 860 -91 -883 -708 299 950
5742 950 536 -521 -906 -335 625 954 109 -805 -752 114 869 704 -285 -955 -525 482 957 328 -734
5761 -734 -857 -69 802 817 -183 -933 -625 306 912 447 -584 -941 -249 704 876 49 -885 -748 174 844
5781 844 629 -418 -907 -418 557 907 240 -744 -933 54 850 768 -257 -897 -556 418 907 417 -662
5800 -662 -876 -168 750 817 -6 -846 -704 236 902 555 -424 -952 -351 623 870 175 -751 -812 48 858 645
5821 645 -294 -915 -432 486 879 351 -641 -885 -20 848 738 -100 -887 -690 318 894 386 -542 -886 -258
5841 -258 656 843 45 -796 -748 122 844 578 -326 -892 -385 535 917 248 -572 -807 -59 758 704 -181 -875
5862 -875 -552 408 835 386 -498 -883 -256 637 868 -54 -841 -693 248 900 506 -451 -851 -382 550 877
5882 877 138 -777 -746 68 789 681 -308 -870 -500 404 918 308 -638 -748 -130 752 767 -89 -845 -542 319
5903 319 880 476 -500 -799 -261 602 847 91 -747 -695 168 780 634 -337 -811 -395 505 851 281 -632
5923 -632 -823 -1 734 726 -194 -862 -563 348 820 378 -508 -835 -171 643 756 -26 -797 -687 263 781 580
5944 580 -342 -866 -326 598 809 157 -733 -783 44 764 651 -308 -836 -509 460 817 295 -532 -843 -107
5964 -107 757 690 -25 -730 -613 316 809 499 -422 -866 -207 606 801 74 -647 -710 86 802 534 -327 -861
5985 -861 -461 483 812 240 -624 -746 -41 721 705 -134 -758 -580 318 800 342 -490 -794 -238 671 771
6005 771 -40 -706 -595 214 877 573 -421 -824 -352 503 803 86 -673 -734 16 735 659 -193 -763 -437 380
6026 380 831 285 -545 -757 -114 624 740 -92 -755 -464 222 746 436 -428 -749 -266 542 780 85 -707
6046 -707 -643 118 726 573 -283 -793 -350 409 753 266 -601 -741 -31 643 609 -150 -767 -499 342 814 407
6067 407 -500 -820 -173 596 664 -40 -692 -645 223 733 447 -325 -778 -336 456 725 190 -570 -687 44 743
6088 743 593 -186 -772 -458 425 811 330 -445 -680 -156 630 679 -85 -679 -581 192 767 447 -399 -737 -268
6109 -268 499 723 142 -676 -709 56 738 547 -255 -772 -356 412 737 195 -571 -756 -124 726 619 -111
6129 -111 -723 -522 241 733 389 -409 -743 -171 568 659 49 -689 -600 130 762 535 -317 -714 -356 457 733
6150 733 216 -576 -654 -20 707 619 -179 -763 -461 305 758 324 -479 -705 -100 579 620 -71 -653 -511 223
6171 223 652 377 -330 -749 -251 533 731 53 -597 -630 104 681 505 -194 -692 -406 390 711 214 -550
6191 -550 -617 -7 555 660 -89 -706 -418 282 696 373 -393 -697 -204 579 642 70 -663 -570 155 702 446
6212 446 -245 -735 -288 456 689 187 -512 -641 -27 635 480 -149 -706 -463 402 695 250 -452 -713 -119
6232 -119 589 587 5 -617 -586 234 711 361 -361 -698 -286 505 678 46 -589 -592 89 705 454 -174 -656 -426
6254 -426 373 651 227 -467 -659 -80 632 523 -123 -629 -477 248 687 353 -367 -725 -200 492 579 12
6274 12 -579 -557 54 658 476 -319 -673 -278 391 719 129 -524 -607 -39 583 557 -210 -655 -377 226 693
6295 693 272 -432 -646 -116 515 582 -29 -634 -535 143 633 364 -327 -704 -276 409 696 111 -597 -580 46
6316 46 609 523 -170 -599 -356 298 657 247 -424 -600 -61 563 543 -84 -618 -439 190 638 355 -349 -650
6337 -650 -132 485 611 95 -581 -528 144 630 364 -256 -658 -318 436 634 123 -443 -604 -66 596 443
6357 443 -131 -624 -425 296 598 245 -390 -526 -170 457 547 4 -510 -475 186 582 421 -261 -645 -272 439
6378 439 648 110 -472 -472 73 590 436 -137 -624 -316 307 571 233 -407 -526 -48 484 580 -61 -639 -406
6399 -406 215 651 282 -312 -582 -174 410 563 83 -496 -481 61 573 444 -275 -580 -290 332 639 137
6419 137 -421 -540 -47 535 469 -104 -606 -368 217 609 269 -343 -545 -152 487 581 5 -519 -426 130 597
6440 597 402 -251 -567 -273 324 573 124 -463 -477 48 535 444 -95 -545 -343 273 532 163 -444 -588 -43
6461 -43 435 563 21 -506 -415 232 554 282 -338 -522 -124 349 499 78 -465 -485 24 574 360 -135 -584
6482 -584 -274 326 519 152 -374 -488 -36 456 467 -117 -518 -347 265 526 239 -336 -525 -119 451 483 -12
6503 -12 -494 -436 168 586 307 -195 -557 -211 363 589 102 -457 -508 42 486 416 -186 -559 -333 263 484
6524 484 159 -379 -490 -53 400 454 -46 -507 -380 123 531 293 -304 -523 -210 438 499 41 -429 -425 23
6545 23 553 417 -203 -503 -258 281 504 200 -381 -515 -35 457 472 -91 -487 -291 258 495 271 -251 -494
6566 -494 -60 440 529 -31 -509 -376 154 436 353 -194 -524 -212 295 457 133 -393 -447 1 428 446 -78
6587 -78 -433 -342 236 498 223 -309 -560 -84 321 457 -52 -489 -424 120 510 301 -234 -512 -138 343 447
6608 447 74 -346 -420 100 492 323 -146 -472 -219 317 498 194 -346 -448 31 383 370 -58 -464 -346 202
6629 202 480 222 -313 -469 -106 384 408 8 -431 -406 61 476 301 -203 -460 -232 301 483 101 -403 -386
6650 -386 -13 450 299 -105 -421 -325 257 469 222 -273 -450 -166 402 455 13 -423 -311 94 478 286 -242
6671 -242 -456 -197 338 495 47 -451 -397 68 470 298 -160 -478 -260 251 426 144 -354 -408 -67 373 379
6692 379 -94 -440 -307 183 449 230 -250 -423 -70 336 371 47 -439 -378 53 497 292 -124 -432 -204 216
6713 216 486 105 -362 -377 -26 382 374 -76 -441 -234 145 420 166 -246 -413 -58 373 387 -15 -475 -347
6734 -347 91 355 280 -201 -438 -185 270 377 42 -341 -382 25 383 333 -151 -428 -192 291 416 109 -305
6755 -305 -439 -48 402 339 -70 -382 -322 166 361 258 -244 -377 -107 320 347 39 -338 -333 74 388 302 -149
6777 -149 -413 -218 229 388 101 -313 -358 -10 317 303 -106 -351 -217 214 426 140 -261 -393 -54 325 393
6798 393 -33 -382 -289 128 345 204 -190 -389 -176 270 352 31 -311 -354 63 410 228 -95 -352 -223 135
6819 135 409 161 -300 -339 -40 232 339 -16 -348 -360 119 360 199 -215 -428 -142 251 419 55 -332 -270
6840 -270 -22 382 285 -101 -353 -169 167 357 151 -290 -318 -11 332 232 -29 -368 -227 198 359 206 -249
6861 -249 -326 -58 313 332 25 -296 -255 106 318 208 -164 -363 -129 260 340 64 -264 -306 18 369 244 -82
6883 -82 -371 -180 184 334 141 -289 -282 -55 259 309 -24 -334 -241 149 365 210 -196 -333 -164 288 306 33
6905 33 -298 -263 -3 304 247 -116 -327 -141 175 397 113 -208 -339 -25 318 278 -27 -313 -283 135 361 170
6927 170 -194 -315 -70 259 328 -9 -263 -264 73 324 207 -143 -344 -87 162 355 80 -320 -332 19 307
6948 307 261 -119 -307 -187 159 318 132 -288 -332 -32 258 255 -20 -324 -270 101 330 152 -207 -294 -87 222
6970 222 277 25 -276 -236 68 256 222 -59 -388 -176 181 287 73 -256 -287 -6 263 267 -40 -343 -226 110
6992 110 305 142 -198 -351 -41 232 304 11 -340 -260 142 251 184 -119 -311 -121 179 293 71 -165 -276
7013 -276 -1 267 189 -60 -332 -198 174 261 124 -240 -290 -58 265 282 -16 -233 -155 150 258 216 -136 -266
7035 -266 -88 227 275 -34 -242 -182 91 274 231 -95 -288 -198 150 221 117 -198 -315 -23 223 146 -16 -268
7057 -268 -187 100 291 100 -177 -275 -45 148 215 -9 -269 -194 20 237 148 -106 -318 -117 150 262 44 -215
7079 -215 -218 38 239 247 -82 -327 -221 85 316 128 -147 -255 -13 175 192 26 -270 -166 180 227 153 -143
7101 -143 -241 9 115 279 18 -199 -231 51 217 178 -82 -260 -135 139 281 41 -170 -260 -34 236 233 6
7123 6 -250 -131 168 246 157 -125 -297 -15 200 239 -5 -230 -193 12 275 130 -93 -185 -75 156 234 96 -192
7146 -192 -250 -26 190 197 -85 -202 -177 139 242 107 -107 -238 -86 111 282 -22 -275 -233 125 244 133 -94
7168 -94 -181 -70 172 242 64 -131 -230 -28 243 144 -121 -204 -121 177 208 11 -151 -204 -15 228 181 -34 -162
7191 -162 -144 64 279 165 -123 -170 -100 178 177 15 -185 -159 62 276 151 -90 -185 -73 143 266 45 -182
7213 -182 -166 21 191 151 -9 -222 -171 114 241 78 -189 -196 -21 161 204 -16 -206 -202 43 224 146 -126 -204
7236 -204 -55 120 194 64 -180 -174 53 246 161 -87 -162 -125 135 201 103 -156 -190 59 143 190 -27 -138 -145 100
7260 100 201 88 -87 -193 -68 181 155 -8 -150 -168 85 211 108 -72 -189 -66 116 142 61 -90 -149 14
7282 14 172 164 -6 -189 -153 51 204 63 -112 -199 -22 214 172 -27 -204 -164 38 188 137 -71 -216 -90 161
7305 161 181 16 -170 -130 42 166 144 -67 -216 -144 115 217 65 -129 -138 -14 173 127 -28 -178 -89 52 228
7328 228 61 -116 -174 -35 179 118 20 -162 -129 52 167 118 -51 -198 -34 41 188 50 -134 -177 -7 152
7350 152 137 -39 -182 -68 77 183 53 -119 -182 -9 152 172 14 -180 -95 -10 180 104 -35 -141 -42 113
7372 113 134 48 -190 -111 26 119 106 -61 -159 -59 104 179 106 -136 -196 0 114 133 8 -167 -116 57 216 85
7396 85 -33 -158 -45 119 113 5 -126 -131 27 238 75 -85 -152 -58 70 161 74 -73 -125 23 114 166 -9 -109
7420 -109 -68 109 149 58 -46 -134 -13 126 127 -56 -195 -73 130 95 68 -54 -141 -90 54 105 23 -113 -54 12 150
7445 150 108 -76 -133 -74 84 131 7 -70 -149 11 98 131 -79 -148 -37 39 118 60 -130 -145 62 121 115 -18 -96 -53
7471 -53 20 160 80 -25 -132 -54 114 138 -30 -135 -131 -15 137 95 -35 -68 -65 79 146 44 -51 -151 22 154
7495 154 109 -62 -125 -35 12 161 114 -76 -124 -33 104 73 66 -122 -149 -17 89 93 -65 -118 -80 43 152 53 -100
7520 -100 -56 10 103 46 10 -63 -77 112 127 56 -65 -105 -66 115 68 7 -61 -122 80 40 69 -34 -104 -84 62 76 74
7547 74 -104 -96 -1 101 30 4 -145 -12 89 84 71 -115 -77 -14 79 102 -3 -65 -66 33 119 -1 -54 -124 -62 126 73
7574 73 16 -57 -78 31 124 66 -62 -100 -81 39 72 38 -67 -52 -22 89 76 -24 -121 -35 -3 35 50 -85 -90 37 93
7601 93 66 2 -119 -39 21 76 80 -47 -128 24 94 80 18 -68 -96 27 97 100 -99 -153 -75 24 110 3 -45 -46 -20 60 21
7630 21 -73 -114 -66 34 52 47 -33 -82 -48 13 129 36 -40 -11 -14 90 53 -52 -103 -52 38 119 14 -59 -87 34 83 81 46
7659 46 -101 -50 -7 49 0 -16 -70 -47 68 42 -2 -94 -72 26 15 27 -54 -88 -48 14 113 -15 -33 -26 32 119 35 4 -56
7688 -56 20 69 43 57 15 -47 5 60 24 -9 -79 -34 17 90 71 -46 -76 2 56 11 -10 -94 -32 51 125 63 -24 -95 -44 50
7718 50 56 -12 -16 -6 0 42 -3 -50 -58 -103 41 56 39 -21 8 -52 65 77 -27 -63 -56 28 23 83 -3 -37 18 37 4 -29 -102 -76
7750 -76 37 9 70 6 -60 -1 75 63 -13 -27 -13 -7 68 61 -26 -60 -7 20 82 16 -18 -64 -40 33 66 -10 -51 -67 -17 77 34
7781 34 -21 -43 4 53 55 -3 -2 -93 -19 39 28 -14 -63 -51 8 38 6 18 -21 -56 9 -5 -33 -75 -66 -11 44 -15 -43 -49 -24 42
7813 42 -18 15 -50 -3 48 28 72 -18 16 31 86 96 -10 -16 -45 -40 55 85 5 -55 -8 19 53 -11 -17 -50 3 11 119 -40 -14
7844 -14 17 19 19 19 18 4 19 2 60 -19 -21 -24 13 -19 -12 -7 -17 -1 -68 19 -82 -62 2 -26 31 31 -1 14 -27 -31 27 59 29 -50 6
7879 6 60 13 19 48 12 35 27 43 -11 -57 -44 67 46 51 -27 -17 3 19 -26 -28 -21 33 36 76 34 15 -32 55 39 39 -23 -15 -73 -9
7913 -9 -5 -27 -34 -30 30 34 1 9 -5 6 7 84 12 31 34 -22 30 -17 -16 -25 17 21 -8 51 10 -11 -51 -12 -13 -40 19 2 19 5 7 -37 -1
7950 -1 34 37 -2 48 -40 46 2 -8 -24 -26 -70 -2 20 18 -21 12 -38 -12 -26 6 25 -63 -2 -17 21 62 10 34 17 34 13 -33
7982 -33 -7 41 -39 -36 -1 -12 48 20 -32 11 -18 -21 80 -7 -30 -87 -44 8 -5 -9 28 -24 42 8 -31 -43 -19 -49 -7 16 63
8013 63 -1 2 42 -1 87 19 -4 15 -24 -6 2 25 -22 10 -36 14 8 7 -30 -59 -49 28 5 -21 -19 -16 -61 -23 44 -24 7 -17 57
8046 57 22 -2 -21 -18 19 5 39 13 -59 -31 3 23 28 11 -32 -34 -18 54 -23 -16 -13 30 -10 63 -25 28 8 7 -3 -2 -11 -30 94 31
8080 31 1 -9 -23 57 -5 13 25 -7 33 3 18 7 -18 -1 -42 3 55 -69 -28 -50 -1 5 0 -38 10 -19 -26 20 -17 -36 -55
8111 -55 -20 49 -6 -67 -46 8 28 30 7 -41 -30 13 -9 56 7 16 -40 3 60 -35 -17 40 3 35 -37 80 -50 -13 6 -14
8141 -14 52 16 5 -35 50 -51 -54 -23 20 20 49 28 -34 -78 18 49 19 35 89 -5 28 8 61 -27 -46 7 26 53 27 -35 -19
8172 -19 -29 46 -8 -7 -25 -56 4 34 9 -8 -21 4 -3 40 -27 5 2 -47 39
8191C9
$$ Imaginary data points
##PAGE= N=2
##DATA TABLE= (X++(I..I)), XYDATA
0 0 0 0 0 0 0 0 0 0 0 0 0 0 0 0 0 0 0 0 0 0 0 5 -6 6 -8 8 -8 8 -8 11 -14 16 -16 20 -21 22 -27 29 -31 36 -39 42 -48
43 -48 52 -57 64 -70 77 -83 92 -102 113 -124 139 -153 171 -192 216 -246 284 -329 394 -476 594
64 594 -772 1067 -1615 2851 -6802 44416 268617 169954 -110468 -224451 -118264 81213 207760
77 207760 107581 -157864 -261579 -37374 217018 178061 -51295 -191312 -138864 50324
87 50324 203863 133143 -107282 -224893 -70071 157335 187370 15881 -160105 -170185 8567
98 8567 192001 150680 -68197 -192833 -92046 104458 187521 73395 -122002 -183324 -21531
109 -21531 178224 160386 -41691 -170659 -108966 53477 163898 101246 -93865 -195435 -60772
120 -60772 145635 159787 -13230 -145143 -118492 14419 144926 131053 -51627 -183904 -81491
131 -81491 118939 161873 23891 -113963 -127512 -19080 127167 146065 -25102 -174695 -100230
142 -100230 83389 146934 50073 -86244 -136528 -46488 110852 149144 -3738 -151234 -102893
153 -102893 52279 128704 74165 -54029 -136943 -67902 91812 143114 15135 -123923 -108431
164 -108431 14597 107994 96073 -22247 -133267 -86331 73506 140581 41559 -88887 -109417
175 -109417 -16434 95739 118060 5395 -127093 -102447 50828 130118 56751 -65281 -115520
186 -115520 -49773 75403 124684 22734 -116523 -110934 27614 116047 71119 -35619 -106926
197 -106926 -70234 56648 127557 41422 -96792 -111498 2126 95648 80841 -10308 -99416
208 -99416 -89897 34429 124603 56963 -75345 -107402 -19980 78216 94298 16206 -88372 -99491
220 -99491 18622 119033 68507 -54504 -101153 -41728 55885 99536 34221 -81462 -106949
231 -106949 814 104270 74832 -31745 -91193 -60308 34022 103195 53524 -68336 -106792
242 -106792 -14739 85977 80282 -6237 -79874 -76598 12736 101444 68179 -53877 -103158 -28458
254 -28458 66814 84113 18254 -67252 -86484 -2504 97134 78712 -37104 -95784 -40538 47140
266 47140 83553 36997 -56850 -94625 -17919 85262 80923 -21636 -88195 -54496 26194 80453
278 80453 52629 -45446 -98830 -30508 73314 83036 -2075 -75457 -65741 8441 79390 68192
290 68192 -30851 -97614 -40647 60409 82974 17425 -59856 -75006 -9413 75342 78356 -17112
302 -17112 -91917 -49864 43746 78434 33964 -43429 -81345 -27006 67223 82747 -4253 -82110
314 -82110 -58264 23872 71033 47614 -27992 -84276 -42446 56462 83271 8050 -68829 -63730
326 -63730 4850 64731 60437 -13063 -82129 -52149 46410 83226 21627 -53080 -66204 -12216
338 -12216 58756 71470 116 -77687 -60047 32317 78631 33381 -38663 -69360 -30505 48512
350 48512 77313 10641 -71618 -65708 15638 70316 44805 -23004 -69424 -44952 38036 80472
362 80472 21608 -61192 -66620 -136 59257 54783 -6533 -66357 -55350 26690 79190 31905
374 31905 -47645 -63804 -13658 47603 63358 10184 -60444 -61304 16168 74550 40705 -33633
386 -33633 -61952 -27987 34148 66913 22071 -56512 -67869 3375 65174 46948 -19425 -60086
398 -60086 -40647 23364 69851 33918 -48090 -68578 -6246 55890 53142 -2940 -55681 -51441
410 -51441 12545 68540 41844 -38407 -67635 -17871 42882 55876 12990 -48394 -59301 2462
422 2462 65242 48837 -24480 -61825 -27909 29864 57131 26585 -40700 -65652 -9153 57082
434 57082 50481 -13367 -57198 -39603 15907 56565 36959 -32242 -67100 -17241 50701 54246
446 54246 1290 -47389 -46227 5811 57491 46444 -22886 -65486 -25700 40459 54267 12405
458 12405 -39902 -54123 -7056 54194 52208 -14201 -61530 -33392 29018 54366 25031 -29852
470 -29852 -57941 -18121 49271 56124 -5348 -55331 -40615 13894 50047 34141 -21736 -60476
482 -60476 -28456 40925 56510 4138 -45293 -43529 1098 46904 45048 -10796 -58000 -34031
494 -34031 32314 55380 14303 -35241 -47212 -13003 40544 51259 -3364 -56311 -40016 21258
506 21258 52187 24961 -24609 -49537 -22603 37122 57904 6414 -50195 -42446 11287 48775
518 48775 35138 -14945 -52079 -32034 29685 57749 13281 -43922 -45706 -722 41785 42466 -4225
531 -4225 -50294 -37817 22553 56363 22172 -33232 -45657 -11303 33676 46694 5698 -47780
543 -47780 -44701 12121 50197 27182 -23830 -46417 -22492 24812 49258 15336 -42292 -47512
555 -47512 4892 45760 33585 -11333 -43622 -30965 18317 51681 22819 -36712 -49268 -3601
567 -3601 38701 37458 -230 -41291 -39672 12023 53004 29366 -28165 -46802 -11114 32175 42882
580 42882 11894 -36813 -45379 5361 50593 32879 -19586 -44837 -22044 21693 44251 19186
592 19186 -33499 -49571 -3251 44113 35242 -9598 -40432 -30549 12465 45314 26218 -27304
604 -27304 -49367 -11176 36001 37134 -39 -35898 -37537 3076 43997 31817 -20431 -47129
616 -47129 -17659 28885 40403 10722 -29127 -40368 -3603 43161 38322 -12347 -43926 -23409
628 -23409 20245 40663 19010 -24305 -44560 -12437 38016 40729 -6019 -40495 -28765 10243
640 10243 39205 27662 -17631 -45681 -18190 32790 42075 2538 -33525 -32269 25 36048
652 36048 34695 -11228 -45495 -23174 24909 39759 10434 -25938 -35590 -9019 32555 39498 -4538
665 -4538 -42508 -26304 16959 36919 18639 -18480 -38786 -16839 28427 40998 976 -38766
677 -38766 -30312 7755 33528 25780 -11531 -40617 -22469 24875 42007 8156 -31991 -32356 358
690 358 31428 32282 -4040 -39955 -27210 19807 40916 14129 -25180 -34424 -8010 27051 35829
703 35829 2743 -37308 -31228 13184 38245 19418 -17017 -34445 -15877 21925 37871 8749
715 8749 -33345 -34126 5637 33793 23304 -9149 -33803 -23618 16369 39317 14006 -28455 -34829
728 -34829 -1204 29371 27935 -728 -31819 -29465 11590 40194 18432 -22971 -34283 -8674
740 -8674 23582 31658 6323 -30442 -34316 5802 38380 22013 -16449 -32996 -16261 17219 34952
753 34952 13318 -27302 -36372 -60 34485 25857 -8335 -30424 -22708 10799 36413 19163 -22976
766 -22976 -36260 -5902 28571 28745 -109 -27307 -27573 4448 35527 23790 -17531 -34891 -11363
779 -11363 21675 30109 7547 -23776 -31192 -1655 32903 27048 -11790 -33064 -16610 14503 30418
792 30418 14455 -20338 -34367 -7190 29588 29421 -5632 -30621 -21428 7715 30307 21111 -15864
805 -15864 -36034 -11656 25833 30695 1293 -26247 -25184 1273 29212 26339 -10653 -35609 -15596
818 -15596 20570 30095 7968 -20750 -28398 -5212 27002 29465 -5259 -33180 -19219 14020 28306
831 28306 14223 -15002 -30864 -11306 23978 30710 -359 -29455 -22640 7029 26572 19588 -9737
844 -9737 -32044 -16107 20997 31584 4731 -24533 -24701 753 25150 24519 -4354 -31448 -20151
857 -20151 16834 31181 9413 -19473 -26713 -6461 22169 27816 356 -29895 -23775 11092 29668
870 29668 14179 -13503 -27309 -13020 18569 30416 5188 -26754 -25793 4664 26527 18483 -7567
883 -7567 -27270 -18690 14069 31248 9267 -22689 -26179 -1295 22833 22682 -1143 -25775 -22234
896 -22234 10192 31338 13448 -17759 -25779 -6894 18577 25815 4120 -24774 -25483 5527 29363
909 29363 16768 -12937 -25646 -12397 14239 28087 9147 -22733 -27053 1438 26617 20076
921 20076 -7011 -24666 -17130 9762 28869 13540 -19707 -27872 -3321 22126 22078 -656 -22882
934 -22882 -21305 5151 28242 17479 -14930 -27186 -7750 17107 23475 5650 -20233 -24744 420
947 420 25998 19790 -10256 -26164 -12660 11816 23991 11010 -17378 -27134 -3465 23956 21955
960 21955 -4583 -23654 -16429 7418 24759 15798 -13838 -28128 -7168 21029 22861 503 -20919
973 -20919 -20360 2489 24467 19443 -9982 -27715 -10819 17188 23564 6040 -16972 -22960 -2432
986 -2432 23198 21975 -5855 -25921 -14672 11483 22748 10597 -13286 -25196 -7794 20363
998 20363 23186 -1783 -22952 -17607 5755 21971 15280 -9011 -25538 -11597 17519 24083 2481
1011 2481 -19243 -19686 92 20647 19038 -5579 -25329 -14836 13643 24097 6712 -15625 -21257
1024 -21257 -4724 19178 22263 -1829 -24048 -17086 9518 23508 11046 -11755 -22323 -9272
1036 -9272 16558 24205 1858 -21850 -18736 4653 21641 15237 -7105 -22265 -12826 13457 25062
1049 25062 6181 -18462 -19691 -124 18786 18374 -2457 -22043 -16517 9190 24008 9418 -14964
1062 -14964 -20710 -5302 15104 20493 1894 -21020 -19017 5690 22429 12475 -10446 -20887 -9650
1075 -9650 12041 22175 5784 -19490 -20799 2211 20143 15131 -5557 -20492 -13706 9356 23338
1088 23338 9513 -16265 -21177 -1171 17809 17765 -214 -19172 -16832 6522 23131 12393 -12457
1101 -12457 -21166 -5720 14244 19231 4055 -17489 -19502 2575 21318 14458 -8015 -20222 -10041
1114 -10041 10553 20119 7877 -14925 -20963 -1249 19060 16078 -3929 -18897 -13758 6561 20359
1127 20359 10967 -12287 -21738 -4908 16618 17455 12 -17028 -16573 2913 20290 13888 -9487
1140 -9487 -21527 -8023 13639 18426 3770 -14706 -18669 -938 19631 16306 -6548 -20286 -10579
1153 -10579 9817 18898 8078 -11856 -19910 -4285 17980 18005 -2863 -17946 -12873 5234 18595
1166 18595 12008 -9136 -20509 -7275 14981 18480 944 -15422 -15192 745 17748 15097 -6513
1179 -6513 -20288 -9557 11538 18452 4887 -12997 -17200 -2912 16370 17005 -3728 -19618 -11951
1192 -11951 7728 17891 8561 -10578 -18712 -6072 14543 18327 -422 -17991 -13971 4267 17251
1205 17251 11911 -7365 -19267 -8795 12394 19131 3232 -15559 -15534 815 15846 14585 -3576
1218 -3576 -18908 -11526 9676 18951 6369 -12385 -16460 -2883 13687 16546 62 -17801 -13796
1231 -13796 6756 17910 9061 -8640 -16899 -6805 11617 17915 2935 -16308 -15404 3492 16350
1244 16350 11298 -5092 -17122 -10397 9664 18837 5196 -14364 -16274 -49 14641 13579 -1732
1257 -1732 -17020 -13339 7443 18958 7374 -11522 -16635 -3895 12604 15660 1371 -16051 -15277
1270 -15277 4476 17976 9716 -7970 -16327 -7589 9967 17242 4468 -14138 -16197 1178 16359
1283 16359 12167 -4336 -15562 -10578 7118 17876 7385 -11847 -16679 -2104 14192 13972 -925
1296 -925 -14500 -12893 3981 17719 10009 -9582 -16836 -5029 11482 15183 2331 -13350 -15026
1309 -15026 1011 16965 12100 -7090 -16566 -7678 8467 15810 5999 -11826 -16506 -1514 15582
1322 15582 13737 -3783 -15302 -10080 5188 15990 9263 -9692 -17395 -4058 13303 14453 -193
1335 -193 -13580 -12424 1850 15535 11839 -7149 -17261 -6290 10424 14728 3598 -11444 -14401
1348 -14401 -1059 14679 13507 -4417 -16452 -8578 7487 14616 6728 -9348 -15906 -3622 13489
1361 13489 14470 -1642 -15053 -10694 4622 14472 9454 -6983 -16625 -6022 11945 15147 1109
1374 1109 -13130 -12479 1499 13924 11623 -4445 -16532 -8461 9756 15238 3766 -10694 -13733
1387 -13733 -1959 12738 13530 -1756 -15639 -10488 6837 14729 6404 -7831 -14431 -5338 11042
1400 11042 14822 610 -14230 -11922 3618 13664 8884 -4960 -14596 -8124 9226 15663 2845
1413 2845 -12233 -12654 392 12547 11265 -2438 -14503 -10275 7259 15807 5127 -10069 -13164
1426 -13164 -2620 11050 13304 100 -13997 -11722 4920 15320 7415 -7513 -13315 -5548 9060
1439 9060 14691 2706 -12929 -12796 2151 13789 9465 -4476 -13275 -8277 6565 15177 5333 -11240
1453 -11240 -13354 -532 11743 11211 -1260 -12687 -10504 4302 15063 7401 -9039 -13671 -3178
1466 -3178 9542 12342 1682 -12027 -12362 2134 14277 8983 -6623 -13517 -5627 7361 13041
1479 13041 4428 -10891 -13617 290 13217 10254 -3772 -12843 -7988 5142 13615 6956 -9080
1492 -9080 -14299 -1952 11663 11353 -616 -11629 -10267 2776 13633 9026 -6838 -14280 -4242
1505 -4242 9505 11853 2378 -9960 -12106 138 13038 10521 -4539 -13610 -6578 6886 12182
1518 12182 5094 -8135 -13371 -2375 11890 11463 -2192 -12418 -8536 4031 12112 7365 -6377
1531 -6377 -14002 -4623 10517 12123 -19 -10983 -10139 1344 11990 9383 -4663 -14006 -6489 8530
1545 8530 12593 2475 -9154 -11333 -1385 11267 11174 -2534 -13240 -8020 6050 12401 5108 -6967
1559 -6967 -12011 -3957 10000 12542 -312 -11943 -9215 3301 11764 7598 -4518 -12323 -6204 8329
1573 8329 13235 1970 -10408 -10099 541 10536 9612 -2447 -12577 -8106 6375 12971 3829 -8792
1587 -8792 -10940 -2072 9145 11031 -463 -12413 -9364 4480 12390 5825 -6626 -11460 -4478 7781
1601 7781 12151 1640 -11453 -10408 2400 11311 7721 -3971 -11520 -6635 6262 12699 3912 -9703
1615 -9703 -11050 112 10038 9325 -1169 -11111 -8575 4442 12576 5910 -7483 -11349 -2374 8355
1629 8355 10440 1407 -10160 -10099 2471 12049 7255 -5259 -11190 -4687 6530 11081 3568 -9058
1643 -9058 -11344 469 11122 8306 -3209 -10790 -6964 4591 11418 5351 -7894 -12023 -1516
1656 -1516 9863 9140 -864 -9875 -8790 2549 11633 6950 -6323 -11875 -3444 8072 9838 1604
1670 1604 -8687 -10302 418 11331 8378 -4309 -11098 -5389 5729 10496 4186 -7127 -11037
1683 -11037 -1517 10389 9427 -2001 -9987 -7016 3393 10697 6220 -5721 -11393 -3403 8783 10035
1697 10035 114 -9021 -8505 1201 10408 7799 -4292 -11388 -5002 6932 10484 2265 -7952 -9572
1711 -9572 -819 9621 9166 -2683 -11150 -6474 4927 10323 4180 -6526 -10380 -2888 8453 10153
1725 10153 -683 -10491 -7657 2891 9769 6275 -4437 -10680 -4710 7177 10761 1366 -8985
1738 -8985 -8418 751 8953 8031 -2202 -10740 -6252 5733 10756 3270 -7196 -9153 -1468 7970 9410
1753 9410 -450 -10432 -7498 4202 10192 4880 -5248 -9772 -3558 7124 10244 1054 -9643 -8435
1767 -8435 2325 9449 6398 -3351 -10072 -5432 5981 10514 2621 -8264 -9199 97 8567 7742 -1554
1782 -1554 -9843 -7151 4310 10379 4189 -6434 -9649 -2240 7347 8825 531 -8975 -8414 2416
1796 2416 10102 5804 -4487 -9481 -4226 5857 9589 2444 -7815 -9229 476 9402 7053 -2647
1810 -2647 -8965 -5853 4199 10036 4184 -6683 -9663 -1177 8352 7934 -768 -8399 -7299 2468 10155
1825 10155 5642 -5555 -9686 -2866 6683 8655 1230 -7766 -8586 694 9674 6794 -3892 -9249
1839 -9249 -4428 4756 9138 3388 -6725 -9356 -886 8632 7666 -1875 -8535 -6007 2830 9262 5184
1854 5184 -5492 -9611 -2453 7177 8328 287 -7716 -7340 1093 8952 6553 -3995 -9537 -3881 5610
1869 5610 8677 2194 -6768 -8250 -368 8314 7509 -2301 -9250 -5174 4207 8661 3895 -5553 -8952
1884 -8952 -1976 7473 8264 -640 -8486 -6311 2570 8409 5391 -3945 -9270 -3599 6363 8615 1136
1899 1136 -7367 -7322 621 7740 6750 -2184 -9208 -5040 4963 8674 2780 -5776 -8026 -1390 7004
1914 7004 7786 -655 -8684 -6196 3272 8327 4145 -4232 -8530 -3269 6134 8410 687 -7805 -7029
1929 -7029 1614 7855 5514 -2709 -8566 -4703 5175 8827 1961 -6649 -7498 -206 7224 6682 -1286
1944 -1286 -8253 -5882 3804 8713 3335 -5307 -7809 -2017 6188 7687 221 -7698 -6705 2277 8426
1959 8426 4766 -3685 -7824 -3645 5048 8367 1899 -6892 -7341 539 7615 5956 -1974 -7577 -5034
1974 -5034 3589 8549 3312 -5862 -7703 -944 6474 6765 -399 -7289 -6159 2228 8378 4441 -4669
1989 -4669 -7890 -2438 5260 7374 1173 -6836 -7093 953 7965 5410 -3228 -7675 -3667 3956 7726
2004 7726 2836 -5971 -7706 -336 7110 6187 -1514 -7183 -5121 2598 7844 4270 -4742 -8038 -1665
2019 -1665 6026 6748 462 -6434 -6198 1185 7604 5424 -3298 -7869 -3020 4706 7100 2041 -5550
2034 -5550 -7116 -213 7134 6028 -2018 -7450 -4243 3402 7145 3335 -4521 -7655 -1518 6503 6556
2049 6556 -756 -6867 -5329 1947 7013 4462 -3601 -7941 -2779 5508 6825 541 -5973 -6209 382
2064 382 6784 5454 -2340 -7704 -3871 4333 7060 2089 -4783 -6729 -1157 6255 6454 -1031 -7139
2079 -7139 -4836 2785 6935 3551 -3485 -6990 -2588 5491 7118 210 -6339 -5439 1264 6603 4786
2094 4786 -2355 -7073 -3701 4466 7299 1402 -5444 -5976 -222 5994 5721 -1278 -7048 -4625 3363
2109 3363 7147 2520 -4525 -6348 -1654 5107 6456 -107 -6726 -5363 2009 6711 3684 -3263 -6600
2124 -6600 -3018 4142 6925 1237 -5986 -5868 690 6052 4842 -1658 -6526 -4092 3120 7109 2564
2139 2564 -4967 -6246 -583 5269 5678 -110 -6194 -4992 2085 6897 3578 -3729 -6356 -1829 4419
2154 4419 6197 1155 -5673 -5807 1236 6565 4266 -2520 -6266 -3052 3382 6447 2223 -5162 -6412
2169 -6412 121 5872 4847 -1310 -6014 -4284 2333 6553 3147 -4205 -6643 -1159 5004 5269 143
2184 143 -5439 -5389 1172 6493 4054 -3124 -6456 -2408 3961 5758 1497 -4709 -6007 -27 6221 4804
2200 4804 -1846 -5962 -3534 2850 5998 2759 -3859 -6367 -1073 5513 5373 -720 -5481 -4376 1639
2215 1639 6061 3731 -3088 -6334 -2076 4731 5732 406 -4867 -5002 403 5792 4573 -2290 -6322
2230 -6322 -3029 3611 5776 1573 -4157 -5566 -881 5247 5312 -1148 -6060 -3785 2376 5649 2776
2245 2776 -3182 -5969 -2070 4541 5837 16 -5461 -4438 1034 5350 3960 -2093 -6066 -2961 3753
2260 3753 6020 1065 -4607 -4884 -136 4883 4922 -1083 -6057 -3603 2990 5852 2197 -3592 -5271 -1240
2276 -1240 4460 5485 -147 -5746 -4204 1943 5449 3120 -2577 -5580 -2330 3776 5731 834 -5080
2291 -5080 -4820 805 5027 3928 -1515 -5579 -3393 2943 5738 1875 -4170 -5295 -469 4433 4534
2306 4534 -331 -5304 -4299 1904 5674 2729 -3134 -5358 -1636 3725 5031 800 -4755 -4970 940
2321 940 5472 3451 -2069 -5220 -2646 2888 5350 1824 -4167 -5306 93 5015 3955 -1065 -4838
2336 -4838 -3569 2010 5637 2508 -3519 -5378 -877 4327 4453 -7 -4404 -4333 1043 5525 3245 -2653
2352 -2653 -5214 -1956 3234 4962 1237 -3982 -4930 64 5156 3913 -1680 -4911 -2923 2255 5149
2367 5149 2189 -3460 -5204 -886 4434 4377 -622 -4603 -3734 1242 5068 3112 -2697 -5226 -1681 3669
2383 3669 4710 432 -4156 -4141 372 4761 3739 -1914 -5180 -2393 2922 4856 1427 -3494 -4551
2398 -4551 -519 4408 4320 -977 -4968 -2991 1949 4712 2384 -2701 -4880 -1474 3829 4721 -48 -4510
2414 -4510 -3652 979 4411 3280 -1762 -5134 -2294 3223 4819 884 -3814 -4089 -44 4096 3945 -865
2430 -865 -4993 -2937 2495 4708 1836 -2937 -4512 -1074 3718 4389 -163 -4670 -3537 1607 4491
2445 4491 2473 -2103 -4682 -1909 3227 4621 519 -4077 -3915 641 4224 3188 -1337 -4661 -2694
2460 -2694 2619 4730 1330 -3446 -4258 -341 3849 3825 -430 -4357 -3382 1785 4740 2103 -2616 -4357
2476 -4357 -1375 3236 4267 409 -4003 -3915 849 4559 2860 -1800 -4301 -2255 2563 4643 1278
2491 1278 -3559 -4181 59 4121 3367 -940 -4064 -2902 1778 4699 2032 -2955 -4262 -760 3481
2506 3481 3856 -94 -3892 -3516 966 4536 2579 -2394 -4295 -1501 2710 4155 812 -3606 -3971 247
2522 247 4180 3155 -1513 -4202 -2275 1867 4339 1807 -3083 -4245 -582 3653 3616 -488 -3955 -2978
2538 -2978 1244 4292 2574 -2317 -4367 -1226 3087 3951 564 -3490 -3549 463 4039 3150 -1532 -4246
2554 -4246 -1910 2382 4036 1311 -2963 -3967 -300 3770 3499 -819 -4094 -2615 1699 3978 2028
2569 2028 -2365 -4289 -1067 3279 3721 10 -3734 -3214 854 3818 2666 -1672 -4356 -1833 2731
2584 2731 3927 775 -3128 -3673 -104 3583 3278 -948 -4171 -2547 1975 3997 1586 -2410 -3923
2599 -3923 -956 3272 3691 -148 -3759 -2944 1272 3929 2278 -1742 -3959 -1640 2842 3980 532
2614 532 -3383 -3342 385 3732 2848 -1128 -3974 -2287 2220 4042 1104 -2797 -3542 -464 3234 3353
2630 3353 -453 -3783 -2893 1441 3941 1811 -2215 -3767 -1253 2716 3802 250 -3514 -3235 666
2645 666 3734 2491 -1498 -3771 -2001 2073 3934 1064 -3042 -3501 -64 3326 3080 -675 -3653 -2588
2661 -2588 1530 3961 1764 -2487 -3615 -720 2868 3488 130 -3464 -3010 913 3852 2264 -1819
2676 -1819 -3635 -1330 2285 3600 854 -3066 -3335 314 3529 2724 -1087 -3606 -2026 1732 3676
2691 3676 1463 -2664 -3668 -362 3077 3060 -278 -3369 -2734 1091 3648 2043 -2009 -3790 -1107 2591
2707 2591 3340 435 -2994 -3264 377 3545 2571 -1258 -3644 -1825 2029 3486 1204 -2533 -3541 -295
2723 -295 3302 2911 -675 -3422 -2260 1433 3536 1776 -2009 -3620 -903 2948 3166 -12 -3011 -2761
2739 -2761 691 3478 2307 -1482 -3548 -1522 2413 3344 617 -2633 -3167 -151 3283 2853 -940 -3539
2755 -3539 -2153 1636 3398 1336 -2135 -3412 -898 2823 3193 -361 -3343 -2546 843 3304 1996
2770 1996 -1562 -3509 -1498 2423 3396 387 -2893 -2811 217 3157 2612 -1029 -3496 -1862 1915 3465
2786 3465 1055 -2374 -2998 -417 2811 3010 -456 -3360 -2239 1303 3347 1684 -1904 -3202 -1037
2801 -1037 2394 3361 254 -3078 -2677 658 3164 2240 -1222 -3312 -1636 1894 3384 926 -2726 -2997
2817 -2997 -16 2788 2636 -517 -3236 -2345 1314 3402 1471 -2092 -3216 -741 2424 2943 171 -3071
2833 -3071 -2765 824 3249 1871 -1509 -3185 -1314 1979 3152 722 -2698 -3037 327 3050 2260 -848
2849 -848 -3110 -1916 1533 3295 1337 -2329 -3152 -249 2684 2611 -149 -2847 -2407 981 3354 1767
2865 1767 -1768 -3134 -983 2178 2932 520 -2600 -2845 376 3168 2174 -1164 -3041 -1609 1636 3118
2881 3118 1067 -2202 -3104 -266 2874 2597 -578 -2861 -2124 1076 3180 1600 -1765 -3062 -868 2386
2897 2386 2824 -5 -2637 -2522 446 3055 2030 -1387 -3140 -1294 1879 2978 566 -2337 -2726 -103
2913 -103 2818 2546 -823 -3037 -1749 1399 2977 1255 -1862 -2939 -736 2510 2865 -195 -2833 -2142
2929 -2142 859 2861 1897 -1340 -3170 -1208 2133 2980 317 -2466 -2476 150 2687 2385 -869 -3177
2945 -3177 -1624 1669 2969 965 -2040 -2839 -399 2441 2712 -342 -3042 -2102 1200 2834 1512 -1549
2961 -1549 -2950 -895 2197 2853 227 -2689 -2316 598 2696 1921 -999 -2975 -1470 1769 3002 682
2977 682 -2279 -2687 -23 2486 2310 -431 -2911 -2015 1262 2968 1310 -1874 -2829 -625 2226 2605
2993 2605 154 -2638 -2418 739 2957 1641 -1315 -2811 -1313 1825 2840 709 -2324 -2719 246
3008 246 2741 2021 -726 -2696 -1744 1299 3018 1070 -2050 -2740 -292 2390 2401 -231 -2553 -2148 857
3025 857 3047 1516 -1632 -2780 -854 1898 2555 423 -2378 -2503 276 2789 1980 -1164 -2757 -1502
3041 -1502 1443 2823 934 -2089 -2761 -304 2547 2319 -526 -2692 -1914 893 2867 1499 -1691 -2902
3057 -2902 -742 2169 2610 40 -2425 -2231 417 2774 1937 -1179 -2813 -1069 1757 2705 583 -2096
3073 -2096 -2412 -4 2557 2235 -721 -2817 -1531 1307 2650 1236 -1702 -2731 -609 2253 2472 -228
3089 -228 -2600 -1953 787 2545 1620 -1281 -2875 -1080 1925 2638 326 -2320 -2354 132 2386 2036 -787
3106 -787 -2931 -1544 1510 2637 858 -1863 -2590 -362 2277 2362 -252 -2685 -1845 990 2652 1351
3122 1351 -1332 -2619 -909 1969 2593 227 -2338 -2151 524 2558 1717 -900 -2634 -1359 1630 2691
3138 2691 651 -2005 -2400 -109 2297 2078 -395 -2560 -1776 1183 2673 1068 -1563 -2563 -691 1958
3154 1958 2439 112 -2364 -2164 609 2572 1550 -1193 -2556 -1275 1557 2592 507 -2135 -2362 82
3170 82 2426 1917 -674 -2527 -1590 1111 2706 1028 -1844 -2539 -387 2119 2196 -222 -2290 -1903 750
3187 750 2622 1436 -1409 -2418 -772 1710 2387 335 -2094 -2120 252 2523 1845 -938 -2423 -1188
3203 -1188 1347 2564 875 -1878 -2405 -208 2171 2100 -360 -2451 -1760 802 2458 1363 -1497 -2615
3219 -2615 -662 1879 2231 162 -2187 -2133 367 2428 1677 -1080 -2567 -1168 1479 2307 681 -1896
3235 -1896 -2318 -92 2196 1960 -555 -2513 -1534 1048 2364 1125 -1499 -2444 -535 2051 2176 -75
3251 -75 -2252 -1807 674 2361 1522 -1061 -2472 -948 1720 2309 395 -1913 -2105 50 2281 1876 -619
3268 -619 -2465 -1378 1275 2384 886 -1582 -2350 -442 2027 2169 -252 -2283 -1822 731 2344 1237
3284 1237 -1209 -2410 -929 1709 2297 163 -2083 -2033 268 2253 1592 -870 -2383 -1260 1353 2331
3300 2331 615 -1760 -2168 -191 2029 1945 -416 -2258 -1549 938 2366 1135 -1424 -2243 -653 1739
3316 1739 2257 115 -2085 -1872 445 2278 1499 -967 -2276 -1072 1408 2372 591 -1850 -2101 46
3332 46 2128 1835 -489 -2264 -1459 929 2393 1014 -1613 -2226 -428 1797 2006 -91 -2169 -1755 578
3349 578 2317 1350 -1175 -2339 -784 1384 2140 399 -1922 -2019 305 2079 1550 -728 -2201 -1208 1119
3366 1119 2254 845 -1629 -2145 -168 1925 1847 -188 -2137 -1616 778 2232 1219 -1237 -2223 -655
3382 -655 1619 2016 287 -1840 -1921 351 2196 1565 -806 -2304 -1126 1305 2162 712 -1581 -2117 -91
3399 -91 1993 1791 -431 -2139 -1391 858 2174 997 -1322 -2250 -543 1748 2016 35 -1897 -1720 448
3416 448 2147 1354 -940 -2203 -945 1461 2146 401 -1685 -1940 32 1943 1703 -594 -2179 -1224
3432 -1224 1090 2122 817 -1403 -2051 -474 1772 1963 -219 -2033 -1584 617 2115 1211 -1038 -2164
3448 -2164 -806 1542 2102 243 -1793 -1752 163 1998 1589 -697 -2186 -1182 1177 2112 648 -1507
3464 -1507 -1920 -301 1787 1876 -358 -2096 -1365 837 2082 1022 -1200 -2063 -611 1569 2007 120
3480 120 -1964 -1710 450 1931 1371 -826 -2114 -989 1188 2089 585 -1736 -1934 -39 1778 1623
3496 1623 -387 -2174 -1378 885 2114 966 -1330 -2097 -430 1618 1849 86 -1945 -1774 555 2101
3512 2101 1219 -1028 -2049 -843 1323 2005 462 -1707 -1928 228 1966 1496 -537 -1963 -1206 1019
3528 1019 2061 832 -1433 -1951 -184 1745 1705 -162 -1828 -1583 649 2066 1025 -1163 -2050 -672
3544 -672 1449 1913 259 -1709 -1860 252 2036 1292 -808 -2001 -1128 1064 2082 626 -1538 -2005
3560 -2005 -227 1809 1613 -374 -1919 -1458 734 2037 978 -1267 -2042 -625 1543 1894 -13 -1769
3576 -1769 -1627 318 2036 1373 -873 -2030 -844 1234 2015 421 -1501 -1762 -47 1845 1613 -492
3592 -492 -1981 -1081 960 1901 801 -1230 -1927 -462 1587 1812 -118 -1895 -1430 473 1921 1238 -926
3609 -926 -2047 -791 1368 1939 223 -1693 -1680 93 1814 1548 -584 -2119 -1129 1071 1973 623 -1380
3626 -1380 -1916 -301 1627 1746 -277 -1921 -1385 676 1854 988 -1041 -1914 -580 1431 1850 180
3642 180 -1714 -1555 398 1805 1231 -702 -1929 -988 1168 1905 517 -1437 -1714 -35 1697 1571 -254
3659 -254 -1860 -1294 859 1918 838 -1111 -1842 -430 1447 1749 105 -1820 -1576 471 2012 1125
3675 1125 -855 -1823 -861 1126 1887 415 -1545 -1779 61 1789 1284 -511 -1827 -1209 916 1936
3691 1936 700 -1281 -1858 -300 1539 1571 -147 -1659 -1505 566 1927 1014 -1047 -1844 -619 1283
3707 1283 1761 244 -1562 -1634 177 1826 1273 -728 -1799 -982 945 1917 656 -1317 -1749 -157 1692
3724 1692 1563 -307 -1741 -1226 569 1963 1041 -1140 -1917 -475 1415 1736 38 -1618 -1496 248
3740 248 1812 1304 -869 -1873 -852 1112 1771 369 -1447 -1724 -65 1633 1453 -490 -1886 -1078
3756 -1078 814 1778 807 -1168 -1828 -369 1448 1538 -104 -1736 -1296 472 1750 1124 -809 -1917 -693
3773 -693 1211 1748 317 -1455 -1563 113 1649 1385 -465 -1856 -1079 1110 1788 674 -1199 -1794 -261
3790 -261 1572 1655 -203 -1721 -1248 700 1785 932 -965 -1886 -580 1393 1714 155 -1647 -1614 259
3807 259 1719 1172 -612 -1843 -956 1082 1793 453 -1374 -1650 -56 1507 1430 -312 -1762 -1214 756
3824 756 1849 725 -1084 -1687 -498 1408 1653 107 -1569 -1440 406 1849 1106 -766 -1770 -791
3840 -791 1128 1819 380 -1433 -1606 26 1734 1404 -481 -1727 -1101 804 1884 676 -1292 -1759
3856 -1759 -267 1468 1568 -96 -1672 -1357 497 1848 1077 -995 -1766 -612 1209 1636 281 -1507
3872 -1507 -1526 163 1652 1293 -652 -1758 -938 890 1752 606 -1309 -1763 -194 1561 1482 -291 -1679
3889 -1679 -1217 621 1770 968 -1030 -1806 -455 1340 1632 84 -1607 -1488 266 1721 1245 -745
3905 -745 -1825 -804 1098 1673 456 -1356 -1707 -26 1624 1425 -348 -1778 -1068 838 1788 791 -1085
3922 -1085 -1759 -415 1446 1579 -91 -1647 -1354 421 1645 1003 -788 -1796 -685 1225 1631 231
3938 231 -1388 -1567 93 1570 1371 -484 -1813 -1007 956 1775 591 -1132 -1662 -271 1503 1579 -171
3955 -171 -1681 -1224 543 1729 922 -908 -1764 -632 1344 1700 80 -1516 -1468 240 1660 1209 -620
3972 -620 -1774 -894 1020 1825 397 -1313 -1611 -143 1547 1419 -347 -1667 -1155 625 1758 829 -1087
3989 -1087 -1633 -426 1281 1677 -34 -1655 -1386 360 1726 1106 -797 -1751 -726 1064 1720 456
4005 456 -1482 -1518 116 1566 1427 -411 -1712 -1110 768 1813 752 -1206 -1746 -255 1443 1547 -108
4022 -108 -1634 -1344 464 1757 976 -930 -1749 -536 1156 1634 292 -1480 -1536 226 1674 1187 -557
4039 -557 -1725 -890 849 1678 545 -1313 -1697 -74 1557 1362 -254 -1620 -1197 660 1741 829 -1020
4056 -1020 -1711 -409 1296 1580 232 -1512 -1455 341 1686 1149 -674 -1770 -843 1122 1658 371 -1366
4073 -1366 -1610 -52 1609 1331 -401 -1727 -1112 772 1733 742 -1094 -1729 -403 1424 1546 -170 -1631
4090 -1631 -1316 496 1670 983 -813 -1693 -729 1201 1637 216 -1356 -1413 31 1590 1284 -532 -1682
4107 -1682 -990 874 1690 586 -1148 -1615 -213 1497 1539 -195 -1611 -1199 580 1723 944 -900 -1730
4124 -1730 -531 1230 1680 130 -1544 -1414 211 1613 1245 -662 -1730 -870 988 1680 505 -1319
4140 -1319 -1507 -162 1521 1405 -377 -1659 -1121 706 1687 767 -1073 -1719 -408 1248 1541 -18 -1582
4157 -1582 -1315 372 1623 1021 -714 -1752 -677 1109 1638 305 -1401 -1504 130 1525 1330 -459
4173 -459 -1697 -973 835 1672 696 -1159 -1597 -226 1432 1465 -54 -1615 -1302 571 1712 878 -854
4190 -854 -1733 -558 1208 1551 234 -1466 -1478 273 1615 1146 -556 -1704 -890 949 1630 481 -1288
4207 -1288 -1597 -61 1463 1301 -307 -1605 -1208 642 1673 732 -1072 -1631 -440 1248 1509 52
4223 52 -1441 -1402 275 1639 998 -714 -1607 -775 1017 1656 356 -1322 -1518 4 1587 1282 -415
4240 -415 -1624 -1013 750 1786 747 -1052 -1640 -314 1471 1459 -37 -1541 -1230 455 1749 989 -870
4257 -870 -1678 -592 1089 1533 220 -1359 -1402 96 1515 1201 -566 -1689 -921 895 1603 535 -1207
4274 -1207 -1588 -199 1408 1423 -230 -1613 -1123 584 1651 913 -927 -1677 -473 1247 1585 58 -1503
4291 -1503 -1344 292 1618 1221 -649 -1733 -736 1026 1687 476 -1275 -1540 19 1492 1422 -352 -1693
4308 -1693 -1077 766 1635 725 -1012 -1655 -323 1323 1510 -7 -1520 -1268 442 1572 1015 -688 -1739
4325 -1739 -736 1066 1578 186 -1330 -1411 100 1435 1175 -431 -1702 -1000 863 1636 555 -1141
4341 -1141 -1610 -196 1361 1387 -108 -1573 -1242 602 1703 858 -860 -1639 -564 1206 1684 182 -1480
4358 -1480 -1423 251 1637 1094 -603 -1665 -929 924 1743 417 -1237 -1518 -66 1483 1365 -299 -1519
4375 -1519 -1123 681 1744 777 -1020 -1550 -385 1239 1493 3 -1511 -1347 354 1653 1000 -816
4391 -816 -1595 -710 1004 1640 345 -1313 -1534 -4 1522 1232 -516 -1659 -924 719 1669 694 -1190
4408 -1190 -1603 -247 1413 1416 -154 -1539 -1261 400 1640 990 -919 -1660 -574 1127 1546 251 -1423
4425 -1423 -1390 138 1535 1221 -570 -1685 -765 879 1569 593 -1203 -1576 -119 1441 1388 -222 -1585
4442 -1585 -1052 570 1657 874 -924 -1660 -481 1210 1481 59 -1424 -1362 297 1569 1083 -619 -1707
4459 -1707 -742 1083 1583 361 -1223 -1506 -47 1494 1295 -338 -1686 -1027 813 1698 689 -968
4475 -968 -1588 -342 1426 1508 -125 -1547 -1217 429 1595 972 -727 -1631 -686 1107 1626 201 -1346
4492 -1346 -1412 98 1551 1175 -511 -1635 -940 893 1682 502 -1142 -1535 -214 1345 1390 -180 -1542
4509 -1542 -1124 613 1668 833 -889 -1515 -513 1144 1570 125 -1484 -1338 260 1616 1042 -661
4525 -661 -1531 -845 948 1717 427 -1330 -1490 -22 1482 1316 -326 -1558 -1078 646 1683 729 -1061
4542 -1061 -1511 -328 1192 1458 5 -1539 -1337 409 1624 911 -828 -1544 -609 979 1516 352 -1335
4559 -1335 -1467 138 1447 1204 -438 -1564 -906 799 1570 659 -1126 -1591 -148 1357 1407 -124 -1480
4576 -1480 -1217 542 1623 894 -870 -1636 -433 1214 1497 167 -1351 -1316 219 1531 1142 -550 -1677
4593 -1677 -814 978 1538 443 -1190 -1603 -150 1431 1279 -348 -1581 -1090 629 1572 726 -902 -1650
4610 -1650 -426 1258 1436 -27 -1383 -1248 320 1586 1004 -689 -1578 -661 1067 1538 344 -1216
4626 -1216 -1422 -20 1483 1176 -380 -1569 -962 802 1545 663 -982 -1515 -307 1316 1425 -120 -1471
4643 -1471 -1208 514 1563 908 -826 -1585 -590 1101 1587 221 -1348 -1259 117 1422 1094 -515 -1574
4660 -1574 -883 852 1584 491 -1176 -1446 -147 1324 1270 -183 -1516 -1083 605 1575 732 -987 -1549
4677 -1549 -424 1085 1465 72 -1453 -1281 268 1524 1004 -661 -1579 -733 950 1543 368 -1258
4693 -1258 -1469 38 1414 1236 -338 -1600 -952 678 1601 721 -1023 -1483 -257 1298 1384 -3 -1440
4710 -1440 -1184 550 1559 847 -774 -1543 -571 1046 1430 290 -1297 -1329 156 1429 1070 -475 -1549
4727 -1549 -861 804 1537 496 -1129 -1467 -185 1278 1179 -216 -1507 -1128 513 1527 676 -868 -1519
4744 -1519 -509 1148 1422 74 -1317 -1302 276 1523 976 -600 -1508 -726 927 1572 338 -1106 -1416
4761 -1416 -32 1468 1288 -355 -1462 -979 649 1532 699 -983 -1484 -340 1256 1444 -96 -1354
4777 -1354 -1205 357 1492 927 -764 -1493 -650 998 1437 158 -1260 -1306 24 1402 1126 -537 -1539
4794 -1539 -849 762 1518 538 -1079 -1415 -276 1260 1332 -194 -1451 -1079 472 1535 797 -829 -1560
4811 -1560 -454 1067 1458 122 -1344 -1221 250 1448 1120 -532 -1534 -708 859 1479 398 -1116
4827 -1116 -1410 -9 1305 1267 -221 -1451 -918 678 1435 728 -849 -1449 -329 1152 1387 43 -1327
4844 -1327 -1158 411 1375 975 -616 -1520 -627 1023 1451 362 -1216 -1331 74 1324 996 -428 -1508
4861 -1508 -910 727 1523 568 -985 -1417 -231 1260 1297 -116 -1373 -1121 466 1563 762 -776 -1519
4878 -1519 -480 1084 1408 156 -1205 -1285 147 1404 993 -496 -1472 -781 837 1491 411 -1073 -1318
4895 -1318 -114 1276 1237 -241 -1396 -975 530 1490 732 -864 -1380 -431 1184 1328 35 -1325 -1140
4912 -1140 300 1422 945 -672 -1454 -648 933 1464 314 -1210 -1301 -9 1306 1105 -384 -1416 -926
4929 -926 649 1462 546 -1001 -1397 -223 1141 1284 -87 -1313 -1091 409 1450 911 -763 -1444 -435
4946 -435 982 1400 244 -1194 -1215 115 1309 1063 -488 -1415 -728 773 1415 520 -1039 -1336 -151
4963 -151 1241 1174 -226 -1384 -982 547 1376 699 -828 -1461 -345 1123 1306 46 -1211 -1240 247
4980 247 1411 954 -625 -1485 -639 859 1380 333 -1097 -1324 33 1257 1129 -326 -1415 -854 669
4997 669 1416 615 -866 -1417 -291 1205 1233 -87 -1323 -1110 377 1421 801 -670 -1427 -492 955
5014 955 1387 208 -1130 -1215 70 1328 957 -391 -1409 -811 767 1391 423 -1021 -1298 -174 1184
5031 1184 1218 -193 -1274 -1030 545 1460 685 -796 -1384 -452 1088 1379 93 -1241 -1162 222 1373
5048 1373 921 -563 -1378 -694 767 1381 338 -1115 -1250 -37 1261 1116 -237 -1287 -913 583 1388
5065 1388 553 -841 -1348 -379 1027 1217 -18 -1265 -1043 280 1307 832 -654 -1316 -605 860 1305
5082 1305 232 -1132 -1206 143 1217 1013 -391 -1397 -734 723 1314 484 -939 -1306 -93 1158 1135
5099 1135 -114 -1253 -982 459 1345 750 -780 -1361 -393 966 1207 159 -1179 -1156 167 1298 929
5116 929 -449 -1400 -582 709 1274 464 -954 -1312 -104 1190 955 -257 -1333 -892 501 1286 625
5133 625 -772 -1315 -347 1032 1107 34 -1141 -1107 228 1256 866 -602 -1381 -523 920 1271 225 -1025
5151 -1025 -1233 -9 1245 999 -351 -1363 -798 658 1314 518 -857 -1252 -246 1141 1154 -119 -1195
5168 -1195 -991 365 1323 746 -658 -1239 -491 865 1280 165 -1018 -1080 104 1188 943 -413 -1262
5185 -1262 -745 642 1281 387 -951 -1164 -145 1086 1118 -221 -1282 -873 465 1305 572 -788 -1265
5202 -1265 -396 927 1172 -33 -1234 -1048 286 1196 809 -538 -1328 -520 792 1322 230 -1045 -1102
5219 -1102 12 1070 1043 -285 -1282 -768 663 1297 549 -860 -1183 -211 1026 1139 -103 -1140 -969
5236 -969 399 1288 788 -605 -1256 -423 877 1213 162 -1082 -1122 108 1142 873 -391 -1326 -717 666
5254 666 1220 349 -921 -1244 -153 1114 1046 -161 -1188 -894 462 1236 602 -666 -1329 -351 1021 1093
5272 1093 43 -1074 -1011 247 1293 831 -559 -1231 -545 742 1251 343 -903 -1158 6 1176 1012
5289 1012 -282 -1202 -721 542 1283 502 -740 -1226 -214 1019 1038 -65 -1062 -951 263 1244 657 -597
5307 -597 -1258 -488 854 1153 152 -1003 -1098 42 1143 924 -486 -1236 -659 573 1181 427 -886 -1137
5325 -1137 -202 1057 1090 -193 -1222 -852 413 1186 639 -662 -1212 -414 863 1165 79 -1054 -922
5342 -922 175 1140 895 -436 -1203 -519 676 1209 342 -863 -1032 -65 1031 979 -172 -1195 -777 523
5360 523 1185 532 -748 -1173 -258 903 1100 59 -1130 -935 304 1157 744 -486 -1195 -500 816 1186
5378 1186 197 -948 -1047 88 1063 839 -312 -1197 -668 606 1163 433 -818 -1167 -145 987 1017 -44
5396 -44 -1156 -892 373 1161 573 -603 -1099 -359 850 1062 115 -1008 -1018 204 1141 729 -373 -1147
5414 -1147 -592 660 1152 325 -866 -1113 -19 1083 903 -193 -1103 -716 478 1195 565 -737 -1118
5431 -1118 -242 885 1001 -17 -1041 -910 184 1112 712 -525 -1140 -471 795 1129 195 -916 -1033
5448 -1033 26 1073 882 -298 -1076 -665 546 1127 401 -759 -1023 -260 915 981 -72 -1029 -836 324
5466 324 1089 604 -545 -1112 -369 792 1042 153 -948 -951 98 1122 725 -380 -1097 -534 651 1065
5484 1065 361 -791 -1097 -23 990 878 -213 -1064 -696 410 1098 557 -691 -1146 -290 874 994
5501 994 93 -1015 -898 235 1038 712 -522 -1108 -432 707 1089 235 -834 -954 75 985 855 -246
5519 -246 -1049 -646 525 1087 400 -684 -1052 -190 880 895 -35 -994 -758 361 1011 622 -520 -1074 -402
5538 -402 759 999 141 -916 -926 119 1026 780 -345 -1002 -637 590 1057 301 -759 -983 -120 957
5556 957 969 -162 -1037 -712 397 1058 529 -583 -1025 -314 811 1003 67 -908 -848 194 1022 631 -381
5575 -381 -985 -463 605 1040 262 -771 -965 -37 896 824 -269 -979 -672 428 1039 441 -688 -991 -224
5594 -224 791 972 -23 -973 -759 299 935 595 -539 -1092 -342 683 1009 142 -867 -881 83 990 788
5613 788 -386 -1068 -533 495 977 376 -733 -991 -44 863 867 -109 -962 -742 384 991 553 -560 -1033
5632 -1033 -235 764 896 33 -896 -839 179 999 641 -391 -991 -465 621 961 320 -813 -980 56
5650 56 921 742 -231 -987 -638 423 951 389 -666 -989 -145 860 826 -72 -891 -792 282 996 529 -457
5670 -457 -989 -369 674 978 139 -844 -888 32 930 686 -356 -966 -501 454 961 335 -687 -864 -129
5689 -129 828 849 -104 -896 -687 371 1042 458 -537 -986 -266 716 963 62 -849 -767 178 956 673 -394
5709 -394 -952 -488 523 995 227 -723 -912 -23 890 736 -245 -961 -636 402 936 360 -635 -935 -184
5728 -184 773 915 -41 -925 -681 194 947 547 -515 -996 -350 638 934 134 -823 -788 58 931 722 -288
5748 -288 -965 -567 533 990 377 -692 -894 -135 765 821 -99 -871 -628 358 910 525 -560 -999 -279
5767 -279 746 884 125 -842 -821 100 891 621 -386 -987 -447 551 933 238 -734 -909 -33 769 677 -171
5787 -171 -947 -637 390 987 372 -581 -918 -212 771 841 77 -808 -789 250 927 506 -413 -901 -374 591
5807 591 861 127 -816 -829 92 870 650 -279 -863 -516 442 996 349 -613 -877 -161 742 775 -125 -853 -675
5828 -675 289 994 541 -487 -911 -284 659 827 111 -765 -763 119 872 601 -382 -931 -442 521 940 247
5848 247 -653 -829 -74 777 759 -167 -907 -612 331 952 411 -562 -834 -200 621 774 -12 -858 -667 163
5868 163 846 561 -408 -888 -318 569 871 230 -720 -752 69 774 706 -174 -816 -420 449 907 393 -558 -839
5889 -839 -159 722 765 -65 -843 -683 277 843 468 -411 -901 -264 635 829 93 -712 -732 126 771 581 -357
5910 -357 -839 -478 438 802 256 -573 -807 -41 709 711 -131 -833 -562 365 855 398 -458 -851 -209 676 793
5931 793 -29 -775 -641 201 882 534 -369 -835 -345 547 801 167 -704 -736 52 824 631 -204 -840 -541
5951 -541 432 870 288 -576 -834 -84 748 710 -75 -755 -666 256 839 441 -431 -852 -330 503 767 113 -720
5972 -720 -693 52 783 539 -267 -751 -468 393 767 282 -604 -783 -111 688 708 -186 -712 -510 240 770 359
5993 359 -545 -802 -145 669 723 16 -744 -640 196 764 575 -380 -827 -349 501 792 171 -639 -728 46 743
6014 743 633 -198 -805 -444 396 756 341 -562 -778 -74 692 714 -13 -757 -600 253 737 479 -328 -844
6034 -844 -256 567 746 97 -671 -661 85 738 508 -269 -812 -444 401 765 296 -594 -788 -22 696 604 -134
6055 -134 -798 -517 294 792 349 -428 -782 -215 610 750 7 -692 -610 138 742 498 -349 -797 -421 488
6075 488 770 135 -632 -668 19 704 603 -186 -766 -435 399 775 279 -494 -713 -142 619 670 -62 -665 -563
6096 -563 235 788 420 -404 -816 -305 497 749 71 -617 -664 57 739 524 -237 -827 -387 375 749 248
6116 248 -551 -693 -91 690 591 -99 -676 -492 252 755 360 -464 -743 -207 500 679 67 -658 -604 157 751
6137 751 513 -300 -730 -347 418 720 226 -569 -690 25 677 565 -115 -709 -465 278 730 337 -453 -727
6157 -727 -103 571 718 -53 -664 -539 142 667 431 -363 -746 -228 511 690 142 -633 -641 65 684 518 -214
6178 -214 -793 -396 374 684 241 -526 -698 -144 620 590 -122 -700 -522 246 780 365 -416 -763 -198 553
6198 553 618 80 -613 -573 159 694 445 -267 -692 -324 400 698 196 -463 -605 -27 640 612 -133 -669 -371
6219 -371 291 702 324 -424 -612 -99 569 656 -54 -589 -488 212 716 414 -281 -696 -321 433 652 75
6239 75 -613 -628 -11 653 492 -219 -731 -412 336 692 260 -472 -676 -75 599 614 -92 -603 -479 200 710
6260 710 390 -366 -649 -210 474 694 114 -603 -527 104 693 481 -287 -632 -270 422 695 206 -520 -615 31
6281 31 643 532 -121 -661 -391 300 672 307 -431 -698 -180 481 604 19 -650 -523 189 625 445 -325
6301 -325 -614 -249 371 660 135 -542 -609 49 576 443 -163 -650 -353 326 642 230 -409 -597 -222 481
6321 481 501 -62 -622 -471 277 663 368 -327 -602 -232 458 645 89 -541 -513 175 567 440 -199 -611 -284
6342 -284 411 644 158 -472 -567 -52 609 517 -119 -670 -376 284 697 285 -309 -623 -191 545 550 -21 -527
6363 -527 -479 122 669 372 -346 -609 -216 405 623 76 -475 -650 -50 508 458 -238 -593 -353 223 605 232
6384 232 -433 -592 -116 553 522 -71 -568 -399 179 584 368 -330 -574 -164 432 593 78 -533 -471 58 597
6405 597 438 -214 -571 -368 376 616 185 -454 -607 5 535 471 -126 -559 -401 268 602 275 -368 -632
6425 -632 -152 449 496 35 -552 -491 142 511 387 -232 -626 -226 373 534 114 -474 -538 67 548 453 -103
6446 -103 -621 -342 281 573 167 -355 -598 -95 489 523 -57 -588 -398 184 591 260 -282 -597 -172 440
6466 440 551 77 -477 -508 32 534 414 -188 -561 -340 320 570 147 -416 -516 -61 503 489 -74 -434 -366
6487 -366 196 589 297 -299 -507 -146 431 544 31 -485 -440 109 563 390 -217 -570 -235 293 561 29
6507 29 -462 -494 -8 474 418 -141 -524 -381 269 574 215 -347 -496 -132 475 456 -13 -511 -413 130 517 307
6529 307 -292 -495 -203 339 484 61 -484 -434 80 464 391 -132 -563 -294 340 586 188 -368 -442 -18 450
6550 450 413 -27 -517 -328 225 497 236 -331 -533 -127 410 458 31 -482 -408 95 460 334 -258 -538 -199
6571 -199 280 525 170 -389 -473 34 427 358 -123 -513 -298 203 453 216 -310 -456 -123 419 410 43 -479
6592 -479 -409 99 456 324 -255 -470 -215 356 463 105 -395 -528 67 483 318 -135 -515 -252 206 500
6612 500 152 -320 -443 -61 441 401 -94 -502 -319 204 476 213 -255 -552 -165 312 468 -20 -420 -378 102
6633 102 469 352 -173 -455 -210 298 495 97 -339 -415 -49 468 371 -162 -468 -306 239 536 127 -292 -402
6654 -402 -148 398 396 -50 -388 -315 32 486 225 -251 -420 -187 365 442 124 -367 -428 84 389 347 -148 -484
6676 -484 -239 281 495 172 -310 -418 -48 429 378 6 -398 -304 171 448 270 -268 -460 -155 326 411 105
6697 105 -398 -376 86 427 276 -105 -471 -234 293 451 152 -315 -386 -70 333 322 -104 -402 -334 133 457
6718 457 218 -295 -446 -97 249 371 -12 -381 -340 112 420 309 -174 -419 -152 307 408 94 -380 -331 27
6739 27 434 271 -108 -393 -254 179 513 115 -302 -385 -66 360 373 -41 -408 -324 89 393 213 -246 -400
6760 -400 -129 295 386 6 -339 -379 18 451 275 -190 -407 -274 164 419 101 -327 -354 -57 340 355 -63
6781 -63 -393 -294 208 444 76 -255 -380 -94 313 340 -21 -375 -277 78 349 245 -149 -365 -141 243 408
6802 408 63 -352 -297 51 368 297 -155 -397 -238 231 348 208 -258 -337 1 310 322 -61 -338 -286 96 332
6824 332 233 -199 -365 -138 296 389 69 -325 -330 95 375 322 -122 -394 -184 203 375 111 -268 -407 -55 328
6846 328 279 -82 -408 -223 176 364 155 -192 -406 -58 324 246 44 -346 -328 102 329 220 -118 -396 -134
6867 -134 212 401 53 -243 -364 24 278 337 -57 -376 -234 104 382 127 -232 -354 -85 265 250 -68 -317
6888 -317 -273 70 342 210 -184 -311 -170 155 309 68 -347 -273 -21 307 192 -131 -423 -163 194 393 60
6909 60 -271 -306 -41 281 272 -56 -310 -221 82 359 195 -175 -302 -20 305 332 43 -347 -284 111 337 218
6931 218 -149 -320 -135 226 318 80 -315 -294 -38 295 315 -160 -366 -215 133 310 157 -254 -350 -89 226
6952 226 310 -21 -313 -244 90 300 207 -136 -373 -105 178 336 34 -246 -295 -2 304 216 -105 -317 -131 235
6974 235 327 101 -270 -281 -20 265 237 -58 -307 -222 132 244 175 -173 -348 -87 230 290 71 -265 -229 44
6996 44 319 213 -72 -350 -122 198 296 86 -244 -238 11 279 281 -32 -212 -195 63 308 56 -168 -237 -70 275
7019 275 244 -56 -275 -229 93 276 228 -147 -283 -95 232 308 -13 -215 -260 11 309 149 -81 -266 -149 131
7041 131 212 110 -206 -275 -26 245 201 -73 -287 -169 89 294 191 -238 -258 -102 236 229 56 -242 -205 67
7063 67 279 135 -93 -254 -147 176 171 61 -218 -240 55 265 217 -125 -303 -155 119 312 113 -168 -267 -43
7085 -43 194 230 -42 -270 -213 23 292 149 -194 -268 -54 149 278 103 -240 -232 44 251 172 -47 -265 -93
7107 -93 101 292 83 -169 -216 -4 229 223 -11 -273 -163 90 253 139 -103 -246 -114 164 246 1 -239 -262
7129 -262 83 241 144 -111 -251 -107 180 289 91 -157 -285 10 219 203 -64 -296 -127 75 248 75 -150
7150 -150 -248 -78 171 250 -9 -189 -167 9 260 182 -117 -255 -75 166 231 60 -161 -193 22 211 157 -74
7172 -74 -215 -127 81 223 84 -175 -291 -16 188 139 -42 -233 -230 111 319 118 -161 -186 -118 164 214 -41 -170
7195 -170 -153 84 177 131 -74 -246 -77 100 209 22 -199 -233 29 181 206 -27 -215 -148 145 249 109 -164
7217 -164 -214 -68 115 177 25 -192 -113 87 164 136 -85 -239 -84 142 186 39 -192 -139 4 149 184 -40 -223
7240 -223 -103 81 240 118 -97 -168 -15 168 155 8 -161 -156 63 229 86 -101 -216 -72 137 187 -19 -155
7262 -155 -199 11 148 56 -101 -182 -112 187 194 61 -145 -207 -28 176 167 -29 -162 -72 36 184 94 -96 -186 -59
7286 -59 181 181 -9 -103 -84 19 209 147 -87 -205 -70 150 165 40 -114 -160 37 134 152 -80 -219 -98 73
7309 73 190 96 -147 -186 -41 198 103 -55 -131 -138 42 193 101 -111 -92 -67 124 194 -34 -184 -173 36 188 77
7333 77 -81 -114 -111 71 163 28 -161 -156 15 153 129 -8 -182 -127 37 166 70 -114 -215 -4 109 136 15 -157
7357 -157 -154 33 145 119 -62 -151 -52 85 165 36 -98 -180 -14 199 103 -34 -163 -101 112 167 75 -102 -154 -56
7381 -56 194 112 -27 -172 -80 85 188 77 -99 -107 -53 164 124 15 -87 -172 27 159 70 -59 -124 -110 116 152
7405 152 33 -127 -230 -33 158 107 -57 -174 -105 32 128 54 -142 -148 -30 142 119 22 -137 -112 79 201 89
7428 89 -28 -113 -68 85 128 16 -149 -108 -53 85 136 -40 -122 -99 104 69 12 -122 -149 -6 129 186 -29 -154
7452 -154 -62 37 150 28 -97 -112 -54 115 146 -7 -126 -114 38 90 88 -81 -131 -23 98 67 21 -68 -156 -22 164
7477 164 78 -67 -140 -48 97 134 80 -60 -128 14 112 95 22 -62 -63 44 178 60 -43 -181 -11 85 130 -1 -106
7502 -106 -103 -21 116 119 -67 -149 -94 48 128 78 -106 -138 37 53 98 -27 -126 -104 -5 74 66 -107 -73 -32 118 128 -4
7529 -4 -133 -33 36 123 79 -35 -115 -90 78 120 9 -93 -144 -58 95 111 -35 -91 -73 17 112 -10 -56 -141 -48 76
7555 76 63 -27 -125 -44 -44 99 72 -103 -117 -43 93 107 15 -69 -79 15 117 60 -10 -24 -38 64 99 32 -83 -101 -24 87
7583 87 87 -57 -76 -46 32 88 17 -77 -62 -11 120 142 -11 -146 -112 38 120 13 -55 -98 -6 52 110 19 -11 -55 7 94
7611 94 63 -2 -101 -37 27 133 72 -67 -80 -19 58 86 -11 -107 -61 14 134 60 -76 -61 -80 85 58 -38 -82 -92 -26 121
7639 121 83 -70 -132 61 86 104 -12 -24 -122 -32 69 34 -9 -81 -72 39 111 10 -45 -71 14 42 68 21 -75 -1 18
7666 18 38 46 -41 -72 -37 106 78 15 -74 -86 1 37 65 -54 -71 50 36 73 -2 -57 -87 -13 72 43 -30 -66 -79 3 86
7695 86 6 -48 -30 -44 75 5 -33 -43 -8 -13 46 35 -16 -69 -19 65 68 7 -70 28 -42 24 82 -57 -53 -32 30 108 48 -18 -89
7726 -89 0 92 61 -28 -23 -53 19 47 46 -35 -62 -19 27 4 -48 20 -92 -12 71 11 -36 -107 -20 -14 54 16 -22 6 6 99 18 26
7758 26 -61 -50 -10 -3 18 -48 -56 9 60 132 -10 -90 -18 -37 26 15 -8 -18 -45 29 15 1 -28 -14 -9 22 92 -69 -28 -17 28
7789 28 1 -16 -53 -80 -7 53 46 -52 -42 -22 16 16 93 -45 -49 -51 20 77 59 -65 -32 -20 9 41 -25 -13 14 81 43 5 -33
7820 -33 -69 58 60 12 56 -68 -16 -10 39 28 13 -27 -10 44 58 -20 20 -6 -6 -14 44 -65 -23 -29 2 30 -21 -35 -66 5 10 51
7852 51 -30 11 -19 72 37 17 20 -5 50 1 24 28 5 -23 2 24 -3 8 8 -74 -1 8 -23 -4 -39 -31 44 -2 -49 -17 2 9 41
7885 41 17 -25 -47 25 51 5 -20 -5 17 4 7 60 -17 -28 22 24 42 10 2 -66 21 65 -50 -22 -11 33 38 8 12 -1 13 65
7917 65 5 14 -6 -50 -40 1 55 -47 -50 -37 9 22 -9 -23 -5 -30 23 12 36 -24 -67 58 2 12 59 -47 33 3 9 -10
7947 -10 -10 -51 -12 1 51 2 -50 0 1 30 18 -19 -23 47 -6 -10 -24 -19 14 -6 43 -1 -4 -5 11 7 -8 -14 -5 9 -3 -37 -46 0 37 -1
7983 -1 -6 29 22 -20 -34 50 28 -10 -10 -3 -12 28 41 11 30 14 34 -6 44 -38 -13 -16 -25 43 -61 -15 4 -9 17 44 8 30 -82
8016 -82 7 -7 -33 -7 -37 33 -24 48 15 -16 -8 -30 28 -9 22 -29 39 34 36 -13 -13 -19 9 1 47 -45 10 34 40 13 8 24 55 26
8050 26 38 -25 15 1 12 -15 20 -38 -66 -5 -1 9 -19 -11 -3 30 -20 0 32 80 -15 -28 83 28 -18 -17 21 4 -50 -40 30 1
8082 1 -11 4 -2 -53 -25 -28 5 46 -30 -9 18 33 28 21 -25 -18 -17 48 77 -16 43 25 -11 -13 24 -43 22 32 25 25 -10 -10 -23 35 16 16
8118 16 -30 -21 47 16 58 83 -15 -56 -33 17 6 -12 5 -18 -17 60 38 -18 -17 1 24 35 9 -18 -14 4 38 39 -49 8 14 65 66 7
8152 7 -11 -58 2 29 28 9 -36 -4 31 18 27 -4 -56 19 14 -3 -36 8 -65 74 7 5 -17 -73 38 35 58 30 2 -29 -12 -18 5
8185 5 6 -20 14 -20 55 8
8191H
##END NTUPLES=NMR FID
##END=
