##TITLE=1H_Ser 7-4-i-2
 CDCl3,8 sc, 
 23.9.2021
##JCAMPDX= 6.0         $$ Bruker NMR JCAMP-DX V2.0
##DATA TYPE= NMR FID
##DATA CLASS= NTUPLES
##ORIGIN= UXNMR, Bruker Analytische Messtechnik GmbH
##OWNER= root
$$ XWIN-NMR		Version 3.5
$$ Thu Sep 23 09:06:42 2021 Russian Standard Time (UT+4h)  she@DPX200
##.OBSERVE FREQUENCY= 200.1314
##.OBSERVE NUCLEUS= ^1H
##.DELAY= (6, 6)
##.ACQUISITION MODE= SIMULTANEOUS
##.ACQUISITION SCHEME= undefined
##.AVERAGES= 8
##.DIGITISER RES= 18
##SPECTROMETER/DATA SYSTEM= spect
##.PULSE SEQUENCE= zg30
##.SOLVENT NAME= CDCl3
##.SHIFT REFERENCE= (INTERNAL, CDCl3, 0, 15.7039)
##AUDIT TRAIL= $$ (NUMBER, WHEN, WHO, WHERE, WHAT)
$$ ##TITLE= Audit trail, XWIN-NMR		Version 3.5
$$ ##JCAMPDX= 5.01
$$ ##ORIGIN= Bruker BioSpin GmbH
$$ ##OWNER= she
$$ F:/spectra/data/she/nmr/H-F/1/audita.txt
$$ ##AUDIT TRAIL=  $$ (NUMBER, WHEN, WHO, WHERE, WHAT)
(   1,<2021-09-23 09:05:30.79 +0400>,<she>,<DPX200>,
      <created by zg, POWCHK disabled, PULCHK disabled
       configuration hash MD5:
       00 E9 B6 7A A2 85 ED C7 34 08 36 98 17 FE 4E 26
       data hash MD5: 16K
       A0 CF 7A FC E0 94 B9 DB 5C 9A B1 3C 34 DD 8B 0A>)
$$ ##END=
$$ 
$$ hash MD5
$$ E5 A6 26 4C EA 02 F0 B4 EB CE E3 24 85 86 9A 23
##$RELAX= 
##$RELAX= 
##$RELAX= 
##$RELAX= 
##$RELAX= 
##$RELAX= 
$$ Bruker specific parameters
$$ --------------------------
##$DU= <F:/spectra>
##$EXPNO= 1
##$NAME= <H-F>
##$PROCNO= 1
##$TYPE= <nmr>
##$USER= <she>
##$AMP= (0..31)
100 100 100 100 100 100 100 100 100 100 100 100 100 100 100 100 100 100 
100 100 100 100 100 100 100 100 100 100 100 100 100 100 
##$AQSEQ= 0
##$AQ_mod= 1
##$AUNM= <au_zg>
##$AUTOPOS= <>
##$BF1= 200.13
##$BF2= 200.13
##$BF3= 200.13
##$BF4= 200.13
##$BF5= 200.13
##$BF6= 200.13
##$BF7= 200.13
##$BF8= 200.13
##$BYTORDA= 1
##$CFDGTYP= 0
##$CFRGTYP= 5
##$CHEMSTR= <none>
##$CNST= (0..31)
1 1 145 1 1 1 1 1 1 1 1 1 1 1 1 1 1 1 1 1 1 1 1 1 1 1 1 1 1 1 1 1 
##$CPDPRG= <>
##$CPDPRG1= <>
##$CPDPRG2= <>
##$CPDPRG3= <>
##$CPDPRG4= <mlev>
##$CPDPRG5= <mlev>
##$CPDPRG6= <mlev>
##$CPDPRG7= <mlev>
##$CPDPRG8= <mlev>
##$CPDPRGB= <>
##$CPDPRGT= <>
##$D= (0..31)
0 1.2 0 0 0 0 0 0 0 0.06 0 0.03 0 0 0 0 0.0002 0 0 0 0 0 0 0 0 0 0 0 0 
0 0 0 
##$DATE= 1632373530
##$DBL= (0..7)
120 120 120 120 120 120 120 120 
##$DBP= (0..7)
150 150 150 150 150 150 150 150 
##$DBP07= 0
##$DBPNAM0= <>
##$DBPNAM1= <>
##$DBPNAM2= <>
##$DBPNAM3= <>
##$DBPNAM4= <>
##$DBPNAM5= <>
##$DBPNAM6= <>
##$DBPNAM7= <>
##$DBPOAL= (0..7)
0.5 0.5 0.5 0.5 0.5 0.5 0.5 0.5 
##$DBPOFFS= (0..7)
0 0 0 0 0 0 0 0 
##$DE= 6
##$DECBNUC= <off>
##$DECIM= 32
##$DECNUC= <off>
##$DECSTAT= 4
##$DIGMOD= 1
##$DIGTYP= 9
##$DL= (0..7)
0 120 120 120 120 120 120 120 
##$DP= (0..7)
150 150 150 150 150 150 150 150 
##$DP07= 0
##$DPNAME0= <>
##$DPNAME1= <>
##$DPNAME2= <>
##$DPNAME3= <>
##$DPNAME4= <>
##$DPNAME5= <>
##$DPNAME6= <>
##$DPNAME7= <>
##$DPOAL= (0..7)
0.5 0.5 0.5 0.5 0.5 0.5 0.5 0.5 
##$DPOFFS= (0..7)
0 0 0 0 0 0 0 0 
##$DQDMODE= 0
##$DR= 18
##$DS= 0
##$DSLIST= <SSSSSSSSSSSSSSS>
$$ [...]
##$SUBNAM2= <"">
##$SUBNAM3= <"">
##$SUBNAM4= <"">
##$SUBNAM5= <"">
##$SUBNAM6= <"">
##$SUBNAM7= <"">
##$SUBNAM8= <"">
##$SUBNAM9= <"">
##$SW= 20.0188988654967
##$SWIBOX= (0..15)
0 0 2 0 0 0 0 0 0 0 0 0 0 0 0 0 
##$SW_h= 4006.41025641026
##$TD= 16384
##$TD0= 1
##$TE= 0
##$TE2= 300
##$TE3= 300
##$TEG= 300
##$TL= (0..7)
0 120 120 120 120 120 120 120 
##$TP= (0..7)
150 150 150 150 150 150 150 150 
##$TP07= 0
##$TPNAME0= <>
##$TPNAME1= <>
##$TPNAME2= <>
##$TPNAME3= <>
##$TPNAME4= <>
##$TPNAME5= <>
##$TPNAME6= <>
##$TPNAME7= <>
##$TPOAL= (0..7)
0.5 0.5 0.5 0.5 0.5 0.5 0.5 0.5 
##$TPOFFS= (0..7)
0 0 0 0 0 0 0 0 
##$TUNHIN= 0
##$TUNHOUT= 0
##$TUNXOUT= 0
##$USERA1= <user>
##$USERA2= <user>
##$USERA3= <user>
##$USERA4= <user>
##$USERA5= <user>
##$V9= 5
##$VALIST= <valist>
##$VCLIST= <CCCCCCCCCCCCCCC>
##$VD= 0
##$VDLIST= <DDDDDDDDDDDDDDD>
##$VPLIST= <PPPPPPPPPPPPPPP>
##$VTLIST= <TTTTTTTTTTTTTTT>
##$WBST= 1024
##$WBSW= 4
##$XGAIN= (0..3)
0 0 0 0 
##$XL= 0
##$YL= 0
##$YMAX_a= 152405
##$YMIN_a= -193015
##$ZGOPTNS= <>
##$ZL1= 120
##$ZL2= 120
##$ZL3= 120
##$ZL4= 120
##$ABSF1= 10
##$ABSF2= 0
##$ABSG= 5
##$ABSL= 3
##$ALPHA= 0
##$AQORDER= 0
##$ASSFAC= 0
##$ASSFACI= 0
##$ASSFACX= 0
##$ASSWID= 0
##$AUNMP= <proc_1d>
##$AZFE= 0.1
##$AZFW= 0.1
##$BCFW= 1
##$BC_mod= 2
##$BYTORDP= 1
##$COROFFS= 0
##$CY= 11.3945322036743
##$DATMOD= 1
##$DC= 2
##$DFILT= <>
##$DTYPP= 0
##$F1P= 2.36226072786647
##$F2P= -0.459571619588291
##$FCOR= 0.5
##$FTSIZE= 0
##$FT_mod= 4
##$GAMMA= 1
##$GB= 0.15
##$INTBC= 1
##$INTSCL= 1
##$ISEN= 128
##$LB= 0.24
##$LEV0= 0
##$LPBIN= 0
##$MAXI= 10000
##$MC2= 0
##$MEAN= 0
##$ME_mod= 0
##$MI= 1.114404
##$NCOEF= 0
##$NC_proc= 0
##$NLEV= 6
##$NOISF1= 3.799351
##$NOISF2= 2.8
##$NSP= 1
##$NTH_PI= 0
##$NZP= 0
##$OFFSET= 15.70392
##$PC= 1
##$PHC0= -14079.21
##$PHC1= 19.40089
##$PH_mod= 1
##$PKNL= yes
##$PPARMOD= 0
##$PSCAL= 0
##$PSIGN= 0
##$REVERSE= no
##$SF= 200.130013532006
##$SI= 16384
##$SIGF1= 3
##$SIGF2= 2
##$SINO= 400
##$SIOLD= 16384
##$SREGLST= <1H.CDCl3>
##$SSB= 0
##$STSI= 0
##$STSR= 0
##$SW_p= 3612.71676300578
##$SYMM= 0
##$S_DEV= 0
##$TDeff= 0
##$TDoff= 0
##$TI= <>
##$TILT= no
##$TM1= 0
##$TM2= 0
##$TOPLEV= 0
##$USERP1= <user>
##$USERP2= <user>
##$USERP3= <user>
##$USERP4= <user>
##$USERP5= <user>
##$WDW= 1
##$XDIM= 8192
##$YMAX_p= 0
##$YMIN_p= 0
$$ End of Bruker specific parameters
$$ ---------------------------------
##NTUPLES= NMR FID
##VAR_NAME=  TIME,          FID/REAL,        FID/IMAG
##SYMBOL=    X,             R,               I
##VAR_TYPE=  INDEPENDENT,   DEPENDENT,       DEPENDENT
##VAR_FORM=  AFFN,          ASDF,            ASDF
##VAR_DIM=   8192,          8192,            8192
##UNITS=     SECONDS,       ARBITRARY UNITS, ARBITRARY UNITS
##FACTOR=    0.0002496,     1,               1
##FIRST=     0,             0,               0
##LAST=      2.0444736,     0,               0
##MIN=       0,             -193015,         0
##MAX=       2.0444736,     152405,          0
$$ Real data points
##PAGE= N=1
##DATA TABLE= (X++(R..R)), XYDATA
$$ [...]
1697E08Q3j423K33K193j201j542J721K82j149J58Q98k36r59k29J784k44j988J011
1715a00J141j537L6J349n39j160Q0J278J11j656N76J449j804m00K614p41k298
1732a601J231J280r85p52R84O28j865o5K709j095k512J940J317k246O6K032j054
1749A2j498J044J660j020j471J925L74k394J037K418k157j362J997M48j347K1
1765c13J147l27j734J219J770j922j172K255m18j472J320P23j463l69J024P42
1781A010q98o82Q38J81j207J027P00j548K5Q16M6j21o02K52K63p55L03J184j068
1800b36q07Q33L01n11n6N69M5q20J91J413n63j472J509N55j851N25J187o02j212
1819a002P54J329q11j328J230R56k233N19K316j666j591J842P88j386q2J505n83
$$ y = [508, 591, -832, -599, 1594, 393, -1149, 572, 854, -295, -137, 761, 525, -434, -663, 1121, 877, -1111, -100, 1041, -496, -460, 889, 350, -810, -730, 548, 659, -997, -421, 1028, -776, -1176, 1438, 697, -1601, -370, 910, -75, -827, 157, 785, -1080, -1145, 1564, 469, -2043, -103, 1214, -1032, -966, 1066, 12, -1486, -442, 1218, 198, -1273, 652, 1026, -1368, -331, 2087, -70, -1432, 565, 1013, -334, -313, 834, 507, -1227, -8, 1762, -160, -1332, 923, 505, -967, 353, 1076, -387, -756, 268, 1010, 112, -570, 268, 449, -758, 269, 969, -579, -554, 262, 308, 187, -415, -163, 100, -655, -352, 832, -236, -1043, -210, 91, -420, -476, 93, 138, -682, -491, 922, 359, -1113, 396, 951, -900, -375, 812, 210, -1002, -248, 1081, 270, -1058, 172, 1128, -1105, -586, 1730, 64, -1527, 315, 1103, -283, -365, 1140, 557]
1836E57j945J240K005j930j344K293Q2k241J336J476j703j134J456J039j626o82
1852a121J807l73j986J870J326k370l94J888l5j322M62P79o48j127J309J237j774
1869d72o97J850n85j033J045N02r94o09Q08R76j219p90J904j69j736J198J073
1886A052j374m90R71P99r89m89J006L85j732O39J925j557j235J625K23j124j69
1903e34J201kj555M06J891j282j518K135K86k114P80J550j183j234J484J099j646
1920b36r23K122n6k442J186J838k098q47J997L26j854J48J701m16k045J253J872
1937A526k173j058K608j84k105Q74J402r87j213J383R42j569p74K226M8k373J227
1954b00J661j564q24J421N32j368l80J468K06j953P91J906j589j273K162J23j931
$$ y = [557, -1388, -148, 1857, -73, -1417, 876, 958, -1283, 53, 1529, -174, -1308, 148, 1187, -439, -1121, 686, 313, -1673, 197, 1523, -847, -1241, 647, 612, -710, -248, 531, -117, -1244, 65, 1302, -472, -1169, 681, 96, -937, 108, 610, -384, -993, -185, 791, -428, -1218, 686, 517, -1219, -21, 1052, -322, -812, 159, 958, -31, -520, 486, 871, -861, -222, 1703, 146, -1089, 536, 759, -365, -534, 667, 665, -890, -484, 1407, 125, -1393, 742, 1028, -1086, -306, 1244, 61, -1173, 311, 1410, -236, -1159, 963, 907, -1535, -349, 1489, -609, -1456, 541, 867, -987, -839, 862, 446, -1599, -346, 1526, -647, -1705, 903, 719, -1386, -512, 890, -97, -1310, 73, 1015, -554, -1328, 898, 946, -1427, -200, 1461, -103, -927, 494, 1026, -342, -722, 746, 952, -1001, -210, 1696, 107, -1166, 996, 1119, -812]
1971h12L28J519l70j663O14J770j355j423K192K20k436P08J813j107j181J097
1987h6J093j289j317K212M43k252O66K042j677j203J704P15j641l23J738J18k302
2004a359O47K078j401j767K349N48k374N14J876p00j446R26J353j214j488K278
2020H20N74k523P13J941j362j503J629R71j475r14J776N06k339N61K141j398j544
2037a426J833Q35k066O1J763k1k045N22K092j336j748K297O38k463L35K025j142
2054A54j310Q05J438j119j523J902P06k222K11K246j193j489J480R26j389o05
2070i82J712J06j832nK352j165j872K154P84k127j23J836j91j618M92J605j022
2087A04j575J833J028k389P6K255q39j518J073J373j376j208J670Q88k217O3K402
$$ y = [-812, -484, 1035, 665, -998, -384, 1386, 31, -1392, 800, 1020, -1416, -708, 1105, -2, -1183, -86, 1007, -282, -1599, 613, 1056, -1196, -530, 1512, -165, -1368, 336, 1051, -590, -913, 825, 943, -1359, -712, 1366, -35, -1802, 547, 1095, -1279, -765, 1111, 411, -1035, -109, 1244, 30, -1458, 820, 1394, -1129, -416, 1525, 163, -1340, 289, 1260, -215, -1129, 647, 1153, -1186, -625, 1516, 118, -1426, 407, 1242, -824, -763, 1000, 979, -1066, -544, 1548, 212, -1536, 761, 1399, -1064, -729, 1296, 154, -1156, -351, 1087, -32, -1555, 347, 1053, -1169, -958, 1288, 95, -1394, 86, 1012, -377, -982, 730, 836, -996, -1001, 1351, 186, -1686, 468, 1252, -875, -998, 838, 647, -971, -479, 1126, 104, -1471, 362, 1390, -999, -923, 1332, 493, -1025, 48, 1421, 45, -1163, 507, 1395, -822, -759, 1643]
2104A643j277j660J488R05j601l20J565J89j738JK272j158j613J693Q02j850j35
2121g94J651n61j195M72J413p48j745J697R42k138j6K087p65j522J145R83j014
2138a08r22J155Q71j675l89K026n04j768J433J133j684l29J469K32j406k13J939
2155A260o84j895J437J300j955m96K083m43j410M11J571o84j768J509R60j861
2171f65n17K337n32j715J265R76j505o65J530L99j420m82J999o20j948J625J137
2188A199j999k87J558j16j181L27J379q06j294J396P35j551l42J858m20j349Q24
2205f9P23p43p75Q80P64r14p94J642l11j203Q14Q48r88o54J024M95q72m09J302
2224G60j22j568R55J230j425o98J431J37j048J01J044k16j357N48J485j417r09
$$ y = [1643, 366, -1294, 194, 1099, -502, -822, 743, 932, -806, -805, 1467, 309, -1304, 389, 1191, -659, -794, 857, 296, -899, -427, 986, 238, -1507, 190, 1132, -1006, -1022, 1065, 300, -1222, -77, 906, -108, -1030, 125, 996, -679, -1068, 958, 454, -1314, 119, 1252, -432, -761, 708, 940, -466, -679, 1260, 576, -1319, 118, 1418, -537, -1033, 1050, 607, -803, -392, 1179, 495, -1273, 236, 1196, -665, -1182, 1155, 623, -1092, 173, 1149, -356, -1021, 509, 908, -512, -994, 1005, 385, -1563, 62, 1199, -800, -1087, 471, 355, -826, -499, 880, 74, -1220, 176, 911, -640, -982, 876, 456, -893, -69, 654, -89, -864, 16, 780, -134, -928, 714, 403, -800, 14, 862, -126, -780, 244, 739, -133, -542, 760, 638, -930, 25, 1255, -170, -868, 563, 700, -348, -247, 797, 581, -776, -228, 1257, -160, -1069]
2241a069J829n1j683N32J431r83j086J084J036j107j018J563L9j734J069J250
2257A102j553p26J454L70j175o8J086k53j416J236R06j577k47J414l00j088P02
2274a33N84n59p93J136O32j084l73J102p8j198Q95O95j068p3K71N00m32l00O03
2293C27P1r08N11P64q08o30Q74K73m29r4K21M01r80J48J161o15j322J145M76j078
2313d92J20P74k44r68M69R83n33r78J111L65j392M09J265q52q92Q01M51o89l68
2332f60R92n0j189M77J329j072p43J467j54j114O75N41p37l08O85P00q89o39J275
2351E86l05q88R96L40r43j02N69K11n69O3N50k74o96N82L56o94j40Q06n61j82
2371b95M28k07l9j06q7O66m13o31N63mlJ33J73l07r4J1N74n9q06L94M35q16L10
$$ y = [-1069, 760, 709, -974, -442, 989, 6, -1080, 4, 1040, -67, -1085, 478, 517, -1217, -148, 1102, -451, -1177, 277, 647, -528, -596, 490, 237, -1179, 57, 963, -614, -861, 553, 253, -835, -133, 451, -108, -901, 235, 867, -217, -590, 512, 434, -764, 131, 826, -242, -315, -44, 456, 24, -276, 327, 398, -510, 1, 765, -43, -673, 201, 474, 45, -49, 172, 573, -407, -259, 902, 287, -1035, 110, 586, -492, -372, 402, 158, -810, -341, 642, 109, -869, 242, 607, -785, -376, 889, 37, -855, -54, 397, -292, -660, 332, 282, -907, -430, 899, -173, -916, 551, 397, -717, -42, 499, -238, -546, 139, 839, -50, -689, 586, 281, -607, 389, 729, -214, -316, 253, 464, -105, -42, 508, 234, -462, 120, 476, -218, -358, 448, -113, -295, 133, -74, -113, -219, -306, 360, -53, -684, -121, -125, -128, 5, 178, -129, -223, -212, 362, 303, -503, -109, 326, -490, -180]
2394a80O25l99m43J96M18m7n21K75K69o56N2J105o19p65Q77L05p89R5N08j49o02
2415d45L54R05p92m61Q28O5r48N92N96r66j28O36J86l40k54M06j34n98O72M12
2435E86r77p5Q86m42j81N02j78l59j9L41K02o24j28Q45m89k12O12q5m48J55N6
2456c2P2j43k4L28l07p0K91K32o29L2L86k09r4Q9r1K26m15O8M78l61j83N95l13
2479g4k60L73K03k45j21K87J07k41l11M51K09n70N06J10n77J55L24j82k69J32
2499GK30N7o53L89L19n45l3O89l82o17O89p8j66j42K34L19n05j22P39m71m76Q14
2521B96l3o89L04L15k19kp0J99k53m15O75J17p98K49P98q66O3M73K7j74l36M66
2543A27K32o83K04O26m48m09Q57k43m63K81K72o1o08K78M84j05p95P72R1r65M83
$$ y = [-180, 445, 46, -397, -201, 217, 170, -351, -76, 193, -463, -411, 694, 75, -690, 187, 492, -297, -202, 306, 157, -445, -91, 814, 22, -439, 389, 454, -494, 98, 694, -272, -400, 236, 422, 82, -172, 234, 100, -498, 174, 586, -391, -466, 420, -22, -203, 299, 121, -238, -257, 84, 286, -338, -466, 379, -110, -322, 290, 205, -243, -88, -32, 40, -103, -127, 201, -106, -176, 115, 347, -282, -250, 136, -73, -167, -78, -169, 57, -358, -290, 188, -173, -356, 239, -74, -334, 39, 242, -3, -124, 163, 270, 29, -282, 169, 378, -192, 314, 424, -153, 2, 326, 144, -125, 7, 237, 294, -359, 30, 349, -196, -229, 460, 78, -539, 150, 72, -94, -236, -2, 317, -188, -310, 429, -42, -518, 296, 263, -426, -122, 193, -26, -28, -98, 101, -152, -567, 108, 225, -573, -324, 474, -392, -329, 144, 171, -3, -339, 127, 359, -324, -120, 506, 58, -351, 506, 263, -200, 81, 353, 292, -316, -38, 446, 341, -454, 318, 409, -556, -73]
2564g3L89l26j65K69J82l98l92P33O9o23J87P10p24k85M35K39n43j9N29J4n77
2585c69QQ01m73m74P66Rp66L11N24k98k07n3O78n69m39P50L46j198M16Q47o26
2606a6l64N88K12n59o2N16Q6r37N05O04n68n07O60K44o38J34M25j51k79r3P69
2627E69n09p42P92M27j079J86P96l98l26K33K72j73l17M07L10r65J81R80n43l96
2647b95L95L23o38r6M78J92p87q2J022m06q46Q75K76p24l2O18j64m50J84N14o3
2668B94q51O06M65r12J10P04k67p28N03M56l50m32N42M40q77j96J066l84o81Q85
2688C93J5o52p4M57Q7n07J8P13l40o05P34L12q16j9N98j03n41L48J98j54o95P62
2710A29M10r89J19Q74n75n95N15M27m94k33M88K66o52p2O83k42o13M99M96p02
$$ y = [-73, 316, -10, -175, 94, 276, -122, -514, 219, 288, -335, -148, 562, -162, -447, -12, 227, -316, -335, 194, 208, -369, -361, 440, -33, -507, 259, 268, -498, -187, 337, 39, -168, -221, 457, -112, -551, 199, 545, -653, -237, 610, -16, -380, 208, 420, -139, -201, 315, 401, -536, -31, 573, 5, -502, 158, 402, -236, -102, 323, 172, -107, -200, 569, 60, -682, 110, 537, -542, -356, 440, 42, -284, -51, 221, 48, -269, 138, 448, -517, -336, 644, 101, -295, 100, 423, -215, -311, 167, 359, -428, -510, 512, 106, -740, 135, 411, -313, -345, 273, 109, -341, -157, 357, 294, -557, 49, 514, -398, -288, 416, 149, -579, -76, 380, 30, -402, 140, 580, -297, -493, 573, 189, -492, 393, 408, -244, -318, 139, 226, -281, -263, 450, 110, -495, 239, 551, -265, -284, 314, 211, -330, 18, 216, 62, -633, 129, 539, -450, -331, 543, -32, -627, -112, 315, -179, -412, 76, 342, -310, -382, 301, 59, -554, -55, 441, -261]
2730b61j20O63j28l96r8P82k68q82O02P92r63j46J027m14n42J48P27k70n77M26
2750A02N93j002k2Q52k54n92L18O50o98m10O41K30q01n6R32j53r93N75Q04r21
2770b05q3N83p6o75K47M18j78m33J93O64q74N6P95k24r37P17K69l83j47K37K46
2791B10n56K1P32k34q32N16M97m33k73N17K9m44q0O35k8p40L65N59o25k54P97
2812C79j19m65j22P53j25o47K29M06m12m93R12N6p81O9Q27k62m72K38N70o05l87
2833d51P56R7r29K89Q06q04k88Q01l7o16j6Q40j02q05K54O55n82l74J080k03r08
2854e37J96O82l10l10L08L67o34l47Q94N1r89M26M89o21O7M53K0n27Q1N31J7o87
2876c80L54M57m68n4N22j51l78n8L75Q6k38R6K12l43l86O44J14o54m3N41j90j94
$$ y = [-261, -381, 282, 154, -242, -340, 442, 174, -708, -106, 686, -277, -423, 604, 190, -352, -204, 523, 253, -324, 102, 695, -307, -329, 523, 269, -323, -5, 645, -53, -463, 178, 408, -393, -449, 483, 330, -663, -88, 716, -205, -288, 295, 219, -456, -209, 209, 31, -402, -209, 455, -419, -363, 432, 208, -729, -12, 257, -126, -273, -36, 210, -346, -325, 407, 173, -659, -143, 354, -79, -352, 165, 194, -250, -330, 305, 277, -463, -98, 461, -164, -418, 379, 260, -205, -327, 426, 301, -346, -117, 289, -123, -616, 296, 352, -429, -360, 467, 205, -267, -29, 541, -64, -451, 305, 402, -527, -238, 568, -236, -524, 277, 240, -376, -392, 448, 346, -459, -205, 450, -132, -506, 574, 371, -537, -341, 341, 31, -279, 29, 396, -238, -585, 309, 360, -629, -203, 286, -335, -268, 185, 205, -322, -241, 290, 307, -380, -26, 431, -37, -91, 431, 280, -98, -156, 219, 305, 67, 163, 375, 32, -354, 290, 404, -250, -293, 248, 58, -136]
2898a36n8L54J25q30N56O51j014m9O93k60m52J15M26k52l14M79J20n61MP28l12
2919A3o74O30L22p89K50M43R6n61J60M33j74o21O75L72r09o5Q98m72l19K97R6
2940A01j16j33L78O2o07K44L04l10j00M27m2m23L36Q3J24n03R3J12J1l98N12j31
2962B4j79k3J77p3Mj15J7J88j97K74R1m99MM15j05j99J12K19j87k31K10M69n44
2985a48j20M54j39l39L23J92l19k15L94J97l72j02L44q1m75L14M75n11j87O15
3005C00k04k22K16K45j35l29L09K85n92k30P08l05k76L41j08p8k10K82M09m57
3025e1p4Q6j0j71M30j37k74J38K56k03l2P2J35j56k6k0K05k62k9L24m95K06J84
3048I6k75l1R1J34L9j82m8K82k1k04L17j89p2l9J28Q4j93j7Q8J74l06L69j13k44
$$ y = [-136, -194, 160, 285, -545, 11, 662, -352, -401, 292, 32, -420, -305, 121, -131, -445, 34, 154, -407, -403, 325, 13, -661, -31, 291, -498, -248, 195, 291, -270, -110, 323, 149, -472, 203, 575, -334, -399, 499, 27, -292, 5, 101, -15, -148, 230, 292, -315, -71, 233, -77, -177, 250, 208, -215, 121, 204, 328, -175, -82, 30, 41, -357, 155, 24, -155, -178, -1, -74, -70, -185, -168, 20, -177, 97, 188, -311, -307, 108, 3, -196, -84, 135, -52, -283, -73, 396, -148, -268, 186, 47, -292, 31, 223, -96, -311, 83, 280, -92, -194, 150, 69, -406, -92, 383, -128, -315, 300, 96, -126, 90, 335, 200, -129, 180, 465, -127, -357, 351, 46, -230, 111, 3, -75, -285, -3, 406, -51, -125, -39, -49, -220, 210, 73, -201, -63, 193, -10, -42, 30, 165, 9, -17, -37, 168, -94, -123, 201, -294, -88, 96, -179, -210, -119, 15, 54, -128, -176, 106, 85, -119, 198, 9, -63, -102, 26, 110, -83, -100, -12, 162, -144, 225, 112, -132]
3072a32J01J56o7j84K65j05L7q6N5L09m61P2L51k49j96K37m0j98J10L0M07l20
3094I2j46L10j90l82L27J00k43j2L35j62j22o7P3Q3k70K46K85m65J7M66n02K65
3116C8J26k26l6J09j17P7P0k21J94j42p3K78n9j87K10J01j16N2o2k3k4J62j01
3139C0K27k75P2K16l29M3J14k14J08k9M7J1j48J56N7j4k13J99j71J11k5P9K6Q
3163H6j36J52j07k9Q9N0l24J14J54l69J55Q2R8j0j83J1J80k31L26l9jl58M32j56
3187a4O5o2J34p4j62Q8J21l14J81K19j01j53J59M7j14L7P6Rj90N1J33k7j64J08
3211E3Q8k06P7L15j84k12J54Pk31J18kJ32j95Q0J95k16j31K47q8j65R9J4O3lk53
3236b44K99j98p9L17J14m31j8L81r4j79j39L55j8j60j44L46l04jL54j39l06J24
$$ y = [-132, -31, 125, 58, -126, 139, 34, 71, -15, 40, 349, -112, -40, 311, 62, -134, 103, 63, -135, -25, 5, 412, 92, -54, 256, 66, -316, 11, 111, -132, -144, 191, 29, -93, -160, -87, -4, -274, -28, 257, -208, -191, 275, -227, 38, 164, -62, -98, 11, -106, -29, 41, -180, 14, -128, -201, 77, 18, -169, 41, 142, 26, 78, 16, -7, -31, 131, 30, 257, -18, 54, 270, -59, -16, 98, -116, -8, -37, 10, 21, -127, 29, 86, 72, -141, 58, -113, -2, -27, 52, 78, 86, -50, 102, -5, -34, 55, 105, -219, -105, 49, -320, -165, -83, 15, 5, -178, -167, 13, -218, 108, 69, 68, -290, 142, -14, 51, -11, 123, 49, -113, -25, 96, -218, -37, 182, 81, -72, 87, 134, 20, 57, 133, 142, -48, 3, 136, 109, -55, 53, 141, -65, 12, 327, 143, -69, 85, 92, -139, -21, -23, 109, -86, -6, 189, -27, -158, 89, 1, -164, -65, -51, 12, 9, -244, 55, -143, -222, 95, 209, -222, -240, 141, 47, -132, -271, 84, 66, -94, -238, 108, -196, -197, 157, 18, -288, -164]
3258a64J91j28l9L66j38j80j61M12j01k62K39K27l42O3J66k7mk00M30j35l44J65
3280C4L54n51J66K94j35k65Q8K5k3j03N1J44k99o8N78j62l95L18l7o3J02j06J52
3303I9j94j90N04k65j18K36J91l69O1K16n3k75q2L79q6k75J26L65l81N6K51o9
3325A27j84L1R1j14j53R7M68l17l13J93K22k80K03J90k73r3J89J93m11R2K35J20
3347C13m59Q5K41k69k99M84k5l10K32K01k39l03K57J35k39j82N57j32l46K21K99
3368B22k92j59L78Kl35K1L05l6k98L95L65p67Q8J78j34L0Q1J1j46PJ35J73n58
3391c34J88L08L7k31K14q1mo1K4K4Q1l23K32K85m66J12P2p4j40J45Mk0k70L52
3415G4R6l07J62K76k44k85L37M0l44K20O5J04m09J39L96m00j88L81L7n18L40K31
$$ y = [-164, 27, -101, -140, 226, 88, -92, -253, 159, 58, -204, 35, 262, -80, -17, 149, 122, 118, -82, 348, 213, -131, 34, 388, -163, 3, 297, 162, -103, -15, 10, -13, -116, -65, 79, -220, -288, 290, 128, -267, 51, 14, -49, 53, -53, 99, -95, -285, 219, -46, -164, 72, 263, -106, -45, 171, 118, -157, -239, 140, 54, -221, -95, 270, -111, -55, 196, 127, -57, -26, 65, -49, -202, -105, 363, 46, -267, -74, 148, -132, 71, 261, -12, -105, 84, 277, -134, -42, 193, 313, -146, -61, 180, -89, -388, 96, 71, -239, -7, 194, -45, -348, -91, 44, -195, -377, 180, 48, -298, -77, 222, -70, -229, 149, 151, -184, -163, 142, 106, -192, 203, 568, -199, -111, 67, -67, -37, 44, 55, -91, -84, 51, 224, -334, -146, 162, 199, -32, 182, 101, 97, 36, 60, 84, 165, -158, 74, 359, -107, 5, 77, 3, -137, 8, 12, -8, -278, 74, 170, -137, 25, 301, 57, -228, 109, 149, -195, 25, 90, 194, -215, -76, 320, -80, -268, 113, 150, -368, -28, 203]
3437B03k99k46J76N06l20l50M43j96j52J82K31k51j52K57K00l34j44M26n1n06
3457c77L84L31n14j62M52J5j44m4K29j66j67L58J59l03p7J03J56l08N2K19k57
3478f1j54K90J41j25j94J65Q6j36j79L43k8m41K14J28nk31K66J56k80k66M53M5
3500A87m08J28M61n35p9M33k03j44J37K01Rl30J66J74n33J14N68k88l54K75K68
3521B47k40o0m3L29l14j9L92l90k04K49K75l01l0J25j12j57M37J5j17l60L37J59
3543B18l18J94J9j38m9Q8J01l1j15j27K41j94J4K11j1l40L16O1%k6l58M75j53
3566G8k68K55ll34R1L39k33N2pk7Lk39N57k33l35J86K58l14Q1K89k57qO9K64k33
3591C1k62K20J66l05j15L03M1l36L23J53j28k25J81Nr1l3K32n5l20K62P1j21l5
$$ y = [203, -96, -342, -166, 340, 20, -330, 113, -83, -235, -53, 178, -73, -225, 32, 232, -102, -246, 180, 129, -377, 7, 338, -176, -338, 114, 129, -15, -59, 170, 4, -163, 195, 354, 51, -26, 77, 233, -75, -23, 196, -61, -215, 75, 216, 91, -103, 62, 148, 12, -167, 176, 148, -293, -79, 49, 44, -187, 79, 235, -45, -311, 142, 187, -221, -93, 368, -167, -246, 187, -16, -160, -23, 178, 187, -143, 23, 197, -336, -222, 346, 58, -296, -21, 247, 7, -53, -96, 233, -81, -100, 292, -98, -302, -53, 222, -79, -109, 16, -96, -253, 184, 199, 82, -278, 59, 218, -100, 94, 113, -25, -74, 14, 115, 84, -31, -158, 83, -111, -97, 114, 103, -237, 79, 140, 140, 114, -244, 231, 78, -190, 65, 62, -272, -181, 158, -75, -23, -30, -57, -54, -293, 264, 31, -304, -118, 140, -174, -93, 196, -61, -69, 0, 264, 31, -231, -11, 155, -150, -265, 38, 79, -257, 66, 219, 91, -134, 47, 52, -39, -72, 160, 105, -215, 47, 118, -3, -38]
3614c8J36j51n1m9J43O5k79J72J44j66Q9R6p3o7J20K3j11k2j20K11r4r9L94k60
3638A3j20K5K10m21L24M2p5Rj70J54M6j1QR8l2j76J28J12j23j83K76o6j83L19
3662B04q9j71J2J79J38m25K3M6J63K1k49L38j19j57J45N9j30M4J95l64L14j31
3684D6j82J42r6J0J99k44N3K86j71o7O3J42l04Q0Q6j63LM1R6J03k03J31j16o2
3708a27J07J08n7j6q2p9L7K32p5O8r4J61l8j05Q0o0j28RK37K0j37k9j01J70J16
3733B17p5O5n2j58j03J34J30q4j25K20p3o6K7N5k44J2k8k1K27j30L0m8J49j24
3757f5M5p9QK6j1K33j36J9j23Q8r2J58oj48K9J21n0R5j58K8J27jj93J92k96J00
3783h9J75k04N2K27j54L9J13j65J51p7N7j56ok4O2N4k42K59j32O0J56j69j79K67
$$ y = [-38, 98, -53, -104, -153, -10, 55, -224, -52, 92, -74, 15, 111, 38, -29, 91, 114, 3, -19, -139, 72, -22, -121, 273, 13, -107, -82, 128, -293, 31, 73, -2, 7, -163, -9, 37, 26, 34, 132, 100, -76, 52, 164, 41, -142, 134, 68, -115, 204, 115, -56, -44, 135, 273, -152, -129, -83, 80, 101, -148, 190, 71, -86, 59, 118, -12, 32, 227, -137, 177, 46, -136, 6, -90, -80, 119, -125, -72, 214, 43, -24, 39, 181, -123, -43, 43, -120, -117, -76, 20, 123, -80, 51, -65, -127, -20, 88, 31, 15, -67, -146, -109, 123, 48, 116, 22, 183, 145, 40, 120, 60, -68, -59, 178, 198, 61, 32, -69, 101, 217, 142, 207, 155, -3, -106, 28, 158, 74, -51, 169, 96, 30, 57, 112, -132, -120, -148, -169, 58, -72, -42, -90, 59, -65, -20, -99, -91, -65, -76, 157, 21, 40, -83, 5, -87, 71, 65, -83, -54, 67, 17, 112, -46, -18, 109, 108, -85, 107, -189, -89, 86, -118, -66, 161, 7, 46, 159, -6, 145, 68, 125, -31, -37, -61, 1, 55, -187, 72, -60, 0, 156, -13, -192, 75]
3807G5m1p1N8N1N8k02p4K35j82K8k1J97k04L15j72j91J92k00J96j77K44j24J61
3830A51j78NO8j79K9K57K8l40K07Mj78QLJ5oJ13%Q1k86J81J04n6N4o9Nj0R0j43
3858d2J44j94J59J03q1j01J98k61K22k98K75n7j49P0J55j50j92K20n1o2P6K0q1
3881g7O9ok3qj21K32k3k02K31J8n4J62l12Q4j13J27q5J81Rn8k8k4J02n0k1k5k0
3908c5O1n8J60k29J71j8o1j19K22olK1k48L39m43L22P1j57K32j85j29J49L01l65
3932gr0L00k25J24N7k73N6K51j10R1o6j10R3o8j02J54k4j14j09J40N2N9k89L95
3956A85k60n2J50K8k16O0M8n0J22j14L03k28Q0Q9q7j29j94L42N5k17J18j11l1
3979a09n1L3J14O0o8J63j19j68K40j33J86p7o1j71O2J54J18j54j64L0J88j68M1
$$ y = [75, 34, -37, 21, 72, 130, -72, -146, 89, -93, -65, -86, 111, -93, 222, 50, -141, 51, -149, 47, -130, 114, -10, 151, -27, -22, 46, -133, -104, 153, 181, -159, 48, 52, -126, -118, -115, -100, -106, 7, 7, 88, -198, -17, 87, 31, 85, 16, 21, 11, 101, -42, 102, -92, 67, 170, 89, -12, 186, -75, 147, -151, 124, 67, -82, -12, 143, -7, -199, 21, -30, -92, -16, 4, -77, -8, -14, -37, -45, -166, 66, 43, -159, 72, 90, 36, 198, -114, -30, -143, -16, -101, 80, 89, 31, 3, -21, 81, 31, 10, -15, -35, 26, -32, 128, -101, 70, 52, -9, -128, 94, 88, 85, 106, -142, 197, -246, 76, 147, -10, 222, 37, -92, 57, 358, -7, -97, 203, -22, 102, 159, -114, -58, 193, 83, 174, 108, -2, 91, 23, -79, 75, 51, -63, -172, -32, 20, 79, -210, 185, -75, -127, 23, 51, -165, -105, -57, -107, 15, -99, 204, -24, 56, 145, 58, -71, -265, 77, 132, -85, 33, -78, -109, -160, -127, -13, 47, -21, 142, 23, -145, 95, -38, 148, 71, 10, -161, -99, 55, 173, 19, -145, -115, 73, -95, -54]
4002e4J49rj72J04l9P1J85k65J29m1j81J52j70K0Q9J69k60r8L30r2j14J21j43
4025a19L13l06N9KJ73j61J23R3j06k08Q6J67k85Q8K60k49J20J2M0j18o3J27p4
4048b6R9M1j83k2q7L40n6l55L07O2j41O7j0n3O3j14N1O2j10J9j52Q5R9K29k42
4073b7q3J91k23K87l07L2J0J10L3N5J41l85R2K85j48n2j33R4O0k64L17m3k41J67
4097c2k3L1j96K20J13l9k12M6K82l14l6L49j18k41L22M1l97J43J14O5j8o3M8j37
4121e2N0J16J23m56J25R7j10J18m1K00l39N5K11N8j56r6K52j03k34J59Q5j98J37
4144Aj9k6N1j65J05Jl9J53n2Pj0l7N2J7k25K28m5P5m6L9p5o6J93o7j08Q4q5L9
4172b0l7L2K77m13LJ70L0O6j51J49k5r4J69nj12n2J65k00j03J20J20k06J2L10
$$ y = [-54, 95, 86, -86, 18, -21, 50, 235, -30, 99, 58, -123, 29, -141, -121, -32, 137, -123, -221, 109, 17, -97, 24, -119, 194, -112, -53, -51, 122, -39, 84, 177, 71, -137, -51, 116, -169, -81, 179, -70, 50, 62, 102, -16, -79, 48, -26, 73, 114, -69, -91, -178, 162, 106, -249, 58, 120, -21, 46, 36, -17, 46, -68, -17, 45, -65, -46, -198, -113, -14, 215, -27, -110, 81, -142, 145, -162, -130, -120, -10, 23, 78, 219, -166, -74, 211, 63, 11, -122, -28, 32, -232, 85, 42, -199, -32, -55, -24, -220, 0, 113, 74, -138, -92, 190, -124, -160, 189, 71, -170, 152, 193, -204, -61, 53, 118, 100, 37, 85, -52, -2, 114, 237, -219, -94, 3, -107, 11, -30, 170, -169, -114, 97, 155, -1, -97, 155, 52, -182, -23, 62, -136, 1, -18, -44, 7, -158, -53, -52, -91, 62, 10, 17, 7, -30, 22, 39, -186, 42, -3, 72, 26, 65, -10, -76, 117, 50, -58, 26, -59, -20, -57, -25, 252, -161, -158, 12, 42, 108, -43, 106, 81, -13, 156, 151, 39, -13, 152, -48, -151, -31, 89, -117, -105, 205]
4196B05j27j56J41M2r0j85K40N7k0k52M83m50K6J00K98l53J62j95J29l9j51K81
4218A46l1j30q3J08j21M9p2O8N0m0R7N3k75J51J10r4o2J65r3K0J07j8m9K7q1Q7
4244H9j06J21j77J39j56J71J03k46J33j08K04q2k17K0J99j53Q7K48l76o0J40J40
4266A13k06J12q9R5m6l5K79j66q8J80k46rJ21N4q3n3o3K22K4k50J74j58r3K22
4290A1R7j40O6j1j39R1N8N8l1m0k11K71k36J35K34j63O6k0k9l8m3KO1j11J14P7
4316A29j89n6J70K3n8pp8J57r2l3Q4O0j88J15k7J26j41J19j37j42O3m8K00J45
4340A95l16L42l6l16R3P6R6o0m4J8j8o0L9J8l9R3j32j74K68J3K9k55J26j4M4R5
4366H1k51K67j87j3K28n1j01M6j5N8j44J36j2j92j5K50N9k10R9r6o2J31R3j75
$$ y = [205, 78, -78, 63, 105, 15, -170, 70, 127, 107, -145, 338, -112, -86, 14, 312, -41, 121, -74, 55, 16, -135, 146, 115, -15, -98, 10, -111, -62, -134, -66, -16, -56, 41, 94, -181, -30, 80, -14, -76, 89, -4, 16, 123, 105, 56, 83, 2, 89, -17, 104, -73, 66, -90, 81, 184, -62, 71, -37, 167, 85, -132, -112, 87, -66, 21, 269, -107, -167, -27, 113, -93, 19, -70, 25, -21, -56, 223, 57, -31, 149, -97, -106, 15, 69, -14, -67, -130, 92, 116, -134, 40, -118, -211, 11, 108, -32, 34, 23, -116, -25, 33, 91, 60, 20, -191, 80, -156, -21, 213, 50, 116, 96, 67, 29, -14, -12, 49, -62, 52, 129, -60, -116, 54, 77, 19, 12, -66, 91, -1, -34, 50, 110, -78, 37, 10, 136, -5, 114, -23, -165, -102, -150, 50, 195, -121, 221, 185, -131, -38, 38, 134, 74, 30, 48, 30, -30, 9, 27, -12, 81, -51, -225, 43, 56, 85, -170, -44, -58, -14, 81, -170, 97, -90, -103, 125, 74, -27, 19, 4, 62, -82, 54, 42, -150, -165, 85, 144, -66, 33, -63, -125, 6, 99, -76]
4390g6K17p2R2j0k22J08J7M6j75n2L56j16n3j48K9k4M9P2J40k67J24o1Q0K7k54
4415a73J00M0n0m5J02q8J04M1j1j00P2k1l5J43K52k53j59N0J20j50j5J4J31L9
4439A08j06l1j04K14q3o3K34j12K1j09J07L2k03J47j58J68m0J11j34j35J24K2
4461A0K0L5j18qK48k96J99M8l09K79j00r4M8J16m6m9L4J18p8M4J5n9Q7k13J59
4486I0j78J11m4j59NJ07J8J45q7J6j7P2k44K29q8j21L0J54j58mL9J11Q7j47J6
4511a7m3J20q5J16k12K23j25l1M8M5M8K3J44l77J35J43k82k3J38n9k0J07Jo1M
4536d0l1K00k80K57Pj87J72j22Qj01R8q3L59k55j10J05k47L43l5j16Q1R4q2k15
4560a80J50J91l09P5J67j23R3l84K35J39M4jj77rK04j62Q2j12n2K08Mp8j35J49
$$ y = [-76, 141, 69, 161, 151, -71, 37, 54, 100, -75, -127, 229, 113, 60, -88, -59, -83, -34, 38, 178, -89, 35, -26, 54, 81, -173, -73, -33, -83, -128, -26, -114, -10, 31, 20, -80, -8, -29, -64, 79, 331, 78, -81, -31, 89, -61, -76, -62, 69, 108, 2, -29, -133, 81, -2, -65, 169, 57, 78, -31, 76, 108, -95, 52, -106, 62, 22, 133, -1, -136, -12, 10, 30, 65, -53, -61, 187, -109, 90, 138, -171, 108, 8, -86, -38, 78, 32, -17, 17, 135, 57, 101, 116, 57, 144, -69, 90, -88, 23, -21, -180, -175, -68, -50, 95, 8, 24, 7, 79, -165, 64, -24, -145, -115, 39, -119, -123, -84, 27, 114, -33, -17, -60, 60, -25, 91, -121, 102, -23, -54, -6, 39, 87, 110, 254, -123, 12, 155, -127, -150, -12, -71, -91, 16, 17, -44, -40, -71, 129, -151, 106, 113, -74, 98, -24, -16, -117, -19, -102, 257, 2, -108, -3, -250, 93, 58, -58, 23, 117, 35, -180, -30, 161, -148, -73, 94, -29, 64, -320, -85, 54, 98, 97, -80, -89, 115, -47, 35, -77, -129, 79, 83, 5, -130, 19]
4584A9l5RJ03j33M2Q7qk2j29J78q5j35R2o4J62j4j56R4K9j56J05M7j55J77K4j09
4610c3o5O3J29l9M1j28O4J0J01m6N0p7p8L7j10k4J72j27l6j6K1K40k90K8J94q5
4636dPL5k8j1J44j08Q6k3r8J4o2J40k17L4Q8J2K4lk21J49R0N8r9M4q1M6J0j93
4664a67J97R6m3j78L7R7N8j38N0P0Q3k10J53j29n3J5l8R4k8%N4k35J84o8R1N9
4690E1L0p0O6j2L1j02J29k19k6J40P5r2j24J2J13m9K4K21l1k39l1J13n1n0J11
4715B0j55N6P2j01J92p1LL1q0o5M7R8J3O8L3j05j20J15lj12l6J90nl0J7r5J08
4742H5j86Q1M8j47K82k10k7j18K00J00N0m5j51J24j69p9K67o6j63Q8R6j12N0p2
4766g4L0j8Q0J29k55N3Q2l3n9J0J21j81J42l8r7K36k23K9L5J41j80J23J55k16
$$ y = [19, -16, -7, 96, -37, 5, 92, 84, 62, -67, 111, 26, -109, -17, -81, 81, 67, -89, 5, 34, -122, -17, 30, -125, 52, 76, -33, -98, -35, 94, 55, 96, -32, 32, 42, 143, 97, 147, 70, -8, 29, -81, -105, 67, -60, -96, -112, -91, 149, -141, -113, 81, -4, 3, 38, 10, -1, 143, 35, 121, 98, 0, 14, -48, 92, -125, -91, -3, 9, 33, 30, -191, -42, 48, 106, 7, 51, -30, 16, 26, -167, 30, 126, 83, -95, -58, 39, 97, -41, 9, 79, 162, -48, 105, -24, -77, -62, -100, -6, -34, -34, 20, -215, -31, -99, -8, 51, 81, 11, 77, 65, 96, -6, 123, -96, -122, 18, 93, 1, -123, -111, 2, -47, -23, 198, 167, -72, -103, 10, -41, -91, 20, -135, -79, -7, -108, 84, 13, 16, 47, -33, -98, -51, 47, 60, 128, 161, 56, -64, 51, 48, -64, -100, 90, 85, 55, 72, -23, 85, -101, -20, 28, -119, 163, -47, -74, -192, 8, 108, 158, 113, -38, 86, -83, -162, 105, 39, -124, -36, 60, -52, -2, -74, -44, -62, 18, 147, -108, -55, 27, -6, -65, -55, 66, -115, 27, -11, -108, 128, -95, -66, -31, 110, -70, 53, 208, -8]
4790hJ26q0oj24K5K37n3j69J39k64J92j96P5M0Nq7J54j31J61l1q2N1j01K07j19
4815c9j49K03n1j09J64N9l3j7K0O0k39K22j06j18M9P1K84m29J81R8r2L9j89L33
4839B12l8j79m1J36r5k3J66p5m8L5m3J23j94K59j56j0N5m6J9p4Q2j11O8N3k14
4864a39K30o0r4J39j28K9l3J1L3l9K1J73j57M0N8j04L8K3q2L02j59j90j28K24
4888Hn8K17j61o5K15k09Rj05L84P4m68J87%m3O0j81K51p7K1o5m1K10j33o1J08
4913G7nK6k4L0k35O9K0Q6J5J5L4j22n5k0j19J46L5k3K75j97r3J23r3k3l5J20o3
4940c6J72j72J27N5k75J96q4NR5p3k17J46q1K00k23J37Pr8J32j14m0L00j40L3
4964E2k27J46J44j59O2n9n1j0K2J91n5r7R8o6J58k42Q4rq2R7j25P7J33q6m5M7
$$ y = [-8, 118, 38, 32, -92, -67, 170, 117, -52, 87, -177, 15, -181, -106, -66, -61, -148, 6, -125, 36, 5, -77, -26, -127, 80, -39, -188, 15, -36, -145, 19, 78, 45, 28, 48, 108, -131, 91, -15, -133, -84, -13, 271, -158, 23, 121, 29, 68, -121, 212, 174, -5, -46, 90, -5, -28, 138, 63, 15, 50, 7, 130, -64, 195, 39, 29, 84, 38, 57, -17, 65, -46, 22, 75, -139, 91, 31, -63, 76, -52, -23, -56, -45, -12, -51, -30, 143, -14, 26, 84, -20, 18, 41, -41, 261, 102, -88, -216, 8, -50, 167, 6, -59, 156, -53, -44, -149, 235, 309, -159, 28, 28, -15, 45, -136, 115, 38, 59, -6, -47, 163, 30, -31, 77, 72, 98, 74, 104, -131, -62, -42, 44, 59, 74, 108, -14, -69, -89, -208, -62, -27, -50, 225, 28, -65, 58, -35, -58, -93, 27, -36, 136, -36, 91, 146, -129, 67, -17, -12, 83, 10, -207, -61, -142, 58, -165, -28, -21, -119, 13, -101, -141, 159, 19, 52, -175, -29, 115, -44, 18, -41, -92, -102, -80, 111, 56, -41, 57, -9, 149, -93, -9, -18, -100, -3, -128, -51, 82, -4, -49, -2]
4990bJ6J86j46j35rM0j03J77j56M3k0N2J22K5J0j40J40J6j16l4l1p8J74j80P8
5015g1Q0M2o7R4Q5k40J06q6Q2L3j07r2J10N3r0P1J41o8n6ol0J21j91J9O7n4J57
5042A03Qj41K3r7L17l17J89m5M2j41q1K88qnp3l3nN9k8j60J58j48J23P4j18j3
5068b9L3L3j31J08j28N0J69j03j24L07j83K6P4j41j05N6J56k45K40L7k02J03l6
5091c5q2J08pQ8r6KK5M9j01J19j97J15L0L2p1j6m3L0l1O4j05K29j57QJ41j15J64
5118A48j26L4o3J13n4K7n5n8p1K06j18J29j21O8j4l3j71J55qo4q4J43K04j40m0
5143Gj00K0l9j7K96k03q0R4j35K89j3k17R2K3l6k3j9M3K11l34r1L74j63j4l1m5
5169a11J07O6k7r8P8m9Q5k1J20j36J6P6l5j55L3K07j70P3j12J04j14n8R0kJ8o1
$$ y = [-2, 14, 200, 54, -81, -90, -50, -153, 24, -132, -89, -109, -57, 65, 90, 100, -40, 100, 116, 0, -34, -65, -143, 31, -149, -71, 9, 51, -16, 78, 163, -77, 29, -57, 25, 58, -49, -141, -31, 22, -68, 3, 144, 76, 20, 14, -16, 105, -86, -67, 0, -54, 103, 111, -30, -7, -104, 213, -104, 85, 40, 82, -59, -140, 148, 140, 135, 62, 29, 24, 83, 55, -105, 53, -95, 28, 102, -16, -29, 4, 37, -94, 14, -114, -64, 105, 2, -122, 185, 2, 28, 102, -39, -144, -88, 68, -177, 63, 100, -102, 1, -35, -117, -9, -16, 72, -24, -22, 3, 52, -49, 70, -127, -12, 18, 50, -21, -37, -80, -50, -81, -17, -122, 107, -50, -42, 99, -16, 148, 22, 56, -7, 106, 52, 79, 24, -34, -105, 101, -17, 112, -9, 59, 45, 12, -159, -4, -12, -76, -160, -17, 187, 47, 7, -93, -73, -112, -129, 167, -36, -116, -22, -157, 132, 119, -98, -6, 17, -19, -42, -61, -18, 193, -141, -232, 142, -21, -35, -66, -111, -4, 62, 35, -63, 15, -34, 51, 30, 150, 14, 30, 106, 71, -84, -51, 156, -14, 59, -53, 51, -63, -121, -31, -33, -15, -76]
5195g6rk8J0J26J12j16n2j57M10k56n1R6O8k2m6k9lM1K1p1n7R1Qko6M1K4j63R1
5224f5J67nrj56J43r8P9N0j57J85l0r3q1P3q3Q3o9KJ06j21k4n2L72k11J0j5L7
5251C8P2j04q1J49k21Q8J99k92m2J45J6P4M4r4R3n6j09Q4k3j0N2j11R1N2j53J18
5277A9P5j96J98k15J23okj43K26j7j6k16lJ92j01r0O0L2J62r2J24k36K20j52n3
5302a07K65j21L3l9L4L6j71J57O1k92O2r2J16p6M2K86k80J7N3j83J1L58p8K6l7
5327H1j22Mj94J87l1J55L0O7q4l4k7r5o5J03J77k72J5J24j47k5J05R8o8j8R2n7
5353al9J44j85j75K82m4k7L9p7q3N4J37K7J26j63k0K47l45N9M5l0J46r5j6j57
5378a51J50r0J62p5Q6j11O7NM3J5j42J40j56Q2j7Pj58K57j69o5K04j80j0J14o8
$$ y = [-76, -85, -113, -103, 23, 135, 19, -33, -190, 220, -36, -87, 9, 77, 55, 9, -20, -23, 18, 39, -32, -89, 2, 10, 8, -58, -17, 7, -156, -65, 102, 97, 88, -68, 75, -23, 56, 106, -51, 134, 104, 11, -70, 3, -80, 3, -66, -64, 42, -79, -103, -155, 217, 6, 16, 1, 38, 110, 6, -75, 74, -147, -59, 140, -152, -194, -49, -33, 41, 85, -9, 84, 28, -81, 3, -20, -30, 22, -89, 2, 54, -99, 19, 94, -102, 96, -119, 4, -2, -4, -147, 79, 62, 46, -170, -173, 19, -82, -172, -112, -80, 82, -10, 114, -122, 98, -54, -107, 158, 37, 70, 31, 65, 101, -70, 87, 148, -144, -82, -174, -58, -134, -92, 194, -86, -69, -16, -199, -188, 170, 92, 118, 81, -41, -37, -231, -44, -75, 80, 110, 177, 93, 59, 32, -63, -128, -25, 152, -120, -105, 19, -128, -153, -48, 50, -18, -36, 56, -1, -40, 104, -81, -256, 26, -18, -45, -6, -83, -166, -112, 25, 52, 178, 15, -5, 242, -103, -44, 1, -29, 117, 22, 6, -151, -1, -91, 71, -4, 82, -29, 38, 43, 86, 101, -41, 99, -57, 25, 8, 15, -143, 114, -55, -120, 84, -96, -106, 8, -60]
5403f0J71j43m6K8J11J8j78M6r0J52m6P9mm1L3j04J57j32j32L64k80J49J75k36
5427io8R6K5J2K6j65p2L8J44j38n6L15k3J35l15o6J96J3o5j48K40N1m0k74J42
5452fP1O3J14j01k5Kk15P5j19L43j11o4J22k48J69r2j05J49j52J93l4R6r8J14
5476A41j90R7m7M4j21L6J51n5j64J50j50K5J14q2L8N1K3j49j0K4R3j27J62j38
5500h4J54J2lL0r0J2%o3j58K25o5J86j67j16K80l13J60O4j10j30J90J19j07j2
5524A4R3o8p5J81j51n5K12j64R3P1k79J12J99j22L4j62R0P0L0p7lJ2j42l3J67
5549D7p8L7mn1lo4K77j53n7k8J4P1j64L12j97N6L6j0L2q0l9J74k08n3Q4j58K83
5576G6j09p9R9Nj06P2N5oJ49k15l8L6q1K12M8j65L4n5J81r2%o2lJ15R6pj42r4
$$ y = [-60, 111, -32, -78, -50, 61, 79, -99, -53, -143, 9, -37, 42, 38, -3, 30, -74, 83, -49, -181, 183, -97, 52, 227, -9, -77, 19, 44, 56, 82, -83, -155, -117, 27, -111, -167, 148, 125, 260, -55, -121, 75, 88, 23, -125, 115, 166, 126, -148, -6, 65, 128, 242, 141, 116, 118, -97, -22, -141, 202, 91, 27, 149, -99, 70, -22, -127, 22, -130, 63, 29, 125, 27, 141, -49, 48, 1, 45, -76, -40, 111, 56, -108, 42, -108, -83, 31, -51, -13, 38, 61, -88, -98, -74, 19, -108, 54, -84, 70, 82, 79, 109, 19, 31, 31, -32, -190, 35, -30, 156, -11, -127, 153, -160, 0, 64, -46, -176, 14, 133, 26, 14, 107, 39, -36, 145, -6, -61, 151, -13, 80, 151, -128, -16, 183, 61, 95, -67, 23, 93, 123, 46, 43, 55, -87, -120, 47, -31, 6, 2, -49, -52, -116, 161, 8, -49, -77, -63, 8, -156, 156, -41, 15, 51, 41, 73, -7, -46, 128, -80, -133, -49, -207, 76, -33, -112, -13, -8, -114, -42, 13, 7, 156, -59, -97, -61, -142, 70, 118, -47, -13, -68, 113, 21, 21, -41, -44, 71, 167, 160, 18, -76]
5604g6J30R1k09J10q8k3J62k77L09n7m1l4r6J77r9J52j70N9J29j30j65J01K00
5627A55r1j09pP1k5k9k3n4J39M0j08N6k01K16j39J97Q4k54k6L36k02n1K9p9J12
5652C7j15J20q3J44j35jk9K0J1J57j31P6l9K1j14j62P9N4L5J17j11o2O8L7j22
5677a28k9J15o0J36L9m1M0J28j33j69K61q2n2O5J9j98J35j02J42j6j71%r0J55
5701c6k6L3J74k54J92o3n6r6J12k8JQ8N8j64K4L5K17j64K4n9l12K36j4Q3l6j24
5727a55J36O3k1o7N2R4o1j13J61l0M6K2%j32k0N2K05l75K09K7N2j63K5ko7qo3
5754a33J44l0q2J75r1r5J13kJ31j73Q3n6J55k24J19j15J11J39j93p3J69j32J79
5777A19m9j63J82L3j35k0l1j6K05j99O5Q3j0j01K31k27J15j86Q1P2o7r9J63r9
$$ y = [-76, 54, 145, -64, 46, -42, -65, 97, -180, 129, 72, 31, -3, -99, 78, -21, 131, -39, 20, 149, 19, -146, -45, 155, 64, -45, -52, 19, -6, -35, -58, -112, 27, 67, -41, 15, -186, 30, -109, 88, 172, -82, -108, 228, 26, -25, 4, -75, 37, -78, 42, -41, 103, -32, -33, -62, -42, -31, 126, -5, 71, 32, 53, -61, -223, -144, -90, -55, 62, -49, -111, -43, -6, -128, -157, -42, -102, 34, 73, 32, 72, 200, 67, -102, 159, 77, 25, 90, 109, -89, 46, -56, 86, 70, -101, -101, -191, -36, -62, -29, 145, -109, 83, 20, -36, -132, -20, -48, -47, 41, 99, -65, -41, -6, 211, 47, 71, 12, -300, -64, -78, 5, -31, -155, -19, 44, 23, -44, 8, 102, 41, -72, 89, 59, 105, 127, 127, -5, -25, 27, 232, -143, 66, 93, 145, -18, 7, 5, -62, -70, -133, 11, -19, -101, 74, -17, -112, 1, -1, 130, -43, 40, -16, 139, -85, 34, -81, 30, 169, -24, -97, 72, -60, 119, 70, -93, 89, 122, -13, -33, -64, -80, 125, -74, -9, 74, 64, -37, 194, -33, 82, -104, -23, 49, -18, -117, 46, -53]
5801e3N9j55J79m0p5K15j61q5J61j96J31Q7j14K39k40q8J13N4k59K06R6L3j28
5824b1J8j3J74j7j9k13J51o4R8j29Q1jJ4j53j3K54K1k29P2p3m0J34l6o5j8j4j35
5851b36K71M3j44R5j2P7j24n8N4N9K3k29Q5o1J38qJ4L6j0j17J92r5J97q3j51p
5877e1K8k2J62j09K08r2j26M4j7J68k87K8J50O1k54J40j9pO9j42MJ47j6m9j02
5902h4K53j7k32J31n9j68K54k05L6P7q2J74n0m9K1J10Q8j65L0l2r9R8J44j78l0
5927c4j55J71lK77k95J1J76k29J39j95J05m7KJ59j05J2l4L7j7j0j13K50j20QJ4
5952DJR9j09R2n9o1jo2l0N1k1l2jK42j14K2n1o9O7M1r2o6L2J47j13Q3M1k1j26
5981a06J0J39j41J99p5L3M2L5j38o4rQ6J02l63J41Q2N0NRk12MJ02O6l6J5J24l5
$$ y = [-53, 6, -149, 30, -10, -85, 130, -31, -116, 45, -151, -20, 67, -47, 192, -48, -136, -23, 31, -228, -22, 74, 107, -21, -3, -16, 158, 141, 122, -91, 60, -4, 94, -35, 46, 45, 59, -94, -107, 147, 168, -61, 11, -62, -102, 32, -4, -69, -87, -101, -236, 35, 78, -66, 29, 17, 94, -30, -88, -34, 25, 48, -181, -96, -157, -19, -27, -13, 23, 13, -104, 88, -7, 190, 107, -44, -51, -23, -45, 117, 8, 216, 124, -2, 42, 25, 193, -94, -66, 84, 145, -109, 31, 12, 5, 74, -68, -64, 83, 67, 18, -84, 169, 152, -80, 51, -8, -176, 78, -127, -91, -14, -96, 78, 28, -21, 0, 110, 198, 33, 63, 31, -68, 30, 174, -4, -34, -189, -18, -21, 256, -39, -28, 148, -81, 58, -137, -32, -79, -77, 82, -23, -11, -45, -8, -25, -35, -148, 102, -18, -10, 4, 5, 104, -5, 87, 28, -33, -34, -96, -126, -75, -96, -128, -129, 113, -1, 21, -30, -99, -32, 9, -83, -149, -117, 30, -83, 0, 41, 20, -106, -96, 43, -98, 101, 26, 59, 101, 136, -2, -66, -75, 11, 113, -250, -109, -27, 23, 28, 37, -175, -171, -69, -3, -39, -24, 100, 65]
6008F5l7K93k61j87J70j1m0R4j57n8L6R0n3J59k3r9J02k36O0J41M9%KL1n4k98
6034b22J48K22j69m9J16l0r8J43n2Mj02J05r2p2J59m8J11L3k16Q0p7J09p8R4K6
6059D5jL4j05r6nJ98M6q7o2K61j84Ko7J87j81J04q1q0L53k93P2r9j75J68R3j11
6085f4K86k14k63J37J15J28p7n4j8P0j96R8J06j01J96j07K3Jr1n3l2K1K3m5M4
6110f7k3J62KK7l6j31J48k06K40K1o8j01k7J24j82P1N8j22J6K20j43O1N5nj57
6135f3j3J8k4J75Oj34p3L5l5Q4J45p0k03K88q9k6Kl1l1l2O8q8J3J15q4k1M3l1
6163e6J41k6j47jP7L2MJ01n2J12l00J7J51m6J53k49J13Nk0m4rJ29R9k44p1R3p9
6190a17Q4K3J3q9K09j46j47K79j52L0q3J40p3J18j12o9mJ25m5R1j59J19K3j6O2
$$ y = [65, 28, 321, 60, -127, 43, 32, -8, 86, -71, -129, -93, -3, -56, 103, 80, -19, 83, -153, -93, 48, 97, 97, 99, 130, 76, -222, -74, 148, -21, -70, 46, 16, -82, 61, 9, 13, -89, 16, -76, -148, 11, -37, 74, 107, -109, -29, -106, 3, -75, 19, 45, 44, 78, -27, -123, -128, 70, 116, 29, -33, 228, 44, 46, -21, 166, -15, 89, 8, -72, 281, -12, 60, -39, -214, -46, 47, -64, 222, 8, -255, -118, -3, 125, 48, -6, -24, 46, -150, -52, 54, -47, 149, 42, 65, 66, -25, -78, -110, -89, -66, -111, -67, -90, 72, 74, 101, 65, -66, 82, -124, 116, 137, 69, -32, -59, 65, -117, -46, 12, -110, -94, 126, -17, 44, 99, 94, -63, -76, -58, -82, 93, 99, -35, -108, -73, -108, -24, 121, 51, -152, 136, 47, 21, 23, -8, -39, -71, -3, -91, -78, 37, -47, -68, -25, -56, 85, 59, -88, -89, -12, 20, 24, 125, 73, 185, -115, -98, 53, 7, 160, -89, 24, 29, 9, -35, -44, 85, 184, -60, -131, -38, -117, -33, -10, 3, -86, 123, -23, -170, 109, -43, -13, -96, 44, -29, 89, -23, -92, -96, 29, -16, 75, -84, 35, 58, 42, 104]
6215A04k14n1K40n5M9r3n6R9L3k4O3n3m4k3J06j97K6j3O9J43o6j01l5L4k4J6J87
6242A20J68l04M3R1l99K97q0k4N8k4J57jq9m8k8j8K20j45j5O8l4O8l5k41J75j6
6268c6K68m62K10m7N5M0k2J38j95J63j64Q1j19O5n1K12k98J65M3k3p3J65j57J07
6292F5j08n3M7j44K66j17J05P4j65P9Ln4j0j47P0J37l6P8n6o1J02J32l31Q6P0
6317C2j22J53r2J27j92K13j28L6K9j86J64o2P4j29J5J13m3M0jMK9j79J78n0L3
6342E6J1j1M6k10K16j82K31o3n7J43j76j22q0J45L5j2K06p8k20J81j51J56q3J89
6366A70j87M1p6J07l0N0j91J24L7j01q9J93j11k6Q3j6Mj00K8O4l2K4J38k04Q4
6391a6%k2J25J44o1q4o1JPr7K04k0n0r9J51j71K4J07J0k03M5J16j3Q1k64K6K24
$$ y = [104, -110, -161, 79, 24, 73, -20, -76, 23, 56, 32, 95, 42, -2, -25, 81, -116, -90, -103, -34, 109, 43, -58, -93, -59, -83, -67, 120, 288, -16, 27, 118, -281, 16, -64, -88, -30, -54, 103, 102, 13, -35, -63, -81, 139, -6, -21, 47, 13, 81, 46, -195, -20, -36, 232, -230, -20, -67, -12, 28, 6, 144, -51, 112, -52, 29, -90, -25, -76, 136, -162, 3, 46, 23, -50, 115, -42, 65, -43, -96, -49, -193, 73, -44, 61, 135, -30, 49, 52, -2, -12, -159, -89, 48, 12, 90, 34, -27, 75, 207, -124, -38, 32, -90, 63, -29, 98, -94, 119, -9, 27, 56, -130, 34, -28, 46, -83, -68, 45, 2, 42, 41, 45, 74, -105, 73, 23, 56, 67, 56, 102, -108, 108, -74, 157, 94, 37, 180, 4, -118, -198, -53, -18, -30, 176, 98, -122, 59, -92, 64, -19, 170, -17, 24, -52, 55, 25, 75, -116, 8, 45, -56, -145, 48, -63, -89, -6, -22, -18, -118, -90, -26, -58, -34, 104, -100, -16, -16, -38, 87, 231, 170, 86, 25, 26, 33, -64, 140, 120, 70, -29, 122, -49, -25, 82, 92, -111, -66, 50, 37, 118, -146, -120, 104]
6418A04q3J03k18J63Nj46qj86K54j53R5k5O4J87j79p5P0o0M1j49K99j07Q6p6j9
6443a3J48r0J8j8l1LJ44k18R8j16J96k41%J5J14j10J40Nr3N7j31j4J57k5r7J13
6469A1l3R4l3J30l01Q2L3M3n2R1j23O1LP4j03J08j22j26K70on9K03j43j87n6K44
6495A03j73j05P9M8j7K18l26M8j8J12K5j62K37j60J55M2j94l9J03r5J3P8N2j14
6519i0M5Q9q4M4%j03L7J16p8m2p6J50nK2j4o2M6o6o8L5J12q9J9K68k13j60J67
6546@J0n3J6R2j76M7J11q7J32j59lJ15j52J85N1j41Q1j79K22j46r1Q4q5J02Q1
6571E7R3k75l3J41PJ2k4PPl0J93p4j1p1P1j00j3PO1k5OJ35o6l1p4j6M8m5K5J66
6601A48k37J43mP2k46R3N3RQN8j82Q4o3R1J38k85RJ56p6N1j8rJ41k0j81J7j4J35
$$ y = [104, 21, 124, -94, 69, 74, -72, -80, -266, -12, -165, -70, -95, -31, 156, -23, -98, -28, -88, -47, -196, 103, -4, 82, 6, -13, 135, 45, 63, 45, 14, 17, 161, -57, 41, -75, 121, -120, -120, -105, 9, -101, 39, 44, -49, 8, -123, -137, 20, -5, -102, 11, -22, 72, 39, 169, -132, -50, -17, 26, -26, 65, -58, 3, 6, 80, -23, 85, -37, -163, 107, 101, 42, 245, 102, -85, -141, 103, -70, -175, -96, -48, -65, 153, -173, -125, -143, -31, -6, -168, 69, -91, 64, 106, -88, -127, -24, -119, -106, -28, 24, -90, -45, 44, -40, 4, 4, -99, -62, 54, -24, -66, -142, 8, 3, 25, 11, -51, -5, -71, -139, -104, 8, -81, -62, 206, -7, -167, 0, 10, -43, -27, 65, -111, -64, 47, -40, 92, -67, -70, 45, -107, 78, 129, -12, 69, -110, 112, -34, -125, -41, -126, -24, 57, 150, -125, -158, -17, -10, 2, -22, -15, -8, -38, 155, 81, 70, -1, 70, -30, -43, -36, 25, 0, 6, 141, 75, 44, -30, -46, 2, -43, -18, 148, -89, 54, 50, 122, -124, -31, 22, 31, 39, 97, -85, -1, -64, 27, 165, -120, -111, 45, -31, 20, 2, -7, 134, 114, -67, -50, -64, 71]
6629G1l4m8Q2N2%k41J17O5P4j18J9k06J02k5K25j35m7K8P2j34J09m0j04J80o9
6654eK8k3J20j67N2q6rJ34k11L40n5o0O1l7n9J3k2O3l8j01K2Q2J1j58q5J98r6
6681h8J10j00k1J71q3J51q0q6J92k76J03J22j59r6J58j62K75j98K4m0k0K04q9
6704A2J11j70KJ34r4R4j23o4J30J51k11o9K0J49j62J17L0q2m5m0L9K04j48M9k6
6729Hl7J81j53j41K65l07P1K93p2j21J06J06j33j43O7R6k30J36o4K07j51p2J15
6752B7j5K4l8qJ3L4o0J01k22K93j87j23J35j34J91L2L%rk4l0J85j79P6j59j8k7
6779a19J69j52J78j9j57j23J94P2j29K4O1j0J05P5l63L65m1j4j46k4P1j01K24
6802A40k21p6Q8J06j81R6J28j63k7K10k23J41Mk3K6j04J08R5M4k52Q5Np6J35J8
$$ y = [71, 37, -11, 71, 123, 123, -118, -1, 64, 138, 20, 39, -167, -65, -90, 135, 0, -47, -19, 53, -81, 28, -12, -116, 64, -5, 23, 0, 120, -47, 5, -81, -90, 44, -167, 173, 118, 58, 119, 82, 23, 36, 14, 77, 39, -62, -40, 42, 53, -105, -190, 8, -88, 22, -78, -99, 72, -11, 140, 60, -26, 166, -110, -7, 115, -44, -140, 18, -144, 131, -67, -43, -83, -103, 101, 12, 123, -47, -45, 89, -5, 89, -34, -98, 32, 183, -28, -97, -77, 72, -90, 27, 57, -25, -70, -110, -71, 133, -15, 34, 8, -29, 152, -1, -142, 123, -184, -113, 180, 108, -13, 93, 199, 66, -77, -10, 86, -144, -8, -72, 135, -16, -88, 27, 12, 36, -2, -10, 3, 37, -23, 78, -144, 149, -38, -161, -26, -160, 31, 63, 66, 66, 57, 33, 3, 188, 9, 85, -74, -92, -119, 50, -102, 76, 57, -100, -223, -29, 43, -86, -62, -1, -11, 94, 169, -194, 171, 130, 116, -30, -54, 17, -84, 140, -81, -157, -69, 37, -144, -48, 80, -83, -110, 100, -123, 18, 22, -1, 25, -79, 29, 124, 168, -84, 1, 6, -70, 65, 83]
6827H3j53J62R3l02P8K2p2K01j33p5O2K6j07N0J22l6J19j82J19j92J13j62J96
6850C2O6kj70o0J06j27R3p5J47q4J03j9K29k96J4L2J25j44p9R9l0o0q1N9J66l6
6876Hr7J46r9k13K53j8J08Nk60J60p0m6J4K81r4j42k7J71J19l47J66j18M7Oo9
6901a16J86j30J36j11m1j5R3L5P6q2j2m9M9R8l49L05J48j10j53n9O2j41l5K50
6925C5J20k72K62j90K8r1J91k9j08J53j43J14j35J51mmq2j08K0J80n6q0J92l79
6949b35J94j60K50j62o5K39J0j9N7j89J75k70K33j1J52k03j00K53j24j81K5J34
6971Cj42R0K01j52j3k7L1k7ll7J02o1O1j12q6J77J54j49q9%K0k4K9kK2j0p1J39
6999B4j12J97m7r4R9j08p9J92j28P3m5N8k91M9L15j12P0m6Lj23n7L10o0K1r3J04
$$ y = [83, -70, 92, 185, -117, -39, -17, -89, 112, -21, -96, -34, -8, -115, -65, 57, 21, 140, -42, 77, -115, -2, -164, 32, 98, 96, -74, -134, -28, -155, -62, -137, 10, -74, 29, 10, 239, -57, -43, -11, 114, -30, -109, -10, -40, -100, -181, -122, 44, 8, -89, 57, -42, -255, -2, -20, 88, 93, -167, -7, -77, -123, -109, 172, 78, -64, -91, 80, 199, -148, 18, -100, -53, -47, -116, 70, -60, 76, -35, -76, -91, 2, 37, 113, 31, 19, -30, 19, 117, -232, 73, 221, 111, -42, -101, -39, -180, -215, 35, 155, -117, 145, -45, -17, -108, 83, 54, -54, 99, -44, 70, -65, 86, 82, 78, -4, -112, -92, 88, 32, -48, 144, -235, -41, -201, 49, -113, -178, 61, 71, 52, 109, -80, 95, -175, 58, 47, 199, -4, -104, 149, 25, -156, -131, 3, -139, -49, 152, 0, -13, -40, -9, -36, -39, -76, 26, -35, 26, -86, -172, 5, 159, 10, -79, -79, -59, -83, -54, -56, -34, -44, -115, 24, -88, 109, 62, -32, 67, -41, -120, 72, -56, 17, -28, 30, -261, -212, 103, -9, 61, 15, 18, -105, -162, 148, 88, 109, 16, 120]
7025A20k47K66k70P2O6J06j06m8n9J05l1M2L4j9j12O0L8k3N1j40N2N1j00J00j01
7050i3J29K9j07r2J54J4r6J10j02K95k84p9Mj0p1J32J31j96n1K06k8M2j54K51
7074A34k38O5J35j92J57m8j46L4J15j17j43K33N1J65k25R8j27J43j40j00K18k2
7096E0J01k51P8j23K68j77M7Q1k0j91J11K7j35nJ8J05O0p7j41K59q9o8R6k0p5
7121g1K3l0J20q0r9j01K40J68j65M3n9j5n8L3J68j77J33k32J20N1L2R6r9l7j07
7146a03Q5j02K33j2R3l13J65Q9j31j5N4m5l7O5j1L5q8J53r9J22j89Q4L3q5R8p3
7172Fn9N9j51J38R7j81M1K45k40J13j13J10j18R7m3j05J98kj08p8r3L22o5l95
7196c25K71J5l1M9J6j04O1L0p3MJ98q0k18J94L2j23OL26j40Np1p4o1J00J53j08
$$ y = [120, -127, 139, -131, -59, 7, 113, 7, -41, -100, 5, -26, 16, 50, 31, -81, -21, 17, -6, 45, -95, -43, 8, -92, 8, -93, 36, 65, -42, -134, 20, 34, -62, 48, -54, 241, -43, -122, -118, -128, -199, -67, 64, -132, -183, 23, -5, 37, -117, 134, -104, -39, 96, -96, 61, 13, -133, -99, 16, -101, -244, -11, 40, 205, -20, 78, -49, 94, -46, -146, 72, 50, 151, -100, -22, -145, 123, -54, -7, 74, 54, -137, -26, 1, -134, -139, -121, -16, 44, -33, -174, 85, -4, -72, 24, 4, -71, -48, -78, 42, -38, -137, -238, 2, 170, 5, 48, -11, -26, -84, -51, 117, -60, 73, -159, -39, 12, 44, 140, 41, 4, -103, -18, -120, 113, 101, 194, -119, 46, 135, 4, -11, 43, -2, -39, 26, 15, 50, -38, 115, 16, 138, -51, 33, 66, -19, 79, 6, -53, 6, -145, -7, 90, -91, -50, 195, -45, 68, -45, 65, -53, 44, 1, -104, 94, 92, -16, -94, -187, 135, 70, -325, -54, -39, -70, -21, -5, -109, -48, -18, -91, -87, 111, 31, -187, 7, 39, -84, -78, 248, 108, 113, 42, -32, -93, 7, 160, 52]
7222E2o6Q1n8Q7J23k34jn6M5J00r9n4J56n4M0K3k1K9l2j39K30j55q5R2J16k57
7248a37N3j21L38j10j12L41j01l9Q1r9m1p4m6JK59j36J7j26lP7nJ2k25K29J50
7273A83k44j59K11O4l4J06j80qK48k96J63j4n8k5J89k06J87l8j05q4J01k9K8k1
7297b1J7L3K3j25J64j2q2J3k7K19k90J3J18n1L9r8k4J06OP4k9j31N1o1qJ03L3
7324E3J8k03J84L1j66K4O3K0J3j78K89j64o5J37j49O1J4J33j10M8p1J29k46P2
7348f3%K93j89j02M0nj1j1J95j24r3q5J91k6O7j50O8J07n5R1j23M6K8m0j7J08
7374A40j99K1J14j6l3j84J41R6j30J2K2M9p9k3P0j05J53p8PN1k79M64p8k94L75
7399B17k58K05j03l9J0l2k19K66k9j04R5j09M7k4J46qR7j33l7Q7K9n6j13l3J45
$$ y = [52, -14, 67, 9, 96, 219, -15, -16, -72, -27, 73, -26, -80, 76, 22, 62, 85, 64, 93, 61, -78, 152, -3, -88, 4, 120, -137, -84, -205, 133, 23, -89, 252, 151, 112, 193, 94, 53, -21, -67, -66, 193, 57, 74, -52, -55, 22, 17, 29, -196, 33, 183, -61, -220, -9, 55, 21, 127, -53, -61, 187, -109, 54, 40, -18, -43, 146, -60, 127, 89, -16, -100, 1, -28, 0, -21, -4, 29, 52, -73, 91, 79, -3, 10, -17, 202, -88, -75, 43, -8, 31, -67, -91, 15, 21, 95, 66, -65, -14, -75, -83, 20, 53, 71, -132, 52, 83, -83, -59, 4, 24, 37, -141, 148, -16, -81, 56, -93, -32, -18, 115, 5, 53, -18, 111, -135, -63, -63, 230, 41, -61, -21, -26, -37, -48, 147, 23, -70, -155, 36, 10, 77, -73, -5, 102, 47, 138, 15, 61, 89, 49, 32, 140, -59, -38, 76, 60, 27, -157, -16, 80, -50, -38, -16, 33, -46, -69, 1, -104, 49, -29, -22, 29, -250, 214, 136, -158, 217, -41, 164, 61, 22, 32, 0, -219, 47, 18, -86, 9, -100, -53, -77, 69, 61, 158, 25, -12, 75, 104, 48, -65, -98, 47]
7424D7q4M2nm1j07K56K6p6k4j84k1N4J16L6j17J90k64K33Rk25K30Kj7j68m3J34
7450aj93K75Q8j56k4q5J34K1M2rj48J16pk5J2q4J30j09K2j40M7J01M5m6j33m7
7476a74J46Rq8N3k9J13m1N6q9N3J1j23N7k4J18k4LM7k4N8k46J26k7q9K74j02L
7503D7k29J23J17L8o2o7O2j5j78N1J60M3q1K1J05j03j12J22J82k54R0j9n0mQ7
7528G4o5M3o8p3r4L24j47P0o4J3Q8j3k5p3J47k77J33j04O3J99k02n0J61n5%N2
7554E7p8l3J07p1n9J29N9j78J22j54M5J41k3J16k16q1Q4n5R0o6R7n1L0J40j70
7579a8R4l4m4j8j02m1J42J00j58l8L32k37n3r9K68j49Rn2J05k22J03K03j95J64
7603F0M0j46n2J5N9k02Q6l3M14k04l1J53j44J17q2j08O1M0j19L2J99k06N0R1P8
$$ y = [47, -37, 5, 0, -41, -148, 108, 134, 58, 34, -150, -171, -117, -1, 35, -82, 108, -156, 77, 86, -139, 91, 93, 76, -92, -135, -1, -194, 81, 169, 13, -11, -96, 38, 59, 101, 92, -56, 60, 53, 28, 40, -44, 86, -23, -1, -141, -94, 7, 52, 6, -127, -174, -28, -19, -107, -54, -83, 30, -11, 45, -44, 9, 20, -103, -46, -70, 48, 24, 27, 74, 50, 108, -138, -12, -39, -128, 146, 44, 47, -182, -59, 58, 96, 34, -33, 29, 14, -164, -113, 47, 90, 9, 30, 135, 32, -80, 42, 224, -30, 60, 41, -9, -13, 74, 9, 52, -16, -89, -183, 141, -6, 64, 0, 13, 101, 88, 63, -10, 137, -140, -7, -111, -48, 151, -51, -101, 60, 5, 5, 57, -21, -54, 53, -18, -77, 52, 111, -67, 55, -99, -54, 87, 64, 180, -36, -117, -33, -88, 2, -64, 33, -18, 12, 152, -18, 76, 42, -2, -20, -122, -163, -21, 79, -79, -117, 215, -22, -75, -174, 94, -55, -46, -98, 7, -215, -112, 91, -104, 60, 100, -46, -98, -83, -24, -226, -140, -173, 241, 37, 6, 159, 15, 132, 50, -58, 3, 43, -76, -44, 155, -51, -1, 90, 168]
7628A68j32O2N8k38OM8K01k96Q7J34j71k05K23J29r5j22K05m8l1O6j30P7J5j25
7652a14K99k07J08n4J42j50P9k7n0j37N2L8mK26k41J56j21l0R9r3J61k14K07k34
7676a09K45j16oj4rQ2j05N7o4QR7mp9L8O7p3lQ6j18p7J11J70j73l1j38J17q2R4
7704b9J60j14j11m2K34K1k37J46o7J11LJ46k24J19k06J28p6o1J19M4KO9j54j35
7728a54P1J53j09J00n5Q2j0Q5p4j32R7Q4k30J33o8J73j48j50L12k20K61k44R1
7751D8j25l6O3Q5p7j9Q2j10J39J4L2Q5j24kj8M2j18k2M2R1J39j54j7q5M6J5%J1
7779B7p7J34k15J62R5j91J77j95O9M9J24k23J75j57j97K75Q3j90O1J5j0N3l1r
7803DM5j52P1n5p8K07j81Q6J09p2%K5j64J52nj11Q5m7J7O8k4o4K37j99L7n4J46
$$ y = [168, 36, 98, 156, -82, -76, -28, 173, -123, -36, 98, -73, -278, -55, 74, -21, -143, 62, 14, -17, 49, -81, -4, 11, -114, 185, -22, 86, 32, 174, 24, 103, 76, 26, -111, -59, -21, -25, 201, -40, 116, -5, -35, 64, -29, 132, -82, 125, -109, 136, 20, 14, 0, -9, 73, -32, 25, -39, -31, 66, 62, -17, 21, 88, 15, 12, 98, -20, -97, 14, 184, 11, -20, -158, -41, -123, -29, 131, 17, -94, -136, 98, 119, -118, 28, -39, 72, 75, 221, -3, 116, -90, 38, -38, -99, 20, 64, 66, 135, -19, -154, -83, 70, -39, 61, 6, 88, 78, 163, 89, -43, 54, 138, -92, 41, -27, 146, -2, -152, 160, -60, 201, -43, 48, -77, -113, -50, 35, -42, -61, 21, -89, 50, 64, 96, 181, 57, 55, 37, 79, -39, -61, -19, 72, 211, 57, 40, -45, 1, 16, 16, 27, -50, 84, -131, 31, 126, -65, 112, -83, -14, 35, 159, -64, 111, -46, -243, 32, 115, -75, -14, 1, -9, 44, 13, 4, 49, -103, -32, -87, -165, 42, -139, -53, 56, -16, -16, 9, -155, -3, -8, -119, -34, -81, -64, 4, -20, -84, 153, -46, -9, -63, 83]
7830H3o5qq5j79K59J70k41l0J97n6P2K7j88R8j89P9K4J3j70K18J69k47J54j53
7854d8P7j77K31k28J67j38NK46j96J04j60N7k2K0JlJ08jp8Km4P2N6k38P0J28O3
7881G4O7j67jl2O8j38R9M9j50ON3r7L55k82L7J91m2p0L0m1O8n4Pkj37J68q6Q4
7909E7j7J27k3j18o9p9J64q9L5m1J62j33P9r6Q7r6K23j94j69O3O4N7l8J40j47
7934e1L2l9J09j97J04J07r9J33k5j31J93J1oJ3Kk01Q0r5J01J51j83k9r9Q8n3j12
7960a96J76K4J01j16L6pRm5J4K15r4p6N5ol9m5K1JJ55k60M9k4rJ82k49kJ68o0
7988b2M4K3m2j64K27j53K64j72J30j02R9j20k3j28J55M0j6R1k04K26k04j58J41
8011f8R8j18J32j62K54o7L3n4j8K9n6l1j2O5r7P0J03p4M5p7n6K16j77L2jj05k1
$$ y = [83, 18, 10, -75, -254, 5, 175, -66, -96, 101, 45, 117, 144, -44, 54, -135, -56, -32, -19, -189, 29, 198, -49, 105, -48, 29, -148, 83, -145, 22, -116, -111, 135, -61, 43, -117, -60, -82, -62, -61, -64, 44, 43, -35, -33, -77, -5, 51, -187, -117, 11, 74, 141, -26, -27, -59, 9, -129, -30, 19, -131, -125, -72, -169, 186, -96, -59, 132, 90, 20, 50, 9, 77, 23, 30, 28, -109, 59, -27, 57, 40, 167, 144, 26, -43, -122, 42, -47, -12, -53, 109, -24, 55, -41, 46, -50, 173, -21, -190, -127, -63, -6, -44, 96, -51, -19, -58, 51, -146, -42, 65, -34, 99, 74, -57, 136, 147, 141, 154, 156, -45, 35, -60, 41, 192, 9, -20, -119, -31, -84, -196, -20, 4, 105, -11, 25, 18, 27, -18, -4, 211, 117, 41, 96, 90, 51, 6, 27, 28, 183, -77, -28, -52, -61, 121, -128, -130, 38, -22, 22, 45, 3, -161, 66, -87, 177, 5, 135, 33, 132, 12, -11, -139, 16, 56, 40, 131, -73, 153, -51, -209, -68, 30, -88, 44, -118, 136, 69, 102, 48, 30, 59, 3, -28, -40, 25, -72, -2, 101, 27, 72, -5, -61, 155, -22, 10, 9, -96, -117]
8038a17J10J07K4o5r9j20K99P8k69q7Q8L7M0%j6j03K39j81j12L1J5J23k7P7k14
8063a42J43k6J2j21l3J07J48j09Q3Q3j68n3N2L1Q9o1m5K59k35m8R0J36k01M3j98
8088a64O6K4Q9Q2j03p7J69m7k0J23p5k57K80j50R2P4q4K1J01k24P8pJ77r8q9k4
8114d3N2l4j67J12o1j56L94l17K11O2m6P8J5mp2r7J87n7m2o3r3M5O9r3J50j4j32
8141a16J32J14j23j90K19j07q9J66n6k3J06J59k22N3r7k3J28J33k07L4j48P2K04
8164A19j00j66Q4J8M9K1r2P2M1j08J43j27N6J2P7k47J0J61n4j20J4J47J17m5j45
8189f3jL0
$$ y = [-117, -7, 100, 124, 59, -40, -160, 139, 217, -52, -139, -51, -14, 26, 26, 10, -93, 146, -35, -147, -116, -101, 22, -5, 72, -142, 1, -25, -13, -134, -167, -60, 88, -21, 62, 145, -23, -76, -24, 7, 96, 35, -10, 249, 14, -34, 56, 192, -9, 34, -164, -98, -74, 15, 97, -6, -83, 86, 39, 19, 142, 67, -190, 90, -60, 32, 106, 22, 43, 144, -80, -2, -9, 168, 70, -19, -43, 9, -25, -192, -80, -141, -297, 97, -220, -9, 53, 7, 85, 100, 96, 24, -73, 114, 57, 15, -48, -141, -96, -27, -120, 30, 16, -116, 16, 130, 7, -183, 36, -71, -160, 6, -50, -73, 33, 192, -30, 23, -74, -97, 31, 164, -43, -9, -157, -85, 119, 19, -147, -63, -45, 4, 25, -67, 5, 46, -62, 81, -46, 10, 22, 99, -148, -138, 23, -31, -151, -137, 10, 127, 82, -63, -64, -34]
8191c4
$$ Imaginary data points
##PAGE= N=2
##DATA TABLE= (X++(I..I)), XYDATA
0@%%%%%%%%%%%%%%%qJ6j6J6j6J7k5L2l3M1m8N6o5P3q8J02j14J28j46J65j84K06
37A09k30K57k86L18l54L93m35M80n31N87o47P10p82Q62r49J047j155J278j419
56g47J575j755J968k218K520k895L371l996M858o125Q175j2014K1507q4515j22724
71a93015K53218O9123j72731j398J43517o5114j09293J19708J08390j61927r7459
82a06981J52539N1409j40539l436R8788l8403p2484O0488N6169o2681l8493O5745
94B2121Q342o3452K3824M5443n3968k3629N3425m102m2902K4362L0765l8175k2234
107d0180N9212J6837p4475O703Q6790l3318p6803O0611O1474p0627m1406P5763
119C0581K1717q7493J6R9029l5783j11605O1664R7016q2635p2420Q5471M0554
$$ y = [0, 0, 0, 0, 0, 0, 0, 0, 0, 0, 0, 0, 0, 0, 0, 0, -8, 8, -8, 8, -8, 9, -16, 16, -17, 24, -24, 32, -33, 40, -48, 54, -60, 68, -78, 87, -97, 109, -121, 136, -150, 168, -186, 207, -228, 252, -279, 308, -339, 371, -411, 451, -498, 549, -606, 672, -747, 828, -927, 1041, -1177, 1343, -1552, 1819, -2177, 2681, -3444, 4731, -7283, 14224, -70291, -193015, 60203, 129326, -43405, -44803, 98714, 33600, -75693, 44015, 152405, -9522, -106981, 45558, 96967, -43572, -47008, 51780, 13377, -59107, 1381, 57550, -5131, -43624, 22121, 30463, -32989, -9165, 36278, -17690, -41319, 12106, 8004, -34898, -10536, 20229, -17946, -40180, 19032, 35869, -38606, -31903, 54887, 21569, -55234, 5377, 66851, -3776, -45182, 30581, 52298, -35195, -35179, 63850, 28067, -83538, -21874, 75142, -7493, -79913, 5558, 46112]
131D6112q6184r795R6101j4833r8668M9154R4937p5366o8597R3537L7784r3315
143b9133j0097Q0752j3006o8839L6185N4462o5592l5731Q8736J2842r1342J2297
155b8466P4091k8912m5273M1127J8240n8430l292P0097j6345p9705L1394O3196
167C7722m9693l3666O0544N941n9106J7964O1572k6140n4421M3045M8329n8148
179f057k8585O8906K397o8152J9595N5096l6373m5120M2667L5030n2192k4559
191c7347N9974K104o5397K3028N8294m3192m5999M8365L1320m6814j7111M7321
203A4546p01n0295K6441N4017m7429m4776N8522K9807n1706q581M2867j0044l8144
216b5476K9491M0681m6440l6960N7848J9949n8589L763M8413k5129l7798L5251
$$ y = [46112, -40072, -49867, 46234, 31401, -67267, -18113, 76824, 1458, -67139, 26398, 64182, -29133, -39230, 41522, 28516, -40323, -4138, 50324, -15268, -50999, 37737, 50579, -40763, -28466, 45625, 16713, -28560, 12567, 30807, -27623, -30915, 39182, 22837, -56868, -25474, 37722, -11971, -45637, 14907, 20848, -38258, -20294, 41278, 15138, -39283, 3762, 52091, -6057, -34642, 34264, 36661, -31491, -11896, 43200, 6827, -38293, 4374, 39404, -12788, -37347, 22627, 24731, -40666, -17638, 40656, -2536, -48535, -170, 31150, -15664, -32775, 14546, 13845, -36450, -10009, 44008, -3421, -48197, 10325, 40132, -11574, -20155, 22712, 12668, -25476, 4015, 44696, -1744, -38704, 19144, 39093, -19496, -15733, 32680, 7551, -30247, 5004]
228E004K7404m2960j9896M9366L633n5823J6835N2302l5757l9240M5338K0419
240B6625m4674l345M3207j0565m5040K5511M5581l9702l6249N0219J6128m9510
252b1814P329M4603k1942l8150L0342L4359l6730k7185M4089J0249n0986R225
264a6611M6957k6749l7028L2718K4217l4704j4548L7746N232m1548R858M2422
276B7962k5333l2644L7814J8340l8421m016L5164m410l1311J3666L0469k4908
288B372k4986L7331J2649m3466K425L8367j5737k9021K0973J8908k7878j4210
300b2273L5251N629m2600O237M0045k0514k8212L0906J4113l3994l888L4610j405
313A3905l4924J0258L4133k2292k6790L4823J3699l8892J355L5552j1045k8997
$$ y = [5004, 32408, -10552, -30448, 18918, 22551, -33272, -16437, 35865, 108, -39132, 6206, 26625, -18049, -21394, 21813, 11248, -33792, -8281, 37300, -2402, -38651, 11568, 27696, -21814, -14485, 30118, 8176, -29974, 368, 34727, -2003, -29188, 14901, 25150, -25836, -16611, 30346, 3597, -33431, -713, 23504, -11200, -25748, 11998, 17230, -24318, -14460, 27962, 2629, -30015, 7799, 26139, -12282, -16298, 18866, 14456, -16855, -3189, 27280, 2372, -22614, 14717, 27366, -16100, -13675, 24692, 8955, -20066, 907, 19815, -8063, -22273, 12978, 18607, -23993, -17756, 22289, 1775, -26437, 4469, 18582, -15412, -19300, 15310, 13905, -21019, -10761, 23372, 1080, -25710, 9113, 22812, -16080, -14725, 20827, 9782, -19215]
325a9215J6235K4921k2924k0577L1103J0702l7900L060L5869j6348k6700K3160
337A386J6798k5163j0667K7593N474l0993M134L1148j6881k4913K7219J2925k9100
350a1040j991K6595m438k3367J0300K3809j6434j9311K5649R531l0452M733K7952
363B1536j5428k2702J8269J5308k0834j2542K3277M069k8980O266K9036j9521
375b246k2553K7063J3269k6795m060K5015p47k3571Q784K4867j8154k1068K7357
388G161J1354l0262M67K6527q873k1597J3249J7748j6578j4594K3180P656k8312
401a2874L769K7577j4375k0233J9705J0211k0872n201K0688N68k3301N999K3227
414A4888j5885j7270K4742P848k5254L037K3266p598j8892J1749J7234j6396j4001
$$ y = [-19215, -2980, 21941, -983, -21560, 9543, 20245, -17655, -14595, 21274, 4926, -21774, 1386, 18184, -6979, -17646, 9947, 15421, -15572, -11438, 19710, 2829, -22084, 5135, 18060, -11040, -13031, 13564, 9126, -14241, -3941, 19868, 3434, -15877, 9772, 19303, -11149, -6416, 21536, 6108, -16594, 1675, 16983, -3851, -16393, 6884, 10953, -18027, -11761, 17275, -2246, -24799, 2264, 15533, -11262, -15322, 9693, 8946, -14625, -5841, 19026, 872, -20196, 7161, 18515, -11747, -11280, 15247, 6374, -15223, -1974, 15774, -804, -15398, 7782, 15438, -12874, -9105, 18472, 4097, -16136, 3569, 13780, -7092, -12293, 8395, 8963, -14338, -8339, 14888, -997, -18267, 6475, 14323, -10931, -7894, 15372, 7774, -11118, 631, 17865, 1469, -12532]
427a2532K2460M472k7648N619K4271j5315j8355J7445J1450j7880o963K0403K504
440I931k2569O303K2925j6307j6916K2713P563k3885k219J9727k699j8167O668
453f932J6878j5011j3873K4166P492k5791K983K3819p255j5930J1811J2133j4592
466a02q526K0504L270k6432L385K4453j3350j7811J7302P828k0026j797K0997
479I695j177k2193P537K2259j4960j6457K3940O831k6195K874K2815r218j9627
492a3876J2320J5590j7331j2518K3341M084k6773O988K4687j4859j7164J9310
504C799R542j9187m027J9693j228k2192Q333J9653j7913j4076K2950M363k2503
517a2793K773J8815o496j4338J1221J3715j6086r599K2912L377k4070N272J9762
$$ y = [-12532, 9928, 14400, -13248, -7629, 16642, 1327, -17028, 417, 11867, -6013, -12976, 7427, 9931, -12638, -6335, 16590, 283, -16633, 6080, 13643, -10242, -12461, 7266, 4567, -13600, -6932, 9946, -5065, -18938, 5228, 12720, -13071, -10088, 13731, 6476, -9454, 2357, 14490, -102, -8628, 11876, 15146, -11286, -7901, 16552, 3202, -14609, 2693, 10521, -9505, -11302, 9695, 8518, -13675, -6138, 16121, 1161, -15296, 8644, 15475, -10720, -7846, 14969, 5751, -13876, -1556, 14034, -3297, -15815, 7526, 11610, -15163, -8175, 16512, 1653, -15511, 3799, 13341, -5846, -9873, 9820, 8592, -13600, -5267, 14386, -3527, -17603, 5347, 9710, -12793, -10020, 8795, 2299, -12039, -818, 12897, -3189, -12788, 10124, 13501, -10569, -5297, 14465]
530A4465j1151j4084J3019Q810j4948o662J8633K671k2467M168K1898j1085j5816
543a2549J6025Q551j7204l429J7318Lj9656M144J9712j2474j7269J9273R325k2571
557a0801l96K1309n528j7749J0841J6705j4621j3349K1950P424k6115L222K4954
570A7846j2826j8938J7903J1081k1185o590K2838N55k5190O320K2964j6753j6198
583a8173K3818O889k6059J154K3188o260j8996J1064J5671j7062j0707K3900M246
596A2673k6125M963K2432j0450j4305J4090Q130j6421m066K0183J269k2544L680
609f491J9981j0760j2744J5661M714j8054j177J7992qj7547K278J6237q748j2757
623a1423J6733O803k0945j387J9527k168j6086N069J3204j0177j1837J7646Q791
$$ y = [14465, 3314, -10770, 2249, 11059, -3889, -10551, 8082, 10753, -11714, -7546, 14352, 3267, -12549, 3476, 12027, -5177, -8606, 8712, 8715, -10941, -6797, 12915, 441, -16828, 2445, 11770, -10801, -11197, 10112, 4584, -13165, -2324, 14381, -240, -13589, 8361, 15785, -10330, -7108, 17846, 5020, -13918, 3985, 15066, -6119, -12709, 10129, 10684, -14506, -8186, 14778, -1975, -18173, 5645, 12534, -13525, -12371, 10817, 4557, -14439, -3375, 12296, -4766, -15473, 8427, 12673, -13452, -8489, 13943, 3493, -10812, 3278, 11408, -5013, -9079, 11104, 12373, -10171, -6491, 13490, 2730, -10014, 5647, 10361, -7693, -8870, 9122, 9114, -8433, -6155, 10082, 1334, -11423, 5310, 12113, -8832, -10219, 9308, 7140, -8946, -3877, 9327, -850, -12687, 4959, 13750]
636A3750k3738k290K3572n140j8013J1548J1974j6699q629K0850O173k4596j044
649a2282K3966q632j9005J8280J1258k3473m748K4113L78k1567M690K0002j2077
662I03j5536K0642R561k5266m57K4543o940j8568J1905J3056j5143r428J9598
675H870M885k2964J725K1764j0359j6317J5855Q483j8783l846J7702L01j7849
688a0533L381J6721r654j4225J6282Q659j8923j395J8122k714j5055N978J3951
701A0595q617j2320J3590Q611j7892k690J9142m683j6773Q930J2586j1351j0369
714a1241J3703P574j7212k693J9751m665j8767J2290J3669j5659q178J6697L883
727I152j7512P90J8606o391j8228J3604J4058j8950o027K0644j516j8237O695
$$ y = [13750, -9988, -12278, 11294, 6154, -11859, -311, 11663, -5036, -13665, 7185, 13358, -11238, -12282, 11684, 3052, -15953, 2327, 13585, -9888, -14636, 9477, 9855, -11712, -7022, 12980, 903, -14633, 6009, 15570, -9696, -10153, 14390, 7450, -11118, 787, 13843, -1300, -10728, 8870, 13755, -9209, -7484, 14280, 3921, -12396, 3459, 11942, -6841, -10687, 7015, 7316, -10533, -7152, 9569, -85, -14310, 1972, 10631, -8292, -9687, 8435, 5721, -9334, -3356, 10595, 1978, -10342, 3248, 11859, -6033, -8723, 10419, 5736, -11037, -2107, 10479, -872, -11241, 2462, 10036, -7176, -9869, 9882, 5217, -13550, -1260, 12409, -3250, -11428, 5269, 9152, -8360, -7570, 11036, 4645, -13583, 21, 14079, -4871, -10898, 9746, 8230, -10007, -3312]
740c312J5811j0357j3672J4827J0308j9141l933K0445n029j7917J1968J2549j6080
753c533q385J6965M736j7099r08J7339n866j6178J4245J0798j8595n033J8605
766G091M68j6067L237J3868o869j2046J2000R670j7285m487J9112j531j6014N973
780b880J1680r007r127J1372P745j4291n191J6238j231j5337P970J1964j2283
793b378p727J3359N256j3385k467J4716k084j4587Q629J2611j3913p409J6123
806F744J877j4743J975J2939n051j2477R141J0839j4232o881J6654j38j6119O601
820b871J2318j0291r264J1467P423j3211l897J4888j616j4955Q801J2193j3731
833b746p100J4851K421j3804K66J3062l324j2828P925J0584j3164n966J6253K32
$$ y = [-3312, 12499, 2142, -11530, 3297, 13605, -5536, -9469, 10976, 5947, -11970, -2, 12547, -3533, -11918, 5047, 9783, -7316, -8224, 9115, 3249, -12929, 1316, 12114, -6481, -11514, 7091, 7559, -8508, -5271, 8597, 1728, -10318, 1682, 11352, -5933, -10420, 8692, 7161, -8853, -2880, 8800, -207, -9334, 2038, 9783, -4508, -9699, 6539, 5308, -10029, -2059, 9905, -2378, -10105, 3254, 8510, -4875, -7342, 7374, 5290, -9297, -668, 11943, -1970, -9379, 6744, 8621, -6122, -4147, 8792, 3741, -8736, 405, 11244, -2988, -9869, 6785, 6647, -9472, -2871, 9447, -844, -10108, 1359, 8782, -4429, -8326, 6562, 4946, -10009, -1208, 10985, -2746, -9846, 5005, 7426, -6378, -6112, 6950, 3626, -9202, -1277, 9307, -3857, -9823, 6430, 6662]
847F662j5034L943J2200n566r682P766Q194j0857n129J3805Q4j4921N205J2160
861H830q427q189R109M739r766k505J1699k58j3147N400J1808r527o886J1893
875D773J874j1350J120J0415k547j0488N300R330r603o267J2424R25j2822L782
889c134J0470o476q584P722O584r063m866J1381M40j2333M643J0676q761o946
903h247J0252L301r740j028R826n73j0044M213R620q951o009J2088J677j1651
917e266J607R395l385q087N046P285p862n657J0737J745j1711L195R862n950o761
932e807O907M606p109l124Q578J167j0208K822R344p115o152Q961K134q548N2
947c492P330j364p239L564P395o934n512R654J564r825K346P784m679n913N441
$$ y = [6662, -8372, -4429, 7771, 2205, -7477, 289, 8483, -2374, -7503, 6302, 6386, -8535, -3330, 8830, 403, -7786, 1323, 6062, -3704, -6209, 5490, 5232, -7915, -2515, 9293, -234, -7120, 4773, 6647, -4703, -3583, 6832, 4285, -6203, -903, 8427, -1176, -7443, 4981, 5906, -6916, -3134, 7336, 860, -7724, -2, 6582, -2481, -7347, 4034, 4474, -7859, -3216, 7460, -1301, -8247, 2005, 5306, -4434, -5462, 4364, 3791, -6253, -2040, 7580, -1371, -7380, 4708, 6385, -5266, -3659, 5736, 2351, -5736, -690, 6595, -1267, -6924, 3813, 5558, -6153, -2958, 6904, 954, -5807, 1100, 5706, -1403, -4527, 4051, 5218, -4990, -2168, 7176, 61, -6091, 2870, 5004, -3544, -3492, 3838, 2474, -4765, -1201, 6194, -740, -6252, 3402, 4966, -4859, -2513, 5271, 592, -5321, 120]
962A20M812o189m452Q103J686r743K569Q472o013n552P436K707o865j503P190
977B778K97p663K402P899o233n137Q763J607q268J284O658k520n604L338N394
992D995n389m598P949J427r114K424P432m847m562N414K691n433j835O853M87
1007C894p961K414P513n670m252P172Q58o659N33N502j535n124K354N229n105
1022h37l831O942O25p146K416N250l669l195L300K519l995j900N420Q31p031K141
1038b160N933m279l104N282O70m861J59M665J19n601J626N431m009l936O277R87
1054C199o205J355M941k025m057K509M173m034l179O219R87p375K354O249m652
1069D59l469M630J375m581j184N545N3o767K128N908n353k934O755j12o302K271
$$ y = [120, 4932, -1257, -5709, 2394, 4080, -5663, -3094, 5378, -635, -6187, 1249, 3956, -2909, -4412, 2778, 3075, -4588, -2186, 5713, -520, -5657, 3106, 4713, -3555, -2271, 4387, 1867, -3737, -399, 4995, -394, -4992, 2957, 4384, -4730, -2306, 5126, 279, -4283, 1131, 3822, -1611, -3446, 3407, 3894, -4067, -1653, 5860, 190, -4062, 3110, 3968, -2691, -2158, 3344, 1809, -3315, -961, 4268, -837, -4668, 2274, 2899, -4247, -1831, 3419, -250, -3445, -145, 2374, -1621, -3521, 1899, 2730, -4301, -2160, 3773, -506, -3610, 1672, 2342, -2519, -2360, 2305, 2424, -3177, -1551, 3880, -129, -4065, 2212, 3199, -3006, -1651, 3290, 1265, -2792, -283, 3890, -144, -3323, 2896, 3883, -3492, -1138, 5111, 459, -3010, 1620, 2995, -1586, -2770, 2775, 2828, -3939, -1811, 4097, -1256, -4190, 2565, 2453, -3849, -1578]
1085a578M853k417l925L228L427m823j945O627j285o555L986L828m817j658M409
1100A355p2m090L37M942j013n467L389M006m918p13N258j554m325K044L533j512
1116A200l707K062L361m012j649N308n63m939K113L412k368j941K039J939k386
1131a31k298M618P80n541J391M470l465j877L462P08l870k62M404L72n361J074
1147a526N077m401k222O368p34o142J878M834k341l946K904L125m919j688P269
1162C536j200p528M217N537n504k423N484J21n436R01O178k057o687M129M596
1177C864o211r19O742k428n706L332M905l401l254L410K461m732m4O086k589n225
1193c709M376L153l948j103K820M23l227J02M142j267m972K843L356l923p94L835
$$ y = [-1578, 3275, 858, -3067, 161, 3588, -1235, -3180, 3447, 2162, -4393, -407, 3421, -1396, -3054, 1355, 1283, -2807, -2470, 2472, 1459, -4008, -619, 3387, -1531, -2244, 3014, 1460, -2865, -821, 2712, 1200, -2507, -445, 2916, -1096, -2745, 2563, 2000, -2939, -826, 2586, 218, -1723, 316, 2255, -131, -2429, 2189, 2969, -2572, -1181, 3289, -176, -2053, 1409, 2117, -1753, -2015, 2389, 2761, -2600, -1526, 3551, -850, -3072, 3296, 2562, -3580, -1702, 3132, 791, -3155, -251, 2874, -2045, -3733, 3536, 2336, -5192, -975, 4562, -942, -3365, 2119, 2240, -3196, -2295, 3883, 1826, -4861, -732, 3864, -2347, -3266, 3476, 1048, -4658, -1326, 3579, 178, -3076, 334, 2795, -1937, -1981, 4105, 1516, -3709, 667, 3820, -128, -1231, 1589, 2012, -1215, -1113, 3029, 1762, -3210, -367, 2989, -934, -1728, 2107]
1209B107j648k895J340L287n64m254J701L668l649j446N388j430n269K136M389
1224B861k063l666K364L271m221k023O505n99p338L152O019m595l385M780J338
1239B400n105j52O304r75p175L400O075n996k629P098p23o575K459N642k925m771
1255c648M074L643o046j336P514j759o917M532M322n372j784M882O74n060M20
1270a861N720k157n896M464L773n847p90N709j684m865K168M268k297m064L126
1285b33L022m872j092O200j337n452K693L804k653k695K809K591m170j620N689
1300B684j40o420K533M914l968k720M115J399m411q36N349N7o530K313N706m625
1316e80l271O352N65o003J039N572j609n087L001M382m990k940P098k38p180K765
$$ y = [2107, 459, -2436, -1096, 2191, 1627, -2627, -926, 2742, -907, -2353, 3035, 1605, -3664, -1528, 2861, 798, -2868, -504, 2767, -1454, -3477, 3028, 2429, -4909, -1757, 4262, -333, -3718, 1062, 2400, -2705, -2857, 3447, 2472, -4703, -1303, 4772, -1224, -3853, 3245, 2522, -4053, -1594, 4048, 1123, -3648, 426, 4069, -1977, -3313, 4201, 2442, -4475, 57, 4379, -993, -2777, 2105, 2779, -2281, -1861, 3859, 1702, -4194, 270, 4043, -1804, -2594, 3115, 1431, -3434, -1266, 3002, 705, -3359, -233, 2789, -2083, -3175, 3025, 1688, -3764, -1071, 2733, 80, -2615, 194, 2785, -1385, -3005, 2684, 2544, -3876, -1343, 3571, -397, -3117, 998, 2397, -2014, -2850, 2499, 2556, -3974, -1661, 4045, -580, -3851, 2501, 3066, -2937, -1898, 3674, 2065, -3022, -21, 4361, -629, -3569, 3529, 3291, -3889, -1124]
1332a124N448m084l548M524K172n458j058O477q93p097L653N538n651k662O045
1347B282J70n706J172N421j742n421K977M601n156k503O820m22o386K318M502
1362B927k680l578L195L112m229k098N756M6o390K566M930l540k998L940J552
1377B511l885r24M754q9n667J896N314m163l266N448P83n234N06M797j010m931
1393c160K430M611m087l642O290J197o694J676N217k833m292L756K910m133k493
1408c247N581N35o570J917N888m351l777N147J671m995o77N026j08n545K061N268
1424C824m375l793O053J549o013O33M820k071l683K506L879l765l225N203J193
1439B735n762J031N308l147l585M072K187l946j601M671Q52n383Q44N517l404
$$ y = [-1124, 4324, 240, -3308, 1216, 3388, -2070, -3128, 3349, 2456, -4641, -988, 4550, -1101, -3763, 2282, 2452, -3254, -2082, 3339, 1597, -3824, -847, 3754, -1402, -3905, 2915, 2493, -3893, -1575, 2927, 247, -3331, -136, 2976, -1253, -3351, 2405, 2451, -3939, -1373, 3557, 17, -2981, 959, 2511, -1374, -2298, 2456, 2367, -3300, -1404, 3910, -253, -3519, 1929, 2712, -2522, -2016, 2781, 1771, -3160, -730, 3881, -206, -3848, 2442, 3639, -3055, -1379, 3838, 1005, -3287, 469, 3379, -754, -3247, 2334, 2869, -3701, -1784, 4104, -247, -4024, 1123, 2794, -2201, -2878, 2148, 2040, -3505, -1444, 3824, -551, -4344, 1709, 3258, -2755, -2122, 2698, 627, -3056, -550, 3329, -436, -3661, 1542, 2735, -3027, -1996, 3312, 165, -3420, 652, 2839, -1107, -2708, 1963, 2815, -2568, -1724, 3793, 389]
1454C89l795N025J600m835j46M273n31m468J433M756l410l900N018J919n719N82
1470a809M772j846l870K532L150k992k960M393J685n613M78N367k500m125L700
1485C62K224m004j367M060P59m798N91N087k810m191M695K132m889j27M355q60
1501A219l519J175M013k439l728M188K244n307K9M936j768l750K760K712l097
1516c32k116L637J590m612k24N018j986l818L416K196m046q08L660L93l877M57
1532a452M282j994l776L766K118m586j43M287j458l533J645L148k065l050L121
1547C10K254m427l41M612j486l804K668K494l028j491K789J425l485m13M243j477
1563H43l924K972K520l519r12L123K32l223M52L734j419l513K877K598m160m74
$$ y = [389, -3406, 1619, 3219, -1616, -1762, 2511, 1980, -2488, -1055, 3701, 291, -3609, 1409, 3328, -2391, -1809, 2963, 1117, -2753, -221, 2929, -63, -3023, 1370, 3055, -2558, -2080, 3287, 787, -3338, 362, 2586, -1418, -2785, 1275, 2034, -2764, -2173, 2914, 104, -4087, 608, 2740, -2149, -2276, 2079, 1219, -2300, -1125, 2888, 449, -3279, 909, 3153, -2154, -2125, 2811, 1043, -2707, 53, 2765, -332, -2448, 1189, 2779, -1833, -2057, 2961, 975, -2843, 573, 2769, -1277, -2085, 1575, 1968, -1909, -1452, 2830, 836, -2940, 826, 2944, -1642, -1785, 2502, 1044, -2489, -844, 2304, 239, -2811, 310, 2564, -1863, -2204, 2408, 922, -2882, -214, 2280, -748, -2239, 550, 1975, -1510, -1923, 2320, 843, -3081, -109, 2411, -1108, -2020, 1103, 1335, -1888, -1436, 2298, 879, -2634, 243, 2841, -1319, -1793]
1579a793M090j084l238J866K515k159k252K776J988l934n41M247j409l332K539
1594B79K097l020j150K720O71l032m2L536j381l097K459K061l003l47K821o96
1610H76k391R83K204j225k462K026J981l101m62L243j168k682J891J741j641j608
1626a795J678J361k044r40L206n20l169J862K202k119j057J907O13k046k15K610
1642A534l99l018J484K638k953q20L001l49k571J041K042j051k123J526K172k645
1658d91r19L286o25l356K289J961k420j118K346L69k398j12K922q41l097J965
1674b39K068k850j21K458r33j887J006J696r75j771J652J250k447M1K684j469
1690A63j868J811R57j493m31Q90L69j126j08K071q45k173J488J262j281k5Q18
$$ y = [-1793, 2297, 1213, -2025, -159, 2356, 197, -2055, 721, 2709, -1225, -1766, 2481, 1072, -2260, 279, 2376, -644, -1794, 926, 1597, -1435, -1477, 2059, 678, -2419, 40, 2101, -902, -1249, 1572, 876, -1515, -532, 1672, 447, -2015, 11, 1992, -1109, -1571, 1672, 504, -2178, -287, 1454, -187, -1795, -117, 1244, -800, -1740, 1466, 946, -2223, -361, 1841, -278, -1335, 572, 1185, -861, -1076, 1534, 1135, -1883, -399, 2239, -714, -1534, 1467, 1118, -1453, -412, 1630, 579, -1544, -18, 2154, -491, -1410, 1876, 1251, -2105, 184, 2145, -275, -1393, 953, 1322, -1076, -1188, 1734, 893, -2204, -239, 1829, -1021, -1142, 1316, 383, -1504, -498, 1198, 223, -1548, 104, 1354, -1093, -1052, 1632, 163, -1705, 106, 1063, -430, -861, 29, 398, -728, -836, 1235, 390, -1783, -295, 967, -314, -339, 479]
1707D79j22q55KJ487q0j723M52J722j353m21J323j42j357J59J414q6j515JJ776
1726A161j211j159K367k38k565J202J826j262j128J312L19j347j17K201l85k824
1742a848J476K130k338m48K134q10j843J087J720j189j635J391J210k189J07K609
1758A564j729j695K088J134j904k92J380l08j293P58J919j451j836K094O06j950
1774i15J122Q15j323n06J124M98q50p01J131L14j329P14J108j482k71J206M6n74
1792A27j12J53K60n79n4J020p06r62J153K96q36Q8K16k61l35L9J139j44j737P85
1812d50J228j322p8J289n72j161Q00J211o90j466J053J099j835r8K280j241j879
1829a832J945Q50j535m38J469Q4j803R61J998j394k078K207J016k402R34J464
$$ y = [479, 357, -498, -496, 991, 911, -812, -360, 1362, 9, -412, 911, 769, -588, -429, 985, 899, -616, -615, 1161, -50, -1209, 1158, 920, -1645, -443, 1383, 121, -1007, 305, 624, -723, -840, 1361, 976, -1848, -372, 1758, -580, -1028, 1106, 296, -1547, -460, 1260, 71, -1564, -173, 1037, -1152, -1045, 1564, -165, -1860, 228, 1362, -542, -834, 546, 238, -1055, -297, 1622, 171, -1665, 429, 1035, -915, 207, 1022, -301, -807, 317, 815, -35, -736, 395, 709, -620, 94, 1202, -280, -551, 655, 701, 127, 15, 168, 428, -151, -205, 815, 109, -853, 300, 596, -240, -152, 64, -197, -532, -493, 646, 502, -1235, -450, 778, -544, -622, 667, 95, -1066, -266, 945, 255, -1211, -158, 941, -894, -992, 1288, 47, -1832, 113, 963, -572, -1010, 459, 543, -1260, -299, 1699, 305, -1773, 434, 1450, -952, -18, 1446]
1845A446j460j327J569J204j391j049J776J51j993J043J762j896j078K046L9j485
1861f43J35J330p03r76N86J507j652q88K137j74j563J079N69r96o30R80O53q50
1879i9j048J138N51j511N47J290j304r08J314O55r64m33P89N65j303J47K018j284
1897A60j477J558R87j678k56J289j17j332L53J829j050j983K176P89k223N17J772
1914A314j145j458J572J218j466j179J831N82k389R55K013j783j479J969P75k161
1930h31L3J587p5j835Q04J816j431j872K476L66k274N30J759j154j194J296J067
1947A068j267j401J988N15k413O53K123j463j143J568O09j470l78J408L86j865
1963a082L35J825j106j359J995N64j960J98J496j88j474M22J729j107j571J963
$$ y = [1446, -14, -1341, 228, 1432, 41, -1008, 768, 919, -1074, -31, 1731, -165, -1243, 803, 842, -643, -508, 822, 119, -857, -271, 1236, -416, -1304, 833, 659, -904, 175, 744, -252, -882, 98, 751, -99, -1147, -9, 542, -969, -422, 868, -436, -1344, -30, 625, -339, -772, 17, 582, -721, -574, 1444, 160, -1317, 241, 1228, -450, -706, 583, 466, -866, -513, 1316, 266, -1717, 459, 1248, -975, -458, 1314, 169, -1289, 283, 1501, 35, -1144, 687, 1269, -1120, -165, 1848, 65, -1414, 555, 1330, -831, -798, 789, 714, -1121, -317, 1499, 68, -1804, 672, 1038, -1236, -706, 1053, -101, -1295, 1, 1068, -199, -1600, 388, 903, -1510, -857, 1266, -197, -1340, 228, 837, -633, -1011, 397, 783, -1082, -747, 1078, -28, -1387, 608, 1172, -788, -590, 906, 718, -756, -334, 1395, 288, -1283, 680]
1979F80P65k118l0J827q41j465J217J029r61j406J811Q04k522K92K440j310j744
1996a532J986J027k067m40J828J28j789k1K349j391j852K206R19k225j34J790
2012G82m74j635Q26J550r93j672J758J249k582K00K412j187j600J257J409j416
2028a16r61J651N60j959k4K267j059j996K050Q99j941j67J285K64j661L35K025
2045A452j087j753J699J241k221k33K201p52j625P83J339o30j613J491J135k119
2061f92k44K222q50k036J585J164j519q45J481P49j825o0K117p89k043J732J111
2078A258j886m98J679J29j679J51J733n77j931J593J381k236n16K305l81j876
2094a351J043J276q91j246J429J129k051k90K319o25j999J504J219j645p04J703
$$ y = [680, 1445, -673, -703, 1124, 283, -1182, 35, 1064, 103, -1303, 508, 1312, -1210, -918, 1522, 212, -1532, 454, 1481, -586, -1026, 802, 930, -859, -880, 1469, 78, -1774, 432, 1351, -874, -1008, 782, 308, -1327, -501, 1049, 56, -1616, 142, 1391, -1191, -991, 1421, 234, -1366, -109, 1300, -116, -1077, 574, 1134, -825, -849, 1418, 359, -1637, 413, 1312, -629, -796, 489, 753, -908, -573, 1452, 365, -1388, 311, 1552, -669, -902, 1299, 547, -1078, -295, 1044, 414, -1199, 292, 1427, -692, -936, 1286, 436, -1600, -15, 1149, -370, -1215, 266, 1015, -810, -870, 1247, 458, -1585, 147, 1258, -628, -1126, 553, 682, -997, -846, 887, 310, -1621, -28, 1353, -883, -1399, 906, 525, -1351, -308, 968, 77, -1169, 260, 1389, -662, -952, 1367, 742, -1257, 247, 1466, -179, -883, 820]
2110H20K18j610k10J894m16k104J509J394j989o63K138l10j735O49J454o70j473
2127a104J009J351j716p42K206k74j936J145J051j033r58J031R32j547n95J906
2143G26r4k030J103J446j659o37J643K95j350k07J599l20j741J008J668j720r16
2160a186K059oj803M55J430o42j464J256J282j998p25K333j32j981R28J547j449
2177i6q20J330N25j177n17J925l43j871J011J315j598o34J769m9j611L82J265
2194H06m05j452R44J335j771n76J754J72j690P18R12p44q37P11Q69r83p81J452
2212D34J63j592P69J254j099o23Q13N21r49m77R94M76j583L36J582r32j156J636
2230E67K88j177k13J266J7j335K99J495j080j400J865L89j662N39J111q19j027
$$ y = [820, 1038, -572, -782, 1112, 696, -1408, 101, 1495, -494, -1157, 981, 671, -1064, -415, 1039, 369, -1104, -95, 1256, -460, -1202, 1004, 730, -1206, -61, 990, -43, -1001, 30, 962, -585, -1180, 726, 632, -1398, -295, 1151, -508, -1145, 498, 793, -557, -764, 835, 515, -1226, -218, 1450, -270, -1186, 873, 867, -936, -481, 949, 307, -1157, 99, 1381, -617, -1342, 991, 859, -1122, -194, 1353, -96, -916, 414, 939, -238, -755, 1170, 827, -1044, -33, 1282, -316, -950, 819, 770, -841, -459, 806, 401, -1051, -107, 1228, -543, -1119, 635, 807, -883, -165, 747, 3, -834, -123, 746, -237, -1018, 434, 597, -995, -226, 1028, -71, -694, 119, 640, -309, -786, 208, 684, -899, -563, 1019, 87, -1069, 567, 855, -322, -535, 731, 748, -587, -288, 1207, 127, -1273, 592, 981, -681, -142, 969, 150, -877]
2247h77Q24J101j094q91J519L22j756M95J502j357r56J650L31j116k33J097Nj468
2265i02P20J423j433j046J683K1j460Q29O80p10m32O22P20r19n81J001L15j253
2283g22N52Q55r63m36Q94J25k25n35N92M06q60J07J112q69p31Q38L85n63j06P5
2303f9L09m65PJ080l20j373R57O70q30k13Q13k24p01K15P63k09j154P79P58j158
2323c65p4J349r23r84R99P09q26o63R74K95j109K69J127p95j124J265N11j123
2341d88K46O28n98m18N45O66r70m18J094K4j101O60J035j315k83R96n1o01K3N37
2361B11j29k66K85P31j066j32P68M5l40K18l7l95K92j85N67m86n98M87L69l67
2381b8j6K00j91j25J37K06J23n59O5O06n63N1N10l41n47N50K97j61m97K39K46
$$ y = [-877, -53, 1048, -46, -937, 582, 904, -852, -357, 1145, -212, -1168, 482, 813, -303, -536, 561, 566, -902, -182, 1241, -192, -1238, 445, 466, -994, -165, 515, -195, -627, -5, 715, -204, -785, 216, 531, -722, -170, 685, -278, -714, 180, 305, 80, -455, 137, 543, -317, -210, 902, 33, -698, 140, 525, -38, -144, -69, 240, -225, -218, 862, 542, -831, 126, 796, -34, -247, 566, 342, -359, -144, 619, 410, -744, 35, 793, -365, -439, 910, -13, -997, 2, 711, -115, -778, 196, 491, -618, -349, 778, -17, -1141, 124, 635, -488, -242, 386, -212, -630, -85, 581, -389, -807, 287, 311, -790, -130, 905, -410, -693, 303, 252, -349, -326, 211, 82, -184, 101, 832, -234, -366, 402, 447, 107, 325, 288, -107, 185, 0, 567, 81, -517, -30, 339, -28, -44, 156, -35, -160, -23, 183, 306, -253, -188, 418, -145, -94, 416, 75, -472, 78, 375, 214, -283, -44, 202]
2402B02m45l01R50k72r45R04M19o89r5M62k04k88J08O44m65o95P26M88j012N69
2422F1N87p81l27R21j33m62M3Q4K30o24M84N88q60k50R75l66l86L76J85m72j5
2443a42K17M84m99m42P47j11o45N84J99q05K05N18k46k43J60K15o0k09R5N27n31
2464A8k23O23m76J43J09l38L1r0J5M20k74l81M57J83o05K97j46m7N2N9K22p7m09
2487d37M93R9o28L39P49q01l4P18m28k32N2K11L03p23K27N75o95j6N94o3o67N33
2509A69J60n96RK71M14p14J33N35j54o94P29L12r56K01O20m19k03P8K21K6n03
2530c61N03J82q30J31P99n60l89M12R4j90JK01K21o80K00M19kn44N52J67p05K69
2552a10L03j30k56q2N62r5o57N36L19q32M53L13j40l31J79M81k60l38L09K36o63
$$ y = [202, -243, -544, 406, 134, -811, 93, 512, -177, -272, 190, -14, -302, -194, 450, -15, -710, 16, 504, -508, 61, 648, -133, -460, 461, 328, -134, -91, -7, 223, -401, 83, 671, -189, -439, 536, 170, -216, 160, 345, -127, -142, 75, 559, 60, -382, 365, 254, -391, 193, 392, -413, -208, 310, 64, -179, -19, 196, 136, -73, 22, 549, 18, -205, 418, -58, 85, 194, -144, -113, -203, -188, 232, -42, -423, 34, 217, -388, -91, -237, -284, -232, -173, 49, -28, -437, 56, 155, -473, -134, 615, -186, -220, 498, 70, -162, -110, 101, 404, -319, -92, 483, -212, -228, 366, 303, -364, 169, 329, -267, -258, 13, 427, -287, -154, 381, 227, -467, 262, 574, -382, -181, 439, 20, -183, -105, 116, 142, -361, 142, 324, -506, -375, 424, -136, -525, -113, -19, -209, -208, -7, 214, -466, -266, 153, 151, -393, 159, 326, -379, -110, 193, 63, -193, -275, 287, 192, -465, 71, 390, -442, 11, 324, 184, -147, 32, 513, 253, -85, 224, 460, -203]
2573b03j45Q29l99m47O11J81o18J7L23J90m91j79O78m5j020Q84K75q41K32M69
2593C01k18l36N3M35K6p98O02L62q55m6P62j09o88N73K21l79j66L51K15o23j0
2614c27P73l85p89R01L55n80j53N39j73m78K99L98j92p49Q53K86q91L8P94m06
2634A13n42M85L12k57n20M30N89q71n1P80k75o18O34K47m54j97M30O8o27m8Q92
2655E20l18p42P48L03q48j29P62J8q46M57O12l62n02J99P21r10l09J049l16n62
2675d55M19L31l07n15O47K32m96k29P45j57q33M17Q24p46q6N28M3n00n8O90l59
2696A35q12P46O62j023L1O50nq73N10K75Np36N50M81q63j92Q99r0p70M60M85m56
2718F9m03L77L27n84j72O03k3p93M57P39q07k15Q48j72n54j8P35j01q61L78O84
$$ y = [-203, -348, 481, 82, -365, 246, 427, -191, -174, 149, 339, -152, -331, 347, 302, -718, 166, 441, -400, -168, 301, 83, -253, -200, 235, 261, -537, 65, 427, -428, -474, 288, 179, -509, 64, 285, -94, -260, 91, 306, -317, -327, 446, 61, -728, 173, 528, -52, -205, 334, 161, -317, -18, 380, 188, -561, 292, 578, -313, -275, 519, 113, -429, 56, 368, 111, -409, 21, 610, -261, -312, 468, 193, -425, 209, 456, 2, -195, 235, 303, -324, -372, 520, 202, -540, 208, 511, -337, -466, 296, 314, -532, -75, 537, 175, -327, -128, 593, -317, -626, 423, 107, -455, -36, 295, -12, -527, 120, 352, -144, -373, 372, 215, -618, -201, 623, -123, -209, 319, 362, -138, -196, 494, 135, -677, 69, 731, -292, -261, 389, 384, -489, 21, 296, 301, -435, 115, 596, -267, -459, 440, 350, -420, 40, 525, 69, -334, 43, 370, -214, -386, 217, 194, -599, -142, 597, -210, -425, 423, 251, -303, -321, 414, 313, -548, -170, 514]
2739E14o93m36P98J32p07N5P43k94m78L79N92q25n55J309j9r46J67Q12n88m41
2759d81P62K54o47l29Q75rr37L49Q32p79k73Q07n5p52J51N86j18p52M79O00o78
2780a15k97R22L7j216M26O60m61n16N78K45n67j38P77q6q88M10N93l96m97P01
2800A72J52m89J41K83Jo63J07Q16o32l39Q08n3n04J0M06n5n18O1O67l61n90O86
2822A06L18r65K20R53l68n79K90N87m19n19O38L66j075j8R95l02p69R39j1p83
2842c96J20P04m1r47L24Q84o60m61Q43P2q67M40N92n15n29M83J92m11n8M33J18
2863C20r38M22Q03n62m59N21j9l99MN42j03l86j61P29m54j96O24P1n30J62K14
2884B05q4j98k07L86J08n75N61M2m38j70P19j8l68j11L63j50k78M01L61p05k26
$$ y = [514, -179, -615, 183, 315, -392, -337, 406, 112, -366, 13, 605, -220, -775, 534, 515, -431, -264, 548, -40, -481, 281, 535, -112, -441, 434, 425, -512, -163, 669, -110, -383, 424, 369, -383, -232, 354, 236, -516, -37, 563, -115, -412, 510, 547, -669, -243, 417, -44, -560, 18, 263, -304, -442, 335, 249, -639, -229, 364, -32, -529, 172, 324, -165, -24, 259, 260, -403, -296, 520, -112, -451, 357, 304, -200, -190, 216, 161, -357, -296, 371, 10, -580, 106, 424, -541, -321, 632, 264, -315, -25, 562, 143, -376, 262, 628, -447, -465, 530, 228, -541, 398, 387, -396, -276, 428, 387, -560, -236, 648, -12, -473, 370, 442, -425, 15, 607, 92, -437, 46, 238, -173, -231, 202, 320, -618, -196, 607, 45, -414, 107, 88, -311, -307, 235, 132, -254, -415, 314, -140, -336, 288, 359, -171, -9, 205, 121, -77, -284, 102, 210, -365, 196, 238, -200, -370, 349, 331, -37, -148, 215, 65, -213, 188, 549, -156, -382]
2905c82Q04M7n24P8L59l80m25O61K09o34k18P12l3q78Q36K26q03o9P15k04l21
2926b24M2N14k60o57Q84Q3n99k07P92j27n83L78L01o02m4N15K2n52p3P92k69m30
2948c04N52l7l58J29L17j82p4j78M61j37m10O89k0n16q9L43l6j28m8J53J1p3o4
2971AL86m00l20N48j81k27J61J20l58j20K79K62r6k47K73J97n53J94N15n99n8
2992b23M54j52j14k54M22J58o10rN77l02n60P38j1l72K08L47l41l11L90L92o96
3013b69j26N72j23k70K20K79l73M4K96l3k06j35K46M4k65J17L14n59J74M80n89
3034a62L5J49N9K08l26N5J68m29K31L57l06j45K43j88n9K22k07J54K0l40K02J07
3056D8k36J77J56j34j30J69J8K0k89k8M67m52K47N0l46k6N15k49j86j9K05o7j19
$$ y = [-382, 422, 469, -55, 23, 382, 2, -423, 238, 447, -187, -405, 307, 274, -604, 232, 458, -345, -414, 301, 97, -224, -182, 332, 72, -585, 299, 382, -217, -424, 368, 241, -342, 36, 337, -265, -309, 206, 228, -324, -397, 395, 126, -304, 248, 211, -147, -18, 299, 117, 43, -135, 326, 189, -221, 468, 448, -68, -157, 186, 150, 22, -26, 127, 138, 65, 1, 387, -13, -333, 215, 34, -193, -32, 88, -270, -390, -111, 151, 55, -192, 81, 278, -275, -81, 434, -165, -223, 231, 79, -35, -289, 133, 291, -319, -328, 249, -53, -613, 125, 114, -258, -50, 297, -44, -355, 35, 427, -269, -395, 177, 54, -216, 4, 283, -90, -46, 250, 217, 11, -124, 122, 166, -99, 18, 332, -227, -53, 427, -162, -127, 22, 81, 289, -37, 18, 186, -243, -12, 345, 39, -106, 137, -51, -110, 112, -95, 59, 79, -261, -59, 48, -188, -11, 145, 11, -119, 50, 68, 88, -201, -229, 238, -214, 33, 83, -263, -289, 226, -23, -209, -228, -23, -90, -209]
3079b09n3M11k44k1K54Q0n88L78J70k96J63l9J55j56o0L01L7m40L74j05j83K3
3101d8K27j99l6J0N6n2Kn5K85k60j47M19l13L4J53p3pM1K2n1o8r2J99m6k43K46
3127DQ7l29K51K4j71m4N8O8m9k8k8J97k34RK73r8r6K80j42L4q0J55m1K8k33J68
3153F3L4j86J30nj1P7R8j83M1L4JL5Lo0N5k80J85J00j15j69K86j19k32N4O6J83
3179H5j84J42k7l9k11M84l40n7K16p5m9J2j96L19j16m9J34n5j89M78j74j07R4
3202I6L1j5j95P0N3k7l50K35J78m5j35K73m69J14K45J52q2n5j64K60m0l73L21
3225G8K09l36K30L8k71P5jQ8J4k11K42l1j55q2M28l19n8K25j90q6K1K49r9l66
3249c08K56K44l65N1L82Mn82L9M00k28j23L28j71j23N6J39P2l64K52L56l77j7
$$ y = [-209, -262, 149, -95, -116, 138, 218, -370, 8, 178, -118, 45, 6, 161, 5, -55, 246, 283, -157, 217, 112, -71, -48, 179, -20, -56, -46, 10, -42, -40, -95, 190, -70, -217, 202, -111, -77, 76, 3, -4, 37, 59, 8, -60, -152, 47, 1, -242, 4, 91, -238, 13, 37, -134, -178, -120, -52, -101, -129, -157, 40, -194, -185, 88, -10, -106, 174, 32, 66, -14, 141, 100, 128, -105, 63, 97, -89, 41, 36, 25, 102, 200, 17, 58, 92, 93, 128, 131, 71, 126, -154, 31, 131, 16, -153, 133, 14, -218, -164, -98, 85, -99, 43, 16, -23, -234, 250, -90, -147, 69, -6, -55, -43, -239, 80, -36, -85, 49, -6, -195, 283, 109, 2, 96, 127, 112, -83, -13, 40, 13, -337, -102, 76, 31, -104, 169, -300, -186, 59, 211, 129, 74, -90, 170, 130, -243, 78, 287, -49, 181, 219, -52, 23, 22, 110, 124, -87, 155, 124, -31, -113, 315, -4, -62, 163, -27, -113, -92, 157, 58, -308, -52, 192, -173, -122, 260, 264, -318, -279, 121, -107, -230, 98, -73, -196, -140, -1, 71, -293, -41, 315, -62, -79]
3271g9J72J15m59J25L08j21l27M03P8j12m63O95k19k45J55K11j65j50j01M00k73
3292e2j93L46j3l07K51J46l00J28N0J65k57j38L13R7l94L2L47k44k23L30r8j13
3314a27J11j6l7j6j20J84j27JK96o1k08K8J77j36k04J26M16l51o1K26K40m81j88
3337c28M94m04O6Q5M36n61K17J33N0l15R4M24n55j55M79Q4l14M2K35L2l95R2L29
3360B65m26OL71M3m27J75K90l94j01K59l2O9l03M44o8k16k4J65j55k01L43m5q2
3383d4J8K62k1k78k5M65m70j43K70J33k04k5O3j62J69j39K03n9j61J20J59l38
3405b07J07J93j80j05K29L30l27r3o7L73m39r8N87k80j46J47J21k56J2J64K45
3426C10m68J82K74k0o30L71L80n13N6L44l03n0N6K14l11k46M57K13o32J02N63
$$ y = [-79, 93, 208, -251, -126, 182, 61, -266, 137, 215, 103, -360, 335, 116, -129, 26, 237, 72, -78, -179, 221, -52, -245, 101, 88, -219, 32, 178, -122, 6, 56, 221, -36, -174, 139, 236, -158, -126, 221, -23, -246, 84, -14, -127, -16, -32, -69, -85, -205, -21, -148, -147, 149, 88, -120, -92, 85, -51, -255, -129, 287, -64, -125, 101, 341, -140, -328, 166, -238, -172, -87, 349, -212, 5, 138, 188, -127, -33, 391, -164, -319, 160, 244, -70, -28, 207, 239, -156, -64, 265, -161, -155, 216, 259, -168, 7, 297, -97, -198, 61, 29, 98, -205, 239, 171, -45, -69, 96, -59, -260, 83, 38, -44, -26, 236, 215, -63, -88, 377, -93, -236, 34, 167, -37, -62, 1, -161, 8, -131, 72, 13, -148, -28, 131, -207, -100, 93, -87, -192, 37, 367, 40, -53, -120, 253, -186, -284, 303, 23, -123, 24, 145, -111, -99, 65, 310, -158, 24, 298, 278, -352, 19, 399, -114, -58, 286, -17, -67, -11, 203, -108, -354, 103, 316, -316, -214, 349]
3447C49l80k58N12j4l53k81N36l1k82J0N70l54l53M80n1k82q3L03m5m1K9K5O7
3470G3l31K04J17j78N8J48l7j13P6K11j0k45R2K77k83p5L69l87k7Q2K73j00l43
3493a49K79J25l83l1N43k83m97L75J55j68j24L04j80j01k8L20j27m66N04M03o03
3514a32P3J68J16n34L16L70l01k23J44K49l64r0L56j16l70L90J71l36J83M8Lj09
3536A2r8K45j09l00K32L28l54nK08k76J80r9L8J8p6R6K2m6p9J74Ml77M51m5j82
3561c8j0P0J09k46R0R7L9k77n8M94k85j02R6J63o4k80K03J21k73k1L39l63K8K53
3585H5J2k61Q2K09j14j52l9L72l30j52M05j31j93L07J57l67k8R4M2r0j50L22J04
3608A84k55J57o3Q3j64K14j48k6O6j4L9l04K90P2Lk54K38m2k68J96J14j27PL0
$$ y = [349, -31, -289, 223, 209, -144, -425, 111, 80, -202, -192, 378, 24, -329, 151, 100, -182, -265, 38, -7, -48, -19, 6, 73, -258, -54, 63, -115, -57, 91, 54, -59, 17, 228, 218, -27, 65, 342, 59, -16, 353, -34, -61, 21, 294, 194, -149, 130, 255, -128, -159, 384, 101, -396, -21, 134, -34, -158, 146, -34, -135, -163, 157, 30, -436, 68, 471, -132, -59, 109, 225, -309, 7, 377, 76, -147, -3, 246, -118, -208, 148, 32, -338, 52, 223, -113, 70, 118, 121, 12, -86, 159, 50, -250, -18, 310, -44, -49, 159, -117, 63, -36, 2, 20, -56, 40, 62, 16, -63, 111, 115, -262, 189, 144, -38, -48, 22, 131, -115, -25, 72, 111, -166, -224, 270, -15, -117, -21, 142, 78, -202, 1, 122, -151, -172, 167, -196, -168, 85, 97, -164, -82, 127, 13, -139, -178, 194, -136, -288, 117, -14, -207, 100, 257, -110, -138, -44, -2, -92, -242, 80, 184, -71, 86, 23, 106, -58, 156, 8, -18, 48, 34, 73, -231, 59, 131, 134, -120, 118, 76, -192, 4, 118, -9, -2, 28]
3632B8O3n2k01K72Kk80J57O8p6m6J71j4k01M1P0N0j05j71M49k43j84J18J32p9
3656c1J68r7j62m8P3P3O1k11J36K10l59K23n1J57j22p6K67j99m8K32j06j60k1
3679i1K78l17J0K20j28O0J1P8O0k49o0J83k5o8K48j92p1K47j54Mm7J09J8l7k27
3704a40K74q6r0n6K1L8lJ1M8J40j41l4K16k39O2J0j30M9n6J35Q8j22q9O7l0R8
3730D1Rj29o9J41j0lj26k5K04Q2J15j67Rn1j63J55J04k22L14n3k43K04p2j6P8
3755A07j49J1J76j37K4R1k40R7J15j30p4J30qj4j61lJ66K3n7J08j69J09J43l21
3779a63J6P8l1J14j12R2J23oo3q0r8m1K57k70l4L44n8o5o4j44K26PM3j93J68j80
3805a34R7K30j17m4j9q5j7J51j47k8J76J8k8N9j17J33j06K1l2J57j33j02o2L16
$$ y = [28, 91, 39, -162, 110, 112, -168, -11, 57, -19, -65, 106, 92, -109, -68, 2, 52, -53, -224, 225, -18, -202, -84, 48, -31, 137, 40, -122, -170, -97, -24, 37, -174, -38, 172, -187, 36, -15, 142, 20, -56, 211, 12, -36, 196, 90, -70, -91, 187, -130, -120, 100, -28, 32, 43, 121, 181, -68, -128, 55, 30, -38, 210, 18, -53, 194, 40, 44, -3, 106, 124, 87, -140, 134, 48, -42, -98, -77, -39, -42, -31, 17, 157, 16, -18, 198, -41, 21, 31, -99, -50, -106, 29, 117, -5, -94, -27, -57, 41, 50, -79, -148, -7, -17, -20, -146, -171, 33, 115, 230, 63, 72, 21, -142, 13, 117, -105, 209, 156, -87, 117, 45, 29, 107, -42, -31, 145, 8, 32, 123, -117, -20, 95, -35, -109, 21, 13, -1, -162, -165, 1, 24, -33, 75, -94, 15, 158, -163, -147, -69, -100, 14, -98, -6, 117, 111, 48, -32, -130, -171, 86, -184, -218, 126, 68, 3, -61, -205, 21, 28, 71, -122, 46, -134, -37, 193, 76, 32, 13, -72, -89, 62, -85, -113, 63, 81, 53, 112, -5, 128, 22, 43, 11, 168, 35, -67, -129, 187]
3829A87q9r0Q9j05j31J79q8j41K54qr7M6qk7Q9j04K79o3k35J68j31K4j79K52k8
3854D3k15K24q4M0L7m4J62j08j99K48j65k0Q3P0j65q0K39P5r4n6J50q9p5J68M7
3879A92j26KR1o4J8q0q1J53j11J54J29l33O0l6Q6n2m2J8P8j20K13n3o6j32J86
3904H4j56j6J84kj42K00%O3k54j29K6J49j4l5l1J14j14J54qO2k0j25K34m31L37
3929A30j69L9O0k5J29l93L05K3j47n6J12P4q2L6J32o8q1o4J84j28j45J24K45j83
3953E2k50K19N8L6j91J47m8j76K36p6p0R2J48j28p6J57j44J35k00J18o0o1K4J47
3977H9j42J02nm1j45P7J23j62m0K35j02O5J23j22n5j68J72OM0p3j02K97o7r6J16
4002A25Mp5p0J75j93P2J14J8L5k89J87l3k80K40l9j43J16m8J70j14N0p2K00k00
$$ y = [187, 98, 8, 97, -8, -139, 40, -48, -189, 65, 57, -40, 6, -2, -29, 60, -44, 235, 172, -63, 105, -26, -2, -181, 71, 43, -172, 52, -32, 8, 45, 1, 163, 55, -144, 104, -61, -81, 2, 72, -93, -173, 66, 141, 47, -9, 141, 52, -23, 145, 192, 66, 68, 159, 95, 113, 33, -48, 105, -6, 148, 277, -56, 4, -32, 54, 2, -40, -22, 56, -64, 149, 96, 30, -102, 84, -72, -88, 96, 94, -48, 152, 152, 215, -39, -168, -142, 7, -7, -42, -73, 41, -73, 81, 73, 135, 115, -10, 224, -207, 130, -39, 0, 60, 35, 164, -229, 76, 99, -48, -104, 8, 82, 0, 36, 168, 100, 19, -45, 139, 11, -134, -10, 235, 52, -198, 21, 79, 115, -76, 71, 23, -153, 83, 7, -63, 29, 177, 49, -27, 130, -14, 121, -79, 39, -21, -82, -58, 89, -53, 49, 44, 3, -142, -65, 58, -104, -144, 91, -11, 54, 177, 55, 0, -168, 4, 10, 50, -23, -125, 172, 105, 9, 125, 129, 54, -16, 159, -34, 38, 152, 170, 205, -84, 103, 70, -210, 30, -9, -152, -36, -84, 86, -28, 22, -50, 150, -50]
4026e0k3J80M0j76J26M0k33k0K17L7k36P0K47k78j90L30j2j14J62O6l64J16K00
4049A35j99m7m8L85j75j49J17L7Mj50L33k65q1J42N7k1j18m7J61o4j20K42n1l33
4073b55K28J40N6p3j82N0J59k82J11P6j25J0J88Oj65K15k72K02k92K75J15j78
4095Gm5K09J56m63J04J68k47PJ26Q2k11Q7N7k0jj43J73N8k36J11P9k11K8J65o5
4120b5L3J02m6l09K02J09k07J13P6l1k6kP7n3m3oj2Q5l03K92J2n1K9P1K8M1l08
4147a52L21j24k47L34j51o6n2K83k16K44k19J16j07Q5j17K53j48j42Q2R8p1J16
4169A20k12K07l47K58J9K6k51J93m8K7K4l1K8j06K29p4q4q0J68J6k41K22L6k23
4193a24J37J44n5j08nJ07r1N4m6K23l68J01J52L5j90J11Rk71L43j76P4j92J20
$$ y = [-50, -73, 107, 147, -29, 97, 137, -96, -116, 101, 138, -98, -28, 219, -59, -249, 81, 69, -45, 117, 183, -181, -65, 135, -64, -111, -159, 226, 51, -98, 19, 56, 60, -90, 243, -22, -103, 39, 96, 75, -43, -90, 71, 7, -113, 129, 78, -255, -27, 113, 169, 96, -86, -36, 123, -159, -48, 28, -97, -87, 101, 107, -58, 157, -115, 87, -205, 70, 185, 7, -38, 171, 327, -136, -32, 136, -111, -104, 22, 104, -107, -20, 37, 17, 16, -127, 46, 104, -132, -21, 58, -153, -125, 40, -25, 8, 110, 64, -245, -43, 66, -141, -28, 48, 17, -9, -11, 66, 13, -30, -36, -48, 37, -266, 26, 38, -13, 16, 87, 115, 156, -152, 169, 45, -202, 132, -19, -85, -137, 146, -70, 174, -45, 71, -36, 49, -68, 185, 37, -105, -23, 75, 4, 120, -92, 115, -232, 26, 45, 71, -180, 13, -35, -8, 16, -15, 13, -93, 136, 62, -22, -102, 66, 82, -159, 63, 99, -124, 13, 157, 102, -6, -11, 96, 5, 59, 13, 236, -132, -31, 121, 156, -34, 77, 86, -185, 158, -18, 56, -136, -16]
4216a6l9K31j62RJ30q4j7JQ8l26K84j01j6o7MJ35j04n5N4J91k91K44J28l47O4
4241f2K45k64J97l02J32Q7r0j27K48m0m2j27L04l21m3K04r3M3J07Q8k79N9P6P6
4265G6P6l17J32p0l1LK27J11k00k1l0Qk38K24K79l28L2J13Oj8n5J38j85J56L9
4290A27j47L0J03M5j2j23rJ27k81N0K00p4l0m0J05p9Q2j08n8o1N8J67j82J5R5
4315@K7o4o1J56m0R2rO3k18O8r0K19k25J10j35K8L6rJ89j49O8o6pJ09j02J06j83
4342h7N7K15j84J5j07K59j17L6j61J76j3j73J43Q5j73n2K54l3j87J03j19R3J3
4365D3o9N9k52J12N3K9r5K50l1k67K87j8p4n3k8k36L08r1J24J0j20Q2j76R6J33
4390G6J04j91J86k14N1J61k37N0J32j97q0R0kJ40L4j74J20pN7k00K77j51J2L7
$$ y = [-16, -55, 176, 14, 23, 153, 69, 52, 53, 141, -185, 99, -2, -18, -85, -81, 54, -50, -105, -51, 140, -151, 93, 221, -126, -62, 183, -81, 116, -186, -54, 33, -57, -184, 64, 24, -18, -145, 159, -162, -205, -1, -94, -51, 56, 144, -135, -76, 0, 76, 152, -165, -33, -103, -134, -131, 96, 207, 7, -14, -44, -36, -274, -50, 229, -99, -67, 46, 52, 34, -21, 117, -68, 88, 127, -20, 10, 113, 158, 146, 23, 14, 141, -140, -90, 110, 36, 6, -34, 71, -8, 74, -34, -92, -153, -95, 72, -110, -95, 0, 27, -37, -98, 58, 18, 110, 101, 164, -54, 14, -76, 143, -82, 28, -107, -79, -43, -52, 137, -12, 56, -10, -17, 92, -10, 96, -87, -30, 185, 1, 16, -91, 168, 51, 87, -74, 102, 89, -84, 59, 144, -29, -81, 173, 140, -47, 56, -63, 30, 43, -26, 33, -219, -107, -54, -25, -120, 130, 99, -168, 119, 101, 27, -26, -54, -290, 18, -73, 51, 61, -59, 23, -153, -57, 76, 180, -11, 175, -39, 12, 173, -64, -14, 118, -79, -159, -69, -71, 69, 103, -71, 49, 42, 99, -101, 176, 25, 37, 74]
4414G4J5o4Q5j00j03J59j5J1p7q1Q7j86J97Oo1k8P7j6k7M3J16j07kJ02j56J6o0
4441i5J45N0k10J44j16J34K3q1J12j28K3p8P0l05K40J22M4j06n1l3R7R2k40J78
4465C1r1N6J84j83N9N2k28J76r1r7K07p9J46k18J29j05N5J1p4k6%J55j37P3j7
4490a2l7j9J33j95N0p8J29j75N3R5K2J46r0k64R7j48K72K08k71Q4R9r7j38J32
4514dM5L2o7l9m8J16N2r2J0o8J54j83O2L21l90J38l0K08k38RM4M3k2l7n7p6J09
4541hp7j6K76k29m4M9R3n0j2p5L2q2J71r7q3L21r2nq7p6L8o3m7K74j42Q8m5j10
4569i8R0K6l8Om1n0J55RM8j95k4J30P2j47J02j9N0q3n6J98k80K15j39J9J78Nk21
4596h8J89j04M0o3K2K66m40K58L5O7j12p0K8k4r3Q5q2J70j3j89J29k9q5N9M9k9
$$ y = [74, 89, 25, 110, 10, -93, 66, 51, 62, -15, -96, -9, -195, 2, 8, -53, -81, -4, -20, -47, -4, 112, 5, 3, 105, -51, -35, -95, 50, 100, -110, 34, -82, 52, 75, -6, 106, -22, 1, -77, -7, -312, -72, 50, 94, -12, -63, -96, 1, 93, -147, 31, -60, -4, 180, -3, 56, 108, -120, 56, -35, -132, 75, -4, 142, -76, 53, -52, 3, 14, -60, -86, -86, 69, -68, 5, -12, -49, -68, 65, -130, -80, -158, -29, -204, -151, -56, -34, 112, 22, -242, -145, -293, -21, 187, -84, 0, 99, 2, -136, -4, 41, 73, 6, -33, -81, 35, 87, -5, 5, -63, 91, -92, -30, 291, -99, 39, 9, 217, -21, -12, 32, 75, 53, 16, -41, -117, -8, -85, -101, 175, -54, -98, -49, 44, -6, -18, -93, -61, -143, 28, -69, -152, 169, 77, 72, -15, -91, -53, -116, -163, 111, -31, 57, 12, -98, -8, 18, -20, -14, -55, -105, 50, 59, 107, -88, -112, 18, 90, -57, 45, 26, 76, -7, -63, 135, -145, 70, -69, -50, 128, 133, -88, 101, -3, 37, -26, -4, 262, -178, 80, 115, 182, 70, 0, 28, 4, -89, -4, -86, 84, 71, -118, 11, -18, -103, -44, 5, -24]
4622b4Rk8p9J33k1J02O3j17J01n8r4M5l3P9L8k4j43j16L10j76J67j23j20K28r6
4647B3Mk9n1Q0r5O5n3J00k9J80j65J86p0J3k37J23L0R3Jj61rP9M1k55J55J16l07
4674a72J30J21k21J07n2l2K56k01L1J01j29J76k37K65j62QK4o6J36j12O1l6O5
4697F1j76k4J87q6Q8np5J29k41J63Q6m6J30n8p7LPJ5n7k13K52j55J68j86J06M0
4723C6j00J01l0J15j67J7Q2k32J96m7j6kJ76j63o0P5J84j05j46R1P9j22J19J3
4747I4k27l7N1j8K06k34K07J1q0J03n3J28j22j25J54n0o0K42j81j53k1K03k29
4770a91L43p2J10k38O4L10k45j34J38Lq4K5j47J81j37N7J43j16M2N3Rj85r5K76
4794A10N1k07k7J75q9j98J05K80k16J02p4K4N2k40O6J95J2j32j09KlQ6J71k15
$$ y = [-24, -15, -43, -122, 11, -10, 92, 155, 38, 139, 81, -13, 32, -1, 78, 116, 92, -51, -167, 143, -33, 134, 11, -109, 119, 23, 27, -2, -53, 27, -68, -3, -56, 44, 15, 195, 30, 216, 146, 159, -78, 45, 75, 168, 169, 8, -1, 78, 119, -136, 19, 135, -172, -42, 79, -142, -35, -87, -119, 137, -64, -33, 68, -61, 115, -122, 143, -19, -11, 13, -53, 83, -29, 32, -4, 61, -115, -139, 48, -38, 50, 45, -30, 99, -142, 21, 107, 61, 191, 133, 56, 59, 66, 81, 24, -189, 63, -92, 76, -110, -4, 36, -64, 37, 7, 122, -45, -28, 54, -178, 18, -29, -45, -47, 129, -34, -94, -19, 165, 60, -86, 5, 84, -38, 81, 94, -133, -170, -119, -137, 69, -165, 42, 53, -27, 76, 23, 151, 29, -96, 58, 8, -52, 190, 9, -144, -165, 38, -191, 152, 80, 190, -48, 16, 326, 81, -53, 85, 88, 4, 29, -118, 63, -74, -17, 126, 10, 52, 105, 114, -71, -166, 110, 161, -46, -73, 102, 13, -185, -80, 200, -16, 86, 12, 36, 88, -152, -86, 109, 121, -11, -120, -118, -121, -35, 136, -79]
4818g9J14k4pM3j49R0k2r1J28J03k15R6j09M3k6QJ35j53J84j05J02l6pl2l2M4
4844CQ1or9J31J76j27j93k5J16j4j51L9K8N9L3lJ40k57M5j25O2P1M1Lj07K04q5
4871D0Q6j39j5oJ19k61P8J64j30Q7j4%k3k26P1K12r0J80j69L0M1N5K7r2J74k29
4897c0Q8j36O9n5m8Q5p2n0J1J36J67k04q2M8J55j87J93j53J18j1j01P4J03l40
4921b22J57J62j03P3J14k51r2K59n3ko8K64k62OQ7N3j78J2qO0m2J20j31RJ41j50
4947d5J88K0k68j15J64K12k06R9p6J8kR8j86L7J24j04r7J01J96l3j62n0J75j37
4971d9J77j85O7J5k4L3qq4k5J56k65J95n6J9J69j26n0J68j44J1k0N3k0Q8l9q1
4997b5j99L42j54K4K11mk21k8K55l02k0k1J59k0J02o7Lk56P6J48Q2p6o8J13O1
$$ y = [-79, 35, 11, 4, 47, -102, -12, -34, -125, 3, 106, -109, -13, -122, -79, -105, -97, 38, -115, 69, -36, 66, 30, 23, -9, -41, 3, 84, 78, -21, 110, 286, 159, -34, -59, 57, 43, -108, -69, -41, 18, 51, 48, 188, -69, -24, -149, -87, -16, 25, 28, -79, 125, 40, 126, -13, -28, -34, 85, -176, -98, 66, -64, 23, 9, 9, -14, -240, -169, 43, -47, 133, -36, -6, 35, 90, 117, 25, 199, -30, 58, -78, -9, -64, -112, -27, -99, -149, -138, -2, 165, -39, -121, -73, 82, -105, 88, -65, 53, 42, -59, 15, 118, -222, -65, 97, -6, 67, 181, -70, -162, 97, 44, 42, -26, 238, -24, -18, 69, 122, -56, -44, -52, 8, -34, 86, -45, -36, 105, -45, 143, 163, -105, -220, -56, 156, -50, 49, -27, -9, -11, 87, -99, -62, 62, -42, -139, -38, 158, 125, -37, -87, 88, -49, 128, -57, 10, 25, 1, 34, 26, -58, -83, 73, -192, 3, -53, -34, 135, 9, -41, 127, -17, -6, -26, 27, 7, 95, 56, -25, -224, 118, -36, -12, 199, 195, -26, -54, 201, -101, -121, -142, 17, -3, 99, 32, 35, -221, -145, 3, 85, 9, -59, 54, 115]
5022A15o7q9J0J22j05P3l3L6M1r4Q6k68J23k4J86j36J15j3j62R3j71O7K09J40
5046B54k09P3j71j06J07J73o1r0J25j56n9o7J45R3O3k01J00O8j17M2J42j21j38
5069a11J39N4j29L0J9j02L09j38j90Q3J02K2k02M8mM2j0J32j55O0N4Jp1r7M6K9
5095c9J33k09J71n4p1o3J14N0M1j32j13J61J0J67J6l10K47j62j06K5K43Pn2O4
5119A38j29K1P4j91Ml7K40l9K6o8j33J86m7o8l4ko7P4K69j75j7qj07M7N6j68K34
5146G9K03j35k37K3q6K55o4n4m3J97k2n6l9j18J37M8J9j91L3K26j26j71J73o5
5170a4j2q5J36j32K05j52J02m0J54o8Q1j04q5J44p8j95L38j98m7L8n8J57k42J84
5194B9n8j09J95j40L4j09J54k2j19R2qn0M0J91l5j45Oo8K72j46j05K01pj81l5
$$ y = [115, 48, -41, -31, 91, -14, 59, 26, 62, 103, 9, 95, -173, -50, -74, 112, -24, 91, 78, -84, 9, -162, -95, 114, 254, 45, 118, -53, -159, -52, 121, 60, -30, 95, -61, -120, -187, -42, 51, 114, -87, 13, 81, -36, 6, 148, 27, -111, 28, 82, -47, -17, 2, -100, 209, 71, -119, -36, 66, 88, -114, -66, -70, -28, -38, 94, -61, -1, 53, 54, -17, -114, -68, -39, 94, -115, 56, 2, -69, -132, -18, 32, 73, -59, -172, -11, -1, 166, 182, -128, 119, -43, -149, -124, 119, 126, 74, 138, 9, 30, 104, -87, -83, -120, 120, 81, 107, 39, -94, 92, 45, -23, -57, -59, -126, -52, 217, 42, 25, 17, -90, -43, 13, -155, 79, 282, 147, -90, -67, -153, 102, 38, -16, -59, 138, 116, 60, 21, -97, 40, 88, 107, -84, -51, 175, 49, -122, 51, -14, -26, -111, 25, -107, 98, -54, 48, 8, 162, 94, 175, 71, -14, 130, 52, -143, 195, -3, -50, -12, -70, 87, -155, 29, -29, -138, 57, -83, -49, -158, -4, -26, -145, -53, -61, -111, -71, 120, 85, -60, -54, -122, 150, 4, -101, 100, 93, -88, -123]
5219a23R4J64j40J39l8q7j00M17m78J55J36J07l57p9K17o8Kj2N6J74j46l6J20
5242A17k5jk17n1J89j22K23j06l7L40k84j32n1K67k43J69n0Q6k11J76q8p4R2L4
5266AO7j63J43pm0n8R6m5K02j52K0j67L3Q0j9J7m1J41j20J40j18p6r1J30J00q9
5292a6j27J65M2j23O3j04J09k6P8q0l7J75j47lP2O6j68n6P4o0J15p4j07K01N6
5317H8j02j82J77jjJ33j44N5P8n2j5o1L2n5R4j08J60l6l8j02J11J3p5q5R4J59
5343A37j27l8O7k05K09rm1K6K5OM4K24k13k27K87j63K1o3r4K20Ml1j40ojJ59j25
5370e4J9k0N9Q7lk15J26K0M9j41J35M9J46j06j10M6Rk30L01j95J10n4l5K2nk4
5396a4J7k8r9P1J68j32J88l09J56L3j24J22LllK0r4R1l2n8p7J71K3j16J71j03
$$ y = [-123, -29, 135, -5, 134, 96, 9, -91, 326, -152, 3, 139, 246, -111, -190, 27, -41, -39, -51, 5, 179, 33, -3, 117, 92, 91, -126, -177, 12, -110, 113, 7, -30, 310, 26, -106, -157, 110, -133, 36, -14, 72, -139, 37, -51, -125, -33, 1, 68, -95, 48, 41, 1, -57, 39, -6, 196, 44, 64, -103, -70, 10, -9, 8, -33, 108, -12, 128, 10, -66, -157, -27, 73, -16, -143, 22, 64, -59, 4, -100, 9, -17, 61, -19, -56, 119, -28, -31, 41, 107, -61, -117, -43, -103, 12, -62, -169, 32, 88, -14, -196, -19, -20, -21, 112, -32, 23, 101, 49, 34, -27, 5, -50, 44, -64, 96, 60, 22, -80, 31, 44, -31, -116, -22, 137, 10, -28, 39, -166, 43, 34, -7, 19, 44, 50, 94, 318, 105, -122, 165, 2, 23, -40, -134, 86, 90, 59, -81, -87, -88, 71, -54, -35, -55, 4, 91, 88, -127, -1, 19, 68, -73, 62, 111, 257, 151, 41, 87, 96, -134, 167, -28, 82, 28, -7, 15, 10, -14, 3, -25, -124, -53, 115, -17, 171, -138, 18, 51, -73, 49, 52, 49, 46, 66, -28, 63, 31, -27, -104, 67, 90, -26, 145, 42]
5422D2k0o3P5M6j00q6J98J08k82kP6J10j83m6J96M4j66j57J09N3K61j42j19J4
5446c4K8R7j68J17j88K49k55K20Or1j6P2K60k37j06Q2kN0j64KK23k08Q0K4j8p4
$$ y = [42, 22, -41, 34, 80, -20, -106, 92, 200, -82, -84, -8, 102, -81, -127, 69, 113, -53, -210, -101, -48, 213, 71, -48, -34, -6, 91, -77, 40, -148, 101, -154, 66, 72, -19, -35, 37, 297, 60, -46, 36, 34, 84, -80, -78, 145, -63, 17, 41, 23, -51]
$$ [...]
8191E5
##END NTUPLES=NMR FID
##END=
