##TITLE=1H_Ser 7-4-V-H
 CDCl3, 8 sc, 
 6.08.2021
##JCAMPDX= 6.0         $$ Bruker NMR JCAMP-DX V2.0
##DATA TYPE= NMR FID
##DATA CLASS= NTUPLES
##ORIGIN= UXNMR, Bruker Analytische Messtechnik GmbH
##OWNER= root
$$ XWIN-NMR		Version 3.5
$$ Fri Aug  6 13:31:34 2021 Russian Standard Time (UT+4h)  she@DPX200
##.OBSERVE FREQUENCY= 200.131506
##.OBSERVE NUCLEUS= ^1H
##.DELAY= (6, 6)
##.ACQUISITION MODE= SIMULTANEOUS
##.ACQUISITION SCHEME= undefined
##.AVERAGES= 8
##.DIGITISER RES= 18
##SPECTROMETER/DATA SYSTEM= spect
##.PULSE SEQUENCE= zg30
##.SOLVENT NAME= CDCl3
##.SHIFT REFERENCE= (INTERNAL, CDCl3, 0, 15.7039)
##AUDIT TRAIL= $$ (NUMBER, WHEN, WHO, WHERE, WHAT)
$$ ##TITLE= Audit trail, XWIN-NMR		Version 3.5
$$ ##JCAMPDX= 5.01
$$ ##ORIGIN= Bruker BioSpin GmbH
$$ ##OWNER= she
$$ F:/spectra/data/she/nmr/H-F/1/audita.txt
$$ ##AUDIT TRAIL=  $$ (NUMBER, WHEN, WHO, WHERE, WHAT)
(   1,<2021-08-06 13:30:28.09 +0400>,<she>,<DPX200>,
      <created by zg, POWCHK disabled, PULCHK disabled
       configuration hash MD5:
       00 E9 B6 7A A2 85 ED C7 34 08 36 98 17 FE 4E 26
       data hash MD5: 16K
       DC 76 F3 8E 01 69 36 0D DB 95 E2 DE 92 84 08 19>)
$$ ##END=
$$ 
$$ hash MD5
$$ 21 D6 E1 BF 71 16 43 48 E2 10 46 60 82 DF C7 BC
##$RELAX= 
##$RELAX= 
##$RELAX= 
##$RELAX= 
##$RELAX= 
##$RELAX= 
$$ Bruker specific parameters
$$ --------------------------
##$DU= <F:/spectra>
##$EXPNO= 1
##$NAME= <H-F>
##$PROCNO= 1
##$TYPE= <nmr>
##$USER= <she>
##$AMP= (0..31)
100 100 100 100 100 100 100 100 100 100 100 100 100 100 100 100 100 100 
100 100 100 100 100 100 100 100 100 100 100 100 100 100 
##$AQSEQ= 0
##$AQ_mod= 1
##$AUNM= <au_zg>
##$AUTOPOS= <>
##$BF1= 200.13
##$BF2= 200.13
##$BF3= 200.13
##$BF4= 200.13
##$BF5= 200.13
##$BF6= 200.13
##$BF7= 200.13
##$BF8= 200.13
##$BYTORDA= 1
##$CFDGTYP= 0
##$CFRGTYP= 5
##$CHEMSTR= <none>
##$CNST= (0..31)
1 1 145 1 1 1 1 1 1 1 1 1 1 1 1 1 1 1 1 1 1 1 1 1 1 1 1 1 1 1 1 1 
##$CPDPRG= <>
##$CPDPRG1= <>
##$CPDPRG2= <>
##$CPDPRG3= <>
##$CPDPRG4= <mlev>
##$CPDPRG5= <mlev>
##$CPDPRG6= <mlev>
##$CPDPRG7= <mlev>
##$CPDPRG8= <mlev>
##$CPDPRGB= <>
##$CPDPRGT= <>
##$D= (0..31)
0 1.2 0 0 0 0 0 0 0 0.06 0 0.03 0 0 0 0 0.0002 0 0 0 0 0 0 0 0 0 0 0 0 
0 0 0 
##$DATE= 1628242227
##$DBL= (0..7)
120 120 120 120 120 120 120 120 
##$DBP= (0..7)
150 150 150 150 150 150 150 150 
##$DBP07= 0
##$DBPNAM0= <>
##$DBPNAM1= <>
##$DBPNAM2= <>
##$DBPNAM3= <>
##$DBPNAM4= <>
##$DBPNAM5= <>
##$DBPNAM6= <>
##$DBPNAM7= <>
##$DBPOAL= (0..7)
0.5 0.5 0.5 0.5 0.5 0.5 0.5 0.5 
##$DBPOFFS= (0..7)
0 0 0 0 0 0 0 0 
##$DE= 6
##$DECBNUC= <off>
##$DECIM= 32
##$DECNUC= <off>
##$DECSTAT= 4
##$DIGMOD= 1
##$DIGTYP= 9
##$DL= (0..7)
0 120 120 120 120 120 120 120 
##$DP= (0..7)
150 150 150 150 150 150 150 150 
##$DP07= 0
##$DPNAME0= <>
##$DPNAME1= <>
##$DPNAME2= <>
##$DPNAME3= <>
##$DPNAME4= <>
##$DPNAME5= <>
##$DPNAME6= <>
##$DPNAME7= <>
##$DPOAL= (0..7)
0.5 0.5 0.5 0.5 0.5 0.5 0.5 0.5 
##$DPOFFS= (0..7)
0 0 0 0 0 0 0 0 
##$DQDMODE= 0
##$DR= 18
##$DS= 0
##$DSLIST= <SSSSSSSSSSSSSSS>
$$ [...]
##$SUBNAM2= <"">
##$SUBNAM3= <"">
##$SUBNAM4= <"">
##$SUBNAM5= <"">
##$SUBNAM6= <"">
##$SUBNAM7= <"">
##$SUBNAM8= <"">
##$SUBNAM9= <"">
##$SW= 20.0188882624521
##$SWIBOX= (0..15)
0 0 2 0 0 0 0 0 0 0 0 0 0 0 0 0 
##$SW_h= 4006.41025641026
##$TD= 16384
##$TD0= 1
##$TE= 0
##$TE2= 300
##$TE3= 300
##$TEG= 300
##$TL= (0..7)
0 120 120 120 120 120 120 120 
##$TP= (0..7)
150 150 150 150 150 150 150 150 
##$TP07= 0
##$TPNAME0= <>
##$TPNAME1= <>
##$TPNAME2= <>
##$TPNAME3= <>
##$TPNAME4= <>
##$TPNAME5= <>
##$TPNAME6= <>
##$TPNAME7= <>
##$TPOAL= (0..7)
0.5 0.5 0.5 0.5 0.5 0.5 0.5 0.5 
##$TPOFFS= (0..7)
0 0 0 0 0 0 0 0 
##$TUNHIN= 0
##$TUNHOUT= 0
##$TUNXOUT= 0
##$USERA1= <user>
##$USERA2= <user>
##$USERA3= <user>
##$USERA4= <user>
##$USERA5= <user>
##$V9= 5
##$VALIST= <valist>
##$VCLIST= <CCCCCCCCCCCCCCC>
##$VD= 0
##$VDLIST= <DDDDDDDDDDDDDDD>
##$VPLIST= <PPPPPPPPPPPPPPP>
##$VTLIST= <TTTTTTTTTTTTTTT>
##$WBST= 1024
##$WBSW= 4
##$XGAIN= (0..3)
0 0 0 0 
##$XL= 0
##$YL= 0
##$YMAX_a= 116970
##$YMIN_a= -212471
##$ZGOPTNS= <>
##$ZL1= 120
##$ZL2= 120
##$ZL3= 120
##$ZL4= 120
##$ABSF1= 10
##$ABSF2= 0
##$ABSG= 5
##$ABSL= 3
##$ALPHA= 0
##$AQORDER= 0
##$ASSFAC= 0
##$ASSFACI= 0
##$ASSFACX= 0
##$ASSWID= 0
##$AUNMP= <proc_1d>
##$AZFE= 0.1
##$AZFW= 0.1
##$BCFW= 1
##$BC_mod= 2
##$BYTORDP= 1
##$COROFFS= 0
##$CY= 11.3945322036743
##$DATMOD= 1
##$DC= 2
##$DFILT= <>
##$DTYPP= 0
##$F1P= 2.36226072786647
##$F2P= -0.459571619588291
##$FCOR= 0.5
##$FTSIZE= 0
##$FT_mod= 4
##$GAMMA= 1
##$GB= 0.15
##$INTBC= 1
##$INTSCL= 1
##$ISEN= 128
##$LB= 0.24
##$LEV0= 0
##$LPBIN= 0
##$MAXI= 10000
##$MC2= 0
##$MEAN= 0
##$ME_mod= 0
##$MI= 1.114404
##$NCOEF= 0
##$NC_proc= 0
##$NLEV= 6
##$NOISF1= 3.799351
##$NOISF2= 2.8
##$NSP= 1
##$NTH_PI= 0
##$NZP= 0
##$OFFSET= 15.70392
##$PC= 1
##$PHC0= -13363.24
##$PHC1= 22.40099
##$PH_mod= 1
##$PKNL= yes
##$PPARMOD= 0
##$PSCAL= 0
##$PSIGN= 0
##$REVERSE= no
##$SF= 200.130013532006
##$SI= 16384
##$SIGF1= 3
##$SIGF2= 2
##$SINO= 400
##$SIOLD= 16384
##$SREGLST= <1H.CDCl3>
##$SSB= 0
##$STSI= 0
##$STSR= 0
##$SW_p= 3612.71676300578
##$SYMM= 0
##$S_DEV= 0
##$TDeff= 0
##$TDoff= 0
##$TI= <>
##$TILT= no
##$TM1= 0
##$TM2= 0
##$TOPLEV= 0
##$USERP1= <user>
##$USERP2= <user>
##$USERP3= <user>
##$USERP4= <user>
##$USERP5= <user>
##$WDW= 1
##$XDIM= 8192
##$YMAX_p= 0
##$YMIN_p= 0
$$ End of Bruker specific parameters
$$ ---------------------------------
##NTUPLES= NMR FID
##VAR_NAME=  TIME,          FID/REAL,        FID/IMAG
##SYMBOL=    X,             R,               I
##VAR_TYPE=  INDEPENDENT,   DEPENDENT,       DEPENDENT
##VAR_FORM=  AFFN,          ASDF,            ASDF
##VAR_DIM=   8192,          8192,            8192
##UNITS=     SECONDS,       ARBITRARY UNITS, ARBITRARY UNITS
##FACTOR=    0.0002496,     1,               1
##FIRST=     0,             0,               0
##LAST=      2.0444736,     0,               0
##MIN=       0,             -212471,         0
##MAX=       2.0444736,     116970,          0
$$ Real data points
##PAGE= N=1
##DATA TABLE= (X++(R..R)), XYDATA
$$ [...]
1895B75q18o04L22J010j18o57p66L93R31J52j08q63k18R24O65k12n59p9l6M17
$$ 275 -543 -1147 -825 185 67 -590 -1356 -963 -32 120 12 -851 -1069 -145 520 308 -251 -330 -366 51
1915E1P44P3q82o57P38N75J72q30r40Q71N03K49p08m55j99O79P92o8o39j13k61
$$ 51 795 868 -14 -671 67 642 814 -16 -956 -85 418 667 -41 -496 -695 -16 776 708 69 -44 -305
1936c05M79M72o4l90j02K76P53K06l25p66j89R38M01m30j014k90N67P24r2j069
$$ -305 174 646 582 192 90 366 1119 1325 1000 234 45 983 1384 954 -60 -350 217 941 849 -220
1956b20m40K87M30O25l73p34k47O18N81k3n49k71j52J466J39m16r32j68O45O61
$$ -220 -660 -373 57 682 309 -425 -672 -54 527 504 -45 -316 -468 998 1137 721 -211 -379 266 927
1976I27J27n58r43K23K36J282p12j729P69K98N28q2p51j495J449K92L66r40o35
$$ 927 1054 496 -447 -224 12 1294 582 -1147 -378 -80 448 366 -385 -1880 -431 -139 227 -713 -1348
1995a348J26J212m43N39o65l38L95J000J47q30n33M9Q78K17n00n31k68O71J030
$$ -1348 -1222 -10 -453 86 -579 -917 -522 478 625 -205 -738 -689 189 406 -94 -625 -893 -222 808
2014H08j88q92p04M79Q06L27m61q25p8P97R56j61r68m63N94Q13L00m43q91j21
$$ 808 620 -272 -976 -497 309 636 175 -650 -728 69 1025 864 -104 -567 27 840 1140 697 -194 -315
2034c15R69K74J64q17o18M13R10J73q72p55Q3R49kj85q26m77P02O73n2o29n09
$$ -315 654 928 1092 275 -343 70 980 1153 281 -474 -391 558 556 371 -455 -932 -230 443 391 -238 -747
2055g47K78N58M3l5o63J35L61M07j7k99o43L98L66N68m09p42k02O20M11j59l95
$$ -747 -469 89 132 97 -566 -431 -70 337 320 21 -622 -224 142 710 301 -441 -643 -23 388 229 -166
2076a66l39L32P1O22p78m31k17M13M82K3n26n12L74N57M21m30j23m00M66N67J53
$$ -166 -505 -173 -102 520 -258 -689 -906 -493 -11 12 -514 -1026 -652 -95 326 -104 -227 -627 -161 406 559
2097E59o45l07k4M34O82p38k94p8L75M52k31l27m98M89M81J95l89o81r2L96O19
$$ 559 -86 -393 -417 17 699 -39 -333 -411 -36 416 185 -142 -640 -151 330 525 136 -545 -637 -241 378
2118C78J34n39l05l5R17J24j41l99r9N75M14N8p13k68J05M80J91m16m17l77O58
$$ 378 512 -27 -332 -367 550 674 533 134 35 610 1024 1082 369 101 206 686 877 461 44 -333 325
2139C25N84m69o78l58J47P17O1n26m34p7M28Q20P6r30k51N19N21r9k10n63j36
$$ 325 909 440 -238 -596 -449 268 329 -197 -631 -708 -280 540 616 -314 -565 -46 475 376 166 -397 -533
2160e33Q05L60l07p88j94L69N55J48q85o13K49N64K85k93o60j69M12O61J12k98
$$ -533 272 632 325 -463 -657 -288 267 415 -470 -1083 -834 -270 15 -278 -938 -1107 -695 -34 78 -220
2180b20m99J97P75P5n24j43k47O13M85Q2o01k16K51L97k5k38o74n2P46L19j84
$$ -220 -719 -522 253 328 -196 -339 -586 27 512 594 -7 -223 28 425 400 162 -512 -564 182 501 317
2201C17o62k00K28M83K73o68n45L78P67J29Q7o85l8J26Q79J12n06l99q0Q13K55
$$ 317 -345 -545 -317 166 439 -229 -774 -396 371 500 587 -98 -136 -10 869 981 475 76 -4 809 1064
2222A064o27m59j82M32M14qo38o11J27Q80L5l61n33k01L23O94l74m03L7J0N73
$$ 1064 437 -22 -204 228 642 634 -4 -615 -488 392 427 66 -467 -668 -345 349 -25 -428 -391 -381 192
2243A92N71q35o4j08M80j21K01j48o88M86O29m17o25J52l45L83N30j45p56M3J66
$$ 192 763 -72 -136 -244 236 115 316 168 -520 -34 595 178 -447 -295 -640 -257 273 128 -628 -585 -419
2264d19L27J11J61q99J03O25j94L18r0n45n0R10q2l63K4j64J11N08j23l66l06
$$ -419 -92 19 180 -719 -616 9 -185 133 43 -502 -552 358 276 -87 -63 -227 -116 392 269 -97 -403
2285d03L27K21o4K71o88j32N20N18j23l12o01M39O50J36l11q26O60K13L04j92
$$ -403 -76 145 81 352 -336 -468 52 570 447 135 -466 -27 623 759 448 -378 282 495 799 607
2305F07n37j44N98J19J7l04m11J8M66K04k61l72o2k22N53L95q50j08m9M40K81
$$ 607 70 -74 524 643 660 356 -55 -37 429 633 372 0 -62 -284 269 664 -186 -294 -343 97 378
2326C78j99l72m34M76M62J67o93j6r2P75J52o45l07k53L71M21J34m39n96J52Q57
$$ 378 179 -193 -627 -151 311 478 -215 -231 -323 452 604 -41 -348 -601 -230 191 325 -114 -710 -558 299
2347B99J02q47j90j7M92L49j40q55K74K1O90N1l83j74K76N18l3l39l82m00M89
$$ 299 401 -446 -636 -653 -161 188 48 -807 -533 -512 178 229 -154 -328 -52 466 433 94 -288 -688 -199
2368a99O09K43o61l88L59K75K28k97p75P8N60L56k12k35l50K78M88l42L17m11
$$ -199 410 653 -8 -396 -37 238 466 169 -606 -528 32 388 176 -59 -409 -131 357 15 332 -79
2388g9r0L51J97q9k49j22J09L58J20k05l21j65L57N77n23l69m04M21M88l0m96
$$ -79 -169 182 379 290 41 -81 28 386 506 301 -20 -185 172 749 226 -143 -547 -126 362 332 -164
2409a64k57K83J5L60j15o45j44M73L05P8j08n86J08L71k7r5k83r5J20K95J69l03
$$ -164 -421 -138 -123 237 122 -523 -667 -194 111 189 81 -505 -397 -26 -53 -148 -431 -526 -406 -111 58 -245
2431b45m08r2L16N63k59k94m00M31J44K04l61l62K41L49O20l76l96m35N56J75
$$ -245 -653 -745 -429 134 -125 -419 -819 -388 -244 -40 -401 -763 -522 -173 447 71 -325 -760 -204 -29
2451b9L86p92K8K21K18K07n60k10J64K27K92j61J31l31k07Q93l05l6l66j32J06
$$ -29 357 -435 -407 -186 32 239 -321 -531 -367 -140 152 -9 122 -209 -416 477 172 136 -230 -362 -256
2472b56O33k6k07m10K11M55L5j90k36JK34N15p8o53j44M0O28J50p74J17k67J3
$$ -256 377 351 144 -266 -55 400 435 245 9 10 244 759 681 28 -116 -76 552 702 -72 45 -222 -209
2494b09P37k3o29k83M99M1J07nl67j32L80L79k87j91l74M46K33j20m1n54J88N69
$$ -209 528 505 -124 -407 92 133 240 235 -132 -264 116 495 208 17 -357 89 322 202 161 -393 -205 364
2516C64K27j92o45j97M27N44j54n29q3J52M02R4k0o37j20K13M03P1n07l13Q5K55
$$ 364 591 399 -246 -443 -16 528 374 -155 -238 -86 316 410 390 -247 -367 -154 249 320 -187 -500 -415 -160
2538a60K39j53q7k01N86K39k60o9l19J95N79l54j17m03O2P38j31j32m01k04L12
$$ -160 79 -74 -161 -362 224 463 203 134 -185 10 589 235 118 -285 -223 515 384 252 -149 -353 -41
2559d1M86k54J6n26M24K60Q7j41k07k04L76J74J58m83p0J02L7M52k67nl79r8N95
$$ -41 445 191 207 -319 105 365 452 311 104 -100 276 450 608 125 55 157 194 646 379 374 -5 -103 492
2582D92r4k83N3l14N4M34l55k12L7K24O9M20o31k63r4M23J95j57k32j71L74N65
$$ 492 398 115 168 -146 -92 342 -13 -225 -188 36 105 525 -106 -369 -463 -40 155 -2 -234 -405 -31 534
2604E34o13k0j10L62q9J82k19k94l72M27M03j78j87p2O8J41j05p7p1k58R9O30
$$ 534 -79 -99 -209 153 64 246 27 -267 -639 -212 191 13 -174 -246 -178 -37 -142 -219 -290 -548 -449 181
2626A81l0l31l52J80N99J13j62k65p5J7O29k34o1o43K77M71K2k74o17L36L53J54
$$ 181 151 -180 -532 -352 247 360 198 -67 -142 -125 504 270 209 -434 -157 314 336 62 -555 -219 134 288
2648B88n7l11m64M04J55K83j34m63M19L1J84j75p0l21K53O81K8p47j25nK15K38
$$ 288 231 -80 -544 -140 15 298 164 -299 120 151 335 160 90 -231 22 703 731 -16 -141 -146 69 307
2670C07k07k57j71L27J13J54j50m47P6M01K22j31m22j94L38O7R2k79j22J75M8
$$ 307 100 -157 -328 -1 112 266 116 -331 -255 146 368 237 -185 -379 -41 26 118 -161 -283 -108 -60
2691f0R8j85J35k68L03K26k09j33k87J42L78L85n75m53L89J2J63Kk77m90K34O21
$$ -60 38 -147 -12 -280 23 249 40 -93 -380 -238 140 525 -50 -503 -114 -102 61 63 -214 -704 -470 151
2713A51M9m05j97o6L41K19j45k82J8K74M61l8o23j94L45L4J56N0l73j58M00M17
$$ 151 200 -205 -402 -468 -127 92 -53 -335 -317 -43 418 380 -243 -437 -92 -58 98 148 -225 -383 17 434
2735D34k22j24l49K32j06K64L23k37l44M15MM1k44j42J2K78J67k43K72n87J64
$$ 434 212 88 -261 -29 -135 129 452 215 -129 286 290 331 87 -55 -43 235 402 159 431 -156 8
2756HN47l9m31k67J44M06p5Q8l93O5l90P97j75k04k01j02N13N1k71l51K21J51
$$ 8 555 516 85 -182 -38 368 293 381 -12 53 -337 460 285 81 -120 -222 291 342 71 -280 -59 92
2778I2J45l6l62Q7p3L13j95K4p11L22J08L54K4l84L49l55L47Q0k09l76K81J05
$$ 92 237 201 -161 -74 -147 166 -29 -5 -716 -394 -286 68 92 -292 57 -298 49 129 -80 -456 -175 -70
2800g0K60k5m91K21q7K49J33o1m05J58J63K56j28m83k4K99J13Pk51j04N17J07
$$ -70 190 165 -326 -105 -192 57 190 129 -276 -118 45 301 173 -310 -334 -35 78 85 -166 -270 247 354
2822C54j57m34K68l65K77M15J2l13k37J33m6J83O3j99K8P5L37N4j28m84K18M40
$$ 354 197 -237 31 -334 -57 358 370 57 -180 -47 -93 90 153 -46 -18 57 394 448 320 -164 54 494
2844D94k48r9k73K6p1P10k98j69k70P4L15n5j35j94P4J59K36l39J54k10J3K78
$$ 494 246 147 -126 -100 -171 539 241 72 -198 -124 191 136 1 -193 -119 40 276 -63 91 -119 -106 172
2866A72l86mJ0Q9K6M53J12p61L02j92Q1N0K2j43k15K31J99j55j14l33O0N84k19
$$ 172 -214 -218 -208 -119 -93 360 472 -289 13 -179 -98 -48 -26 -169 -384 -153 46 -109 -223 -556 -496 88 -131
2889a31j77r4J33J50K61k64m28L59K78K1l40K51k26o6M60m2k93O6j94M29N4k38
$$ -131 -308 -402 -269 -119 142 -122 -550 -191 87 108 -232 19 -207 -273 187 145 -148 -82 -276 153 207 -31
2911c1mM4j4M9n6J96j84o0l9N11p9l38k83J57k55P75m42k14L13l00M91j19O5j24
$$ -31 -35 9 -5 44 -12 184 0 -60 -99 412 333 -5 -288 -131 -386 389 -53 -267 46 -254 237 118 183 59
2935E9j6J90J6Mm22K63K35k15Q6j94l25J82L34R1j53p8m5n7L19j00k52k06N31
$$ 59 43 233 249 253 -169 94 329 114 200 6 -319 -137 197 288 135 57 12 -45 274 174 -78 -284 247
2958B47j5j79n35J68N39j46L89m13k2l05J00N12m50r1k90K68L09K4j69m25J66
$$ 247 232 53 -482 -314 225 79 468 55 33 -272 -172 340 -110 -201 -491 -223 86 110 -59 -484 -318
2979c18N06M3j70l52K12o9K36o5j67j54O4M71o5k70Q5J2o7L44j32l6N5m08K06
$$ -318 188 231 61 -291 -79 -148 88 23 -144 -298 -234 237 172 -98 -13 -1 -68 276 144 108 163 -245 -39
3002c9K88k86k19N7p7L33J49j67l0L4L42m46K95k51l17M22J70K38k14j45KJ23
$$ -39 249 -37 -256 -199 -276 57 206 39 9 43 385 -61 234 -17 -334 88 258 496 282 137 139 262
3024B62J5q1j0K3J61j23J05l57K29l57N07k71j57qj31M31j34pk07k07J94J88K6
$$ 262 277 196 186 209 370 247 352 -5 224 -133 374 103 -54 -62 -193 238 104 97 -110 -317 -123 65 91
3047I1p0j47J13q4L02n8l92J98L71j46k3m93Q2J05n0L48j16k21J29q8K58l5k10
$$ 91 21 -126 -13 -97 205 147 -245 -47 324 178 155 -338 -256 -151 -201 147 31 -190 -61 -149 109 74 -136
3070a36j08j58J73L71P0k96q1k7N23o3k12j06k3j15M44Q5l66l00L01L03j1j35
$$ -136 -244 -402 -229 142 212 -84 -165 -192 331 268 56 -50 -73 -188 256 341 -25 -325 -24 279 268 133
3092A33j03K9j23K58o1j92m10J61K16N70l35k32J03j81L87j99r1J32JM19k16q2
$$ 133 30 59 -64 194 133 -59 -469 -308 -92 478 143 -89 14 -167 220 21 -70 62 63 482 266 184
3114A84m3NQ0M4m7l87L15P3j05p0j71QLK33o8L6M0j27J05p0O2q2j18p5L18k58
$$ 184 141 146 226 270 223 -164 151 224 119 49 -122 -114 -111 122 54 90 130 3 108 38 100 18 -100 -175 143 -115
3140a15j12n2R3M98j51j19j86m7j2M63l58j48M5j07K63J21n2l01J90J8J17N1k97
$$ -115 -227 -279 -186 312 161 42 -144 -191 -203 260 -98 -246 -201 -308 -45 76 24 -277 -87 -69 48 99 -198
3163a98j93J61K85N1k17j53K03K6M8N3k1l84J90L67k07K21m31k82M01N9K64k52
$$ -198 -391 -230 55 106 -111 -264 -61 -35 13 66 45 -339 -149 218 11 232 -199 -481 -80 -21 243 -9
3185ij37K91O9k65K26m63mM96j64m2P8K09l86L11m4J53m85JN68j06k33j73L8K60
$$ -9 -146 145 214 -51 175 -288 -292 204 40 -2 76 285 -101 210 166 319 -166 -165 403 297 64 -109 -71 189
3209A89M6rl63n4r7M29J30k39k64Q1j7K41K71l03o6k95P5L02n9k16K40K01L76
$$ 189 235 226 -137 -191 -288 141 271 32 -232 -151 -168 73 344 41 -25 -320 -245 57 -2 -218 22 223 599
3232E99p04J85k02J15Q0K74j03j4m27J77J17j45k73K6K40J5O1q9j04j47J02J21
$$ 599 -105 80 -122 -7 73 347 244 230 -197 -20 97 -48 -321 -295 -55 -40 21 -68 -172 -319 -217 -96
3254i6K54j74k72L06J23l15L74k32j75L86j43L43j89k69J09J74k5m3k85j04N97
$$ -96 158 -16 -288 18 141 -174 200 -32 -207 179 36 379 190 -79 30 204 179 136 -149 -253 344
3275C44LJ74m54l42K03J79k4j1j85J23K20J19j85K8k56L8K49o0m31L11n1J38J38
$$ 344 347 521 67 -275 -72 107 83 72 -113 10 230 349 164 192 -64 -26 223 163 -268 43 -8 130 268
3298B68M8j93j98L67k21K32m93J82RJ86j3j26j39J83k68N31j90j26j93K0N12k59
$$ 268 316 123 -75 292 71 303 -190 -8 1 187 174 48 -91 92 -176 355 165 39 -154 -134 378 119
3320A19p0j24j03L25j15k64K21k16kK20J20j16l5r3LQ1p0k23J80j05J84J41k05
$$ 119 49 -75 -178 147 32 -232 -11 -227 -229 -9 111 -5 -40 -133 -130 -49 -119 -342 -162 -267 -83 58 -147
3343a47q4j55L95J44j78J14J9r6J11r5j93Q4QNR8O4l73J65J51J59j69jP3k66M33
$$ -147 -231 -386 9 153 -25 89 108 12 123 28 -165 -81 -73 -68 30 94 -279 -114 37 196 27 26 99 -167 266
3368B66q3j83k53M9K27L77j15k35P2j10k38L97K0j89R6Q7O6J18p03L21k05L83
$$ 266 183 0 -253 -204 23 400 285 50 122 12 -226 171 191 2 98 185 251 369 -334 -13 -218 165
3390A65L25l25k53r3J8J45K58q0m44K09K96k11K43k42q4j71M42K17o21n9K97N2
$$ 165 490 165 -88 -181 -163 -18 240 160 -284 -75 221 10 253 11 -73 -244 198 415 -206 -265 32 84
3412H4k1j27Q7R4l22J38k1o5Q1p3N8j38Kn9N6n7J74l8p4J3m3J80l4J28k28J09
$$ 84 63 -64 23 117 -205 -67 -88 -153 -72 -145 -87 -225 -223 -282 -226 -283 -109 -147 -221 -208 -251 -71 -105 23 -205 -96
3438i6m6J62j06K2j10J36j48K21n6k59J22J51K21j65Rl63R5K15J58k66Q1J89K2
$$ -96 -142 20 -86 -64 -174 -38 -186 35 -21 -280 -158 -7 214 49 58 -305 -210 5 163 -103 -22 167 189
3461A89j38k95J00O3R3M7Q5k12K2k5J99p1J02K48n63L0J94Nk15J10K64k76J72
$$ 189 51 -244 -144 -81 12 59 144 -68 -46 -71 128 57 159 407 -156 -126 68 73 -142 -32 232 -44 128
3484A28P3k26j51J42K01j48J76l49J33J48o2k27J84k76J68L76l33k7j59J25J94
$$ 128 201 -25 -176 -34 167 19 195 -154 -21 127 65 -162 22 -254 -86 290 -43 -70 -229 -104 90
3505I0Q4j56r4O1K87j07l14n6K2k35M92k74J25l06L31J07O5l27j64J96P5j4Q8
$$ 90 174 18 -76 -15 272 165 -149 -205 -183 -418 74 -200 -75 -381 -50 57 122 -205 -369 -173 -98 -112 -24
3528b4J80q7k07J27R1j8k6n1l31L52j2k13K43L3K67l10n3j69J74L31k84K23k86
$$ -24 156 69 -138 -11 80 62 36 -15 -346 6 -6 -219 24 57 324 14 -39 -208 -34 297 13 236 -50
3551e0k12L07n5K27r6j54p0K99R3nJ33l36k70L10J5p1N9o5Q2K80R6n78q5J03p8
$$ -50 -262 45 -10 217 121 -33 -103 196 289 284 417 81 -189 121 136 65 124 59 141 421 517 -61 -146 -43 -121
3576a21J95Q4j43m7R4J66j86j15J13k80M29O3m13kK39j28R2r9P9j6j95P0jK33
$$ -121 74 158 15 -32 62 228 42 -73 40 -240 189 252 -161 -163 76 -52 40 -59 20 4 -191 -121 -122 111
3600A11j58LJ49l2j05m4n2J36j25K53o2l26K46m3L83l08m45L70j28J80J48j50
$$ 111 -47 -44 105 73 -32 -76 -128 8 -117 136 74 -252 -6 -49 334 26 -419 -49 -177 3 151 1
3622AJ32j85J31j14J57Q6k20j81K31J26k41k8J48J70n9O3j96k56K23k5K74k07
$$ 1 133 -52 79 -35 122 208 -12 -193 38 164 -77 -105 43 213 154 217 21 -235 -12 -37 237 30
3644C0R3QK4l5j42p4K26q1J44k23l1O1J11J01j86n9K2j83J52q7Q4j95J67P5KJ69
$$ 30 123 131 155 120 -22 -96 130 49 193 -30 -61 0 111 212 26 -33 -11 -194 -42 -129 -45 -240 -73 2 4 173
3670A73k36R0pJ85j58mj68k27K73N7K96l38j41J81K90Q7o80J38K49l51M33l60
$$ 173 -63 27 20 205 47 43 -125 -352 -79 -22 274 -64 -205 -24 266 353 -327 -189 60 -291 142 -218
3692b18j22J18J15N9r4K16j76k0m7K79j52J52k31N5NO9o0j25L40j48rJ48k13j55
$$ -218 -340 -222 -107 -48 -142 74 -102 -122 -169 110 -42 110 -121 -66 -61 8 -52 -177 163 15 6 154 -59 -214
3716b14J57L52k40j99M0O9J62j84J00J7N0m22K90L62l49J84j96M6J87p4j28q1
$$ -214 -57 295 55 -144 -104 -35 127 -57 43 60 110 -312 -22 340 -9 175 -21 25 212 138 10 -71
3738g1N9jK98m04K31o1j25J32J82l37L32k98K60q6K06j05l33l5K91k79L03k05
$$ -71 -12 -13 285 -119 112 51 -74 58 240 -97 235 -63 197 111 317 212 -121 -156 135 -144 159 -46
3760d6K3j03J63q8O2M2pK91k85k14PL06k29j09L6r8K03p7P3R9j65J7j1lK9J67
$$ -46 -23 -126 37 -51 11 53 46 337 52 -162 -155 151 -78 -187 -151 -249 -46 -123 -50 49 -116 -99 -110 -113 -84 83
3786H3k38R9n5R0k6n6J26J39o4J6m12J78j40L61n9j02l2l43M73j3J12k4l28J53
$$ 83 -155 -56 -111 -21 -47 -103 23 162 98 114 -298 -120 -260 101 42 -60 -92 -435 38 25 137 113 -215 -62
3810f2Q0Q5J00l11J71Rl2lj8r9Q5J67k03O7rN3j21kP7J2M4l1M40m90l22M95k57
$$ -62 18 103 203 -108 63 72 40 37 19 -80 5 172 -31 36 27 80 -41 -43 34 46 90 59 499 9 -313 182 -75
3837g5K75n9j10J1l22J90J91j57n5rK16j69K41k18NP8k41J59J98q7k6N1M3N2k43
$$ -75 200 141 31 42 -280 -90 101 -56 -111 -120 96 -73 168 -50 -45 33 -208 -49 149 62 36 87 130 182 -61
3862f1j48ML97p2j38k34K02Q5J29k52J35p4M2r7J65R4l15j73K48r9O9j31k2M58
$$ -61 -209 -205 192 120 -18 -252 -50 35 164 -88 47 -27 15 -82 83 177 -138 -311 -63 -162 -93 -224 -246 212
3886B12lj84l02K44j61J73P3m3KK05k52K39j70K25j59m00O19k91j77K69l9O6j
$$ 212 209 25 -277 -33 -194 -21 52 9 11 216 -36 203 33 258 99 -301 318 27 -150 119 80 146 145
3909A45o5J99l62J29K72O2o5k00j07lL7j95K83j59n9J34Q2J41k12j26K12k23J99
$$ 145 80 279 -83 46 318 380 315 115 8 5 42 -153 130 -29 -88 46 128 269 57 -69 143 -80 119
3932A19q1j6r1L26k26M5m10R3L54n4j61M1k02K09K8j5R8Q3k10R7J03J29l41N8
$$ 119 38 22 -69 257 31 76 -334 -241 113 59 -102 -61 -263 -54 -26 -41 57 140 -70 27 130 259 -82 -24
3956b4J80o8o6p2M4l6J18l20J49r2J45j65J29j13K93k12K02k24K80Kk21n3p9J91
$$ -24 156 88 22 -50 -6 -42 76 -244 -95 -187 -42 -207 -78 -191 102 -110 92 -132 148 150 -71 -124 -203 -12
3980a2j12J20j06K43o3J91k58J02j44l28N21J8j03l31K72N0k48M14k41r4K05j22
$$ -12 -124 -4 -110 133 70 261 3 105 -39 -367 154 172 69 -262 10 60 -188 226 -15 -109 96 -26
4002b6m4p2N47l14J43k92O7j5K2O8q2k37L82k73JJ63K0l2J9l33K81p2L61m42K84
$$ -26 -70 -142 405 91 234 -58 9 -6 16 84 2 -235 147 -126 -125 38 58 26 45 -288 -7 -79 282 -160 124
4027A24q6R3m8j16j85O8J20K90j26o1k81L4J72k56L17m4r0n7L8j35M03j74j21
$$ 124 38 131 83 -33 -218 -150 -30 260 134 73 -208 -174 -2 -258 59 15 -75 -132 -94 -229 174 0 -121
4050a21R1J26k33O2Q9k95K88K95m68N6Q3j56K72r8J2O9j53q6J62R4J21j16q5j28
$$ -121 -30 96 -137 -75 14 -281 7 302 -166 -110 -27 -183 89 -9 3 72 -81 -167 -5 89 210 94 9 -119
4074a19M45n34J02j40K07j38K8O8Q9J1m5J4k07L31k44J58K04q1J14l72M1J25p8
$$ -119 326 -208 -106 -246 -39 -177 -149 -81 8 19 -26 -12 -219 112 -132 26 230 149 263 -109 -68 57 -21
4097b1J12K34j05j45J6l46K11J37k54L11m47L29l15K59K58j40k22p9K45j78p0
$$ -21 91 325 220 75 91 -255 -44 93 -161 150 -297 32 -283 -24 234 94 -128 -207 38 -140 -210
4118b10R1N2J77k22P3m9K68l71J67O5k27J85J54o6J3l38K60J23k85K21j54P0k28
$$ -210 -119 -67 110 -112 -39 -88 180 -191 -24 41 -186 -1 153 87 100 -238 22 145 -140 81 -73 -3 -231
4141b31K08j27K91j16q3p4J60k90M59k93J75l5k34J74K4O6l8k8J3k54K04J8n3
$$ -231 -23 -150 141 25 -58 -132 28 -262 197 -96 79 44 -190 -16 8 74 36 8 21 -233 -29 -11 -64
4164f4K33%j1Ol58K99Oj26l9Q0R1k91J56q3K86m0j84q2m5J40r0L3J47J83P3j15
$$ -64 169 169 158 164 -194 105 111 -15 -54 26 117 -174 -18 -101 185 145 -39 -121 -166 -26 -116 -83 64 247 320 205
4190B05j45L8Jk04lK59j95L27l27L13k79j97L09j45N1L0k86K26K22k6k31o5M0
$$ 205 60 98 99 -105 -108 151 -44 283 -44 269 -10 -207 102 -43 8 38 -248 -22 200 174 -57 -122 -82
4213h2R2L5K4k35J34k12L36J69j61nk79J21K4L9k3J4k14J66MJ62j48j15j78J94
$$ -82 10 45 69 -166 -32 -244 92 261 100 95 -184 -63 -39 0 -23 -9 -223 -57 -53 109 -39 -154 -332 -138
4237a38J29RL8J67k07J8J1KK06l06K31k33K25k84J38JP3m2Q7m53K19J03J13J24
$$ -138 -9 0 38 205 -2 16 27 29 235 -71 160 -73 152 -132 6 7 80 38 125 -328 -109 -6 107 231
4261B31j33j19J38o0j14k34K93P3j60j38L52k61J79M6J21l80J38k41K69J9m3K10
$$ 231 98 -21 117 57 -57 -291 2 75 -85 -223 129 -132 47 93 214 -166 -28 -269 0 19 -24 186
4283A86j85J58J8K22l85q2L74m84J97j04K41j31R1K8l27K71k97J35K03j7K09m04
$$ 186 1 159 177 399 14 -68 306 -178 19 -85 156 25 116 144 -183 88 -209 -74 129 112 321 -83
4305h3j17k0M29j49q0J16K3QP3l56o2K77R6k48L6m9L6q7l7K37j74K24j5k06n3
$$ -83 -200 -220 209 60 -20 96 119 127 200 -156 -218 59 155 -93 -57 -106 -70 -157 -194 43 -131 93 78 -128 -181
4330a81L60j56j40o3K16J8k42l5K78O2M3Oo5o1p4j16L23k64Jk8j16K62o8K10l54
$$ -181 179 23 -117 -180 36 54 -188 -223 55 117 160 166 101 40 -34 -150 173 -91 -90 -118 -234 28 -40 170 -184
4355a84J04P1O5p3j5J19l2j20K1J44k17L81j76J74m03Q8Q5R5m9l24L12j18J01
$$ -184 -80 -9 56 -17 -32 87 55 -65 -44 100 -117 264 88 262 -141 -53 32 127 78 -246 66 -52 49
4378D9K38l00J70j0K5j89K3M4p5K08j82J17K3O4l57j44M87k96J87k1o4k04J40
$$ 49 287 -13 157 147 172 -17 6 50 -25 183 1 118 141 205 -152 -296 191 -105 82 61 -3 -207 -67
4401f7J00j33R9l6PK6L6K4n1j17N3Q5r3J48K50n07K11K4P3j01j4J80p2q3k61M81
$$ -67 33 -100 -1 -37 -30 -4 32 56 5 -112 -59 26 -67 81 331 -176 35 59 132 31 17 197 125 42 -219 262
4427B62k45K5k63p0J94M70n07J24k07l7J84q9K17q1k33K72j09Pj58K9K15j33R5
$$ 262 17 42 -221 -291 -97 373 -134 -10 -217 -254 -70 -159 58 -23 -256 16 -93 -86 -244 -215 0 -133 -38
4450c8K2J07K6p8n6qlj14K70j3k54L62j49k16JM2K23q4j15L07l33J53j69L5r5
$$ -38 -16 91 117 39 -17 -25 -28 -142 128 115 -139 223 74 -142 -141 -99 124 40 -75 232 -101 52 -117 -82 -177
4475a77K25j27J21j67J43Q9j68K19k36K2l13L31k27K32l4n0M8K03m9j4N7j88R2
$$ -177 48 -79 42 -125 18 107 -61 158 -78 -56 -369 -38 -265 -33 -67 -117 -69 134 85 71 128 -60 32
4498C2q8k7J16k51J51m1K6o2N4J25J42j87J04k73N56m29j54K87Q2j79J85n9m3
$$ 32 -56 -83 33 -218 -67 -108 -82 -144 -90 35 177 -10 94 -179 377 -52 -206 81 163 -16 169 110 67
4521F7K02m70K56Q1j43K2J84k30r3K22J4O3l49J8K08K43n00J88j25J62k17Q7K41
$$ 67 269 -201 55 136 -7 15 199 -31 -124 98 112 175 -174 -156 52 295 -205 -17 -142 20 -197 -110 131
4544A31O4j72P9k31J21j7J4p8J18n5J37P4k90J84J93j69q0K14j2j57N4r4N6l90
$$ 131 195 23 102 -129 -8 -25 -11 -89 29 -26 111 185 -105 79 272 103 23 237 225 68 122 28 84 -306
4568c06M00j77K06PP5j27j92K6L23k37k07P5j92K74J64j36J03o3k25K72J25l42
$$ -306 94 -83 123 130 205 78 -114 -88 235 -2 -209 -134 -326 -52 112 -24 79 16 -209 63 188 -154
4590a54K64p2N7K5j22l8O1M6j13j14M16k72k97K62LJ63o1j01p3J12k94L22J96
$$ -154 110 38 95 120 -2 -40 21 67 -46 -160 256 -16 -313 -51 -48 115 54 -47 -120 -8 -302 20 216
4613B16k41Pj76JK47q7M0l02N31j80l77K34L7K12j32m5j08J45J71J40m72L37j25
$$ 216 -25 -18 -194 -193 54 -33 7 -295 236 56 -321 -87 -50 162 30 -15 -123 22 193 333 -139 198 73
4636G3j37J6j10K74l44M80m43K90j00k08K70L1j15L12j17m7k21J55J32l12K12
$$ 73 -64 -48 -158 116 -228 252 -191 99 -1 -209 61 92 -23 289 172 125 -96 59 191 -121 91
4657I1J19j12O6l36no4K97N2k37J09no3L6J8M5j16L35k80l4J51J33nl8k72K72
$$ 91 210 98 164 -172 -177 -241 56 108 -129 -20 -25 -88 -52 -34 11 -105 230 -50 -84 67 200 195 157 -115 157
4682A57j7m55L18j4P2j59L0m4J22l68M62j27r7K07R1l05j09K65Q3l9R8j05r0j8
$$ 157 140 -315 3 -11 61 -98 -68 -112 10 -358 104 -23 -120 87 178 -127 -236 29 112 73 171 66 -24 -42
4706d2L4Q2j33R8k27K06R8j3nk87m9j3J0L36n4j84K32m02J89j25J91N6K58Pm40
$$ -42 -8 74 -59 39 -188 18 116 103 98 -189 -238 -251 -241 95 41 -143 89 -313 -124 -249 -58 -2 256 263 -177
4731a77M37m07J40k35M49j11l61O1K16j03M8q9J03p8O9k23K52N8j69N2jL21l46
$$ -177 260 -147 -7 -242 207 96 -265 -204 12 -91 -43 -132 -29 -107 -38 -261 -9 49 -120 -68 -69 252 -94
4754i4J95mMj28j38J09Q8J46k49Rj6j01J93k68L34K7j48J99l39J87r7J90r3j25
$$ -94 101 97 101 -27 -165 -56 32 178 -71 -62 -78 -179 14 -254 80 107 -41 158 -181 6 -91 99 6 -119
4778a19K34k83O8R4J15p6j07J30k20M1K90q4j25J37J17l35O2k6k6O9j00J56R4
$$ -119 115 -168 -100 -6 109 33 -74 56 -164 -123 167 83 -42 95 212 -123 -61 -87 -113 -44 -144 12 106
4801A06j26oJ0k12O15k52j38k15L12r1k24J33J73J97m09M9K49Ol08J23j09L42
$$ 106 -20 -26 -16 -228 387 135 -3 -218 94 3 -221 -88 85 282 -127 -78 171 177 -131 -8 -117 225
4823B25j45K09j85j19J01j49J30k58K65q7K65r9k54j08K01o4n5J73q4J40L0j28
$$ 225 80 289 104 -15 86 -63 67 -191 74 -13 252 153 -101 -209 -8 -72 -127 46 -38 102 132 4
4845Do8P2Q4j43J38%J85k59k71J65L58l32J06N2j16k27J85j30L16p7r9P1O0k13
$$ 4 -64 8 92 -51 87 87 272 13 -258 -93 265 -67 39 91 -25 -252 -67 -197 119 42 -57 14 74 -139
4869a39p8K74J41k84M7k8J17j39j14J01J66J1k25R7K8l16K90k6J79J23J5k38J93
$$ -139 -217 57 198 -86 -39 -67 50 -89 -203 -102 64 75 -150 -53 -25 -341 -51 -77 102 225 240 2 195
4892A95N5n24L04j22J05j07J64k27J61O6j22O2K5J15K34m37J41oj65L30j75J28
$$ 195 250 -274 30 -92 13 -94 70 -157 4 70 -52 10 35 150 384 -53 88 82 -83 247 72 200
4914B00l03J18j66N96m37L6J50k33J84M3q6M1j24k90L55j23K03m4m0j05K27m98
$$ 200 -103 15 -151 445 8 44 194 -39 145 188 102 143 19 -271 84 -39 164 120 80 -25 202 -296
4936b96M25l50J11oK58r0Jl4q0K2k91L49J51k49J9O7o4k09N6J49j62K64Lj51J73
$$ -296 129 -221 -110 -116 142 52 53 19 -61 -39 -330 19 170 -79 -60 7 -57 -266 -210 -61 -223 41 44 -107 66
4961F6l74K69K99l42K52k45q7L00j17j64R9k3J38J24k95P1k9K26k76K10j67P1
$$ 66 -308 -39 260 -82 170 -75 -162 138 21 -143 -44 -67 71 195 -100 -29 -58 168 -108 102 -65 6
4983FJ63K0j43l44N16n14K35L11m16L06q4k67M00k12Q4R0r1l9Qr1J69k47j17K94
$$ 6 169 189 46 -298 218 -296 -61 250 -166 140 56 -211 189 -23 61 151 60 21 29 -62 107 -140 -257 37
5007C7K7Q3J98m47j26M32J5k38m3k8rR7j40J8L87j35m37K35j37K30q4J4J83j84
$$ 37 64 147 345 -102 -228 204 219 -19 -62 -90 -99 -2 -142 -124 263 128 -309 -74 -211 19 -65 -51 132 -52
5031e2j81L91k04o2R6R0J59l67K09k67K22j5j5j48N3J03K07j75j93J61R2l18N9
$$ -52 -233 158 -46 -108 -12 78 237 -130 79 -188 34 19 4 -144 -91 12 219 44 -149 12 104 -214 -155
5054a55M71m93J11j22K05j43lr5p4N42l01M4m9K35l14J94j73R6k06K41R3l3j14
$$ -155 316 -177 -66 -188 17 -126 -129 -224 -298 244 -57 -13 -62 173 -141 53 -120 -24 -230 11 104 71 -43
5077d3J28k03J21J16j33K38r7l4o0m1m1K0M4Mj07K47l67n3L6j2L18O7k87n0K78
$$ -43 85 -118 3 119 -14 224 127 93 33 -8 -49 -29 15 19 -88 159 -208 -261 -225 -237 81 148 -139 -189 89
5102H9r8j20K87l93K30J48j67K81j08j21rK4j00M4J4Q4J67p6j65O1j59j02K61
$$ 89 -9 -129 158 -235 -5 143 -24 257 149 28 19 43 -57 -13 1 85 252 176 11 72 -87 -189 72
5125G2M6j85m3K8K62m74K41K63k32j31J63l48J12K38j61K03r6K03j43l1q5n2J58
$$ 72 118 -67 -110 -82 180 -294 -53 210 -22 -153 10 -338 -226 12 -149 54 -42 161 18 -13 -98 -150 8
5148Hk49J6J65N3k32L09Nj44q6J84K36J1l05l22K46Q1J66l05L48j13J45k47J60
$$ 8 -241 -225 -60 -7 -239 70 75 -69 -155 29 265 276 -29 -351 -105 -24 142 -163 185 72 217 -30 130
5171A30r2j64J59R1k4p7l1l1o5J30J62k7k68r9K97n1K48l38j48K48j37j59L40
$$ 130 38 -126 33 124 100 23 -8 -39 -104 26 188 161 -107 -206 91 40 288 -50 -198 50 -87 -246 94
5194I4l9j05p5M38k09J8j67J75j89j11O2N4J27j16J47j16J00j33K15k36R0L18
$$ 94 55 -50 -125 313 104 122 -45 130 -59 -170 -108 -54 73 -43 104 -12 88 -45 170 -66 24 342
5216C42l73J6j78J32n4K78l51K69l6q5o0J93R5k98J11j85L65m33K24k11K14o0
$$ 342 -31 -15 -193 -61 -115 163 -188 81 45 -40 -100 93 188 -110 1 -184 181 -252 -28 -239 -25 -85
5238h5o1oJ14J53j65Q1K74k81k10J59M3k82M13k09Q1m2j73J34N7j33J50K2N5K16
$$ -85 -146 -152 -38 115 -50 31 305 24 -186 -27 16 -266 147 -62 19 -23 -196 -62 -5 -138 12 34 89 305
5262C05j99j01l9K50j70j05M2J80k06jK46l08Q7j83J21q6K93k72K65l3qJ15p7
$$ 305 106 5 -34 216 46 -59 -17 163 -43 -44 202 -106 -19 -202 -81 -167 126 -146 119 86 78 193 116
5285A16l69J19J93j42j57K27k12K94k02K38Rm5l58K69L7j98J81J56l68K98J9j36
$$ 116 -253 -134 59 -83 -240 -13 -225 69 -133 105 114 69 -289 -20 17 -181 0 156 -212 86 105 -31
5307c1j36O9K78k99K49j08j45K3R0k9j57K65mln3n7L0j53K13k06K58l9k64L12
$$ -31 -167 -98 180 -119 130 22 -123 -100 -10 -39 -196 69 65 62 9 -48 -18 -171 42 -164 94 55 -209 103
5331A03l9l12K53qo4J07J24r4j41k18K45q6J00J5j5J20k20J19n2mJ11N7k2O7J39
$$ 103 64 -248 5 -3 -67 40 164 70 -71 -289 -44 -130 -30 -15 -30 90 -130 -11 -63 -67 44 101 79 146 285
5356B85l66l3J06k65J70N7j22Q5J36j00K05j76K0L1j29m4J62J20L2n6J46m49J91
$$ 285 -81 -114 -8 -273 -103 -46 -168 -83 53 -47 158 -18 2 33 -96 -140 22 142 174 118 264 -185 6
5379Fn2j83J80J0J68n3p0m7J03j69M9K19k46J17N7m4j79K9J85J9k10K29k49J44
$$ 6 -46 -229 -49 -39 129 76 6 -41 62 -107 -58 161 -85 32 89 45 -134 -105 80 99 -111 118 -131 13
5403A3Q5j28J00j5J30l97J93O5k04n1J58J68j15M7j6k64J83M1n2L18m39K24jJ86
$$ 13 98 -30 70 55 185 -212 -19 46 -158 -209 -51 117 2 49 33 -231 -48 -7 -59 259 -180 44 43 229
5427B29l08P8Pk3J97k16L6l6o6J76n7K49k96Q1J6l1K4j15J33q6j50J13O2j03K56
$$ 229 -79 -1 6 -17 180 -36 0 -36 -102 74 17 266 -30 51 67 36 60 -55 78 -8 -158 -45 17 -86 170
5452A70l08K58j02M6j38K02K67l61j19K89l33J5L2j1K18j12J28m5m2J86k13q9
$$ 170 -138 120 18 64 -74 128 395 34 -85 204 -129 -114 -82 -93 125 13 141 96 54 240 27 -62
5474f2n6N0J36k59j7J4K19M2j94K02R2K76m94k7n3K5K82j96J72k94K12j58J77
$$ -62 -118 -68 68 -191 -208 -194 25 67 -127 75 167 443 -51 -78 -131 -106 176 -20 152 -142 70 -88 89
5497H9n1q4j38KJ79J66k45j93L50J54l59J08L1POj53K54j10q8p3K12o0j46R7k
$$ 89 38 -46 -184 -182 -3 163 -82 -275 75 229 -130 -22 9 16 22 -131 123 13 -75 -148 64 4 -142 -45 -47
5522d7J44l14L09R0o7K4k32M77l97O0j2p1P0J51q6j83K04Q4l66J79O5o8K70l47
$$ -47 97 -217 92 182 115 139 -93 384 -13 47 35 -36 34 185 99 -84 120 204 -162 17 82 14 284 -63
5546f3j44J15k99M54Ol01K78M8k00K46j7L0k73j36L82j24K31k25k5J38l0k68J41
$$ -63 -207 -92 -391 63 69 -232 46 94 -106 140 123 153 -120 -256 126 2 233 8 -17 121 91 -177 -36
5569c6m8R2J1M4k28J01q3O4J70j15j38J07J40j19J01k30J20j29J28k6J21J62k36
$$ -36 -84 8 19 63 -165 -64 -147 -83 87 -28 -166 -59 81 -38 63 -167 -47 -176 -48 -74 47 209 -27
5592b7K13j22N1k01J07p6p5J92j87n4J94j91N8N19m06j14l5M8K20m0k01J84J9
$$ -27 186 64 115 -86 21 -55 -130 62 -125 -179 15 -176 -118 401 -5 -119 -154 -106 114 74 -127 57 76
5615G6l87M74k67L24m21J10J45q0J97k77l4M9J99k70L49k33q5J96O5j01L31m66
$$ 76 -311 163 -104 220 -201 -91 54 -26 171 -106 -140 -91 108 -162 187 -46 -131 65 130 29 360 -106
5637a06K13R0r7PK0o8k25L05j55K4j78J00k09K31q7J21k59M96k02O0J26Kk06j45
$$ -106 107 197 100 107 127 59 -166 139 -16 8 -170 -70 -279 -48 -135 -14 -273 223 21 81 207 209 3 -142
5661a42J24j08J57j93K70j68J62j23j1J02k20NJ39l87M57m1L6K9j88J01k05J87
$$ -142 -18 -126 31 -162 108 -60 102 -21 -32 70 -150 -145 -6 -393 64 23 59 88 -100 1 -204 -17
5683a7k7m6j29J29J19p3J90q6j02ONj73K59J42q0l7j87J82n7j42L10m6k43k59
$$ -17 -44 -90 -219 -90 29 -44 146 60 -42 -36 -31 -204 55 197 117 80 -107 75 18 -124 186 140 -103 -362
5707c62L89j4j87L21N6n14J92J10J3m4j27O0Q4j13J47K61m54K07O2p5m9m3l33
$$ -362 27 13 -174 147 203 -311 -119 -9 4 -40 -167 -107 -23 -136 11 272 -182 25 87 12 -37 -80 -413
5730d13L11J88qk51K42j95P1K27k01J55o5JJ64k47k71L16L41n40M74r8k66N5J80
$$ -413 -102 86 78 -173 69 -126 -55 172 -29 126 61 62 226 -21 -292 24 365 -175 299 201 -65 -10 170
5753A70l7M4j48j75j32L07j7M7m1k14K14r4K46k38k55K26K66o5j67L7J01M8N4
$$ 170 133 177 29 -146 -278 29 12 59 18 -196 18 -76 170 -68 -323 -97 169 104 -63 -26 75 123 177
5776A77k39ml1K79k80R5Q2k85r2L43PR7j21l82N79m95L07J68k23O6k13J60l6r5
$$ 177 -62 -66 -97 182 -98 -3 79 -206 -298 45 52 149 28 -354 225 -270 37 205 -18 48 -165 -5 -41 -136
5800a36J56j29L24k07rM1Kq8j52K94l2l70L84M4L2kj62o9K97Mn4J83l15P9k78
$$ -136 20 -109 215 8 -1 40 42 -46 -198 96 64 -306 78 122 154 152 -10 -79 218 222 168 351 36 115 -163
5825a63K29l1j78K77r4k9o2LJ51l11L76j38p6K18j82J43k57J44J79l98K55l53
$$ -163 66 35 -143 134 40 11 -51 -48 103 -208 168 30 -46 172 -10 133 -124 20 199 -199 56 -297
5847b97L94N3j40o6p8k1R4J28l11L10J21j12k62K20j90J43l17K80K5j77K17j30
$$ -297 97 150 10 -56 -134 -155 -61 67 -244 66 187 75 -187 33 -157 -14 -331 -51 -26 -203 14 -116
5869a16K29l93L64k03R1J86Kl93K02P7k36L07j93O2k47K85k42J03K42j03l7J81
$$ -116 113 -280 84 -119 -28 158 160 -233 -31 46 -190 117 -76 -14 -261 24 -218 -115 127 24 -13 168
5891A68j03k77J56n8K36r5q7J31j66j25L04M5k69K51j40l2j28K27Q5k74M86k08
$$ 168 65 -212 -56 -114 122 27 -60 71 -95 -220 84 129 -140 111 -29 -61 -189 38 123 -151 335 127
5913A27lj29K18r7K2j55p6J57n1r6RL18j84R9K41l47p7q9M51l26oj02K01l09N04
$$ 127 124 -5 213 116 138 -17 -93 64 13 -83 -74 244 60 159 400 53 -24 -113 338 12 6 -96 105 -204 300
5938C00R5n25o6Q1K40J2n7n8L85k93n7l16J78K45m08M25k92o3K05P1Op7K2P2o1
$$ 300 395 -130 -196 -115 125 137 80 22 407 114 57 -259 -81 164 -244 181 -111 -174 31 102 108 31 53 125 64
5963F4N5Qj7N5m0l0k43L26l93K58K4r1k8j78M7L63k8j03n8m5R1k00J82R1k01M8
$$ 64 119 127 110 165 125 95 -148 178 -215 43 67 -24 -52 -230 -183 180 152 49 -9 -54 37 -163 19 110 -91 -43
5989d3K08l85L43j22j45j31L59Q3k91N7R5J48o6j08q0K82k95N4J06j69J02J68
$$ -43 165 -220 123 1 -144 -275 84 167 -124 -67 28 176 110 2 -78 204 -91 -37 69 -100 2 170
6011A70j95r0J28j65K71O8l54K1J09R7k18J61R5k02L83k46K17k06J82r2k4r8J13
$$ 170 -25 -115 13 -152 119 187 -167 -146 -37 60 -158 3 98 -104 279 33 250 44 226 134 110 12 125
6034A25o6K5j20j97N43n06K23Q0Ol14N8J69k15L9L26j6j09j18j5K08k93L85k08
$$ 125 59 84 -36 -233 310 -196 27 107 113 -201 -143 26 -189 -150 176 160 51 -67 -82 126 -167 218 10
6057A0j40J64Lj47K11r7j65L5J41J31r4J56j24k41J45j37P8K09m13K64r4n4J47
$$ 10 -130 34 37 -110 101 4 -161 -126 15 146 52 208 84 -157 -12 -149 -71 138 -275 -11 -105 -159 -12
6080a2J37M2J20l85M15j99l02L59M2r2o6q3k3K75k07K57k96j56N7J27j2K40p8
$$ -12 125 167 287 -98 317 118 -184 175 217 125 59 -24 -47 228 21 278 -18 -174 -117 10 -2 238 160
6103A60o2j30K57j54o1L5l73K88m3K96j14j56n4J42j70L7k0J57q1k37J35J90M8
$$ 160 98 -32 225 71 10 45 -328 -40 -83 213 99 -57 -111 31 -139 -102 -122 35 -46 -283 -148 42 90
6126I0M4R2l06R0N0q0LO9j05Q9q5l9K7p5j45K80J68j53l10J76P0n1J81J44k29
$$ 90 134 226 -80 10 60 -20 -17 52 -53 36 -49 -88 -61 -136 -281 -1 167 14 -296 -120 -50 -101 80 224 -5
6151eJ03n7p5K58o8J12l32J41k57K88J67m07K55j68J21j14j75N21l72J39k9j26
$$ -5 98 41 -34 224 156 268 -64 77 -180 108 275 -132 123 -45 76 -38 -213 308 -64 75 46 -80
6173h0o6J19k04K50kJ27j80J28j85m4N8K13l1j25k4k26L00N2pj15N7P6j70Mr0
$$ -80 -146 -27 -231 19 17 144 -36 92 -93 -137 -79 134 103 -22 -46 -272 28 80 73 -42 15 91 -79 -75 -165
6198a65M70m07K09n5j31j6j3K8j90L68k61K24k99J93Q0J87J7k68J47q3j87R6P7
$$ -165 305 -102 107 52 -79 -95 -108 -80 -270 98 -163 61 -238 -45 35 222 239 -29 118 35 -152 -56 21
6221B1J02J15j15k4j41k01L81k1k55p4J37J69m49K36o0J80J54q4J08j95J17l9
$$ 21 123 238 123 99 -42 -243 138 117 -138 -212 -75 94 -355 -119 -179 1 155 71 179 -16 101 62
6243F2J28n95N71j55L45m49J03j04M00m46K57k01K19P6k64L6N4k6p7R7Jm9j66
$$ 62 190 -405 166 11 356 -93 10 -94 306 -140 117 -84 135 211 -53 -17 37 11 -66 31 32 -17 -183
6266a83K25j84J04Kj36K64j44Q7j78R8J62m46L35p7p2LO8K64P8l25J78m9ML8j45
$$ -183 42 -142 -38 -36 -172 92 -52 35 -143 -45 117 -329 6 -71 -143 -140 -72 192 270 -55 123 74 78 116 -29
6291b9J40k57J51j74K12j87J41nj02J94j45KN6J93j88n7j2L27k27M0J7k58n5O1
$$ -29 111 -146 5 -169 43 -144 -3 -8 -110 84 -61 -59 -3 190 2 -55 -67 260 33 73 90 -168 -223 -162
6315a62K15l80J99M0J9K16p3l58K75J33k72L25N9k77J34j54j07J31J26l70J04
$$ -162 53 -327 -128 -88 -69 147 74 -284 -9 124 -148 177 236 -41 93 -61 -168 -37 89 -281 -177
6336a77j57K69K51r6p2r1J49k18K09N2k68J96o7j90J7K74n0O6j10j28r7J75M42
$$ -177 -334 -65 186 90 18 -73 76 -142 67 119 -149 47 -20 -210 -193 81 31 97 -13 -141 -238 -63 379
6359C79m08j3p0J63q0j53O1N40m63j2R6J51k90K34n2J4Oj34L6j64oQJ08q6K01
$$ 379 -29 -42 -112 51 -29 -182 -121 419 -44 -56 40 191 -99 135 83 97 103 -31 5 -159 -165 -157 -49 -135 66
6384F6Q4k9j88n4J10rQ2p4o7R6l8Q2R0l01J47l2K13m94M79j04m07L37M1k83K80
$$ 66 150 121 -67 -121 -11 -20 62 -12 -79 17 -21 61 151 -150 -3 -35 178 -316 163 59 -348 -11 30 -253 27
6409B7K8L9q3k47J78k12K72j1q7Q4P1q1L0r6p5KJ06qj61J38P8K09j87j06J83J11
$$ 27 55 94 11 -236 -58 -270 2 -9 -96 -12 59 -22 8 -88 -163 -161 -55 -63 -224 -86 -8 201 14 -92 91 202
6435B02k68Q3J44n00L10k75M18R2m95L58K33j41n1n1L6J57j37o8n6K90k21j31
$$ 202 -66 17 161 -339 -29 -304 114 206 -289 69 302 161 110 59 95 252 115 47 -9 281 60 -71
6457g1n4L23Q8l81K08k76K15k7j31Q6k8rN0K87n46M28r6J68k31J49l36J03J61
$$ -71 -125 198 286 -95 113 -163 52 25 -106 -20 -48 -57 -7 280 -266 162 66 234 3 152 -184 -81 80
6480H0j31NL08k94Rl14M02l37K61k03K78j42J40k3j11J72j75q0L50j13j43RK03
$$ 80 -51 -46 262 -32 -23 -337 65 -272 -11 -214 64 -78 62 39 -72 100 -75 -155 195 82 -61 -52 151
6503A51j35j91J61j43L83l29K18k52K17k10P6j79K98KN5j14J03J75m14L8L53k98
$$ 151 16 -175 -14 -157 226 -103 115 -137 80 -130 -54 -233 65 67 122 8 111 286 -128 -90 263 -35
6525c5J34o6LK03l28L22l14J47J35k86K06j55J50m1J58k04l32J74L67r1j65q1
$$ -35 99 33 36 239 -89 233 -81 66 201 -85 121 -34 116 75 233 29 -303 -129 238 147 -18 -99
6547i9K3Nq8K08nM2k18J09j4J17r6P2j06k9K36l05K47n9KK46k33or4P6j6J51l63
$$ -99 -76 -71 -159 49 44 86 -132 -23 -37 80 -16 56 -50 -79 157 -148 99 40 42 288 55 49 -45 31 15 166 -197
6574a97J2O1K47m68K04j17J47K91j86j53K35N8Q5k91j54M60k41J74l73M63k35
$$ -197 -185 -124 123 -345 -141 -258 -111 180 -6 -159 76 134 219 -72 -226 234 -7 167 -206 257 22
6595B2J61k38K7M9Lj46L16k22j0K25k54j6R8j02K73n5q0l65K24K38j73K19j23
$$ 22 183 -55 -28 21 24 -122 194 -28 -38 187 -67 -83 15 -87 186 131 51 -314 -90 148 -25 194 71
6618G1K54k77L9N6j03K2j47K86o8l20Q4M0Q6j58L9K56k96K09k92R2K50j45j02
$$ 71 325 48 87 143 40 62 -85 201 133 -187 -103 -63 23 -135 -96 160 -136 73 -219 -127 123 -22 -124
6641a24K53p1K7k25Pm5J83Qj37j62M47k34M3j24J40J24r3j04K95j69l3r6JK89
$$ -124 129 58 85 -140 -133 -178 5 13 -124 -286 161 -73 -30 -154 -14 110 17 -87 208 39 6 -90 -89 200
6665B00l98K07O3j20O5PJ7p5r5J49L6Rm8j04r1R8K7Rq8L87j75K0q6n0J44j81K47
$$ 200 -198 9 72 -48 17 24 41 -34 -129 20 56 65 17 -87 -178 -80 -53 -44 -132 255 80 100 14 -36 108 -73 174
6692A74k05o3J32P1n0o6j19J15p0O0R4J3j48l0O0k4P3l5l8J97k06j15J35J53j31
$$ 174 -31 -94 38 109 59 -7 -126 -11 -81 -21 73 86 -62 -92 -32 -56 17 -18 -56 141 -65 -180 -45 108 -23
6717b3O7j3m2J0J08j38k2r6J38k7J46K5O7j83K28n7l17J19J50j60Q7L5k98L02
$$ -23 44 31 -11 -1 107 -31 -53 -149 -11 -38 108 133 200 17 245 188 -129 -10 140 -20 67 102 -196 106
6741A06j89j18j1N09j57j78r6J7J29j70K95j02o1K51m29K16kl58M55l32N1L17
$$ 106 -83 -201 -212 297 140 -38 -134 -117 12 -158 137 35 -26 225 -204 12 10 -348 107 -225 -174 143
6763A43k66L04k10J44j68j28J83Q5J68l97K64k29J32j41J94l72K01K45j80O4N7
$$ 143 -123 181 -29 115 -53 -181 2 87 255 -142 122 -107 25 -116 78 -294 -93 152 -28 36 93
6784I3j52l44K14QK10n9Mk61N02k8j65Nj49L75k85j47K06J42j90Qk02L57M4l24
$$ 93 -59 -403 -189 -181 29 -30 -26 -287 215 187 22 27 -122 253 -32 -179 27 169 -21 -13 -215 142 186 -138
6808a38J23K34k16O1qL84n61M7K0L76l73j23K97k5p7M9o1K46l49N2J18k69M15
$$ -138 -15 219 3 64 56 440 -121 -74 -54 322 -51 -174 123 98 21 70 9 255 -94 -42 76 -193 222
6831B22k90m3J35j45L45k86PN4p4K6J24k07J12k9L4J03L1K45m98oJ68p9K91k5
$$ 222 -68 -111 24 -121 224 -62 -55 -1 -75 -49 75 -132 -20 -49 -15 88 119 364 -134 -140 28 -51 240 215
6855B15j52J28n4m7j1J18k06j54K17M8j22k5n8K47j86l7K74j27j1K45k76J47n7
$$ 215 63 191 137 90 79 197 -9 -163 54 102 -20 -45 -103 144 -42 -79 195 68 57 302 26 173 116
6878A16PJ6k08J0L25k21l9J26j45K0j05K04k41K48j03J27Qj22j72J26O2mn6J1
$$ 116 123 139 -69 -59 266 45 6 132 -13 7 -98 106 -135 113 10 137 145 23 -149 -23 39 35 -21 -10
6902a0J30NM9j14k40J51K70j59k97K67l68M08k86J86mL4P8mK55k15M8N9j16K31
$$ -10 120 125 174 60 -180 -29 241 82 -215 52 -316 92 -194 -8 -12 22 100 96 351 136 184 243 127 358
6926C58n58L91k32J80j04o7J06j85K18j46k84L84j59l2K52J9m43N86n84Q3M32
$$ 358 -200 191 -41 139 35 -32 74 -111 107 -39 -323 61 -98 -130 122 141 -302 284 -300 -217 215
6947B15m01K22k12J76j48R9J73P7k46m4n8p3K23j45k2k6L69k62j12L41k94K14
$$ 215 -186 36 -176 0 -148 -49 124 201 -45 -89 -147 -220 3 -142 -164 -190 179 -83 -195 146 -148 66
6969F6j88J86P4r6M8k53J21R1j48J69k82K63k47q5L09Q0j10J1R4j13opRP9l62
$$ 66 -122 64 138 42 90 -163 -42 49 -99 70 -212 51 -196 -281 28 108 -2 9 103 -10 -16 -23 -14 65 -297
6994b97L60J2j39q4J93J49j90P9j26n1K01l01K13N4J79m40J32J02l2J60k18P7
$$ -297 63 75 -64 -148 45 194 4 83 -43 -94 107 -194 19 73 252 -188 -56 46 14 174 -44 33
7016C3J15m09J6J80J64L9j04n5M0n8j68K63j76L09p5k0l35O7K14k31j0k79K24
$$ 33 148 -261 -245 -65 99 138 34 -21 19 -39 -207 56 -120 189 114 94 -241 -174 40 -191 -201 -480 -256
7039b56K62n2M3Q9K2k81K96j93o1J2L38n05M51j17K9J18l84L5N0J98m27J81QK25
$$ -256 6 -46 -3 86 108 -173 123 -70 -131 -119 219 -286 165 48 77 195 -189 -154 -104 94 -333 -152 -144 81
7063H1N2j52O8j78J25J76k78P0oR0p7o1k26M19j20Np3M2J4J65l9J62l21M15k24
$$ 81 133 -19 49 -129 -4 172 -106 -36 -42 48 -29 -90 -316 103 -17 -12 -85 -43 -29 136 97 259 -62 353 129
7088A29k00K55m38M46k21J28o3j8n0J49r8M00n15J72J77l12q4K08L1l62LL32O2
$$ 129 -71 184 -254 192 -29 99 36 18 -32 117 19 419 -96 76 253 -59 -143 65 96 -266 -263 69 131
7111A31m08M58l30K33J60k17p0Q5P5m82K76k8L50m17M05j66q5J41k99J14o6k6
$$ 131 -277 181 -149 84 244 27 -43 42 117 -365 -89 -117 233 -184 221 55 -30 111 -188 -74 -140 -166
7133a66J14J95K2k28K9l43K90J15%M8j81J17o8J52k3k05J48n0k09J04L8J33j46
$$ -166 -52 143 165 -63 -34 -377 -87 28 28 76 -105 12 -56 96 73 -132 16 -34 -243 -139 -101 32 -114
7156a14K75k98R5M3J17o7Rk03J71j29J44k93J77m7K58j40J27k33K9R2m2M9j54
$$ -114 161 -137 -42 1 118 51 60 -143 28 -101 43 -250 -73 -120 138 -2 125 -108 -79 13 -29 20 -134
7179a34p4J31M14k25k17J63j04J39k49J95p8M4K15j90Q2Lj35K23n2j37L01k96
$$ -134 -208 -77 337 112 -105 58 -46 93 -156 39 -39 5 220 30 112 115 -20 203 151 14 315 19
7201A9j49j18N45l40j98l8K41R3l08K5L78l16N2q2K67p8j24M13k53j60L43k19
$$ 19 -130 -248 297 -43 -241 -279 -38 55 -253 -228 150 -166 -114 -196 71 -7 -131 282 29 -131 212 -7
7223gj1M1j53k1k7Q3p3J94l00L54l2rO5k7j83r3K31J34m82J03L18j09K32k71l4
$$ -7 -18 23 -130 -151 -178 -95 -168 26 -274 80 48 39 104 77 -106 -199 32 166 -316 -213 105 -4 228 -43 -77
7248g7P0o6M9k25M12q5k93P0M38k97n3P7j52K79j46%J35j17j23j43K09k48M64
$$ -77 -7 -73 -24 -249 163 78 -215 -145 293 -4 -57 20 -132 147 1 1 136 19 -104 -247 -38 -286 178
7271A78n3j79K21j19J01j25J1J06j47q9J76L3j83M8j31L30L3k03q7K5j35L33J10
$$ 178 125 -54 167 48 149 24 35 141 -6 -95 81 114 -69 -21 -152 178 211 8 -79 -54 -189 144 254
7294B54k50n9Q2M2j55K29J56j94M7j39J09p2J42p1j42J31M9n6k71JJ15KO6J5j05
$$ 254 4 -55 27 69 -86 143 299 105 152 13 122 50 192 121 -21 110 159 103 -168 -167 -52 -50 16 31 -74
7319g4k8K85j01k6n2j05K06k70J59J87l0m01M45p8k77K92q8j54L7J85K28l22P
$$ -74 -102 183 82 56 4 -101 105 -165 -6 181 151 -250 195 117 -160 132 44 -110 -73 112 340 18 25
7342B5r7J96j54R6j47K95l01J90j05m6M2l6L61q5k57l63K81L37j71k51L31l30
$$ 25 -72 124 -30 66 -81 214 -87 103 -2 -48 -6 -42 319 234 -23 -386 -105 232 61 -190 141 -189
7364a89J79K48j06Q6q1r1K55l19J95m28L37l3j22K06k59l4J18K06j70j05L26k12
$$ -189 -10 238 132 218 137 46 301 -18 177 -251 86 53 -69 137 -122 -156 -38 168 -2 -107 219 7
7386Gk09k2J62J37k16K71k02k3L7K6K82j18k60J51n7J65j59J97r4J83l2k73L62
$$ 7 -202 -224 -62 75 -141 130 -72 -95 -58 -32 250 132 -128 23 -34 131 -28 169 75 258 226 -47 315
7409C15j87k32K18N8l39M1mJ63j32n2%q6L71j64P9PL1j44m1KK16r0K0k14K65k01
$$ 315 128 -104 114 172 -167 -126 -130 33 -99 -151 -151 -237 134 -30 49 56 87 -57 -98 -96 120 30 50 -164 101 -100
7435a00J19l28J85J68L4o8K28j9l40j28q5K29K56j2J88j40j62o0J14l2J30m13
$$ -100 19 -309 -124 44 78 10 238 219 -121 -249 -334 -105 151 139 327 187 25 -35 79 47 177 -236
7457b36K88K24k89L55n53L01k21K32M6n7k06K06j73o1RK84k14O1l02K63n9M9P6
$$ -236 52 276 -13 342 -211 90 -131 101 147 90 -116 90 -83 -144 -135 149 -65 -4 -306 -43 -102 -53 23
7480B3K49k74k38J00R4M1k69N37K4k81K58k96k26J65j36J55K42k08j92L95k0l70
$$ 23 272 -2 -240 -140 -46 -5 -274 263 287 6 264 -32 -258 -93 -229 -74 168 -40 -232 163 143 -227
7502b27K82Q8r4k86K99o8o2J78K40m20M9K51k17M8O1p1l12J32K36l36N76j61k67
$$ -227 55 143 49 -237 62 -6 -68 110 350 -70 -21 230 13 61 122 51 -261 -129 107 -229 347 186 -81
7525h1J41l5j1o0LR3p9J65l22K06J86m66Q7J00M3qL59j17n1j3j96J70j56J61J0
$$ -81 60 25 14 -46 -43 50 -29 136 -186 20 206 -260 -173 -73 -30 -38 321 204 153 140 -56 114 -42 119 129
7550A29j66R0j11J0k9J68j00Ko8J34p4m2l3K42j83j4J25R4q9J21k61L4n2N6r9
$$ 129 -37 53 -58 -48 -77 91 -9 -7 -75 59 -15 -57 -90 152 -31 -45 80 174 85 206 -55 -21 -73 -17 -116
7575a16J03j77J26n8K42j95j02J04j7J05j68K48k74J64J5m2P5L46l67j77j01J60
$$ -116 -13 -190 -64 -122 120 -75 -177 -73 -90 15 -153 95 -179 -15 0 -42 33 379 12 -165 -266 -106
7597a06J17j96K89r3N5k5m7j08P9J4L6J47l5j63k9K30j13j03J35n9j12K62m7k56
$$ -106 11 -185 104 11 66 41 -6 -114 -35 -21 15 162 127 -36 -65 165 52 -51 84 25 -87 175 128 -128
7621a28j53K74j80J62J80o0l37J58J46j76qJ65q8n8M77m28K6O5m04L96j03J28
$$ -128 -281 -7 -187 -25 155 95 -242 -84 62 -114 -122 43 -45 -103 374 -54 -28 37 -367 29 -74 54
7643E4j33K37j00j38L19k30j41J60k17K12k13M47o3k7k87q8J42J4K06k56Q2P8
$$ 54 -79 158 58 -80 239 9 -132 28 -189 23 -190 257 194 167 -120 -208 -66 -52 154 -102 -20 58
7665E8j08J02J30l10K23j19k70K37O8l1j31L15Qk57pPl8R4j48j5N3q2L9J49l7
$$ 58 -50 52 182 -128 95 -24 -294 -57 11 -20 -151 164 172 -85 -92 -85 -123 -29 -177 -192 -139 -221 -182 -33 -70
7690g0L3J36j85K43k94j5q1J98j75K2J48K35m2k97J59O8L6O5m53K15M22q9l16
$$ -70 -37 99 -86 157 -137 -152 -233 -35 -210 -188 -40 195 153 -144 15 83 119 184 -269 -54 368 279 -37
7713c7J44r3N5j44k1L64m03J83J08j94K1k40M44K31l81M1o2j4K3j20L51l39L2
$$ -37 107 14 69 -75 -96 268 -135 48 156 -38 -17 -257 187 418 37 78 16 2 25 -95 256 -83 -51
7736e1K13l43N6K19Pj24J67l79K68j95J08J01j58%J06k9J92k12L88m29%j29L32
$$ -51 162 -181 -125 94 101 -23 144 -235 33 -162 -54 47 -111 -111 -5 -34 158 -54 334 -95 -95 -224 108
7759A08k90J90p2j49K57p8M1j10O6j45L32j89K92k81j07M3M7N4J73l97J53rj6
$$ 108 -182 8 -64 -213 44 -34 7 -103 -37 -182 150 -39 253 -28 -135 -92 -45 9 182 -215 -62 -71 -87
7782h7N9n8m6J80o1K9o3J58j91K71j15j44K03k56L07K5m9j87j15J63MO0Oj90O8
$$ -87 -28 -86 -132 48 -13 16 -47 111 -80 191 76 -68 135 -121 186 211 162 -25 -140 23 27 87 93 -97 -29
7807b9k43K83l61K80Q2R8R9l26K26k70L04m15J53L13k32K70k06J02K80l42J7j30
$$ -29 -272 11 -350 -70 12 110 209 -117 109 -161 143 -272 -119 194 -38 232 26 128 408 66 83 -47
7829d7J45J7n5j50N5K4J85l14J26J92k08K24k71N7J00J82m43J07K06k43J77k6
$$ -47 98 115 60 -90 -35 -11 174 -140 -14 178 -30 194 -77 -20 80 262 -181 -74 132 -111 66 40
7851D0J43j60Q6j32kQ8j14J14K9m3jJ60j30j87R8J93l43K61j83Q6j70L74k04J27
$$ 40 183 23 109 -23 -25 63 -51 63 92 49 48 208 78 -109 -11 182 -161 100 -83 3 -167 207 3 130
7875A30j87o7j37L04L4m9Q5j13J78m22J65O0K20Lk98L48Lj70Q1O4k41O0k80L53
$$ 130 -57 -124 -261 43 77 28 113 0 178 -244 -79 -19 201 204 -94 254 257 87 168 232 -9 51 -229 124
7899A24q5j03J33Kp4Q6N7k67P8K07r6L6p8J08l16J34O8r8l30L26J10k7o2J61j14
$$ 124 39 -64 69 71 -3 83 140 -127 -49 158 62 98 20 128 -188 -54 14 -84 -414 -88 22 -5 -67 94 -20
7924b0j22L20k57r6j56K81n3J81j40N1j22P2K14m32M4K31j90L73k69p8J93n8K51
$$ -20 -142 178 -79 -175 -331 -50 -103 78 -62 -11 -133 -61 153 -279 -235 -4 -194 179 -90 -168 25 -33 218
7947B18o3j73j63J51J65k28K28k55J97l3k93K4K89l91K81K0R3l5l7J4k5l8oJ22
$$ 218 155 -18 -181 -30 135 -93 135 -120 77 44 -249 -225 64 -327 -46 -26 67 32 -5 9 -16 -54 -60 62
7971F2n6J50L5j77J02O5k68K43m42M70k10r5K4j82K99q3J58k23K73J78l14j1n5
$$ 62 6 156 191 14 116 181 -87 156 -286 184 -26 -121 -97 -279 20 -63 95 -128 145 323 9 -2 -57
7994e7J38k38K69j35R6JJ60k20nl7p9j5j40L48l29L78p5j60O8J21N1Qk81rK68
$$ -57 81 -157 112 -23 73 74 234 14 9 -28 -107 -122 -262 86 -243 135 60 -100 -32 89 140 148 -133 -142 126
8019A26j77J57J8k72K85j57K36j56j81q3K65j73q6J87j8L1o9k8K8K23k6j23O4
$$ 126 -51 106 124 -148 137 -20 216 60 -121 -204 61 -112 -198 -11 -29 2 -67 -95 -67 156 130 7 71
8042G1R8n9K6m51K71J90k07P1r8j18K10l29R4L43P2n92L22K30j72J0J3j2J8J2
$$ 71 169 110 136 -315 -44 146 -61 10 -88 -206 4 -325 -231 112 184 -408 -86 144 -28 -18 -5 -17 1 13
8066A3J00K23m15Mk72L55j6J95j43k21PO1J48q9j70J77p5L0M5Q2k4K1q0j16K72
$$ 13 113 336 -79 -75 -347 8 -8 187 44 -177 -170 -109 39 -50 -220 -43 -118 -88 -43 39 15 36 -44 -160 112
8091A12r5J60l56L60j09k88L86r5j97jL29l78L36j04k6q8O5J51j10R8k84L46j76
$$ 112 17 177 -179 181 72 -216 170 75 -122 -123 206 -172 164 60 34 -54 11 162 52 150 -134 212 36
8114C6J5J10k11J92j01k59M90l4k35j21JJ55k4J34k63L02l01J29j89Q1J9J38R3
$$ 36 51 161 -50 142 41 -218 272 238 3 -118 -117 38 14 148 -115 187 -114 15 -174 -93 -74 64 157
8137A57J2k78J62J20l61L84j35P2j87K49k11K93j88r4J1L75l27K2l5M23m06J04
$$ 157 169 -109 53 173 -188 196 61 133 -54 195 -16 277 89 -5 6 381 54 76 41 464 58 162
8159A62k26J84j6K07l21o8J42l2R4j45K19j42j78R9M8k26N40p30K28L05k76K36
$$ 162 -64 120 104 311 -10 -78 64 32 126 -19 200 58 -120 -21 27 -199 341 -389 -161 144 -132 104
8181A04k1J34k33P7J2k25J32L16l8l65
$$ 104 83 217 -16 61 73 -152 -20 296 258 -107
8191a07
$$ Imaginary data points
##PAGE= N=2
##DATA TABLE= (X++(I..I)), XYDATA
0@%%%%%%%%%%%%%%Kj0J6j6J6j6K4l2L2m0M8n6O4p2Q8j02J15j30J47j66J87k10
$$ 0 0 0 0 0 0 0 0 0 0 0 0 0 0 0 2 -8 8 -8 8 -8 16 -16 16 -24 24 -32 32 -40 48 -54 61 -69 78 -88 99 -111
36a11K36k64K94l28L64m04M48m95N49o06O68p37Q12q96R87j087J198j322J462
$$ -111 125 -139 155 -173 191 -213 235 -260 289 -317 351 -386 426 -470 517 -570 628 -694 768
55G68j618J795k001K243k529K873l296L831m534N502o920R200j3447K3897r3757
$$ 768 -850 945 -1056 1187 -1342 1531 -1765 2066 -2468 3034 -3886 5314 -8133 15764 -77993
70g7993j34478K43027O8849j45740l1475O3154k7440K9045O5560o6013o9230R7173
$$ -77993 -212471 30556 99405 -46335 -77810 -14656 -42096 -13051 52509 -13504 -82734 14439
82A4439M7508q4920K963Q6842m3920p2590O9939O2445p8387l8188O0175o877m5458
$$ 14439 61947 -22973 -20010 66832 22912 -49678 20261 82706 4319 -33869 26306 19429 -26029
95b6029M4726J7169q3585j6690Q2650K670o5512K995J8891k3272L0004M0524o2593
$$ -26029 18697 35866 -47719 -64409 18241 20911 -44601 -41606 -22715 -45987 -15983 24541 -38052
108c8052m6146P7507M7252n7211j9147L7117m250j195L5553j4194l9656K5725
$$ -38052 -84198 -6691 40561 -16650 -35797 1320 -2930 -4125 31428 17234 -22422 3303
120C303L2858j9206j4997J1801j298q537M182P36k224M697q979j6164J2000K4269
$$ 3303 36161 16955 1958 13759 12461 3924 8106 8842 6618 11315 2336 -13828 -1828 22441
134B2441r189l2063j932L5619J4637k6807j9811J4967K2380K26j9850o570J7552
$$ 22441 13252 -18811 -20743 14876 29513 2706 -17105 -2138 20242 20468 618 -5952 11600
147A1600Q882j9477q081K3402M513l1679n915K7148K938j9820o283M097M626O736
$$ 11600 20482 1005 -7076 16326 20839 -10840 -16755 10393 13331 -6489 -12772 -8675 -4049 2687
161B687o771j5198R673J6223j5694q929K6136L578k7023N40K6208N095j2605o517
$$ 2687 -4084 -19282 -9609 6614 -9080 -18009 8127 11705 -15318 -14778 11430 16525 3920 -2597
175b597q39Q134J6470j883k1910o319J5029J1936l362j2006r223M30J1964J1346
$$ -2597 -3436 4698 21168 19285 -2625 -8944 6085 18021 14659 2653 -6570 -6140 5824 17170
189A7170j0899k2895J638K1563N360j2864p280M01N94Q665J0367r771j3264N397
$$ 17170 6271 -16624 -14986 6577 11937 -927 -8207 -7806 -7212 1453 11820 2049 -11215 -5818
203e818J0425N369J131o735j0766L748J6165N130r334q359n521O344J9908J782
$$ -5818 4607 9976 11107 4372 -6394 -2646 13519 18649 9315 956 -4565 1779 21687 23469
217B3469k6056j6132J6724K5964o60k8173j9172J6568K8560k613k7556r813J5117
$$ 23469 -2587 -18719 -1995 23969 23309 -4864 -24036 -7468 21092 18479 -9077 -18890 -3773
230c773J3962j110r795m657J772K108M686P008j906j1944o056J2628J5773n282
$$ -3773 10189 9079 -716 -5373 -3601 -1493 3193 10201 8295 -3649 -9705 2923 18696 13414
244A3414j8226q433J2624J6517k479j6215j0213L623J3732Q268j1226j7807j065
$$ 13414 -4812 -13245 -621 15896 13417 -2798 -13011 -9388 4344 12612 1386 -16421 -17486
257a7486J6731J0001p482j3538o085R513J6718j443j6546m168J0755P858k38k595
$$ -17486 -755 9246 1764 -11774 -17859 -8346 8372 6929 -9617 -13785 -3030 4828 4590 1995
271A995n819m263P862R265l747o723l027r4M965N450l805q853l218O424O299j046
$$ 1995 -3824 -8087 -225 9040 5293 -1430 -4457 -4551 414 5864 2059 -6794 -10012 -3588 2711 1665
287A665n516o689J844R916M107n943p724K730J0248K933n071k208M52K075M196
$$ 1665 -3851 -10540 -8696 1220 5327 -616 -8340 -5610 4638 7571 2500 292 744 2819 7015
302G015J563k369k947J216N59j06L214k401p486J821N788j973l697L19j383k398
$$ 7015 8578 6209 3262 4478 5037 4931 8145 5744 -1742 79 5867 3894 197 516 -867 -3265
318c265K568L202k554k559M32M92L411M294m644n472K400N994K675k642l490k647
$$ -3265 -697 2505 -49 -2608 -2176 -1684 1727 6021 1377 -4095 -1695 4299 6974 4332 842 -1805
334a805K151N350J024n382o351M79O966K646n817o193j494L057O057O26p826n182
$$ -1805 346 5696 6720 1338 -5013 -4534 2432 5078 -739 -6932 -8426 -5369 688 1314 -6512 -11694
350a1694L713P858K191k598n805l661O613J1973q58j0137m995N500J0505K838
$$ -11694 -7981 -123 2068 -530 -6335 -9996 -3383 8590 7732 -2405 -7400 -1900 8605 11443
364A1443q081r095J984R840N404n618r820m449O820R049k016r202n660J407P958
$$ 11443 3362 -5733 -3749 6091 11495 5877 -3943 -8392 -1572 7477 5461 -3741 -9401 -7994 -36
379c6O308n040j1460k048J0149R113q76q571p558M662J4375L413j0440r552L688
$$ -36 6272 1232 -10228 -12276 -2127 6986 6110 -2461 -10019 -5357 9018 12431 1991 -7561 -3873
394c873J1613N521o124r812k246O914P926k76q443q149L026J0042L326n275q430
$$ -3873 7740 13261 7137 -2675 -4921 1993 9919 9643 1200 -6949 -3923 6119 9445 4170 -4260
409d260l502P991J0862j809j0953m571P258Q409P14m751q414l77J0131N938n592
$$ -4260 -7762 229 11091 9282 -1671 -6242 1016 9425 10139 5388 -3026 -3403 6728 12666 7074
424G074q969l381M647P449r8r059q127L536Q244J255o410p504M42O869L058k370
$$ 7074 -1895 -5276 -629 6820 6722 -2337 -10464 -6928 1316 2571 -3839 -11343 -10901 -4032 -974 -3344
440c344k303j795J240M915L868j554m383j273M748O475K001p321n746N338P048
$$ -3344 -5647 -7442 -6202 -1287 2581 1027 -3356 -4629 119 6594 8595 1274 -4472 866 7914
455G914k39n394n231R45N579J904n542m168J464K009p13Q91q13j930J001K33R80
$$ 7914 7675 2281 -2950 -2005 3574 5478 -64 -4232 -2768 -759 -1472 -581 -1394 -3324 -2323 -2090 -1110
472a110K287K47l485n59L291L661j41l678l154J749N812j04n403j898J052J750
$$ -1110 1177 1424 -2061 -2620 671 4332 4191 513 -2641 -892 4920 4816 -587 -2485 -1433 317
488C17J615j023l764j265J488J376J568K40l461k127M069M055n49k703k420Q92
$$ 317 1932 909 -2855 -4120 -2632 -1256 312 552 -2909 -5036 -967 3088 2539 -164 -2584 -1692
504a692N544K905k584m957k430L036O534J133q518p567M905Q255l79o882q294
$$ -1692 3852 6757 4173 -784 -3214 -178 6356 7489 -1029 -8596 -3691 4564 4185 -2697 -10991
519a0991P95J0172L177q598n904K996M139K038L96k543m833R91O591M213j448
$$ -10991 -10196 -24 3153 -5445 -11349 -8353 -4214 -2176 -1780 -4323 -9156 -8165 -1574 2639 1191
534A191o459l982N882P452Q5p051o101K767Q270L488o721p994J02O248N823K42
$$ 1191 -5268 -9250 -3368 4084 4169 -2882 -8983 -6216 2054 5542 -1179 -9173 -9071 -2823 3000 3242
550C242j0003p006Q006J0713j993q100n012L219Q369M925n727p858Q67O113N261
$$ 3242 -6761 -13767 -5761 4952 2959 -5141 -10153 -6934 1435 6360 633 -7225 -6358 -245 5016
565E016P25o382o623M341Q834J922o348o622P01O976M363l042o385j197K708M418
$$ 5016 5741 -641 -7264 -2923 5911 7833 1485 -5137 -4436 2540 6903 3861 -2524 -3721 -1013 3405
581C405L135m376o885J72P112N256k611q321l222O832O997k855p400j238L021
$$ 3405 6540 2164 -4721 -4549 2563 7819 5208 -3113 -6335 497 7494 4639 -2761 -3999 -978
596i78L735J671l524m749M3L309L133N71m560m303L210O288j74n589j418J978
$$ -978 2757 4428 904 -3845 -3802 -493 2640 3211 -1349 -5652 -2442 3846 3672 -1917 -3335 -1357
612a357J801J385k14j406o76q70J058M374m34n714j030M491L123r07l654k366
$$ -1357 444 1829 1615 209 -467 -1337 -279 4095 3661 -2053 -3083 1408 4531 3624 -30 -2396
628b396J850M760k47l888n26M90M13K422N20l520k479K183L532o32l014q30J289
$$ -2396 -546 4214 3967 79 -447 43 456 2878 3398 -122 -2601 -418 3114 2482 -532 -1362 -73
645g3M42j511J05K275p98l508P72L691J998k541m280O26O132K692l647l673J714
$$ -73 369 -1142 -1037 1238 440 -3068 -2296 1395 3393 852 -3428 -2802 3330 6022 2375 -1298 416
662D16L118K094M85k870l742K118N136J520l053n265q73N417L900m037n919N09
$$ 416 3534 5628 6113 3243 -499 1619 6755 8275 5222 -43 -916 4501 8401 4364 -1555 -1046
678a046L298J696k97k445l497j68L076L711m28n649l137L318O415N99o613m307
$$ -1046 2252 3948 3651 1206 -2291 -2459 617 4328 3900 -1749 -4886 -1568 4847 5446 -1167 -5474
694e474K640N935J556l952m251j081L037M935Q45p041n094M555O705P77o385n316
$$ -5474 -2834 3101 4657 705 -3546 -4627 -1590 3345 4190 -2851 -7945 -3390 3315 4092 -2293 -7609
710g609K167O703L409m931n162J622M053J536N28j812l490r04N041M746l050o239
$$ -7609 -5442 1261 4670 -261 -5423 -3801 252 1788 2316 504 -2986 -3890 1151 5897 2847 -3392
726c392j012M483M725r85n794l356K501N117J392l626n060p54L507N879l32p030
$$ -3392 -4404 79 4804 3819 -1975 -5331 -2830 2287 3679 53 -5007 -5761 -2254 3625 3293 -3737
742c737l666N479P047j173n994l132L039O004J226m550k980K091K488J568n73
$$ -3737 -7403 -1924 5123 3950 -2044 -5176 -2137 3867 5093 543 -2437 -346 2142 3710 3137
757C137k718k060J010L632Q98k414k317o26J324K364K35k349k143r3L775J758
$$ 3137 419 -1641 -631 3001 3899 1485 -832 -1458 -134 2230 2465 116 -2027 -2120 1655 3413
773C413j715l831j214M293L982k322m715n49M073J843k442j874m4N49Q25O99n27
$$ 3413 1698 -2133 -3347 946 4928 2606 -2109 -2658 1415 3258 816 -1058 -1102 -553 272 971 444
790D44r97q18r15J108J983m06l065k8K166J69k96m23j303k88J671J972l23k087
$$ 444 -553 -1371 -2286 -1178 805 399 -2666 -2694 -528 -359 -655 -1078 -2381 -2669 -998 974 651 -1436
808a436j623Q67L128J000l008k510K012K741L10j857j334K80K52N37K304r85k637
$$ -1436 -3059 -2192 936 1936 -1072 -3582 -1570 1171 1481 -376 -1710 -1430 -1178 -641 1663 678 -1959
825a959l07K296K052l10j736k847Q69M725J424m122k710J893K711J452q62l283
$$ -1959 -2266 30 2082 1772 36 -2811 -1942 2783 4207 85 -2625 -732 1979 3431 2569 -714
841g14k051L206M059j064l896j622J023L107J561j741k981j289K365M072n92l922
$$ -714 -2765 441 4500 3436 -460 -2082 -1059 2048 3609 1868 -1113 -2402 -37 4035 3443 -479
857d79k683K001M378J726l000m541n27N807K815m062l625k02K117L148Q99l666
$$ -479 -3162 -1161 3217 4943 1943 -2598 -3125 2682 5497 1435 -2190 -2392 -275 2873 3772 106
873A06l850R76L776J929k467l361j535K920M199q88m209k610K061M481Q27k713
$$ 106 -3744 -2768 1008 2937 470 -2891 -4426 -1506 2693 1805 -2404 -5014 -2953 1528 2355 -358
889c58k645m43L260L169m34m668k828L138M991m21l413l244M36M290K288k908
$$ -358 -3003 -3446 -186 2983 2549 -2119 -4947 -1809 3182 2761 -652 -3896 -3460 830 3118 210
905B10l953K26L519J845o57k643k450J747L989K72j669j839p16K193L068l99l031
$$ 210 -3743 -3517 2 1847 1190 -1453 -3903 -2156 1833 2105 436 -1403 -2119 74 3142 2743 -288
922b88k013J743L272Q54k204l262Q6L063J516j603k818j052K756J968j057j438
$$ -288 -2301 -558 2714 3568 1364 -1898 -1812 1251 2767 1164 -1654 -2706 50 2018 961 -477
938d77j189M53J483J555l25j984q0J218J286J013j148k225L55K617P87q74j368
$$ -477 -1666 -1213 270 1825 1500 -484 -564 654 1940 2953 1805 -420 -65 2552 3339 2465 1097
955A097r77N08J383N48j546j824L20P35R77l19k660p57J042J282J57o38j541n51
$$ 1097 120 628 2011 2559 1013 -811 -491 244 1221 902 -1758 -2515 -1473 -191 -34 -672 -2213 -2764
973b764J151J845k74j335j028J12J871J800j133j661q14J327K108o5j987j619
$$ -2764 -1613 232 -42 -1377 -2405 -2293 -422 1378 245 -1416 -2230 -903 1205 1140 -847 -2466
989b466N56K374P50j128j890j653K469K570n44k066j046J89K562J954j339l129
$$ -2466 -1910 464 1214 86 -1804 -3457 -988 1582 1038 -1028 -2074 -1885 677 2631 1292 -1837
1005a837m28L146K201l74j874k452J000L662R12k768l030L91L445J247j372l672
$$ -1837 -2265 881 3082 2708 834 -1618 -618 3044 3956 1188 -1842 -1451 1994 3241 1869 -1803
1021a803r65K192K657K44k510l039N63L481J614j559k874j108K760L587k06l268
$$ -1803 -2768 -576 2081 2325 -185 -3224 -2661 820 2434 875 -1999 -3107 -347 3240 3034 -234
1037b34k095J916L084J241j558l384m54L603K091j137l362j754J885L205M69l243
$$ -234 -2329 -413 2671 3912 2354 -1030 -1484 2119 4210 3073 -289 -2043 -158 3047 3516 273
1053B73k669Q3K848J750q87l882j397K597K666r3k636k400O13L273J833k257l011
$$ 273 -2396 -2313 535 2285 1398 -2484 -3881 -1284 1382 1289 -1347 -3747 -3134 139 1972 -285 -3296
1070c296J67K406K590m86l467j077J639K078R54j789k303lK370J628j246k026
$$ -3296 -3129 -723 1867 1381 -2086 -3163 -1524 554 1508 -281 -2584 -2587 -217 1411 165 -1861
1086a861p09J086K069R45k291j935J263J694J069p93j480k74J045J447M64j031
$$ -1861 -2570 -1484 585 1530 -761 -2696 -1433 261 1330 537 -943 -1217 -172 1275 1739 708
1102G08j635j9J955J407p44j678l57L96J570N91k315j232O09J001J146n76j301
$$ 708 -927 -946 1009 2416 1672 -6 -363 33 1603 2194 -121 -1353 -744 257 1403 827 -474
1119d74j039L26J773N61j159j378K42J468J412r72q86p70O96J286Q38j139j107
$$ -474 -1513 -1187 586 1147 -12 -1390 -1148 320 1732 760 -126 -896 -200 1086 1924 785 -322
1136c22J14Q92O12j05q55j500O18J487R0q74j122r11P72J409L01j602j747N85
$$ -322 -208 684 1296 1191 336 -1164 -546 941 1031 157 -965 -1876 -1104 305 606 -996 -2743 -2158
1154b158K336J073j827k071K69K005J206o9k158q19J171J685M29n21j974p96J850
$$ -2158 178 1251 -576 -2647 -2378 -373 833 764 -1394 -2213 -1042 643 1072 551 -1423 -2219 -369
1171c69K366m61k872j420J527K563M77k511k614J262K274J660q81k886o72J598
$$ -369 1997 1536 -1336 -2756 -1229 1334 1811 -700 -3314 -2052 222 1882 1001 -1885 -2557 -959
1187i59K857L49k735j898J583K942Q11j886k779O01K661J349r81k195j049J651
$$ -959 1898 2247 -488 -2386 -803 2139 2950 1064 -1715 -1114 1547 2896 1915 -280 -1329 322
1203C22J455M68j106j841p67J981K256q47k985q06J481K048R07j932k480O45K698
$$ 322 1777 2245 1139 -702 -1469 512 2768 1921 -1064 -1870 -389 1659 2566 634 -1846 -1201 1497
1220A497J400j353k880q15K539K902q76l200j215J906J646L81j948j821P31J492
$$ 1497 2897 1544 -1336 -2151 388 3290 2414 -786 -2001 -95 1551 1932 -16 -1837 -1106 386
1236C86J020n74j784j276O43J893R08j976j617K38J549K087j063k750L13J402
$$ 386 1406 832 -952 -2228 -1585 308 1216 -760 -2377 -2139 -590 1497 434 -2316 -2003 -601
1252f01J015L44j178r96J16J572N59m92j223p85J031K013n03k174j3R77K89K57
$$ -601 414 758 -420 -1416 -1300 272 831 339 -884 -1669 -638 1375 872 -1302 -1315 -338 -49 208
1270B08l18j031m5Q01O05N4J68j621o1J700P98l03r28q51Q81J480n7r33m04l45
$$ 208 -110 -1141 -1186 -385 220 274 442 -1179 -1240 460 1258 955 27 -824 57 1537 1480 547 143 -202
1290b02O23J118L61j843j247J286J294j54o20j290K22J423P61q80j067j50p3J361
$$ -202 421 1539 1900 57 -1190 96 1390 1236 616 -674 -452 971 1732 852 -215 -365 -438 923
1308I23J013j131j802M15J481M22j81j160r89J013J233j43p22r82l62Q74J586
$$ 923 1936 805 -997 -582 899 1321 1140 -20 -1009 4 1237 1094 372 -610 -972 -98 1488
1325A488l43k185p04O52J829P94j814j833N87J704R08q07j675m70J279K016l85
$$ 1488 1145 -1040 -1744 -1092 737 1531 -283 -2116 -1529 175 1083 276 -1399 -1869 -590 1426 1041
1342A041j938q36J46J835J632j805k610O92J666J272n33j367j411Q39K618K5j597
$$ 1041 -897 -1733 -1587 248 1880 75 -2535 -1843 -177 1095 562 -805 -2216 -1377 1241 1266 -331
1359c31j080l52J669K429j094k423n63J506J933L19k097j167M82K441R63j865
$$ -331 -1411 -1763 -94 2335 1241 -1182 -1745 -239 1694 2013 -84 -1251 -769 1672 2635 770
1375G70j232o04J141K436m83k222j146J124J756N45j627j633L38J656Q95m71j244
$$ 770 -462 -1066 75 2511 2028 -194 -1340 -216 1540 2085 458 -1175 -837 819 1714 1243 -1
1392aj032P44J939L10j710j000J68J297J424o98k260o11J594J453m30j024j464
$$ -1 -1033 -289 1650 1960 250 -750 -582 715 2139 1441 -819 -1430 164 1617 1187 163 -1301
1409a301J74J744O13j226j127m91J307Q33P5j183j201J198Q47M16p19j460L09
$$ -1301 -1127 617 1230 4 -1123 -1614 -307 526 601 -582 -1783 -585 262 678 -41 -1501 -1192
1426a192J240P34m31q69n31M0J516n4l83j203J70N64L79L63q77o95j46J018O23
$$ -1192 48 782 351 -518 -1049 -1009 507 453 70 -1133 -963 -399 -20 343 -534 -1229 -1375 -357 266
1445B66n12p09m13M44J470l54j057j17M51Q16J060r57p78k9Q76L44L39j97j225
$$ 266 -246 -955 -1368 -924 546 192 -865 -982 -531 285 1345 388 -390 -419 457 801 1140 943 -282
1464b82J29J017L73m01j117j84L54J082K62j046j025Q2J067Q57n92j331j69Q75
$$ -282 -153 864 1237 836 -281 -465 -111 971 1233 187 -838 -756 311 1168 576 -755 -924 -49
1482d9J301N7o82j340K38J516N34n87j280k44R31R08K72j625j270O50J225O72
$$ -49 1252 1309 627 -713 -475 1041 1575 988 -292 -536 395 1303 1575 -50 -1320 -670 555 1227
1500A227j052j192p24J470J251o46j359j083R83J660N27j204j682J05J786J293
$$ 1227 175 -1017 -1741 -271 980 334 -1025 -2108 -1125 535 1062 -142 -1824 -1719 67 1360
1516A360q80j297r73J515J459p1j459j201J89J520R44q78j478p92J045J560L6
$$ 1360 480 -817 -1790 -275 1184 1113 -346 -1547 -1358 162 1106 228 -1250 -2042 -997 563 599
1533E99j829j150Q21K141L15j041j155m56J644J831r09j423n55J003J581J1j136
$$ 599 -1230 -2380 -1559 582 897 -144 -1299 -1755 -111 1720 811 -612 -1167 -164 1417 1428 292
1550B92j077P2J595P64o33r05r50J132J128j59r55j254J71J477R29j207j405k44
$$ 292 -785 -713 882 1646 1013 108 -842 290 1418 1259 304 -950 -779 698 1627 420 -985 -1229
1568a229J364Q27L71j057j001M57J384O86q15j304j36P43J130k71j073r82Q22
$$ -1229 135 962 1333 276 -725 -268 1116 1802 987 -317 -453 290 1420 1149 76 -906 -84
1585h4P12M59q00j155J78N99M50J70p14j127L32Q36P40m99r70j56N95J046q1r39
$$ -84 628 1087 287 -868 -690 -91 359 529 -185 -1312 -980 -144 596 97 -873 -1029 -434 612 531 -408
1605d08q00M33J043J62m68m29k22M92N56J9j107l68J76O32Q70m29r63l68P68O62
$$ -408 -1208 -775 268 430 -38 -467 -689 -197 359 378 -729 -1097 -921 -289 581 152 -811 -1179 -411 251
1625B51j69n64n08J45J260K16l22r09k53M79J303k05o00o15J34J042M07l55j148
$$ 251 82 -482 -990 -845 415 631 309 -600 -853 -374 929 724 124 -491 -357 685 1092 737 -411
1644d11K9M34J062j9r85n24J64J403L85j032p03n93R53J111Pj366j055P33J528
$$ -411 -382 52 1114 1095 110 -414 -250 1153 1538 506 -197 -790 163 1274 1281 -85 -1140 -407 1121
1663A121K20p24j382j43J332J027m73j505m73R86J215M26j331j637O32J035K73
$$ 1121 1341 617 -765 -908 424 1451 978 -527 -1000 -14 1201 1627 296 -1341 -709 326 599
1680E99L1j280q44J266J168j39j640n30L71Q36J177j090j522o5J354Q04j33j171
$$ 599 630 -650 -1494 -228 940 801 -839 -1369 -998 -162 1015 -75 -1597 -1662 -308 496 363 -808
1698h08r36R22J145N19j039j299J90R73J349k77j724m23P48J377J5r34j247L16
$$ -808 -1744 -822 323 842 -197 -1496 -1306 -333 1016 739 -985 -1408 -660 717 732 -202 -1449 -1133
1716a133J342M08n36j028j78L35J569L44j355p98L17J407L76j64j456QR94R14
$$ -1133 209 617 81 -947 -1125 -790 779 1123 -232 -1030 -713 694 1070 906 -550 -542 452 1366
1734A366l57r61n73N20J088L32q19j106J79O63Q04k32j349k84P08O82k3l72o12
$$ 1366 1009 48 -525 -5 1083 1415 596 -510 -331 332 1136 904 -445 -729 -21 661 638 266 -346
1753c46j56Q15N74m96k09j00k33P66L94n25p25j79O10L49K95j096k82J63O56l8
$$ -346 -502 313 887 391 182 82 -151 615 1009 484 -241 -420 190 539 834 -262 -544 -381 275 237
1773B37np11n90Q20R90k83j018m52L41N79N63m61r99J82O46M46o4n86m85N84P83
$$ 237 232 -479 -1069 -249 741 458 -560 -1012 -671 -92 471 10 -989 -807 -161 285 221 -365 -850 -266 517
1794E17n6n59o48m20P32J052o99n61j90M06L39J06M7j095R3Q63N88K29j006m42
$$ 517 461 -98 -746 -1166 -434 618 -81 -642 -832 -426 -87 19 66 -1029 -936 -73 515 744 -262 -704
1814g04J13J401J3m45n05P5J96J164j84j353k12O05M53M14m89j182J00J187P44
$$ -704 -591 810 823 378 -127 -52 144 1308 1124 -229 -441 164 617 1031 542 -640 -540 647 1391
1833A391j135q08K9O67J029k7j264m13L38Q76L59k88j336l6R21R72Np59j235J90
$$ 1391 256 -552 -523 144 1173 1146 -118 -531 -193 683 1042 754 -582 -618 303 1275 1280 521 -714 -524
1853e24J696J27j145o10j13P26P33m29j409l05R06J082j76j055p74K34J359M50
$$ -524 1172 1299 154 -456 -569 157 890 461 -948 -1253 -347 735 559 -496 -1270 -1036 323 773
1871G73r93p68J47N99O38L98q86n18O1P30K59J71j436k44Q55O36R6j189l32L1
$$ 773 -220 -988 -841 -242 396 794 -92 -610 -549 181 440 611 -825 -1069 -214 422 518 -671 -1003 -972
1891i72J038L09r48n27M16K77P06J34j224m88J104J025K48q70l82j03Q13N71o17
$$ -972 66 375 -573 -1100 -684 -407 299 433 -791 -1279 -175 850 1098 228 -154 -257 556 1127 510
1910E10n41N0j09O82M87p09r05j20P90M73l84o65l14M33P79l15k48l19L8P56L28
$$ 510 -31 19 -90 592 1079 370 -535 -655 135 608 224 -441 -755 -322 457 142 -106 -425 -387 369 697
1931F97j64m76l14M80N35J71k56n69j04Q98q3k49n09l36RP56K07o88q24J40Q1
$$ 697 533 57 -257 223 758 929 673 104 0 898 815 566 57 -279 -270 486 693 5 -819 -679 -598
1952e98Q15l54q59j89M72N26L53m19o11J18Q36J95m24k76l05M14Q13k26j062o2
$$ -598 217 -137 -996 -1185 -713 -187 166 -253 -864 -746 90 285 -139 -415 -720 -306 507 281 -781 -843
1972h43K23M62N41k96r42PJ03P61M82j932P62j02J744j41o66j19q10L10J071l92
$$ -843 -620 -158 383 87 -855 -848 -745 16 498 -1434 -672 -774 970 829 163 44 -766 -456 615 223
1992B23n40R7k0J045m31J8l19O3L37N75j24j214p35J095N31K61n84r94k04J004
$$ 223 -317 -220 -240 805 374 392 73 136 473 1048 924 -290 -1025 70 601 862 278 -716 -920 84
2012H4R60n76j000k24M38R32J81o25n79L3P33N69j88q98m45P90Q83j96o00n91
$$ 84 1044 468 -532 -756 -318 614 795 170 -409 -376 357 926 738 -160 -605 185 1068 872 272 -319
2032c19r2R23P05p80o90l07O53O42l25p09o59O68N73p6l30n07pN92O59o45n56
$$ -319 -411 512 1217 437 -253 -560 93 735 410 -299 -958 -290 283 207 -123 -630 -637 -45 614 -31 -587
2053e87m50N89R20k57j71q06m6Q50K32N0r73k30L90R77Lo36p91L02N12L98o6m81
$$ -587 -1037 -448 472 215 44 -762 -808 42 274 324 -649 -879 -489 488 491 -145 -936 -634 -122 276 210 -271
2075b71m96M00N02J86o30k12L32M24J15J27m76k00L31M64N87j130p4J13M06K86
$$ -271 -767 -367 135 321 -309 -521 -189 235 350 477 1 -199 132 596 1183 53 -21 92 498 784
2095G84l19l58l9M9M41K66q31l77m2Q05J09J29o77o60N85N66J58n70l10K32N38
$$ 784 465 107 68 117 558 824 -7 -384 -426 379 488 617 -60 -720 -135 431 589 19 -291 -59 479
2116D79J48j52m52r7J63Q61j02n33n23J52M58L01m14p39j17K50O81o6r40k71J80
$$ 479 627 475 23 -74 89 950 848 315 -208 -56 402 703 289 -450 -567 -317 364 298 -642 -913 -733
2137g33O49O2K4o41k12M31P40j9q36j36Q5R77J92l67p17k73Q33M24l9l75j034
$$ -733 -84 -22 2 -639 -851 -420 320 301 -535 -671 -586 391 583 216 -501 -774 59 483 444 69 -965
2158i65P29N34L47j097m49j56N06R26k20j002l34O00J003J0m07o45p1J146K10
$$ -965 -236 298 645 -452 -901 -1057 -551 375 155 -847 -1181 -581 422 432 25 -620 -691 455 665
2177F65k10m93j28M52O29k46k01o40K69N85L19m50q38j27O13K12K15p75l86J71
$$ 665 455 -38 -166 286 915 669 468 -172 97 682 1001 551 -287 -414 199 411 626 -149 -535 -364
2197c64R50j05k07m95k17O67K72J95m94m40K23P33r3l58m48R1P00K52k29n08m44
$$ -364 586 481 274 -221 -438 229 501 696 202 -238 -15 718 625 267 -181 -90 610 862 633 125 -319
2218c19M6O07ol57o44N6M05N8R5n31m26N32P00m2m17l22P4N94L79n26l14K57J06
$$ -319 -273 334 328 -29 -673 -617 -212 -154 -59 -590 -1016 -484 216 174 -243 -565 -491 103 482 -44 -358 -101 5
2241EM8K77n27l84K47N57j38j82k70m20L56O07J59q25P8l28O58L30k48o53J75
$$ 5 53 330 -197 -581 -334 223 85 -97 -367 -787 -431 176 335 -490 -412 -740 -82 248 0 -653 -478
2262d78O24M54k4m58l66J52O86L07m23m05l27K93L26L16n24l05Q5L48K41k9n79
$$ -478 146 600 576 118 -248 -96 590 897 474 69 -258 35 361 677 153 -152 -67 281 522 493 -86
2283h6j60L28K53l34J17l67J20O89k5l2m16j33p5P03j23l54k81K59L55K3L1q00
$$ -86 -246 82 335 1 118 -249 -129 560 535 503 87 -46 -121 582 459 105 -176 83 438 461 492 -308
2305c08k21P57K36m01k71k9j92N55L53n93k57J44L55p9K79m95k16K33J91K50l69
$$ -308 -529 228 464 63 -208 -237 -429 126 479 -114 -371 -227 128 49 328 -167 -383 -150 41 291 -78
2326g8n40j62J182J05k45n77k89M86K46L48p22n66M48L29K89o65q4j32O79Q4K4
$$ -78 -618 -780 402 507 262 -315 -604 -118 128 476 -246 -812 -364 -35 254 -411 -495 -627 52 136 160
2347A60p89MM79K31L91l68o00M57K69J83P6l18j76J66M08m5k63m97j99N93N18
$$ 160 -629 -625 -146 85 476 108 -492 -35 234 417 493 175 -1 165 573 528 265 -232 -431 162 680
2368F80n32k30P5N5M54k63m18K7j8M81J27q2o28m1M54q3N38l94k60K88J44K37
$$ 680 148 -82 -7 48 502 239 -179 -152 -170 311 438 356 -272 -313 141 58 596 202 -58 230 374 611
2390F11n86j29k78M23J69P9l57o32L21K62J38k09p7l10L49N50n01k40j36N2N29
$$ 611 25 -104 -382 41 210 289 -68 -700 -379 -117 21 -188 -265 -575 -226 324 -177 -417 -553 -501 28
2411B8nr7k95k31M77J86O7n19M3J85Q4J4j38l34O4N05q2n6m73K3L18j67O38k64
$$ 28 23 -74 -369 -600 -123 63 130 -389 -346 -161 -77 -63 -201 -535 -471 34 -48 -104 -577 -554 -236 -403 235 -29
2435b9n35j31N85q4L58k47m23L16L66L42j37m75k49L27M27j67l7m07jL45K94m70
$$ -29 -564 -695 -110 -194 164 -83 -506 -190 176 518 381 -94 -343 -16 411 244 207 -200 -201 144 438 -32
2457c2j96o5M31K91l63k87j76J92O55j85q6p32L83M14Q3l37O4j50J37M86q7k43
$$ -32 -228 -293 138 429 66 -221 -397 -205 450 265 179 -553 -170 244 327 -10 54 -96 41 527 440 197
2479A97m68K08jO93l57n76k29L76N26K90j042K18J5L67R3k67l74k90O85K7r1k27
$$ 197 -271 -63 -64 629 272 -304 -533 -157 369 659 -383 -165 -150 217 310 43 -331 -621 64 91 0 -227
2501b27j0k91M82K60l96l94K65J44M69j98k86k48L90K59K41m77k16j80L95L33
$$ -227 -237 -528 -46 214 -182 -576 -311 -167 302 104 -182 -430 -40 219 460 -17 -233 -413 -18 315
2521C15k87l93j16L60L92j54k78m30M01L46J82r1o46M1N35N25m86m9n86O03L21
$$ 315 28 -365 -481 -121 271 117 -161 -591 -190 156 338 247 -399 -358 177 702 216 167 -419 184 505
2542E05L51l46q36L02O7N58o2l81k79K72L10j17j04k45k20L07L46P7o13J73K21
$$ 505 856 510 -326 -24 43 601 539 158 -121 151 461 344 240 -5 -225 82 428 505 -108 65 286
2563B86Q6J42l73j25j72M54K15j79ol73K89Q5J21n9n98r8N62n2N5n03j7N2J88
$$ 286 372 514 141 16 -156 298 513 334 328 -45 244 329 450 391 -207 -305 257 205 260 -243 -260 -208 -20
2586b0J23k23k61%M23p0n1l29M0J61N13k15k83O0k15L05K70j27m49p2P3M62o5
$$ -20 103 -120 -381 -381 42 -28 -79 -408 -368 -207 306 91 -192 -132 -347 -42 228 101 -348 -420 -347 115 50
2609E0l75q0o5K78M85j37k09k1K3J57L4J5l57MM69K60o7o26p0M55L55pl67l67
$$ 50 -325 -405 -470 -192 293 156 -53 -74 -51 106 140 155 -202 -198 271 531 464 -162 -232 223 578 571 204 -163
2633a63K56N75m7k75m69j27M21O8R3o60L25j63J53K38l64J00N8N28Qj07m03l17
$$ -163 93 668 621 346 -123 -250 171 239 332 -328 -3 -166 -13 225 -139 -39 19 547 555 448 45 -272
2655b72J03L16L9m0l05K27j35M57k06m40l17K10M27K90o11J84l08M16L11m53n7
$$ -272 -169 147 186 146 -159 68 -67 390 184 -256 -573 -363 64 354 -257 -73 -381 35 346 -107 -164
2676a64m29K56L00J87m08k39j05N21M99m37k54j13O40j58q2j75k39N04j14K51
$$ -164 -593 -337 -37 150 -258 -497 -602 -81 418 -19 -273 -386 254 96 14 -161 -400 104 -10 241
2696B41o9n23J57jJ28K21r6l96J23L45N2j26p5k78J84N20j8p37J74K31M89l15
$$ 241 172 -351 -194 -195 -67 154 58 -338 -215 130 182 56 -19 -297 -113 407 389 -348 -174 57 546 231
2718B31r6k83j74K00O26P5p06J95J34J78k32o7l18J07J7M58J83m35l42M58N7j7
$$ 231 135 -148 -322 -122 504 579 -127 68 202 380 148 81 -237 -130 -113 345 528 93 -249 209 266 249
2740B49o4l09L04j05M14n28k71K67m7M48o5o24J63q9L07K37k22k43o7K79k7R9
$$ 249 185 -124 180 75 489 -39 -310 -43 -90 358 293 -331 -168 -257 50 287 65 -178 -245 34 7 106
2762A06l90J14j21K36J51l24M33m28J28L08l26p0l68K97O6M16k22k34k69M97L13
$$ 106 -284 -170 -291 -55 96 -228 205 -223 -95 213 -113 -183 -551 -254 -188 228 6 -228 -497 0 313
2783C13k71k51M7M8K62K1k08k54l35L57J63J73K0m40J70M86M1k22j88J52j38M40
$$ 313 42 -209 -162 -114 148 169 -39 -293 -628 -271 -108 65 85 -355 -185 301 342 120 -68 84 -54 386
2805C86m57J40k41J61M35j33k93m62L76L61J38o5l09m51M32L72k32M5l98J80L25
$$ 386 -71 69 -172 -11 424 291 -2 -464 -88 273 411 346 37 -414 18 390 158 203 -195 -15 310
2826C10K18m21l90L9L49K95r3j63m02J24N02l54K60l98m08P92j3J5o5k67n3L66
$$ 310 528 107 -283 -244 105 400 307 144 -258 -134 368 14 274 -124 -532 260 247 262 197 -70 -123 243
2848B43O0n56J58m54P16j31L66m73%J40j92K92k79j80P3J63K72j31k21J93j58
$$ 243 303 -253 -95 -549 167 36 402 -71 -71 69 -123 169 -110 -290 -217 -54 218 87 -134 59 -99
2869i9J31J13p3l82l7L14J15j5j56Kj3J06L47l04l46J24J38N45l70l75mK83N10
$$ -99 32 145 72 -310 -347 -33 82 67 -89 -87 -100 6 353 49 -297 -173 -35 510 140 -235 -239 44 554
2892E54k95j9m22pM82k01J20q1j62K30J53j80j56J74m4p2M07k59j77r4M44L0k03
$$ 554 259 240 -182 -189 293 92 212 131 -31 199 352 172 16 190 146 74 481 222 45 -49 395 425 222
2915B22K4n9J34P6k77p5j82k3L98J69l26r1j91j6K56J77j01m14j41M95j1n8J14
$$ 222 246 187 321 397 120 45 -137 -160 238 407 81 -10 -201 -217 39 216 115 -299 -440 55 44 -14 100
2938A00m68jK76L40k87m5N2j04M8K5p1q4k07K64K08j08j50mK77n3j01k10k85M47
$$ 100 -368 -369 -93 247 -40 -85 -33 -137 -89 -64 -135 -219 -426 -162 46 -62 -212 -216 61 8 -93 -303 -588 -141
2962a41J76m5k67jQ0l6L77l34P5o2J98K9N9l79J50n7J19M3k5j75J95J12J5m5k5
$$ -141 35 -10 -277 -278 -198 -234 143 -191 -116 -178 20 49 108 -271 -121 -178 -59 -16 -41 -216 -21 91 106 61 36
2987C6k26p6M36j1r6l18k04K19N84l30j89Q9j7J14K50P0m23l3L02K48m26K47o64
$$ 36 -190 -266 170 159 63 -255 -459 -240 344 14 -175 -86 -103 11 261 331 -92 -125 177 425 -1 246 -418
3010d18L10L15O2k54k26J95L48j33q4j34k7R4j0J37m58L75J88n04J94j23O2j46
$$ -418 -108 207 269 15 -211 -16 332 199 115 -19 -46 48 38 175 -283 92 280 -224 -30 -153 -91 -237
3032b37J90L16p7k13l42L98J4J72k71oj15k41M01Q6k02P9n4J21j93J10l01K68
$$ -237 -47 269 192 -21 -363 35 49 221 -50 -56 -171 -412 -11 75 -127 -48 -102 19 -174 -64 -365 -97
3054i7k36L89L8j02R6j87j01P9K53j23n08M22J47J29l07r1L42l8J23j34j53q3
$$ -97 -333 56 94 -8 88 -99 -200 -121 132 9 -499 -77 70 199 -108 -199 143 105 228 94 -59 -142
3076a42J87Q2J93m07P8K89J08k29No8L5k43M31K13l70l16L29Pr9J83m77%J52L78
$$ -142 45 127 320 -87 -9 280 388 159 164 96 131 -112 319 532 162 -154 175 182 83 266 -211 -211 -59 319
3100C19p0m03K26q7J34j22p9n6J99j4M25m34k21J08Kl8K68l67j12o5M60j5k62
$$ 319 249 -154 72 -15 119 -3 -82 -138 61 47 472 38 -183 -75 -73 -111 157 -210 -322 -387 73 58 -204
3123b04L42m26K31K64R4l09nl40L64L48l08l67J19J34L96j16n04j21Q2M38K47
$$ -204 138 -288 -57 207 301 -8 -13 -353 11 359 51 -316 -197 -63 333 217 -287 -408 -326 112 359
3144C59n34j51q6M63Q0l81P4l54M80J34Or6l02J03L12K02k75M4k27J67K22Rm05
$$ 359 -175 -326 -412 51 131 -250 -176 -530 -50 84 90 -6 -308 -205 107 309 34 78 -149 18 240 249 -156
3167a56o7O2q7N53J23j98l67J38M66k46j88j80R2L20R8k75P7l17K43K38m73K32
$$ -156 -223 -161 -248 305 428 230 -137 1 467 221 33 -147 -55 265 363 88 165 -152 91 329 -144 88
3189H8j34J80K21l95M7j18l9K34J21L40p16j55K4K86J35m9m16J86o9L94j17j58
$$ 88 -46 134 355 -40 7 -111 -150 84 205 545 -171 -326 -302 -16 119 70 -346 -160 -229 165 48 -110
3211a10J60j63K11J32k83l44L76M3J16q1l02o8K38m9J05Kk10o7L38j38k10L05
$$ -110 50 -113 98 230 -53 -397 -21 22 138 57 -245 -313 -75 -124 -19 -17 -227 -294 44 -94 -304 1
3233AL3o7O5Qj62k52M02p8PO0l93M36J25l22K18l86r9M00J60M7k3m85K26M7M83
$$ 1 34 -33 32 40 -122 -374 28 -50 -43 17 -376 60 185 -137 81 -305 -404 -4 156 203 180 -305 -79 -32 451
3258D51k70l06P5PK59L7j62j85P4K0J81K42j80k47j03L76k01J33o9M7k34M13j50
$$ 451 181 -125 -50 -43 216 253 91 -94 -20 0 181 423 243 -4 -107 269 68 201 132 179 -55 358 208
3281B08k77p5L92J16k46j44o0j70L83J32K7m7n55M33K39l04m7N1r7k2J79k37l0
$$ 208 -69 -144 248 364 118 -26 -86 -256 127 259 286 239 -316 117 356 52 5 56 -41 -63 116 -121 -151
3304a51j78K15R7J01L0j34N2P7p6k09j15J15K03K10j15l54K8R0J3R0j09rm9m8
$$ -151 -329 -114 -17 84 114 -20 32 109 33 -176 -291 -176 27 237 122 -232 -204 -114 -101 -11 -120 -129 -178 -226
3328b26L38J08l51K45J08k89K40j62n8K71j55o6J11k16R2J66L7J9j63j16K30L20
$$ -226 112 220 -131 114 222 -67 173 11 -47 224 69 3 114 -102 -10 156 193 212 49 -67 163 483
3350D83k57j08N7l3m39M05J80p8r1k95J97K53l51J61k40L57J6L4J27l68J07k01
$$ 483 226 118 175 142 -297 108 288 210 119 -176 21 274 -77 84 -156 201 217 251 378 10 117 -84
3372h4M49m25K96j99o5K67j56l1j72P1Q8K24k15m89M17k01J80m4J89k43j98L54
$$ -84 365 -60 236 37 -28 239 83 52 -120 -49 39 263 48 -441 -24 -225 -45 -89 100 -143 -341 13
3394A3N4j24k32o8K15M13j02j64k23R9l6m7O2j76J92O2J98j86o3j93K23J99l80
$$ 13 67 -57 -289 -357 -142 271 169 5 -218 -119 -155 -202 -140 -316 -124 -62 136 -50 -113 -306 -83 116 -264
3417b64J89Q9j45QJ14J52o2k11K48j91J93p9k21qJ41j00L87k11j59J81n4K43J08
$$ -264 -75 14 -131 -123 -9 143 81 -130 118 -73 120 41 -180 -188 -47 -147 240 29 -130 51 -3 240 348
3440C48m81j10M46l23K92k17L3K09j71M06l82l0k68J35K64k72J42J60K5k94L87
$$ 348 -133 -243 203 -120 172 -45 -12 197 26 432 50 20 -248 -113 151 -121 21 181 206 -88 299
3461B99k25m86K85L13l98L75j73J0N9k48L32j69O1j83J37J08L8m62M44q8r2J43
$$ 299 74 -412 -127 186 -212 163 -10 0 59 -189 143 -26 35 -148 -11 97 135 -327 117 29 -63 80
3483H0j64J84k60KK01j70jL00K8j51l41K61J25k28J27nJ79l78J63J95o1R7j53
$$ 80 -84 100 -160 -158 43 -127 -128 172 200 49 -292 -31 94 -134 -7 -12 167 -211 -48 147 86 183 30
3506C0j79N6K09K74l90j17Q3j69J80M36j77j33k0o6O7l7k46L3L19J65m23Q6M4
$$ 30 -149 -93 116 390 0 -117 -34 -203 -23 413 236 103 83 17 84 47 -199 -166 153 318 -105 -19 25
3529B5j34K27p4l6R8j65J81J00j35k81K63j30K56j16j96Q7J65j32Mr2pM8J78j33
$$ 25 -109 118 44 8 106 -59 122 222 87 -194 69 -61 195 79 -117 -30 135 3 7 -85 -92 -44 134 1
3553AJ91j82K0j67K54k90K70l51K7K55J36J3k95p6MK02N0m02J55O8O6J68L7j49
$$ 1 192 10 30 -137 117 -173 97 -254 -227 28 164 177 -118 -194 -190 12 62 -340 -185 -117 -51 117 154 5
3577Ek44J84K83l41J66j73r1K72k18J38l41K59K23m02K81R5m22L26O6J47n2l48
$$ 5 -239 -55 228 -113 53 -120 -211 61 -157 -19 -360 -101 122 -280 1 96 -326 0 66 213 161 -187
3599a87k11L73N3j45J2j71K49J4M6K60n84K63j48K97j45K66l43K34m4j18M31l88
$$ -187 -398 -25 28 -117 -105 -276 -27 -13 33 293 -291 -28 -176 121 -24 242 -101 133 89 -29 402 14
3621A4n2L12j1n21J76R6K5o9n9J53j0l7R6J24l28r6J14KK21K5j09J7P1J24J43
$$ 14 -38 274 263 -258 -82 14 39 -30 -89 64 54 17 113 237 -91 -187 -73 -71 150 175 66 83 154 278 421
3646D21k80j35K32l17O9o7n5Q8L9j06o8P1J3k72L90k18K00j54K22l94L39j73K42
$$ 421 141 6 238 -79 -10 -77 -132 -44 -5 -111 -179 -108 -95 -367 23 -195 5 -149 73 -321 18 -155 87
3669H7l27j36J41K22J31j86p4K24M1l6%q1q9J07M16l87j05j87K35mo5r7R3O4J32
$$ 87 -240 -376 -235 -13 118 -68 -142 82 123 87 87 6 -83 24 440 53 -52 -239 -4 -8 -73 -170 -77 -13 119
3694A19j27K80k84j82J23L46m8l30j7M21m42K00r6P5j67K47J50q2k86n6JK56k3
$$ 119 -8 272 -12 -194 -71 275 227 -103 -120 301 -141 59 -37 38 -129 118 268 186 -100 -156 -155 101 78
3717G8Np6j88J57K76j11j52J83j70k01O63m60k28L09l70K07P2K0o0j66K57k52
$$ 78 83 7 -181 -24 252 141 -11 172 2 -199 464 4 -224 85 -285 -78 -6 14 -46 -212 45 -207
3739b07L25k98j6K74j97K62j07O8j87K82j91J69m79K54n8N5J00k19J18o8J21J68
$$ -207 118 -180 -196 78 -119 143 36 104 -83 199 8 177 -302 -48 -106 -51 49 -170 -52 -120 1 169
3761A69l17k01K59p7L08j53P4k6o9M9l2M6j84J79j07k7J80j31N8j87Q6J13n6J43
$$ 169 -148 -349 -90 -167 141 -12 62 36 -33 16 -16 30 -154 25 -82 -109 71 -60 -2 -189 -103 10 -46 97
3785I7J9K36m29M9J8r9K85J1j13k6J51J01l46K00j27n0j4l3J81p0m20K12N6J30
$$ 97 116 352 -77 -28 -10 -109 176 187 74 48 199 300 -46 154 27 -23 -37 -70 111 41 -379 -167 -111 19
3809A9j38J08K83k06r8K27l36L95r5p1j82K06l5m7j0k51K16J82J7k42j45K9K49
$$ 19 -119 -11 272 66 -32 195 -141 254 159 88 -94 112 77 30 20 -231 -15 167 184 -58 -203 -174 75
3832G5r3rk39L46j5O1k44J61p2K26l3k61l27K17M9K84m68K62j05J3J11L40k59
$$ 75 -18 -27 -266 80 65 126 -118 43 -29 197 164 -97 -424 -207 -158 126 -342 -80 -185 -172 -61 279 20
3855B0k28N8K37J78l02Q8r0J07l30M50j73p6l1J75k03K99l46K01j93J58J71k46
$$ 20 -208 -150 87 265 -37 51 -39 68 -262 188 15 -61 -92 83 -120 179 -167 34 -159 -1 170 -76
3877g6p1j00L14mK30l01j71K55K8o4L18l96l9j07L50j69p3K67k46K32L8j58j17
$$ -76 -147 -247 67 63 293 -8 -179 76 104 40 358 -38 -77 -184 166 -3 -76 191 -55 177 215 57 -60
3900f0J17N4k85K39j49K79l7L1J01j02l5m76N81j05j58L36k88Q8k46O9P5n5M0
$$ -60 57 111 -174 65 -84 195 158 189 290 188 153 -323 258 153 -5 331 43 131 -115 -46 29 -26 14
3923A4P4k59M8R0M5k23K75q0O5k06J64J06O8j24m3q0l2K44j06j5j5j11K07j5K6
$$ 14 88 -171 -123 -33 12 -211 64 -16 49 -157 7 113 181 57 14 -66 -98 146 40 25 10 -101 106 91 117
3948A17j98J51j06j12L24l74J72J61J25j35j11%j22K68j10J0N9l33J76R1N6j72
$$ 117 -81 70 -36 -148 176 -198 -26 135 260 125 14 14 -108 160 50 60 119 -214 -38 53 109 -63
3970f3K12l55K43p8J23k50J16k8K41K32k59r4j46q8K27o9JK32k52m1J67M6r4k44
$$ -63 149 -206 37 -41 82 -168 -52 -80 161 393 134 40 -106 -194 33 -36 -35 197 -55 -96 71 117 23 -221
3994b21L19j04J65m44M66r5m5L3j97K76j61j65L90o7j29j40KJ52k75J39k5K2j20
$$ -221 98 -6 159 -285 181 86 41 74 -123 153 -8 -173 217 150 21 -119 -117 35 -240 -101 -126 -104 -224
4017b24L34j10Jk18J80m0N3J01l28K17j6K48j69k39L18p2j24J30q8j05J36J8o0
$$ -224 110 0 1 -217 -37 -77 -24 77 -251 -34 -50 198 29 -210 108 36 -88 42 -46 -151 -15 3 -57
4040e7qQK6j4j6N4k23L17o5J40l69L43k40N3j06L60J18n37J71M64k79J83l02R1
$$ -57 -65 -57 -31 -45 -61 -7 -230 87 22 162 -207 136 -104 -51 -157 203 321 -216 -45 419 140 323 21 112
4064A12k76M01m0k45j31M62j44q0O0q2l74K61K20m4k55J57q1O1J73p1J08j74k9
$$ 112 -164 237 197 -48 -179 283 139 59 119 37 -337 -76 144 100 -155 2 -79 -18 155 84 192 18 -11
4087a1J42oj36J11j11M44m75L6J82j14j0J63k54R0k77J85lk29K87J58k93k72M46
$$ -11 131 125 -11 100 -11 433 -42 -6 176 62 52 215 -39 51 -226 -41 -44 -273 14 172 -121 -393 53
4110E3k29K5J23n4K36p7J2k5l21K04J84k07k24J05Q9J97J11N2j60j95k3J24J06
$$ 53 -176 -151 -28 -82 154 77 89 64 -257 -53 131 -76 -300 -195 -106 91 202 254 94 -101 -124 0 106
4133A06j87Rj36M4J43P2Q3j46q2K06j12n0k6N46p02M88m15K91K12l61n9J38K55
$$ 106 -81 -72 -208 -164 -21 51 134 -12 -94 112 0 -50 -76 470 -232 256 -159 132 344 -17 -76 62 317
4156C17j44j45l0L18M2j21l84L92n6j66pJ34Jj37k98N77l01q7J93k80J58J21q6
$$ 317 173 28 -2 316 358 237 -147 245 189 23 16 150 151 14 -284 293 -8 -95 98 -182 -24 97 11
4179A1N0P0J8k06J56j46K28k94K45k36k81L30J95j19P9k15J91k58J97j17J38j28
$$ 11 61 131 149 -57 99 -47 181 -113 132 -104 -385 -55 140 21 100 -115 76 -182 15 -102 36 -92
4201i2Rj65J6L31j39J0J04j17N4j55J74q4K20j04K48l88J05l4L6k38J01J25mJ22
$$ -92 -83 -248 -232 99 -40 -30 74 -43 11 -144 30 -54 166 62 310 -78 27 -7 29 -209 -108 17 13 135
4225A35k18J50j4n5P3k97J37k59J12O27n15M48l01J0N8J5L9j13j3k6Q9j9o1Q5
$$ 135 -83 67 53 -2 71 -226 -89 -348 -236 391 -124 324 23 33 91 106 145 32 19 -7 82 63 2 87
4249H7J31j22J44l25L16l62J11J58k56J58J12l80L57l82J74L18k75N0n8K21m07
$$ 87 218 96 240 -85 231 -131 -20 138 -118 40 152 -228 129 -253 -79 239 -36 14 -44 177 -230
4270b30J90j00R8n1J85q1j04O3K20k86K94k70Lr4K84l51J77j69L43q0Qqj04P1
$$ -230 -40 -140 -42 -93 92 11 -93 -30 190 -96 198 -72 -69 -163 121 -230 -53 -222 121 41 49 41 -63 8
4294HL23l78L08l84%J70j24K05n46M99l49L57L2J38m22N8j03K67o4j85J71lM20
$$ 8 331 -47 261 -123 -123 47 -77 128 -418 81 -268 89 121 259 -163 -105 -208 59 -5 -190 -19 -22 398
4317C98k75k66J88r6M6J57q8k24P5j00K09J93o4M0k30K00p4L1j93K5J70k77L88
$$ 398 123 -143 45 -51 -5 152 64 -160 -85 -185 24 217 153 193 -37 163 89 120 -73 -48 122 -155 233
4340B33K3k86J41n5J37k06J97k19O1q1L91k57j17K07j70P7J5n8J23j94qJ60j35
$$ 233 256 -30 111 56 193 -13 184 -35 26 -55 336 79 -38 169 -1 76 91 33 156 -38 -46 114 -21
4363b1J76j11j31k02M31k25M2j93J35r7J33R8M5O2k13k61L50M0j57k2L21j19j44
$$ -21 155 44 -87 -289 142 -83 -41 -234 -99 -196 -63 35 80 142 -71 -332 18 58 -99 -121 200 81 -63
4386f3o3p6M10j29J18j28j44J40Q6l18J44k89M32Mq9j7j06q8K34k20K75k38J17
$$ -63 -126 -202 208 79 197 69 -75 65 151 -167 -23 -312 120 124 35 18 -88 -176 58 -162 113 -125 -8
4409hj32J17N9j29P1O3J29j90K77l35J0Q2J29l51P0Q6K77l30k4K14k1J2j80K29
$$ -8 -140 -23 36 -93 -22 41 170 -20 257 -78 -68 14 143 -208 -138 -52 225 -105 -129 85 64 76 -104 125
4433A25k48j18J50j02K14J9K28k31m27N16k0P8j12j41O1R8j45M6L3l9J21m10K26
$$ 125 -123 -241 -91 -193 21 40 268 37 -390 126 106 184 72 -69 -8 90 -55 -9 24 -15 106 -304 -78
4456g8J96j07r4J80J21j57j00Kn5J15k12K94J42m62J34j07J4J13K98m81L01N6
$$ -78 118 11 -83 97 218 61 -39 -37 -92 23 -189 105 247 -215 -81 -188 -174 -61 237 -244 57 113
4478A13l11R9K51l20M5L0L0M5O3m1J5j49M17m6m48K87k05J27k13K72oj35L43j90
$$ 113 -198 -99 152 -168 -123 -93 -63 -18 45 4 19 -130 287 241 -207 80 -125 2 -211 61 55 -80 263 73
4502G3m62N27j28q2L9K95j99j87J41l4j16K73k61K84pp7k01J77o4j39N7J84j60
$$ 73 -389 138 10 -72 -33 262 63 -124 17 -17 -133 140 -121 163 156 79 -122 55 -9 -148 -91 93 -67
4525f7K36J03l72M2q2l7N0J43j39J99l09K63n7J6j36K33j82K28J07P8k46j97m
$$ -67 169 272 -100 -58 -140 -177 -127 16 -123 76 -233 30 -27 -11 -147 86 -96 132 239 317 71 -126 -130
4548a30nK51k36J51j64J77J28Q3k99L3o0Lm4j5LK87n07L53k27J07K51j8k68M70
$$ -130 -135 116 -120 31 -133 44 172 255 -44 -11 -71 -68 -112 -127 -124 163 -344 9 -218 -111 140 122 -146 324
4572C24n09K30j52J10J15l27K12k24L66j48j15J72j4J98l13J18J85l26n3J43J90
$$ 324 -185 45 -107 3 118 -209 3 -221 145 -3 -118 54 40 238 -75 43 228 -98 -151 -8 182
4593A82k48M3m7J6j67K54j57j7qN9J27k13L04m2j53P9Mk9M9j38p2L77k05k18J16
$$ 182 -66 -23 -70 -54 -221 33 -124 -141 -149 -90 37 -176 128 86 -67 12 16 -13 36 -102 -174 203 -2 -220 -104
4618a04L29l2j55J5J69J89r7k84M3p3o2J97j45L23l47M3l5R8R2Pm7l82K05q2k15
$$ -104 225 193 38 53 222 411 314 30 73 0 -62 135 -10 313 -34 9 -26 72 164 171 124 -258 -53 -135 -350
4643c50M59o3P5K7l32K75m07N08l07J24L6k20J18N2M5j50n1jN44l49p6J1J36k53
$$ -350 109 46 121 148 -184 91 -316 192 -115 9 45 -175 -57 -5 40 -110 -161 -162 382 33 -43 -32 104 -149
4667a49K86J74k81j43j08J22K41J0j26K6J05j07l60J97N9Q2N3M4j50k6Q6k62K43
$$ -149 137 311 30 -113 -221 -99 142 152 26 52 157 50 -310 -113 -54 28 81 125 -25 -51 35 -227 16
4690A6k22K94j19k11O0p9N03j68j03j75J28j4K03r7j72n2K61N3lL54n42j74K78
$$ 16 -206 88 -31 -242 -182 -261 242 74 -29 -204 -76 -90 113 16 -156 -208 53 106 103 457 -85 -259 19
4713A9LJ78j96J38M5j32o5J41J16m88J26K19j00M1o0k3L0j46pj03L85j66J64m8
$$ 19 22 200 4 142 187 55 -10 131 247 -241 -115 104 4 45 -15 -38 -8 -154 -161 -264 121 -45 119 71
4737G1r1j14J53L97m26K48j46j60K9M6K52k16j53K01k26J87q5J30o2k05L97j22
$$ 71 -20 -134 19 416 -10 238 92 -68 -39 7 259 43 -110 91 -135 52 -33 97 35 -170 227 105
4759A05j77l0k7J08n4J6J94l04K54P5j26k91L30k68J51l1n3L28n31O3J28J12P3
$$ 105 -72 -102 -129 -21 -75 -59 135 -169 85 160 34 -257 73 -195 -44 -75 -128 200 -331 -268 -140 -28 45
4782D5K3n5n2J99l55M1M35l90J60k87N29k26p2L3P1p6o5J72p9l20J24J36j20m3
$$ 45 68 13 -39 160 -195 -154 281 -109 51 -236 293 67 -5 28 99 23 -42 130 51 -269 -145 -9 -129 -172
4806a72r9K85K63n33L08R6l47L10p9m8j35J36r6L22l04J51j0j16l2K80k15l2Q1
$$ -172 -271 14 277 -256 52 148 -199 111 32 -16 -151 -15 -111 211 -93 58 48 -68 -100 180 -35 -67 14
4829A4j36K89j3k21l8J03j29J8k37N48k04M1J20k29K37k87K68R5N1n3l55p8J13
$$ 14 -122 167 154 -67 -105 -2 -131 -113 -350 198 -6 35 155 -74 163 -124 144 239 290 237 -118 -196 -83
4852h3R9l3o9j43K43k2K7j78L84k88K25l08L78n5l51K43Q9j89Q6r8r4n3K71j24
$$ -83 16 -17 -86 -229 14 -8 19 -159 225 -63 162 -146 232 177 -174 69 158 -31 55 -43 -137 -190 81 -43
4876d3j18N0j22J76kp8O2K47p1P2k15R2j29j56K22P5q7j46J93L8O3J20l46N16
$$ -43 -161 -111 -233 -57 -59 -137 -75 172 101 173 -42 50 -79 -235 -13 62 -25 -171 22 60 123 243 -103 413
4900D13k08k81K96m81M55l78J35M9O1k87K41P2j18J07j36K18K3m08qO40k26k46
$$ 413 205 -76 220 -261 194 -184 -49 0 61 -226 15 87 -31 76 -60 158 181 -227 -235 405 179 -67
4922f7M8J6k32K39l5n0k06J68L29k74J07r6j2Q0J82k98lJ72M6p9R0J90n53K35
$$ -67 -19 -3 -235 4 -31 -81 -287 -119 210 -64 43 -53 -65 15 197 -101 -104 68 114 35 125 315 -238 -3
4946cJ56p6j39q1L48k93J5N9j18%K48j74j69J61L5Jk0j40K8O6K9N8L1l41M00m04
$$ -3 153 77 -62 -143 205 -88 -73 -14 -132 -132 116 -58 -227 -66 -31 -30 -50 -190 -162 -96 -67 -9 22 -319 81 -323
4972c23L33j01RL11o3k46j78K44m6J47q0O2j44o0j19M08po0J19j15r9K7P2o5R4
$$ -323 10 -91 -82 229 166 -80 -258 -14 -60 87 7 69 -75 -135 -254 154 147 87 206 91 -8 19 91 26 120
4997A20k55K24j50k0L32j06m4mj73j31K04O2O5j72Q4j02j58K59j30k57K92J40
$$ 120 -135 89 -61 -81 251 145 101 97 -76 -207 -3 59 124 -48 36 -66 -224 35 -95 -352 -60 80
5019H0k45J2J40p6J29n1Q2m7J03j41q4j44J25P6jL12n05L08P2j77j29R3j41L35
$$ 80 -165 -153 -13 -89 40 -11 71 24 127 -14 -98 -242 -117 -41 -42 270 -235 73 145 -32 -161 -68 -209 126
5043A26j60O7J19p3k19J02l7j52L33j50K86k32l2k06L7P2O3j27P4Q4K73K1k12
$$ 126 -34 33 152 79 -140 -38 -75 -227 106 -44 242 10 -22 -228 -191 -119 -56 -183 -109 -25 248 269 57
5066E7M5l6K1l3j67J95j39J37j55PJ69j47j94K72j65J06J78n6P2n3k32K39k39
$$ 57 102 66 87 54 -113 82 -57 80 -75 -68 101 -46 -240 32 -133 -27 151 95 167 114 -118 121 -118
5089a18J63r9J65j09Q5l11J80m9r9L55k75N1j45K93J66k72R0k22P0R6J21K1j54
$$ -118 45 -54 111 2 87 -224 -44 -93 -192 163 -112 -61 -206 87 253 -19 71 -151 -81 15 136 157 3
5112Cj77J11K29n34m8L07K06j32j41K81K2j75J12k23J66r4q0J97j57j28J97J64
$$ 3 -174 -63 166 -368 -416 -109 97 -35 -176 105 127 -48 64 -159 7 -87 -167 30 -127 -255 -58 106
5134A06j09J62j66J37l70K2lL25l49J12k3L64j82J35O0k10J48p3j91K7K47q8M1
$$ 106 -3 159 -7 130 -240 -218 -221 104 -245 -133 -156 208 26 161 221 11 159 86 -105 -78 169 81 122
5157A22k13J06k06K78l1k21J67M8K6Q8q5M6j8p5p1M2M6J49j53l8R7J33m71nM51
$$ 122 -91 15 -191 87 56 -165 2 50 76 164 79 125 107 32 -39 3 49 198 45 7 104 237 -234 -239 212
5182B12k29J43j33O1p4m8Q4J44j69o1J69k06J03O2j91L7K29J8r7N4O1K23k33m08
$$ 212 -17 126 -7 54 -20 -68 16 160 -9 -70 99 -107 -4 58 -133 -96 133 151 54 108 169 392 159 -249
5206b49O1L49j3J84l91j47J19L9J32k39O2L32k93P3j09J07j35K0L48j02k81L7
$$ -249 -188 161 148 332 -59 -206 -87 -48 84 -155 -93 239 -54 19 -90 17 -118 -98 250 148 -133 -96
5228i6J80P6M7p7J13J0j22l34J7O7K04k29K7M7ml17O65k15p4J14n4l1k2l0J0k0
$$ -96 84 160 207 130 243 253 131 -203 -186 -119 85 -144 -117 -70 -74 -391 274 59 -15 99 45 14 -8 -38 -28 -48
5254d8J96K0J14k38j56J37lj56K90k22J72L2r7j53L14qK3p9j09K52l79K33n95
$$ -48 148 168 282 44 -112 25 22 -134 156 -66 106 138 41 -112 202 194 217 138 29 281 -98 135 -460
5277d60O88j76j84N1L03o0j35mo3K22l0k17J73P1j83r3M3K46k60j24J97Q5l12
$$ -460 228 52 -132 -81 222 162 27 23 -40 182 152 -65 108 179 -4 -97 -54 192 -68 -192 5 90 -222
5300b22L22n5P0r2M3J00k87K35k17O6o7K01r3k39Q4R3K16k99M11j24k19j55L23
$$ -222 100 45 115 23 66 166 -121 114 -103 -37 -104 97 4 -235 -151 -58 158 -141 270 146 -73 -228 95
5323I5J04o7j13j10lK78q1np5j27J99j18J77l54J34J00P0j40l1J04p3j03J06R3
$$ 95 199 132 19 -91 -94 184 103 98 23 -104 95 -23 154 -200 -66 34 104 -36 -67 37 -36 -139 -33 60
5347F0nj33J03k7J56j65m8J26m4p5J15j69J54J21j68m3J35j90K52q1k1j64J09
$$ 60 55 -78 25 -2 154 -11 -59 67 23 -52 63 -106 48 169 1 -42 93 -97 155 74 53 -111 -2
5370bJ41j91K52k98R4r0O6J57k1j04j07K05rq9j68J20L3L2k00o7K16J13oQ7j39
$$ -2 139 -52 200 -98 -4 -94 -28 129 108 4 -103 102 93 4 -164 -44 -11 21 -179 -246 -30 83 77 164 25
5395B5j2m2J22j30jJ74j74Q0j2k09M07q6Nj53o5J15Jj87j24K51m5K51j99m4J1
$$ 25 13 -29 93 -37 -38 136 -38 42 30 -179 228 142 147 -6 -71 44 45 -142 -266 -15 -60 191 -8 -52 -41
5420d1O2N3k76J79j23Q5l13L61j32K86q5k66L19K37n12L15k81k4K08J54m29J63
$$ -41 21 74 -202 -23 -146 -61 -374 -13 -145 141 56 -210 109 346 -166 149 -132 -156 52 206 -223 -60
5442f0R2L0r4J5m7J26J8j69K10J02k96p3L12J9o0K9m9l00K54L0j34j33J25k5J20
$$ -60 32 62 -32 -17 -64 62 80 -89 121 223 -73 -146 166 185 125 154 105 -195 59 89 -45 -178 -53 -78 42
5467D2J47p3j43j25J75m2P3J95R7j11J1l71M41m17J08n5r9K16R5k53N2oj42L36
$$ 42 189 116 -27 -152 23 -19 54 249 346 235 246 -125 316 -101 7 -48 -147 69 164 -89 -37 -43 -185 151
5491A51k5j83Q0k57L18j93p8L02k92K59j09K4k00j2J40M5n3p9J61p4L5n6L7J06
$$ 151 126 -57 23 -234 84 -109 -187 115 -177 82 -27 -3 -203 -215 -75 -30 -83 -162 -1 -75 -40 -96 -59 47
5515D7k71N60l10k8O0j41m0J69k10J16q4O4O7k81L96j50p1m9J16N1p1J81k76L74
$$ 47 -224 336 26 -2 58 -83 -123 46 -164 -48 -132 -68 -1 -282 114 -36 -107 -156 -40 11 -60 121 -155 219
5539B19j81n8J56o6r2p8k33L36O2J23l14j35J65p3k17L20L36k80R4l65J89j51
$$ 219 38 -20 136 70 -22 -100 -333 3 65 188 -126 -261 -96 -169 -386 -66 270 -10 84 -281 -92 -243
5561b43L94j29K69n37K54j99j1J56J11J2K27L8m46J01l9j25k2K37j69l04R6K65
$$ -243 151 22 291 -246 8 -191 -202 -46 65 77 304 342 -104 -3 -42 -167 -189 48 -121 -425 -329 -64
5583f4LK45k48K30l52m0pJ55K58l41K99k61R7l65M60P5M0j53nnq6K35j03k55L27
$$ -64 -61 184 -64 166 -186 -226 -233 -78 180 -161 138 -123 -26 -391 69 144 184 31 26 21 -65 170 67 -188 139
5608A39pl05J69J00k55J5L86k48n0J09k48L38k09K26j53k8J69j59j97L74j72m
$$ 139 132 -173 -4 96 -159 -144 242 -6 -56 53 -195 143 -66 160 7 -21 148 -11 -208 166 -6 -10
5630a0P0K93l26j90J66K0P9l04L09j46J45j00O5n3r7j86K77p9R2k12J41o7M9l0
$$ -10 60 353 27 -163 3 23 102 -202 107 -39 106 6 71 18 -79 -265 12 -67 25 -187 -46 -113 -64 -94
5654i4k6K15Q5k32J42J04l33J38l34J27N54l92M8J35m22J48m7Q6Q0J03K3J73l76
$$ -94 -120 95 180 -52 90 194 -139 -1 -335 -208 346 -46 2 137 -285 -137 -184 -98 -18 85 108 281 -95
5677i5j65L00K1J2R9l32j5L44j9j85r7N4J39J6J90k00q0k15R0J1K57p2j24K5J30
$$ -95 -260 40 61 73 172 -160 -175 169 150 -35 -132 -78 61 77 267 67 -13 -228 -138 -127 130 58 -66 -41 89
5702H9k18L66k10J40k55L4K02l89L91m9j8K6q4L3r9J12J15l24O8P5q6J52l30J79
$$ 89 -129 237 27 167 -88 -54 148 -241 150 101 83 109 25 58 -41 71 186 -138 -70 5 -81 71 -259 -80
5726h0R5j15P6k22L75j39m9O6O2j29J19p2p4J13K1k87O4J82mQ9j26j17J91j02
$$ -80 15 -100 -24 -246 129 -10 -59 7 69 -60 59 -13 -87 26 47 -240 -176 6 2 91 -35 -152 39 -63
5750f3j24J99k29N2K27j79M8j16L06M5j59m8M1L7qpR7j52Q2J74k3k66r1K22j86
$$ -63 -187 12 -217 -165 62 -117 -69 -185 121 166 7 -41 0 37 29 22 119 -33 49 223 200 -66 -157 65 -121
5775a21K10j83K48k80K74k66L05k73M3J12j31J02q4J4J22MLP2j21l40M73K04k72
$$ -121 89 -94 154 -126 148 -118 187 -86 -43 69 -62 40 -44 -30 92 96 99 171 50 -290 183 387 115
$$ [...]
8191a23
##END NTUPLES=NMR FID
##END=
