##TITLE=1H_Set 7-3-i-4
 aceton-d6, 32 sc, 
 9.6.2020
##JCAMPDX= 6.0         $$ Bruker NMR JCAMP-DX V2.0
##DATA TYPE= NMR FID
##DATA CLASS= NTUPLES
##ORIGIN= UXNMR, Bruker Analytische Messtechnik GmbH
##OWNER= root
$$ XWIN-NMR		Version 3.5
$$ Tue Jun  9 13:26:27 2020 Russian Standard Time (UT+4h)  she@DPX200
##.OBSERVE FREQUENCY= 200.1315
##.OBSERVE NUCLEUS= ^1H
##.DELAY= (6, 6)
##.ACQUISITION MODE= SIMULTANEOUS
##.ACQUISITION SCHEME= undefined
##.AVERAGES= 32
##.DIGITISER RES= 18
##SPECTROMETER/DATA SYSTEM= spect
##.PULSE SEQUENCE= zg30
##.SOLVENT NAME= Acetone
##.SHIFT REFERENCE= (INTERNAL, Acetone, 0, 15.7039)
##AUDIT TRAIL= $$ (NUMBER, WHEN, WHO, WHERE, WHAT)
$$ ##TITLE= Audit trail, XWIN-NMR		Version 3.5
$$ ##JCAMPDX= 5.01
$$ ##ORIGIN= Bruker BioSpin GmbH
$$ ##OWNER= she
$$ F:/spectra/data/she/nmr/H-F/1/audita.txt
$$ ##AUDIT TRAIL=  $$ (NUMBER, WHEN, WHO, WHERE, WHAT)
(   1,<2020-06-09 13:25:45.60 +0400>,<she>,<DPX200>,
      <continue with go, POWCHK disabled, PULCHK disabled
       configuration hash MD5:
       00 E9 B6 7A A2 85 ED C7 34 08 36 98 17 FE 4E 26
       data hash MD5: 16K
       CB F0 01 2D 4C 24 25 29 E0 3A 9A 59 59 EE 78 7B>)
$$ ##END=
$$ 
$$ hash MD5
$$ DA 25 D4 73 F9 E6 B8 18 39 2C 86 12 72 26 6B 5F
##$RELAX= 
##$RELAX= 
##$RELAX= 
##$RELAX= 
##$RELAX= 
##$RELAX= 
$$ Bruker specific parameters
$$ --------------------------
##$DU= <F:/spectra>
##$EXPNO= 1
##$NAME= <H-F>
##$PROCNO= 1
##$TYPE= <nmr>
##$USER= <she>
##$AMP= (0..31)
100 100 100 100 100 100 100 100 100 100 100 100 100 100 100 100 100 100 
100 100 100 100 100 100 100 100 100 100 100 100 100 100 
##$AQSEQ= 0
##$AQ_mod= 1
##$AUNM= <au_zg>
##$AUTOPOS= <>
##$BF1= 200.13
##$BF2= 200.13
##$BF3= 200.13
##$BF4= 200.13
##$BF5= 200.13
##$BF6= 200.13
##$BF7= 200.13
##$BF8= 200.13
##$BYTORDA= 1
##$CFDGTYP= 0
##$CFRGTYP= 5
##$CHEMSTR= <none>
##$CNST= (0..31)
1 1 145 1 1 1 1 1 1 1 1 1 1 1 1 1 1 1 1 1 1 1 1 1 1 1 1 1 1 1 1 1 
##$CPDPRG= <>
##$CPDPRG1= <>
##$CPDPRG2= <>
##$CPDPRG3= <>
##$CPDPRG4= <mlev>
##$CPDPRG5= <mlev>
##$CPDPRG6= <mlev>
##$CPDPRG7= <mlev>
##$CPDPRG8= <mlev>
##$CPDPRGB= <>
##$CPDPRGT= <>
##$D= (0..31)
0 1.2 0 0 0 0 0 0 0 0.06 0 0.03 0 0 0 0 0.0002 0 0 0 0 0 0 0 0 0 0 0 0 
0 0 0 
##$DATE= 1591694605
##$DBL= (0..7)
120 120 120 120 120 120 120 120 
##$DBP= (0..7)
150 150 150 150 150 150 150 150 
##$DBP07= 0
##$DBPNAM0= <>
##$DBPNAM1= <>
##$DBPNAM2= <>
##$DBPNAM3= <>
##$DBPNAM4= <>
##$DBPNAM5= <>
##$DBPNAM6= <>
##$DBPNAM7= <>
##$DBPOAL= (0..7)
0.5 0.5 0.5 0.5 0.5 0.5 0.5 0.5 
##$DBPOFFS= (0..7)
0 0 0 0 0 0 0 0 
##$DE= 6
##$DECBNUC= <off>
##$DECIM= 24
##$DECNUC= <off>
##$DECSTAT= 4
##$DIGMOD= 1
##$DIGTYP= 9
##$DL= (0..7)
0 120 120 120 120 120 120 120 
##$DP= (0..7)
150 150 150 150 150 150 150 150 
##$DP07= 0
##$DPNAME0= <>
##$DPNAME1= <>
##$DPNAME2= <>
##$DPNAME3= <>
##$DPNAME4= <>
##$DPNAME5= <>
##$DPNAME6= <>
##$DPNAME7= <>
##$DPOAL= (0..7)
0.5 0.5 0.5 0.5 0.5 0.5 0.5 0.5 
##$DPOFFS= (0..7)
0 0 0 0 0 0 0 0 
##$DQDMODE= 0
##$DR= 18
##$DS= 0
$$ [...]
##$SUBNAM2= <"">
##$SUBNAM3= <"">
##$SUBNAM4= <"">
##$SUBNAM5= <"">
##$SUBNAM6= <"">
##$SUBNAM7= <"">
##$SUBNAM8= <"">
##$SUBNAM9= <"">
##$SW= 24.9337058887773
##$SWIBOX= (0..15)
0 0 2 0 0 0 0 0 0 0 0 0 0 0 0 0 
##$SW_h= 4990.01996007984
##$TD= 16384
##$TD0= 1
##$TE= 0
##$TE2= 300
##$TE3= 300
##$TEG= 300
##$TL= (0..7)
0 120 120 120 120 120 120 120 
##$TP= (0..7)
150 150 150 150 150 150 150 150 
##$TP07= 0
##$TPNAME0= <>
##$TPNAME1= <>
##$TPNAME2= <>
##$TPNAME3= <>
##$TPNAME4= <>
##$TPNAME5= <>
##$TPNAME6= <>
##$TPNAME7= <>
##$TPOAL= (0..7)
0.5 0.5 0.5 0.5 0.5 0.5 0.5 0.5 
##$TPOFFS= (0..7)
0 0 0 0 0 0 0 0 
##$TUNHIN= 0
##$TUNHOUT= 0
##$TUNXOUT= 0
##$USERA1= <user>
##$USERA2= <user>
##$USERA3= <user>
##$USERA4= <user>
##$USERA5= <user>
##$V9= 5
##$VALIST= <valist>
##$VCLIST= <CCCCCCCCCCCCCCC>
##$VD= 0
##$VDLIST= <DDDDDDDDDDDDDDD>
##$VPLIST= <PPPPPPPPPPPPPPP>
##$VTLIST= <TTTTTTTTTTTTTTT>
##$WBST= 1024
##$WBSW= 4
##$XGAIN= (0..3)
0 0 0 0 
##$XL= 0
##$YL= 0
##$YMAX_a= 187072
##$YMIN_a= -159866
##$ZGOPTNS= <>
##$ZL1= 120
##$ZL2= 120
##$ZL3= 120
##$ZL4= 120
##$ABSF1= 10
##$ABSF2= 0
##$ABSG= 5
##$ABSL= 3
##$ALPHA= 0
##$AQORDER= 0
##$ASSFAC= 0
##$ASSFACI= 0
##$ASSFACX= 0
##$ASSWID= 0
##$AUNMP= <proc_1d>
##$AZFE= 0.1
##$AZFW= 0.1
##$BCFW= 1
##$BC_mod= 2
##$BYTORDP= 1
##$COROFFS= 0
##$CY= 11.3945322036743
##$DATMOD= 1
##$DC= 2
##$DFILT= <>
##$DTYPP= 0
##$F1P= 16.9975609425685
##$F2P= -3.02152046262296
##$FCOR= 0.5
##$FTSIZE= 0
##$FT_mod= 4
##$GAMMA= 1
##$GB= 0.15
##$INTBC= 1
##$INTSCL= 1
##$ISEN= 128
##$LB= 0.24
##$LEV0= 0
##$LPBIN= 0
##$MAXI= 10000
##$MC2= 0
##$MEAN= 0
##$ME_mod= 0
##$MI= 1.114404
##$NCOEF= 0
##$NC_proc= 0
##$NLEV= 6
##$NOISF1= 3.799351
##$NOISF2= 2.8
##$NSP= 1
##$NTH_PI= 0
##$NZP= 0
##$OFFSET= 15.70392
##$PC= 1
##$PHC0= -9882.551
##$PHC1= 26.00088
##$PH_mod= 1
##$PKNL= yes
##$PPARMOD= 0
##$PSCAL= 0
##$PSIGN= 0
##$REVERSE= no
##$SF= 200.130013532006
##$SI= 16384
##$SIGF1= 3
##$SIGF2= 2
##$SINO= 400
##$SIOLD= 16384
##$SREGLST= <1H.CDCl3>
##$SSB= 0
##$STSI= 0
##$STSR= 0
##$SW_p= 3612.71676300578
##$SYMM= 0
##$S_DEV= 0
##$TDeff= 0
##$TDoff= 0
##$TI= <>
##$TILT= no
##$TM1= 0
##$TM2= 0
##$TOPLEV= 0
##$USERP1= <user>
##$USERP2= <user>
##$USERP3= <user>
##$USERP4= <user>
##$USERP5= <user>
##$WDW= 1
##$XDIM= 8192
##$YMAX_p= 0
##$YMIN_p= 0
$$ End of Bruker specific parameters
$$ ---------------------------------
##NTUPLES= NMR FID
##VAR_NAME=  TIME,          FID/REAL,        FID/IMAG
##SYMBOL=    X,             R,               I
##VAR_TYPE=  INDEPENDENT,   DEPENDENT,       DEPENDENT
##VAR_FORM=  AFFN,          ASDF,            ASDF
##VAR_DIM=   8192,          8192,            8192
##UNITS=     SECONDS,       ARBITRARY UNITS, ARBITRARY UNITS
##FACTOR=    0.0002004,     1,               1
##FIRST=     0,             0,               0
##LAST=      1.6414764,     0,               0
##MIN=       0,             -159866,         0
##MAX=       1.6414764,     187072,          0
$$ Real data points
##PAGE= N=1
##DATA TABLE= (X++(R..R)), XYDATA
$$ [...]
$$ plain form
279 -14050 -37508 -35059 -7166 26863 41270 24554 -9316 -34634 -34840 -11435 19628 37969 29172
292 29172 -1933 -31944 -37231 -14847 16357 34412 28679 3680 -24678 -36562 -21553 9845
304 9845 33402 31554 7222 -21001 -34197 -23761 3634 28907 32904 12280 -16794 -32662 -25178
317 -25178 -700 23998 32259 17192 -11134 -31334 -27833 -4257 20974 30635 19265 -5304 -26852
330 -26852 -29546 -10011 17244 30907 21336 -2609 -23354 -27706 -13316 10949 28273 24958 2627
343 2627 -21360 -28724 -15352 7947 25082 24924 7083 -16409 -28068 -18774 3909 22799 24995
356 24995 10095 -11826 -25911 -21516 -702 20801 26139 12256 -9330 -23226 -21216 -4717 15914
369 15914 25856 16648 -5240 -22448 -22261 -6456 12972 23240 17970 -222 -18913 -23684 -10411
$$ packed form
279a4050k3458K449K7893L4029J4407j6716l3870k5318k06K3405L1063J8341q797
292B9172l1105l0011n287K2384L1204J8055n733k4999k8358j1884J5009L1398
304I845K3557j848k4332k8223j3196J0436K7395K5273L997k0624k9074j5868P484
317b5178K4478K4698Q261j5067k8326k0200L501K3576K5231R661j1370k4569k1548
330b6852k694J9535K7255J3663r571k3945k0745m352J4390K4265J7324l315k2331
343B627k3987p364J3372K3299J7135j58j7841k3492j1659R294K2683J8890K196
356B4995j4900k1921j4085M395K0814K1503N338j3883k1586j3896K010J6499K0631
369A5914R942r208k1888j7208J87J5805J9428J0268n270j8192j8691m771J3273
$$ plain form
382 -10411 10461 22739 18497 1881 -15716 -22431 -13343 5898 20902 20260 4926 -13342 -21622
395 -21622 -15069 2069 18057 21086 8269 -10892 -21304 -15988 58 15197 19635 10756 -6364
408 -6364 -19606 -18504 -3410 13905 20085 11809 -4199 -16834 -18017 -6704 10101 19650 14526
421 14526 -1420 -15660 -17964 -7991 7354 17567 15671 2213 -13334 -18683 -10228 5357 16315
434 16315 15713 4479 -10302 -17992 -12623 2409 15231 16099 5787 -8000 -15912 -13370 -1336 12652
448 12652 17338 8701 -6544 -15896 -13398 -2299 10020 15689 10790 -2579 -14534 -15192 -4484 8937
462 8937 15095 11069 -180 -11716 -15252 -7390 6638 15289 12189 919 -10135 -14011 -8606 3357
476 3357 13685 13898 3472 -9128 -14085 -9037 1581 11118 13474 6258 -6331 -14321 -11016 317
$$ packed form
382a0411K0872J2278m242j6616j7597o715R088J9241J5004o42j5334j8268q280
395b1622O553J7138J5988L029j2817j9161j0412N316J6046J5139M438q879j7120
408f364j3242J102J5094J7315O180q276j6008j2635j183J1313J6805R549n124
421A4526j5946j4240k304R973J5345J0213j896j3458j5547n349Q455J5585J0958
434A6315o02j1234j4781p690N369J5032J2822Q68j0312j3787p912K542J2034J3988
448A2652M686q637j5245r352K498J1099J2319N669m899j3369j1955o58J0708J3421
462H937O158m026j1249j1536l536P862J4028Q651l100j1270j1054l876N405J1963
476C357J0328K13j0426j2600m957N048J0618R537K356p216j2589p990L305J1333
$$ plain form
490 317 10475 12684 6595 -3854 -12221 -12225 -2811 8978 13598 7925 -2894 -11075 -11716 -4495 6335
505 6335 12907 9791 -910 -10484 -11863 -5118 4603 11100 10210 1767 -8579 -12629 -7029 3547 10787
520 10787 10174 2834 -6398 -11544 -8624 1026 10034 11155 3961 -5549 -10597 -8541 -837 7811 11142
535 11142 6059 -3962 -10774 -9341 -1509 6681 10126 6801 -1547 -9283 -10290 -3382 5846 10188 7213
550 7213 -291 -7469 -9713 -5135 3780 10113 8589 660 -7081 -9290 -5339 2083 8438 9119 2824
565 2824 -5885 -9836 -6254 1391 7477 8486 3994 -3640 -9134 -7711 -130 7299 8758 4157 -2723
580 -2723 -7619 -7647 -2110 5541 9246 5724 -1896 -7489 -7519 -2715 3940 8247 6790 6 -6904 -8159
596 -8159 -3305 3434 7397 6568 1387 -5130 -8173 -4919 2336 7533 6889 1669 -4202 -7292 -5603 292
$$ packed form
490C17J0158K209o089j0449q367mR414J1789M620n673j0819q181o41P221J0830
505F335O572l116j0701r574j379O745R721O497q90q443j0346m050N600J0576P240
520A0787o13p340r232n146K920R650R008J121p194r510n048K056P704Q648L331
535A1142n083j0021o812J433P832Q190L445l325q348p736j007O908R228M342k975
550G213p504p178k244M578Q915O333j524p929p741k209L951P422O355O81o295
565B824q709l951L582P645O086J009m492p634n494J423P581P429J459m601o880
580b723m896k8N537P651L705l522p620n593l0M804O655M307j457o784o910j255
596h159M854O739L963q29n181o517l043L254P255N197o44n220n871l090J689N895
$$ plain form
612 292 6379 7651 2869 -3895 -7349 -5580 -415 4922 7009 4066 -2303 -7165 -6596 -1162 4615 6767
628 6767 4286 -1097 -5955 -6815 -2602 3645 6897 4858 -478 -5138 -6335 -3367 2149 6434 5900 657
644 657 -4937 -6477 -3320 1727 5425 5755 2104 -3451 -6582 -4470 1077 5414 5640 2289 -2344 -5558
660 -5558 -5137 -551 4725 6232 2850 -2268 -5295 -4836 -1327 3308 5921 4030 -1264 -5459 -5262 -1458
676 -1458 2792 5066 4220 211 -4409 -5784 -2465 2561 5126 3970 522 -3170 -5120 -3514 1163
691 1163 5221 5017 987 -3202 -4749 -3322 265 4020 5275 2354 -2523 -5078 -3532 269 3441
706 3441 4506 2751 -1144 -4575 -4493 -690 3400 4606 2642 -782 -3699 -4453 -1958 2319 4836 3404
722 3404 -548 -3650 -4087 -2016 1306 4028 3965 644 -3326 -4568 -2240 1345 3620 3580 1229 -2165
$$ packed form
612B92O087J272m782o764l454J769N165N337K087k943o369m862N69N434N777K152
628F767k481n383m858q60M213O247L252k039n336m660j197K968N516M285n34n243
644F57n594j540L157N047L698L30l651n555l131K112N547M337K26l351m633l214
660e558M21M586N276J507l382n118l027M59L509M635K613j891n294m195J97L804
676a458M250K274q46m009m620j375L319N026K565j156l448l692j950J606M677
691A163M058k04m030m189j547J427L587L755J255k921m877k555J546L801L172
706C441J065j755l895l431Q2L803M090J206j964l424k917p54K495M277K517j432
722C404l952l102m37K071L322K722o3l321l970j242K328L585K275m0k351l394
$$ plain form
738 -2165 -4351 -3185 543 3646 3799 1384 -1685 -3621 -3337 -503 3009 4282 2069 -1556 -3637 -3068
754 -3068 -656 2095 3770 2802 -518 -3630 -3736 -956 2061 3383 2559 172 -2555 -3802 -2024 1493
770 1493 3695 2882 169 -2282 -3200 -2190 556 3251 3511 911 -2186 -3334 -2082 298 2527 3324
786 3324 1745 -1400 -3477 -2600 176 2447 2855 1644 -597 -2720 -3055 -806 2224 3350 1855 -681
802 -681 -2473 -2690 -1255 1271 3126 2513 -187 -2567 -2859 -1235 948 2468 2494 567 -2041 -3131 -1725
819 -1725 865 2459 2266 688 -1345 -2716 -2251 77 2399 2728 971 -1265 -2420 -2042 -370 1712
835 1712 2783 1656 -879 -2609 -2204 -334 1540 2335 1708 -195 -2193 -2614 -895 1419 2406 1669 -26
852 -26 -1633 -2321 -1474 710 2448 2120 81 -1752 -2151 -1276 294 1812 2289 868 -1419 -2508 -1506
$$ packed form
738b165k186J166L728L103J53k415l069j936K84K834L512J273k213l625k081N69
754c068K412K751J675r68l320l112j06K780L017J322q24k387k727j247J778L517
770A493K202q13k713k451r18J010K746K695K60k600l097j148J252K380K229P97
786C324j579l145k077Q77K776K271M08j211k241k123l35K249L030J126j495k536
802f81j792k17J435K526J855o13k700k380k92J624K183J520K6j927k608j090J406
819a725K590J594j93j578k033j371M65K328K322L29j757k236j155L78J672K082
835A712J071j127k535j730M05J870J874P95o27j903j998m21J719K314R87p37j695
852b6j607o88Q47K184J738l28k039j833l99Q75J570J518M77j421k287j089J002
$$ plain form
869 -1506 384 1713 1959 1104 -632 -2163 -2008 -39 1867 2151 994 -517 -1601 -1814 -674 1295
885 1295 2425 1512 -515 -1783 -1661 -626 766 1925 1865 197 -1724 -2094 -795 830 1626 1491 504
902 504 -1064 -2056 -1423 539 1896 1644 335 -937 -1655 -1472 -125 1524 2023 746 -962 -1719 -1272
919 -1272 -171 1004 1738 1246 -428 -1784 -1633 -186 1130 1514 1050 -32 -1285 -1792 -797 926 1778
936 1778 1171 -119 -1145 -1487 -994 313 1563 1555 176 -1260 -1551 -811 240 1105 1385 662 -821 -1780
954 -1780 -1218 249 1244 1258 593 -413 -1346 -1446 -343 1158 1624 715 -515 -1141 -1099 -449 678 1530 1193
973 1193 -208 -1336 -1284 -340 611 1181 1168 255 -1054 -1545 -687 644 1220 928 241 -560 -1247 -1058 139
992 139 1322 1297 198 -763 -1045 -816 -177 825 1394 784 -605 -1334 -893 10 706 1066 846 -69 -1110
$$ packed form
869a506J890J329K46q55j736j531J55J969J906K84j157j511j084k13J140J969
885A295J130r13k027j268J22J035J392J159o0j668j921l70J299J625P96j35r87
902E04j568r92O33J962J357k52j309j272p18J83J347J649M99j277j708p57M47
919a272J101J175P34m92j674j356J51J447J316L84m64j082j253n07R95J723Q52
936A778o07j290j026l42M93J307J250qj379j436k91P40J051Q65K80p23j483r59
954a780N62J467R95J4o65j006r33j00J103J501M66r09j230o26M2O50J127Q52l37
973A193j401j128N2R44R51N70j3r13j309m91Q58J331N76k92o87q01o87J89J197
992A39J183k5j099r61k82K29O39J002N69o10j389p29M41R03O96L60k20r15j041
$$ plain form
1011 -1110 -1208 -206 885 1155 676 -47 -778 -1105 -601 546 1308 906 -75 -817 -943 -581 137 934 1101
1030 1101 304 -817 -1189 -597 228 748 800 384 -447 -1181 -999 23 905 957 310 -411 -870 -894 -296 605
1050 605 1110 604 -374 -897 -753 -239 410 875 780 20 -891 -998 -251 533 811 652 181 -503 -1000 -664
1070 -664 348 990 756 58 -467 -698 -589 -33 761 1015 328 -604 -900 -481 54 481 763 563 -267 -940
1090 -940 -786 32 591 633 386 16 -592 -885 -326 620 925 419 -195 -493 -551 -400 193 843 836 35 -700
1111 -700 -679 -203 206 553 698 342 -402 -859 -470 292 670 518 204 -206 -644 -637 -46 675 732 204 -330
1132 -330 -551 -548 -284 315 750 503 -265 -757 -540 -96 244 484 496 74 -581 -780 -293 399 574 366 36
1153 36 -346 -596 -473 126 661 589 22 -434 -469 -303 -51 385 633 308 -381 -678 -361 98 347 441 340
$$ packed form
1011a110r8J002J091K70m79p23p31l27N04J147P62m02r81p42j26L62P18P97J67
1030A101p97j121l72N92Q25N20N2m16q31p34J82J022Q82N2o47p21m59k4N98R01
1050F05N05n06r78n23J44N14O49M65r5p60r11j07P47P84K78j59m71o84m97L36
1070f64J012O42k34o98n25k31J09N56P94K54o87r32k96M19N35M27K82k00q30o73
1090i40J54Q18N59M2k47l70o08k93N59R46L05n06o14k98n8J51N93O50pq01p35
1111g00K1M76M09L47J45l56p44m57L89P62L78j52l14m10m38PN91P21N7n28n34
1132c30k21LK64N99M35k47p68m92K17M44L40K40J2m22o55j99M87O92J75k08l30
1153C6l82k50J23N99N35p2n67m56l5J66K52M36K48l25o89k97L17M59K49R4j01
$$ plain form
1174 340 -52 -586 -631 -75 484 539 203 -98 -323 -491 -319 272 697 410 -155 -436 -340 -146 88 448 576
1195 576 122 -475 -562 -147 229 344 348 288 -117 -574 -447 144 539 387 72 -178 -335 -407 -138 369 562 219
1217 219 -290 -432 -277 -110 176 445 395 -64 -511 -420 -57 259 324 276 97 -280 -509 -268 253 494 271
1238 271 -41 -215 -326 -300 7 429 523 61 -316 -396 -150 39 226 355 230 -163 -489 -340 72 306 265
1259 265 129 -75 -338 -457 -146 291 392 128 -153 -279 -283 -227 36 376 347 -82 -439 -357 -58 112 227 294
1281 294 145 -245 -497 -210 207 342 209 88 -48 -251 -310 7 388 375 56 -186 -177 -134 -47 183 422 287
1303 287 -163 -376 -170 68 149 224 269 60 -308 -437 -97 275 272 69 -45 -128 -306 -244 85 366 258 -99
1325 -99 -241 -207 -120 -26 212 340 106 -233 -323 -96 79 140 198 195 -54 -316 -268 56 306 222 26 -54 -138 -251
$$ packed form
1174C40l92n34m5N56N59N5l36l01k25j68J72N91M25k87n65k81R6J94K34L60J28
1195E76m54n97q7M15L76J15Mo0m05m57J27N91L95j52l15k50j57p2K69N07J93l43
1217B19n09j42J55J67K86K69n0m59m47R1L63L16O5m8j79l77k29K41N21K41k23
1238B71l12j74j11K6L07M22R4m62l77q0K46J89J87J29j25l93l26J49M12K34m1
1259B65j36k04k63j19L11M37J01k64k81j26mN6K63L40k9m29l57Q2K99J70J15O7
1281B94j49l90k52K87M17J35j33j21j36k03n9L17L81j3l19k42RM3Q7K30K39j35
1303B87m50k13K06K38Q1P5M5k09l68j29L40L72lk03j14q3j78O2L29K81j08l57
1325i9j42L4Q7R4K38J28k34l39r0K27J75O1N8lk49k62M8L24K50q4j96q0q4j13
$$ plain form
1349 -251 -167 175 337 152 -177 -270 -153 -71 11 187 254 9 -293 -309 -50 105 169 106 36 -150 -315 -228 91
1372 91 265 153 -24 -105 -164 -222 -84 208 320 67 -202 -223 -57 17 71 215 224 -41 -293 -239 80 214 131 94
1396 94 59 -95 -273 -144 198 285 91 -74 -81 -96 -123 2 228 282 -23 -226 -142 -24 10 92 213 158 -104 -282
1420 -282 -89 150 133 91 82 2 -149 -212 7 220 243 26 -108 -84 -120 -99 69 233 169 -100 -215 -119 -34 25 76
1445 76 152 34 -181 -255 -67 114 130 30 -27 -74 -176 -194 19 170 134 -40 -171 -117 -76 -53 60 181 96 -116
1469 -116 -198 -67 63 82 98 116 20 -154 -208 -5 169 127 24 6 -54 -137 -146 60 239 97 -73 -130 -71 -39 -36 74
1495 74 158 55 -171 -207 -44 59 47 53 101 -24 -181 -163 55 172 95 -22 -19 -30 -102 -44 142 215 73 -103 -108 5
1521 5 -6 50 158 190 29 -160 -119 36 105 42 69 108 -30 -160 -108 115 155 45 -39 -22 -66 -91 -39 104 187 15
$$ packed form
1349b51Q4L42J62j85l29r3J17Q2Q2J76O7k45l02j6K59J55O4o3p0j86j65Q7L19
1372I1J74j12j77q1n9n8J38K92J12k53k69k1J66P4N4J44Rk65k52N4L19J34q3l7
1396I4l5j54j78J29L42Q7j94j65pj5k7J25K26N4l05k03Q4J18L4Q2J21n5k62j78
1420b82J93K39j7m2rq0j51o3K19K13K3k17j34K4l6K1J68J64o4k69j15R6Q5N9N1
1445G6P6j18k15p4J88J81J6j00n7m7j02j8K13J51l6j74j31N4M1K3J13J21q5k12
1469a16q2J31J30J9J6J8r6j74n4K03J74m2j03j8o0q3rK06J79j42j70n7N9L2LJ10
1495G4Q4j03k26l6J63J03j2OM8j25j57J8K18J17p7j17Lj1p2N8J86P3j42j76nJ13
1521Ej1N6J08L2j61j89M1J55O9o3K7L9j38j30N2K23M0j10q4J7m4k5N2J43Q3j72
$$ plain form
1547 15 -130 -97 -28 -50 6 79 87 -61 -178 -118 43 95 15 0 11 -59 -151 -52 95 161 21 -71 -29 -43 -69 8 110
1574 110 140 -39 -121 -62 44 18 6 94 84 -62 -172 -61 105 109 7 1 33 -72 -149 -36 115 111 -42 -74 -6 -21
1600 -21 -41 20 136 98 -81 -115 -4 40 37 49 87 74 -80 -124 13 122 77 1 32 38 -64 -97 39 160 67 -73
1626 -73 -61 -24 -10 -34 62 128 62 -93 -99 11 48 -5 44 64 0 -121 -93 32 90 24 -22 6 -8 -64 -65 67 133 49 -62
1655 -62 -51 -5 -29 -57 81 103 17 -87 -76 8 49 11 5 27 -23 -97 -73 26 79 18 -42 -29 -61 -64 -70 52 75 3 -73 -89
1685 -89 2 2 5 45 92 -9 -108 -64 50 59 18 0 55 -8 -85 -62 72 141 22 -22 -1 4 -32 -23 83 113 -13 -81 -38 24
1715 24 15 18 70 68 -23 -107 -16 50 38 -3 36 54 -48 -103 -23 82 75 -37 -53 -3 -7 -66 -19 87 73 -22 -93 -18 23 -1 10
1746 10 48 45 -19 -57 -24 68 55 15 10 -1 -28 -60 1 84 58 -28 -42 6 -7 -41 15 99 48 -70 -52 19 36 3 2 25 28 -55
$$ packed form
1547A5j45L3O9k2N6P3Qj48j17O0J61N2q0j5J1p0r2R9J47O6j40r2M2j4k6P7J02
1574A10L0j79q2N9J06k6j2Q8j0j46j10J11J66Mj02oL2j05p7J13J51mj53l2O8j5
1600b1k0O1J16l8j79l4J11M4lJ2L8j3j54m4J37J09m5p6L1Oj02l3J36J21r3j40
1626g3J2L7J4k4R6O6o6j55oJ10L7n3M9K0o4j21K8J25N8o6m6K8j4n6jJ32O6q4j11
1655f2J1M6k4k8J38K2q6j04J1Q4M1l8oK2n0p4K4R9N3o1o0J3l2loJ22K3p2p6j6
1685h9R1%LM0M7j01r9M4J14Rm1j8N5o3p7K3J34O9j19m4K1Nl6RJ06L0j26o8M3O2
1715B4rLN2kr1q4R1O6j2m1L9J8j02n5Q0J05pj12j6N0mn9M7J06j4r5p1P5M1k4J1
1746A0L8lo4l8L3R2j3m0nj1k7l2O1Q3k6q6j4M8j3l4N6Q4n1j18J8P1J7l3jK3Lq3
$$ plain form
1778 -55 -100 -13 68 21 -19 -18 -17 -44 -81 5 67 25 -49 -70 0 -15 -32 12 76 34 -74 -65 29 43 6 -20 51 35 -69 -57 49
1809 49 97 32 -34 1 28 -39 -68 49 99 34 -47 -22 12 -7 -8 36 68 37 -62 -38 51 44 -4 14 44 11 -76 -52 40 70 -28
1840 -28 -18 12 11 -35 -5 46 58 5 -49 -3 -14 -34 -27 41 81 -22 -67 -52 45 2 -27 -12 1 -1 -64 -45 38 41 -6 -30 0 -16
1872 -16 -35 -19 16 49 3 -35 -6 3 -1 -7 41 34 -17 -58 -15 51 24 -31 21 51 -16 -70 -13 68 60 -27 -53 10 16 -31 -19 33 34 -29
1906 -29 -31 -20 22 -30 -31 -5 23 -50 -89 -5 26 22 -52 -9 24 -43 -47 20 60 20 -30 -13 65 21 -22 31 71 50 -37 -22 54 65
1938 65 -13 -8 45 34 -21 -43 -1 63 3 -25 -4 9 -29 -41 8 66 -6 -34 -29 -19 -5 -33 20 42 -18 -57 -47 23 2 -39 -13
1969 -13 23 -2 -87 -52 36 29 -10 -42 8 6 -21 -49 2 55 19 -37 -3 13 2 -12 -11 31 5 -42 -7 30 16 -23 -10 37 11 -27
2001 -27 -15 44 64 -25 -15 59 39 -21 -20 24 82 -31 -69 -1 34 -4 -30 19 49 0 -58 -34 23 29 -14 -4 22 14 -41 -18 30
$$ packed form
1778e5m5Q7Q1m7m0JJk7l7Q6O2m2p4k1P0j5j7M4O4m2j08RR4J4l7k6P1j6j04J2J06
1809D9M8o5o6L5K7o7k9J17N0o5q1K5L4j9jM4L2l1r9K4Q9pm8J8L0l3q7K4R2L0r8
1840b8J0L0jm6L0N1J2n3n4M6j1k0PO8M0j03m5J5R7m3k9J5J3ko3J9Q3Lm7k4L0j6
1872a6j9J6L5L3m6l8K9RmoM8pn1m1M3O6k7n5N2L0o7n4N7Q1qq7k6O3Om7J2N2Jo3
1906b9kJ1M2n2jK6K8p3l9Q4L1mp4M3L3o7mO7M0m0n0J7P8m4m3N3M0k1q7J5P6J1
1938F5p8NN3j1n5k2M2O4o0k8K1J3l8j2M9N8p2k8NJ0J4k8N3K2o0l9J0P0k1m1K6
1969a3L6k5q5L5Q8pl9l2N0kk7k8N1N3l6n6L4J6j1j4JM2k6m7L5L7j4l9J3M7k6l8
2001b7J2N9K0q9J0P4k0o0JM4N8j13l8O8L5l8k6M9L0m9n8K4N7Om3J0K6qn5K3M8
$$ plain form
2032 30 30 -32 -4 26 6 -27 20 71 34 -28 -43 36 29 -20 -15 51 78 -22 -50 0 59 15 -18 8 15 9 -40 -24 58 31 -22 -20 23
2065 23 22 -5 8 32 15 -31 13 18 -3 -23 -12 20 2 -57 -44 1 20 -25 -41 -17 9 -42 -63 -19 29 2 -60 -47 -2 -35 -50
2096 -50 -38 6 19 -53 -31 -13 36 -1 2 0 8 -28 -32 21 8 -15 -7 7 9 -12 -17 48 45 -8 -48 -5 43 -11 -47 25 59 6 -55 -15
2130 -15 60 19 -29 -31 24 37 -45 -37 23 9 -32 -34 -8 12 -10 -17 3 14 -25 -26 -10 -1 -48 -32 19 24 -40 -45 8 21 14 -7 -18 49 21
2165 21 -33 -1 46 32 -2 -23 24 18 -1 -20 28 60 -2 -51 -26 10 4 -3 6 8 6 -19 -22 0 -25 -25 -13 -21 -44 -40 3 26 -14 -25 -19 19
2201 19 6 -45 -26 18 23 -41 -47 35 29 -5 -46 -6 39 -19 -38 -26 15 24 -3 -12 40 36 -26 -26 33 -1 5 -12 5 -10 -25 20 20 0 -27
2236 -27 15 56 11 -42 10 65 29 -31 -46 27 33 -1 -38 -7 42 23 -46 -38 31 -6 -46 -44 -15 -13 9 -7 -6 2 -8 -10 -3 -12 0 -15 17
2271 17 -18 -28 -15 16 -1 -56 -38 30 16 -52 -28 31 54 2 -44 9 26 14 -1 -10 -1 19 -32 -34 -4 1 -2 -23 3 21 -15 -23 17
$$ packed form
2032C0%o2K8L0k0l3M7N1l7o2j5P9pm9NO6K7j00k8N0N9m4l3K6Pom9J6Q2k7n3KM3
2065B3jk7J3K4j7m6M4Nk1k0J1L2j8n9J3M5J9m5j6K4K6n1k1M4M8k7o2J3M5l3j5
2096e0J2M4J3p2K2J8M9l7LkQl6mN3j3k3QJ4Kk1nO5ln3m0M3M8n4l6P2L4n3o1M0
2130a5P5m1m8kN5J3q2QO0j4m1kK6K0k2pK0J1l9jJ6Rm7J6N1No4nN3J3pk1j1O7k8
2165B1n4L2M7j4l4k1M7oj9j9M8L2o2m9K5L6opRKkk5lK2k5%J2qk3MM3K3m0j1OL8
2201A9j3n1J9M4No4oQ2ol4m1M0M5n8j9J2M1Rk7rN2mo2%N9l4Oj7J7j5j5M5%k0k7
2236b7M2M1m5n3N2N5l6o0j5P3Ol4l7L1M9j9o9QO9l7m0KK9KK2j6JQj0kPrJ2j5L2
2271A7l5j0J3L1j7n5J8O8j4o8K4N9K3n2m6N3J7j2j5rRK0n1kL0Nlk1K6J8l6qM0
$$ plain form
2304 17 13 -13 -1 17 11 -14 -9 8 -12 -59 -23 11 1 -52 -63 -8 36 -23 -77 -8 30 -4 -61 -18 17 23 -25 -48 29 34 -22 -23 1
2337 1 19 -22 6 9 23 -3 24 28 32 -7 0 24 42 -11 1 29 42 2 -19 40 32 -2 -44 53 64 10 -24 -24 26 11 -31 -27 30 0
2371 0 -38 -26 -12 -3 -1 -22 5 -1 -12 -20 -1 8 -8 -4 0 14 -11 7 21 35 -30 -22 -2 -9 -15 -24 4 23 15 -38 -18 48 40 -13 -26 2 22
2408 22 0 -22 15 36 -9 -23 28 5 13 -3 -20 23 -3 -12 -22 41 -40 -11 11 23 -12 -31 1 44 1 -41 21 16 -7 -19 -53 15
2440 15 14 -22 -43 11 39 -9 -50 -3 36 0 -35 -11 14 4 -17 -6 15 10 -16 -2 24 -15 4 24 34 16 -12 -9 25 1 -37 -14
2472 -14 27 28 -31 -15 36 23 -16 -31 20 25 -11 -7 23 40 27 -14 -1 -3 23 -30 20 0 -1 -22 -28 -27 0 7 -4 2 -19 -20 -11 7 -11 -11
2508 -11 -2 14 -1 -22 -47 7 20 -5 -15 29 21 -10 -16 9 37 16 -13 13 46 33 12 -5 34 21 -9 -34 10 22 -6 -19 14 22
2540 22 -12 5 11 5 -18 1 28 5 -22 -14 7 29 -37 -10 -22 8 0 -36 -22 15 -29 -18 1 45 16 -4 13 24 9 -15 -9 28 39
$$ packed form
2304A7mk6J2J8ok5NJ7k0m7L6L4j0n3j1N5M4n9n4O9L8l4n7M3L5Om8k3P7Nn6jK4
2337AJ8m1K8LJ4k6K7MMl9PK4J8n3J2K8J3m0k1N9ql4m2R7J1n4l4%N0j5m2MN7l0
2371@l8J2J4RKk1K7oj1qJ9Rj6MMJ4k5J8J4J4o5QK0porK8J9qn3K0O6qn3j3K8K0
2408B2k2k2L7K1m5j4N1k3Qj6j7M3k6rj0O3q1K9K2J2l5j9L2M3m3m2O2nk3j2l4O8
2440A5jl6k1N4K8m8m1M7L9l6l5K4K5j0k1J1K1nk6J4K6l9J9K0J0j8k8LL4k4l8K3
2472a4M1Jn9J6N1j3l9j5N1Nl6ML0J7j3m1J3kK6n3N0k0jk1oJK7Pj1Ok1jRJ8j8%
2508a1RJ6j5k1k5N4J3k5j0M4ql1oK5K8k1k9K6L3j3k1j7L9j3l0k5M4J2k8j3L3Q
2540B2l4J7Ook3J9K7k3k7QK1K2o6K7j2L0ql6J4L7m4J1J9M4k9k0J7J1j5k4OL7J1
$$ plain form
2573 39 6 -2 25 10 5 19 22 23 -8 -10 34 13 3 7 13 26 -29 -15 34 32 9 -32 -30 22 -8 -5 -18 -1 1 -28 -14 6 19 -1 -36 -3
2609 -3 -9 -31 -36 -21 24 5 -12 -1 9 8 -10 1 3 -3 -22 -2 8 8 -18 37 18 -11 -8 -14 28 12 -15 -25 22 29 -7 -14 34 16 3 -21
2645 -21 7 21 14 -7 -11 19 -24 -15 18 21 -1 -25 -4 10 -1 -7 -15 35 -20 -34 13 27 -29 -29 2 26 -15 -36 -27 18 -12 -24 -12 13
2679 13 35 -38 -7 -1 4 -16 16 4 15 -25 9 0 14 5 -14 -10 4 -2 -6 13 10 29 -7 -3 27 8 -10 -8 19 20 1 -31 -20 23 -4 7
2715 7 -5 1 -22 -1 -19 2 -7 -21 7 22 0 -39 -4 3 15 -16 11 -9 -14 -13 5 16 -5 -29 -18 -7 -6 -11 -7 10 18 -15 -34 17 28
2750 28 -14 -25 13 22 3 -11 -3 47 -3 7 11 43 17 -3 43 46 33 13 -7 36 0 -3 0 7 22 -13 22 29 -26 -38 -16 -13 -15 -34 -9
2785 -9 17 8 -24 -31 -13 5 -13 9 -21 27 3 -27 15 1 7 -9 2 18 -4 -3 -3 -4 3 -22 -16 -2 4 -16 23 8 2 3 -10 19 12 9 -18
2822 -18 10 -2 -4 3 -3 11 6 -11 -3 13 4 -16 -8 23 -2 -31 -30 12 0 -21 -15 8 -4 -15 -13 -20 -2 -12 -19 15 -2 -23 -23 -19 28 -26 -2
$$ packed form
2573C9l3qK7j5nJ4LJl1kM4k1j0MOJ3n5J4M9kk3m1KN2l0Lj3J7Kk9J4K0J3k0l5L3
2609cok2nJ5M5j9j7J1J0jj8J1Koj9K0J0%k6N5j9k9LoM2j6k7j0M7Pl6pM8j8j3k4
2645b1K8J4pk1mL0m3RL3Lk2k4K1J4j1oqN0n5j4M7J4n6%L1K4m1k1RM5l0j2J2K5
2679A3K2p3L1ONk0L2j2J1m0L4rJ4rj9MJ4omJ9lJ9l6ML0j9j8KK7Jj9l2J1M3k7J1
2715Gj2Ok3K1j8K1rj4K8J5k2l9L5PJ2l1K7k0nJJ8J1k1k4J1J1JnMJ7Ql3j9N1J1
2750B8m2j1L8Rj9j4QN0n0J0ML2k6k0M6Lj3k0k0M3l6lLPJ5l5L5Pn5j2K2Lkj9K5
2785iK6rl2pJ8J8j8K2l0M8k4l0M2j4Oj6J1J6k2J%jPk5OJ4Ok0L9j5oJj3K9plk7
2822a8K8j2kPoJ4nj7QJ6rk0QL1k5k9JM2j2k1OK3j2j1KpJ8j0pL4j7k1%MM7n4K4
$$ plain form
2859 -2 -7 3 6 -7 13 15 -2 -25 -23 17 -3 5 -7 13 0 -21 5 10 14 -23 -12 24 19 -4 3 7 21 -21 11 4 4 -10 -19 -23 9 14 -22 -18 -2
2898 -2 16 -2 -4 3 -4 -12 -5 6 12 -10 -16 16 0 -7 -11 1 -4 -21 -10 -4 9 -14 -38 -14 9 -18 -12 -1 18 12 12 -1 -7 24 -19 -7 -16 7 19
2937 19 -15 31 10 -17 13 32 10 -4 16 15 19 5 -23 -10 -16 -13 -22 0 -9 -10 -22 -3 19 -11 -15 -12 7 -7 -9 -2 13 -7 -27 -11 -5 18
2973 18 -25 -32 -1 8 0 -5 14 9 17 -16 18 20 -3 11 26 33 8 6 8 28 6 -1 -9 18 22 -24 12 27 38 13 13 25 3 -5 -1 27 7 -21
3011 -21 -10 15 11 -10 -36 4 10 -23 -19 -6 28 -12 -12 -7 9 -12 -9 4 20 -22 -20 -20 19 12 -14 -5 1 0 6 -19 15 -2 -7 1 36 -1 -26 -22
3049 -22 30 36 -7 22 -11 -18 -2 9 16 2 -32 -10 14 38 -12 -9 -4 9 17 -28 -19 35 2 -1 -1 4 3 6 -14 0 -20 -11 -32 13 7 -11 -18 1
3087 1 5 5 -32 -9 -12 1 -21 1 21 8 -5 -5 14 -12 0 16 18 12 -12 7 9 8 -14 13 14 4 3 -16 23 -1 -10 1 -24 25 5 -11
3123 -11 -4 9 -11 4 5 -3 -8 -11 -5 -10 -16 -18 -5 -1 -13 -8 -16 -2 -17 -9 -11 13 -2 10 -28 0 15 -15 -23 -7 -15 0 -4 13 6 -5 -17 16 12 4
$$ packed form
2859bnJ0Lj3K0Kj7k3KM0k0Qj2K0j3k1K6NMl7J1L6nk3PMJ4m2L2p%j4rmL2Nl6MJ6
2898bJ8j8kPpqPJ1Ok2oL2j6pmJ2nj7J1OJ3k3k4K4K3k7OJ1J9o%j3oL1m3J2rK3J2
2937A9l4M6k1k7L0J9k2j4K0jMj4k8J3oLrK2rjj2J9K2l0mLJ9j4kPJ5k0k0J6OK3
2973A8m3pL1RqnJ9nQl3L4Kk3J4J5Pk5kKK0k2pqK7Mm6L6J5J1k5%J2k2qMK8k0k8
3011b1J1K5mk1k6M0Ol3MJ3L4m0%NJ6k1LJ3J6m2K%L9pk6ROjOk5L4j7nQL5l7k5M
3049b2N2Om3K9l3pJ6J1Pj4l4K2K4K4n0LNJ3Qm5RN4l3l%NjLk0J4k0Rk1M5oj8pJ9
3087AM%l7K3lJ3k2K2K0j3j3%J9k6J2J6Kok4J9Kjk2K7Jj0jj9L9k4rJ1k5M9k0j6
3123a1PJ3k0J5JqnlOnokJ3Mj2NqJ4j5QkK4j5J2l8K8J5l0qJ6qJ5mJ7pj1j2L3mq
$$ plain form
3163 4 0 1 7 14 -16 8 13 24 -3 2 22 27 2 4 10 -20 -3 -4 3 -15 -6 -4 1 17 -32 -31 -14 14 -8 -11 12 -6 -25 2 14 -4 -12 -5 -1 17
3203 17 -8 -35 -16 -4 -32 -31 -13 -17 11 2 -11 7 -1 5 8 19 12 21 17 8 -5 -2 8 4 38 14 -7 -5 24 9 3 5 38 9 5 -1 3 -2 -23 6
3243 6 18 28 -12 -4 12 8 -33 -12 -16 12 -7 -8 4 9 1 -4 26 16 11 -4 -1 19 12 5 17 41 23 -19 20 -1 -10 -11 -9 -2 13 17 -1 14 9
3282 9 17 39 35 29 19 -1 -10 22 0 -4 8 3 0 -1 14 24 24 19 31 27 17 -9 25 30 14 -11 -11 23 17 -4 11 7 11 17 -13 -8 -1 -5 -15 -9 9
3323 9 -2 7 0 2 -1 0 17 23 5 -8 -15 8 15 -8 8 1 15 -3 31 30 -6 7 -27 8 8 4 -16 -7 9 3 -31 -4 13 -5 -9 -8 14 -21 15
3362 15 11 15 -9 -2 -30 7 16 -10 -23 3 8 -5 -5 -20 -30 -17 -17 22 1 -7 -18 -8 11 12 -8 3 -22 6 -44 6 -12 -9 16 -10 21
3397 21 -8 -7 21 8 13 7 18 26 16 8 -12 23 9 -1 0 22 7 10 -6 9 12 -16 -4 4 8 -2 -3 0 16 9 -10 2 -2 -19 -17 -9 -6 10 -20
3436 -20 -14 28 30 10 3 -17 21 -1 8 10 -9 -9 -10 16 12 0 5 3 -2 -9 -1 22 10 28 -13 25 22 0 -6 20 21 19 -2 24 27 22 -13 -14 -5 9 -22
$$ packed form
3163DmJOPl0K4NJ1k7NK0Nk5KOl0J7jPj8RKNJ6m9JJ7K8k2lK3j8j9K7J2j8qPMJ8
3203A7k5k7J9J2k8JJ8mK8rj3J8qOLJ1pRmrj3LJ0mL4k4k1KK9j5oKL3k9moMnk1K9
3243FJ2J0m0QJ6mm1K1mK8j9jJ2NqnL0j0nj5LK0ppJ2K4j8m2L9k1rjKPJ5Mj8J5n
3282IQK2moj0k0rL2k2mJ2nljJ5J0%nJ2mj0k6L4Nj6k5%L4ok1J5mMOl0NPmj0OJ8
3323Ij1RpKlJJ7Oj8j3pK3Pk3J6pJ4j8L4jl6J3l4L5%mk0RJ6ol4K7J7j8mJK2l5L6
3362A5mMk4Pk8L7Rk6j3K6Nj3%j5j0J3%L9k1qj1J0J9Jk0J1k5K8n0N0j8LK5k6L1
3397B1k9JK8j3NoJ1Qj0qk0L5j4j0JK2j5Lj6J5Lk8J2QMj0jLJ6pj9J2mj7KQLJ6l0
3436b0OM2Kk0pk0L8k2RKj9%jK6mj2NknpQK3j2J8m1L8lk2oK6Jkk1K6Lnl5jRJ4l1
$$ plain form
3477 -22 -18 15 10 -21 -20 4 -3 6 -3 15 -5 8 -10 12 -18 -1 -4 -1 -16 -27 6 3 17 -12 17 9 6 5 3 -3 21 11 -8 10 8 23 22 -6
3515 -6 14 32 -4 0 6 21 3 -12 0 9 1 7 10 6 11 -7 9 -1 8 -8 4 2 5 19 -5 8 -8 6 -1 12 -6 6 14 -1 -17 -21 2 -11
3553 -11 -18 1 -5 -7 -6 9 -18 1 16 24 -22 5 7 -10 -22 -19 27 12 1 -10 16 2 -11 -10 19 27 8 19 4 11 13 -14 -1 21 15 30
3589 30 10 20 5 -10 -13 -12 1 -7 4 10 -2 -2 -10 11 -8 -13 -30 -7 9 2 -5 -7 -11 -30 -8 3 0 -21 -5 -4 -12 -3 -5 3 13 -7 3 18 -4
3628 -4 0 9 10 -11 -18 -15 0 -16 11 -4 22 43 28 13 12 8 8 3 -25 -8 8 -5 17 1 16 8 -25 20 -12 -15 -5 2 -15 -23 -32 -29 17 -26
3666 -26 -17 -17 -8 -7 -11 -10 12 -20 -30 2 -8 5 -31 8 12 10 -14 -13 19 -6 -6 -5 3 12 7 -10 18 7 -8 10 33 12 16 21 0 15 8 -10 -11
3705 -11 7 11 13 -7 -3 28 9 -6 28 -9 13 5 -6 2 -15 8 3 -2 -5 2 3 11 12 13 -3 -11 -8 -23 -20 13 -7 -3 5 17 22 -3 -2 5 5 -1 3 21
3747 21 0 -12 -18 11 -1 1 -5 21 -4 -8 0 10 22 20 16 4 -3 -5 2 19 11 -11 -1 -16 -1 1 -28 -5 -2 -11 8 -13 -8 2 -30 -1 20 -6
$$ packed form
3477b2ML3nl1JK4pRrJ8k0J3j8K2l0J7lLj5j1L3lJ4k9K9qljkoK4j0j9J8kJ5jk8
3515fK0J8l6MOJ5j8j5J2RqOLmNj8J6j0Rj6J2kLJ4k4J3j6J4pJ3j8J2Qj5j6mK3j3
3553a1pJ9okJJ5k7J9J5Qm6K7Kj7j2LM6j5j1j1K6j4j3JK9Qj9J1j5PKk7J3K2oJ5
3589C0k0J0j5j5lJJ3qJ1Oj2%qK1j9nj7K3J6ppkmj9K2J1lk1J6JqRkQJ0k0J0J5k2
3628dMRJk1pLJ5j6K7j5K6K1j5j5jm%nk8J7J6j3K2j6J5ql3M5l2lJ0Pj7qrLM6m3
3666b6R%RJmJK2l2j0L2j0J3l6L9Mkk4JL2k5%JQRnj7K8j1j5J8K3k1MNk1J5pj8j
3705a1J8MKk0ML1j9j5L4l7K2qj1Qj7K3nnlPJQJJj6qLj5LL3k0MQJ2Nk5JP%oMJ8
3747B1k1j2oK9j2KoK6k5mQJ0J2kmj2pkPJ7qk2J0j5J5Kk9K3LrJ9k1NJ0l2K9K1k6
$$ plain form
3785 -6 -15 -25 -3 3 -22 -17 -17 -29 -26 2 -11 5 -10 8 9 14 14 12 -3 -6 5 9 -10 -4 -10 9 5 1 30 0 12 22 2 -6 -19 31 25 -1 -5 0
3825 0 32 26 -1 2 4 -12 8 -9 14 4 -12 1 -9 0 5 0 -7 -37 -4 -4 -22 -2 -15 -37 2 -22 -31 -8 5 -3 -8 -20 6 8 -11 7 8
3862 8 20 13 1 -18 20 -6 -12 1 20 23 16 5 -5 17 -13 24 0 1 1 -2 -2 15 -7 -12 17 -4 -36 16 -18 22 -14 -44 11 12 -2 -40
3898 -40 -17 19 0 -5 8 22 -13 -21 -22 -14 -26 -13 -11 7 -13 -15 2 -16 -9 9 -1 5 19 5 -18 -1 28 21 -12 -20 7 -25 13 -9 -1 -26
3934 -26 3 19 17 22 1 -15 2 15 2 -18 0 -12 -10 3 1 19 -6 -4 -8 5 -11 -24 0 -10 20 1 -7 -7 -4 -9 -8 5 8 0 -1 15 10 -13
3972 -13 11 -1 12 -6 8 -13 0 -11 5 2 11 -6 -20 23 21 -4 -4 14 21 -19 3 -11 2 16 -6 -21 18 9 -6 17 0 2 3 2 13
4007 13 -27 -32 13 -8 -17 -10 15 -6 -16 -20 17 -14 -16 -8 -8 10 7 -8 -26 8 -1 -17 -14 10 -24 8 -9 9 -9 -10 11 3 11 -1 -4 9 35
4044 35 -3 9 10 16 27 3 -10 16 5 -17 6 -2 8 -10 -9 5 9 -14 -14 23 -7 6 -11 17 -3 -8 -12 -8 -1 -9 -14 -14 -28 -5 -11 0 -14
$$ packed form
3785frj0K2Ok5N%j2LK8j3J6j5J8JN%kj5lJ1Mj9OoJ9mmK9l0J2J0k0qj3N0ok6mN
3825@L2ok7LKj6K0j7K3j0j6J3j0RNnpl0L3%j8K0j3k2L9k4rK3J3qnj2K6Kj9J8J
3862HJ2pj2j9L8k6oJ3J9Lpj1j0K2l0L7k4J%l%J7k2nK9k1l2N2l4M0l6l0N5Jj4l8
3898d0K3L6j9nJ3J4l5qjQj2J3KJ8k0kJ7j8PJ8j0OJ4j4k3J7K9pl3qK7l2L8k2Qk5
3934b6K9J6kNk1j6J7J3j3k0J8j2KJ3kJ8k5KmJ3j6j3K4j0L0j9q%LnJJ3LqjJ6nk3
3972a3K4j2J3j8J4k1J3j1J6lRj7j4M3kk5%J8Pm0K2j4J3J4k2j5L9rj5K3j7KJjJ1
4007A3m0nM5k1rPK5k1j0mL7l1kQ%J8lj5j8L4rj6LK4l4L2j7J8j8jK1qQj2lJ3K6
4044C5l8J2JOJ1k4j3K6j1k2K3qJ0j8JJ4Mk3%L7l0J3j7K8k0nmMPqn%j4K3oJ1j4
$$ plain form
4081 -14 11 -18 20 0 -1 -10 -7 -4 -1 -3 -1 1 -8 7 1 -8 -5 8 6 10 11 5 8 -10 -1 -6 6 -10 9 18 21 19 11 11 -17 31 6 0 11 4 10 11 -13 -4 3
4126 3 7 -23 -6 -1 -3 1 -9 8 24 -14 1 -20 15 8 -18 -1 -22 -34 -18 3 -7 3 -11 9 0 -7 -1 -2 1 -13 -8 -2 2 -2 11 29 3 32
4164 32 22 2 11 12 2 -3 4 40 17 -23 17 16 3 -20 5 1 10 0 19 -8 -9 -23 -5 4 9 -4 -13 -23 -28 -27 -14 -13 12 1 5 30 15 8
4202 8 -21 -11 1 -13 16 1 9 -4 -23 1 10 20 -3 -10 2 -6 1 15 12 -4 -9 -20 7 5 -9 0 33 4 -20 11 -10 25 4 -13 -6 31
4238 31 -6 -11 -24 3 -13 -21 -5 -26 -24 -7 -36 -16 0 -25 -26 -12 4 7 3 -6 -13 -7 -7 4 -1 -11 19 -8 -13 -12 -25 -12 13 -5 11 -7 -27
4275 -27 -16 0 -5 -10 15 2 26 8 9 -20 -5 6 -9 1 -1 2 -8 10 -14 18 5 -6 11 22 7 -4 -6 6 -9 3 -19 -12 -15 6
4309 6 -28 -20 -10 -7 -29 0 -13 -16 -1 20 1 -8 12 -4 -13 -6 15 10 -1 -1 13 0 -5 5 7 -4 8 4 -7 7 -12 1 15 -17 11 6 -21
4346 -21 -3 15 32 -6 -3 -38 4 -5 -10 -17 -5 -9 -16 5 -13 -14 1 -16 -23 12 -1 -5 -5 -12 -4 -15 -4 -3 -11 -10 -13 22 -18 -7 -4 9 -16 11 -10
$$ packed form
4081a4K5k9L8k0jrLLLkKKrJ5orLJ3kMJoLj8RnJ2j6J9RLkq%k8M8k5oJ1pOJk4RP
4126CMl0J7NkMj0J7J6l8J5k1L5pk6J7k1j2J6K1j0J0j4K0rpOjLj4NOMmJ3J8k6K9
4164C2j0k0RJj0nPL6k3m0M0jj3k3K5mRj0J9k7jj4J8RNj3rj0nJJ3JK5j1MK5j5p
4202Hk9J0J2j4K9j5Qj3j9K4RJ0k3pJ2qPJ4lj6nj1K7kj4RL3k9k4L1k1L5k1j7PL7
4238C1l7nj3K7j6qJ6k1KJ7k9K0J6k5jJ4J6LmrpO%J1nj0L0k7nJj3J3K5j8J6j8k0
4275b7J1J6nnK5j3K4j8Jk9J5J1j5J0kLj0J8k4L2j3j1J7J1j5j1kJ2j5J2k2PlK1
4309Fl4QJ0Lk2K9j3lJ5K1j9rK0j6rPK1nj1%J4j3nJ0Kj1J2mj1J4j9J3J4l2K8nk7
4346b1J8J8J7l8Ll5M2rnpJ2mpK1j8jJ5j7pL5j3m%pQj1J1JqJlL5m0J1LJ3k5K7k1
$$ plain form
4385 -10 2 1 -20 -6 -8 9 -4 -5 24 9 1 -4 8 0 9 7 6 11 17 7 6 11 -4 9 5 20 -16 -4 16 1 -28 -17 16 9 -18 -21 2 -14
4423 -14 8 9 17 -19 -5 -19 -12 -17 -11 -8 -30 -24 -23 -2 -17 1 -24 -13 -15 -12 -3 -12 -4 3 -8 -6 5 -14 14 17 -1 1 3 -8 0 -1 31 8 11 13 1
4464 1 15 20 19 -2 4 7 -4 23 -3 -8 -4 -16 -4 -1 -12 3 12 -9 -7 -2 -26 -20 -22 -17 -15 -22 -2 -9 -14 -56 -13 -1 5 9 -1 -4 0 -17 -7 -6 10 13
4506 13 -15 -16 18 4 -18 -1 11 -1 13 -9 11 14 39 11 6 5 4 33 -1 -1 0 7 2 -9 -15 -12 -17 -14 -13 -28 16 -1 -11 -29 -15 20 2
4543 2 -11 -5 -19 -17 -2 -24 -8 -26 -7 -9 9 -4 -1 14 -4 5 21 14 5 11 -10 -12 -10 -3 -9 4 -3 5 2 -25 -5 -12 -7 -35 0 -22 -12 17 -4
4582 -4 3 4 -1 -7 19 -6 -1 8 15 -1 -2 8 -5 6 14 -1 -17 0 4 1 -16 8 10 -7 -13 -3 -7 -15 -36 4 -21 -3 -17 -9 15 -12 2 -1 -19
4621 -19 0 15 1 14 -10 3 17 5 25 14 11 -29 16 20 6 13 22 17 -5 24 6 3 5 -2 -7 -9 -5 -27 14 5 -17 -2 -20 -25 -16 -29 -7
4658 -7 -22 -12 -10 14 -9 -23 -22 -13 11 -8 9 -23 -1 -10 -6 -2 -6 2 18 5 9 27 -5 -2 4 26 30 -3 6 26 -2 8 32 4 15 8 -1 4 1
$$ packed form
4385a0J2jk1J4kJ7j3jK9j5qnJ2qRkjNOj0jNj5J3mJ5l6J2K0j5k9J1L3pk7lK3j6
4423a4K2JQl6J4j4PnOLk2OJK1j5J8k5J1kLRrQPj1KJ1j9K8Lj8KKj1QjL2k3LKj2
4464AJ4Njk1OLj1K7k6nMj2J2Lj1J5Rk1KNk4OkNKpK0pnm2M3J2OMj0lMj7J0JJ6L
4506A3k8jL4j4k2J7J2j2J4k2K0LK5k8njjK9l4%JPnj1oLnLJj5M4j7j0j8J4L5j8
4543Bj3Oj4KJ5k2J6j8J9kJ8j3LJ5j8RJ6prOk1kKPoJ3pQlk7K0pNk8L5k2J0K9k1
4582dPJnoK6k5NRPj6jJ0j3J1Qj5j6J7Mlj7K4Kj7oJ0mqk1M0k5J8j4QK4k7J4lj8
4621a9J9J5j4J3k4J3J4j2K0j1lm0M5Mj4PRnk2K9j8lKpnkMk2M1rk2J5j8nRj3K2
4658gj5J0KK4k3j4JRK4j9J7l2K2rMMmQJ6j3MJ8l2LOK2Ml3RK0k8J0K4k8J1prNl
$$ plain form
4697 1 17 -13 1 25 -4 -4 11 -6 4 -16 -11 -7 -11 22 -9 6 -7 -4 -6 -21 -3 2 -2 2 -3 -21 2 -20 14 -20 -9 0 7 4 2 -17 -24 -25 -20
4736 -20 9 -4 3 -16 -17 -8 8 -4 6 2 -13 19 -8 29 14 -23 22 20 -4 3 30 22 4 3 12 0 -21 2 -16 2 -7 -13 -8 -7 -38 0 -27
4773 -27 -15 -41 -9 6 -14 12 -22 -17 9 -5 -3 -27 -13 -24 -16 -4 10 -14 -28 3 0 -17 -6 18 3 12 3 -5 -4 -10 5 -17 18 13 14 15
4809 15 -1 5 -27 5 14 0 -6 18 -2 -17 -12 -4 -11 -5 11 -5 8 7 7 8 -15 -16 -11 -27 -20 -2 -14 -10 13 -21 -9 -1 8 -4 -23 -18 -14 -32 -34 -9
4849 -9 7 4 9 5 -18 0 1 36 24 -11 -1 20 12 20 -1 1 8 -2 -11 3 2 33 10 4 3 11 -17 -16 -5 -6 -18 -3 8 -12 8 -5 -18 -36
4887 -36 3 -12 -16 -21 -1 -1 -15 -16 -10 -6 -2 -5 3 -21 -9 -10 -22 -4 -16 -4 10 -7 11 -1 21 2 -3 -6 4 11 7 -2 -11 10 -10 2 6 19 3
4926 3 13 -14 -7 -7 -1 8 -2 -2 -4 4 13 -9 18 1 -16 15 18 -13 11 -10 -7 -3 -24 -22 4 19 -21 -3 -7 10 -7 5 -4 3 1 -4 0 22 -3 -2
4966 -2 -2 3 10 -5 29 2 15 18 34 -2 -6 -3 5 -4 35 -23 11 12 -6 -3 -17 20 9 8 4 0 5 20 0 4 -8 15 21 10 0 -2 28 -19 -3
$$ packed form
4697AJ6l0J4K4k9%J5j7J0k0NMmL3l1J5j3Lkj5J8NmMnj8K3k2L4l4J1RPlkj9pjN
4736b0K9j3Pj9jRJ6j2J0mj5L2k7L7j5l7M5kk4PK7qj8jRj2k1K3j8J8roNJl1L8k7
4773b7J2k6L2J5k0K6l4NK6j4Kk4J4j1QJ2J4k4j4L1lj7J1K4j5RrqJoJ5k2L5nJJ
4809A5j6Ol2L2Rj4oK4k0j5NQpOJ6j6J3j%Jk3jNj6PJ8j2MK3l4J2QRj2j9NMj8kK5
4849iJ6lNmk3J8JL5j2l5J0K1qQk1KPj0rJ4jL1k3ojQk8JJ1jj2J5J1k0K0j3j3j8
4887c6L9j5mnK0%j4jOMMlQk4J2jj2J8j2J2J4j7J8j2K2j9nlJ0PmrrK1k0J2MJ3j6
4926CJ0k7P%ORj0%kQRk2K7j7j7L1Ll1K4k1LMk1KK6J5m0J8mJ7j7J2rPknMK2k5J
4966b%NPj5L4k7J3LJ6l6mLQrL9n8L4Jj8Lj4L7j1jmmNJ5k0Mj2K3Oj1j0kL0m7J6
$$ plain form
5005 -3 3 -16 2 -5 1 -2 -5 4 -6 -10 -8 -3 -28 -3 -20 2 20 11 3 17 9 -18 -36 -10 3 -22 -3 -10 11 13 8 8 5 3 6 -8 2 -8 -6 8 -20
5046 -20 -19 -14 5 4 -6 -9 26 22 1 -36 15 -14 12 19 1 38 3 6 -3 -2 -7 1 -10 2 -9 1 -18 -17 -3 10 -8 1 -1 3 6 0 4 3 -7 -11
5086 -11 6 -22 -5 5 -1 5 6 33 13 20 -3 6 21 32 10 -1 -13 26 5 5 -8 -6 -28 -7 -15 -5 -4 -17 3 6 2 -9 -4 -5 -10 4 -6
5123 -6 -3 13 -16 -21 -21 -13 -2 -26 -21 -5 -15 -15 -18 -10 1 0 -11 19 16 -15 -11 -11 -14 -11 2 10 -15 -6 8 1 25 -17 3 -6 18 15 5 -5 3 -12 1
5164 1 4 20 -9 -1 13 -15 -4 -14 5 -14 -3 -25 9 3 17 6 -11 -7 -8 -3 -7 -3 -17 -14 4 -5 -11 -6 9 -14 8 -1 -11 0 7 -14 -12 -1
5202 -1 9 -18 -7 -1 6 -4 -13 0 -5 16 -16 -9 -6 -7 10 0 -4 -12 1 -5 0 -3 1 6 -4 -2 17 -12 13 -17 14 11 6 15 -7 -4 10 20 -7 -9 7
5243 7 2 -21 -21 -4 -20 -4 -2 -21 -5 17 7 -10 -9 4 16 13 -7 -3 -6 5 -13 18 9 3 29 12 -10 2 4 14 -10 4 4 -17 2 13
5279 13 9 -2 17 16 -16 -10 -2 -16 1 5 -17 -11 2 0 -17 -3 15 -12 1 -16 -8 -49 -10 -7 4 -14 -33 -20 -18 4 4 -34 -11 14 -8 6
$$ packed form
5005cOj9J8pOllRj0mKNk5K5j7K2J8rqJ4qk7j8K6J3k5J9pK1Kn%lkLj4J0j0KJ4k8
5046b0JNJ9jj0lL5mk1l7N1k9K6Pj8L7l5LrJnQj1J2j1J0j9JJ4J3j8RkMLoMjj0m
5086a1J7k8J7J0oOJK7k0Pk3RJ5J1k2j1j2L9k1%j3Kk2K1qJ0Jj3K0Lmj1NjnJ4j0
5123fLJ6k9n%QJ1k4NJ6j0%lQJ1jj1L0ll1M%lLJ3Qk5RJ4pK4m2K0rK4lj0j0Qj5J3
5164ALJ6k9QJ4k8J1j0J9j9J1k2L4oJ4j1j7MjNmMj4LJ8roNJ5k3K2rj0J1Pk1KJ1
5202aJ0k7J1OPj0rJ3nK1l2PLjJ7j0mqJ3oNlMNj0KJ9k9K5l0L1lnRk2LJ4J0k7kJ6
5243Gnk3%J7j6J6Kj9J6K2j0j7JJ3J2lk0MlJ1j8L1roK6j7k2J2KJ0k4J4%k1J9J1
5279A3mj1J9jl2OQj4J7Mk2OJ3kj7J4J8k7J3j7Qm1L9LJ1j8j9J3KK2%l8K3K5k2J4
$$ plain form
5315 6 11 30 10 -7 -16 10 1 26 5 24 -4 0 -4 5 4 -5 -6 -10 11 2 -4 -6 -12 9 5 -5 4 -6 14 -17 -8 16 -27 0 -16 16 8 0 -15 -16 13
5356 13 -15 21 5 13 7 5 -23 1 -5 -3 -2 3 -20 -17 1 8 -2 -5 -15 -29 -3 -13 -15 -22 15 10 0 7 -30 -12 -9 8 9 9 0 23 12 19 42 8
5396 8 28 7 -3 -1 -13 -2 -8 -11 -11 -5 -2 -5 -6 -5 -2 11 12 -10 -33 -39 -17 -16 -11 7 -15 15 -7 -28 0 -13 1 -17 -9 9 -18 -20 -10 -1 6 -2
5436 -2 12 -8 -8 -14 -15 10 -17 -5 -4 15 -3 6 -1 6 -3 14 15 -1 -18 2 12 -17 -10 -11 10 -4 32 16 21 5 1 21 -20 3 -24 -17 -30 -31
5474 -31 4 -12 -22 -9 -17 4 11 -3 -1 -25 -30 -15 -14 -37 -18 0 -1 5 2 -19 -3 -2 4 8 -4 -2 -16 -15 3 -3 11 -12 -16 15 20 5 -3 3 -6 -31
5514 -31 2 -22 12 1 0 3 1 10 5 -1 1 -25 6 -7 -18 7 -31 -14 12 -5 -13 -12 -20 -8 -9 3 6 -2 -20 -37 -4 17 5 -7 -7 2 -10 -4
5552 -4 -22 21 -1 -15 15 -10 -3 3 -6 9 3 23 12 22 4 -23 -2 -1 -20 -2 13 3 -8 -6 -7 11 15 2 2 1 0 -6 -4 -15 16 -3 -6 -1
5590 -1 -12 -5 10 -13 4 9 -4 0 -4 4 -37 4 -26 -9 3 -1 21 -16 -7 3 -14 8 -9 8 -7 12 15 4 11 10 -6 16 13 11 17 12 11 -13
$$ packed form
5315FNJ9k0j7rK6rK5k1J9k8MmRjrjmK1rokoK1mj0Rj0K0l1RK4m3K7j6L2qqj5jK9
5356A3k8L6j6Qokk8K4oKJNk3LJ8Pj0lj0j4K6j0kpL7nj0Pl7J8LJ7J%rK3j1PK3l4
5396HK0k1j0Kj2J1ol%OLljJLJ3Jk2k3oK2JNJ8k2L0k2k1K8j3J4j8QJ8k7kJ0RPq
5436bJ4k0%ojK5k7J2JJ9j8RpPrJ7Jj6j7K0J0k9PjK1j4L6j6Nj6mK0m1K3k7Pj3j
5474c1L5j6j0J3qK1Pj4Kk4nJ5Jk3J9J8jOlk1J6JOMj2Kj4JJ8oJ4k3mL1Nj5qOrk5
5514c1L3k4L4j1jLkRnoKk6L1j3j1K5l8J7K6j7qJqJ2jJ2Lqj8j7L3K1j2j2%Rj2O
5552dj8M3k2j4L0k5POrJ5oK0j1J0j8k7K1Jj9J8J5j0j1KjJ8Mj3%jjoKj1L1j9lN
5590aj1PJ5k3J7Nj3MmQm1M1l0J7J2mK2l7RJ0j7K2j7J7j5J9Lj1Pjj6K2lkOnjk4
$$ plain form
5628 -13 15 -3 -5 10 -21 -4 14 3 -20 -8 16 -13 -14 -4 -3 -2 20 -9 -6 -9 -15 -16 -2 -6 -6 1 -9 -18 -13 -5 -9 7 -14 -21 2 8 11 -14 -1
5667 -1 0 -8 -17 21 -17 -17 -17 -9 17 8 -9 1 -3 12 1 -10 14 17 13 1 25 -6 -9 29 5 20 3 28 13 6 17 20 7 -16 2 5 -9 -13
5705 -13 -27 -15 -30 -16 -10 -11 -6 -20 -5 -6 -1 -4 -27 0 -6 -13 -2 -6 10 -15 -5 -24 -15 7 8 -1 26 -19 26 3 9 1 11 -5 -9 27 4 2
5743 2 -15 -5 28 10 28 11 -12 9 -11 -1 -6 18 -12 8 -12 -1 -6 7 -10 -8 1 18 -1 -6 -8 2 2 -5 -6 -30 7 -2 18 -10 -9 -6 1
5780 1 -12 -20 -8 6 3 7 3 8 -17 -8 -11 5 8 -4 0 37 -6 23 1 -25 -9 -2 9 11 10 11 -15 10 9 -5 13 20 28 0 12 2 6 -2 14 7
5820 7 -8 14 -5 -16 -13 -1 -14 -3 23 -23 -5 5 2 14 -8 4 8 3 -12 -5 -14 -15 -16 -8 -4 -4 -16 -6 -7 19 -4 -3 5 2 6 7 11 26 18 8
5860 8 -5 16 20 16 2 -6 7 18 24 15 -3 -6 2 -16 -13 -6 -15 -1 -5 15 -14 15 -6 -5 -8 -22 -3 -16 -12 -34 11 -9 -2 -7 -6 -5 8 0 14 -24
5900 -24 -3 -3 3 -5 -2 10 13 -32 -7 13 -15 -9 0 -9 0 4 15 2 27 2 -1 40 -3 15 -28 1 12 -16 26 18 -6 0 16 10 0 4 6 -4
$$ packed form
5628a3K8j8kJ5l1J7J8j1k3J2K4k9jJ0JJK2k9LlojJ4m%Pj0rNQmJ6k1pK3OLk5J3
5667aJqrL8l8%%QK6rj7J0mJ5j1j1K4Lmj2K4l1lL8k4J5j7K5j5pJ1Lj3k3J8Lj4m
5705a3j4J2j5J4OjNj4J5jNlk3K7opJ1mJ6k5J0j9RK2JrK7m5M5k3OqJ0j6mL6k3k
5743Bj7J0L3j8J8j7k3K1k0J0nK4l0K0k0J1nJ3j7KRJ7j9nkJ0%pjk4L7rK0k8JLP
5780Aj3qJ2J4lMmNk5RlJ6Lj2ML7m3K9k2k6J6PJ1KjJk6K5jj4J8PQk8J2j0MqJ6p
5820Gj5K2j9j1LJ2j3J1K6m6J8J0lJ2k2J2Mnj5PrjjQM%j2J0jK6k3JQlMJMJ5qj0
5860Hj3K1Mmj4qJ3J1Orj8lQj8LPrJ4mK0k9K9k1Jlj4J9j3Mk2M5k0PnJJJ3qJ4l8
5900b4K1%OqLJ2Lm5K5K0k8ORrRMJ1j3K5k5lM1m3J8m3K9J1k8M2qk4OJ6oj0MKj0
$$ plain form
5938 -4 3 13 -1 -28 2 -9 -12 -19 -21 7 15 38 -6 -5 -35 -21 5 12 4 -13 -12 -2 -5 7 -8 -15 16 -7 -13 -8 -2 8 4 -26 -4 -11 13 9 7 -5
5978 -5 9 6 6 19 -3 9 18 -10 -14 -3 8 -22 -23 30 20 1 -3 2 -7 27 9 1 20 10 -11 -21 -2 -25 -25 -12 -2 19 -3 5 -25 -3
6014 -3 -9 8 19 2 -24 -17 12 -3 -7 2 -7 6 8 -26 -7 -9 -4 5 -14 -7 27 -7 11 4 21 -2 -20 1 -1 8 3 -3 19 -18 3 4 6 7 -18 -2
6054 -2 -12 -7 20 -16 -2 14 4 -6 -1 -1 -3 15 -4 -4 -3 -16 -21 -9 -11 13 -11 -7 -25 -10 16 -9 14 9 -18 0 -11 5 3 -14 11 4 17
6091 17 29 13 9 11 -1 16 -9 -7 -6 24 8 -2 18 -12 -23 -1 0 -2 13 -1 -13 1 6 11 -6 -6 1 9 1 -13 9 6 -24 -20 8 -19 -28 -29
6129 -29 -18 -11 16 -22 -11 -2 -1 9 -13 -11 4 -12 -53 -19 -10 -11 -12 -25 -9 16 -23 -15 3 1 1 8 9 19 5 -11 -3 9 27 -13 7 7 12 -16
6167 -16 -5 -11 0 -9 22 -15 -28 -1 -10 -2 -26 20 -11 -11 -23 -44 -34 -11 -2 -27 -11 -30 -8 9 -10 -10 -8 -1 -7 21 -10 -10 -21 8 5 -7
6203 -7 3 -19 -18 -23 -13 6 0 -12 -4 -9 17 11 -6 1 -10 -23 10 5 -1 -16 -16 -14 -26 -18 -4 -13 -31 -4 -12 -29 -7 -9 -2 -8 1 -6 2 -6 -12 8 -18 -12
$$ packed form
5938dPJ0j4k7L0j1lpkK8QK3m4Jl0J4K6Pqj7JJ0lJ2j5pL1k3oNOJ0ml0K2pK4mkj2
5978eJ4l%J3k2J2Rk8mJ1J1l0jN3j0j9mNrL4j8qJ9j0k1j0J9k3%J3J0K1k2Ql0K2
6014coJ7J1j7k6PK9j5mRrJ3Kl4J9kNRj9PL4l4J8pJ7k3j8K1kRnoK2l7K1JKJk5J6
6054bj0NK7l6J4J6j0j0N%kJ8j9%Jj3nJ2kK4k4Mj8J5K6k5K3nk7J8j1J6kj7K5pJ3
6091A7J2j6mKj2J7k5KJL0j6j0K0l0j1K2JkJ5j4j2J4NNj7%PQqj4K2ll0MK8k7rj
6129b9J1PK7l8J1RJJ0k2KJ5j6m1L4Rjjj3J6K5l9QJ8k%PJJ0j4j6QJ2J8m0K0%Nk8
6167a6J1oJ1rL1l7j3K7rQk4M6l1%j2k1J0K3Rk5J6j9K2J7j9%KPoK8l1%j1K9lj2
6203gJ0k2JnJ0J9oj2QnK6oj7Pj1j3L3noj5%Kj2QJ4rj8K7qj7K2kPoRpQqoK0k6O
$$ plain form
6245 -12 -18 -1 9 2 -20 3 -19 5 -7 -11 -12 5 11 -1 8 -9 6 -10 -14 -1 4 -15 8 -1 0 -9 -10 0 2 13 -22 2 -5 9 -20 -7 -16 -38
6283 -38 -11 -14 -3 -24 -19 -46 -3 -12 -2 -8 3 1 -22 -11 -30 0 4 12 15 -15 14 -22 -3 0 -27 -16 10 -2 -6 -12 -1 -18 -2 14 5 -10
6319 -10 -3 26 11 -16 -13 -3 15 -1 -6 -11 2 -7 -3 -10 0 -4 -14 4 -1 5 -36 0 -12 4 18 -7 -16 -19 -7 -12 5 -10 -11 7 -1 -10 -7 1 -14
6358 -14 15 5 -14 -16 4 -22 -16 -5 -7 -39 -15 -11 -15 -12 -3 2 1 -8 7 6 22 -25 -15 4 8 28 -13 -1 7 11 13 -17 -8 5 -3 13 20 25 -16 5
6398 5 -3 -12 9 -9 -10 -10 -13 -19 -11 -17 -31 -15 -11 -18 1 3 -11 19 -5 -3 -8 7 5 9 4 2 -9 10 1 21 -1 2 -17 -3 14 12 -12 23 19 5 17
6439 17 13 24 12 15 -12 -4 5 4 -17 -2 10 -12 3 3 13 -15 7 18 5 -9 6 6 6 -4 15 18 -18 -5 9 0 1 -4 -32 -6 4 11 5
6476 5 -7 -5 25 11 -18 -3 9 -21 -14 -17 -26 4 -10 -22 5 -3 -14 1 6 13 -4 -5 -2 -10 7 -14 24 9 -4 21 -3 -9 12 1 1 -3 -7 -14
6514 -14 3 -2 7 -19 22 8 -30 -3 15 -12 -31 -26 -11 6 -17 -20 -30 -21 -22 -16 7 -3 -12 7 4 6 2 -4 -21 -5 -24 -13 -10 13 17 1 11
$$ packed form
6245a2oJ7J0pk2K3k2K4j2mjJ7Oj2Rj7J5j6mJ3Nj9K3rJrjJ0KJ1l5K4pJ4k9J3rk2
6283c8K7lJ1k1Nk7M3rJ0oJ1kk3J1j9L0MQLl0K9l6J9Lk7J1K6j2moJ1j7J6J6rj5
6319a0PK9j5k7LJ0J8j6nnJ3rMpJ0mj0J8nOm1L6j2J6J4k5rlJ2nJ7j5jJ8qrLQj5
6358a4K9j0j9kK0k6OJ1kl2K4MmLRNjrJ5jJ6m7J0J9MK0m1J2QMKl0RJ3qJ6PNm1K1
6398EqrK1j8j%loQoj4J6MpJ9Kj4L0k4KnJ5kMnkj1J9rK0k2Lj9J4J7kk4L5mj4J2
6439A7mJ1j2Lk7QRjk1J5J2k2J5%J0k8K2J1j3j4J5%%j0J9Ll6J3J4rJnk8K6J0Po
6476Ej2KL0j4k9J5J2l0PlrL0j4j2K7qj1J5NPj7jLqJ7k1L8j5j3K5k4oK1j1%mmp
6514a4J7nRk6M1j4l8K7J8k7j9NJ5J7k3lj0RjOK3j0rJ9lKmoj7J6j9J1LK3Mj6J0
$$ plain form
6551 11 -21 -6 6 8 -2 -8 3 -5 2 -7 24 4 17 20 3 11 -2 -9 -4 6 -10 24 -21 15 27 -2 7 -9 4 7 1 4 7 -4 -4 -15 11 -3
6589 -3 11 1 11 3 4 29 -9 -2 13 -8 -15 1 0 6 -10 -5 14 3 -6 10 -11 -17 5 11 -24 6 18 -11 -14 1 7 10 2 13 0 11 13 -17
6627 -17 22 -4 -18 19 20 13 12 6 5 10 -22 0 13 -16 13 -9 -8 -18 -14 -17 8 16 -2 10 1 1 0 -19 15 4 -1 12 -13 6 -7 4 -3 -2
6665 -2 3 -2 12 7 2 -12 2 -15 0 29 10 15 13 22 7 -29 -9 -20 -10 -10 7 2 25 -4 -1 -9 15 13 23 -5 -1 29 6 14 -3 6 2 -8 16
6704 16 -5 -9 -10 4 0 0 -12 16 3 -6 11 1 -13 -20 -21 1 16 7 8 4 10 -21 -6 -3 4 -3 21 10 10 -6 19 6 -21 24 -8 -7 -17 6
6742 6 3 -13 5 8 10 -1 -11 -4 0 7 5 -29 -8 5 -21 3 -9 -2 -7 -1 -2 -8 6 -1 9 -13 -28 -12 -12 -17 8 -20 1 0 4 -13 -39 0 -4 4
6782 4 9 -31 -3 -3 -21 13 11 -4 28 7 16 21 -5 22 26 -8 -1 -14 17 6 7 17 1 -9 6 2 -15 9 3 -6 -12 -1 23 -6 15 -5 11
6819 11 19 -13 -4 -27 0 -11 5 -23 -7 -10 -10 -16 2 11 0 15 2 4 0 -11 3 14 -13 -1 11 6 -16 -19 -1 -10 -24 13 -7 -16 20 -11
$$ packed form
6551A1l2J5J2Kj0oJ1qPrL1k0J3Lj7Qj3pNJ0j6L4m5L6J2k9Rj6J3LoLLj1%j1K6j4
6589cJ4j0J0qJK5l8PJ5k1pJ6jOj6NJ9j1rJ6k1oK2Ol5L0J2k9lJ5OLqJ1j3J1Kl0
6627a7L9k6j4L7JpjojNl2K2J3k9K9k2Jj0MlK5Qj8J2r%jj9L4j1nJ3k5J9j3J1pJ
6665bNnJ4nnj4J4j7J5K9j9NkRj5l6K0j1J0%J7nK3k9LqK4kJ0k8ML0k3Qj7Rmj0K4
6704A6k1mjJ4m%j2K8j3rJ7j0j4pjK2J5rJmOl1J5LPpK4j1%j6K5j3k7M5l2Jj0K3
6742Flj6J8LKj1j0PMPkl4K1J3k6K4j2PnOjoJ4pJ0k2j5J6%nK5k8K1jMj7k6L9mQ
6782DNm0K8%j8L4kj5L2k1RNk6K7Ml4Pj3L1j1JJ0j6j0J5mj7K4oroJ1K4k9K1k0J6
6819A1Ql2Rk3K7j1J6k8J6l%oJ8Rj1J5j3Kmj1J4J1k7J2J2nk2lJ8rj4L7k0rL6l1
$$ plain form
6855 -11 -3 3 8 -15 -7 12 -19 -5 4 5 -4 -8 -9 9 3 -6 13 8 10 19 -4 -9 -8 6 -11 15 -14 22 32 11 -22 -7 7 -6 13 -18 -11 17 7
6894 7 19 -3 38 -12 -16 17 4 2 21 -3 4 27 -1 3 -7 1 -8 0 19 2 15 7 -10 21 16 -1 18 3 6 -14 -2 -12 -39 -12 19 -1
6930 -1 25 3 6 24 -19 -12 14 -4 -1 11 4 -21 7 -9 -22 16 -15 -13 -6 2 7 -2 17 29 -5 23 -5 37 18 12 -2 19 18 20 23 0 8 13
6968 13 14 12 23 -2 -12 4 16 22 -9 27 26 5 -16 20 2 -14 -13 -12 10 0 -3 1 13 10 -9 14 16 19 -1 5 -17 -16 -3 1 -2 -11 10 -11
7006 -11 1 2 1 -6 -33 -18 -20 -13 2 -6 -5 14 -5 -3 -10 9 4 15 -7 12 0 14 26 18 13 3 9 9 0 2 22 -1 -3 19 2 2 -26 19 -5
7045 -5 3 5 -9 8 -5 5 -13 -7 23 -13 4 -5 4 -9 -8 -5 5 -3 -11 2 4 4 -26 1 1 19 20 14 1 1 0 19 -8 21 -27 -15 -4 27 12
7084 12 4 20 -7 7 31 22 18 18 6 -3 7 9 5 39 8 18 -8 22 12 16 -4 17 2 7 10 -10 1 2 -2 -3 11 9 7 13 -10 -4 -10 0 5 2
7124 2 7 -11 20 11 -1 25 6 12 3 -22 9 32 -14 19 32 18 -7 11 -7 5 -19 -4 0 19 7 -2 8 26 -4 -9 11 -2 -7 7 -5
$$ packed form
6855a1QONk3QJ9l1J4RJrmjJ8orJ9nKRk3nJJ4j7K6k9L6J0k1l3J5J4j3J9l1PK8j0
6894GJ2k2M1n0mL3j3kJ9k4PK3k8Mj0QrQJ9j7J3qj7L1nj7J9j5Lk0J2j0k7K7L1k0
6930aK6k2LJ8m3PK6j8LJ2pk5K8j6j3L8l1KPQNrJ9J2l4K8k8M2j9oj4K1jKLk3QN
6968A3JkJ1k5j0J6J2Ol1L6jk1k1L6j8j6JJK2j0lMJ2lj9K3KLk0Ok2JJ3MlrK1k1
7006a1J2Jjpk7J5kPJ5qJJ9j9KpJ9nJ1k2J9j2J4J2qnj0O%rKK0k3kK2j7%k8M5k4
7045eQKj4J7j3J0j8OL0l6J7rRj3JLJ0qqJ3K%l0K7%J8Joj3%jJ9k7K9m8J2J1L1j5
7084A2qJ6k7J4K4rm%j2rJ0KmL4l1J0k6L0j0Mk0K1j5NLk0J1JmjJ4kkOk3OoJ0Nl
7124BNj8L1rj2K6j9Ork5L1K3m6L3J3j4k5J8j8J2k4J5MJ9j2rJ0J8l0nK0j3nJ4j2
$$ plain form
7159 -5 -9 9 12 -3 -5 3 2 -13 15 7 -4 4 -6 -2 -5 4 -17 3 -10 -7 14 0 -15 -14 5 -6 3 -8 6 -5 -8 23 15 36 3 0 9 -6 -2 27
7199 27 0 12 4 -6 9 -12 7 -1 -22 23 17 7 -5 5 -6 7 19 5 11 6 0 15 -10 -1 5 -10 -1 -21 -18 -11 -5 -15 3 -11 1 6 -8
7236 -8 -1 6 12 -19 -8 -15 13 -7 22 -22 -23 0 7 10 -2 32 -14 -6 2 20 14 13 5 10 5 16 9 10 13 -17 -14 -12 -9 4 10 21 3 0 4 7 -4 0 6 0
7280 0 -5 -5 -1 -25 -1 -18 -17 15 -9 6 26 11 -2 10 16 4 11 -11 12 -5 9 -6 -6 0 0 -14 -14 11 14 2 12 28 9 -4 3 2 1 4
7318 4 10 7 -10 -8 20 17 17 -26 9 12 3 4 11 1 3 -4 -8 16 13 -5 -20 1 13 -12 8 6 5 -6 2 -8 -5 -3 38 7 19 7 -3 10 5 -2 8
7359 8 2 2 10 6 1 12 5 18 9 -11 3 -13 5 -12 10 3 16 16 13 4 15 4 20 1 21 17 -1 17 9 1 10 22 -18 -10 20 -6 -12 -8 13 -1
7399 -1 2 -24 10 -1 1 9 -8 0 -3 5 -8 -3 -9 -15 -23 -8 15 7 -6 12 -5 14 3 -3 3 -26 -12 -6 7 -13 23 3 -4 -4 -28 11 7 -6 -3 -10
7439 -10 0 2 3 1 0 -6 1 9 -18 5 -2 8 -14 2 5 0 -7 -9 -25 3 -25 -38 -17 9 -3 1 -24 -13 -5 -28 -15 -10 -31 -15 1 2 16 6
$$ packed form
7159emJ8Lj5kQjj5K8qj1Qj0MlRk1K0j3LK1j4j5JJ9j1Rj1J4j1lL1qK1l3lRj5MK9
7199B7k7J2qj0J5k1J9qk1M5oj0j2J0j1J3J2j4OnoJ5k5ROj5Rk0LPOj0J8j4J2Nj4
7236hPPOl1J1pK8k0K9m4jK3PLj2L4m6QQJ8ojqNnJ1pJLl0LKLJ3OJ1j8lMLj1MOo
7280@n%Mk4K4j7JL2k4J5K0j5j3J2Oj2Pk2K3j7J4j5%O%j4%K5Lj2J0J6j9j3PjjL
7318DOlj7KK8l%m3L5LrJPj0KpmK4lj8j5K1J2k5K0kjj1Qj0LKM1l1J2j2j0J3npJ0
7359Ho%QmnJ1pJ3rk0J4j6J8j7K2pJ3%lrJ1j1J6j9K0mj8J8qqRJ2m0QL0k6oMK1j4
7399aLk6L4j1KQj7QlQj3NooqJ5K3qj3J8j7J9j1oOk9J4OJ3k0L6k0p%k4L9mj3Lp
7439a0J0KJkjoPQk7K3pJ0k2J6Lnpkj6K8k8j3K1K6j2Mk5J1Qk3J3Nk1J6J6JJ4j0
$$ plain form
7477 6 3 -14 -9 -3 2 -4 -1 13 7 3 -6 8 7 11 18 13 8 4 -6 25 9 -22 4 -25 0 8 3 14 -2 -8 -17 8 7 9 -5 0 -7 -7 3 6 24 -3 2 10
7521 10 -8 -9 -15 -10 -10 -33 -2 -3 -10 -1 2 17 -10 -12 -18 -8 15 -5 -8 7 -12 -2 -11 -17 -27 -3 10 -14 -1 -3 0 -18 9 13 -5 12 21 9 -3
7560 -3 17 8 3 6 -2 8 -18 -13 -13 -6 7 1 27 16 6 13 24 -25 9 -8 -4 1 -28 -25 -15 1 15 15 -7 3 2 5 -13 1 -12 -26 5 -14
7598 -14 -9 -16 -18 15 7 0 1 -22 -20 0 10 -9 -1 -6 -9 -6 -5 -11 10 5 9 10 19 3 -6 0 7 -8 -10 1 -21 -11 -22 -29 -3 -4 11 -24 7 -22 -1 -13
7640 -13 -7 -11 -8 -29 5 -9 7 -2 -6 9 -4 9 -25 7 -3 -6 -19 -7 -14 -19 1 14 -8 7 -4 10 -11 -22 -8 -10 5 9 12 22 7 1
7676 1 17 6 2 -18 -13 -11 -3 -7 0 0 -10 41 -8 -13 -15 14 -1 -3 -10 7 -4 4 -1 -10 11 -19 -23 -12 6 -10 -7 -27 -18 -20 12 -20 -18 -17 -24 -26 6 -5
7718 -5 -7 13 -3 0 -1 0 -14 -5 6 15 -5 37 -1 -8 7 24 5 33 9 -3 -16 3 -29 -13 11 -4 13 2 2 -13 0 2 17 0 -6 -9
7754 -9 -6 -24 -31 -2 -5 -13 29 5 -2 2 -3 3 1 -2 -8 12 2 27 1 10 -5 -2 -9 -23 -27 5 12 3 -27 -3 11 5 23 24 7 -14 5 17 -2 0 19
$$ packed form
7477Flj7NONoLJ4omrJ4jMPnnmj0L1j6l1K6k9K5QnJ1j6orK5jKj4Np%J0LJ8k7NQ
7521A0j8joN%k3L1jpRLJ5k7koJ0K3k0lJ5j9J0roj0K4J3k4J3kLj8K7Mj8J7Rj2j2
7560cK0rnLqJ0k6N%PJ3oK6j1j0PJ1m9L4j7MNk9LJ0J6J4%k2J0jLj8J4j3j4L1j9
7598a4NpkL3qpJk3KK0J0j9QnlLJoK1nMJRj6rOPj5kJ1k2J0j1pK6jJ5l5L1k9K1j2
7640a3OmLk1L4j4J6rmJ5j3J3l4L2j0lj3J2pnK0J3k2J5j1J4k1j1J4kJ5MLJ0j5o
7676AJ6j1mk0NKQmP%j0N1m9nkK9j5kpJ7j1QnrK1l0mJ1J8j6Lk0RkL2l2KJpkL2j1
7718ekK0j6LjJj4RJ1Rk0M2l8pJ5J7j9K8k4j2j3J9l2J6K4j5J7j1%j5J3KJ5j7ol
7754iLj8pK9lqM2k4pMnOkloK0j0K5k6Rj5Lpj4mL2Prl0K4J4oJ8Jj7k1J9J2j9KJ9
$$ plain form
7795 19 2 22 3 23 -13 6 -16 -12 5 -10 23 20 -1 -11 -9 3 15 6 -10 0 6 -3 17 -3 -24 -8 3 -12 -9 -12 -6 0 -26 -5 -3 4
7831 4 -1 8 19 5 -12 15 -13 13 -8 32 26 1 -5 -7 7 5 15 -8 5 -3 0 10 6 -1 4 8 -8 -3 4 0 12 11 -3 3 13 -8 12 -21 -14 -4
7871 -4 11 -9 18 -1 -10 -16 -18 -15 -12 9 12 -13 -21 2 -11 -25 -9 -10 25 -16 2 0 18 28 -2 6 13 -11 18 1 -3 -2 5 9 -1 36 20 8
7909 8 3 15 -1 27 17 8 18 11 10 7 10 -2 9 -22 4 -22 -10 -7 9 2 9 2 19 -1 -11 -4 -4 -20 19 -22 -6 0 -7 -22 -1 0 12 4 14
7948 14 -4 -12 26 6 31 -5 -3 20 4 -3 7 7 6 4 12 -22 -10 11 11 -7 5 5 -3 -18 -2 5 3 11 -5 28 -24 13 -10 -11 -13 -22 -12 14
7986 14 20 -15 2 -19 -18 -16 -28 -4 -2 0 4 -15 -5 -14 -19 -7 -25 9 -28 -9 -19 15 -14 -17 -6 4 13 13 3 -19 6 -4 -3 0 3 -3 6 7 7
8025 7 -2 20 -7 11 -10 -4 -1 13 -25 -21 -4 -26 4 -14 -13 6 -23 -8 -2 12 -16 -17 -21 -18 -4 6 19 -7 -11 14 -3 1 -5 -5 -24 -9 9
8062 9 -3 15 -3 -15 -39 -14 5 -11 -18 -2 -2 7 -10 3 13 0 -18 -14 -6 -7 -3 13 17 17 13 2 3 17 10 -5 -5 -4 -15 -2 18 -24 -23 -24 -1
$$ packed form
7795A9j7K0j9K0l6J9k2MJ7j5L3lk1j0KJ2J2rj6J0OrK0k0k1J6J1j5LlOOk6K1KP
7831DnRJ1j4j7K7k8K6k1M0ok5okJ4kJ0k3J3qLJ0mpNMj6NPmJ2jj4OJ0k1K0l3PJ0
7871dJ5k0K7j9rokLLK1Lk5qK3j3j4J6jL5m1J8kJ8J0l0QPk4K9j7mJPMj0L7j6j2
7909HnJ2j6K8j0rJ0pjlLj2J1l1K6k6J2LJ6pPpJ7k0j0P%j6L9m1J6Opj5K1JJ2qJ0
7948A4j8qL8k0K5l6KK3j6pJ0%jkQl4J2K1%j8J2%qj5J6PkQj6L3n2L7k3jkrJ0K6
7986A4Ol5J7k1JKj2K4KKMj9J0rnJ2j8L4l7J9j0L4k9lJ1J0R%j0k2K5j0JLLoRJ%
8025GrK2k7J8k1OLJ4l8MJ7k2L0j8JJ9k9J5OJ4k8jmLJ4J0J3k6mK5j7Mo%j9J5J8
8062Ij2J8j8j2k4K5J9j6pJ6%Rj7J3J0j3j8MQjMJ6M%mj1JJ4pj5%Jj1J3K0m2JjK3
$$ plain form
8101 -1 -7 -21 -7 2 -4 9 -6 -8 -25 6 -31 -4 1 -3 -12 13 1 8 3 -14 9 -36 -15 11 -10 7 14 -27 -25 5 -1 8 -4 9 -25 -8 -10 -13
8139 -13 -15 14 0 -10 -12 -18 3 11 -5 0 -6 -4 15 12 14 12 1 -8 -12 -27 -12 -19 -10 1 10 -10 -12 -18 -1 -25 12 14 -14 -9 8 -6 -12 -23 -3 10
8179 10 -13 8 -8 -15 -15 -17 -13 -12 1 8 21 23
$$ packed form
8101aoj4J4RoJ3j5kj7L1l7K7NmrK5j2Pnj7K3m5K1K6k1J7Pm1KL0oRj2J3l4J7kl
8139a3kK9j4j0koK1Qj6NoKJ9lKkj1rmj5J5pRJ1Rk0koJ7k4L7Kk8NJ7j4oj1K0J3
8179A0k3K1j6p%kMJJ3PJ3K
8191B3
$$ Imaginary data points
##PAGE= N=2
##DATA TABLE= (X++(I..I)), XYDATA
$$ plain form
0 0 0 0 0 0 0 0 0 0 0 0 0 0 0 0 0 0 11 -32 32 -32 32 -32 32 -52 64 -64 64 -95 96 -96 128 -128 160 -160 192
35 192 -215 225 -256 288 -320 352 -388 434 -480 530 -589 655 -727 815 -912 1031 -1165 1338
53 1338 -1545 1819 -2195 2724 -3558 5062 -8618 34446 -26410 -159866 -145526 -44731 91145
66 91145 155383 121488 -4498 -125321 -157360 -66851 67791 151771 123949 14147 -105438
77 -105438 -148550 -86118 41188 136600 132584 32900 -86036 -143025 -97227 17829 121620
88 121620 135627 50081 -70020 -135079 -102459 560 100879 130531 66547 -46663 -126389
99 -126389 -111785 -16307 86685 124087 73912 -26420 -108233 -113773 -36709 67337 121122 85517
111 85517 -10236 -95990 -112399 -49063 49260 112509 93473 6426 -83112 -110278 -58402 32288
$$ packed form
0@%%%%%%%%%%%%%%%%J1m3O4o4O4o4O4q4J16j28J28j59J91j92K24k56K88l20L52
35A92m07M40m81N44o08O72p40Q22r14J010j119J244j382J542j727J943k196K503
53A338k883L364m014M919o282Q620j3680M3064o0856j33456J4340J00795J35876
66I1145O4238l3895j25986j20823l2039R0509J34642Q3980k7822j09802j19585
77a05438m3112O2432J27306R5412m016r9684j18936n6989M5798J15056J03791
88A21620J4007q5546j20101o5059L2620J03019J00319K9652o3984j13210p9726
99a26389J4604R5478J02992L7402n0175j00332q1813n540P7064J04046N3785l5605
111H5517r5753q5754j6409O3336R8323O3249j9036q7047q9538k7166N1876R0690
$$ plain form
123 32288 98744 95541 24184 -65545 -108242 -70821 17596 90302 95561 33519 -49933 -98173
135 -98173 -77478 -852 77347 98314 46005 -38017 -91462 -78890 -12790 60911 92455 57867
147 57867 -19914 -83630 -85033 -24530 50908 87746 62105 -6743 -71029 -84683 -36586 37494
159 37494 82995 67848 5536 -59281 -82191 -46380 23627 76945 73009 15771 -50105 -77508
171 -77508 -50151 10590 64177 73504 29419 -37258 -76345 -57873 1742 57105 70794 35676
183 35676 -23826 -67708 -63315 -11742 48491 71871 42381 -15503 -60413 -62392 -20399 36441
195 36441 67515 49120 -4580 -53372 -62826 -27990 25936 62051 53978 6236 -46097 -63525
207 -63525 -33882 18359 55419 53428 15153 -33811 -60008 -42605 7125 51552 56731 20485
$$ packed form
123C2288O6456l203p1357q9729m2697L7421Q8417P2706N259o2042q3452m8240
135i8173K0695P6626P8199K0967n2309q4022n3445J2572O6100P3701L1544l4588
147E7867p7781o3716j403O0503P5438L6838k5641o8848o4286j3654M8097P4080
159C7494M5501j5147o2312o4817k2910L5811P0007N3318l936n7238o5876k7403
171g7508K7357O0741N3587R327m4085o6677l9087J8472N9615N5363J3689l5118
183C5676n9502m3882M393N1573O0233K3380k9490n7884m4910j979M1993N6840
195C6441L1074j8395n3700m8792r454L4836N3926L6115q073m7742n2333j7428
207f3525K9643N2241L7060j991l8275m8964k6197J7403M9730M4427N179l6246
$$ plain form
219 20485 -28171 -55299 -43875 -2241 41639 56360 29308 -19578 -53279 -47364 -8423 34629
231 34629 52876 33902 -9610 -46937 -49985 -16269 28103 50826 36958 -2157 -39699 -49599
243 -49599 -23482 20108 48572 40561 3886 -33665 -47021 -28195 10300 42828 44759 12658
255 12658 -28907 -47751 -30972 6248 37171 42293 18302 -19369 -44185 -36226 -1112 33768
267 33768 42890 21698 -13395 -39015 -37620 -8832 27092 43042 26724 -8091 -35478 -37465 -13694
280 -13694 19820 40182 31253 -1224 -32267 -38437 -16846 15101 35994 32480 6058 -25788 -39330
293 -39330 -22759 10692 34727 32751 8716 -19885 -34968 -26004 2221 29913 35459 14272 -16568
306 -16568 -34158 -27240 -1871 24717 34215 18831 -10772 -32262 -29533 -5950 20598 32224 21525
$$ packed form
219B0485m8656k7128J1424M1634M3880J4721k7052m8886l3701N915L8941M3052
231C4629J8247j8974m3512l7327l048L3716M4372K2723j3868l9115l7542r900
243d9599K6117M3590K8464q011l6675l7551j3356J8826L8495L2528J931l2101
255A2658m1565j8844J6779L7220L0923N122k3991l7671k4816P959L5114L4880
267C3768R122k1192l5093k5620J395K8788L5924J5950j6318l4815k7387j987K3771
280a3694L3514K0362q929l2477l1043o170K1591L1947K0893l514k6422l1846j3542
293c9330J6571L3451K4035j976k4035k8601j5083Q964K8225K7692N546k1187l0840
306a6568j7590O918K5369K6588R498j5384k9603k1490K729K3583K6548J1626j0699
$$ plain form
319 21525 -4604 -28238 -31475 -11142 17006 31471 22913 -997 -23624 -30162 -15595 11020 30082
332 30082 26418 2952 -21558 -29374 -16807 6549 25472 27118 9023 -16518 -29801 -20496 3468
345 3468 23648 26507 11220 -11796 -26871 -22745 -1607 20554 26969 13900 -8337 -24299 -23677
358 -23677 -6319 16315 27165 17396 -5259 -22946 -23490 -8230 12027 24157 19639 265 -20037
371 -20037 -25145 -11271 10116 23002 19675 3331 -15485 -23888 -15017 5626 22148 21815 5857
384 5857 -13234 -22188 -15827 1745 18621 22313 9604 -10023 -21468 -17226 -1035 15730 21684
397 21684 12437 -6359 -20510 -19094 -3518 13866 20484 13154 -2874 -17097 -19639 -7864 10384
410 10384 20697 15276 -1135 -15791 -18783 -9256 6704 18217 16871 2773 -13747 -19602 -11139
$$ packed form
319B1525k6129k3634l237K0333K8148J4465q558k3910k2627o538J4567K6615J9062
332C0082l664k3466k4510p816J2567K3356J8923J646j8095k5541j3283R305K3964
345C468K0180K859j5287k3016j5075M126K1138K2161O415j3069k2237j5962O22
358b3677J7358K2634J0850r769k2655j7687n44J5260K0257J2130m518j9374k0302
371b0037n108J3874K1387J2886l327j6344j8816q403Q871K0643J6522l33j5958
384E857j9091q954O361J7572J6876L692j2709j9627j1445M242J6191J6765N954
397B1684r247j8796j4151J416J5576J7384O618p330j6028j4223k542J1775J8248
410A0384J0313n421j6411j4656k992R527J5960J1513j346j4098j6520n855Q463
$$ plain form
423 -11139 4790 16550 16737 5499 -10143 -18717 -13599 1822 15480 17218 7045 -7760 -16914
436 -16914 -14511 -1439 13232 17829 9055 -6067 -15856 -14403 -3710 9753 16825 11928 -2589
449 -2589 -15359 -15968 -4997 8628 15328 11775 383 -12097 -16243 -8237 6349 15461 12703 1546
463 1546 -10254 -15035 -9865 2882 14082 14486 3838 -9182 -14640 -9979 929 11451 14377 6810
477 6810 -6458 -14625 -11330 -104 10338 13423 7886 -3268 -12818 -13071 -2979 9412 14075 8487
491 8487 -2263 -10886 -12342 -5320 6198 13640 10627 -428 -10495 -12354 -5803 4444 11927 11300
505 11300 2202 -8824 -12962 -7191 3412 10908 10875 3765 -6152 -12147 -9252 923 10316 11574 4519
520 4519 -5092 -10851 -9391 -1298 8249 11952 6534 -3810 -10755 -9614 -2041 6561 10828 7796 -1210
$$ packed form
423a1139J5929J1760J87j1238j5642q574N118J5421J3658J738j0173j4805r154
436a6914K403J3072J4671M597q774j5122r789J453J0693J3463P072m897j4517
449b589j2770o09J0971J3625O700l553j1392j2480m146Q006J4586R112k758j1157
463A546j1800m781N170J2747J1200M04j0648j3020n458M661J0908J0522K926p567
477F810j3268q167L295J1226J0442L085n537j1154r550k53J0092J2391M663n588
491H487j0750q623j456P022J1518P442l013j1055j0067j859O551J0247P483o27
505A1300r098j1026m138N771J0603P496l3p110r917n995K895J0175R393J258p055
520D519r611n759J460Q093R547L703n418j0344o945J141P573Q602M267l032r006
$$ plain form
535 -1210 -9719 -10885 -3704 5765 10362 7701 -6 -7771 -10506 -5687 3686 10204 8659 858 -6978
550 -6978 -9815 -6301 1558 8776 9751 3091 -5999 -10162 -6731 933 7446 9072 4544 -3717 -9589
565 -9589 -8131 -401 7154 8968 4703 -2398 -8055 -8535 -2550 5755 9589 5876 -1838 -7505 -7863 -3289
581 -3289 3643 8558 7258 159 -7052 -8524 -3810 3069 7567 7122 1685 -5457 -8768 -5267 2191
596 2191 7504 7140 2180 -4000 -7668 -6143 237 6785 8090 3242 -3490 -7136 -5802 -686 5189
611 5189 7858 4798 -2157 -7264 -6573 -1154 4617 7057 4953 -581 -6047 -7198 -2821 3760 7204
626 7204 5254 -113 -5150 -6725 -3675 2196 6692 6060 802 -4763 -6648 -3978 1154 5557 6279 2253
642 2253 -3810 -7050 -4830 758 5190 5760 2599 -2332 -6061 -5597 -702 4794 6322 3033 -1998 -5273
$$ packed form
535a210q509j166P181R469M597k661p707p765k735M819R373O518j545p801p836
550f978k837L514P859P218R75o660r090m163L431P664O513J626m528q261n872
565i589J458P730P555J814m265p101n657m80N985Q305L834l713p714n667l58M574
581c289O932M915j300p099p211j472M714O879M498m45n437p142l311L501P458
596B191N313l64m960o180l668J525O380O548J305m848o732l646J334N116N875
611E189K669l060o955n107O91N419N771K440k104n534n466j151M377O581L444
626G204j950n367n037j575L050N871M496o32n258n565j885K670N132M403P22m026
642B253o063l240K220N588M432N70l161m931l729M64M895N496J528l289n031l275
$$ plain form
658 -5273 -5156 -1675 3402 6394 4438 -1061 -5374 -5369 -1759 2674 5384 4705 427 -4559 -6031 -2650
674 -2650 2423 5184 4349 839 -3322 -5634 -3826 1207 5313 4978 1042 -3036 -4878 -3812 -160 4084
690 4084 5537 2434 -2597 -5246 -3877 -167 3290 4789 3129 -1202 -4945 -4728 -698 3425 4728
705 4728 2993 -436 -3705 -4692 -1984 2554 5120 3610 -249 -3399 -4166 -2291 1294 4398 4313 691
721 691 -3353 -4564 -2390 1051 3595 4003 1624 -2248 -4697 -3409 574 3730 3925 1585 -1564 -3810
737 -3810 -3601 -603 3069 4347 2151 -1392 -3606 -3357 -1011 2143 4146 3048 -584 -3707 -3773 -1114
753 -1114 1881 3480 2947 384 -2782 -4075 -2034 1593 3713 2896 348 -2175 -3440 -2550 445 3363
769 3363 3592 889 -2260 -3480 -2416 -2 2461 3457 1776 -1544 -3656 -2803 -90 2284 3022 1904
$$ packed form
658e273J17L481N077K992j956n499m313NL610M433K710o79m278m986j472L381
674b650N073K761q35l510m161k312J808N033M106l35l936m078j842J066L652M244
690D084J453l103n031k649J369L710L457J499j660m331l743K17M030M123J303
705D728j735l429l269r87K708M538K566j510l859l150p67J875L585L104q5l622
721F91m044j211K174L441K544M08k379l872k449J288L983L156J95k340l149k246
737c810K09K998L672J278k196l543k214K49K346L154K003j098l632l123o6K659
753a114K995J599n33k563l166j293K041L627K120q17k548k523j265Q90K995K918
769C363K29k703l149j220J064K414K463R96j681l320k112Q53K713K374P38j118
$$ plain form
785 1904 -646 -3090 -3304 -748 2321 3330 1884 -470 -2316 -2892 -1507 1312 3402 2770 -94 -2471
801 -2471 -2794 -1318 883 2697 2870 803 -2012 -3161 -1698 898 2554 2570 1049 -1274 -2901 -2372
817 -2372 161 2508 2734 1046 -1117 -2401 -2261 -568 1760 2898 1646 -925 -2610 -2289 -569 1380
833 1380 2493 2014 -152 -2369 -2727 -947 1378 2444 1844 134 -1663 -2543 -1517 833 2531 2141
849 2141 214 -1577 -2193 -1511 201 2022 2491 866 -1481 -2523 -1561 206 1590 2094 1253 -671 -2360
866 -2360 -2173 -157 1756 2078 1024 -485 -1787 -2123 -845 1298 2382 1438 -556 -1788 -1816 -908 637
883 637 2010 1938 113 -1816 -2137 -832 714 1642 1692 630 -1134 -2241 -1402 587 1914 1661 511
900 511 -770 -1725 -1663 -165 1687 2106 805 -903 -1662 -1335 -301 1018 1914 1345 -468 -1858 -1618 -231
$$ packed form
785A904k550k444k14K556L069J009j446k354j846n76J385K819K090o32k864k377
801b471l23J476K201J814J73k067k815j149J463K596J656J6j521k323j627N29
817b372K533K347K26j688k163j284J40J693K328J138j252k571j685L21J720J949
833A380J113m79k166k217l58J780K325J066o00j710j797q80J026K350J698l90
849B141j927j791o16O82J712J821M69j625k347j042R62J767J384N04q41j924j689
866b360J87K016J913L22j054j509j302l36J278K143J084r44j994j232k8R08J545
883F37J373p2j825j929l21J305J546R28N0j062j764j107Q39J989J327k53j150
900E11j281r55O2J498J852M19j301j708p59L27J034J319Q96n69j813j390K40J387
$$ plain form
918 -231 1034 1551 1263 67 -1397 -1922 -768 995 1787 1242 46 -1013 -1532 -1090 398 1716 1677 231
936 231 -1135 -1517 -920 162 1236 1652 766 -888 -1795 -1183 238 1166 1331 727 -373 -1487 -1580 -305
954 -305 1156 1517 657 -483 -1197 -1307 -670 629 1584 1177 -318 -1394 -1298 -476 446 1188 1270 309 -1113
973 -1113 -1593 -733 567 1201 1026 328 -618 -1391 -1090 252 1353 1262 252 -634 -1058 -983 -246 955 1512
992 1512 726 -642 -1304 -878 -110 588 1107 963 -130 -1252 -1285 -227 807 1089 737 25 -816 -1281 -741
1011 -741 552 1319 931 -42 -793 -979 -692 147 1055 1184 274 -759 -1068 -536 208 814 1069 612 -391
1030 -391 -1151 -877 168 991 993 493 -194 -790 -978 -304 731 1190 616 -302 -860 -800 -318 414 1003 850
1050 850 -85 -956 -998 -339 398 763 712 161 -629 -1127 -709 319 907 688 73 -455 -805 -766 -71 819 1004
$$ packed form
918b31J265N17k88j196j464n25J154J763P92n45j196j059n19M42J488J318l9j446
936B31j366l82N97J082J074M16q86j654r07O12J421R28J65o04j100j114r3J275
954c05J461L61q60j140p14j10O37J299R55m07j495j076R6Q22R22P42Q2r61j422
973a113m80Q60J300O34j75o98r46p73L01J342J101r1j010q86m24P5P37J201N57
992A512p86j368o62M26P68O98N19j44j093j122l3J058J034K82l52p12q41m65N40
1011g41J293P67l88r73p51j86K87Q39R08J29r10j033l09N32P44O06K55m57j003
1030c91p60K74J045Q23Kn00o87n96j88O74J035M59n74r18n58O0M82P32N89j53
1050H50r35q71m2O59P37L65n1n51p90m98M18J028N88k19o15n28l50L9O95Q90J85
$$ plain form
1071 1004 263 -621 -857 -541 -66 473 874 627 -300 -999 -782 0 563 666 459 -6 -686 -932 -315 600
1091 600 853 411 -133 -487 -714 -528 194 937 780 -64 -689 -655 -279 69 540 816 385 -469 -894 -458
1111 -458 275 618 531 320 -159 -710 -726 -24 716 745 236 -231 -501 -559 -231 399 866 503 -230 -623 -491
1132 -491 -106 244 604 631 80 -651 -779 -184 376 572 423 138 -302 -673 -525 155 686 553 28 -393
1152 -393 -484 -399 -79 463 688 266 -396 -652 -362 60 332 512 440 -81 -636 -610 -53 461 499 267 -10 -367
1174 -367 -592 -343 309 661 366 -186 -443 -426 -286 34 471 573 59 -535 -588 -192 143 315 385 252 -246
1195 -246 -654 -418 143 485 335 121 -77 -368 -499 -112 487 641 235 -226 -354 -262 -143 176 544 459 -67
1216 -67 -491 -400 -40 245 326 351 101 -331 -552 -210 288 459 268 34 -183 -380 -383 25 486 450 21 -318
$$ packed form
1071A004p41q84k36L16M75N39M01k47r27o99K17P82N63J03k07m65o80k46O17R15
1091F00K53m42n44l54k27J86P22P43j57q44o25L4L76L48M71K76m31q54m25M36
1111d58P33L43q7k11m79n51j6P02P40K9n09m67k70n8L28O30M67l63p33l93J32
1132d91L85L50L60K7n51p31j28N95N60J96j49k85m40l71J48O80N31j33n25m21
1152c93r1Q5L20N42K25m22o62k56K90M22K72J80p2n21n55K6N57N14L8k32k77l57
1174c67k25K49O52L52k95n52k57J7J40L20M37J02n14n94n3L96L35J72P0j33m98
1195b46m08K36N61L42j50k14j98k91j31L87N99J54m06m61j28R2J19L19L68q5n26
1216f7m24R1L60K85Q1K5k50m32k21L42M98J71j91k34k17j97lM08M61l6m29l39
$$ plain form
1238 -318 -320 -222 -46 209 459 259 -223 -500 -304 98 289 288 227 0 -346 -449 -111 326 425 191 -74 -241
1260 -241 -289 -212 132 473 321 -85 -366 -280 -106 57 260 369 140 -303 -506 -232 171 280 185 87 -109 -411
1282 -411 -384 -20 365 299 -5 -220 -251 -252 -131 193 404 194 -214 -381 -237 -35 89 241 328 59 -346 -397
1304 -397 -39 280 231 160 62 -107 -334 -253 162 440 235 -83 -212 -185 -162 -56 239 386 100 -269 -295 -78
1326 -78 80 134 238 226 -57 -338 -267 88 283 200 93 -5 -163 -309 -114 249 376 168 -108 -161 -135 -113 45
1349 45 264 300 8 -282 -256 -4 125 159 186 109 -119 -314 -213 124 274 141 12 -79 -171 -270 -56 227 263
1372 263 37 -209 -200 -138 -60 60 253 225 -110 -340 -207 29 111 102 137 87 -148 -281 -88 225 245 54 -65 -78
1396 -78 -167 -184 24 278 268 -54 -201 -121 -61 -14 117 251 163 -154 -276 -116 115 107 47 110 -10 -210 -283 4
$$ packed form
1238c18kR8J76K55K50k00m82k77J96M02J91jo1k27l46j03L38M37R9k34k65j67
1260b41m8P7L44L41j52m06k81Q6J74J63K03J09k29m43k03K74M03J09r5r8j96l02
1282d11K7L64L85o6l04k15l1jJ21L24K11k10m08j67J44K02J24J52Q7k69m05n1
1304c97L58L19m9p1r8j69k27Q1M15K78k05l18j29K7K3J06K95J47k86l69k6K17
1326g8J58N4J04j2k83k81P1L55J95q3j07r8j58j46J95L63J27k08k76n3K6K2J58
1349D5K19L6k92k90K6K52J29L4K7p7k28j95J01L37J50j33j29r1r2r9K14K83L6
1372B63k26k46RO2P8J20J93k8l35k30J33K36Q2rL5n0k35j33J93L13K0j91j19j3
1396g8q9j7K08K54j0l22j47Q0O0M7J31J34q8l17j22J60K31qo0O3j20k00p3K87
$$ plain form
1420 4 236 159 -9 -84 -86 -151 -115 97 281 154 -86 -163 -55 8 39 135 235 78 -166 -209 1 151 163 106 105 -21
1446 -21 -176 -160 70 257 159 -23 -94 -68 -118 -59 113 217 66 -119 -206 -63 30 50 97 133 5 -223 -194 -7
1470 -7 154 106 30 3 -88 -177 -146 61 203 83 -98 -105 -67 -79 -60 133 174 34 -172 -184 0 70 33 82 129 -41
1496 -41 -198 -152 95 166 79 -6 -8 -45 -147 -69 119 207 45 -106 -80 -52 -39 -18 124 169 -31 -187 -142 16 42 11
1522 11 54 75 -53 -182 -65 122 161 39 -6 -13 -48 -133 -9 178 166 -1 -91 -36 -15 -53 33 160 99 -76 -167 -56
1548 -56 74 70 11 61 29 -93 -167 -61 129 99 3 -39 -21 -44 -103 12 163 105 -25 -114 -34 3 0 80 125 75 -127
1575 -127 -165 -52 81 84 39 50 -17 -113 -144 -18 134 91 -51 -70 -39 -49 -80 14 132 54 -117 -137 -39 10 -25 15 109
1602 109 44 -113 -142 -16 90 26 0 37 18 -123 -120 61 147 48 -53 -45 -6 -61 -56 81 156 41 -98 -67 30 33 -14
$$ packed form
1420DK32p7j68p5ko5L6K12J84j27k40p7J08O3L1R6J00j57k44m3K10J50J2n7jj26
1446b1j55J6K30J87r8j82p1K6n0N9J72J04j51j85q7J43R3K0M7L6j28k28K9J87
1470gJ61m8p6k7r1q9L1K07J42j20j81pL8j2J9J93M1j40k06j2J84P0l7M9M7j70
1496d1j57M6K47P1q7q5kl7j02P8J88Q8j62j51K6K8J3K1J42M5k00j56M5J58K6l1
1522A1M3K1j28j29J17J87L9j22m5pl5q5J24J87j2j67r0N5K1l8Q6J27o1j75r1J11
1548e6J30mn9N0l2j22p4J06J90l0r6m2J8k3n9J15J51n8j30q9Q0L7lQ0M5n0k02
1575a27l8J13J33Lm5J1o7r6l1J26J52m3j42j9L1j0l1R4J18p8j71k0R8M9l5M0R4
1602A09o5j57k9J26J06o4k6L7j9j41LJ81Q6r9j01QL9n5NJ37P5j15j39L1R7Lm7
$$ plain form
1629 -14 74 122 22 -113 -65 67 113 6 2 19 -24 -96 -58 83 136 22 -59 -24 -10 -81 -42 61 99 -3 -140 -66
1655 -66 3 12 13 36 47 -18 -107 -62 78 109 39 19 41 4 -53 -22 71 116 28 -50 -21 3 -25 6 50 98 -43 -112 -39 44
1685 44 55 5 39 65 -39 -128 -53 74 57 -9 -73 -6 -32 -88 -15 73 101 -63 -105 -26 10 2 2 69 90 -41 -113 -48 20
1714 20 15 5 23 25 -57 -133 8 92 43 -22 -3 12 -38 -65 35 127 73 -44 -74 62 14 -26 4 87 70 -69 -90 9 67
1743 67 19 19 26 28 -56 -77 10 68 37 -8 -27 -26 -36 -62 37 64 35 -41 -60 -3 23 -25 5 82 4 -93 -68 34 51 14 -19 -7
1775 -7 -9 -63 -71 22 70 4 -59 -44 -5 -42 -39 14 65 10 -88 -64 11 19 -25 21 67 -8 -75 -30 58 86 3 -12 51 39 -44 -25 61
1808 61 74 7 -54 -14 5 -49 -46 44 67 -19 -91 -30 13 -18 -35 10 51 -1 -88 -44 58 26 -22 -9 29 4 -50 -23 63 72 -20
1839 -20 -46 -26 25 -14 13 71 89 -32 -51 24 57 -14 -3 34 48 -29 -68 -14 78 62 15 13 35 3 -39 -1 72 60 -22 -20 17
$$ packed form
1629a4Q8M8j00j35M8J32M6j07mJ7m3p2L8J41N3j14q1L5J4p1L9J03L8j02j37P4
1655f6O9RJK3J1o5q9M5J40L1p0k0K2l7n7L1R3M5q8p8K9K4k8L1M4M8j41o9P3Q3
1685D4J1n0L4K6j04q9P5J27j7o6o4O7k6n6P3Q8K8j64m2P9L6q%O7K1j31p2O5O8
1714B0nj0J8Kq2p6J41Q4m9o5J9J5n0k7J00R2n4j17l0J36m8m0L0Q3j7j39k1R9N8
1743F7m8%PKq4k1Q7N8l1m5j9Jj0k6R9K7k9p6j9N7K6m8L0P7p8r7K5J02J7l7l3J2
1775gkn4qR3M8o6o3J5L9l7LN3N1n5r8K4P5Qm4M6M6p5o7M5Q8K8q3j5O3j2q3J9Q6
1808F1J3o7o1M0J9n4LR0K3q6p2O1M3l1j7M5M1n2q7M4J02l2m8J3L8k5n4K7Q6Rr2
1839b0k6K0N1l9K7N8J8j21j9P5L3p1J1L7J4p7l9N4R2j6m7kK2l2m2L8P3j2q2KL7
$$ plain form
1870 17 6 -28 23 30 36 -21 -71 1 20 -4 -23 29 11 -59 -73 -4 50 17 -27 -21 -6 -24 -65 4 60 31 -45 -46 39 47 -6 -10 47
1903 47 41 -10 -33 1 29 36 7 32 13 -42 -53 23 41 2 -8 -10 -3 -13 -61 12 62 -13 -59 -46 35 7 -34 7 50 9 -64 -29
1935 -29 47 42 -62 -44 28 -3 -35 -63 42 77 -1 -28 1 -1 -14 -24 25 30 1 -34 -13 31 15 -6 33 50 -22 -68 -15 53 33
1966 33 -8 -7 16 12 -41 -32 64 44 -3 -44 -2 28 -15 -36 10 60 1 -54 -25 17 37 -6 -3 36 -27 -37 -18 7 9 -11 0 5 -17
1999 -17 -53 -20 43 49 -15 -37 8 32 -6 -43 39 51 -45 -83 -27 40 -28 -17 23 40 -34 -82 -14 42 34 -35 -22 41 12 -7 19
2030 19 66 34 -26 8 41 15 -45 14 50 27 -54 -23 82 37 -33 -29 36 11 -38 -49 0 56 -21 -50 -38 32 -34 -40 -1 25 -1
2061 -1 -21 -10 4 18 -8 -6 25 -7 -15 -10 32 9 -16 5 19 -11 -46 -51 11 59 -18 -32 9 11 -17 -27 42 77 2 -50 -15 37 23
2094 23 -5 -22 27 30 -14 -47 -20 36 12 0 -6 9 -6 -30 9 9 -20 -39 -1 -21 -31 -45 19 2 -15 -54 -15 25 -44 -36 -5 34
$$ packed form
1870A7j1l4N1POn7n0P2J9k4j9N2j8p0j4O9N4l3m4OJ5j8m1O9N6k9p6jQ5Qn3mN7
1903D7on1k3L4K8Pk9K5j9n5j1P6J8l9j0kPj0m8P3N0p5m6J3Q1k8m1M1M3m1p3L5
1935b9P6nj04J8P2l1l2k8J05L5p8k7K9kj3j0M9Nk9l5K1M4j6k1L9J7p2m6N3O8k0
1966C3m1JK3mn3RR6k0m7m1M2L0m3k1M6N0n9n5K9M2K0m3LL9o3j0J9K5Kk0J1Nk2
1999a7l6L3O3Oo4k2M5K4l8l7Q2J2r6l8N6O7o8J1M0J7p4m8O8N6qo9J3O3k9j9K6
2030A9M7l2o0L4L3k6o0N9L6k3q1L1J05m5p0MO5k5m9j1M9N6p7k9J2P0o6oL9K6k6
2061ak0J1J4J4k6KL1l2qNM2k3k5K1J4l0l5nO2M8p7j4M1Kk8j0O9L5p5n2L5N2j4
2094B3k8j7M9Lm4l3K7N6k4j2oJ5j5k4L9%k9j9L8k0j0j4O4j7j7l9L9M0o9QL1L9
$$ plain form
2126 34 13 -81 -30 56 32 -32 -22 53 39 -6 -32 36 44 -20 -13 13 26 -4 4 36 28 -21 -18 -7 18 -32 -23 3 10 -36 -17 27 13 8
2160 8 -34 11 49 24 -40 6 74 48 -19 -32 16 7 -13 -26 31 29 -14 -33 -30 24 2 -24 -14 6 -24 -26 -9 25 -5 -6 -15 -11 -21 -7
2194 -7 11 25 -5 -23 -1 25 12 -22 10 64 25 -42 -46 49 51 -2 -38 8 22 -21 -70 -11 50 -14 -30 -42 -7 -13 -24 -5 30 -26
2226 -26 -34 -8 12 0 -10 21 25 2 -39 -21 31 -6 -51 -29 3 14 -49 -33 40 41 -53 -45 -16 26 1 -65 -9 51 4 -30 -41 3
2258 3 -8 6 -1 16 -1 5 12 33 -11 7 36 39 -7 -17 3 42 17 -26 8 31 1 -28 -28 15 38 -17 -60 20 44 11 -43 -10 11
2291 11 16 -32 -48 22 28 8 -34 6 8 21 12 -2 27 33 16 31 9 -37 30 28 0 -55 -23 20 9 -26 -29 8 47 -9 -51 23 40 -3
2325 -3 -35 -28 28 17 -40 -24 27 33 -21 -30 3 38 -12 5 10 11 -11 -3 2 -18 -34 -27 2 -16 -33 -42 7 18 -40 -53 10 34 -39 -52 21
2360 21 36 -8 -36 -17 31 13 -2 -3 21 43 -23 -35 21 12 -3 -28 -12 28 -1 -27 -5 15 -9 -24 11 10 -20 -2 22 24 -8 -17 5
$$ packed form
2126C4k1r4N1Q6k4o4J0P5j4m5k6O8Qo4PK6J3l0QL2qm9LJ1K5n0RK6Pm6J9M4j4n
2160Hm2M5L8k5o4M6O8k6o7j3M8rk0j3N7km3j9LN4k2k6J0K0l0kJ7L4l0jrMj0J4
2194gJ8J4l0j8K2K6j3l4L2N4l9o7mR5Kn3l6M6J4m3m9N9O1o4j6j2L5oj1J9L5n6
2226b6qK6K0j2j0L1Mk3m1J8N2l7m5K2L2J1o3J6P3Jr4QK9M2k5o6N6O0m7l4j1M4
2258Cj1J4pJ7j7OPK1m4J8K9Lm6j0K0L9k5m3L4K3l0k9%M3K3n5m3Q0K4l3n4L3K1
2291A1Nm8j6P0Ok0m2M0KJ3rj4K9Oj7J5k2m6O7kk8n5L2M3j1l5lL7L9n6m2P4J7m3
2325cl2PN6j1n7J6N1On4rL3L5n0J7NJk2QNk0j6PK9j8j7rM9J1n8j3O3K4p3j3P3
2360B1J5m4k8J9M8j8j5jK4K2o6j2N6rj5k5J6M0k9k6K2K0k4j5L5jl0J8K4Kl2rK2
$$ plain form
2393 5 18 -16 -16 -11 13 3 -45 -39 42 49 -1 -21 -12 13 -24 -26 -2 3 -3 -38 -21 15 -28 -15 -29 5 -20 -9 -34 2 11 -6 0 -3 -4 -32 14
2430 14 37 30 5 7 45 4 -14 -11 12 28 -43 -7 27 15 -21 -23 15 26 20 -19 5 -11 -1 -27 -24 28 -15 11 11 29 2 -18 21 10
2464 10 -16 -14 -19 29 10 -42 -35 6 -12 -40 -12 29 4 -31 -54 10 9 -19 -41 -13 24 -16 -45 14 27 5 -18 -14 5 17 21 -7 13
2497 13 -5 2 1 35 16 -2 17 29 6 -26 6 15 -1 -16 -13 11 -4 -13 -42 -8 21 -23 -51 5 34 -17 -51 -10 19 8 -25 -1 -5
2530 -5 0 8 -28 -4 -15 -6 -23 2 0 -16 -9 13 -4 -19 -9 9 22 -21 -24 6 11 -35 -76 -7 17 -42 -45 7 10 -9 -33 5 16 7 -25 -7
2566 -7 37 -2 -24 -20 -6 -4 -10 -32 3 -19 -21 -32 -16 -5 -29 -10 -15 -3 2 -13 7 19 -22 -22 -25 26 -24 -40 -27 3 18 -27 -10 22 21
2601 21 -16 -27 22 33 0 -10 -8 5 -3 -14 4 8 -7 -15 -6 3 -9 -14 -3 -8 -14 -10 13 34 8 -24 0 30 -3 -5 -16 26 5 -31 -39 18
2637 18 20 -40 -25 2 32 -20 -8 6 -4 -32 -14 -13 -3 -40 -43 -43 -8 -12 -29 9 -7 -3 -8 -16 3 -22 -6 7 11 17 -7 16 39 13 -39
$$ packed form
2393EJ3l4%NK4j0m8OQ1Pn0k0RK5l7kK4Nol5J7L6m3J3j4L4k5J1k5L6Rj7Oljk8M6
2430A4K3pk5KL8m1j8LK3J6p1L6L4j2l6kL8J1ol9K4j6J0k6LN2m3K6%J8k7k0L9j1
2464A0k6KnM8j9n2PM1j8k8K8M1k5l5k3O4jk8k2K8L7m0k9N9J3k2k3MJ9J2Mk8K0
2497A3j8PjL4j9j8J9J2k3l2L2Rj6j5LK4j5rk9L4K9m4k8N6K9n1l4M1K9j1l3K4m
2530eNQl6K4j1Rj7K5kj6PK2j7j5J0J8J3m3lL0Nm6m1O9K4n9lN2Lj9k4L8J1rl2J8
2566gM4l9k2MJ4Kok2L5k2kj1J6J1k4J9nJ2Nj5K0J2m1%lN1n0j6J3L0J5m5J7L2j
2601B1l7j1M9J1l3j0KJ3qj1J8Mj5qRRj2nJ1noMK3K1k6l2K4L0l3kj1M2k1l6qN7
2637A8Ko0J5K7L0n2J2J4j0k8J8JJ0l7l%L5mj7L8j6MnqJ9k5J6J3MOk4K3K3k6n2
$$ plain form
2672 -39 -12 13 15 -21 -18 -6 3 -12 -16 0 23 22 -17 -4 6 1 -17 -12 4 -16 -13 -15 5 -5 -13 -12 -4 1 -17 4 15 -3 -21 -4 9 9 -17
2709 -17 -24 9 -20 -16 -24 -14 3 -31 -49 -10 29 -8 -8 -13 16 12 -13 1 54 27 10 -6 17 22 -2 -1 21 23 0 -15 0 10 -25 -11 28
2744 28 -19 -58 -40 -24 -19 -20 -39 -23 -3 -57 -39 -22 11 -20 -41 -10 -4 -7 -19 -12 26 3 -6 20 11 1 -31 3 4 -18 -27 -16 -7 -24 -23 -24
2780 -24 -23 -5 -15 -20 31 13 -25 -1 4 20 -23 15 -5 5 3 -8 18 32 8 0 -3 6 16 -11 -20 24 0 -14 -13 -19 -3 -10 -34 -25 5 -14
2816 -14 -20 -7 1 -8 -7 10 0 -8 -26 3 23 17 -8 9 25 7 -18 5 17 13 -30 -19 28 28 -8 -5 26 3 -48 -23 9 20 -21 -11 -4
2851 -4 -18 -18 -13 -7 7 1 1 1 20 -31 -12 11 8 13 -40 18 32 9 -2 -30 9 13 -20 -39 -5 -49 -52 -45 -22 4 -9 -44 -5 -10 -5 -26 -7
2888 -7 4 -27 -27 17 -7 -4 -14 12 18 19 -15 8 23 10 10 22 24 26 19 -7 18 -3 10 12 20 -11 -9 -15 -10 -2 -10 -7 -15 3 1 -15 -13 -3 0 -15 7
2929 7 4 -12 9 -14 -23 -22 -18 0 -6 5 5 -15 -16 -2 -9 -17 -22 3 -6 -36 -7 -14 -8 -19 -24 -16 -18 -18 6 18 20 -15 -6 24 12 -8 17 12 7 -28 8
$$ packed form
2672c9K7K5Kl6LJ2Rj5mJ6K3jl9J3J0nj8NJ6k0LkK0j0qJQNj8K1J1j8j8J7J3%k6
2709a7pL3k9MqJ0J7l4j8L9L9l7%nK9mk5J4N3k7j7j6K3Nk4JK2Kk3j5J5J0l5J4L9
2744B8m7l9J8J6Njj9J6K0n4J8J7L3l1k1L1Olj2PL8k3rK6rj0l2L4Jk2rJ1Rj7Jj
2780b4JJ8j0nN1j8l8K4NJ6m3L8k0J0kj1K6J4k4qlRJ0k7rM4k4j4JoJ6pk4RL0j9
2816a4oJ3QrJJ7j0qj8K9K0ok5J7J6j8k5K3J2mm3J1M7%l6LL1k3n1K5L2J1m1J0P
2851dj4%NOJ4o%%J9n1J9K3lNn3N8J4k3j1k8L9Ml3j9L4m4lPK3K6j3l5L9nNk1J9
2888gJ1l1%M4k4Lj0K6OJl4K3J5j3%J2KKpk6K5k1J3KQl1KoNQqLqJ8kj6KJ0Lj5K2
2929Glj6K1k3rJMJ8oJ1%k0jJ4pqnK5rl0K9pOj1nQk%K4J2Kl5RL0j2k0K5nnl5L6
$$ plain form
2970 8 10 -15 -35 -15 -6 -4 -36 -28 -25 -4 -30 -29 4 9 -18 -28 15 6 -17 -30 12 -3 0 -17 10 4 4 -17 8 0 3 0 9 1 1 -4 -5 -3 -16 -6 4
3011 4 -5 4 -1 -13 -2 14 10 -16 23 -8 18 0 -1 11 19 -10 -4 24 6 21 -21 3 4 -9 9 -12 3 -10 7 15 25 -16 -17 21 -14 -18
3047 -18 -2 3 15 -39 -27 6 -11 -32 -19 -33 7 29 -32 10 11 -8 3 5 6 13 -4 -13 18 4 -20 -24 29 17 -17 -31 5 -1 -21 -4
3081 -4 -17 29 0 -18 5 17 -6 17 22 -1 -14 -3 5 24 0 -7 23 2 -2 15 11 -2 -5 -13 -14 21 -22 -18 -20 -8 -8 -19 -37 -13 -18 -29 -20
3118 -20 -8 -17 -29 -24 19 17 -16 -8 19 -19 -3 9 11 41 27 -11 -17 29 26 0 9 10 1 -15 -21 8 -2 -36 -11 -12 15 -9 -24 -4 -3 -29 -44
3155 -44 -34 -12 -37 -23 -23 -14 -37 -49 -6 12 -10 -29 -18 -13 -18 -10 -11 -9 -11 -26 -32 -2 -13 -32 -2 -5 -3 1 14 5 2 -29 -10 9 2 -3 -12 9 6
3194 6 -19 -7 -10 17 -14 0 6 13 9 -2 9 18 9 -14 -23 22 -6 -25 -30 -4 -8 -13 -20 -12 -21 -17 -19 3 17 -12 -7 -8 19 1 -9 19 7 6 -30 -1
3234 -1 14 23 -25 -7 19 12 -7 -15 -9 -4 -12 -13 -7 -9 7 -1 -15 -8 -33 -7 -15 17 -20 -9 23 21 3 -23 7 21 8 -20 0 20 -11 -21 -11
$$ packed form
2970HKk5k0K0RKl2QLK1k6JL3Nk7j0M3rk3j3M2j5Lj7K7o%k1K5qLlRq%njKj3J0J0
3011DrRnj2J1J6mk6L9l1K6j8jJ2Qk9OK8j8J5m2K4Jj3J8k1J5j3J7QJ0m1jL8l5m
3047a8J6NJ2n4J2L3j7k1J3j4M0K2o1M2Jj9J1KJPj7rL1j4k4mN3j2l4j4L6ok0J7
3081dj3M6k9j8K3J2k3K3Nk3j3J1QJ9k4pL0k1mJ7mj3lqjL5m3MkJ2%j1j8K4nj1R
3118b0J2rj2NM3kl3QK7l8J6J2KL0j4l8oM6lk6RJrj6oK9j0l4K5jK7k4j5K0Jk6j5
3155d4J0K2k5J4%Rk3j2M3J8k2j9J1NnQjKkj5oL0j1j9L0lKMJ3rll1J9J9pnrK1l
3194Fk5J2lK7l1J4OPmj1J1Rrk3rM5k8j9nK6mnpQrMkK2J4k9NjK7j8j0K8j2jl6K9
3234aJ5Rm8J8K6pj9qONqjOkJ6qj4Pk5K6qL2l7J1L2kj8k6L0J4j3k8K0K0l1j0J0
$$ plain form
3271 -11 7 -5 -18 -3 -16 -16 -48 -41 -15 -47 -36 -30 -18 -10 -23 -21 -20 2 5 -36 -22 -28 -22 -14 -10 -13 -20 -26 19 9 8 12 8 -1 0 -12 -10 -9 -2 -19 1
3312 1 -11 10 17 -4 11 6 -6 -17 -5 15 15 3 2 9 21 12 23 28 10 6 8 13 -6 3 -5 -15 9 0 -18 10 -11 -24 -15 -9 -14 -18 -10 -36 3 -30
3352 -30 -16 -22 8 -21 -53 4 4 5 -23 -14 11 16 -8 15 10 -12 -14 -2 9 1 -10 0 6 -21 -3 -6 1 9 -10 -23 6 -7 -3 -12 6 -1 -6 -21
3390 -21 -12 -8 -17 -18 0 13 -22 -13 -32 -6 -5 -12 7 1 -3 -12 -29 -30 -24 -21 -13 -8 -10 -29 -26 17 -4 -19 9 3 -10 -12 -7 11 19 -13 9 3 8 4 -14 -2
3432 -2 6 -15 3 12 33 5 -3 6 9 10 0 -2 3 0 -16 -24 -8 -5 -11 -6 -15 -14 -10 -14 8 3 10 13 -19 30 -13 -3 -9 18 4 2 -16 7 -22 -9 -9 -23
3474 -23 4 -36 -46 -8 -28 -21 -33 -10 8 -24 -29 -16 9 -16 -21 0 0 -5 7 20 7 9 5 9 35 10 8 25 23 -26 -1 1 -3 -17 -6 -13 -21
3511 -21 -16 -34 11 -28 -19 -8 7 6 -7 7 -5 -4 -17 -22 -2 -7 -13 4 0 0 -2 1 -30 -17 2 -5 -23 -1 0 6 -23 -7 13 -4 -8 -3 -8 -7 26
3550 26 -34 -15 -16 -19 -6 19 9 0 -1 -1 4 -1 -7 -3 15 1 -1 15 6 -10 -27 -34 -15 -15 -39 -41 -13 14 -21 -30 -34 -6 14 -9 -7 -6 9 -11 -8 -8
$$ packed form
3271a1J8j2j3J5j3%l2PK6l2J1OJ2Qj3KJK2Lm1J4oOQMlpoM5j0jMmrJj2KJPj7K0
3312Aj2K1Pk1J5nj2j1J2K0%j2jPJ2rJ1Nj8mKNj9Rqj0K4rj8K8k1j3ROnmQk6L9l3
3352c0J4oL0k9l2N7%Jk8RK5Nk4K3nk2kJ2J1qj1J0Ok7J8lPQj9j3K9j3MrJ8pnj5
3390b1RMrjJ8J3l5Rj9K6JpJ9omrj7jOLQNkj9LM3k1j5K8oj3kNJ8Ql2K2oNmj8J2
3432bQk1J8RK1k8qRLJj0kNlj6qJ6LoNrJMmK2nPLl2M9m3J0oK7j4kj8K3k9J3%j4
3474b3K7m0j0L8k0Pj2K3J8l2nJ3K5k5nK1%nJ2J3j3KmMK6k5kJ7km9K5Kmj4J1pq
3511b1Nj8M5l9RJ1J5jj3J4j2Jj3nK0noJ7m%kLl1J3J9pj8K2JOk9J6K0j7mNnJL3
3550B6o0J9jlJ3K5j0rj%NnoMJ8j4kJ6rj6j7pJ9%k4kK8K7l5rmK8K0k3KJJ5k0L%
$$ plain form
3590 -8 -12 -20 -3 -5 3 -5 13 3 -12 21 8 24 6 13 21 -4 -8 -17 -10 -4 3 -33 -8 2 -19 -3 -20 -22 5 -19 -4 -19 -8 -15 4 1 -8 12 3
3629 3 -1 5 0 16 -5 1 -1 -2 -8 -1 4 -14 -25 13 -3 -25 17 0 -14 -24 -14 16 -15 -25 -19 -1 -5 -7 -7 -2 12 6 -4 5 35 25 10 13 6 16
3669 16 4 8 4 -11 -24 -17 -2 -15 -4 7 8 -8 -37 1 -10 -9 0 -20 9 17 -11 -22 5 -2 -1 6 2 -5 4 -5 3 5 1 -4 18 13 2 -7 -21 6
3709 6 -3 -38 -16 18 -10 -25 -3 -7 -13 2 -12 1 20 7 -2 -21 12 0 3 14 12 12 22 -16 15 3 8 17 15 15 4 -19 -6 -5 1 -8 6 -10
3747 -10 -34 -2 -10 -13 -26 -26 -15 -14 -17 -17 -9 7 -12 -6 -24 16 -10 1 7 16 -5 -10 -2 -7 -22 -16 13 9 -3 8 -40 -28 6 -15 17 16 -6 -30
3785 -30 -37 3 -8 -10 -16 -14 -3 -5 -9 -12 18 -12 16 9 21 11 -18 0 12 12 -7 -11 -7 -28 -14 -39 -5 5 -2 -24 -31 -8 -27 -7 27 6 -1
3822 -1 -8 -1 4 -13 -19 7 22 3 -10 5 -12 -15 -8 10 -2 24 11 -5 6 11 7 11 -5 -10 -7 -32 -19 -20 -11 -30 -16 -32 -20 -2 -13 4 0 -1
3860 -1 2 -22 0 -30 -8 5 9 -8 8 -3 -11 -3 -10 -20 -32 -25 -16 -27 -47 -29 -16 2 -9 -14 -8 -7 -24 7 9 0 0 -15 2 10 16 0 8 -17 -7
$$ packed form
3590hmqJ7kQqJ8j0j5L3j3J6j8PQk5mrPOPl6K5J0k1J6j7kK7k4J5j5J1pJ9lrK0r
3629CmOnJ6k1OkjoPNj8j1L8j6k2M2j7j4j0J0L0l1j0OJ8mk%NJ4oj0RL0j0j5LpJ0
3669A6j2Mmj5j3PJ5j3J1J1Jj6k9L8j1JRk0K9Qk8j1K7pJPmpRrQKmnK2nj1rj4K7
3709Frl5K2L4k8j5K2moJ5j4J3J9j3rj9L3j2LJ1k%J0l8L1j2NRk%j1k3J3JOrJ4j6
3747a0k4L2qlj3%J1Jl%QJ6j9Oj8M0k6J1ORk1nQnj5OK9mj2J1m8J2L4k1L2jk2k4
3785c0pM0j1koKJ1kmlL0l0K8pJ2j0k9J8J2%j9mMk1J4k5L4J0pk2pK3j9K0L4k1p
3822apPNj7oK6J5j9j3J5j7lPJ8j2K6j3j6J1NmMj6nLk5J3jRj9J4j6J2J8j1J7mj
3860aLk4K2l0K2J3Mj7J6j1qQpj0j2PRj1k0J8J3J8j1nOJj7L1Kr%j5J7QOj6Qk5J0
$$ plain form
3899 -7 -4 9 -10 26 4 -13 -25 3 -21 -20 -9 -2 17 -22 -2 -6 -14 -27 -9 -22 4 4 -14 -6 -16 -3 -11 10 -12 -5 11 12 0 -13 -3 -11
3935 -11 8 -22 0 21 1 7 -29 -27 8 -18 -8 -13 -21 -7 -19 -14 4 -18 -26 -2 7 7 2 6 -15 27 30 14 10 33 -10 2 2 15 12 1 6 2
3973 2 -22 -9 -18 -12 -27 -16 -13 -13 3 -6 -37 -11 -17 -18 -14 -7 -22 -18 -2 -29 -15 -34 -8 -10 5 -14 0 34 4 1 -5 0 -20 -13 0 -5 -9 -19 -6
4012 -6 7 13 -12 -16 -9 12 20 -15 -2 8 -1 8 1 19 7 -13 18 18 -18 -1 0 6 -11 -26 -17 -13 -17 2 -20 -14 -25 -12 -18 -28 -23 -39 -7 -15 -21 -32
4052 -32 -24 -10 -12 14 -20 -12 20 -12 12 5 -9 14 20 -22 -6 10 6 -6 6 10 -6 -9 -9 -19 -5 -14 -18 29 -6 -17 -14 8 15 -20 -6 -19 -16
4089 -16 -28 -16 -1 -10 -7 -10 -14 -10 0 -15 5 -21 -10 19 -20 24 9 -14 -12 -20 -11 -56 -37 -9 -2 -21 -8 7 -28 -19 -2 8 13 -14 -2 9
4125 9 -14 -6 -6 18 -2 -4 5 -4 3 5 1 -9 -5 8 3 -7 2 -8 -10 -18 9 -14 -24 -8 -27 -8 -20 -15 -18 -23 5 -18 -24 5 -6 -40 -29 9 -44
4164 -44 3 4 -4 -9 -33 -19 -5 -21 -18 -4 -16 -6 -18 -26 2 -11 4 0 8 -12 -9 -11 18 5 8 -2 -9 28 22 6 12 16 9 -14 -2 32 41 22
$$ packed form
3899gLJ3j9L6k2j7j2K8k4JJ1PJ9l9K0mqj3J8j3K6%j8Qj0J3qK1k2PJ6Jj2j3J0q
3935a1J9l0K2K1k0Ol6KL5k6J0nqJ4j2NJ8k2qK4R%nMk1M2Lj6mK3m3J2%J3lj1Nm
3973Bk4J3rOj5J1L%J6rl1K6ojMPj5MJ6k7J4j9K6kJ5j9J4L4l0loNk0PJ3nmj0J3
4012fJ3Ok5mPK1Ql5J3J0rRpJ8j2k0L1%l6J7JOj7j5RMmJ9k2Oj1J3oj0Nj6L2qoj1
4052c2QJ4kK6l4QL2l2K4pj4K3Om2J6J6mj2J2Mj6l%j0J4rmM7l5j1LK2Pl5J4j3L
4089a6j2J2J5rLlmMJ0j5K0k6J1K9l9M4j5k3KqRm5J9K8Pj9J3J5l5RJ7J0Nk7J2J1
4125Ik3Q%K4k0kRrPKmj0MJ3nj0Rj0kqK7k3j0J6j9J9j2NlnK8k3oK9j1l4J1L8n3
4164d4M7Jqnk4J4J4j6LJ4j2J0j2qK8j3J5mQk0LkK9j3Lj0pL7oj6OMpk3J2L4Rj9
$$ plain form
4202 22 2 5 10 6 1 13 5 -7 -2 -18 -14 -26 -14 -30 -28 -18 -4 3 -10 -13 -3 25 16 12 -9 11 -2 8 14 -2 -13 8 10 10 22 1 13 10
4240 10 8 14 -22 7 -4 -4 8 -19 -16 0 -4 2 27 -12 -11 -12 -16 3 31 9 18 14 14 29 20 -7 8 12 -31 -17 -8 -5 4 -1 -22 -15 -17 -1 -10 -2 -25
4281 -25 3 7 4 -14 0 -33 5 -12 -30 7 -21 11 44 29 10 47 14 26 6 -12 23 21 22 5 16 29 -4 6 18 3 -1 11 -6
4314 -6 19 16 10 3 12 31 1 5 19 17 11 14 18 8 30 -2 5 13 7 16 -13 -7 -11 15 25 1 -3 -34 9 -3 -12 -18 -11 -24 -26 -6 -27 14 4 -9 5
4355 5 4 -3 12 3 26 14 22 0 0 -3 4 3 6 -14 16 -15 9 23 19 -15 -5 -2 -30 -13 0 0 6 -10 -20 1 -7 -20 -1 -3 3 -16 7 12 23
4394 23 6 0 -8 -2 10 8 16 22 -4 12 -19 9 23 -12 -10 -10 -8 -6 -11 -30 -9 -11 22 -6 13 1 4 5 21 21 23 33 23 3 -6 5 24 4 16
4433 16 -11 21 -9 -18 -2 -3 -14 -9 -19 -24 -19 -27 -14 -24 -7 -14 -2 -30 15 3 3 15 -12 -21 -17 -1 -14 -5 -12 3 -3 8 -36 14 7 -2 -21 -14
4471 -14 7 -13 -18 -22 -9 8 5 3 11 4 -4 4 17 21 -5 -27 -19 1 17 -18 3 12 -6 16 -3 10 24 2 -1 -5 -13 -4 2 -29 -22 -20 -14 -28 0 -16
$$ packed form
4202B2k0LNmnJ2qj2Nj6Mj2J2j6KJ0J4Pj3lJ0K8rmk1K0j3J0Oj6j1K1K%J2k1J2l
4240A0kOl6K9j1%J2k7LJ6mOK5l9JjmJ9K8k2Rm%J5rk7J5Mm3J4RLRnk1PkJ6rQk3
4281b5K8Mlj8J4l3L8j7j8L7k8L2L3j5j9L7l3J2k0j8L5kJj7J1J3l3J0J2j5mJ2j7
4314fK5lopRJ9l0MJ4koLMj0K2l2PQoRk9OmK6J0k4ml1M3j2roPj3kK0k1M1j0j3J4
4355EjpJ5rK3j2Qk2%lPjLk0L0l1K4J4ml4J0Lk8J7J3%Oj6j0K1qj3J9kOj9K3NJ1
4394B3j7oqOJ2kQOk6J6l1K8J4l5K%KKnj9K1kL3k8J9j2LJJ6%KJ0j0k0rJ1J9k0J2
4433A6k7L2l0rJ6jj1Nj0nNqJ3j0J7pJ2k8M5j2%J2k7rMJ6j3RpJ5oJ1m4N0prj9P
4471a4K1k0nmJ3J7lkQpqQJ3Mk6k2QK0J6l5K1Rj8K2j9J3J4k2lmqROl1PKOj4K8j6
$$ plain form
4511 -16 -20 -15 11 4 -27 -2 9 0 1 -1 -10 -17 13 -7 17 7 7 4 25 1 5 -8 -13 -5 -9 13 3 14 11 6 8 -2 -18 -5 12 -28 -4 0 16
4550 16 6 -16 -22 8 -8 25 -5 -12 10 21 -11 7 7 12 -1 -3 2 -3 14 -4 19 -3 -21 -15 -38 -35 -21 -1 0 -6 -27 -2 -5 -1 -8 3 -29
4587 -29 -2 16 -6 -7 -5 -9 21 23 16 19 7 5 12 17 -16 16 -1 9 7 -4 -4 -21 -23 -21 7 -5 -26 3 8 -3 -13 -12 0 -2 -7 16 5 9 12 11
4627 11 2 -17 -13 10 -5 2 -12 -6 -20 -16 -10 -19 -19 -8 -18 -21 -23 -12 -6 18 -15 -7 -19 -32 2 -10 5 -3 -1 -10 10 32 10 23 21 19 24 -5 16
4666 16 -17 22 14 3 16 -9 -11 -21 0 -11 -25 -20 -3 -10 -34 -9 1 -3 -14 -14 -8 -24 5 -7 -8 8 -3 -1 10 5 -3 39 20 13 22 18 21 8
4704 8 -8 -20 -8 -6 10 -20 25 -6 -10 2 7 3 3 12 -6 15 18 23 19 9 14 20 2 21 -1 7 11 4 -6 1 -9 6 -6 -9 4 17 -11 -33 -15
4743 -15 -28 -19 -6 -22 -8 0 -12 -16 -11 -3 -12 -35 -8 4 -16 7 1 -8 -1 0 3 6 -11 9 -13 -4 2 -2 27 -12 -6 -17 0 41 -5 -8 15 -8 -6
4782 -6 -7 -1 21 -2 -30 -4 6 -11 17 30 -7 1 30 3 11 11 9 -1 1 6 1 1 -17 4 6 -6 -19 -11 5 12 -13 -7 9 17 -8 -2 16 -6 13
$$ packed form
4511a6mNK6pl1K5J1rJkrpL0k0K4j0%lK1k4Mj3nQmK2j0J1lnKj0j6J3J7m0K4MJ6
4550A6j0k2oL0j6L3l0pK2J1l2J8%Nj3kNnJ7j8K3k2j8Ok3LJ4K0Jok1K5lMpJ1l2
4587b9K7J8k2jKmL0KpLj2kPNl3L2j7J0kj1%j7kKK8j2k1K9Nj1j0JJ2knK3j1MLj
4627A1rj9MK3j5Pj4Oj4MOr%J1j0lkJ1OK4l3Qj2j3L4j2J5qKrK0K2k2J3kkNk9K1
4666A6l3L9qj1J3k5kj0K1j1j4NJ7pk4K5J0mj1%Oj6K9j2jJ6j1KJ1nqM2j9pRmLj3
4704Hj6j2J2KJ6l0M5l1mJ2Nm%Rj8K1LNmj0NOj8J9k2QMpj0Pj0J5j2lJ3J3k8k2J8
4743a5j3RJ3j6J4Qj2mNQrk3K7J2k0K3orPJLLj7K0k2ROmK9l9Oj1J7M1m6lK3k3K
4782fjOK2k3k8K6J0j7K8J3l7QK9k7Q%kj0KNn%j8K1Kj2j3QJ6Pk5OJ6Qk5OJ8k2J9
$$ plain form
4821 13 18 27 21 16 17 29 19 15 2 7 8 18 1 1 14 22 14 10 31 9 -10 -2 -9 5 -10 9 0 -16 -5 -26 -15 -9 4 16 -5 -32 5 5 4
4860 4 -12 -9 -13 1 14 -7 -5 7 -11 -14 4 1 -5 -24 1 -21 4 10 12 -5 -16 -15 10 -2 -15 4 2 11 1 8 -6 13 7 -9 1 15 9 19
4898 19 9 24 22 16 23 -17 13 26 -7 -1 17 -11 -6 -15 -13 -28 -25 -26 26 1 -22 -4 -14 0 2 10 20 12 -1 8 25 5 8 -6 18 9 6 7 11
4937 11 15 23 9 -4 8 -6 -16 -1 14 2 -12 -12 -5 -15 -6 -1 -2 20 8 -3 25 -3 2 18 -4 0 36 1 10 2 -24 9 -1 2 6 4 -12
4974 -12 1 -10 -20 -24 14 13 0 -5 13 -7 -20 1 -7 4 -11 0 -5 2 14 13 4 -12 14 35 -4 12 1 2 5 0 -16 4 4 12 -9 -11 1
5011 1 -6 17 -17 -5 8 11 6 1 19 4 -11 6 2 5 20 23 7 3 31 20 -1 16 2 -2 7 12 1 -17 1 -12 6 -14 0 -20 -6 -10 -11
5048 -11 -12 2 -15 4 4 -11 14 0 6 26 15 18 9 18 12 11 11 23 23 15 13 -2 3 7 22 -12 12 -23 -8 -10 -10 9 -14 7 9 4 6 -1 -19 -4
5088 -4 -3 2 10 4 0 24 8 -8 10 17 25 8 -7 -4 -3 1 -13 -8 -6 -4 10 -6 -4 -21 -9 1 1 20 2 -6 24 9 20 6 19 18 21 28 18 11 26
$$ packed form
4821A3NRonJJ2j0mj3NJJ0j7%J3QqmK1k2j9QpJ4j5J9rj6J1k1J1OJ3J2k1k7L7%j
4860Dj6LmJ4J3k1KJ2j8lJ8loj9K5k2K5OKj7j1JK5j2j3J9kRj0Pj4J9oj6J0J4oJ0
4898A9j0J5koPm0L0J3l3OJ8k8NrKj5LjN2k5k3J8j0J4KQJ0qj3RJ7k0Lj4K4rlJM
4937A1MQj4j3J2j4j0J5J5j2j4%Pj0RNjK2j2j1K8k8NJ6k2ML6l5Rqk6L3j0LMkj6
4974a2J3j1j0mL8jj3nJ8k0j3K1qJ1j5J1nPJ2jrj6K6K1l9J6j1JLnj6K0%Qk1kJ2
5011ApK3l4J2J3LnnJ8j5j5J7mLJ5Lj6mK8j1k1J7j4mRNj1j8J8j3J8k0J4k0J4mj
5048a1jJ4j7J9%j5K5j4OK0j1LrRoj%J2%qkj5NMJ5l4K4l5J5k%J9k3K1KnKpj8J5
5088dJNQomK4j6j6J8PQj7j5LJMj4NKKJ4j6Kj7J2J0%J9j8qL0j5J1j4J3jLPj0pJ5
$$ plain form
5129 26 -13 -12 6 -4 6 26 3 -6 -8 1 18 -8 -1 -23 13 -2 -7 -33 -3 -3 -2 -6 -6 -15 2 9 24 1 -5 -3 13 17 7 -1 13 17 7 -17 -9
5168 -9 3 0 -8 -6 23 30 3 0 3 -4 4 15 22 -19 12 11 8 2 4 12 17 1 25 17 -2 31 6 32 26 26 7 18 44 7 18 -3 7 -4 -3 19
5208 19 -8 -10 10 0 -13 -3 -1 -3 14 3 -2 1 -16 10 -2 3 23 5 -1 -6 10 14 -4 7 -7 19 21 -22 14 20 24 17 -6 6 26 -20 5
5245 5 -4 4 -11 -11 12 -7 25 22 -1 10 9 8 11 -1 16 5 17 -7 1 15 2 2 20 -21 9 3 -2 -28 -11 -26 -9 -15 -6 -3 17 -15 -14 9
5283 9 13 26 -12 -9 0 -2 -9 19 2 21 20 3 20 18 15 15 33 45 -21 33 3 -11 24 -7 3 3 2 -9 -25 11 4 11 20 13 6 9 -7 19 17 5
5323 5 16 29 4 22 -20 12 5 -9 5 -3 -7 -12 8 19 5 12 14 14 1 9 -6 -15 8 -10 -5 -12 -7 3 19 5 9 32 -10 11 0 30 5
5360 5 37 23 38 -12 -16 14 -21 -13 -13 -6 1 -17 -12 -4 -8 -6 -3 -14 10 0 -18 -12 7 -8 7 8 8 14 -11 3 -6 28 -27 4 -24 -8 30 7
5398 7 15 15 14 -27 -8 5 -10 12 5 -10 -22 11 1 -22 -4 -16 2 7 28 12 -7 10 6 16 40 12 -1 41 7 38 14 23 12 -14
$$ packed form
5129B6l9JJ8j0J0K0k3rkRJ7k6Pk2L6j5nk6L0%Jm%rJ7PJ5k3oKJ6Mj0qJ4Mj0k4Q
5168iJ2lqKK9Pk7lLpQJ1Pm1L1jloKQNj6K4qj9L3k5K6o%j9J1K6l7J1k1J0j1JK2
5208A9k7kK0j0j3J0KkJ7j1nLj7K6j2NK0j8onJ6Mj8J1j4K6Km3L6OMpk3J2K0m6K5
5245ErQj5%K3j9L2lk3J1jjLj2J7j1J2k4QJ4j3%J8m1L0onk6J7j5J7oRLK0l2JK3
5283IMJ3l8LRkpK8j7J9jj7J7kl%J8J2o6N4l0j4L5l1J0%jj1j6L6pPRppLj6K6kj2
5323EJ1J3k5J8m2L2pj4J4qmnK0J1j4PK%j3Qj5rK3j8NpNJ0J6j4MK3m2K1j1L0k5
5360EL2j4J5n0mL0l5Q%PPj8NQmKLj1K4j0j8OJ9j5J5J%Ok5J4rL4n5L1k8J6L8k3
5398GQ%jm1J9J3j5K2pj5j2L3j0k3J8j2J8NK1j6j9J7mJ0K4k8j3M2l4L1k4Rj1k6
$$ plain form
5432 -14 12 9 14 -7 10 -1 16 5 8 16 9 -9 -9 -6 -2 -18 -9 -21 1 -1 -14 -23 -13 -14 -5 29 1 14 28 10 9 -2 0 0 2 -10 1 24 -25
5471 -25 4 8 -10 -3 6 -2 7 4 -6 4 5 -7 13 7 -4 20 12 8 13 25 8 8 11 11 24 0 6 18 -1 1 -9 1 -6 6 -9 -2 -20 -23 -8 -13
5511 -13 0 -18 -26 0 -7 -4 -14 10 12 12 2 20 8 5 12 32 13 10 6 13 27 5 11 12 25 2 20 23 25 -15 3 14 18 9 -10 -23 12 3 0
5550 0 -7 15 18 -10 12 -2 -2 11 -6 3 -1 -2 -14 12 7 -4 -15 -3 6 -31 6 16 -6 -6 -16 -1 -17 26 -4 -10 -2 -13 3 5 12 2 16
5587 16 18 17 33 21 -9 29 12 24 13 17 28 6 -11 10 35 0 -3 27 22 -22 4 5 -12 -12 -22 2 1 -1 -5 -22 20 -3 -3 3 4 30 -12
5624 -12 11 9 -10 -12 7 -24 11 -12 26 -1 16 -14 2 1 1 -18 7 -3 -1 7 0 5 -1 9 6 0 21 0 -13 8 -6 16 19 52 32 31 15
5661 15 18 26 24 -2 11 -7 -4 11 -8 -16 -13 10 -9 -13 -18 -14 -5 -28 -13 -7 -4 -11 1 26 -18 -8 37 18 13 8 8 1 17 21 14 32 17 12 7 -10 -2
5702 -2 11 -10 0 13 6 -8 13 29 6 1 7 -12 40 10 18 11 3 1 9 25 14 16 28 3 5 -4 -2 24 26 18 -1 31 12 27 -25 2 -18 -13
$$ packed form
5432a4K6lNk1J7j1J7j1LQpj8%LMj6Rj2K2kj3rJ0jRL4k8J3J4j8jj1K%Kj2J1K3m9
5471b5K9Mj8PRqRlj0J0Jj2K0oj1K4qmNJ2j7%L%J3k4OJ2j9Kj0J0pJ2j5Pj8lJ5n
5511a3J3j8qK6pLj0K4K%j0J8j2lPK0j9lmPJ4k2OJJ3k3J8LKm0J8J1Mrj9j3L5rl
5550@pK2Lk8K2j4%J3j7Rmjj2K6nj1j1J2Rl7L7J0k2%j0J5j6M3l0oQj1J6KPj0J4
5587A6KjJ6j2l0L8j7J2j1MJ1k2j7K1K5l5lL0nm4K6Jj7%j0K4jkmj7M2k3%OJK6m2
5624a2K3kj9kJ9l1L5k3L8k7J7l0J6j%j9K5j0KQpNoJ0loK1k1j3K1j4K2LL3k0jj6
5661A5LQkk6J3j8LJ5j9qLK3j9mnMRk3J5OLpJ2K5m4J0M5j9nn%pJ6MpJ8j5nnj7Q
5702bJ3k1J0J3pj4K1J6k3nOj9N2l0QpqkQJ6j1KJ2k5KrKK6Kqj9L2j9J5n2K7k0N
$$ plain form
5740 -13 2 -24 -11 3 4 6 -10 -4 -23 -12 -10 13 14 -12 -9 22 16 -2 13 8 1 27 11 0 6 -9 9 4 -19 30 -1 -14 2 1 -19 -9
5776 -9 -11 8 -1 5 23 13 -5 -6 -13 0 3 10 0 12 9 20 10 13 11 0 -1 9 9 -2 -21 -8 17 -12 -16 -10 -33 -13 -1 21 -1 -4 -3 8 5
5815 5 7 14 23 5 13 33 18 10 17 38 32 25 22 9 21 12 5 8 10 -4 22 13 11 16 12 3 9 8 0 -8 -23 -7 -7 -2 10 -8 -11 -6 11 16 -6 1 9 -9 -7 -8
5861 -8 1 12 13 0 -16 9 -18 -15 -15 -39 -12 4 -5 -16 5 0 -3 13 14 1 -4 -2 13 -11 8 9 -5 26 15 14 25 24 38 -4 43 17 -4
5898 -4 3 16 5 10 15 -13 -8 -26 -2 -11 -28 -16 -11 -26 -17 4 -18 -24 -14 1 18 13 12 21 23 8 27 7 7 -11 -2 8 -2 0 8 7 1 7 3 -3 6 -5
5940 -5 -4 -10 -9 -5 -9 -17 -23 10 -12 -3 -17 -6 12 11 12 4 10 15 23 14 15 7 -12 -16 4 3 -11 -8 -35 -3 -25 -18 -23 -32 -9 -8 10 8 -3 3 1 -8 3 -12 11
5985 11 -16 26 18 -9 10 9 36 31 20 5 3 47 35 26 5 11 -2 21 -20 -19 -9 2 -13 -19 8 7 15 -8 4 23 13 11 -2 9 30 11
6021 11 -12 33 -15 23 8 13 0 -14 -12 12 -24 12 13 5 -7 -3 -16 -20 4 3 -6 -6 11 -15 -4 -6 -7 -6 -20 -16 12 25 -2 20 18 24 23 -4
$$ packed form
5740a3J5k6J3J4JKj6Oj9J1KK3Jk6LL1oj8J5npK6j6j1Oj5J8nk3M9l1j3J6jk0J0
5776ikJ9rOJ8j0j8jpJ3LPj0J2lJ1j0Lkj1jJ0%j1j9J3K5k9mOk3K0J2K2k2lJJ1l
5815EKPRj8QK0j5qPK1oplj3J2rpLKj4K6rkNmrOjqqj5J6%NJ2j8lNJ7Nk2PQj8Kj
5861hRJ1Jj3j6K5k7L%k4K7J6rj1K1nlJ6Jj3nKJ5k4J9Jj4L1j1jJ1jJ4m2M7k6k1
5898dPJ3j1NNk8Nj8K4rj7J2Nj5RK1k2oJ0J5J7njRKj5J9k0%j8RJ0j0KQjoOmoRj1
5940eJoJMmqoL3k2Rj4J1J8jJqONQrJqj9mK0jj4Lk7L2k2PnrK3JJ8kj1OkrJ1j5K3
5985A1k7M2qk7J9jK7nj1j5kM4j2rk1Oj3K3m1JJ0J1j5oK7jQk3J2J9j0kj3J1K1j9
6021A1k3M5m8L8j5Nj3j4KK4l6L6Jqj2Mj3mK4jr%J7k6J1kjJj4MK8J3k7K2kOjk7
$$ plain form
6059 -4 10 -5 45 12 29 -3 -3 14 -7 -1 8 -2 -4 12 -3 -19 17 -12 -3 -13 -2 13 -17 21 13 -2 34 -5 1 2 -2 38 -7 3 19
6094 19 -12 10 6 6 12 15 3 16 12 16 3 -17 2 -11 -25 -12 32 3 3 26 9 12 19 -8 28 32 13 19 34 37 27 35 26 33 8 25 5 44
6132 44 13 5 15 15 5 16 27 10 -1 12 5 11 0 -6 -2 6 10 10 10 15 6 11 24 10 25 17 13 14 18 22 -1 18 2 4 2 17 -4 8 8 -15 -18
6173 -18 14 10 12 24 8 -4 11 8 7 13 6 -7 32 -11 2 3 37 -4 27 19 -3 24 -8 19 -18 -3 2 -20 6 30 -1 -21 -12 -26 -1
6208 -1 26 -6 -17 -4 14 7 20 0 12 14 5 29 17 26 29 28 23 19 28 1 12 33 11 17 27 23 24 12 -2 12 -3 11 24 7 12 0 23
6245 23 7 -5 31 6 1 2 29 5 7 3 15 -16 -2 27 -6 10 8 3 9 -10 5 5 15 -13 -28 -21 13 -9 16 -22 10 10 7 -2 15 20 19
6282 19 13 22 18 10 19 8 10 41 9 27 27 12 33 13 21 36 37 5 2 9 7 2 11 -9 10 9 -1 -12 -6 11 24 23 10 2 15 19 17 29 16 1
6322 1 0 -5 15 -9 7 26 10 -10 21 6 -28 2 12 29 -8 15 -8 -1 0 -14 27 -34 -13 -27 -6 -12 -1 -14 6 6 10 27 6 8 20
$$ packed form
6059dJ4j5N0l3J7l2%J7k1ORj0kJ6j5j6L6k9Rj0J1J5l0L8qj5L6l9OJmM0m5J0J6
6094A9l1K2m%OLj2J3mMj3k0J9j3j4J3M4k9%K3j7LPk7L6Mj9OJ5Lj0QrPk5J7k0L9
6132D4l1qJ0%j0J1J1j7j1J3pOj1oMQM%%NrNJ3j4J5qmJMMk3J9j6KkJ5k1J2%k3l
6173a8L2mKJ2j6j2J5ljOpj3L9m3J3JL4m1L1qk2K7l2K7l7J5Nk2K6K4l1k0Rj4K5
6208aK7l2j1J3J8pJ3k0J2KrK4j2RLjnmRk7J1K1k2OJ0mJj2j4J4j5J4J3j7Nj2K3
6245B3j6j2L6k5nJK7k4KmJ2l1J4K9l3J6knOj9J5%J0k8j5PL4k2K5l8L2%lrJ7Nj
6282A9oRmqRj1KL1l2J8%j5K1k0QJ5Jl2lPknRk0J9jj0j1OJ7J3jj3qJ3MkJ2j3j5
6322AjnK0k4J6J9j6k0L1j5l4L0J0J7l7K3k3PJj4M1o1K1j4K1oJ1j3K0%MJ7k1KJ2
$$ plain form
6357 20 53 2 18 25 17 1 -27 9 6 -8 2 10 -38 -3 -1 -16 -11 -20 -3 -8 -4 -1 -8 17 -15 -9 7 -5 -15 -9 12 11 -14 2 -3 2 12 16 15
6396 15 2 5 -7 -4 1 -8 35 11 13 30 -1 22 0 -7 -10 13 12 0 39 34 14 14 37 30 16 11 5 14 36 -1 5 -7 2 15 -13 1 -3 8 -5
6435 -5 12 -14 14 1 -4 6 12 -13 10 -12 -8 -21 -9 -15 -1 2 11 11 13 9 -5 4 6 27 12 23 5 6 3 -9 27 9 -4 8 6 -5 8 -24
6473 -24 -8 3 23 16 14 9 -5 -20 2 1 -7 16 -1 -7 3 -3 9 14 4 18 -4 23 20 16 1 2 4 31 -8 -18 -3 -17 9 -6 -14 6 -4
6510 -4 4 1 7 22 9 -11 11 24 4 29 23 -5 27 15 36 21 -9 30 28 11 15 15 22 32 24 -3 18 8 8 -5 7 -32 -25 -1 2 6 4 -3
6548 -3 -24 -3 1 -5 -4 -1 0 19 23 28 20 16 1 2 10 19 15 6 18 15 5 -2 -7 -14 -1 -4 10 1 8 6 3 6 8 25 -5 6 0 -11 2 9 6 23 0 3 -4 26
6594 26 9 36 12 24 12 6 22 -1 13 -4 0 -9 -16 9 -8 -7 -35 11 16 -1 -5 -17 1 -1 -14 1 -4 8 3 3 20 24 -25 -15 13 -23
6630 -23 -13 21 6 0 14 15 28 1 -10 7 -23 24 21 6 4 7 16 15 16 -7 -6 -4 -9 36 -10 -8 -10 12 -1 2 -10 -1 -2 -8 -10 -13 1 -21 8 -11
$$ packed form
6357B0L3n1J6Pqj6k8L6lj4J0Qm8L5Kj5NrJ7nMLpK5l2OJ6j2j0OK1jk5J6nNJ0Mj
6396A5j3Lj2LNrM3k4KJ7l1K3k2plK3jj2L9nk0%K3pj4noRK2l7Oj2RJ3k8J4mJ1j3
6435eJ7k6K8j3nJ0Ok5K3k2Mj3J2oJ4LR%Kmj4RKK1j5J1j8Jlj2L6j8j3J2kj1J3l2
6473b4J6J1K0pknj4j5K2jqK3j7oJ0oJ2Nj0J4k2K7lmj5JKK7l9j0J5j4K6j5qK0j0
6510dQlOJ5j3k0K2J3k0K5ok8L2j2K1j5l0L9kj7M%PJ0qk7K1j0%j3J2l9PK4LMkp
6548ck1K1MoJLJJ9MNqmj5JQRmrJ2lj0pnpJ3lJ4rPklLKJ7l0J1oj1J3PlJ7k3LpL0
6594B6j7K7k4J2j2oJ6k3J4j7MrpK5j7Jk8M6Nj7mj2J8kj3J5nJ2n%J7Mm9J0K8l6
6630b3J0L4j5oJ4JJ3k7j1J7l0M7lj5kLRjJk3JKnM5m6KkK2j3Lj2RjoklJ4k2K9j9
$$ plain form
6670 -11 -4 -19 -4 -21 -10 -9 9 -13 -9 -20 12 -5 -2 -6 2 -3 -7 2 -11 20 -5 25 -4 12 32 19 27 31 20 22 22 13 3 -6 2 4 -8 -8 11
6709 11 15 1 10 -15 8 4 -3 -28 -8 25 4 21 -1 3 -5 1 -18 0 -21 -51 12 -14 5 -34 -6 -18 -2 -19 -27 -5 -17 -10 -32 0 -12
6744 -12 -43 -14 -25 -11 -12 4 19 13 0 7 12 -2 -9 9 30 1 3 6 -4 -17 3 3 3 8 -1 15 -14 5 -23 15 -1 14 30 -14 -9 -21
6780 -21 0 -12 -3 -25 -12 9 -2 8 15 2 18 -15 1 -32 9 28 7 9 18 14 -16 13 -12 -10 -18 1 17 -14 -4 17 12 20 12 10 -2 27
6816 27 4 11 15 28 6 29 11 -4 15 3 -4 11 23 14 -6 11 -9 19 7 -20 10 9 -4 1 -18 -5 -16 -24 -4 10 3 -7 -17 -8 0
6851 0 -5 -4 17 28 2 14 -15 8 12 -4 3 -11 2 -1 -1 -15 -13 -8 10 -17 0 9 -4 -11 8 2 5 -1 2 13 5 13 15 3 9 16 12 5 4 -3 -5 -3 21
6894 21 13 7 2 1 15 5 -3 -12 -2 16 -25 -20 -38 -11 -21 -30 -28 3 -2 11 -20 -4 -6 -12 -6 9 6 11 21 -1 12 1 6 -8 -19 -12 -14 -1 18
6933 18 26 7 -25 10 11 -18 12 -25 -10 -7 -12 -18 -16 -7 -13 -32 2 -7 16 3 -8 -18 -8 -14 -14 -13 -5 -1 -21 -11 -31 -6 -27 -6 -37 -18 -25 -28
$$ packed form
6670a1Pj5J5j7J1JJ8k2Mj1L2j7LmQnmRj3L1k5L0k9J6K0j3QMj1K%rj0rQKj2%J9
6709A1Mj4Rk5K3mpk5K0L3k1J7k2MqOj9J8k1l0O3k6J9l9K8j2J6j7qK2j2Pk2L2j2
6744a2l1K9j1J4jJ6J5oj3PNj4pJ8K1k9KLj0j3K0%%NrJ6k9J9k8L8j6J5J6m4Nj2
6780b1K1j2Rk2J3K1j1J0Pj3J6l3J6l3M1J9k1KRml0K9k5KqJ9J6l1J0K1nQqkj2K9
6816B7k3PMJ3k2K3j8j5J9j2pJ5J2rk0J7k0K8j2k7L0jj3Nj9J3j1qK0J4pj0j0RQ
6851@nJK1J1k6J2k9K3Mj6Pj4J3l%j4KNJ8k7J7Rj3pJ9oLoLJ1qQKj2OPmpjpkKK4
6894B1qonjJ4j0qrJ0J8m1Nj8K7j0rKL1nJ3l1J6koOJ5lNJ0k2J3j1Nj4j1PkJ3J9
6933A8Qj9l2L5Jk9L0l7J5LnoKRoj9L4rK3j3j1j0J0o%JQMk0J0k0K5k1K1l1J9pl
$$ plain form
6971 -28 -32 -36 -15 -34 -19 -15 4 -30 -1 -25 -4 -25 -12 -7 -6 5 5 25 12 -2 5 7 30 19 27 11 -9 16 6 -8 -1 9 2 0 -14 -10 4
7008 4 -21 -8 -9 -9 18 -11 -2 -8 -28 5 19 8 7 -1 18 5 -12 -11 -17 0 -9 9 -11 -6 10 -3 14 11 8 -20 -25 -19 3 -3 -7 -27 -5 -7 9
7047 9 -6 -17 0 6 15 9 6 -4 37 14 11 -1 -5 9 0 19 -22 11 -7 0 -13 11 10 -2 -3 -36 -6 -17 -3 -7 0 -9 -24 -9 -4 2 -7 -17 -4
7086 -4 -14 -30 -33 2 10 3 1 17 -3 13 30 -7 -11 17 19 -30 -11 -1 -5 -23 3 -21 -8 -26 10 15 27 17 4 34 8 -10 5 22 2
7121 2 3 21 -9 7 -14 -2 -5 -11 22 4 19 -11 -1 4 -13 -29 -5 -25 -12 -3 3 0 -14 -19 -18 -16 -13 -6 -9 -13 8 -14 7 2 -2 3 7 8 -5 15
7161 15 2 -16 14 -14 -9 -16 -10 -17 -9 13 0 11 15 4 17 7 14 8 -16 1 0 15 12 -22 6 -6 6 3 5 10 -3 27 3 9 -5 -6 5 4
7199 4 -2 13 -1 -23 -11 -26 -15 -2 -3 -18 3 2 18 -2 -8 1 14 -16 11 -4 16 21 9 19 20 6 -1 17 18 13 24 8 11 15 17 8 13 -11
7237 -11 6 -3 12 0 27 -2 -9 -19 -7 10 -15 2 -5 -10 -23 2 -6 -10 29 -1 0 1 10 3 6 3 -8 -1 -11 -20 -31 -25 -24 -8 -27 13 -31 0
$$ packed form
6971b8mmK1j9J5MJ9l4K9k4K1k1J3NJJ1%K0j3j4PKK3j1Qj6k0K5j0j4PJ0pkj4MJ4
7008Dk5J3j%K7k9Rok0L3J4j1jqJ9j3j7JoJ7rJ8k0NJ6j3J7llk8nOK2omk0K2kJ6
7047Ij5j1J7ORolj0M1k3lj2mJ4rJ9m1L3j8Pj3K4jj2jl3L0j1J4mPrj5J5NOrj0J3
7086dj0j6lL5QpkJ6k0J6J7l7mK8Km9J9J0mj8K6k4J3j8L6NJ2j0j3L0k6j8J5J7k0
7121BJJ8l0J6k1J2loL3j8J5l0J0Nj7j6K4k0J3ROlj4nJKLPlmK1k2K1nmNMJj3K0
7161A5j3j8L0k8NpOpQK2j3J1Mj1J3j0Pok4J7jJ5ll4K8j2J2lKNj3L0k4Oj4jJ1j
7199DoJ5j4k2J2j5J1J3jj5K1jJ6k0oRJ3l0K7j5K0Nj2J0Jj4pJ8JnJ1j6LMKrNk4
7237a1J7rJ5j2K7k9pj0J2J7k5J7pnj3K5qmL9l0JJRpLlj1Pj0rj1OJJ6j9M0m4L1
$$ plain form
7275 0 0 4 3 7 -10 -15 4 -19 2 -11 -3 8 31 21 16 11 19 8 19 9 12 14 -15 14 -14 1 -2 -15 -14 -23 -18 -35 -20 -8 23 -17 10 -1
7313 -1 -4 -12 -2 -7 -14 -5 -5 14 12 -9 -1 -2 -13 -19 1 20 33 7 -1 15 -32 -4 -17 -5 -3 4 -3 -21 -5 6 12 -24 -27 11 10 -25 -1 21 -6
7352 -6 36 23 12 12 -3 13 -5 -10 1 14 -8 -4 29 -9 -7 4 -14 -13 -4 -20 -15 0 -22 -10 -10 -13 -4 -12 6 -11 -21 -12 -8 -3 8 2 -11 -4 11
7391 11 1 7 -10 4 6 -9 8 -12 22 7 -8 -15 -17 -5 -6 -6 -7 -23 10 -7 -3 30 4 17 28 6 17 11 13 5 20 7 25 -15 -16 -22 8
7428 8 -12 -20 -20 -10 -14 -10 -11 2 -3 -10 -5 -5 1 -17 -17 -24 -3 -15 -11 3 13 30 26 23 22 21 51 16 8 -7 -14 -3 -7 -12 -1 1 -21 13 -10 -1 19 -24
7470 -24 0 12 -13 -10 -4 -8 22 -3 -13 -9 -6 -2 21 4 -19 -14 5 -1 8 11 8 2 15 8 -10 12 15 10 14 -17 -21 -8 -24 -2 -4 -7 -33 -9 6 18
7510 18 0 -14 7 20 14 19 2 20 11 16 23 14 13 25 11 -7 -12 -10 27 10 18 -6 5 -2 10 14 25 -2 4 -21 -37 -1 -20 -4 -26 -17 -9 -18
7548 -18 -23 -12 -2 28 7 2 12 -1 9 14 -1 -16 0 -11 13 -7 2 7 1 0 -12 -20 -12 -14 -26 -2 -2 9 -11 10 18 28 1 12 19 20 9
$$ packed form
7275@%MjMj7nJ9k3K1j3QJ1K3j0nnQj1J1j0LKk9K9k8J5lj3JrNj7J5J2L1m0K7j1
7313alqJ0npR%J9kk1Qjj1oK0J9J3k6qJ6m7K8j3J2KPpj8J6J1Ol6lL8jl5K4K2k7
7352fM2j3j1%j5J6j8nJ1J3k2ML3l8KJ1j8JRj6NJ5k2J2%lRqJ8j7j0RMNJ1oj3PJ5
7391A1j0Oj7J4Kj5J7k0L4j5j5pkJ2j%jj6L3j7ML3k6J3J1k2J1oKqJ5j3J8m0joL0
7428Hk0q%J0mMjJ3npN%Oj8%pK1j2MJ4J0J7mljjL0l5qj5pJ1mnJ1Kk2L4k3RK0m3
7470b4K4J2k5LOmL0k5j0MLMK3j7k3NJ9oRLloJ3pj8K2LnMl1mJ3j6K2klk6K4J5J2
7510A8j8j4K1J3oNj7J8rNPrjJ2j4j8nKL7j7Qk4J1pJ2MJ1k7Ok5j6L6j9J6k2RQr
7548a8nJ1J0L0k1nJ0j3J0Nj5j5J6j1K4k0RNojj2qQkj2K4%J1k0K1QJ0k7J1PJj1
$$ plain form
7585 9 1 6 15 -8 27 9 12 -2 16 11 8 8 2 18 -2 3 1 -27 7 9 -36 3 -15 5 -9 -21 0 14 14 14 4 21 21 7 12 1 12 -13
7623 -13 6 -3 8 -1 6 20 13 15 17 1 11 18 -1 17 -7 22 18 -22 -7 -3 -6 -5 3 5 1 1 2 5 16 20 29 15 3 13 -17 12 25 12 7 -9
7663 -9 -17 -5 14 9 -17 -25 -23 -7 -11 -4 -9 16 11 15 3 -22 -6 -7 1 -6 10 9 -2 2 7 16 2 27 36 42 -4 34 44 20 3 10 15 21 15 -25 9 11
7705 11 23 2 16 1 -7 -14 35 5 -8 13 25 11 -5 19 21 3 0 24 9 22 -3 4 -1 -2 -1 -8 26 -9 2 11 -3 -17 4 -2 -4 11
7741 11 -8 -24 8 -22 -8 -4 12 5 31 32 21 -7 30 38 33 8 28 9 12 24 6 -5 6 28 23 4 12 -11 6 -2 -2 1 2 5 -3 0 -2 9
7779 9 -7 -11 -26 -1 -16 6 4 22 -3 -15 -17 31 4 -5 4 2 2 -5 17 5 16 12 -9 -1 23 -7 -5 0 4 -6 26 24 10 -9 24 29 10 24
7817 24 15 33 30 35 13 49 24 2 9 4 16 36 18 15 14 5 16 17 4 -4 8 4 -5 -11 -3 -3 -3 0 -9 -8 1 -24 -3 13 15 8 6 15 21 7 -1 -11 11
7860 11 33 8 -3 -10 2 8 21 -3 10 -8 -3 10 13 21 21 1 8 -2 2 15 16 14 14 1 12 16 20 23 35 14 19 13 20 17 19 29 12 -26 17 14
$$ packed form
7585IqNRk3L5j8Lj4J8nl%oJ6k0Nkk8L4Km5L9j8K0j4j2K1J4%%j0J7%j4Nj1J1k5
7623a3J9rJ1rPJ4pKKj6J0Pj9J8k4K9mm0J5MlJQKm%JLJ1MRj4j2J0l0K9J3j3nj6
7663iqJ2J9nk6qKJ6mPnK5nMj2k5J6jQpJ6jj1MNRj4K5ROm6L8J0k4j7PNOom0L4K
7705A1J2k1J4j5qpM9l0j3K1J2j4j6K4Kj8lK4j5J3k5PnjJpL4l5J1Rj4j4K1okJ5
7741A1j9j6L2l0J4MJ6pK6Jj1k8L7Qnk5K0j9LJ2j8j1J1K2nj9Qk3J7q%LJLqLkJ1
7779Ij6mj5K5j5K2kJ8k5j2kM8k7rRk%pK2j2J1mk1QK4l0KNMj0L2kj4j9L3Nj9J4
7817B4rJ8lNk2L6k5k2PnJ2K0j8ljrJ1Jj3qJ2mroQ%%LrJRk5K1J6KpkROj4qj0K2
7860A1K2k5j1pJ2OJ3k4J3j8NJ3LQ%k0Pj0MJ3Jk%j3J1MMLJ2k1NoPlKJ0j7l8M3l
$$ plain form
7900 14 -3 3 -17 -13 1 -2 1 2 -5 -4 7 -9 5 -25 14 3 -6 12 3 -3 12 17 14 -7 -1 42 11 23 24 9 22 11 1 5 0 -13 9 6 5
7939 5 2 31 5 -18 -5 23 8 12 -10 4 2 -16 -13 -2 16 -6 5 -1 9 22 15 -10 -4 -7 -20 -16 -11 -27 -25 -33 -29 -14 -24 -14 -6 -6 -20 6
7977 6 18 0 7 -8 0 22 4 6 40 35 13 16 29 11 22 17 20 22 12 38 -4 2 11 18 -9 5 8 19 -1 18 -8 -18 3 1 10 9 -4 -10 17
8016 17 22 -7 1 7 18 5 -1 4 3 -14 -1 -6 -6 5 11 9 5 -5 -20 -2 29 6 -12 -27 -29 -22 10 -22 -7 -4 15 -5 6 8 11 14 50 16 21
$$ packed form
7900A4j7Ok0MJ4lLJpJJ1j6J4l0L9j1rJ8roJ5Nlk1OM3l1J2Jj5J3j1j0Mnj3K2lj
7939ElK9k6k3J3K8j5Mk2J4kj8LJ1J8k2J1oJ0J3pk5Olj3MNj6KqMJ5j0J0Q%j4K6
7977FJ2j8Pj5QK2j8KL4nk2LJ3j8J1nLKj0K6m2ORPk7J4LJ1k0J9k6j0K1kRjj3oK7
8016A7Nk9QOJ1j3oNjj7J3n%J1Okmj0j5J8L1k3j8j5kPL2l2J5LJ9k0J1KLLL6l4N
$$ [...]
8191C
##END NTUPLES=NMR FID
##END=
