##TITLE=1H_Ser 7-3-i-3
 CDCl3, 8 sc, 
 8.6.2020
##JCAMPDX= 6.0         $$ Bruker NMR JCAMP-DX V2.0
##DATA TYPE= NMR FID
##DATA CLASS= NTUPLES
##ORIGIN= UXNMR, Bruker Analytische Messtechnik GmbH
##OWNER= root
$$ XWIN-NMR		Version 3.5
$$ Mon Jun  8 12:02:52 2020 Russian Standard Time (UT+4h)  she@DPX200
##.OBSERVE FREQUENCY= 200.1315
##.OBSERVE NUCLEUS= ^1H
##.DELAY= (6, 6)
##.ACQUISITION MODE= SIMULTANEOUS
##.ACQUISITION SCHEME= undefined
##.AVERAGES= 8
##.DIGITISER RES= 18
##SPECTROMETER/DATA SYSTEM= spect
##.PULSE SEQUENCE= zg30
##.SOLVENT NAME= CDCl3
##.SHIFT REFERENCE= (INTERNAL, CDCl3, 0, 15.7039)
##AUDIT TRAIL= $$ (NUMBER, WHEN, WHO, WHERE, WHAT)
$$ ##TITLE= Audit trail, XWIN-NMR		Version 3.5
$$ ##JCAMPDX= 5.01
$$ ##ORIGIN= Bruker BioSpin GmbH
$$ ##OWNER= she
$$ F:/spectra/data/she/nmr/H-F/1/audita.txt
$$ ##AUDIT TRAIL=  $$ (NUMBER, WHEN, WHO, WHERE, WHAT)
(   1,<2020-06-08 12:01:45.39 +0400>,<she>,<DPX200>,
      <created by zg, POWCHK disabled, PULCHK disabled
       configuration hash MD5:
       00 E9 B6 7A A2 85 ED C7 34 08 36 98 17 FE 4E 26
       data hash MD5: 16K
       06 8C 91 66 0E 07 A5 28 BF EC 07 88 49 3E FF D4>)
$$ ##END=
$$ 
$$ hash MD5
$$ E6 AB 3D E2 A5 A1 C8 63 A8 DB 33 2A 90 39 16 D3
##$RELAX= 
##$RELAX= 
##$RELAX= 
##$RELAX= 
##$RELAX= 
##$RELAX= 
$$ Bruker specific parameters
$$ --------------------------
##$DU= <F:/spectra>
##$EXPNO= 1
##$NAME= <H-F>
##$PROCNO= 1
##$TYPE= <nmr>
##$USER= <she>
##$AMP= (0..31)
100 100 100 100 100 100 100 100 100 100 100 100 100 100 100 100 100 100 
100 100 100 100 100 100 100 100 100 100 100 100 100 100 
##$AQSEQ= 0
##$AQ_mod= 1
##$AUNM= <au_zg>
##$AUTOPOS= <>
##$BF1= 200.13
##$BF2= 200.13
##$BF3= 200.13
##$BF4= 200.13
##$BF5= 200.13
##$BF6= 200.13
##$BF7= 200.13
##$BF8= 200.13
##$BYTORDA= 1
##$CFDGTYP= 0
##$CFRGTYP= 5
##$CHEMSTR= <none>
##$CNST= (0..31)
1 1 145 1 1 1 1 1 1 1 1 1 1 1 1 1 1 1 1 1 1 1 1 1 1 1 1 1 1 1 1 1 
##$CPDPRG= <>
##$CPDPRG1= <>
##$CPDPRG2= <>
##$CPDPRG3= <>
##$CPDPRG4= <mlev>
##$CPDPRG5= <mlev>
##$CPDPRG6= <mlev>
##$CPDPRG7= <mlev>
##$CPDPRG8= <mlev>
##$CPDPRGB= <>
##$CPDPRGT= <>
##$D= (0..31)
0 1.2 0 0 0 0 0 0 0 0.06 0 0.03 0 0 0 0 0.0002 0 0 0 0 0 0 0 0 0 0 0 0 
0 0 0 
##$DATE= 1591603304
##$DBL= (0..7)
120 120 120 120 120 120 120 120 
##$DBP= (0..7)
150 150 150 150 150 150 150 150 
##$DBP07= 0
##$DBPNAM0= <>
##$DBPNAM1= <>
##$DBPNAM2= <>
##$DBPNAM3= <>
##$DBPNAM4= <>
##$DBPNAM5= <>
##$DBPNAM6= <>
##$DBPNAM7= <>
##$DBPOAL= (0..7)
0.5 0.5 0.5 0.5 0.5 0.5 0.5 0.5 
##$DBPOFFS= (0..7)
0 0 0 0 0 0 0 0 
##$DE= 6
##$DECBNUC= <off>
##$DECIM= 24
##$DECNUC= <off>
##$DECSTAT= 4
##$DIGMOD= 1
##$DIGTYP= 9
##$DL= (0..7)
0 120 120 120 120 120 120 120 
##$DP= (0..7)
150 150 150 150 150 150 150 150 
##$DP07= 0
##$DPNAME0= <>
##$DPNAME1= <>
##$DPNAME2= <>
##$DPNAME3= <>
##$DPNAME4= <>
##$DPNAME5= <>
##$DPNAME6= <>
##$DPNAME7= <>
##$DPOAL= (0..7)
0.5 0.5 0.5 0.5 0.5 0.5 0.5 0.5 
##$DPOFFS= (0..7)
0 0 0 0 0 0 0 0 
##$DQDMODE= 0
##$DR= 18
##$DS= 0
##$DSLIST= <SSSSSSSSSSSSSSS>
$$ [...]
##$SUBNAM2= <"">
##$SUBNAM3= <"">
##$SUBNAM4= <"">
##$SUBNAM5= <"">
##$SUBNAM6= <"">
##$SUBNAM7= <"">
##$SUBNAM8= <"">
##$SUBNAM9= <"">
##$SW= 24.9337058887773
##$SWIBOX= (0..15)
0 0 2 0 0 0 0 0 0 0 0 0 0 0 0 0 
##$SW_h= 4990.01996007984
##$TD= 16384
##$TD0= 1
##$TE= 0
##$TE2= 300
##$TE3= 300
##$TEG= 300
##$TL= (0..7)
0 120 120 120 120 120 120 120 
##$TP= (0..7)
150 150 150 150 150 150 150 150 
##$TP07= 0
##$TPNAME0= <>
##$TPNAME1= <>
##$TPNAME2= <>
##$TPNAME3= <>
##$TPNAME4= <>
##$TPNAME5= <>
##$TPNAME6= <>
##$TPNAME7= <>
##$TPOAL= (0..7)
0.5 0.5 0.5 0.5 0.5 0.5 0.5 0.5 
##$TPOFFS= (0..7)
0 0 0 0 0 0 0 0 
##$TUNHIN= 0
##$TUNHOUT= 0
##$TUNXOUT= 0
##$USERA1= <user>
##$USERA2= <user>
##$USERA3= <user>
##$USERA4= <user>
##$USERA5= <user>
##$V9= 5
##$VALIST= <valist>
##$VCLIST= <CCCCCCCCCCCCCCC>
##$VD= 0
##$VDLIST= <DDDDDDDDDDDDDDD>
##$VPLIST= <PPPPPPPPPPPPPPP>
##$VTLIST= <TTTTTTTTTTTTTTT>
##$WBST= 1024
##$WBSW= 4
##$XGAIN= (0..3)
0 0 0 0 
##$XL= 0
##$YL= 0
##$YMAX_a= 189012
##$YMIN_a= -110216
##$ZGOPTNS= <>
##$ZL1= 120
##$ZL2= 120
##$ZL3= 120
##$ZL4= 120
##$ABSF1= 10
##$ABSF2= 0
##$ABSG= 5
##$ABSL= 3
##$ALPHA= 0
##$AQORDER= 0
##$ASSFAC= 0
##$ASSFACI= 0
##$ASSFACX= 0
##$ASSWID= 0
##$AUNMP= <proc_1d>
##$AZFE= 0.1
##$AZFW= 0.1
##$BCFW= 1
##$BC_mod= 2
##$BYTORDP= 1
##$COROFFS= 0
##$CY= 11.3945322036743
##$DATMOD= 1
##$DC= 2
##$DFILT= <>
##$DTYPP= 0
##$F1P= 16.9975609425685
##$F2P= -3.02152046262296
##$FCOR= 0.5
##$FTSIZE= 0
##$FT_mod= 4
##$GAMMA= 1
##$GB= 0.15
##$INTBC= 1
##$INTSCL= 1
##$ISEN= 128
##$LB= 0.24
##$LEV0= 0
##$LPBIN= 0
##$MAXI= 10000
##$MC2= 0
##$MEAN= 0
##$ME_mod= 0
##$MI= 1.114404
##$NCOEF= 0
##$NC_proc= 0
##$NLEV= 6
##$NOISF1= 3.799351
##$NOISF2= 2.8
##$NSP= 1
##$NTH_PI= 0
##$NZP= 0
##$OFFSET= 15.70392
##$PC= 1
##$PHC0= -9791.866
##$PHC1= 10.40088
##$PH_mod= 1
##$PKNL= yes
##$PPARMOD= 0
##$PSCAL= 0
##$PSIGN= 0
##$REVERSE= no
##$SF= 200.130013532006
##$SI= 16384
##$SIGF1= 3
##$SIGF2= 2
##$SINO= 400
##$SIOLD= 16384
##$SREGLST= <1H.CDCl3>
##$SSB= 0
##$STSI= 0
##$STSR= 0
##$SW_p= 3612.71676300578
##$SYMM= 0
##$S_DEV= 0
##$TDeff= 0
##$TDoff= 0
##$TI= <>
##$TILT= no
##$TM1= 0
##$TM2= 0
##$TOPLEV= 0
##$USERP1= <user>
##$USERP2= <user>
##$USERP3= <user>
##$USERP4= <user>
##$USERP5= <user>
##$WDW= 1
##$XDIM= 8192
##$YMAX_p= 0
##$YMIN_p= 0
$$ End of Bruker specific parameters
$$ ---------------------------------
##NTUPLES= NMR FID
##VAR_NAME=  TIME,          FID/REAL,        FID/IMAG
##SYMBOL=    X,             R,               I
##VAR_TYPE=  INDEPENDENT,   DEPENDENT,       DEPENDENT
##VAR_FORM=  AFFN,          ASDF,            ASDF
##VAR_DIM=   8192,          8192,            8192
##UNITS=     SECONDS,       ARBITRARY UNITS, ARBITRARY UNITS
##FACTOR=    0.0002004,     1,               1
##FIRST=     0,             0,               0
##LAST=      1.6414764,     0,               0
##MIN=       0,             -110216,         0
##MAX=       1.6414764,     189012,          0
$$ Real data points
##PAGE= N=1
##DATA TABLE= (X++(R..R)), XYDATA
$$ [...]
2137c928L132J016k551j035K168J861k853j894K241K627k048k343J318K571j335
2152a053k528J229K659p25l078K92L472j63k631m71K243Q19k522p33K361J375
2168E46k397j597K463J661j987j712J890J420j305k051J670K014j219k341P44
2183b201K705k31k484J13K484J18k586k26K629K89k369r63K255J472k107j058
2199b160J987J181j374j859J893J645j269k050J248J775m36k102O97K049m95k140
2215a410K38K288l02j774m10K253Q90j755j069J908O82j930o54J825J014j302
2231D92j505J398J372n12j714P62J679j214j365M85K330o29j605K15J421J70j678
2248A02q5J777K63j466q86K063P20j618p48J038R43q98j000J123J201j284q58
$$ y = [-3928, -796, 220, -2331, -3366, -1198, 663, -2190, -4084, -1843, 784, -1264, -3607, -2289, 282, -1053, -3581, -2352, 307, -418, -3496, -3204, 268, 105, -2526, -2997, -754, 65, -2457, -3190, -829, 546, -1851, -3448, -985, 676, -1311, -3023, -1133, 287, -1018, -3069, -1399, 615, -604, -2945, -2201, 504, 273, -2211, -2098, 386, 504, -2082, -2308, 321, 610, -1759, -2722, -467, 1005, -1102, -2160, -173, 1008, -366, -2225, -332, 1313, 44, -2006, -758, 1017, 581, -1521, -824, 1225, 730, -1410, -1172, 1116, 814, -960, -1370, 883, 1773, 18, -1051, 857, 1539, -391, -1045, 780, 1794, 492, -1013, 385, 1757, 1245, -469, 293, 1972, 758, -607, -122, 2208, 1579, -26, 189, 1610, 1780, 102, 17, 1794, 2057, 591, -295, 1768, 2488, 870, 122, 1160, 2103, 1205, 205, 1328, 2529, 1245, 387]
2265C87P37J780q92j489L03J374L7j348M21J208k35j697P8J711L73j728j17J170
2283B073K54j102k7J205K40j341o31J166Q42q10p67L50J028q35n51O88Q97j135
2301A544o26K45J469o17r69J22P56K31q95j02R76m3j264j5J149lj163O8N76J88
2321A627p48k73Q69M5q41o59Q82Q20o51n61N3N94o23m64P24M19o76p66P1J109
2341I51m34r49J73N47O0r51K24R41l76j063j1Q77J47q51k94O76J19q34J62N86
2361c00M78j176m91O39N85n06p91N60M10n27p57N52R72p75o21J87Q41K2r20M93
2381a125J33%j075J54J086K59j486O8Q19K89o79k41P40K61r88n46J068R35r86
2400a314q62J007M59q12l88O85N56o88q92O94J081l65r73J41P92K91j300l8J550
$$ y = [387, 1124, 2904, 2012, 523, 826, 2200, 2237, 889, 1310, 2518, 2283, 586, 664, 2375, 2748, 1020, 903, 2073, 2327, 1225, 1198, 2403, 2643, 1302, 671, 1837, 2679, 1869, 1102, 1452, 2480, 1645, 1094, 1782, 2679, 1544, 918, 1163, 2632, 2015, 1046, 1168, 1924, 2155, 1260, 1158, 2134, 2091, 827, 812, 1961, 1958, 795, 863, 1439, 1627, 879, 606, 1475, 1520, 679, 20, 902, 1722, 1071, 510, 563, 1157, 534, 70, 794, 1213, 537, -229, -158, 951, 517, -432, -259, 288, 348, -603, -379, 562, 186, -877, -888, -11, 136, -715, -1009, -333, -214, -1048, -886, -300, 178, -998, -1489, -850, -265, -771, -1562, -1002, -592, -1119, -1876, -1324, -352, -1127, -1748, -1561, -720, -698, -1618, -1125, -992, -992, -2067, -1913, -827, -568, -2054, -1986, -1167, -878, -1557, -1798, -1058, -797, -1785, -2331, -1263, -328, -1314, -2176, -1169, -710, -1522, -1910, -1225, -669, -1357, -2249, -1555, -474, -839, -1812, -1671, -879, -588, -1888, -1926, -376]
2419c76j41j285%R28M19j277j91P62P46r04o14P66J200j216r48J191N62m54j246
2438b078N80J269n32j102L28J264k57j197k6J369L29j250l31J405J88j189n07
2455a737J459O52j528q03J400J007j195r72J041J263j227r89Q89J327p55j432
2471a600M22J761k60j458O1J606k98j274j22J522N72j772m23J632Q38j505q66
2488a164J042J236j147r56R54J107o89j321Q26J373k90j599K16J611m16j242K05
2505b54J790J26k039j00J985L80j617k54J359J72r29r10J176J604j480j660J490
2522H39J520j007j568J312J059r88j119N14J797l73k060M44J890Kj449l77J196
2539A632P33j873m21J950M76j442r29J293J133j387p91J116R97j085j375Q84J998
$$ y = [-376, -517, -1802, -1802, -874, -455, -1732, -1923, -1161, -415, -1319, -1933, -1167, 33, -1183, -2131, -940, -378, -832, -2078, -1498, -229, -761, -1863, -1535, -271, -528, -1725, -1751, -382, -53, -1303, -1634, -229, -41, -1230, -1737, -278, 374, -1154, -1957, -557, 450, -745, -1717, -676, 587, -640, -1629, -740, 587, -168, -1600, -1178, 583, 323, -1135, -1074, 532, 234, -1040, -1162, 360, 932, -840, -1263, 369, 1207, -298, -1164, -122, 1114, -33, -989, -35, 1072, 383, -938, -112, 1261, 971, -628, -412, 1199, 783, -459, -254, 1536, 1662, -377, -477, 1508, 1888, 271, 17, 1376, 1548, 619, -291, 885, 2489, 1009, -651, 839, 2359, 1352, -216, 1096, 2155, 1167, 48, 562, 2359, 1986, -74, 370, 2260, 2262, 813, 436, 1632, 2365, 492, 71, 2021, 2497, 1055, 126, 1419, 2552, 1165, 374, 1490, 2487, 1402, 27, 911, 2909]
2556B909p94j975O87J354o6j551p9J700J55j931j20J562L02j203p10J412M67r85
2574A134j242J199J196j466j145J249J357p92j675L61J913o01j560L76J552n03
2590A353j530j4J308P10j718p03J753M85j307r76J228J073j483j446J508J115
2606A356q59j491J013J342j238j086M13J558o53j310J10J513J29j449k65Q72O71
2623F26j602k32J382J79j143j268J368J174o82j166K69J427o94j342O25J355p06
2640d30j296M28J758m86j458j90J771q7j436k21J371J98j521n24J462P77j234
2657a118q33J079P04j043n47Q83J122j068j350Q69J111k84j280L87J343m13j188
2674a626K60J217j81j316r6J213N84j256l41P76M74o77p91J027N87p96j096R36
$$ y = [2909, 2115, 140, 827, 2181, 2115, 564, 485, 2185, 2340, 409, 289, 1851, 2153, 950, 240, 1652, 2119, 1134, -108, 1091, 2287, 821, -324, 925, 2282, 1490, -185, 176, 2089, 1488, -72, 304, 1856, 1353, -177, -191, 1117, 1827, 109, -594, 1159, 1644, 337, -639, 589, 1662, 179, -1267, 241, 1356, 497, -994, 19, 1361, 123, -963, -550, 1008, 355, -955, -845, 668, 797, -652, -917, -45, 626, -976, -1208, 174, 353, -790, -2058, -690, 484, -198, -1364, -1095, 332, -362, -1704, -1079, 276, -430, -1726, -1298, 460, -26, -1484, -1674, 97, 10, -1426, -1647, -276, -78, -1599, -2123, -661, 116, -1118, -1951, -872, -168, -1211, -1758, -875, 247, -821, -2171, -1302, -191, -475, -1755, -1368, -25, -438, -1626, -1366, -149, -330, -1646, -1742, -529, 55, -1201, -1542, -766, -292, -969, -1760, -733, -146, -942, -2038, -1102]
2692a102J070n87q07L11R56o30m85K05R23j52j178r7J077P30j304m04Q55P14j348
2711a253j81J125N48q85r04P07Q23o95n65O66M30k94j021Q45N22N9j408J01J112
2730b68L9o61K86N51j5j014J11Q51J79n40p00P93N33n17l73O11M13l55q43R64
2750D5K74k41o34J79N14Nl46j70Q35p6n56L3Q28L8n45l27L86K08J7l87O63P1m15
2773C99k15N37K84m49k39Q6L43R1k36nM67j58n61K31J004o67k8K9NJ88k28K8K93
2796A199k51k05k21N98J37k06m69P37j51l12L83k15M48m38l2J04L39n08k0L07
2816A224J06kl78J43M82o42p5p6N19j16l31J12J85j26O4k23Q7L99p08mK37J5k21
2839F71N7K20l1l62O8L32J22k89l22J61J91k58j98J57K56j67n37N90M7k25l32
$$ y = [-1102, -32, -619, -1426, -1115, -159, -789, -1274, -1069, -146, -298, -1476, -1573, -496, 234, -1070, -1474, -619, 95, -1253, -1434, -309, 239, -646, -1550, -843, -20, -715, -1280, -614, -184, -478, -1499, -654, -132, -73, -1481, -1380, -268, -229, -890, -604, -53, -68, -1082, -971, -120, 59, -481, -1181, -388, 145, -372, -745, -134, 279, -76, -919, 45, 319, 78, -556, -377, 137, 142, -204, -374, 461, 385, -171, -138, 690, 728, 183, -144, 242, 450, 467, 80, 743, 814, 399, 184, 721, 1005, 556, 317, 403, 746, 837, 601, 596, 1063, 905, 344, 575, 1579, 912, 884, 913, 918, 1106, 878, 906, 1199, 948, 743, 522, 1120, 1257, 1051, 582, 1319, 1168, 856, 1239, 1024, 1472, 1034, 1002, 1106, 1445, 937, 917, 1224, 1330, 1328, 950, 1093, 1575, 933, 858, 782, 1301, 1185, 854, 966, 1151, 1025, 1089, 866, 953, 1352, 644, 640, 877, 892, 671, 728, 948, 917, 555, 623, 955, 1077, 788, 466, 627, 818, 560, 362, 519, 775, 608, 71, 661, 708, 483, 151]
2860A51L73j28j58P2lK33n19j56K83J94J4o36M64J52r6l52K16O2J0n70J07M07
2882A20M0l26o24P88K96o60k31L21N42l40o23K55M57m67l97N05J10p6l68O7K11
2903d00k70l49J30O69J19j024O3N94K96p22j78N40K18q37J18N48o8l60l09L95
2923h27K14j23m36L56O55m26p32K95Q26j22n31j62N44J17p12m5Q45r0q01j56R23
2944c88L37r26j10N45J80m01p41J034M86n72p28M08Q92n72o77J30J202o77n83
2963a161J41O93j9p75J31M49M04n67k95O11L56o63n82P32P16p85n45P17K98l14
2983d58m52K15P50n20o94O21M24r7o66l07J208J4j224J77O99J55o32r7J035pq77
3004g33k83N12P13o86l76L41Q03k98r14M76R72n97n89M5J057l72l09k48J070m73
$$ y = [151, 524, 396, 238, 310, 307, 540, 21, -135, 148, 342, 356, -280, 184, 336, 240, -112, 104, 166, 176, -394, -287, 120, 160, -166, -790, -2, 294, -366, -597, -276, 266, -74, -697, -442, 15, -452, -849, -344, -234, -310, -678, -611, -400, -670, -1019, -889, -220, -101, -1125, -1062, -468, -172, -894, -1072, -532, -314, -1151, -1033, -485, -553, -913, -1222, -827, -613, -736, -1172, -816, -161, -587, -1319, -1024, -198, -320, -851, -1013, -469, -352, -1064, -1109, -264, -354, -1155, -1311, -388, -51, -977, -1087, -542, -362, -763, -1504, -470, 16, -556, -1284, -876, 16, -556, -1233, -1103, 99, -578, -1161, -1020, -327, -346, -1121, -990, -541, -137, -704, -999, -388, -32, -695, -1277, -545, 171, -614, -1159, -442, -144, -458, -910, -695, 55, -465, -1159, -538, -114, -211, -877, -1184, 24, 38, -1186, -1009, -310, -155, -787, -884, 151, 144, -733, -1016, -504, 209, -477, -853, -512, 291, -7, -921, -445, 527, -70, -659, -614, 443, 71, -238, -486, 584, 111]
3024A11m09l18J113K31j070pN25N90r22M3N55K75m56n59O04R92p90o20M62P47
3044A097k17q63K18J099m30j198Q42M50L89r16j87M89N68o30k83O13K89q45p31
3063b46J097N98q20o07O22O63k40q54N93L67k40j009N72P70J89r63j92Q90K85
3082A475j081j2Q33M9j034q8J167P3o68q36Q36O28o10n47M08J000p98p73N47P19
3102A288J33j324m6J242k23p20m26J031Q2q10l04Q45K30m61n99P06J83k94p15
3121a82M83P63l91j040Q09N41m74p57m5R37k92o12L03M60J03j063K2P30J36m35
3141dk26N17K58m31o62M15P74o46n17M77O56m57n55L9N18l87k17J59M65Oq95J6
3163f97N43K89q86k1P07Q1m74j82K35M85n84k60N61Pj77l00P3L85j82p36P29K61
$$ y = [111, -298, -616, 497, 728, -342, -349, 176, 766, -156, -113, 442, 717, 261, -298, 306, 1298, 508, -112, 350, 1097, 880, 17, 235, 1334, 904, -294, 548, 998, 1387, 471, 284, 773, 1341, 711, 428, 1041, 1330, 485, -246, 851, 1449, 629, 22, 644, 1307, 1067, 213, 806, 1173, 933, -76, 496, 1266, 1455, 492, 300, 1190, 1475, 394, 382, 1215, 1264, 230, 142, 1309, 1382, 714, -122, 714, 1342, 732, 185, 593, 1593, 795, 22, 569, 1288, 1421, 97, 51, 1293, 1070, 350, -76, 955, 1037, 227, -77, 768, 998, 537, -62, 644, 827, 533, -182, 301, 1064, 673, -367, 442, 983, 509, -248, -293, 644, 352, -260, 43, 503, 606, -457, -435, 295, 431, -4, -230, 287, 545, 114, -548, -133, 641, -5, -522, -45, 611, 154, -401, -362, 156, -231, -448, -289, 176, 182, -713, -697, -154, 135, -751, -772, -65, 16, -458, -640, -405, 80, -504, -764, -203, -196, -373, -673, -600, -215, -397, -1133, -404, -143]
3185a43m0n26o4P83k45p5o48O83j7l54o4L40O35p80k83K86K57l47k11j26O03m59
3207g95j84O11k7M88q40k4O71k53k87k52N26j66k23M5O97mp89j50N23m8l9n1L2
3230e39K04m07QM38lr6l81K43K62j34k58J7M01j43l64L17O9K59m96J8M34J88l02
3253b65j76K1J49n1m02N56qm11J39L5J75j3k59J90P9rl53L17J14K08m75K25J83
3276c1j3m15L42K05k26j1mR2M71k84j37O6J58j09k29J83L8k03N2L31J41k26m28
3299b37M52j81L54j77N0K56j21j55j40M91j33k01J30n0R1K36k14M12m24K48l6
3320F51l3o2R0Q8j79po1nJ03J51l25O7L25j82N7j67K80j10m6K24k48K75n30mK42
3345E94m1J63J24r2j47l88L25J15j43K52q5k50J51l0j03Q2J72l07k64K82L48N6
$$ y = [-143, -183, -709, -773, 10, -235, -310, -958, -275, -292, -646, -710, -370, 265, -515, -798, -512, -255, -602, -813, -939, -336, -795, -979, -368, -395, 93, -747, -771, -100, -353, -640, -892, -366, -532, -755, -710, -13, -17, -806, -956, -433, -481, -520, -571, -539, -335, -742, -734, -296, -299, -395, -776, -533, -271, -405, -663, -646, -245, -388, -752, -435, -366, -107, -603, -585, -151, 37, -265, -441, -420, -271, -322, -724, -168, -176, -587, -448, -413, -238, -251, -510, -320, -241, -250, -603, -286, -172, 36, -439, -214, -31, -44, -459, -117, 88, -138, -149, -153, -61, 410, 126, -11, 55, 213, 104, -125, 58, 96, -107, -55, 276, 417, 191, -237, 215, 34, 388, 211, 261, 517, 396, 241, 101, 592, 459, 258, 388, 338, 429, 665, 451, 863, 439, 687, 651, 618, 556, 646, 734, 555, 548, 487, 482, 585, 736, 411, 478, 803, 621, 678, 511, 791, 681, 635, 859, 611, 886, 356, 352, 594, 553, 716, 840, 748, 601, 213, 538, 653, 510, 762, 677, 427, 578, 548, 445, 527, 699, 392, 128, 410, 758, 814]
3367H14m68K7j01N1j24R6M33l22o18K78K66M17l32l67M46j04k05L03J3l22J28
3388C09j56k39N29l8n90J45J92O2n7k79K79k2K5n67P56pn22L30n6J38j73j09K53
3411B03l4J6m40M13K08n05l85L30K36j27Q8k69K83j05l81L37L00l33q9O7j5J78
3433b4l10p6J40K23m67j31J5O96j90m47J15J40k5j54J93Q5j37m32L11M57l46l74
3455g38O0N58J52p47K02J26M9r5l94L94K12l36k78O20J03m51m5K32R2o3m82K96
3477e33L46K58n45M9K91m47j86O72p1l34M7l62M31K62n22J6K79K05m22o24Q28
3498c62L48n50k63J45O58l92l83O6M22%n12L03N95n13k17J39K07K70r42N71K93
3519a17M8o88N5K72M42j91l52L78M00n23j42L66o8j06k96R1O36k63k88j13L41
$$ y = [814, 346, 373, 272, 323, 199, 295, 728, 406, -212, 66, 332, 749, 417, 50, 496, 392, 187, 490, 503, 181, 309, 153, -86, 443, 405, -185, -40, 152, 214, 157, -122, 157, 135, 160, -407, 349, 342, -180, 150, 94, 232, 59, -50, 203, 169, 185, -255, 158, 366, -139, -524, -194, 42, -85, 3, -266, 17, -88, -469, -132, 168, -165, -254, -187, -202, -24, -334, -410, -270, -47, -514, -645, -630, 66, -124, -571, -456, -316, -341, -495, -302, -217, -354, -786, -475, -18, -364, -738, -678, -120, 32, -715, -513, -387, -338, -433, -827, -433, -221, -557, -835, -215, -112, -563, -608, -376, -284, -347, -829, -533, -187, 71, -474, -425, -134, -581, -767, -95, -166, -500, -453, -815, -384, -122, -644, -628, -349, -144, -566, -1190, -362, -14, -564, -827, -682, -24, -416, -799, -733, -311, -311, -823, -520, 75, -438, -655, -516, -309, -39, -981, -410, -117, -69, -757, -702, -430, 12, -179, -531, -153, 247, -276, -418, -52, -120, -226, -522, -431, 205, -58, -346, -459, -118]
3540a18K89n36J9O74k48k60m8L13J32o27j2L64K26k49k96O95K31o70J13j1L83
3561C64k96k10L37L37k30l49L75R2K77p55J57M87on54j96N65k82j5p2M01J95k73
3583C49l01M92M10j85q30M46L27j90l96P8L67j6l92j07P05j10l00k74L87K99j45
3604F14o06L11O12m85l07N17k2k79j87N19M1j85l20J39N34k91l88j6M80j30n02
3625D9M1L09K21k41N2J76o1j08m06M57J65m23l10L82P6r1j25NJ11p0l67K12L84
3648D38k08k36j55O79J13p17J99j78J06j05k28R21j75n81J46J24j42j14K01ML48
3669D40l74j60L25J11k59l61K9L05q3o4k08M44N5n31k3M12nJ47o13L16K31m33
3691b99J37L20k61j90k26L20K68o7P8j43L30m59r0p7M46l34r5J75L58j23l17l63
$$ y = [-118, 171, -365, -346, 328, 80, -180, -228, 85, 217, -410, -422, -58, 168, -81, -377, 318, 549, -121, -8, -19, 364, 68, -142, 195, 532, 302, -47, 328, 420, 697, -58, 99, 586, 580, 26, -170, 395, 113, 98, 26, 427, 622, 349, 48, 540, 950, 765, -65, 381, 708, 518, 122, 200, 567, 551, 159, 52, 757, 647, 347, 73, 460, 759, 614, 8, 319, 931, 446, 139, 656, 634, 355, 168, 687, 728, 543, 223, 362, 896, 605, 217, 201, 681, 551, 49, 90, 399, 620, 379, 431, 607, 546, 438, 32, 489, 654, 231, -79, 303, 379, 288, 163, 168, 279, 209, -158, 54, 438, 230, -6, -161, 518, 631, -86, 113, -65, 41, -64, -292, 629, 454, -127, 19, 143, 1, -113, 88, 92, 440, 66, -94, 231, 342, 83, -278, -249, 56, -27, -91, -299, 145, 200, -331, -354, 58, 53, 200, -413, -97, 134, -299, -162, 158, -103, -293, -519, -199, 69, 2, 80, -63, 267, -192, -282, -359, 87, -247, -342, -167, 191, 68, -249, -612]
3713f12K36J85k32R2P2O7j58k25J29L77Qj85Olq0j54j03L80l4p2J39j2j84J05
3737b58j38K12j04j26k24N47K43m72M5k28J86J7j17J36l1l4n5j0K30j29k13N40
3759A7k99mj27J43K76j82m34J08N15l92m2m8J68J50j77Q1l59J52K43k75J94N4
3781b38j32R9J66oj48j72K49Q7j18k06K03J97k01q6K6L57l01N5k7m1J81O1k58
3804b53L65j30O5k22J15K71k08O3J98M5o62N33l28J72L15j65r2P4l34N75n67O30
3826D60l83O3K1l7qK97l12O1P9k87K25M4K13k75j2J92j79M5J22l6J13k05O9J79
3850D49n1Q5l37J57L71n57L21j80O7J78m65M10J35k95j19M1J31j92K50o8J77n4
3872D54j85k27K56K16J6o43N67k59k6k2n7K11K27r0k02n1K7jR5M2j51M8P7j4k71
$$ y = [-612, -376, -191, -423, -331, -259, -192, -350, -575, -446, -69, -61, -246, -240, -243, -323, -477, -580, -200, -234, -306, -167, -179, -363, -258, -396, -184, -288, -414, -638, -91, 152, -320, -275, -503, -317, -300, -417, -281, -312, -346, -401, -411, -181, -310, -523, 17, -282, -286, -413, -270, 6, -176, -610, -502, 13, -379, -421, -469, -301, -151, -328, -247, -606, -454, -211, -486, -292, -238, -370, -271, -105, -111, -259, -431, -182, -95, -213, -419, -216, -19, -220, -306, -280, 77, -224, -169, -196, -237, -56, 5, -253, 112, -18, 47, -175, -60, 211, 3, 66, 264, 309, -353, 180, -148, 24, 339, 174, 82, 156, -178, 397, -170, 460, 77, 140, 161, 124, 116, 413, 101, 162, 241, -46, 179, 223, 436, 161, 149, 341, 162, 207, 329, 293, 406, 201, 270, 449, 398, 483, 146, 303, 674, 117, 438, 258, 325, 503, 38, 448, 583, 288, 169, 210, 341, 149, 399, 331, 508, 454, 269, 42, 298, 514, 530, -113, 454, 195, 169, 147, 90, 301, 528, 438, 236, 185, 212, 211, 306, 348, 197, 245, 322, 308, 37]
3897C7J60J72J95l82K32j52K09j31k81K34k36K4q2K3L27n0l28l38L94n1k03J80
3919d7L00J61o01L72qJ76l82j45k9j53N80k43qK86k71k2J47o7j28K06k17K83l58
3942a68J59q3m9J31j97rK29K99p19L58qJ64n64N55k18r1k3j61L55K76k30j06j67
3965b67J25K51k2J70k31k28lJ72j20J17j17n52P23K2k41l4K90l9j58m15L29N01
3987B73k70k67K0K06l12q7K76J29j37ok73L25j50j45J40K31J12l48K11O1j02l42
4009d55K7J8P7rj87L08j25j24K9J36Q4r9l23L87K23j52l02J60K20p0k89K58J45
4032f3J12l22l18M67j9k40J43J08K11j78m23M31j37r5k54K65L22k92J95N5J37
4053A05o4m02J96K43j02N8m4K25o7m93p6M00N64o06j48L6K64j01k93M20L5j74
$$ y = [37, 197, 369, 564, 182, 414, 262, 471, 340, 59, 293, 57, 81, -1, 22, 349, 299, -29, -367, 27, -24, -227, -47, 253, 414, -187, 185, 177, 353, -29, -174, -203, -356, 224, -19, -27, 259, -12, -34, 113, 46, -82, 124, -93, 190, -168, -9, -92, -141, -10, -207, -216, 13, 312, -407, -49, -57, 107, -457, 98, -120, -211, -234, -395, -40, 236, 6, -100, -267, -142, 109, 87, 257, 26, -202, -205, -33, -153, -36, -153, -705, 18, 40, -201, -235, 55, 16, -142, -557, -228, 273, 3, -264, -244, -38, -350, -437, -161, -32, -169, -175, -448, -123, -273, -418, -278, -47, 65, -283, -72, -11, -113, -455, -428, -410, -333, -342, -529, -221, -346, -470, -441, -305, -221, -320, -643, -256, -33, -185, -487, -327, -107, -177, -466, -208, -63, 49, -273, -591, -124, -143, -383, -240, -132, 79, -99, -522, -91, -228, -323, -577, -312, 10, -282, -87, -32, 105, 41, -361, -165, 78, -24, 34, -10, 215, 148, -345, -421, -21, 543, -63, -211, -175, 89, -12, -305, 115, 150, -24]
4075b4j38R1M4J44m32M83q5j04o0k8J91L55j92k13J75j49j84N9L84l28M4k1L79
4098C91k72j17Q0R7m5J15l09K19L58j25j23J56k88J66j13J22K58l02j41N4K22
4119D03j51p7n2q8L25m9o6M6k39L18j53L23l51L19m47J66M40o55J92k1l0J75j55
4142A73j24L71l7k61k5L52J32k35j31K02%l79L62l39K37m5m13L15oK74k05rK33
4165D42k15O5j64K82k18k4k01J36L11p68L57J40J06l96M50l22J77k64J06K05j02
4186A03J49l54J82m7J62l38K8K16J74o9k57P4K16l37Q6N7J6q1k30P59l41j37k42
4209b11K22J76k32O0N5J70m04J79J30o3j80j5J2L52m51N5r0K13p9k08K71J25L2
4232A19l36J32K18Kl60J27o8K82l00j58m9M26n28L68j57J66j21Rl8q8K41l61L00
$$ y = [-24, -162, -71, -27, 117, -315, 168, 83, -21, -81, -109, 82, 437, 245, 32, 207, 58, -126, -67, 317, -11, 33, 12, 391, 119, 2, 82, 179, 134, 249, -60, 159, 517, 392, 269, 425, 137, 303, 190, 312, 570, 268, 127, 181, 403, 252, 175, 123, 35, 360, 311, 245, 291, 52, 370, 217, 540, 189, 508, 61, 227, 667, 12, 204, 183, 153, 328, 173, 49, 420, 383, 122, 97, 449, 581, 346, 215, 417, 417, 38, 400, 61, 298, 253, -160, 155, 149, 423, 218, 209, 442, 227, 292, 128, 410, 192, 168, -33, 103, 414, -354, 3, 143, 249, -147, 303, -19, 158, -106, 0, 205, 103, 252, -102, 80, 33, 195, -143, -115, 101, 275, 206, -51, 23, 239, -98, -12, 45, 61, -20, -250, 509, 168, 31, -211, 11, 187, -45, 15, 70, 240, -164, 15, 145, 82, -98, -113, -101, 251, -200, -145, -235, -22, -101, -309, -38, 87, 119, -217, -85, 133, 135, -225, -98, -166, 116, -184, -342, -391, 35, -493, -125, -282, -116, -237, -228, -266, -354, -113, -474, -174]
4255a74k2N0j19r2L99l18J30M2l50N69n15k9L25k66Nj41L65J65l00j0RK50j11
4278a38j43j4l0K18j44K25j64j54L96m14K32J16k74j37K87j26J07l44K83K00p2
4299i0k40L07l88K87l29J74j0J11P4n1N8l4k27K1P8K19j08J89o8k10L95m25K68
4322Ak66k04J19L17k92L12j83m0L09l77K43r5J68j47J01l1m9OL23j12j30k6J9
4345c4J06L6J9P7Q1k12L3j46P5N9mJ75j68q8L79j56k99L04Q6l84J11J62N1m66
4369b03J41K3L09k73R5o3K64J26L1j39k78K4J88j95L42k04m1L61j38l79K64K88
4391E43m57Q4K07j6j5k38NJ21j76Q8m1k13K80K07j81k74J56K56j37j26Q4k0J52
4414B89N0k56M6J76k68K69j27Nr6P2K9J28j24Pm1j85K03j75M80o62O84n94K66
$$ y = [-174, -196, -146, -265, -357, 42, -276, -146, -104, -454, 115, -400, -429, -104, -370, -365, -506, -141, 24, -276, -286, -277, -27, -138, -281, -295, -325, -107, -251, -26, -190, -344, 52, -362, -130, -14, -288, -425, -138, -264, -157, -501, -218, -18, -90, -330, -23, -411, -124, -453, -279, -289, -178, -104, -155, -97, -131, -358, -337, -259, -40, -148, 41, -27, -237, 158, -267, 1, -265, -469, -350, -33, -325, -13, -196, -236, 73, -304, -61, -156, 12, -135, -34, -65, -114, -108, 215, 103, -27, -53, -34, 72, 108, 127, 204, 285, 73, 106, -40, 35, 94, 90, 265, 97, 9, 388, 232, -67, 237, 323, -61, 50, 212, 263, -203, -62, -39, 270, -3, 92, 29, 293, 419, 450, 311, 33, 57, 245, 50, 392, 188, 147, 508, 370, -9, 255, 543, 86, 170, 377, 361, 346, 108, 113, 234, 58, 146, 105, -108, 172, 379, 198, -76, 80, 336, 199, 73, 157, 137, 289, 339, 83, 129, 305, 37, 306, 179, 184, 88, 160, 189, 317, 193, 200, 159, -26, 177, 2, 482, -180, 504, -90, 176]
4437A76j49J76j09k21M68l14k38K77J65l56K18j8j04K34k55M9J75k90K13j45K73
4458B25l59K75r2J99K23p54M19k73P5r1k5J92j07O6J2L00o34K32L2N0L53k57k15
4481a54Q2N2L6j63J56p0J0R2o7P0K4L1k33J90k71L70k51k06L85m45J12K7K59j54
4505a18l46L58j01N7J54j47nK75k83o1L22J85l31P0r0p5L91l87j54N7j30J7J30
4528b12M98m31k74J23J42j61o7O3K82k39k1N6J61L9l42J10j30K84k91J57O6o1
4550b48j4j23J44J7j83P6P7J26j38J16K41k79J65o78O92J2R0l00K95m6l55J93
4572a20k25M94j82l74J46J90O8o4r5K25j15j03J03n1j84K00j46J04l2J61m58L77
4594h1l22M81l90L12K28Mk77l93N23j7l38O3K55J38k52p8K81j58K6K77j48MmJ35
$$ y = [176, 27, 203, 94, -127, 341, 27, -211, 66, 231, -125, 93, 75, -29, 205, -50, -1, 174, -116, 97, -48, 225, -134, 141, 49, 248, 471, -283, 136, -137, -62, -153, -178, 14, -93, -27, -15, 285, -349, -117, -85, -35, 318, 61, -154, -72, -20, 16, -147, 9, -61, -51, 41, -26, 44, 68, 99, -134, 56, -215, 155, -96, -302, 83, -362, -250, -223, 36, -118, -464, -106, -207, -150, 4, -143, -148, 127, -156, -217, 105, 290, -41, 29, -61, -136, 255, -132, -286, -229, -359, -342, -212, 286, -145, -419, -296, -154, -315, -382, -319, -37, -276, -297, -241, -80, -41, -383, -273, -403, -119, -410, -253, -187, -248, -262, -385, -241, -224, -407, -331, -254, -128, -266, -150, 91, -188, -23, -701, -9, 3, 93, -207, 88, 42, -313, -120, -345, 149, -33, -407, -261, -71, -3, -67, -162, 63, -52, -155, -52, -103, -287, -87, -233, -129, -161, 0, -458, -81, -403, 78, -312, 0, 228, 232, -45, -438, 85, 68, -270, -207, 48, 186, -66, -144, 137, -21, 5, 282, 134, 138, 134, 269]
4618B69k12N7j08Q6k42N52j07j82j01K72j87k93K84J74j42q5O2J68N8j21j35j56
4640h9O37l55l02K94J15j51j30R3L68m49r6M3J70k64L95k99J70j48O4R1j31Q8
4662A14m2k29L39K17j11k65J79O0r0j53m9L02k7j02o1N3KJ43k18J13K83m28R0
4685A20L1l7m8j2K74l24J72l0N5P5j95j24O9K57q1k88K17K6J25k55rJ41J8j2P2
4710B37J65j45k67L2L50n1k90k9K71l01N3j27J62n6l4k76K09O5J63p0j28L53k79
4733GJ28j01J01k18r4J03J34K00k07k66M77k49Q0P0k18J38nk46J75K5j42p4K70
4756H8l64M01k29K71k13n3K50l18M84l69K20j21q7P9j06m0L00l01Lk52L93j64
4778a28K81k92Q7m9M5K2K2k13J68k25J82L04k37K0k31k7J37k8n0K21qJ57k29j90
$$ y = [269, 57, 114, 6, 92, -150, 402, 295, 113, 12, 284, 97, -196, 88, 262, 120, 35, 97, 265, 323, 202, 67, -89, 548, 193, -109, 185, 300, 149, 19, 112, 480, 31, -65, -22, 148, -116, 279, -20, 150, 2, 66, 157, 26, 114, 72, -157, 182, 399, 288, 23, 202, 262, 172, 19, -30, 272, 245, 143, 82, 135, 137, 280, 62, 175, 458, 30, 120, 151, 114, 66, 54, 328, 4, 176, 146, 201, 276, 81, -43, 26, 283, 202, -86, 131, 157, 282, 27, 18, 159, 177, 165, 237, 402, 257, -10, 22, 372, 321, 31, 2, 273, -28, 25, -102, 60, 4, -30, -306, -97, -32, 131, 61, -67, 286, 7, 135, 34, 135, -83, -177, -74, 60, 260, 53, -213, 264, 15, 95, 165, -53, 85, 80, -166, 9, 34, -108, -182, 88, -276, 125, -104, 167, -46, -99, 151, -167, 317, -52, 168, 47, -40, 39, -67, -107, 193, -108, -105, -357, 36, -128, 153, -139, -52, -101, -56, -34, -12, -225, -57, -282, -100, 204, -33, -13, -244, -271, -134, -162, -212, 9, 1, 158, -71, -261]
4802b61K26N8n52M1K65P8%K39j53n8L2j87O4j03K6J92j34k78K89l0j17L74l21
4825c10J30J41L1J05J8K3m17j05l6K85j35K98l75K00K91k44k90L11j24o6M00n37
4847d06J50q4N6j1L12l83K17K22k54j09L30j19k92M73K16l54o0J6o1n8P8K41j79
4870e9o4K32j41m7q3k0J97n1J48J02j65j04J1J97j14Nj27p2J46M11l70N2j74J67
4894G7j93M52l06n1M69k18k11p4L48l66j4L32o4j55PO5L6j10J45Pn6j34K22l9
4918A69K50j71r1M9k92N14m68K49j67J75J86k77k57K59j61L63j39k0k33J18j65
4939a09J53J53j29K05j61j0J90j11j34J84j78K07j16j18K36K4j3j99k05K88j29
4960B8j53K13J80k31k9J55K7l29K75K81k44j19r5J71O2o5Rn9n2L09k50m5J27J58
$$ y = [-261, -35, 23, -529, -488, -223, -145, -145, 94, -59, -117, -85, -272, -208, -311, -285, -93, -227, -505, -216, -246, -363, 11, -310, -180, -39, -8, 97, 115, 138, -279, -384, -420, -135, -270, 28, -347, -147, 144, -100, -390, -79, -203, -269, 131, -406, -256, -340, -284, -295, 17, -366, -149, 73, -181, -290, 40, -79, -371, 102, 318, -36, -96, -80, -141, -199, -121, 120, -59, -123, 109, -32, -79, -162, -182, 15, -36, 112, 214, 49, -55, -44, 153, 39, 44, -83, -155, -9, 402, 32, 84, -90, 77, -116, 336, 30, -21, 448, 230, 19, -55, 293, -73, -87, 245, 181, 26, 33, 98, 134, 24, 169, 176, 120, -14, 208, 169, 419, 248, 157, 206, -86, 428, -40, 209, 42, 217, 403, 126, -131, 128, -33, 330, 191, 171, -62, 56, -109, 44, 197, 68, 273, 112, 102, 292, 181, 47, 231, 53, 260, 144, 26, 262, 286, 273, 74, -131, 157, 28, -125, 88, 268, 37, 8, 163, 190, -139, 136, 417, 173, 54, -41, 130, 192, 127, 136, 77, 25, 334, 84, 39, 166, 324]
4984C24m9m80O91k25k91m1J29J37k61N3K46k33K01j55K65l51L2j45K17p8q4j00
5006a98M22nm9m24K25R1P5n3L5k06L4J7k3J3q0O8j17j3K6L15l21mJ10j46Q2j99
5032c25L97k93P0j08L08J8l20q3M71m49J31K89k13JL6l31L17J58l73J00LJ54j69
5055b11j90R7M1K9r4J05L38K2n32Q7J50K42l58m0kK55k16r6O06k16j65k04K75
5078g7J14l57J52J44k43K14l1K24k97r1N7r3J28jm73J72L35j61J6LK97J63m10
5101b15L4J97qk26j41L54l11J52j8R7l5J51r9J65j36k65k3K04L1K70m86N6J30
5124a22J71K0p6k8J04J5p5j27J27j67j86K5O70l82o1J87M6k16K23l09r1L68j62
5147d6J81j33J08j48n4O9Nj30J23j5L31k77l1K61P6p4K0k43p6M66l57M7Q2L38
$$ y = [324, 275, -205, 486, 261, -30, -71, 58, 195, -66, -13, 233, 0, 201, 46, 311, -40, -8, -153, 64, -14, -98, -198, 224, 219, 170, -254, -29, 62, 137, 84, 119, -87, -53, -36, -59, -46, -126, -58, -175, -188, -162, 153, -168, -172, -62, -208, -126, -325, 72, -221, -151, -259, 49, 67, -253, -336, 135, -314, -183, 106, -107, -106, -70, -401, -84, 74, -299, -199, -196, -42, -211, -401, -304, -263, -234, -328, -223, 115, 137, -395, -308, -158, 84, -274, -314, -316, -61, -277, -373, 233, 17, -148, -352, -77, 37, -320, -168, -24, -267, -53, -84, 140, -157, -248, -191, -284, -156, -157, -630, -458, -123, -284, -268, -265, 32, 195, -215, -181, 16, 8, -218, -359, -5, -316, -164, -182, -85, -120, 31, -68, 97, -39, -304, -327, -123, -92, 178, -308, -252, -122, 49, 69, -7, -35, 69, 84, 9, -118, 9, -158, -344, -319, 351, -31, -92, 95, 141, -75, 148, -161, -252, 116, -46, 135, 2, 110, -38, -92, -23, -18, -148, -25, -40, 291, 14, -17, 244, 320, 246, 266, 23, -53, 413, 56, 103, 185, 523]
5171E23o90K83k4K1O3j31K50k30N6l71M10p8P3j76p3J27o6K59k27K15r2j67J24
5194G9N1J1N8l05L15j46J46l3M7k46P7L7Q0N4J7l83K42Kj18Q1j07L55N5n80L69
5219A58Q6j57k34L66k54L23m04K75o8nl8k58J85l9J80k96L98r1j21O1N5j03K06
5242B25j04J4N5K54j79mN5k50P8l32O00R4l07P1j73q0K99j94k06J49J6K20q5k26
5266a0J51L8j24Q3J30m22J56j5J32K6Ol18R9K23k73J84j41J08m40L53N1L24n55
5289b34p9J13M0M27j94j21j37J70q2K05j63k5k1l0m8J94j1q4J65l48o8K68J05
5312D2m05J70J90l03K42n4l1m6K27j57j02q8n1K44j52N5P0K5qrL3n8j24j83J72
5337c01K34k97K91j5J88n87M55k09R3j37l7O9o%l30M06o2j20J11K21j05o3J07
$$ y = [523, -167, 116, 92, 113, 176, 45, 295, 65, 121, -250, 160, 82, 155, -21, -94, 33, -33, 226, -1, 214, 122, -45, 79, 130, 141, 199, -106, 209, 63, 209, 176, 223, -23, 54, 91, 171, 225, 242, -141, 101, 103, -15, 66, -41, 314, 369, -211, 158, 244, 87, -147, 219, -35, 288, -116, 159, 91, 86, 48, -210, -25, -64, 116, -180, 218, 127, 6, 67, 122, 19, 225, 121, 135, 190, 444, 265, 261, 316, 66, 144, -188, 412, 506, 199, 270, 97, 17, 316, 122, -84, 65, 81, 301, 216, -10, 141, 179, 55, 138, 268, -154, 2, -13, 119, 145, 151, -167, -68, 155, -118, 66, -75, 33, -407, -54, -3, 321, -234, -313, -200, -160, 267, 73, -48, -185, -15, -97, 108, -55, -80, -101, -131, -179, 15, 4, -80, 85, -263, -331, -63, 42, -363, -193, -3, -306, -64, -118, -149, -195, 32, -125, -227, -315, -366, -122, -274, -219, -149, -124, -132, -141, -108, -166, -290, -473, -301, -67, -364, -73, -88, 100, -487, -32, -241, -148, -285, -322, -253, -259, -259, -589, -183, -245, -365, -254, -33, -138, -201, -94]
5360i4q7K19j86K9m2L9R7j2l22J39l8M08k65K45k18j87L81r9m8j31P1jJJ8J29
5385D6k14J90n9O8p5l3j69M13l7j76pK0n2k5K4p9J10J06k59m0L0J72j65L38j65
5410c8j7J80l20J73j12J83l3Q1J3jM3k1l99K97q5K93j0l71K23j00p6J58Jk18n1
5435b07K38K98r8P3k35L97l85R3k0%q4J90m1k23pL42k10j41J04j38K16m9j21J26
5459A18K22k51J32K09k58m6J12j37p9j37J40J46p0Q4j72K32L7l8j37L3n9j26L60
5482C15q2j65J97N8j50R6j16Q0k22J86J44k68K26m3k29L8J79k14M2K48k73K30
5504B77k0J01m69M21k66P4L2j65J18Q3P4j61L49k35m5n7j0o2j33J38J72m24M08
5527B00l76J75J0j63p3M03J26l59K14Mj87k95M14J11Kk50o8J14K43K9l64Q3J45
$$ y = [-94, -181, 38, -148, -119, -161, -122, -25, -37, -359, -220, -258, 150, -115, 130, -88, -275, 106, 7, -41, -172, -101, -102, -101, -83, 46, -168, 22, -37, 31, -44, -77, -246, 167, 130, -46, -53, -33, -85, -110, -86, -165, -55, 51, -208, -248, -218, -46, -211, 127, -38, -55, 125, -195, -22, -134, 49, 16, 97, 110, 109, 152, 131, -268, 29, -56, 237, 227, -144, 79, -21, -97, 61, 62, -156, -207, 31, 329, 231, 304, 69, 466, 81, 174, 154, 154, 70, 260, 219, -4, -11, 331, 121, -20, 84, -54, 162, 113, -8, 118, 340, 89, 221, 430, 172, 126, 238, 101, 22, -115, 25, 171, 101, 185, 13, 245, 282, 244, 107, 140, 81, -45, 315, 233, 68, 265, 323, 173, 269, 153, 233, 11, 197, 341, 73, 299, 256, 27, 65, 244, 30, 72, 320, 47, 277, 257, 358, -111, 310, 44, 118, 150, -15, 103, 186, 260, 99, 448, 213, 168, 111, 101, 39, -94, 44, 216, -208, 200, -176, -1, 9, -154, -227, 176, 302, -57, 157, 161, -26, -321, 93, 204, 206, -44, -112, 2, 245, 274, -90, -7, 138]
5550A38j6m7j76P1m3j79N42r9j18j18m10L36J60k85J60J5K44m15k1K22Kq8l3P9
5574g9jl12L31l8m4n9J46j49J11j27M6N0K5l1q0J03k70M76m54J15k14L26j19j21
5598c69q2J60J76j78J46Q0q9J9K08j43N0l72J09K44Q7j04j49j08K44J10m8j19
5620a28J92k28k77J21M62j48p2j64J32K43l84K63k49k23K38R3K64j43m5k42J60
5641a35Q8l61J03J81o3J48J41R8j24M0J3k89M7K14R5k91K87j80j43r2K66O6j57
5664d8o4pJ37Kj02M25k20m0m3j56j9J61j40M17l27k6K18m72N94l04K1J24Oj9k9
5689H9j43k5K2P7QR9Q8n3k54L04Mo1j68J33j2j42l9J73M5L71m63J71k70J20k03
5714a29K23L9N7m1k3J60l93L17J8j56K48m37J23M68k52j58q3m9L15n2r7j7L13
$$ y = [138, 122, 75, -101, -30, -73, -252, 290, 191, 73, -45, -455, -119, 41, -244, -84, -69, 175, -240, -261, -39, -37, -125, -158, -79, -80, -392, -61, -99, -143, -202, -56, -205, -94, -221, -175, -125, -100, -131, -211, -108, -378, 98, -356, -241, -455, -129, -248, -369, -451, -291, -115, -293, -147, -67, -156, -137, 71, -72, -22, -394, -285, -41, 46, -58, -207, -315, -71, 39, -9, -128, 64, -164, -441, -320, 142, -6, -78, -242, -110, 133, -251, 12, -237, -460, -222, -129, 135, -8, -53, -295, -135, -47, -408, -305, -124, -187, -39, 102, 200, 76, 116, 129, -160, -113, 101, 196, -95, 192, 12, -131, -223, 43, 109, -48, -112, -119, 18, 20, -82, 343, 123, 83, 40, -116, -135, 26, -114, 303, -24, -50, 168, -304, 290, -14, 7, 131, 137, 118, 89, -54, -79, -57, 20, 28, 127, 215, 162, -92, 212, 216, 155, -13, 120, 108, -34, -73, 100, 145, 516, 53, 224, -46, 74, -129, 94, 133, 190, 149, 126, 286, -107, 210, 228, 72, 320, -117, 6, 474, 222, 64, -19, -68, 247, 195, 98, 81, 394]
5737C94m06J68J35q2J37k41J32l03L52n42J88K68m8K9k82L46J7k74o1K4l1K04
5759A24L21m17J24J60j96J45l9l81J37K38k8k31J80r2j73K78k48J53K92j00J97
5780D44k15l1L2j82K71j08K7l14P6P9L0j75K44j68j46K11O1K29n37L26m49N53
5802B58j09j45K30Ol84K87m21J42o8K45J16k61J24j26K16k30k5J48L8k77K33N9
5824E6l0r1j90O3n4K48k43J58j64N3M05k05j94k21M91n2j41l6P7p5j3j36L28m04
5848c70L49k18J85j45K18j45o5l8R5o9P1%QP5n1Q6n96M39l3N6j13K36j20K20j96
5873a21n5K06j96L37l53J59k56l3M05j34J1k21K90k44j34K50K40m62K45p6J51
5894IJl59J79J09R2J61j60o9J84k35J32j89k05M03o4m87L74M33l86N0R3j25p1
$$ y = [394, -12, 156, 291, 209, 346, 105, 237, -66, 286, -256, -68, 200, 152, 181, -101, 245, 262, -12, -73, -49, -80, 124, 445, 28, 152, 312, 116, 261, 222, -159, -22, 216, 188, -43, 137, 45, -128, 150, -98, 55, 347, 247, 444, 229, 198, 230, 48, 319, 211, 238, -76, 0, 79, 109, -66, 178, 10, -136, 75, 136, 365, -172, 154, -295, 258, 149, 4, 234, 240, -144, 143, -278, -136, -204, 41, 157, -104, 20, -106, 110, -120, -145, 3, 41, -236, -3, 56, 26, -65, -255, -192, -246, 2, -241, -83, -247, -194, 211, 6, -188, -409, 82, 30, -111, -147, -70, -145, -158, -294, 34, -370, -21, -239, -54, -199, 19, -126, -191, -229, -134, -203, -132, -132, -124, -49, -100, -14, -610, -171, -204, -148, -261, -25, -145, 75, -121, -176, 30, -166, 171, -182, -23, -279, -312, 93, -41, -30, -251, 39, -205, -339, -89, 151, -311, -66, -142, 9, 10, -349, -170, -61, 31, 192, 32, -37, 147, -88, 44, -145, -350, 53, -11, -498, -124, 309, -77, -27, 66, -59, -130]
5917a30p6l4N04k91J01q1K90n17k3K28K10m14M1J89j88J20k24N02m88J72rL23
5939B05m31K72j76m4K99l17Q0J80o2n2J46k22K15R8k2j37Op5J41j5k19K81k41
5962i0K72Q3k76l7O2K70k20j56L49j50k00K71K23j06k41M2j65K09K54qk11K2l7
5985A60J37m60J74K61l21K8K83k29K12o4mL9q7q0J43p8O8k01R4k4K14j70p5L66
6009C86m50L94o4kk41NK32J25j49p5j51L18m08J89J27o9M6Q1j58R1n7M2k34K84
6033B62k73J00p4k4j07j4L00k05L77k99j32Q0J9K61j2j68k52K80J6qk21K73p4
6056A05j10k75M38p0r4K22l47K87j48J22L2j42r3n0J54j10j00q0M80l14k70M24
6078F1J4o5j16j1J34l37N19k53L21M8l66k35J40J6P2p5K40k36K80m27Q3J09L0
$$ y = [-130, -206, -240, 264, -27, 74, -7, 283, -234, -257, -29, 181, -233, -192, -3, -191, -71, -295, 207, -281, -109, -118, 205, -226, 46, -130, -174, 125, -192, -112, 68, 6, -46, 100, -122, 93, 191, 169, 32, 38, -37, 104, 89, -130, 151, -90, 182, 265, -11, -48, 14, 284, 64, -92, 257, 107, -93, 178, 401, 295, 54, 96, -69, 140, 394, 386, 175, 197, 160, 297, -163, 11, 272, -49, -21, 262, 33, 245, 181, 177, 216, 129, 49, 192, 114, 182, -19, 75, 51, 265, 95, 20, 386, -64, 330, 266, 264, 23, 28, 260, 385, 236, 161, 10, 328, -80, 109, 236, 167, 213, 294, 136, 227, 170, 212, -22, 262, -11, 89, 15, -9, -116, -130, 170, -35, 342, 43, -89, -9, 10, 271, 259, 91, -161, 119, 135, 127, -94, 179, 105, -5, -280, 158, 88, -6, 216, -131, 156, 8, 130, 162, 20, -73, -123, 31, -79, -179, -259, 221, -93, -363, 61, 75, 10, -106, -117, 17, -320, 199, -54, 267, 315, -51, -286, -146, -130, -58, -133, 107, -129, 151, -276, -193, -84, -54]
6101e4k89K01P5J32l58P1k6L78M6j10N3m39J70p7P7K48J6k09N2NK49n43J64J69
6125Ak69K33m36K89K01k75L9k35K11L48k08j69J32n6L14n21K89j48k05J99J60
6146a06pk10K09j62K71j44m7J36J02j14r1o1QnP2q7L52r4K58m14O9j20q2K21j39
6171a85q4J34J82oMr6R8n2L6N1q5J91j25j20j18j2J93J62l11K06M1j98j03L8J67
6196Hn5J13l28K06J1m6R9J35K38m00N6K96k41j78J04J51k1l69K43k77K35j66L69
6219A83J27j55M1k79L59k58L12k31J03k11j63rO97o22J00K45j52j91L03p2j51
6240b4P5j19L60l82J64jn1J04k62J64J58k97J08R3q6j5K30rJ76l42j05M4J85q3
6264H5J98l42Q4J30j7nj47Nj4L93k30N5Q5M9q5m02J99l3krJ20o2l1K39j14j56
$$ y = [-54, -343, -142, -67, 65, -293, -222, -248, 130, 176, 66, 119, -320, -150, -227, -150, 98, 114, -95, -43, -38, 211, -332, -168, 1, -268, -35, -471, -182, 19, -256, -217, -452, -241, 107, -101, -270, -138, -194, 120, -401, -112, -260, -465, -266, -106, -113, -323, -114, -276, -5, -149, -196, -60, 42, -72, -163, -224, -216, -221, -149, -236, 116, 22, 280, -134, -65, -185, -267, -46, -185, -269, -135, 47, 41, 45, -51, 47, -5, 31, 82, -3, 188, 63, -57, -175, -187, 6, 168, -143, 63, 104, -94, -197, -159, 8, -47, 66, -262, -56, -45, -91, 8, 143, 381, -19, 37, 333, 92, -86, 18, 169, 148, -221, 22, -255, -20, -186, 183, 310, 155, 196, -83, 276, 18, 330, 99, 202, -9, -172, -181, 516, -106, -6, 239, 87, -104, 199, 127, -24, 51, -68, 292, -90, 74, 73, 22, 126, -136, 28, 186, -111, -3, 90, 4, -11, 219, 210, 386, 44, -61, -17, 168, 85, 283, -59, 25, 155, 138, 133, -14, -9, -23, 370, 140, 195, 280, 329, 244, -158, 41, 8, 6, -3, 117, 55, 24, 263, 149, -7]
6290glL50j63j58J20k20K72J74l72Pk87L94R3N5N9n40J95R8k16K25q0p7N9J33
6314A11qn6j08QK71q5N6j82M1m0J99J42k42l07M76k88J1k53K03RL01l47J47r3
6338c4J18j14j69L21l41q3Q3RJ66L4J25Kj40k15N21n73J56J29p1n5j25N34o36
6361c58K76O6J37K2j36k74J88K01l04Lk12L33Lj76J1p6L69k16J51k56J8K25j87
6384a92R7J17r4j60NO2K12p1L7k13K7K12j85M9K04l79MJ09K99n50N7M84j26r6
6408i1L71o83K47Q6j91L82k11J42j21k8J52j57ML5j75J79k74N37k56k67J77j40
6430b82L49k30J63K9l33j3L40R0l06K36k57n6K42R2o9J39L6k00ok67K35%K93k43
6454a8k70K48L3m3N6j14N6M1n9M0j61R8L39k13q1n9M4J39o7l3O4k61K37l01M46
$$ y = [-7, -10, 340, 177, 19, 139, -81, 191, 365, -7, 0, -287, 107, 200, 255, 314, -226, -31, 67, -149, 76, -4, -81, -22, 111, 103, 47, -61, -53, 218, 133, 189, 7, 48, 8, 207, 349, 107, -200, 276, -12, -1, -254, -51, -42, 259, -88, 59, -34, 84, -30, -199, 122, -219, -302, -219, -210, -44, -10, 115, 117, -23, -238, 283, -290, -134, -5, -76, -131, -256, 278, -358, -82, -16, 121, 143, 7, -267, -79, 122, -182, -179, -391, -58, -55, -231, -220, -296, 73, -143, 8, -248, -230, -5, -192, -95, 22, -72, -232, -227, -165, 47, -24, 13, -200, -173, 39, -146, -97, 107, -272, -268, -159, 140, -410, -353, 131, 5, -91, 280, -403, -156, -70, -261, 121, -90, 52, -69, -97, 55, -102, -98, -63, -238, -59, -333, 204, -52, -319, -142, -282, 67, -163, 0, 29, -304, -317, 23, 113, -193, 43, -214, -270, -28, 64, -5, 134, 170, -30, -36, -303, -68, -68, 225, -18, -288, -40, -7, -50, 6, -108, -52, -11, -70, -30, -191, -93, 246, 33, -48, -107, -63, 76, 9, -24, 40, -221, 16, -285, 161]
6479A61j76K44j14j43p7J40j0k0L20j83k62P4J19j43M01l93J50mK60m65K80j09
6501E0j9LJ73l96M85j30k75K90j73k85M16j74J80J2j16K35k22K74k52M4K63j42
6523B41j67J72J70o06N4R2K39R4O2n03M63j33k10L58n21M60r1Q4k32L62j74k50
6545c6J35J11L25l92j21K19l2Qm3j17Q9k95L26j93J44j58O0J60jr2Kl4P5J46k14
6570G2n3K16m9K5j78kK63j49j19k41J21q3J08o7J41RR5P1j80L60k07K74o57J87
6594d3k9k30L56k97K89k2O7j95j04K91k4k53l5L34m45K86M4l62K64j38K49K29
6616B32k3j27k25P6o4k02J87J87k0J1k20j34q2M85N4l68M6K12j88K68l17L71m30
6639b71j23R2J88K13k98K7J2j3J87l81m4K92J31k21m9L08j73J89o4Q7q2r7k34
$$ y = [161, -15, 229, 115, -28, -105, 35, 25, 5, 325, 142, -120, -46, 73, -70, 331, -62, 88, 84, 344, -121, 159, 50, 31, 34, 207, -189, 296, 166, -109, 181, 8, -277, 139, -35, 145, 157, 41, 276, 54, 328, 76, 120, 383, 241, 74, 246, 416, -190, -136, -44, 195, 289, 351, -152, 311, 178, -32, 326, -195, 265, 174, 258, 26, 388, 214, -36, 99, 210, 535, 143, 22, 241, 209, 217, 174, 57, 146, -149, 177, -16, 128, -30, 30, 190, 189, 97, 99, 65, 140, 286, 72, 19, 235, 186, 211, 33, 31, 294, 145, 26, -215, -94, -177, -69, -136, 5, 14, 109, 180, 0, 360, 153, 427, -230, -43, -72, -302, 54, -243, 46, 24, 91, -104, -208, 83, 59, -194, -229, 105, -340, -54, -10, -372, -108, -246, 3, 232, 209, 82, -143, -67, -131, -333, -146, 41, 21, 32, -188, -322, -404, 81, 135, -233, -187, 25, -163, 105, -212, 159, -271, -394, -302, -114, 99, -199, -172, -160, -173, 14, -367, -411, -119, 12, -209, -258, 50, -123, 66, 2, 89, 7, -90, -324]
6662c24J40j75K60m78J98K33k29L20j57M08k28Jo7M9j56j76N39M8l14n4o3K62
6684C7j67m1J23R5p4M3j79M48n39Q4J81j38M20k90m04M04M4p5k29O27l22j30j35
6707b17N23l85J11j70r7J03L48k93J98k35o6J49k18K70j04p1N5L13M9m16K10n5
6729Bk80N57Lk97K65k81l5K57K5j71k0p1J04pn6K00j93r9L46k07L9L0j38Q2K08
6754B63j36j20J08J1O8j58J92J73k18l11L43n11L15J29k44J35k03K04O9K03k8
6775B84m4k17j07L51N9k97nJ41o0k91K41K22N1N4l2p6q3R4l24K32p4k5Qj65L14
6800B51Q2j08j38J36m0N9k19N7Q7q1j42K19o9L09j64m36L58J90j21K7Nk15q2l6
6824g1M24%j63k49l2R5J68k57J65n1MM0p7p0R2j59K25j01J19p9K16l41N8J77k12
$$ y = [-324, -184, -359, -99, -577, -379, -146, -375, -55, -212, 196, -32, -31, -98, -49, -205, -381, 158, 206, -108, -162, -225, 37, -130, -171, -48, 47, -27, 16, -163, 285, -254, -170, 11, -127, 293, 3, -401, 3, 47, -28, -257, 370, 48, -82, -217, 306, -79, 32, -138, -235, -132, 216, -77, 121, -114, -180, -31, -249, 21, -83, -154, -99, 214, 263, -153, 57, 2, -278, 279, 282, -15, 250, -31, -66, 191, 216, 45, 25, -46, 58, 51, -5, 195, 2, -97, 249, 42, 81, 111, -27, 55, 263, 127, 7, 115, 126, 194, 36, 228, 401, 183, -128, 215, -296, 19, 148, -96, 39, -164, 40, 109, 312, 284, 240, 23, -84, 267, 326, 29, 24, 165, 105, -186, 55, 277, 328, 382, 350, 274, 191, 285, -39, 193, 119, 94, 102, -63, 251, 333, 225, 87, 223, 183, 242, 23, 80, 167, 86, -56, 163, 94, 403, 239, -197, 161, 351, 230, 257, 262, 47, -35, -71, 353, 353, 190, -59, -91, 4, 172, -85, 80, 29, 33, 73, -4, -74, 18, -141, 84, -17, 102, 23, 239, -102, -44, 133, -79]
6849g9j17J3J52J1j96J29J42l27M88l39N33m91j00l1L55l61Jk64M15j95M01k0
6871A20k13J38j79O9L06j04k94L44l39K19m8J19k52p0M1J55o0K8k6R2K10j94k49
6894a87L4K64j51k09j86M95j21k7N4j12j12j20L00j09j1j36L45l04J83k2k24J80
6916a76P8j94L44k67q8K72P2j52l26K69J33k75K19j94J55J88k48j02p6J68J91
6937ij0Kj2Nj43l0K24k3m00M88kl69J84j92M10j30k80K21J27k61K54k80L73k78
6961a31K39l6r9R1j24j25j8L69k67r4K52K4j67q7K86k04K04r9J45l70K75r4Q3
6984E3O8k65r2M01l54j8K6K56k46k13L80k06L70j11j36K08K2j55j9q3J49K0K11
7007B66k16P7n6J71k19J85J06j67j31J37j00N7j82L27k08j26J53m8J47J69l20
$$ y = [-79, -196, -183, -31, -20, -216, -87, 55, -272, 216, -123, 410, -81, -181, -212, 143, -218, -217, -481, -66, -261, 140, 120, -93, 45, -134, -65, 241, 137, -157, 187, -152, 67, 19, 138, -114, -184, -143, 12, -48, -20, -46, 46, 256, 62, -187, -153, 111, -40, -249, -435, 60, -61, -88, -34, -146, -258, -378, -78, -187, -198, -334, 11, -293, -110, -132, -356, -176, -98, -292, 52, -215, -303, -31, 41, -111, -437, -168, -35, -310, -91, -285, -130, 58, -190, -292, -368, -200, -9, -19, -17, -29, -24, -167, -197, 27, 4, -396, 92, 90, -279, -95, -287, 123, -7, -287, -66, 61, -200, 54, -226, 147, -131, 108, 72, -27, 64, -60, -185, -203, 166, -101, -195, 57, 81, -86, -173, 113, -91, 113, 14, 159, -211, 64, -30, 53, 121, -144, -236, 165, -189, -207, -181, 75, -171, -384, -4, -210, 160, 49, -87, 121, 143, -12, -31, -114, 35, 55, 266, 50, 127, 71, 242, 23, 208, 314, 147, 16, 153, 53, 110, -72, 255, 47, -79, 74, 26, 173, 342, 22]
7028B2J97J30l88n3J78J10n0K6p5K75l25N8j75K99k37J16p3J34j59p4J90o3J42
7051B05j24J59m28K35L70O9k94l23L17K1l5K40k78K15lp2j54K77l49R4L06m98
7073e0k2j93M38M5m99O11k93N1j79L15n6n2j13J52k60K88m9J63k52j96J53J51
7095A53mq4o7R0j09J74j61j42L79k56K54p2k59o6j26J81K56j65O5j41K77j58J04
7118A23k38j2L41k46j31o0r6L45j56n8O8J97m32K84j77J27J96j77k4K45m70l5
7140c86L79m21K93J39L0j98Q1j01LL21Q9m40J15k33O9J32P6k24L99k59J76k10
7162a70m3j12QJ30K96l4K6k39j44R7J19k2j97K83j01nJ02J3J50k31r9J19m14M24
7186d4k0J6j07k9K97k55JK51r7L1q2J88l99J8J55J28j50oJ55K82m77L36j01k0
$$ y = [22, 219, 349, -39, -92, 86, 196, 146, 172, 97, 372, 47, 105, -70, 229, -8, 108, 35, 169, 10, -64, 126, 63, 205, 81, 240, -188, 47, 417, 486, 192, -131, 186, 207, 172, 412, 134, 349, 346, 274, 120, 397, 48, 142, 448, -50, -72, -265, 173, 218, -281, 330, 37, 88, -91, 224, 168, 116, 3, 155, -105, 183, 134, 297, 45, -151, 2, 153, 149, 65, -2, 88, -21, 153, -8, -150, 229, -27, 227, 155, -104, -170, -296, -115, 141, -24, 41, -100, 177, 19, 123, -115, -127, 214, -32, -163, -223, -319, 26, -130, -188, -120, 77, -355, -71, -248, -121, 75, -102, -126, 119, -351, -386, -7, -428, -135, 4, 34, -164, -83, -184, -181, 140, 229, -211, -96, -329, -260, -128, -52, -276, 123, -136, 40, -170, -213, -325, -317, -187, 109, 75, 101, -138, -282, -185, -66, -88, -285, -2, -103, -108, -6, 7, 157, -74, -173, -54, -468, -44, -64, -48, -155, -184, 113, -142, -141, 110, 13, 44, -38, 150, -249, -231, -76, 52, -98, -104, 51, 333, -144, 192, 91, 71]
7210G1l74K04K62j5k30kQ0J00l88n9L25j37K51l89K54j45K84j4j62r1M3J77k14
7233a69J78p8j2o7J99q9rj40N9N0j59J30j20K63j54j55K19r2L13k06k68N96j1
7256B78j95J45k98K70l30j71L19Q5Mm4O1j65k5r2q6M9Q3J35J2Q0j66J51K18k59
7280E9J53k09J50p0j5N8p7J52R0k74n6L49p4l01N2K15QJ18l9j75k75J27J74j33
7304GK96j90Q4PJ80m18j29M81m77J78k9K25l71J26K3P4O2j85K81l50J45L02L6
7327C58L1j36j59J77l8P8J60k78j23L35m95O7j60L29N8J65k30O9j56L3j8N6K2
7350A45J04m4l23L23k02R9j20N2j46J4K23kJ8M4J5j41j75K86r9j70l7Q5L12m8
7374B13j56q5l9m5N1K8l9J92m19O27k52M3k76J78j14P7N6l6p6j67m3L88oo7l26
$$ y = [71, -303, -99, 163, 148, -82, -84, -4, 96, -292, -351, -26, -163, 88, -301, -47, -192, 92, 78, -84, -175, -132, 45, -169, 9, -69, -81, -148, 51, -38, -47, -187, -128, -78, -237, -107, -227, 36, -118, -273, -54, -146, 167, -39, -307, 289, 278, 83, 228, -70, 200, -130, -301, 18, 103, 107, 63, 124, -41, -66, -158, -244, -195, -112, 23, 35, 115, -51, 100, 318, 59, 212, 3, 153, 83, 68, 126, 49, 201, 291, 17, -39, 310, 236, -65, -13, 202, 210, 328, 289, 114, -161, -34, 140, 7, 303, 113, 197, 204, 384, -34, -163, 318, -159, 19, -10, 215, -156, -30, -7, 67, 129, -56, 225, -125, 20, 322, 358, 389, 253, 94, 271, 233, 311, 471, 193, 70, 405, -90, -23, -183, 146, 204, 369, 139, 208, 52, 85, 67, 123, 145, 249, 205, -118, 205, 3, 102, -18, 34, -112, -98, 125, 123, 141, 185, 200, 59, -116, 170, 71, -99, -136, -51, 261, 213, 57, -28, -67, -112, -61, -33, -72, 120, -299, 328, 76, 119, -157, 21, -93, -16, 40, 4, -72, -239, -282, 106, 100, 33, -293]
7399b93R6L26m40K16qj8j6K04j99O6Rk57J38q7K20k05Q6J57l44M20m6J51r3j78
7423i5m6j67J93j04O5j16N2K31j71J29q8J69k24o3L37l1m32J32J53J28j95m0J53
7446c0k12L7J18j76K72j05k45r8L85j88J9L46m62J40j5q6k8K58r7j89M36j91%
7469a11o8j56L24L2q1J3l54K90r2k4L34j39r3%N5L37m80K12j88L98n25M46k00
7492g0M4RK9k02J98j28m8L96k49K25n14K85j6K45k5j17J50l30J29L04l06k68K91
7515C2q6J35j46l0O7K81l95L19jj83j29L66k74J16j66J83j27r4L87j13L7Om40
7538b55M74j97K31j23l09J77k5k51O14l18L46l9k64K53k12n1J7M17l71L39k61
7559A92J62k44O3J67j69j14L3j08K00J75n66O52j46p7j43K12k71J16l12O26l75
$$ y = [-293, -197, 129, -311, -95, -103, -121, -137, 67, -132, -66, -57, -314, -176, -263, -43, -248, -162, -5, -349, 71, 25, 176, 83, -95, -141, -308, -115, -219, -154, -270, -218, 13, -158, -29, -117, 52, -172, -235, 102, 71, -361, -229, -76, 52, -143, -183, -30, -242, -205, -87, -263, 9, -96, -341, -439, -54, -242, -223, 123, -339, -199, -214, -300, -328, -70, -167, -356, 80, -111, -111, -179, -335, -11, 21, -60, -47, -401, -111, -203, -227, 107, -32, -125, -125, -70, 267, -213, -1, -189, 209, -316, 130, -70, -26, -17, 12, -190, 8, -120, -168, 228, -21, 204, -310, -25, -41, 204, 179, 62, 212, -118, 11, 315, 9, -259, 32, -54, 81, -65, -95, -28, 253, -142, 177, 176, -7, -136, 230, -44, 72, -94, 89, -38, -132, 255, 142, 179, 185, -255, 219, 22, 253, 130, -179, -2, -27, -278, 336, 18, 364, 325, 61, 314, 102, 51, 68, 485, 114, 453, 192, 354, 110, 173, 340, 171, 57, 90, -18, 182, 357, -209, 443, 297, 220, 77, 289, 18, 134, -178, 448, 73]
7580G3J4J33J6j60J08j63j8L81j47p4J43L07m33k0l92L37J37O9Q4l63J53Kj7k18
7604d8J19Mq5J87r0K6j76J32K64j80P0j25j25j27K90j61J01k98L33o5k34K32K
7627D6k8J52k02J99O0j00k94K67j50O4j20j26L21j71J05j2M8k57K50l39K84R1
7649H8k96R9k81K23J19M75o00J31L9K17m13Qm5J55l6J95j89L65j45m70N6K81p4
7672i8j15q7o7J55j7J33L18m88m6J52k27M17J25m12J24j50K4L01m61M69j56K5
7694h1o0Q1p9k0q2l4r2K10l2J51L1r7k32L44kj0r6k63M4M43m29K36R2j00j89K84
7720A8j34k5O0o6r9K04o9K6n1J2QJ98k14O8J52k69l5M06l64K04nk0J09m16K62
7745d0j0J85j91j30q9K22J96n4q0p9j96K71n1M2j46N1q7J47P0M0j53P6j0j93K23
$$ y = [73, 87, 220, 236, 76, 184, 21, 3, 384, 237, 163, 306, 613, 180, 160, -232, 105, 242, 311, 395, 32, 185, 187, 170, -48, 71, 75, -10, 177, 87, 113, -63, 69, 333, 153, 223, 98, -27, -154, 136, -25, 76, -222, 111, 46, -188, 44, 46, 18, 170, -32, 167, 227, 127, -167, 100, -50, 14, -106, -232, 89, -82, 23, 11, 59, -198, 52, -287, -3, 88, -208, -109, -390, -167, -48, 427, -173, -42, -3, 214, -199, -191, -236, -81, -117, 78, -111, 254, 109, -361, -305, -24, -98, -213, -300, -367, -212, -229, -96, 222, -266, -312, -160, -387, 30, 155, -257, -133, -283, -259, 42, -419, 50, -106, -81, -141, -60, -139, -159, -241, -275, -367, -157, -189, -38, -7, -104, -336, 8, 6, -4, -100, -363, -319, 124, -305, -69, 23, -77, -266, 18, -116, -141, -81, -147, -246, -42, -111, -85, -136, -124, -116, 82, -132, -64, 88, -181, -216, 190, -174, 30, 25, 5, 114, -302, -40, -50, 135, -56, -186, -275, -53, 143, 89, 9, -70, -266, 5, -46, -4, -150, -99, -186, -39, 31, 71, -82, -6, -16, -209, 14]
7770A4j29j29M07r6M1k78K08j26L49j01j01L2k76L23K7OQj02N1J61j27J9q2J49
7794B48r1k30L45K21n55J32L37j64l20J42J44j44J01k75L23j06K33l42L0K63r9
7815A93m56M87J51n14K12p9K39n4k38j57J32M62l66J39j68J69l1K1j04j03Q4n6
7837c7L11k19K8n6R7q4J35k21M06jk41l0J71k18J65pk04K60o5p9J01l30L9rK19
7862A31j57o1N1J97j94M76l97j85K94n5o2K09l77Q2P7l56N21J51q3J42l64J90
7884B30p0o0j78K78k90K60k25J34J99l31k13L38M1j9j01n3M73m64K29k85j30L69
7906A32l37Q2L35n41M26j11L55j85k49k49M35L7k17j42K20Q5o9Q9j91J6K83j86
7928A8r0K2j35J22K0k35R6J31j36K23j35j04r8K31L77n45K54j44k51J13l0L74
$$ y = [14, -115, -244, 163, 67, 108, -170, 38, -88, 261, 160, 59, 91, -185, 138, 165, 171, 179, 77, 128, 289, 162, 181, 99, 248, 157, -73, 272, 493, -62, 70, 407, 243, -77, 65, 209, 65, 166, -109, 214, 108, 341, -1, 29, 292, 193, -263, 224, 375, -139, 73, -6, 233, 179, -59, -216, -84, 378, 12, 151, -17, 152, 121, 142, 38, -65, 19, -37, 274, 55, 83, 27, 124, 40, 175, -46, 360, 359, 118, 88, 259, 41, 206, 199, -5, 255, 190, 111, 212, -118, -79, -88, 131, -26, -87, -36, 161, -33, 443, 46, -139, 155, 100, 38, 247, -130, -48, 29, -327, 194, 345, 262, 404, 40, 230, 160, 100, -78, 200, -90, 170, -55, 79, 278, -53, -266, 72, 113, 94, -7, -60, 413, -51, 178, -107, -237, 132, -205, -123, 212, -329, 97, -14, 341, 156, -93, -342, 93, 130, -87, -229, -9, 76, 7, 96, -95, -79, 204, 18, -72, -50, -185, -63, -43, -278, -182, -51, -187, 36, -99, -203, -301, -70, 307, -238, 16, -128, -379, -266, -296, 78]
7950G8j55J36j12J30Rk34P2L5j40K01j86K94j71j31j46M18k20o4M5R5k50K46K7
7973b3m32K61Mn6K06j82M76k59j85P1J36l21K36K9r9L33l29M3p0J67j44r5L2K53
7997E2l10K9K61k13m2J62J57L2m13O5J72K20k49J87l20O8j29N0L1J08J48k17k7
8020a78r4K60k58L62r2L88n46J39M4J32l8k17J36k91L01k5o28N76N6R6j6p1K41
8043B77k00j62m7P8J15k58K11P9P4j2J21n57K20j15K37Q2k7k55QM06R5k87j72
8066h9L40k28j18J40j11N44m50M06k64J04j96j68J75j5r2L14m15J74J03o3p4k5
8088hO2J03k29K51J2l08J01J58j29J95m4J91r3j73J3k28K96r5j92Q2J11k4J49
8111B01J84m93K54K67l72k5J49j37K04r2N8m7J4Pl6m6j6j16m5L38m37K10M61l46
$$ y = [78, -77, 59, -53, 77, 86, -148, -76, -41, -181, 20, -166, 128, -43, -174, -320, 98, -122, -186, -141, -46, -296, -50, -23, -455, -194, -190, -246, -40, -222, 254, -5, -190, -119, 17, -304, -68, -39, -138, 195, -134, -91, -161, 6, -138, -233, -201, 52, -258, -229, 32, -181, -223, -61, 96, 128, -285, -220, -48, 172, -77, 110, -210, -142, -271, -221, -190, -82, 66, -151, -178, -272, -12, -270, 92, 0, 388, -158, -19, 25, 157, 119, -98, 38, -253, 48, 23, -605, -29, 27, 123, 107, 36, 277, 77, -85, -132, -54, 61, -197, 14, 93, 167, 155, 276, -281, -61, -176, 61, 143, 116, -139, -131, 275, 370, 83, -89, 251, 23, -95, 45, -66, 478, 28, 434, 170, 274, 78, -90, 85, 70, -22, 292, -123, 51, 154, 91, 17, -8, 54, 157, -72, 179, 191, -117, -16, 142, 13, 208, 164, 355, 262, 89, 102, -126, 170, 75, -117, -35, 76, 52, 201, 385, -108, 146, 413, 41, 16, 165, 28, 232, 140, 198, 151, 165, 172, 136, 90, 74, -42, -87, 251, -186, 24, 485, 139]
8135A39L0k66L61j77j69K52j17K00k79J76J12q8k25N8K45k83M1j18j09M42k40
8156a5J93k78j9R8m2J84pj36J66j49K47p3j40j04J70j10k02K96j77n7J56j99P7
8179a21J06o8M7M4m7R1k54J97ok85L10j48
$$ y = [139, 169, -97, 264, 87, -82, 170, 53, 253, -26, 150, 262, 174, -51, 7, 252, -31, 10, -108, -217, 225, -15, 178, -100, -119, -21, -63, 121, 114, -22, 144, -5, 242, 169, 29, -75, 95, -15, -217, 79, -98, -155, 1, -198, -121, -15, -83, -36, 8, -39, 52, -202, -5, -11, -296, 14, -134]
8191a34
$$ Imaginary data points
##PAGE= N=2
##DATA TABLE= (X++(I..I)), XYDATA
0@%%%%%%%qJ6j6J6k4L2m0M8n6P2q4R9j19J36j56J81k10K42k77L17l62M12m64N22
31B77n89O61p39Q28r24J027j142J269j408J558j724J911k116K343k597K884l211
48a692L584m015M523n127N860o779P965r560J1839j5394K1746l6592J35214P7440
62A89012k19851j0215J14709M7568j14333k2553R1635L2273j16531m6324J01757
73D7147P8390q5356q0754N5298P6929n2171o8757M6883P7890l8969p7724K1126
85f8P4284j3750o3254J2763O4680j6071p2519N926P4379K78p5650r861P0108J2682
99F3927p3709k3698P0495L3971o1698m2643M7681L6569m6894l3308N5815M3601
111G0109n9943o2858M7428P4355k6749p0273J2189N6859j4840n6218J7912O4946
$$ y = [0, 0, 0, 0, 0, 0, 0, 0, -8, 8, -8, 8, -16, 16, -24, 24, -32, 40, -44, 55, -64, 72, -84, 97, -113, 129, -148, 169, -193, 219, -245, 277, -312, 349, -390, 438, -486, 541, -601, 668, -740, 818, -906, 1005, -1111, 1232, -1365, 1519, -1692, 1892, -2123, 2400, -2727, 3133, -3646, 4319, -5241, 6598, -8796, 12950, -23642, 111572, 189012, -30839, -41054, 73655, 121223, 6890, -15663, 75972, 108245, -8286, -54610, 47147, 125537, 40181, -40573, 14725, 91654, 39483, -29274, 17609, 95499, 56530, -21194, -68, 74216, 60466, -2788, 9975, 74655, 58584, -13935, -8009, 66370, 66648, -9002, -18863, 51245, 63927, -9782, -33480, 37015, 70986, 9288, -33355, 14326, 50895, 4001, -29307, 26508, 70109, 10166, -52692, -5264, 69091, 42342, -27931, -15742, 41117, 26277, -29941, -12029, 52917]
123E2917j2646p6907n693P3064J5078o9761k1212O7630K6333p0197m1009O3697
135A294N3437m9241n7996L5332N5245l0914n4565L0222O3665k2380p0558O870
147c9589O6062L320n7508n652N2992O028n4611j3515N0553K1090m3545k3773L3705
160d443J7024l7449j4434M6419K1177n0722l6241M1422M1799l1373m0799K5031
172b2589L7437k6305m1871K6068M8873k2212n6742J2111N8889m380o0216l085
184e4022O0503J2279n7144k0870N0100K5283m5384k5880M4360L1448m2385l8934
196f0646L7430M5693k8309m6406K1822M3226j9974m4608J9315N1422j0143n4663
208d5841l165M8379J0782l9581r060L8017O973m3444j0774M8907K3594m2898l3934
$$ y = [52917, 40271, -36636, -42329, 30735, 45813, -23948, -45160, 22470, 48803, -21394, -62403, 1294, 54731, 5490, -52506, -17174, 38071, 7157, -47408, -17186, 46479, 24099, -46459, -39589, 26473, 29793, -27715, -33367, 19625, 25653, -28958, -42473, 8080, 29170, -14375, -38148, -4443, 12581, -24868, -39302, 7117, 28294, -22428, -58669, -17247, 24552, -6821, -47620, -22589, 14848, -11457, -53328, -27260, 21613, -599, -57341, -45230, 13659, 9279, -50937, -54022, 6481, 18760, -38384, -59254, -9154, 16129, -29255, -55135, -10775, 20673, -21712, -60646, -23216, 22477, -5832, -52238, -30416, 12810, -7164, -51772, -32457, 18965, 8822, -45841, -49006, -627, 10155, -29426, -38486, -469, 6504, -36940, -47714, 1193, 24787, -18111, -52045]
221e2045L0189L4241j9408k7071J8340K4601k1508k8134K0331L3646j5136l5390
233c7344Q813L3120o605l0379O922L1465m750l3275J124L2828M345l0168n067
246b8971L1076Q708l1211j0988L1557J5991k9359j8738K7894K2828k4867k5901
258c1981K0436K8407j3875k8860Q505K6221p794k5592R064K9331n498l2717j280
271b5633L1818P158k5273p386K2568P888k0990o573K3401J1374k1156j4159J9239
284B276J5667j6383j4017J7948J6661j6950j8775J4588K0475j0193j9536P923
296c16J9437o027j8614P510K1525n541k3373K751K4830J287k1817j470K2060L366
310B5608k0991l567K2200P210k1166j0468J9617J3414j7225j3123J7809J4143
$$ y = [-52045, -21856, 12385, -7023, -34094, -15754, 8847, -12661, -40795, -20464, 13182, -1954, -37344, -28531, 4589, -2016, -32395, -25473, 5992, 1242, -32033, -30909, 1919, 6264, -23904, -28971, 2105, 10813, -20398, -31386, 171, 16162, -13197, -31935, -4041, 18787, -6080, -31981, -11545, 16862, 2987, -25873, -17368, 8853, 1059, -24533, -15469, 13862, 8364, -24353, -25633, 6185, 13343, -11930, -19316, 3252, 11140, -9850, -16423, 6978, 18352, -2804, -16963, 2276, 17943, 1560, -12457, 5491, 22152, 5202, -13573, 1015, 21490, 11297, -8239, -316, 19121, 13094, -5520, 1990, 23515, 17974, -5399, -2648, 22182, 23469, 1652, 182, 22242, 25608, 4617, 1050, 23250, 30460, 9294, -1174, 18443, 31857, 14632, 1509, 19318, 33461]
322C3461j8308j7622J6458K0155j2800k1298R134K0887o379j9414M649J9751m029
335B4645k1444K014K3227R26k2894l474K1782N539j9678o187J7268N846j7780
348I790p074J8493J0213j8046j4102J5299J3690j3703j4352J2782J3783j4971
360A1802j5896J3631J8833j1613k1084O866J9498n799j8854M881K0056m350k3094
373e123J823K4516J077k5033m922K2641O345k1409p117K0754P863k1302j2420
386a2307J9936J5116j8501j8530J4852J9065j3726j9525J2359J9757j2671k2610
398a6785R123K4202n357k4009J443K2377P74k2128j719K1982L218k4204n691K4068
412G294R654k2385j2095J9214J1872j8624j3433J8078J4746j7531j8486J5286
$$ y = [33461, 15153, -2469, 13989, 34144, 21344, 46, 9180, 30067, 23688, 4274, 8923, 28674, 24645, 3201, 5215, 28442, 29368, 6474, 3000, 24782, 30321, 10643, 4456, 21724, 27570, 9790, 2716, 21209, 31422, 13376, -726, 14573, 28263, 14560, 208, 12990, 26773, 11802, -4094, 9537, 28370, 16757, -4327, 2539, 22037, 16238, -2616, 2265, 22321, 17971, -5123, -3300, 21216, 22293, -2740, -7662, 14979, 21324, -85, -7202, 13552, 21415, 113, -12307, 7629, 22745, 4244, -14286, 566, 19631, 5905, -13620, -1261, 18496, 5825, -16785, -7662, 16540, 11183, -12826, -11383, 10994, 11768, -10360, -12079, 9903, 13121, -11083, -16774, 7294, 16948, -5437, -17532, 1682, 13554, -5070, -18503, -425, 14321, -3210, -21696, -6410]
424f410K1168j2807k2819R256K1841r188k2386Q118K4705o285k6376J473K7550
437G840K220k6308o480K3731Q021k3507q616K4500J1048k5934j6122K3198J8985
450A2576k0013k1040J5980K1256j4431k2599J3380K4821j1436k8348P129K8717
462E992k450k7772Q07K7348M66k7044k732K8021O270k7810j1207K6155J5269k2606
476a1293j7221K0350J7681k0266j9155J9493K1481j8461k4376J4732K6798j0124
488c61k7192O660K6380m782k7215L094K8825R35k9321m138K8752P199k7565r410
502b8139K6028J2295k5303j4784K4515J8232k1572k1651J9204K3628j6026k4975
514b8548J4170K6091j1071k7013R857K9306o955l0015K276L0581K718k8449n038
$$ y = [-6410, 14758, 1951, -20868, -11612, 10229, 1041, -21345, -13227, 11478, 5193, -21183, -19710, 7840, 10060, -16248, -22728, 1003, 9024, -14483, -23099, 1401, 12449, -13485, -29607, -6409, 12576, -7437, -28477, -12497, 8759, -5672, -28271, -14891, 9930, -1506, -29854, -22725, 5992, 3542, -24230, -23423, 3925, 4391, -22653, -25385, 2636, 8906, -18904, -30111, -3956, 11313, -11293, -28514, -8164, 9517, -10749, -29904, -10411, 11070, -7391, -31767, -17035, 9763, -361, -27553, -20893, 5487, 705, -26510, -23416, 5409, 6344, -22977, -27115, 1637, 8836, -18729, -28139, -2111, 10184, -15119, -29903, -5388, 12844, -8728, -30379, -11175, 12453, -3573, -28548, -14378, 11713, 642, -26371, -16514, 12792, 5837, -24178, -21902, 8679, 11397, -17052, -22090]
527b2090K7668P756k7283j0068K7736J2915k5665j6462K3812J8911k0886j9541
539b3197J9051K1980j7065k4463J4059K7034r569k6884O972K7578l294k7469K356
552a2911K8106N4k8024k997K8851Q173k6386j1763K4832J3866k1914j5205K1240
565E922J7384k0171j9003J9539K2885j5162k4410J2006K4724r196k4041P464K6956
578B4897m854k7532J470K8556L332k7218o519K5029P798k4179q783K4298J1792
591B8087k3965j5682K1350J9456j8147k1547J4704K1578j2008k1625J1999K2914
603B7114j0643k4994P321K6849k554k6262q98K5043L194k3633n111K3823O776
616B6025k4902j0452K3521J4157k0990j5819J7777J5891j6892j6931J5350J9105
$$ y = [-22090, 5578, 13334, -13949, -24017, 3719, 16634, -9031, -25493, -1681, 17230, -3656, -23197, -4146, 17834, 769, -23694, -9635, 17399, 7830, -19054, -12082, 15496, 12202, -15267, -12911, 15195, 15249, -12775, -15772, 13079, 21252, -5134, -16897, 7935, 21801, -113, -15318, 5922, 23306, 3135, -15868, 3671, 26556, 11394, -13016, -1010, 23714, 14518, -9523, -2059, 24897, 20043, -7489, -6019, 22537, 25869, -1349, -7868, 17161, 24959, 780, -8003, 16295, 28087, 4122, -11560, 9790, 29246, 11099, -10448, 4256, 25834, 13826, -7799, 4200, 27114, 16471, -8523, -1202, 25647, 23093, -3169, -4067, 20976, 24170, 537, -4574, 19249, 26025, 1123, -9329, 14192, 28349, 7359, -8460, 9317, 25208, 8316, -8615, 6735, 25840]
628B5840j4321k1897J0812K4203o925k4112L100K2383k044k2108Q61K2733N72
641A9097k3778m378K2652P471k1706j0674J8215J1744j7424j3073J6913J4329
653A9388j6004j7491J3775J8484j1290j8995Q628J9105o727j9183M933K0608k624
666A2607k1641q60K1132L311k0063m882J8856N671j8227p748J7294Q997j6993
679b546j1787J5062J3530j2700j5244J0742J5453r334j6553Q271J6458p195j7638
692a3481N235J8702k187j8207n52J6864J203j6715l145J7105M682j7107p409J6199
706A187Q609j4151r663J2253R110j2240j0974J1968J3222r299j5099O042J4931
719E896m329j4026L211J4090l163j5129K065J5673L32j5786l087J2832M246j2311
$$ y = [25840, 11519, -10378, 434, 24637, 17712, -6400, -3300, 19083, 17039, -5069, -4208, 18525, 19097, -4681, -9059, 13593, 21064, -642, -11316, 6899, 18643, 1219, -11854, 5059, 19388, 3384, -14107, -332, 18152, 6862, -12133, -3505, 15600, 8873, -10310, -5377, 15231, 12607, -9034, -9894, 11238, 14549, -5514, -10396, 8460, 14131, -4096, -11844, 5450, 14447, -2546, -14333, 729, 14259, 1559, -13685, -2943, 12510, 3176, -13377, -5106, 11352, 4157, -13481, -8246, 10456, 8269, -9938, -10490, 6374, 7577, -9138, -12283, 4822, 9504, -7603, -15012, 1187, 9796, -4355, -14018, -1765, 7345, -4895, -15869, -3901, 9321, 22, -15077, -9035, 5896, 1567, -12459, -9248, 4842, 1679, -13450, -11385, 4288, 4620, -11166, -14253, -1421, 2825, -9486]
733i486n070J2328N349j3140p800J2239R419j0656j0884P923J0224p506r351P116
747i295J0342o950j2156M453J3099k584j2375J444J1867p27j1935J66J2641Q18
761a192j3304k072J2097M206j1188m786J0455O122q948p033Q294P373q208p741
775a5925Q038J0236o884r928M567R902l290q774L444Q814l258r868K195J1990
789A259L80j1303j591R142K127q775o81R773K155j0404l608R948O022p513o421
804i490O324O015n649n476P412P139o579q559M879R473l020q400L127P542k506
819B232p491L242Q392j688r068j50R397J470p676j393Q588J186p985k010R172
834F218L442q991m173Q035N664o123o147N963O728n701o943N587P716m933q471
$$ y = [-9486, -14556, -2228, 3121, -10019, -17819, -5580, 3839, -6817, -17701, -9778, 446, -7060, -16411, -9295, 1047, -5903, -18059, -13606, -507, -3091, -15466, -14022, -2155, -2882, -14817, -14651, -2010, -1192, -14496, -16568, -4471, -265, -11453, -16239, -5784, 338, -8610, -15643, -7349, 24, -8184, -15925, -7887, 2349, -4535, -14463, -9896, 6, -3284, -12058, -8614, 200, -3058, -12926, -10731, 1259, 1639, -9664, -11255, -2113, 14, -8761, -9442, 331, 2486, -7918, -11526, -1578, 4444, -3069, -9490, -3166, 2849, -2800, -8276, -864, 6275, -304, -8863, -3984, 5489, 2469, -5931, -2804, 4738, 2232, -5259, -2017, 6375, 4687, -4381, -4531, 4866, 6336, -1340, -2733, 5855, 7041, -944, -2954, 6218, 9660, 669, -3504, 4531, 10195, 4072, -2075, 3888, 10616, 4915, -2028, 3559, 11275, 6342, -2129]
849b129M389R422k359q188J042P430q14p573J734Q817n63r475j077R815L034q505
865E000l222P596K268p624k904R115M850q391o824O456P042n102p242N316P387
880A3721n518q898M892J0302l302j0724J211Q918o58q041O50R197l36j0385j891
895h62J0145L071r159m415Q758M344q674n089Q851N274q459p259P288P586o310
910E090q546N389R402m863j0200L536J0786l324j1073J300J1529k31j0917j450
924c572J0623K084j0584k972J0088L652j0220n394J0360O922r601p834P780P784
938I116p571p459O820Q469o992r815N217J1691l582j2010J388J0988n91j1512
952e843R94J2298Oj2752l173J2366M820j0645n841Q963N457r122o196R706Q497
$$ y = [-2129, 2260, 11682, 9323, 1135, 2177, 9607, 8793, 1220, 2954, 11771, 11208, 1733, 656, 10471, 13505, 5000, 1778, 9374, 11642, 4018, 1114, 10229, 15079, 6688, -136, 6320, 13362, 8260, 1018, 6334, 13721, 8203, -695, 4197, 14499, 11197, 473, 1684, 10602, 9944, 1903, 2553, 11750, 11414, 1029, -862, 9283, 12354, 3195, -1220, 7538, 11882, 3208, -1881, 6970, 12244, 3785, -3474, 3814, 11400, 5090, -3456, 1933, 11335, 6472, -3728, -192, 10594, 7270, -3803, -2503, 9026, 8795, -2122, -3572, 7051, 9135, -1449, -4421, 5667, 9319, -901, -6295, 4065, 10987, 1386, -6448, 1332, 9116, 1545, -5914, 906, 9375, 2383, -7432, -2215, 9476, 5894, -6116, -4728, 6260, 5669, -5843, -4849, 7449, 7455, -5297, -8470, 3896, 8716, -1929, -7770, 1193, 6650, -2472, -8668, 1038, 9535]
967I535r755j0480O811J1050n405j0176M253R821m537j0708L520J1717k291j2818
981i463l73J2745J585j2139k511J1394L749j2264m638J1565N421j1076p334R826
995c513Q548q003r852O766R774o720j1109N722J2371m773j3101K714J2756n89
1009I91j2578o31J1161J135j1712j719J2589L039j2358n795J1667P416j0751p992
1023a5538R208Q205q424q363P961J0230p168j1776N183J2184l119j1854J911J2104
1037G44j109j2358K94J3190J712j3047l599J2093M944j0688m978J0411O139r957
1051f209p680R685R029q219r726P169J0721n601j0640M657J1282l931j1329K819
1065g973J1948q09j2058m68J2852J622j1634k967J1133M427j0933m977J1019O991
$$ y = [9535, -220, -10700, -3889, 7161, 1756, -8420, -4167, 5654, 1117, -9591, -6071, 5646, 3355, -9463, -9836, 2909, 4494, -7645, -10156, 1238, 4987, -7277, -11915, -350, 5071, -6005, -13339, -3513, 5035, -2968, -12820, -6054, 3720, -3000, -14109, -8387, 3984, -789, -13890, -11176, 1580, 991, -11587, -12218, -1057, 78, -11634, -13353, -764, 2275, -10083, -15878, -4211, 3205, -7546, -15538, -6330, 1875, -6549, -14912, -6951, 3279, -3889, -15665, -10482, 1702, -1417, -13271, -11360, 744, -365, -12723, -12429, 761, 2473, -10574, -14173, -2080, 2864, -7824, -12802, -2391, 3748, -6209, -13889, -4204, 4825, -3394, -13120, -5951, 4770, -831, -11471, -6814, 4468, 537, -10792, -7973, 3975, 3166, -8892, -9360, 3492, 5114, -6520, -9487, 1646, 6073, -4860, -9837, 1182, 8173]
1079H173r464p726Q382Q454o817q808O575R684n779j0689N558J1605l157j1887
1093e896J626J1406m98j0150k11J0940J423j0965k747J1336M494j0503n842R845
1107D258O076q246o234Q208P798p863q622O044R975m593r821L316R668k294r639
1122a969K162J0493j088j1065n16J1130K402r990l085R004L577q154m573Q615
1136F943N252q182o887P361Q234n795q418M926P943m372q567M051Q585k634r334
1151h94J065R784K49r266j414Q838J792q868k503Q757L079q140m818P916N171
1166A0748o579o232N294O271n154o291M886P089m582p808K256Q608j600q217P78
1181e33P477l65p320j40P540P06p664k583P696L258o652m079O065M424n954m532
$$ y = [8173, -1291, -9017, -635, 7819, 1002, -7806, -1231, 8453, 2674, -8015, -2457, 9148, 5991, -5896, -4270, 7136, 6638, -3512, -3723, 7217, 8640, -2325, -5072, 6264, 10758, 255, -5587, 4258, 10334, 2088, -4146, 4062, 11860, 3997, -4625, 1419, 11394, 6801, -3020, 296, 9964, 7670, -1969, 193, 10686, 9598, -1467, -1983, 9147, 11549, 1559, -1526, 7478, 11055, 2901, -1672, 6943, 12195, 4013, -2874, 4487, 12721, 6926, -1492, 3434, 11377, 7005, -1562, 2489, 11074, 8440, -894, 171, 9955, 10204, 938, -476, 8362, 10154, 1286, -1217, 7540, 10619, 2479, -2339, 5577, 10748, 4169, -2063, 3231, 9502, 4348, -1943, 2943, 10032, 5450, -2358, -102, 8506, 6906, -1311, -533, 6944, 6579, -741, -881, 6659, 7365, -299, -2882, 4814, 8072, 1420, -2659, 3406, 7830, 1876, -2656]
1197b656N104N013n358n922M029O601k774o138J783N626j869o568J697O809r76
1212D401p265l17P096J408o201j864N165J546n737k120N699L288n429m018M333
1227a5M396l824m786L320M148l273m634L048N276k565n343P10N371n84n137K96
1243c596M565j20n307j32N517O86n894j555M247K051l795k187L610K029l874l128
1259f883L469L692l156m464K390L767k218l511K184L306k064m118J118M402q81
1274b967m152J6L942M06l753m72L730M91m409j001M308J386l173j799K868J575
1290c004k859j276K460J849k553k852K718L447k207l227J849K670j657k741J806
1305e577L339j472l289Q46L840j05l272l11L016L81l026k6L633Q19l607j163L966
$$ y = [-2656, 2448, 7461, 2103, -3819, 210, 6811, 4037, -2101, -318, 5308, 3439, -3129, -1432, 5377, 4401, -2864, -3181, 3915, 5323, -878, -2742, 2423, 3969, -1768, -3888, 1811, 5099, -330, -4348, -15, 4381, 557, -4229, -909, 3239, -34, -4668, -1620, 3656, 1091, -4252, -3542, 1829, 1245, -3892, -3596, 969, 849, -4458, -4590, 927, 1613, -4281, -5836, -1589, 462, -3333, -5520, -1910, 119, -3755, -6883, -3414, 278, -2878, -7342, -4952, -1185, -3403, -6914, -4730, -1424, -3488, -7606, -6488, -2086, -2967, -7119, -7103, -3161, -2755, -6508, -6980, -3250, -2759, -7168, -8169, -3861, -2475, -5648, -7447, -4579, -3004, -5863, -7139, -4679, -2830, -5383, -8235, -5517, -2070, -4277, -7504, -5655, -2985, -4642, -7383, -5577, -2238, -3710, -6999, -6153, -2313, -2418, -5690, -6001, -2985, -2604, -5630, -5656, -2023, -1204, -4811, -5974, -2008]
1322b008J060l041j347K797J437k141j434L211K217l039k947K720L355j456l563
1337d179K003L461j760k863J832L968j617m129N12M611J5l284r9L529J84l796
1353a612k89M827P87m314j405L553K651l497j617K964K233l680k431L618L469
1368E257k818l779K258M132j757l769K107L740k064m356J742N009k41n195n12
1383b46M959J088m481j031N024O18m646j715N518K370m316l282L528L322l100
1398C610l233L060L765l327m214K805N343k722n369J681N337j022m873M88N383
1413F712n3n572p47N658J492n763k058N207K566m540k678M543L024m967l948M672
1429C548M576l653m983K673N090k158n204J646N654j630o407Q58O791J75o671
$$ y = [-2008, -948, -3989, -5336, -2539, -1102, -3243, -4677, -1466, 751, -2288, -5235, -2515, 840, -616, -4179, -2176, 1285, -475, -3338, -1506, 2462, 845, -3284, -2772, 1839, 1854, -1430, -1529, 2000, 2184, -1612, -1901, 2926, 3713, -601, -2006, 1547, 4198, 701, -916, 2048, 4281, 601, -1830, 1788, 5257, 2439, -1340, 918, 5050, 3293, -476, 1631, 5371, 3307, -1049, 693, 5702, 5461, 266, -246, 4713, 5801, 1320, 289, 5313, 5931, 1285, -430, 5088, 7458, 3142, -140, 3388, 6710, 3610, 377, 3437, 7202, 3875, -339, 2466, 7809, 5087, -282, 1399, 6736, 5714, 841, 1329, 6712, 6659, 1087, 340, 5998, 7490, 1727, -331, 4876, 7442, 2902, 224, 4767, 7791, 2824, -1124, 3548, 8124, 4471, -512, 2161, 7251, 5093, -111, 1535, 7189, 5559, -848, 10, 6801, 6976, 305]
1444C05o33N574J423n738j977N714K354n504l651N393M339m628m930M117M736
1459F894m025n292L655N514l028o308K376O279j368o404j46O143L3o275K14O372
1475D634J005o961k254O631K561n874l404N204L671n056m340M705N174m451o347
1490e102L527O252k609o501K021O395k000o460J320O728n59p104j333P048K100
1505C723o373k695O021K432o101l521O091M435n884n471M690N700l593n671K536
1520c681N702k946o419K487O561j062p599L77P025L58o777j315O725Q91o194k547
1536h414O852L173o353m194N376M667m798m980M177N075m185n776L820O528k696
1551a728p195J564O708l42o557j60O630M85p025r75P102K153o943k999O445L336
$$ y = [305, -328, 5246, 6669, 931, -1046, 4668, 7022, 1518, -2133, 3260, 7599, 2971, -1959, 2158, 6894, 2869, -2423, 1232, 6746, 3718, -2590, -214, 6065, 4697, -1707, -1853, 4290, 4323, -1952, -1738, 4634, 5639, -1322, -3576, 3055, 5616, -258, -3662, 1542, 5213, 157, -4183, 522, 5696, 1245, -5102, -1575, 4677, 2068, -4433, -2412, 3983, 1983, -4477, -3157, 3571, 3012, -4092, -5425, 1623, 3723, -2650, -5345, 676, 3108, -2993, -6514, -423, 4012, -1872, -7343, -2653, 3047, -546, -6217, -3681, 2021, -925, -7344, -4857, 1704, 642, -6957, -6580, 445, 803, -5974, -7289, -564, 327, -5867, -8414, -1562, 1611, -4742, -8936, -3560, 1107, -3691, -8671, -4494, 581, -3604, -9380, -5560, 968, -1728, -8923, -7359, -651, -993, -7550, -7710, -1080, -595, -7620, -8595, -1493, 660, -6283, -9282, -2837, 499]
1567D99n234l784N121M173m646m980M625N457l140o018K203O795j918o126J492
1582e481O187r83o396P54O669R88o795j750O503K392n394k750N403L155n387l524
1598f409N173N016m207n503L596N480k641n044J999N742j585n729J115O777l29
1613C451o469m63O224J046n704j289N984J857n344k851N631L184m349m526M570
1628I52M388l443m696L332N159l135m876K244N639j329n681L59N476K92n067n05
1644h91N482R25n705j952N816K557m778k778M314K993m128l428M007M101l515
1659C020m379K477N115k252m508J604M462j219m782J209M723k56m886m91M828
1674D665J237m259j760L742K148m097j683L508K854l578l619L568L354k429l811
$$ y = [499, -4735, -8519, -3398, 775, -3871, -8851, -4226, 1231, -1909, -7927, -5724, 1071, -847, -6973, -5481, 706, -277, -6673, -5919, 750, 1738, -5057, -6807, -304, 2088, -3306, -6056, -653, 2502, -2885, -6409, -1236, 3780, -427, -5930, -2334, 3146, 505, -4539, -2540, 3202, 1617, -4112, -2997, 3780, 3451, -3018, -3481, 2743, 3789, -1915, -3204, 2780, 4637, -707, -3558, 2073, 5257, 908, -3618, 952, 5340, 1897, -2799, 533, 5692, 2557, -2319, -75, 5564, 4235, -1446, -1087, 4389, 4681, -386, -891, 4591, 5516, -189, -2141, 3675, 6232, 1454, -1324, 2990, 5983, 1855, -1573, 2434, 6535, 3020, -1359, 1118, 6233, 3981, -527, 1077, 5539, 4320, -462, 747, 5470, 5214, 328, -163, 4665, 5902, 1643, -117, 3625, 5773, 1676, -7, 3501, 6355, 2777, -842, 2726, 6080, 3651, -160]
1689a60K107L586j849l443J230M371r41m674J24M367O75m354n73M071N83l759
1705A361j186L699J475l488k333L062K599k565k885K363K591k287k552K231L027
1720E112j994l841J345L675o31l537N95K693l66l006n05L576N54l467j110K893
1736A986J549k774j478K534J236k666j708K274K261j769k945J251K818j358k325
1751a114N12K184j169j980Q85K863q12l215L8K235O77k347n48K249J92k346n83
1768b279K403J012k413j757J758J705j866j015J104J591j524j895J393J595q01
1783i89k320O69J765n03j911N73J508m42k251O09K089j04k031O1J302R9j492l61
1801c729J546L18j667q67J770Q34j508o02J032P55j276p27J110R24j234j007Q31
$$ y = [-160, 1947, 5533, 3684, 241, 1471, 5842, 4901, 227, 351, 4718, 5393, 1039, 466, 4537, 5120, 1361, 175, 3874, 5349, 1861, -472, 2590, 5189, 2624, -261, 2102, 4693, 2406, -146, 2085, 5112, 3118, -723, 622, 4297, 3666, 129, 724, 3417, 3051, 45, -460, 3116, 3670, 203, -907, 1986, 3535, 761, -717, 1817, 3053, 387, -1321, 953, 3214, 1445, -1500, -249, 2569, 1211, -1114, -602, 1582, 413, -1567, -682, 2181, 1369, -1846, -1808, 427, 1104, -1243, -1791, 458, 650, -1696, -2279, 124, 1136, -1277, -3034, -1276, 429, -1437, -2452, -1348, 243, -1281, -3176, -1783, -188, -989, -3309, -2640, -875, -1378, -3289, -2716, -1208, -1650, -3901, -3292, -1203, -1307, -3338, -3277, -1975, -1876, -3368, -3729, -2183, -1865, -3532, -4399, -2629, -1795, -3303, -3905, -2873, -2118, -3394, -4121, -3011, -2087, -3321, -4328, -3497]
1818c497J453l13j622L59J039l19j539J057J173l93j594L68J578J66j678J54J129
1835b479M5j470J53J753L94j744n94J501J033j308q20J369R13j347n13J230J022
1852h62j261j553J379J616o37j437J070J148l29j373O39K144q11j690j70K113
1868a4K75j647L85J563r9j503o17K288N14j555j257K206J028j670o96J375J410
1885A986k028j122J790J611j076k017J171J868k17k202O50K515j171k359Q02K605
1901B806L7k460n30K343O57k391l29K022J066k396j463K565J692j982j959J636
1917A314J853j555j609J607J901j390k352J044K826m57l063J34L419o07k617J84
1933F32K791Q4k854m43K873Q44k702j323K277J845k377j457K244K029k436k515
$$ y = [-3497, -2044, -2357, -3979, -3620, -2581, -2900, -4439, -3382, -2209, -2602, -4196, -3828, -2250, -2084, -3762, -3608, -2479, -2434, -3904, -3751, -1998, -1604, -3348, -3942, -2441, -1408, -2716, -3536, -2167, -1254, -2601, -3114, -1884, -862, -2123, -3676, -2297, -681, -1318, -2755, -1685, -537, -866, -2239, -1600, 544, -267, -1957, -2127, -14, 261, -1386, -1001, 562, 463, -1040, -1657, 631, 1145, -410, -1667, 539, 1567, -103, -799, 576, 1986, -42, -1164, 626, 2237, 1161, -856, 315, 2183, 1966, -236, 414, 2929, 1758, -601, 201, 2806, 2843, 383, -147, 2196, 2853, 462, 133, 2155, 3221, 825, -638, 1927, 3619, 1637, -322, 1314, 3167, 1612, 3, 1610, 3511, 2121, -231, 813, 3639, 3182, 119, 253, 3672, 3065, 448, 632, 3423, 3507, 653, 210, 3083, 3927, 1225, -98, 2179, 4024, 1647, 190, 2434, 4463, 2027, -488]
1949d88J905L277j791k812J261K742p80l082J029K741k62l451j0L718J87l334
1965H50n57L117N56k792j107K917J334k945k005K891K725k570k565J649K606j610
1981B494k794J340L176j296l168M97L690l56l565m30L709q1l277l71L235J210
1997D013l625j484K880K022l070k013K231K353k450k326J940K809j663l476J082
2012g77L347r46l330O66L074j6l750RL417M77l840r36L114J496l069j794K586
2029b72K425k866k847K728L117k772l048J826L367j643l584J331L041r07m012
2044d116J196L488n5l585o29L558P21l027j488L212J082l263j640K929K619l214
2060b212k561K551K705j930l247J582L255j428l342R69L649n83m070O36L039J54
$$ y = [-488, 1417, 4694, 2903, 91, 1352, 4094, 3314, 232, 1261, 4002, 3740, 289, 279, 3997, 4184, 850, 293, 3410, 3966, 1174, 67, 2984, 4318, 1373, -632, 2259, 4984, 2414, -151, 1498, 4104, 2494, -300, 1040, 4216, 2920, -248, 249, 3939, 3583, 18, -412, 3297, 3216, -61, -432, 2803, 4013, 388, -1096, 1784, 3806, 736, -1277, 954, 3307, 857, -1469, 471, 3280, 1617, -1859, -777, 2570, 1624, -1706, -1040, 2034, 2018, -1732, -1723, 1694, 2171, -1669, -2605, 509, 2005, -1064, -2858, -272, 2153, -713, -3560, -832, 2285, -487, -3535, -1709, 1658, 15, -3569, -2238, 803, -104, -4116, -2920, 568, 513, -3072, -3701, -143, 578, -2449, -3937, -725, 357, -2906, -4546, -1617, 1002, -2212, -4773, -2222, 483, -1447, -4694, -3112, 143, -1285, -4627, -3658, -9, -592, -4662, -4026, -987, -833]
2076h33k692p12L428L95l371j068L398J735l024k550L068K291k821j866K218K775
2092C71k710k257J292L380r01l902J048L465l42l247K38L210j4l285l73L804Q01
2109E78l125j740L253J571k442j600K541J844k604j945J953K878j678k941J362
2124b095K987p77k877P44L154m24k963KL457M62l255r11L177J056k930j148L211
2141H70J354k750j792K568K506j947k744J290K962j245k418J168K489r11k767
2156a367P33K996j72k703m34K739O37k250p82K462J239l078j241K804J513j705
2172A391k070J803J727j409k057J522K243j337k330R16K579o38k542K56K565l03
2188B316k093Q5K416J93k294o46J998J347k249j522K639Q24j684j636K167J619
$$ y = [-833, -3525, -4237, -809, -414, -3785, -4853, -1455, 280, -2744, -5294, -2226, 65, -2756, -4622, -2404, 371, -2339, -4596, -3304, 76, -825, -4727, -3679, -214, -556, -3803, -3565, -355, -369, -3654, -4027, -223, 578, -2547, -4287, -1034, 537, -1905, -3505, -964, 880, -1724, -3669, -1716, 1162, -516, -3457, -2095, 892, 115, -2762, -2018, 1136, 712, -2251, -2249, 1208, 1670, -1585, -2496, 681, 1737, -1193, -2341, 870, 2224, -526, -2318, 250, 2756, 809, -1935, -645, 2317, 1072, -1346, -178, 2311, 1400, -1367, -634, 2362, 2190, -513, -947, 1792, 2429, 179, -603, 1859, 3098, 20, -1221, 1583, 3096, 1391, -679, 1124, 2851, 1442, -615, 907, 3150, 1813, -517, 399, 2978, 2340, -202, 54, 2619, 2316, 223, 308, 2724, 2917, 623, -23, 1975, 3322, 1073, -449, 2190, 3014, 1330, -306, 1861, 3480]
2204C480j459k479J403K179j115j895R25J979q98j806L54K201l62j860n78K338
2220B407M53j737o87J864N18j824p01J965R08j837j119J139J437r01j212P44J527
2237B944q32j852R35J774o16j849m1J986k76j306k8J355O1j669l0J515O89j743
2255A017p02J170J252j462j184J328Q37j521j051J547R17o80j664N94J100l30
2271A168j302M67P91j43j495L71J604l5j712n81J503J17j206J7Q71K62j346k81
2289i30P99J158j388j147P21Q16m01j242P77J033j305n06O13Q70l70j257L75O56
2307g28k06n15N7O61N4j294j76J341j90q69j16Q59J7l74m19P73M5p20n99Q36Q35
2328g28q70q47Q23J35k65n71M73N11k02p04K79Q73l59q46kJ185n58q06O84O14
$$ y = [3480, 2021, -458, 945, 3124, 2009, 114, 1039, 3018, 2120, 314, 668, 2869, 2507, 647, 69, 2407, 2860, 1123, 436, 2300, 2818, 994, 293, 2258, 3166, 1329, 210, 1349, 2786, 1885, 673, 1417, 2944, 2112, 260, 1195, 2969, 2353, 504, 463, 2449, 2173, 867, 839, 2194, 2255, 586, 556, 2071, 2760, 1017, 315, 1485, 2737, 1275, 91, 1419, 2256, 735, -316, 1231, 2148, 1468, -196, 398, 1498, 1168, -134, 333, 1124, 981, -514, -143, 1461, 1426, -286, -867, 636, 753, -453, -436, 435, 697, -649, -930, -131, 1027, -361, -1508, -787, 29, -372, -1614, -837, 196, -1109, -1615, -1002, -132, -502, -1759, -1384, -728, -934, -1449, -1392, -731, -677, -1971, -2147, -806, -996, -1865, -1981, -1122, -1105, -1479, -1898, -1125, -1080, -1800, -2399, -1563, -728, -1598, -2445, -1622, -1487, -1752, -2323, -1850, -1339, -1541, -2245, -1966, -1093, -1452, -2298, -2300, -1115, -1673, -2479, -1795, -1181]
2348a181k9q53n6R27k61p22j60P38L53q38j62Q83M09p18p03Q32P63p18o70Q87
2368a279N62p14n31R30N34n91j082P59P51j34q29M22P50o59o30L74R24J74j298
2387a567kJ363Q5q28j28Q12K85p65l29O85Q44j158k99M10J050o59o19P71M28m11
2407c2j063P24J350o95q41R7J294p6r05m35J600l40j144k68J926K97j169n86J042
2426G76N13j140l34J066N21j115o52J081J018n41j312M10J324p50q68P14J061
2443A772m71j312L18J312K05j494k70J169M53j181m76J661K95j368q89J447R13
2460B084r74j071R74J058r54j104J110J065p08j501O57J459k62j272k43J769j33
2477A954j597J74J560J40j685l10J273Q79j329r84J005J122j005q16J268P71j217
$$ y = [-1181, -1210, -2063, -2119, -1192, -1453, -2175, -2335, -1597, -1244, -2082, -2244, -1361, -952, -1670, -2373, -1541, -778, -1496, -2166, -1279, -717, -1431, -1962, -1032, -498, -1089, -2171, -1412, -661, -795, -1624, -1202, -452, -1111, -1741, -1367, -443, -269, -1567, -1569, -206, -121, -949, -1077, -265, 20, -745, -1074, -389, 455, -703, -1002, -592, 458, -201, -820, -49, 379, -32, -1095, -371, 979, 284, -557, -460, 834, 758, -147, -582, 1018, 678, -466, -734, 1192, 1489, 320, -266, 776, 1289, 149, -185, 881, 1402, 287, -365, 716, 1734, 1193, -119, 291, 1615, 865, -3, 711, 1772, 1301, -11, 307, 1619, 1824, 330, 60, 1229, 1682, 501, 25, 1686, 1981, 613, -276, 1171, 2084, 1110, 39, 1013, 2071, 1117, 13, 1123, 2188, 1480, -21, 636, 2095, 1833, 561, 318, 2087, 1954, 357, 531, 2091, 2231, 546, 236, 1509, 2388, 1059, 75, 1080, 2202, 1197, 381, 1649, 2420, 1203]
2494A203j336J368J406n81j770P06J142l05j420L53J713j76j820l30J997K82j848
2511E84n30J434N49j172p13J257J136j492j305J080J505q46j478M86J445r08j376
2528c44J152J332r67j474k64J952K2j535k35J393N50j762n41J882M42j719q95
2545a011J503P68q37j415J062Q11q37j611J097J496m85k027L14J980n92j338j7
2562a139J240K84j877l87K034M32j954p03J715N10j194r08J057R89j135j350J229
2579a157J671j363j297M96J140kj928P17J448l48j360j59J856L12k064n63J826
2596g75M48j591n19J574N60j313p06J093J149r84j498P61J529n78j437N76J612
2613i9o79j444L24J723o51j128l25J686K42j310n87J550P44j807l19J337Q23j498
$$ y = [1203, -133, 1235, 2641, 2060, 290, 996, 2138, 1833, 413, 766, 2479, 2303, 483, 153, 2150, 2432, 584, 54, 1488, 2037, 865, 152, 1409, 2545, 1053, -252, 828, 2333, 1487, 9, 495, 1940, 1032, -344, 808, 2140, 1173, -301, -565, 1387, 1409, -126, -361, 1032, 1582, -180, -721, 1161, 1603, -116, -1011, 492, 1260, 423, -992, 70, 881, 44, -1567, -470, 1026, 541, -1486, -1172, 808, 216, -1122, -1139, 101, 385, -1492, -1879, 155, 587, -1367, -2070, -355, 155, -1039, -1947, -890, 99, -1036, -2386, -1157, 514, -849, -2146, -1650, -510, -512, -2440, -1723, -275, -623, -1983, -2142, -286, 26, -2038, -2601, -775, -327, -1918, -2437, -863, -303, -1616, -2322, -1229, -80, -1064, -2562, -1801, -272, -850, -2287, -1711, -99, -778, -2222, -1898, -175, -826, -1954, -2279, -593, -351, -1661, -2248, -698, 46, -1761, -2080, -743, 80, -1418]
2631a418j044J090J392q24j234J093R69n33j264R0K003m38j470J68R97N34j572
2648a461J67J252m7j189l61J555O72j247q02J003Q17o67j037J189P88j014j121
2665a503R99J200o34j077L64J064j1j224K62J555m26j210j93J260L90j055l78
2682f17J048L18o81o73J122O35p32q82M73J082m83q31K85J292o34q44K58J086
2700A222n15o54l1R04N40j393k04R11N43r87l60J070L87j044k59M27R04p21q27
2719h7O40N03l01o93Q42N63m4q62j02J178j83q61k92J086j95q43J47P93K63j113
2739D39lN73O04p24k03K34P52n95n75M31P26l63q41J87R46k65o80L87M13m11n49
2760D83L81N51j96m81J4M64N23q15k51L11K40q87K52J99M98l65k44L91K11l8q03
$$ y = [-1418, -2462, -1372, 20, -804, -2038, -945, 24, -509, -1773, -1683, 320, -118, -1588, -1420, -423, 111, -1461, -1294, -42, -89, -1278, -1639, -84, 588, -659, -1461, -458, 359, -308, -1345, -156, 632, -382, -1503, -504, 696, 62, -1015, -651, 413, 402, -822, -560, 995, 569, -641, -834, 426, 816, -239, -617, 431, 749, 68, -605, 517, 1152, 420, -462, 11, 1093, 610, -221, 64, 1356, 722, -122, 136, 1222, 707, 53, 22, 926, 1466, 73, -131, 780, 1323, 336, -24, 1046, 1433, 389, 130, 557, 1461, 740, -87, 553, 1056, 755, 62, 904, 1467, 1423, 561, 459, 1637, 1454, 593, 301, 1387, 1192, 349, 496, 1289, 1552, 439, 436, 1009, 1613, 889, 686, 920, 1672, 1077, 502, 933, 1659, 1296, 455, 642, 1588, 1323, 643, 1030, 1443, 1032, 483, 864, 1415, 1219, 738, 752, 1216, 1739, 924, 673, 984, 1224, 337, 589, 788, 1286, 921, 677, 1068, 1279, 1241, 438]
2781D38L73J44P7r12N26O49k67o60R8M90K3k21l55N81l73j70j12L29l6p0l86N54
2803G20j39j35m6o4K7k16l0K92j45L3l59L8o8n8k39J61K97l23j85k12P03k27k81
2826d56MJ14n8j22k10O46j11q53rO45l40J45j05J79k96l96L97K45l42K32l72K86
2848g77J63k73j31J77o4l04L08kP1k17k73K04M90m04r4L21J00m04j23R4N63j28
2870g03n49O8L05L13l41k71M58l2j65l15P25k94n43K67J81J36k80j87L15J43k66
2891a035j2L09L93m88n21L83N48j33m13J76O17p28o9L23N50l11p11l8R37N3n97
2912g67l4M71M38r78M7N97L32n27n79O79L99k17n48J43P19n86k86K00O20l24m60
2933f61L62o7N26o57k12Q83J2o03k79J027Q7o73l79N83L74o36l19N95N28m87k96
$$ y = [438, 811, 955, 1032, 120, 646, 1295, 1028, 368, 466, 956, 979, 758, 403, 984, 611, 441, 329, 658, 622, 552, 166, 720, 581, 446, 400, 336, 363, 147, 117, 409, 264, 297, -62, -24, -92, -150, -389, -228, 69, -254, -439, -651, 52, -175, -456, -452, -338, -396, -518, -728, -82, -193, -1046, -1055, -410, -750, -605, -710, -531, -827, -1223, -826, -581, -923, -691, -1063, -777, -614, -887, -1018, -841, -905, -1209, -901, -903, -832, -1049, -1322, -1118, -628, -1032, -1126, -805, -705, -1109, -1232, -1138, -575, -703, -1252, -1184, -879, -566, -907, -1178, -720, -752, -917, -1232, -507, -801, -1344, -1077, -896, -760, -1040, -1227, -912, -769, -1035, -1047, -738, -345, -833, -1354, -971, -423, -556, -969, -793, -176, -904, -973, -650, -100, -411, -1122, -1160, -223, -170, -767, -801, -330, 108, -870, -823, -226, 106, -421, -1000, -321, 78, -139, -687, -544, 175, -411, -697, -497, 123, -201, -661, -299, -366, 160, -497, -709, 174, 186, -417, -696, 331, 418, -255, -634, -51, 323, -313, -632, -37, 491, 4, -292]
2954b92M5P43J41q40J93N29P0p76K12O90k10p68Q5Q59qn69k54R15p8m62n86P75
2976D14K80m57m39N26Q57p72p07O89N91k36q50P26P39n61n81K1Q13k23n28m7P60
2997A015Q8p11j38P09K10p14l66Q25N46m97r34P69M56o03o53O31O05j55r17L04
3017D70Q85j56q73J54M26L00o42l14J056J06q62o78R11P03j015l59O97P80p62
3036H27r70P89N09k30p63L87Q25l75p77K70P26k30r12J19R56j85p42o00J183N93
3056A400q74l91P15K27o14m17L81O74m02j362P66P58k38j061N91P73k62r83J29
3075a90J049l21r12K99M47J42p96l05Q99J70q41j81O22M62o12q85N04R42q43j51
3095e01o2O52l38r35O00O26Oj007p3P95M6o94j0R69J32j214J78M68J86l56p88
$$ y = [-292, -247, 496, 637, -203, -10, 519, 589, -187, 25, 715, 505, -263, -178, 681, 673, 104, -150, 765, 687, 225, -361, 414, 694, 237, -202, 324, 1181, 409, -298, 391, 982, 746, -104, 622, 1361, 800, 219, 240, 1053, 830, 302, 255, 1015, 1103, 392, 254, 963, 1173, 459, 93, 918, 1464, 967, 33, 802, 1258, 655, 2, 633, 1238, 1083, 166, 470, 1355, 1199, 326, 480, 906, 1206, 564, 250, 1306, 1412, 550, -128, 783, 1486, 471, 112, 809, 1589, 827, -143, 646, 1155, 925, 162, 549, 1374, 999, 222, 492, 1218, 988, 76, 195, 1151, 966, 224, -376, 807, 1400, 526, 135, 850, 1077, 463, 46, 427, 1101, 699, -663, 103, 861, 623, -438, 153, 926, 664, -319, -190, 859, 538, -374, -75, 372, 514, -282, -587, 312, 482, -359, -540, 82, 544, -68, -953, -449, 493, -350, -501, -563, 89, -249, -1184, -584, 42, 48, -959, -1032, -237, -191, -885, -895, 74, 206, -1008, -830, -362, -176, -532, -1320]
3116a320P11N45n28n15M65K29j15m94L52L47j80p14M0P58K58j168N37N63k05o76
3136a110o8O48K93q01n19P90M89o65p8L08K12k3p75N24N75m73l21M06N68l34o27
3157i81K23N41j04q03M05N46K13q38l4O94K18q85j85O73L86o07k76M05L61k43
3177b91m80L00L89j46l48K62K50J08o29j92J061n14l22L4M47k93J6r0L54K78p03
3198e09k71N94M25m10l09N88J0k74l54J42M91j78l11j4P73m49m48K39J25K70j43
3219a3r1N40j28n95K1N86j12l92k97L14N00p1m43M11M26n39l92M16L69Q2m46k1
3241A25L26r5P2k37L43R3k51j95L47j5k93J11K33k08M1K5L49J00l72l98L45K09
3263F55K2k78j00K17n2K51j78L24j52m05l9M71M3l87L11K00n43j3Q4J82M37o50
$$ y = [-1320, -609, -64, -592, -1107, -642, -413, -528, -1022, -670, -323, -503, -1217, -1177, -419, -161, -1329, -792, -229, -434, -1110, -1178, -530, -237, -1038, -1557, -767, -278, -943, -1021, -713, -501, -524, -1299, -775, -200, -673, -994, -588, -20, -354, -981, -758, -217, -321, -1124, -719, -173, 40, -798, -832, -138, 80, -805, -990, -317, 69, -538, -814, -409, -48, -291, -771, -471, -82, -228, -576, -314, -64, 44, -585, -777, 284, -230, -552, -518, -71, -364, -348, -438, -84, 194, -509, -780, -186, 239, -171, -480, 108, 118, -156, -510, -368, 123, -55, -366, -380, 393, -56, -504, -265, -140, 130, -13, -104, 436, 308, -287, -266, 320, 208, -184, -481, -167, 333, 262, -181, 230, 656, 117, -275, 141, 510, 592, 146, 125, 451, 356, 428, 191, 534, 627, 376, 181, 528, 513, 220, 331, 564, 356, 397, 422, 771, 871, 499, 101, 446, 655, 677, 399, 299, 516, 464, 715, 537, 861, 709, 304, 265, 736, 779, 392, 703, 903, 360, 347, 431, 613, 1050, 400]
3285D00p1K42N66n97N3J82J20l35j96L68J27j80o8k01J99M3n3j25k3j10j88N61
3307G14l3k25L3l5l2O9l12K41qJN5k12K91k14l7q1K28r5k43K28J65l52Q3k6j97
3332FJ63k10KJ27k78K91j53l5L69j92q3q2J94l3q8l0J13j42J0R8l04K32J35l70
3356b60J49K1nj81K73l57j80L96J79m2m89J91K81j29j78k05O20o58K34k98J81
3377d57o8N3j69J45L90j95k79q8J64J2l43K50K23J23l23l64O53k88M5QK76J13
3399a19q23O20j78J73r4k10K53J29l48J71N5K8j98k65K24K71N8k48J2J95l8p8
3421d10R9K3J23o53N92J0J65m35m7N04K1n91N6K56m9k32l60M93M81m00n60N83
3443c31L18l97K03k1J83l91l84N40oM60q22J91O44l12j57k30M09K91n32j38O56
$$ y = [400, 329, 571, 1137, 540, 593, 775, 895, 560, 364, 732, 859, 679, 611, 410, 609, 652, 599, 474, 451, 341, 153, 714, 681, 456, 489, 454, 422, 491, 179, 420, 412, 413, 468, 256, 547, 333, 296, 215, 443, 348, 105, 333, 498, 146, 229, 203, 6, 169, -41, -39, 88, -190, 101, -52, -87, 282, 90, 7, -75, 119, 86, -2, -32, 81, -61, -51, 47, -257, -25, 110, -260, -111, -90, -95, -276, -3, -360, -540, -144, 35, -7, -496, -305, -24, -153, -331, -536, 84, -574, -340, -638, -457, -525, -472, -641, -496, -106, -301, -580, -668, -504, -492, -835, -585, -362, -239, -562, -926, -273, -561, -516, -508, -232, -119, -942, -322, -500, -327, -421, -631, -378, -249, -597, -426, -371, -343, -541, -806, -582, -311, -253, -501, -489, -294, -332, -410, -311, -288, -165, -818, -226, -216, -51, -486, -533, -29, -8, -599, -543, -287, -336, -568, -928, -435, 46, -354, -914, -331, -13, -410, -207, -228, -45, -436, -820, -280, -286, 174, -648, -457, 187, -125, -282, -512, -103, 188, -344, -482, 174]
3464A74q2m47q2K74L61l94l8M69J57m93k30J44J89j50j27J16J42K31m85k9N24
3485B24k43k89K38K81L5l01l63N64L32l53k32L40K83l71k04J73K67o8n39K77O29
3506F80l35l13o8L55J77o31J81L91J52m97K73q3M61p46J41L14J97m71J52K15J57
3527G02k45l98L68J44P2o65N57M38m74l70M80rO9m71N7N00l20j94n4L79K40n74
3549B32j77N43J84n17j24j1M74l71p2K89L22l97j88J44P13o58m35L47L13l42j40
3570A29o8N75L02q81j0K90L64l97q6L43rr5m57L74JJ6m76J67L49J28k49m02M98
3593D06j78l86R4N81j73k90k99L53K59m18L4J10L52o38l9L97L14k79l22n6J28
3614e0j34j40K26m4P8m70M61K36k46m39Q8J70Q5o6l76O68l6l73J06K0Q5o2k01
$$ y = [174, 92, -355, -437, -163, 198, -196, -234, 235, 392, -101, -331, -187, 2, -148, -275, -159, -17, 214, -271, -300, 224, -19, -308, -70, 211, 246, -55, -418, 146, 478, 125, -107, 233, 516, 145, -59, 114, 381, 313, -226, 51, 680, 345, 32, -36, 319, 496, -135, 46, 437, 589, 92, 365, 282, 743, -3, 138, 452, 649, 178, 330, 545, 702, 457, 59, 427, 571, 643, -22, 535, 973, 499, 129, 609, 600, 669, 198, 255, 755, 435, 241, 187, 566, 806, 232, 55, 598, 782, 265, 141, 130, 604, 233, 161, 450, 772, 375, 187, 331, 1044, 386, -49, 298, 611, 269, 129, 61, 636, 938, 57, 47, 337, 701, 304, 218, 561, 552, 457, 0, 374, 375, 391, -85, 82, 431, 559, 310, -92, 406, 228, -158, -64, 517, 344, 54, -245, 108, 367, -51, -17, 93, 445, -193, -232, 165, 479, 200, -122, -178, -50, -184, -324, -98, -142, -64, -534, -73, 163, -83, -522, -434, -264, -179, -245, -621, 47, 11, -362, -256, -236, -151, -213, -414]
3637d14L3L6L7j26K75P4k56j48L2N83K27r65P1M70j68k80p4O11J45o02j10N1L51
3660a47l49L48j00m1J15l36K16K89k35m52J30K03p5N1O8k7J21k57O0K64m2m91
3682f87K08K55J92m46Q0J29K35l60l34P63O3n75l6N3P53n12k11p3L72k66j03K21
3704b79K49o7o6l8j56O16l97k2K38j25k32K18l2j9k40q6J15L36j55m62L63J12
3726a29J00k61L36Q9k32k58K29M29l67j5l42J87K4N8K7M03j92l35p8K88P0J6k2
3749B5j3L3q9j0r3M16j85R8p1K54l42q0j68K67R4m26J67M40N6l87q8L15Q2k09
3773H6J01p1K12K12l31L1L22m95L0N2J8J20j22J35m5N8j07l1K22j48pj09L93n
3797E21j10o2O3J22k30l5J18m2k7J93j45k3k18J03R5K8J5k5L16k18n20M12m6J05
$$ y = [-414, -381, -345, -308, -434, -159, -85, -341, -489, -457, 126, 353, -612, -541, -71, -239, -519, -593, 18, 163, -439, -549, -498, -147, -496, -148, -248, -289, -174, -510, -294, -5, -240, -692, -562, -359, -434, -383, -315, -342, -221, -478, -418, -154, -196, -687, -479, -224, -32, -478, -398, -269, -34, -394, -728, 35, 98, -477, -513, -460, 293, -219, -430, -503, -131, -397, -500, -279, -30, -97, -163, -201, -357, 259, -138, -160, 78, -47, -279, -61, -93, -112, -352, -438, -323, 13, -142, -604, -241, -129, -29, -290, 46, 135, -97, -355, -126, 303, -64, -79, -421, -234, -210, -152, -125, 278, 86, -249, -327, -39, 31, 47, 25, 12, 45, -44, -54, -147, 269, 84, 182, 111, 365, 23, -57, -225, 42, 136, -290, -123, 317, 373, -14, -102, 213, 295, 86, 187, 116, 328, 540, 209, 240, 562, 67, 97, 149, 167, 287, 165, 300, 255, 313, 206, 175, 397, 249, 242, 133, 526, 521, 411, 349, 412, 534, 304, 269, 387, 345, 318, 511, 366, 343, 125, 228, 323, 351, 366, 341, 657, 439, -81, 331, 285, 390]
3821C90Q7l28P4M3j36J98%n2K22L9l52K45p1k0P7k41j17m9R2J13j30J26j92R9
3845A17J92m3k98M59m6j87l51J83K32k4l65L87j50j92J41J47k12J80J76k83N1
3866A14J05j18j05n5l91L06K61j34k41K88l69M28L8k06j86P7k37K59Q6J94j95
3887h1Q5r5j19R6q7J28J82l67m2K23q7J15j34j71K07j5l12n2K05Q1K33k53J94
3910f6J14l54K73n19O34k73k0J30J1m0Q8l74M10p4l2l92K34o0j57J90J34l8m32
3933f13K01L6J93j10k3j02L98Q1k56J8K46o61K78O5j0K70n18J97J24M2r9j63M14
3956Hj68O4k32Q1K7j59j4K14R5n31L62k84N42k99m63N12L25p1j65m22N70j97l7
3979b42j27M21j55j00pK7O8k45J9J78Q9j53J30l6O6K77n12P5J58r5j29J43K54
$$ y = [390, 477, 149, 223, 266, 130, 328, 328, 276, 498, 537, 185, 430, 359, 339, 416, 175, 58, 9, 101, 214, 84, 210, 18, 117, 309, 266, -32, 427, 381, 194, -157, 26, 258, 234, -131, 256, 106, -86, 55, 202, -10, 170, 346, 63, 114, 219, 101, -4, -59, -450, -144, 117, -17, -258, 30, -339, 89, 127, -79, -265, -188, -425, -166, -80, 114, -81, 4, -91, -210, -114, -201, -73, 109, -258, -300, -77, -164, -49, -183, -354, -147, -162, -474, -526, -321, -240, -7, -260, -66, 48, -306, -33, -552, 82, -191, -211, -81, -70, -110, -22, -396, 14, -60, -92, -484, -250, -310, -467, -277, -143, -181, -613, -412, -376, -183, -293, -316, -418, -20, 61, -195, -177, 69, -592, -314, -249, -259, 11, -507, -310, -186, -144, -243, -406, 8, -160, -96, -328, -247, -220, -379, -393, -179, -84, -615, -253, -537, 5, -294, -757, -245, 80, 9, -156, -578, -8, -205, -242, -369, 52, -103, -203, -210, -183, -115, -360, -341, -163, -74, -227, -97, -133, -67, 210, -302, -227, -69, -164, -293, -150, 104]
4002A04k01o9R8L94j19k85j17q3M57l49o9K54J22j54k4J3J90Ro49L20N91k42l10
4025a19J66L21l60k51M83j10J69m57j2K43K37j72k83L67K1j78j6O0J52k02P8P3
4047B10K68k10j80j19K40k7L1J03J51l3l14J40J33J59m22K42N2k23q4K44J37j41
4069C57j56k6L65j01n6ro1RJ51l40O0L30k02l09p1O21q6m35J10J43PK3k77K09
4093B56L76l08K4p2m0j26q1J75K48j54j17J2M49m01k21l6J97M19n42p0M25k21
4115A92k08K29k6P8j96j18mK54J23l57k2K31j6l53N59J38n88K37oj33Q6po1K41
4139B73k8o06L75J6J34l68q4M27j99j37K4L36o1k73k1J86J82k78j31j27L09K28
4161A77q01M23m1j23P4J11K63k78k4K5%J04J2n5j32M51o06j14N16j07J42n36L84
$$ y = [104, -97, -166, -68, 326, 207, -78, -195, -278, 179, -170, -239, 15, 137, -17, -41, -28, 162, 171, -478, -158, 433, 191, -119, 47, 368, 8, -243, 240, 130, 299, -158, -170, 73, 310, 138, -145, 222, 243, 65, 49, 109, 261, 59, 137, 210, 478, 268, 88, -31, 209, 182, 213, 316, 467, 434, 120, 260, 393, 552, 130, 372, 424, 201, 117, 361, 498, 357, 201, 175, 540, 439, 383, 374, 313, 322, 473, 133, 193, 523, 321, 12, -59, 562, 476, 41, 151, 294, 301, 324, 47, 256, 632, 324, 348, 276, 236, 110, 29, 204, 452, 298, 181, 193, 642, 241, 20, -16, 181, 600, 58, -12, 413, 192, -16, 213, 187, 265, 69, -49, -53, 201, 324, -33, -55, 176, 160, -193, 366, 504, -84, 153, 147, 14, 100, 93, 32, 273, 245, -361, 14, 30, 164, -204, -288, 139, -60, -197, -173, 163, 102, -171, -192, -6, 176, -102, -233, -360, -51, 177, -624, -201, -242, -365, -291, -180, 83, -195, -219, -194, -194, -90, -78, -133, -265, 186, -420, -534, -18, -125, 17, -519, -135]
4184a35J05Ol90O2P05l76j16n8oJ07k44j1P4P2j47nL44q9k38J83j27k0k99K21
4208c82J85q2k37m0K32J07j50K5R3K25j5l87O3K44l28K3J44J2k6Q2KK64k43j1
4232b00qj11J38J17k34R2L18l22m2P6M3J6j05j11K32Q8p0j17M40n32pK19J99m01
4256b82K35l59K85o7j07J79j22M19k90j71Q1L15k67o2r9J34K50k52K61ol16K44
4278Cn8L34k92P2j68M17j36k41J97j91j4J87q3K10j57K7n3o5K59L9j26Kp5K18
4302C06m30K77K0o7K35k14J43m14M18R5k95m5J20n4k5L19l54O6pK15r0n9J10j4
4326B56o4K11j25p3j84K51K38m58N5J0P7pQ6j36J94j23p6l4M0k9j52L85k00j11
4350C1R5J55j92J12k29K40n7j85L52n0Q7Q6l06k4J30p4j55K61j08Q9r3j3J1L9
$$ y = [-135, -30, -24, -414, -352, 353, -23, -139, -197, -203, -96, -340, -351, -277, -205, -352, -357, -13, -102, -340, -157, -284, -304, -603, -382, -197, -279, -516, -556, -324, -217, -367, -342, -249, -24, -39, -426, -363, -119, -447, -424, -280, -268, -294, -212, -210, 54, -189, -200, -208, -319, -181, -64, -298, -206, 112, -210, -252, -176, -133, -117, -222, -333, -101, -13, -83, -200, 240, -292, -299, -80, 119, -282, -47, -406, -121, -188, -295, -116, -238, 181, -109, -280, -199, 116, -151, -213, -312, -178, 72, -180, 81, 75, -241, 3, -55, 279, -13, 59, -109, 308, 172, -69, 128, -63, -77, 110, 27, 237, 80, 107, 54, -11, 248, 287, 161, 163, 88, 306, -124, 153, 173, 106, 341, 127, 270, -144, 274, 369, 74, 29, 149, 95, 70, 389, 35, 101, 94, 309, 219, 160, 270, 256, 192, 403, 278, 205, 21, 272, 510, 52, 107, 117, 194, 187, 273, 137, 331, 208, 132, 98, 138, 109, -43, 342, 142, 31, 126, 281, 89, 201, -28, 212, 155, -30, 322, 272, 359, 445, 139, 115, 245, 171, 16, 277, 169, 258, 165, 152, 163, 202]
4374B02j14R3j8L3j12K43l96K03L8k7k54K94k55M1J09P9j6r9J50N7l26M9J35p1
4398C8j04M44m99p2O6O5M9j52J78k00J1l8%L69o1r8j06p5Q2m57M21q4P5k92M85
4423D5j19L5j09J27j23k6k18N00k89K02l5k35L0K63m19l6K26p3P2j71J66L26n50
4446d11L03j35J46j39r3K26K32k02N1r8K03j23o9j68j2J98k0J31j1j16k33M01
4468F1p0j37j92R0L1r3L09l58L62p9j21m8m9K89j16l08j36L61K6J21J10O2j98
4491h3l80K24K51o37L27K66l49M2n9l0J65j03J18l9O8K20j44j02j28K72N7l00
4513c44J66J25K1q6O4L3r0k26P9J73N8l2j57K75N2l46J3M91n9l65k19N65j69j78
4537a56J8m7J31p7m7J23J12q3K50m05J40j3J7ml4J53k66L45k41L26j79j7j87L75
$$ y = [202, 88, 181, 163, 196, 84, 327, -69, 134, 172, 145, -109, 185, -70, -29, 80, 159, 143, 44, 194, 251, -75, -26, 109, 38, -66, 378, -121, -193, -127, -62, -13, -165, 13, -187, -176, -214, -214, 155, 94, -4, -110, -185, -103, -560, -139, -223, -148, -440, 45, -74, -39, -148, -21, -144, -170, -388, 112, -177, 25, -10, -245, -215, 48, -371, -407, -181, -254, -182, -353, -187, 139, -411, -108, -243, -97, -236, -329, -103, 129, -73, -22, -120, 83, -40, -109, -277, -289, -91, -111, 20, 9, -107, -340, 61, -9, -146, -338, -248, -217, -310, -1, -359, 3, -76, -197, -245, -294, -5, -121, -429, -565, -204, -178, -57, 53, 115, -83, -463, -239, 12, -625, -298, -32, -381, -339, -398, -428, -263, -366, -248, -287, -219, 1, -143, -245, -373, -101, -44, -344, -178, -53, -32, -118, -54, -21, -111, -337, -258, -85, -27, -59, -216, 59, 111, -235, -222, 269, 210, -155, -374, 191, 22, -156, -138, -185, -54, -131, -178, -55, 57, -26, 224, -181, -41, -54, -37, -41, -75, 78, -188, 157, -84, 242, 63, 46, -141, 234]
4561B34k03pJ10J11l21J06M8K61k06LQJ17m0k23k52M94J66o20L43K05j22l7j23
4584E2P0K70j53k60M7J24L6j47o9P8L38k51P6R6k05j2J33K95k34L8j54R6K0k12
4608G2J08R7j87K0o7Q9K06j40r1M5J63K4m62J68J25J63j77k84N14k85j47Q5J26
4631A65J57j0J49l99K23l9k47j8M8J99j88J12R3j42m34K99J43j84p3J23L74k56
4653I5O4j33JJ26n7j40K71k69J24j70O1Q1p7k9Rl7J47q4j13L24J17o74L11L45
4677B93l78o7Q6kK4k29J90K97k54p1L50k16l0l1J5J31p2J00n23M16N6k24M2l6
4701a33K67l67R8l2R1j14O6j15L13j10k31P1M82n05L14j53k12K56k54Q3J28j40
4723a97j59K29p1l0j4J52m2J74j00k11K83j27J04j59q0J49N5m47L33j31K33q8
$$ y = [234, 31, 24, 134, 245, -76, 30, 78, 339, 133, 136, 144, 261, 221, -2, -254, 240, 406, -214, 129, 334, 212, 175, 52, 122, 392, 239, -21, 26, 150, 186, 39, -30, 48, 386, 135, 211, 307, 102, 90, 223, 518, 284, 322, 168, 264, 284, 72, 180, 277, 90, 110, 43, 132, 338, 198, 107, 152, 315, 339, -123, 45, 170, 333, 156, -128, 386, 101, -46, 39, 165, 322, 312, 461, 62, 285, 246, -1, -19, 29, 228, 40, 152, 245, 103, -331, -32, 111, -73, -146, -23, 351, 95, 159, 26, 27, 153, 96, -44, 227, -42, 82, -88, -27, 54, -23, -52, -43, -80, 67, -17, -130, 194, 311, -363, -52, 293, -85, -152, -66, -68, -44, -273, -83, 214, -40, -111, 239, 23, -7, -38, -23, 108, 36, 136, -387, 29, 85, -139, -97, -133, 134, -233, -135, -167, -76, -190, -124, -239, 74, -36, -267, -196, 286, -219, 95, -58, -270, -14, -268, -185, -57, -197, -356, -127, -198, -228, -242, -90, -132, 42, -58, -269, 14, -113, -9, -168, -248, -99, -44, -491, -158, -289, -56, -144]
4745a44N0mNl69K33J60J60j53j65j18L99k71O4Q0k25K73o4j91K53q6j45l6k8L17
4769ej60l8J09M1k37K34j75P0L7Q1o9%l41M41k61J5M08m03K93k75K25K23j45j08
4793d0J77k84J57j55K48j6k66L11k23j38O3k4J73k2K3O1k00N14n16J26J83J76
4815C28m82J24J43N8Q9nl49K46M5l86K12J77p2l62L48j28K67n18J98K97k89R1
4837C2Q0J87k29L03l83K99k72M5J62m83M55K37k76J7K19p6l67J82O3k22o5L85
4859B93L6n1l2j05j00M64l05p3m8n8j43L68K15m66M49l3K2n01K45P7ml39K48n0
4883A09J40J55l9l96K32P8K12r9k45KK50k40L1l69N5L22k5j80M02k09n1P1k16
4906a0K49k87L18k18K02j63r4j69K30k1L3j19L52j34p7k91K97L9q5J06m04M37
$$ y = [-144, -94, -98, -93, -462, -229, -69, 91, -62, -227, -345, 54, -217, -153, -73, -298, -25, -89, -280, -27, -113, -258, -294, -322, -5, -165, -203, -94, -53, -290, -56, -231, -161, -124, -43, -112, -112, -453, -12, -273, -258, 150, -253, 40, -235, -10, 213, 68, -40, 137, -147, 10, -145, 103, 87, -179, 132, -91, -229, -166, -190, -17, -39, -16, 45, -155, 359, -157, -31, 152, 328, -154, -30, 113, 171, 260, 255, -94, 152, 197, -189, 23, 200, 128, -234, 114, -14, 253, -265, -67, 230, -59, 32, 112, 299, 70, 373, -10, 289, 17, 62, 224, -259, 196, 433, 157, 174, 393, 317, -50, 132, 195, -27, -92, 293, 329, 278, 246, 141, 41, 505, 200, 127, 79, 21, -122, 246, 461, -5, 444, 411, 433, -68, 177, 254, 250, -89, 159, 109, 249, 404, 365, -31, 201, 279, 491, 392, 147, 149, 399, 159, 190, -179, -124, 198, 173, -7, 395, 186, 135, 206, -10, 239, -48, 270, 52, 254, 91, -3, -172, 58, 37, 70, -49, 303, 169, 92, -199, 98, 137, 52, 158, -246, 191]
4928A91k11L14n88M37P8Mk84K02j82O4r2L3q3N6N4K45k52K9J03j68L6j62J95J31
4952A50l31P1r5R5J39K8j48j34J26J6J2j03q7K96J23l61J49J49j31r7nJ9K65j24
4976B2J09O7m0k71k27L24M0m41L01J06J26j63l66M08j30k5p9K8J83n2p9M42m05
4999a22o6l84K4L31O5k56N0K08k58J95n6L79r6k08K49m58M05k40K09R4l04J49
5021i0k60M04n7n9j28kO7k8k10N6K25J27k32R2R3j50Rm1K90j51m18M27J72m37
5045c01K58j88j7L43k00k93J18M81l13k56l9N02j95j12L71m23J79J56m3j65M01
$$ y = [191, -20, 294, -294, 143, 221, 225, -59, 143, -39, 25, -67, -34, -117, -61, -7, 238, -14, 15, 118, -50, -14, -176, 19, 150, -181, -110, -205, -110, 29, 57, -91, -225, -99, -83, -71, -174, -261, 35, 158, -203, -54, 95, -36, -133, -138, -119, 146, 22, 131, 198, 158, -113, -340, -16, 24, -417, -116, -10, 116, -47, -413, -5, -135, -160, -239, -211, -28, -80, -159, 283, -122, -188, -572, -548, -217, -152, -408, -358, -150, -408, -213, -269, 110, 14, -194, 55, -403, 2, -238, -29, 65, -239, -90, -350, 54, -3, -62, -190, -192, -125, -153, -363, -307, -82, 45, -187, -95, -2, -152, -143, -184, 106, -45, -463, -36, 136, -301, -43, -231, -248, 95, -105, -398, -280, 201, -112, -368, -407, 95, -100, -212, 159, -264, -85, 71, 28, -137, 264]
$$ [...]
8191b78
##END NTUPLES=NMR FID
##END=
