##TITLE=1H_Ser 7-3-i-2
 CDcl3, 8 sc, 
 5.6.2020
##JCAMPDX= 6.0         $$ Bruker NMR JCAMP-DX V2.0
##DATA TYPE= NMR FID
##DATA CLASS= NTUPLES
##ORIGIN= UXNMR, Bruker Analytische Messtechnik GmbH
##OWNER= root
$$ XWIN-NMR		Version 3.5
$$ Fri Jun  5 10:54:39 2020 Russian Standard Time (UT+4h)  she@DPX200
##.OBSERVE FREQUENCY= 200.1315
##.OBSERVE NUCLEUS= ^1H
##.DELAY= (6, 6)
##.ACQUISITION MODE= SIMULTANEOUS
##.ACQUISITION SCHEME= undefined
##.AVERAGES= 8
##.DIGITISER RES= 18
##SPECTROMETER/DATA SYSTEM= spect
##.PULSE SEQUENCE= zg30
##.SOLVENT NAME= D2O
##.SHIFT REFERENCE= (INTERNAL, D2O, 0, 15.7039)
##AUDIT TRAIL= $$ (NUMBER, WHEN, WHO, WHERE, WHAT)
$$ ##TITLE= Audit trail, XWIN-NMR		Version 3.5
$$ ##JCAMPDX= 5.01
$$ ##ORIGIN= Bruker BioSpin GmbH
$$ ##OWNER= she
$$ F:/spectra/data/she/nmr/H-F/1/audita.txt
$$ ##AUDIT TRAIL=  $$ (NUMBER, WHEN, WHO, WHERE, WHAT)
(   1,<2020-06-05 10:53:35.15 +0400>,<she>,<DPX200>,
      <created by zg, POWCHK disabled, PULCHK disabled
       configuration hash MD5:
       00 E9 B6 7A A2 85 ED C7 34 08 36 98 17 FE 4E 26
       data hash MD5: 16K
       4A 8B 15 31 6A 84 00 3E FE 84 09 DE 0A 8C EC DE>)
$$ ##END=
$$ 
$$ hash MD5
$$ FB 31 F4 57 34 B0 2F 24 CB FD 34 01 22 B3 F6 A1
##$RELAX= 
##$RELAX= 
##$RELAX= 
##$RELAX= 
##$RELAX= 
##$RELAX= 
$$ Bruker specific parameters
$$ --------------------------
##$DU= <F:/spectra>
##$EXPNO= 1
##$NAME= <H-F>
##$PROCNO= 1
##$TYPE= <nmr>
##$USER= <she>
##$AMP= (0..31)
100 100 100 100 100 100 100 100 100 100 100 100 100 100 100 100 100 100 
100 100 100 100 100 100 100 100 100 100 100 100 100 100 
##$AQSEQ= 0
##$AQ_mod= 1
##$AUNM= <au_zg>
##$AUTOPOS= <>
##$BF1= 200.13
##$BF2= 200.13
##$BF3= 200.13
##$BF4= 200.13
##$BF5= 200.13
##$BF6= 200.13
##$BF7= 200.13
##$BF8= 200.13
##$BYTORDA= 1
##$CFDGTYP= 0
##$CFRGTYP= 5
##$CHEMSTR= <none>
##$CNST= (0..31)
1 1 145 1 1 1 1 1 1 1 1 1 1 1 1 1 1 1 1 1 1 1 1 1 1 1 1 1 1 1 1 1 
##$CPDPRG= <>
##$CPDPRG1= <>
##$CPDPRG2= <>
##$CPDPRG3= <>
##$CPDPRG4= <mlev>
##$CPDPRG5= <mlev>
##$CPDPRG6= <mlev>
##$CPDPRG7= <mlev>
##$CPDPRG8= <mlev>
##$CPDPRGB= <>
##$CPDPRGT= <>
##$D= (0..31)
0 1.2 0 0 0 0 0 0 0 0.06 0 0.03 0 0 0 0 0.0002 0 0 0 0 0 0 0 0 0 0 0 0 
0 0 0 
##$DATE= 1591340014
##$DBL= (0..7)
120 120 120 120 120 120 120 120 
##$DBP= (0..7)
150 150 150 150 150 150 150 150 
##$DBP07= 0
##$DBPNAM0= <>
##$DBPNAM1= <>
##$DBPNAM2= <>
##$DBPNAM3= <>
##$DBPNAM4= <>
##$DBPNAM5= <>
##$DBPNAM6= <>
##$DBPNAM7= <>
##$DBPOAL= (0..7)
0.5 0.5 0.5 0.5 0.5 0.5 0.5 0.5 
##$DBPOFFS= (0..7)
0 0 0 0 0 0 0 0 
##$DE= 6
##$DECBNUC= <off>
##$DECIM= 24
##$DECNUC= <off>
##$DECSTAT= 4
##$DIGMOD= 1
##$DIGTYP= 9
##$DL= (0..7)
0 120 120 120 120 120 120 120 
##$DP= (0..7)
150 150 150 150 150 150 150 150 
##$DP07= 0
##$DPNAME0= <>
##$DPNAME1= <>
##$DPNAME2= <>
##$DPNAME3= <>
##$DPNAME4= <>
##$DPNAME5= <>
##$DPNAME6= <>
##$DPNAME7= <>
##$DPOAL= (0..7)
0.5 0.5 0.5 0.5 0.5 0.5 0.5 0.5 
##$DPOFFS= (0..7)
0 0 0 0 0 0 0 0 
##$DQDMODE= 0
##$DR= 18
##$DS= 0
##$DSLIST= <SSSSSSSSSSSSSSS>
$$ [...]
##$SUBNAM2= <"">
##$SUBNAM3= <"">
##$SUBNAM4= <"">
##$SUBNAM5= <"">
##$SUBNAM6= <"">
##$SUBNAM7= <"">
##$SUBNAM8= <"">
##$SUBNAM9= <"">
##$SW= 24.9337058887773
##$SWIBOX= (0..15)
0 0 2 0 0 0 0 0 0 0 0 0 0 0 0 0 
##$SW_h= 4990.01996007984
##$TD= 16384
##$TD0= 1
##$TE= 0
##$TE2= 300
##$TE3= 300
##$TEG= 300
##$TL= (0..7)
0 120 120 120 120 120 120 120 
##$TP= (0..7)
150 150 150 150 150 150 150 150 
##$TP07= 0
##$TPNAME0= <>
##$TPNAME1= <>
##$TPNAME2= <>
##$TPNAME3= <>
##$TPNAME4= <>
##$TPNAME5= <>
##$TPNAME6= <>
##$TPNAME7= <>
##$TPOAL= (0..7)
0.5 0.5 0.5 0.5 0.5 0.5 0.5 0.5 
##$TPOFFS= (0..7)
0 0 0 0 0 0 0 0 
##$TUNHIN= 0
##$TUNHOUT= 0
##$TUNXOUT= 0
##$USERA1= <user>
##$USERA2= <user>
##$USERA3= <user>
##$USERA4= <user>
##$USERA5= <user>
##$V9= 5
##$VALIST= <valist>
##$VCLIST= <CCCCCCCCCCCCCCC>
##$VD= 0
##$VDLIST= <DDDDDDDDDDDDDDD>
##$VPLIST= <PPPPPPPPPPPPPPP>
##$VTLIST= <TTTTTTTTTTTTTTT>
##$WBST= 1024
##$WBSW= 4
##$XGAIN= (0..3)
0 0 0 0 
##$XL= 0
##$YL= 0
##$YMAX_a= 221799
##$YMIN_a= -158598
##$ZGOPTNS= <>
##$ZL1= 120
##$ZL2= 120
##$ZL3= 120
##$ZL4= 120
##$ABSF1= 10
##$ABSF2= 0
##$ABSG= 5
##$ABSL= 3
##$ALPHA= 0
##$AQORDER= 0
##$ASSFAC= 0
##$ASSFACI= 0
##$ASSFACX= 0
##$ASSWID= 0
##$AUNMP= <proc_1d>
##$AZFE= 0.1
##$AZFW= 0.1
##$BCFW= 1
##$BC_mod= 2
##$BYTORDP= 1
##$COROFFS= 0
##$CY= 11.3945322036743
##$DATMOD= 1
##$DC= 2
##$DFILT= <>
##$DTYPP= 0
##$F1P= 16.9975609425685
##$F2P= -3.02152046262296
##$FCOR= 0.5
##$FTSIZE= 0
##$FT_mod= 4
##$GAMMA= 1
##$GB= 0.15
##$INTBC= 1
##$INTSCL= 1
##$ISEN= 128
##$LB= 0.24
##$LEV0= 0
##$LPBIN= 0
##$MAXI= 10000
##$MC2= 0
##$MEAN= 0
##$ME_mod= 0
##$MI= 1.114404
##$NCOEF= 0
##$NC_proc= 0
##$NLEV= 6
##$NOISF1= 3.799351
##$NOISF2= 2.8
##$NSP= 1
##$NTH_PI= 0
##$NZP= 0
##$OFFSET= 15.70392
##$PC= 1
##$PHC0= -9798.639
##$PHC1= 20.60082
##$PH_mod= 1
##$PKNL= yes
##$PPARMOD= 0
##$PSCAL= 0
##$PSIGN= 0
##$REVERSE= no
##$SF= 200.130013532006
##$SI= 16384
##$SIGF1= 3
##$SIGF2= 2
##$SINO= 400
##$SIOLD= 16384
##$SREGLST= <1H.CDCl3>
##$SSB= 0
##$STSI= 0
##$STSR= 0
##$SW_p= 3612.71676300578
##$SYMM= 0
##$S_DEV= 0
##$TDeff= 0
##$TDoff= 0
##$TI= <>
##$TILT= no
##$TM1= 0
##$TM2= 0
##$TOPLEV= 0
##$USERP1= <user>
##$USERP2= <user>
##$USERP3= <user>
##$USERP4= <user>
##$USERP5= <user>
##$WDW= 1
##$XDIM= 8192
##$YMAX_p= 0
##$YMIN_p= 0
$$ End of Bruker specific parameters
$$ ---------------------------------
##NTUPLES= NMR FID
##VAR_NAME=  TIME,          FID/REAL,        FID/IMAG
##SYMBOL=    X,             R,               I
##VAR_TYPE=  INDEPENDENT,   DEPENDENT,       DEPENDENT
##VAR_FORM=  AFFN,          ASDF,            ASDF
##VAR_DIM=   8192,          8192,            8192
##UNITS=     SECONDS,       ARBITRARY UNITS, ARBITRARY UNITS
##FACTOR=    0.0002004,     1,               1
##FIRST=     0,             0,               0
##LAST=      1.6414764,     0,               0
##MIN=       0,             -158598,         0
##MAX=       1.6414764,     221799,          0
$$ Real data points
##PAGE= N=1
##DATA TABLE= (X++(R..R)), XYDATA
$$ [...]
$$ plain form
2698 494 -1313 1664 2519 1100 -1834 1201 3767 1180 -1787 779 3799 2972 -415 163 3787 3564
2714 3564 -906 478 3942 2910 -1642 -1132 2242 3572 871 -606 1276 4228 1128 -1495 1718
2729 1718 2858 1650 -1968 206 3434 1695 -1622 -242 2997 2250 -1569 -742 2187 1312 -881 -1537
2745 -1537 1644 2438 -28 -1367 1483 1787 -842 -2439 -185 1726 887 -1325 535 2373 2009 -2209
2761 -2209 -930 1299 982 -2072 -1231 2166 1762 -520 -2617 977 2641 -1210 -2133 1383 2169 -420
2777 -420 -1723 79 2443 650 -849 268 1874 572 -654 75 1318 2503 -239 -601 1180 1501
2793 1501 -381 -1175 957 1236 -126 -1127 1759 2269 322 -751 623 1126 702 -653 -1689 1141
2809 1141 638 -558 -141 -69 1153 461 -1005 101 1856 -1143 -1304 760 1965 567 -2019 255
$$ packed form
2698D94j807K977Q55j419k934L035K566k587k967K566L020q27l387N78L624k23
2714C564m470J384L464j032m552N10L374J330k701j477J882K952l100k623L213
2729A718J140j208l618K174L228j739l317J380L239p47l819Q27K929q75k193o56
2745a537L181P94k466j339K850L04k629j597K254J911q39k212J860J838l64m218
2761b209J279K229l17l054Q41L397m04k282k097L594J664l851r23L516P86k589
2777d20j303J802K364j793j499J117J606j302j226P29J243J185k742l62J781L21
2793A501j882p94K132K79j362j001K886N10j947j073J374N03m24j355j036K830
2809A141n03j196M17P2J222o92j466J106J755k999j61K064J205j398k586K274
$$ plain form
2825 255 943 -755 -1231 -387 460 -147 -1841 177 936 362 -2341 -1677 -120 776 -1049 -2297 223
2842 223 581 -278 -2480 -1699 -746 -2266 -3245 -781 431 203 -1938 -2117 -797 141 -2028 -3000 -659
2859 -659 6 -1675 -2057 -486 745 -1829 -2771 -1681 -176 -1096 -2976 -1193 193 -88 -2464 -1190
2875 -1190 -479 -367 -2062 -2009 -1007 503 -1525 -2585 236 91 -1677 -2023 -1473 275 -1139 -1855 -634
2892 -634 1405 -729 -2190 -1786 -447 -376 -1259 -875 1173 1061 -137 -1742 1113 540 -1628 -1709 -839 1837
2910 1837 -2520 -2055 -728 1609 -746 -2052 -659 1428 566 -1262 -1334 -503 1345 -2255 -1206 595
2926 595 443 -2689 -2419 387 1538 -913 -1883 -383 2526 -385 -1436 -165 1270 448 -1481 -1005
2942 -1005 1348 413 -1194 -260 2509 1165 -1682 -430 1758 2115 -529 -906 1484 2276 -68 -925
$$ packed form
2825B55O88j698m76Q44Q47o07j694K018P59n74k703O64J557Q96j825j248K520
2842B23L58q59k202P81R53j520r79K464J212k28k141j79J320R38k169r72K341
2859f59O65j681l82J571J231k574r42J090J505r20j880J783J386k81k376J274
2875a190P11J12j695N3J002J510k028j060K821j45j768l46N50J748j414p16J221
2892f34K039k134j461M04J339P1q83L84K048j12j198j605K855n73k168q1Q70K676
2910A837m357M65J327K337k355j306J393K087q62j828p2Q31J848l600J049J801
2926E95j52l132K70K806J151k451r70J500K909k911j051J271J435q22j929M76
2942a005K353r35j607R34K769j344k847J252K188L57k644l77K390P92k344q57
$$ plain form
2958 -925 1344 1987 121 -1750 388 2541 767 -1570 821 3176 1755 -357 352 1354 923 -1121
2974 -1121 -180 2046 2321 -589 -1170 1877 1897 -310 -1621 1573 2816 537 -1761 2426 2828 1293
2990 1293 -38 -693 1128 2561 -1751 -441 1427 1671 -743 -168 2028 1557 -641 -1010 781 1836
3006 1836 -533 -1272 2738 1774 326 -467 -177 1445 -158 -2340 -510 1528 -57 -1397 48 1544
3022 1544 1061 -1305 -611 2808 1227 -597 -442 1661 1905 200 -1153 1017 1498 749 -1615 1105
3038 1105 1513 428 -2324 -14 1773 504 -1195 -904 2506 -386 -1407 35 2433 1686 -1153 -1669
3054 -1669 2687 1962 -1299 -2345 1193 1730 477 -725 7 1782 -909 -2647 109 3466 1316 -3094
3070 -3094 -409 2370 1314 -2679 -1573 772 577 -265 -1693 1167 967 -2064 -1202 731 865 -718
$$ packed form
2958i25K269O43j866j871K138K153j774k337K391K355j421k112P09J002m31k044
2974a121R41K226K75k910n81L047K0k207j311L194J243k279k298M187M02j535
2990A293j331o55J821J433m312J310J868K44k414N75K196m71k198l69J791J055
3006A836k369p39M010r64j448p93K90J622j603k182J830K038j585j340J445J496
3022A544m83k366O94L419j581j824J55K103K44j705j353K170M81p49k364K720
3038A105M08j085k752K310J787j269j699K91L410k892j021J442K398p47k839n16
3054a669M356p25l261j046L538N37j253j202P32J775k691j738K756L357k150m410
3070c094K685K779j056l993J106K345j95q42j428K860k00l031Q62J933J34j583
$$ plain form
3086 -718 -2006 1033 1922 -2098 -2207 -512 3216 338 -3387 743 2762 -362 -2086 -805 2532 588
3102 588 -1922 -752 1706 -341 -2151 -2786 299 490 -1549 -3263 364 420 -652 -3408 -3 876
3118 876 -1855 -2270 -834 889 -564 -3074 -2775 291 -347 -1679 -1523 -706 751 -684 -2583 486
3134 486 1284 -1860 -3208 2083 999 -26 -2450 378 480 -1000 -4048 -1221 886 -320 -2542 -1469
3150 -1469 910 141 -1159 -1742 1455 1256 -2212 -1310 1157 1696 -932 -1629 -131 1997 -237 -2699
3166 -2699 -545 958 -246 -804 18 1487 1007 -2687 -605 2773 1751 -1886 -282 729 560 -719
3182 -719 -2419 139 2960 -1077 -1375 973 1929 -641 -962 284 375 -72 -1623 -43 2694 -261 -1596
3199 -1596 -1188 874 704 -1683 -559 1737 1729 -432 -511 2614 1143 -92 -1535 2118 2740 -29 -318
$$ packed form
3086g18j288L039Q89m020j09J695L728k878l725M130K019l124j724J281L337j944
3102E88k510J170K458k047j810o35L085J91k039j714L627N6j072k756L405Q79
3118H76k731m15J436J723j453k510K99L066o38j332J56Q17J457j435j899L069
3134D86P98l144j348N291j084j025k424K828J02j480l048K827K107j206k222J073
3150a469K379p69j300n83L197j99l468R02K467N39k628o97J498K128k234k462
3166b699K154J503j204n58Q22J469m80l694K082L378j022l637J604J011j69j279
3182g19j700K558K821m037k98K348R56k570l21J246R1m47j551J580K737k955j335
3199a596M08K062j70k387J124K296qk161p9L125j471j235j443L653O22k769k89
$$ plain form
3216 -318 247 2755 190 -1250 887 1954 181 -1942 9 2000 1051 -1101 983 1005 1786 -1246
3232 -1246 -267 2506 817 -1138 -553 1717 1868 -535 -292 757 2403 1234 -1158 1137 1932 600
3248 600 -771 870 1858 1779 -332 517 1272 1050 227 -117 1683 525 -619 534 859 2137 114
3265 114 -1203 302 2194 415 -580 19 1560 637 -1094 -292 676 960 711 -1270 820 1850 -784
3282 -784 -284 1448 1278 355 -11 54 1987 751 -643 708 589 94 -335 183 400 -1011 -1929 -1593
3300 -1593 2050 2167 -590 -2716 245 -64 383 -307 1124 840 219 -719 821 327 252 -1518 -849 425
3318 425 807 1142 -1409 1610 994 -907 -1114 -38 268 -1152 -654 545 439 68 -1052 65 1304
3335 1304 -1026 -244 65 862 560 -168 695 2093 -601 -1618 30 667 385 -763 244 1170 863
$$ packed form
3216c18N65K508k565j440K137J067j773k123J951J991r49k152K084K2P81l032
3232a246R79K773j689j955N85K270J51k403K43J049J646j169k392K295P95j332
3248F00j371J641R88p9k111Q49P55k22q23l44J800j158j144J153L25J278k023
3265A14j317J505J892j779r95N99J541r23j731Q02R68K84k49j981K090J030k634
3282g84N00J732j70r23l66O5J933j236j394J351j19m95m29N18K17j411r18L36
3300a593L643J17k757k126K961l09M47o90J431k84o21r38J540m94p5j770O69J274
3318D25L82L35k551L019o16j901k07J076L06j420M98J199j06l71j120J117J239
3335A304k330P82L09P97l02p28Q63J398k694j017J648O37k82j148J007R26l07
$$ plain form
3352 863 70 -227 341 203 -490 -866 846 841 -910 -595 -948 1153 288 -1285 -7 -959 -364 -1249 -293
3371 -293 133 -657 -273 -682 1150 18 -240 -730 -249 -516 -8 -440 -182 -768 -1749 -656 174 -197 -963
3390 -963 -1530 505 -177 175 -1049 -1334 -468 435 -1308 -1728 396 -112 -1198 -2450 -151 1753 -1312
3407 -1312 -1070 -1877 -320 129 -1407 25 1536 -499 -2309 -1657 149 784 -2657 -1995 -506 1121
3423 1121 -1137 -566 -134 2190 -307 -666 1203 818 247 -1901 1737 -580 613 -130 -778 44 -760
3440 -760 -1484 -1109 169 906 -51 273 -102 1578 -730 -1087 793 1595 -840 333 -181 306 574 -1078
3458 -1078 974 1291 388 -524 -613 1859 1436 -1068 -789 1508 -82 -349 707 928 1212 -191 -894 1637
3476 1637 1998 32 -604 1832 1739 1629 -2091 957 2235 631 884 -230 731 1850 -1124 -1174 1197
$$ packed form
3352H63p93k97N68j38o93l76J712nj751L15l53K101q65j573J278r52N95q85R56
3371b93M26p90L84m09J832j132k58m90M81k67N08m32K58n86r81J093Q30l71p66
3390i63n67K035o82L52j224k85Q66R03j743m20K124n08j086j252K299J904l065
3407a312K42q07J557M49j536J432J511k035j810O52J806O35l441O62J489J627
3423A121k258N71M32K324k497l59J869l85n71k148L638k317J193p43o48Q22q04
3440g60p24L75J278P37r57L24l75J680k308l57J880Q02k435J173n14M87K68j652
3458a078K052L17r03r12q9K472m23k504K79K297j590k67J056K21K84j403p03K531
3476A637L61j966o36K436r3j10l720L048J278j604K53j114R61J119k974n0K371
$$ plain form
3493 1197 521 -1576 -299 1856 1908 1190 928 586 2120 -347 -939 1112 848 284 -1515 1271 -447
3510 -447 250 -446 -787 1286 1130 -435 -1004 3440 168 -417 -501 960 210 -216 -200 1193 987 -751
3528 -751 726 775 1513 400 -2007 642 1071 -621 -961 1364 2716 -409 -1033 424 2808 901 -906
3545 -906 -703 2110 1003 238 -1264 875 891 -454 -1089 146 1688 379 -1519 17 1900 400
3561 400 -635 714 1835 -1078 -2179 -1057 351 -1144 -1567 -1150 1446 1521 26 -1776 1070 767
3577 767 -1354 -1617 51 2147 -712 -1633 10 628 -91 -2505 -400 544 815 -921 -965 871 -353
3594 -353 -688 119 1541 1102 -1140 -1017 1507 1872 -1029 -719 336 1230 -1288 -729 899 1307 61
3611 61 -800 -522 -12 -219 -2302 -1060 1430 240 -1010 -732 114 -107 -858 -1020 221 248 -911 -1082
$$ packed form
3493A197o76k097J277K155N2p18k62l42J534k467n92K051k64n64j799K786j718
3510d47O97o96l41K073j56j565n69M444l272n85q4J461p50m26J6J393k06j738
3528g51J477M9P38j113k407K649M29j692l40K325J352l125o24J457K384j907j807
3545i06K03K813j107p65j502K139J6j345o35J235J542j309j898J536J883j500
3561D00j035J349J121k913j101J122J408j495m23M17K596P5j495j802K846l03
3577G67k121k63J668K096k859r21J643O18p19k414K105R44K71j736m4J836j224
3594c53l35Q07J422m39k242J23K524L65k901L10J055Q94k518N59J628M08j246
3611F1q61K78N10k07k083J242K490j190j250K78Q46k21p51j62J241K7j159j71
$$ plain form
3629 -1082 -198 -64 -760 -2313 464 905 -846 -1448 -216 202 -405 -1720 -1326 450 -68 -1127 866
3646 866 1238 283 -1924 -2031 274 1005 -505 -2169 1226 162 -1792 -1960 -438 51 -755 -1626 -1229
3663 -1229 500 -257 -1534 -1237 1082 -144 -1927 -399 550 -968 -1114 675 865 -376 -789 -1894
3679 -1894 898 1253 -168 -1096 117 328 -1005 -2133 136 878 -103 -985 170 1170 36 -1228
3695 -1228 -506 1058 279 -1404 -1591 736 497 -760 -912 180 956 90 -640 -466 1231 647 -1185
3712 -1185 745 1425 936 297 633 1412 288 -1402 -1324 299 1297 -795 822 493 891 -1137 872
3729 872 1322 860 -294 -134 1152 2276 570 -793 728 517 291 622 -402 418 -245 -271 922 2035
3747 2035 1190 41 427 645 136 -817 -1062 -28 1076 462 258 335 1336 -1177 -455 1296 971 -428
$$ packed form
3629a082Q84J34o96j553K777M41j751o02J232M18o07j315L94J776n18j059J993
3646H66L72r55k207j07K305P31j510j664L395j064j954j68J522M89q06q71L97
3663a229J729p57j277K97K319j226j783J528R49j518j46J789J90j241m13j105
3679a894K792L55j421r28J213K11j333j128K269P42r81q82J155J000j134j264
3695a228P22J564p79j683j87K327k39j257j52J092P76q66p30J74J697n84j832
3712a185J930O80m89o39L36P79j124j690P8J623R98k092J617l29L98k028K009
3729H72M50m62j154J60J286J124j706j363J521k11k26L31j024Q20o63k6J193J113
3747B035q45j149L86K18n09r53k45J034J104o14k04P7J001k513P22J751l25j399
$$ plain form
3765 -428 1279 343 505 484 -135 346 599 1940 -11 -579 1460 37 511 55 1562 -91 -996 -1381
3783 -1381 1425 616 372 146 -3 884 -324 -711 -219 909 1140 -214 -187 1433 509 779 70 1297
3801 1297 605 -63 -207 812 1180 -558 94 1426 935 117 -738 1034 1601 98 -881 271 613 723
3819 723 -522 -556 113 419 -935 123 -7 174 -974 62 610 675 -883 -496 68 -292 -326 -1033 -52
3838 -52 -168 102 -191 131 730 220 -776 -1905 880 661 -109 -193 1150 -386 -323 -1250 200 -274 -69
3857 -69 -655 -19 532 50 74 86 927 -75 451 -968 851 313 -257 -295 280 1147 -671 -1296 987 -37
3877 -37 -756 -669 -825 -11 -62 -939 61 -539 27 -153 -716 -384 44 332 -743 -264 477 -968 -841 -122
3897 -122 653 -641 -799 939 501 -141 -326 -743 -232 27 -164 -736 82 1011 -820 64 596 260 -339
$$ packed form
3765d28J707r36J62k1o19M81K53J341j951n68K039j423M74m56J507j653r05l85
3783a381K806q09k44k26j49Q87j208l87M92J128K31j354K7J620r24K70p09J227
3801A297o92o68j44J019L68j738O52J332m91q18q55J772N67j503r79J152L42J10
3819G23j245l4O69L06j354J058j30J81j148J036N48O5j558L87N64l60l4p07R81
3838e2j16K70k93L22N99n10r96j129K785k19p70q4J343j536O3r27J450m74K05
3857f9n86O36N51m82K4J2Q41j002N26j419J819n38n70l8N75Q67j818o25K283j024
3877c7p19Q7j56Q14n1q77J000o00N66j80n63L32M28K88j075M79P41j445J27P19
3897a22P75j294j58J738m38o42j85m17N11K59j91n72Q18R29j831Q84N32l36n99
$$ plain form
3916 -339 -680 492 57 -543 -1274 -335 527 -134 -1865 -51 816 -722 -784 -984 190 -1022 -1038 576
3934 576 135 144 -1302 -1728 250 556 -239 -1123 -197 753 -928 -1478 276 605 -121 -824 490 333 -1064
3953 -1064 -541 267 853 1116 -1023 -544 -140 -178 -1066 -730 749 209 -372 -1079 550 618 -718 -1454 -62
3972 -62 323 -200 -87 -240 708 145 -527 -913 1335 641 -644 338 905 406 -361 -491 30 344 -1086
3991 -1086 -298 785 1450 -96 -732 524 1443 47 -148 345 761 451 422 354 1222 256 -523 65 1077
4010 1077 384 -877 -91 1271 432 5 -398 485 947 -340 -867 1185 1481 -152 207 282 2176 -127
4028 -127 228 234 1041 654 746 -621 1107 180 267 -177 882 1861 -369 -58 595 1745 -688 -1079 -80
4047 -80 442 -385 -533 -246 463 805 -620 578 36 157 -387 -187 762 -109 -261 -458 1219 1100 -91
$$ packed form
3916c39l41J172m35o00p31R39Q62o61j731J814Q67j538o2k00J174j212j6J614
3934E76m41Rj446m26J978L06p95q84R26R50j681n50J754L29p26p03J314j57j397
3953a064N23Q08N86K63k139M79M04l8q88L36J479n40n81p07J629O8j336p36J392
3972f2L85n23J13j53R48n63o72l86K248o94j285R82N67m99p67j30N21L14j430
3991a086P88J083O65j546o36J256R19j396j95M93M16l10k9o8Q68r66p79N88J012
4010A077o93j261P86J362q39m27m03Q83M62j287n27K052K96j633L59P5J894k303
4028a27L55OQ07l87R2j367J728r27Q7m44J059R79k230L11O53J150k433l91R99
4047h0N22q27j48K87P09L42j425J198n42J21n44K00R49q71j52j97J677j19j191
$$ plain form
4066 -91 -496 1567 1074 486 111 637 599 922 -1322 728 1155 297 -769 -41 663 405 -550 -41 1618
4085 1618 397 -726 -616 872 966 -1189 -1812 170 978 -596 96 -344 1236 7 -508 955 260
4102 260 250 -146 652 450 -167 -423 385 208 -124 721 -34 347 1221 -61 -768 305 -117 -1157 291
4121 291 -99 356 -270 -191 -844 36 -1164 -1189 -130 688 -46 -566 -333 1090 -190 -12 -750 321 -431
4140 -431 -1317 -310 -3 178 -453 -849 348 590 -395 -94 -479 1124 562 -324 367 652 -534 -218 -464
4159 -464 655 90 -643 -602 587 -425 -1326 -566 938 673 -414 -363 -324 1134 -821 -718 600 934
4177 934 -186 -1098 -179 174 209 -403 -1249 568 1066 -334 -183 506 246 440 -1745 408 703 -749
4195 -749 -103 364 405 -935 -521 -147 352 -611 -535 -751 -501 51 593 -192 1577 2 80 -92 120 -159
$$ packed form
4066i1m05K063m93n88l75N26l8L23k244K050M27q58j066P28P04k58r55N09J659
4085A618j221j123J10J488R4k155o23J982Q08j574O92m40J580j229n15J463o95
4102B60j0l96P98k02o17k56Q08j77l32Q45p55L81Q74j282p07J073m22j040J448
4121B91l90M55o26P9o53Q80j200k5J059Q18p34n20K33J423j280J78p38J071p52
4140d31q86J007L07J81o31l96J197K42r85L01l85J603n62q86O91K85j186L16k46
4159d64J119n65p33M1J189j012r01P60J504k65j087N1L9J458j955J03J318L34
4177I34j120r12R19L53L5o12q46J817M98j400J51O89k60J94k185K153K95j452
4195g49O46M67M1j340M14L74M99r63P6k16K50N52N42p85J769j575P8j72K12k79
$$ plain form
4215 -159 -223 -97 -405 674 -213 -1249 869 715 -1100 380 330 205 -1009 -1433 1070 318 -271 -680
4233 -680 -84 426 880 -11 834 578 115 -452 -1591 -29 762 -753 -782 1013 923 198 32 379 1086
4252 1086 -515 428 577 725 1578 -330 414 83 197 -284 667 232 1289 -155 576 2080 531 -154
4270 -154 -790 331 1345 12 -136 1321 1137 -476 -543 -92 698 242 -515 1804 151 1131 -431 584
4288 584 851 1313 -622 -407 405 922 -382 376 -303 365 379 238 344 -511 -154 279 494 796 -54 -882
4308 -882 939 1169 113 207 -82 56 562 -130 -650 630 177 356 -212 212 646 5 114 1322 216
4327 216 415 -397 606 -405 1103 -165 372 754 -179 -87 411 452 252 -1120 -297 -276 278 -173 -12
4346 -12 541 -6 -493 871 -331 585 1048 -650 234 1118 1350 -550 50 1490 296 -98 -1147 1504
$$ packed form
4215a59o4J26l08J079q87j036K118j54j815J480n0j25j214m24K503p52n89m09
4233f80N96N10M54q91Q45k56m63n67j139J562P91j515k9J795r0p25j66L47P07
4252A086j601R43J49J48Q53j908P44l31J14m81R51m35J057j444P31J504j549o85
4270a54o36J121J014j333j48J457j84j613o7M51P90m56p57K319j653R80j562J015
4288E84K67M62j935K15Q12N17j304P58o79O68J4j41J06q55L57M33K15L02q50q28
4308h82J821K30j056R4k89J38N06o92n20J280m53J79n68M24M34o41J09J208j106
4327B16J99q12J003j011J508j268N37L82r33R2M98M1k00j372Q23K1N54m51J61
4346a2N53n47m87J364j202R16M63j698Q84Q84K32j900O00J440j194l94j049K651
$$ plain form
4364 1504 623 -808 -263 -158 -456 -377 -611 306 857 215 -505 433 9 477 -154 171 189 1074 28 -253
4384 -253 -492 -772 -190 -676 427 562 831 440 197 80 1687 366 1435 33 -822 -18 -861 117
4402 117 -18 -290 -766 -395 -719 543 -835 -1148 213 -777 -937 -166 -82 -972 -150 -950 -581 -454 -915
4421 -915 -371 984 453 -769 270 -188 -759 190 -5 146 477 183 -332 -575 667 632 -996 422
4439 422 31 -92 -661 -532 435 -260 -715 -555 6 146 177 -624 509 -572 -952 -1389 -159 -172 -862 -875
4459 -875 370 -1062 -436 -233 1046 -1085 -629 -1830 221 350 -948 -1396 -721 598 -201 -948 -614
4476 -614 272 1062 -1311 -1102 -1193 -934 -794 -585 -356 -93 387 1064 422 -395 -495 -643 212 752 -63 -1049
4496 -1049 488 1132 -1064 53 89 -1361 799 7 840 1077 41 -253 -808 260 528 567 -1209 -377
$$ packed form
4364A504q81j431N45J05k98P9k34R17N51o42p20R38m24M68o31L25J8Q85j046k81
4384b53k39k80N82m86J103J35K69l91k43j17J607j321J069j402q55Q04q43R78
4402A17j35k72m76L71l24J262j378l13J361r90j60P71Q4q90Q22q00L69J27m61
4421i15N44J355n31j222J039m58n71R49j95J51L31k94n15k43J242l5j628J418
4439D22l91j23n69J29R67o95m55J60N61J40L1q01J133j081l80m37J230j3o90j3
4459h75J245j432O26K03J279k131M56j201K051J29j298m48O75J319p99p47L34
4476f14Q86P90k373K09r1K59J40K09K29K63M80O77o42q17j00j48Q55N40q15r86
4496a049J537O44k196J117L6j450K160p92Q33K37j036k94n55J068K68L9j776Q32
$$ plain form
4514 -377 303 -433 -48 792 -351 1041 -53 -191 269 785 -233 -1079 133 505 441 213 791 660 -364
4533 -364 43 1132 881 194 -724 895 1167 69 -1359 69 575 -205 314 1073 702 520 -384 366
4551 366 661 267 310 491 1668 -565 -77 -207 -624 592 -699 -313 -592 259 -452 -452 -349 1404 -369
4570 -369 -226 -838 1625 780 47 785 411 657 324 687 1153 756 57 277 445 126 247 -643 -178 1131
4590 1131 -1145 -756 908 662 1257 -1094 -286 265 79 -435 1390 1253 1979 -1018 560 362 547 446
4608 446 -1010 926 157 -22 -248 826 279 699 279 534 -745 63 1166 -433 1768 604 -306
4625 -306 711 -1088 -228 -47 -356 454 -1203 589 338 631 360 -431 -674 619 1668 -43 27 -664
4643 -664 906 502 -794 147 796 683 724 -368 1465 241 376 -1525 -162 301 -1222 -385 -703 -182
$$ packed form
4514c77O80p36L85Q40j143J392j094j38M60N16j018q46J212L72o4k28N78j31j024
4533c64M07J089k51o87r18J619K72j098j428J428N06p80N19P59l71j82r04P50
4551C66K95l94M3J81J177k233M88j30m17J216j291L86k79Q51p11%J03J753j773
4570c69J43o12K463q45p33P38l74K46l33L63M66l97o99K20J68l19J21q90M65J309
4590A131k276L89J664k46N95k351Q08N51j86n14J825j37P26k997J578j98J85j01
4608D46j456J936p69j79k26J074n47M20m20K55j279Q08J103j599K201j164r10
4625c06J017j799Q60J81l09Q10j657J792k51K93k71p91k43J293J049j711P0o91
4643f64J570m04j296R41O49j13M1j092J833j224J35j901J363M63j523Q37l18N21
$$ plain form
4661 -182 599 -1075 1188 509 -319 -264 -523 1142 259 422 -87 783 -371 -579 -821 118 193 -1176 -220
4680 -220 226 -1251 -785 -230 4 -243 -363 -1992 347 -346 -437 -1541 -1005 417 -490 -257 -1042 466
4698 466 -620 313 368 -256 -642 -499 -558 794 -639 207 -354 421 780 72 -688 -993 599 -603 -850
4717 -850 -702 388 -563 -1302 906 639 541 -298 -826 36 656 -161 65 843 1237 -517 -1204 -20 -992
4736 -992 564 -737 360 -394 -1506 -529 534 541 1298 -1373 -526 532 -1597 -982 -510 824 1201 -558
4754 -558 731 -94 859 -568 -900 1035 788 -1525 -617 -877 320 -1306 -373 -631 257 -739 -437 611
4772 611 82 -140 -601 -211 3 -841 38 -388 -497 888 244 -488 -25 1249 -685 -234 1440 -1014
4790 -1014 -56 -961 -13 38 319 -348 -73 -157 587 -227 -101 -510 633 -488 -72 1555 -93 1279 1099
$$ packed form
4661a82P81j674K263o79q28N5k59J665q83J63n09Q70j154k08k42R39P5j369R56
4680b20M46j477M66N55K34k47j20j629K339o93r1j104N36J422r07K33p85J508
4698D66j086R33N5o24l86J43n9J352j433Q46n61P75L59p08p60l05J592j202k47
4717h50J48J090r51p39K208k67r8q39n28Q62O20q17K26P78L94j754o87J184r72
4736i92J556j301J097p54j112R77J063PP57k671Q47J058k129O15M72J334L77j759
4754e58J289q25R53j427l32J935k47k313R08k60J197j626R33k58Q88r96L02J048
4772F11n29k22m61L90K14q44Q79m26j09J385o44p32M63J274j934M51J674k454
4790a014R58r05R48N1K81o67K75q4P44q14J26m09J143j121M16J627j648J372j80
$$ plain form
4809 1099 960 35 495 250 395 -1479 621 -119 -807 -185 -437 644 1449 2360 1010 503 -1598 1111
4827 1111 728 472 -104 -388 101 724 595 -844 580 -1264 -54 136 144 1157 -149 -270 818 141
4845 141 679 310 727 -87 -1079 168 873 1103 -737 274 492 -744 -616 227 -83 656 400 1852
4863 1852 223 -173 -977 166 1292 1190 124 103 16 -193 154 -730 -656 -314 -303 482 286 -181 746 625
4883 625 173 -721 578 -1001 324 667 53 212 -261 656 -69 -88 -449 -504 525 720 -854 -836 -354
4902 -354 502 -434 -255 -489 293 -1034 -600 92 589 -137 -550 -571 175 -1003 -1089 -153 -607 -490 -426 446
4922 446 455 -451 -219 883 -228 -369 -396 -1181 1262 -414 -628 328 -41 514 -83 -286 -1216 108 -49
4941 -49 -189 -730 -580 95 -433 -841 -199 5 -146 -969 -232 699 357 -874 182 107 315 -685 -313 -1013
$$ packed form
4809A099j39r25M60k45J45j874K100p40o88O22k52J081Q05R11j350n07k101K709
4827A111l83k56n76k84M89O23j29j439J424j844J210J90QJ013j306j21J088o77
4845A41N38l69M17q14r92J247P05K30j840J011K18j236J28Q43l10P39k56J452
4863A852j629l96q04J143J126j02j066k1q7k09L47q84P4L42J1P85j96m67R27j21
4883F25m52q94J299j579J325L43o14J59m73R17p25j9l61n5J029J95j574J8M82
4902c54Q56r36J79k34P82j327M34O92M97p26m13k1P46j178q6R36m54J17O4Q72
4922D46Rr06K32J102j111j41k7p85K443j676k14R56l69N55n97k03r30J324j57
4941d9j40n41J50O75n28m08O42K04j51q23P37R31l42j231J056p5K08j000L72p00
$$ plain form
4961 -1013 -89 417 -558 398 -994 -866 -312 -78 480 -848 -369 809 28 -296 -623 -272 -74 -970 -799
4980 -799 448 -325 -179 22 -6 -335 -131 200 101 -21 84 -766 -1368 41 -635 -380 -103 -1030 457 95
5000 95 541 366 -106 775 -55 383 408 -138 -700 736 1250 46 208 -525 168 767 394 765 998 95
5020 95 -144 -164 855 241 -760 -218 9 509 249 -334 784 544 -201 -957 -285 888 371 -240 373
5039 373 -4 -543 -412 70 604 -230 -224 -708 455 19 194 -266 594 511 106 -596 -687 359 -24 -641 160
5060 160 -39 -156 51 617 727 -618 -392 -465 336 892 -619 -205 -198 186 -399 -213 924 736 417 864
5080 864 -416 753 104 -97 1370 174 -301 -92 838 606 -369 -1011 474 670 -87 -1115 -195 -430
5098 -430 707 -308 -114 145 942 -5 454 206 625 -210 -413 1027 810 1050 182 178 189 529 118 1120
$$ packed form
4961a013R24N06r75R56j392J28N54K34N58j328M79J178p81l24l27L51J98q96J71
4980g99J247p73J46K01k8l29K04L31r9j22J05q50o02J409o76K55K77r27J487l62
5000I5M46j75m72Q81q30M38K5n46n62J436N14j204J62p33O93N99l73L71K33r03
5020I5k39k0J019o14j001N42K27N00k60n83J118k40p45p56O72J173n17o11O13
5039C73l77n39J31M82N34q34Om84J163m36J75m60Q60q3m05p02r1J046l83o17Q01
5060A60j99j17K07N66J10j345K26p3Q01N56j511M14PL84n85J86J137j88l19M47
5080H64j280J169o49k01J467j196m75K09R30k32r75o42J485J96p57j028R20k35
5098d30J137j015J94K59P97r47M59k48M19q35k03J440k17K40q68mJ1L40m11J002
$$ plain form
5118 1120 174 -144 -836 -176 1025 -903 -633 -193 -42 947 -123 -703 744 -337 -63 105 762 628
5136 628 -338 -815 -65 327 -573 56 -1366 445 -442 166 -103 884 405 -384 129 -542 400 -211 -252 448
5156 448 876 150 -316 55 585 -99 413 124 951 -889 -112 596 77 253 -227 -54 -382 501 -522
5175 -522 -40 -980 656 -1144 -89 -516 32 -1200 -532 205 408 -313 -36 -884 -266 40 -201 -161 960
5194 960 -137 -453 822 -150 143 -521 -57 -227 -78 -469 -107 694 -221 23 -720 503 1220 -402 -444
5213 -444 -421 85 438 -1012 55 376 -473 -591 -590 882 232 -1038 -283 -496 -230 -204 -734 197 -769 -522
5233 -522 -433 376 7 -630 -726 475 -1063 -371 -1056 -131 -69 523 187 -543 -618 -649 -419 -365 -6 -734 -195
5254 -195 -21 -814 6 -557 -359 4 260 -186 373 -1057 467 -663 -498 -1023 171 -255 -48 -200 -244
$$ packed form
5118A120r46l18o92O60J201j928K70M40J51R89j070n80J447j081K74J68O57j34
5136F28r66m77P50L92r00O29j422J811q87O08k69R87m79p89N13o71R42o11m1P00
5156D48M28p26m66L71N30o84N12k89Q27j840P77P08n19J76m80J73l28Q83j023
5175e22M82r40J636j800J055m27N48j232O68P37K03p21K77q48O18L06k41M0J121
5194I60j097l16J275r72K93o64M64j70J49l91L62Q01r15K44p43J223P17j622m2
5213d44K3N06L53j450J067L21q49j18JJ472o50j270P55k13K66K6n30R31r66K47
5233e22Q9Q09l69o37r6J201j538O92o85R25O2N92l36p30p5l1K30N4L59p28N39
5254a95J74p93Q20n63J98L63K56m46N59j430J524j130J65n25J194m26K07j52m4
$$ plain form
5273 -244 1029 -988 661 -165 250 -617 -275 90 -710 964 -103 -350 420 878 -1365 -480 1136 454
5291 454 -571 -525 496 433 -645 -614 279 -410 -595 -271 554 500 -24 -99 1131 742 -593 794 295 594
5311 594 -14 154 578 656 -6 -612 -465 286 372 528 -278 63 -321 532 -182 -314 278 187 -304 -104 338
5332 338 158 -321 -107 346 182 -226 61 713 -599 286 559 -65 983 -61 -379 626 335 9 -818
5351 -818 653 167 -14 1024 622 28 -346 -39 1149 160 375 -127 817 1215 12 -300 370 538 296
5370 296 588 561 -68 31 451 383 578 -167 -317 -397 -68 376 664 301 -296 833 165 3 -203 656 220
5391 220 299 322 807 21 -108 102 -321 704 -298 -80 400 -9 -44 413 863 -591 -546 -41 -14 697 499
5412 499 -466 119 13 289 -22 573 23 359 -552 205 717 220 -966 -102 -290 303 -214 -69 -165 388
$$ packed form
5273b44J273k017J649q26M15q67L42L65q00J674j067k47P70M58k243Q85J616o82
5291D54j025M6J021o3j078L1Q93o89j85L24Q25n4n24p5J230l89j335J387m99K99
5311E94o08J68M24P8o62o06J47P51Q6J56q06L41l84Q53p14j32N92r1m91K00M42
5332C38j80m79K14M53j64m08K87O52j312Q85K73o24J048j044l18J005k91l26q27
5351h18J471m86j81J038m02n94l74L07J188r89K15n02R44L98j203l12O70J68k42
5370B96K92k7o29R9M20o8J95p45j50q0L29M44K88l63n97J129o68j62k06Q59m36
5391B20P9K3M85p86j29K10m23J025j002K18M80m09l5M57M50j454M5N05K7P11j98
5412D99r65N85j06K76l11N95n50L36r11P57N12m97j186Q64j88N93n17J45r6N53
$$ plain form
5432 388 -254 513 308 278 437 9 -254 455 596 -930 407 772 -521 -384 -169 -141 105 -279 -578 -717
5452 -717 75 -666 -236 -37 -925 -169 -421 -642 989 -300 -385 -830 450 352 788 -27 -682 -218 -630 -197
5472 -197 -1012 266 49 -673 46 111 -608 -757 -473 738 -308 -690 -127 -119 294 -926 254 428 -107
5491 -107 -516 -814 -442 31 -650 -505 -125 -296 -583 -131 -274 274 83 -382 108 -262 -619 -838 -611 246
5511 246 -62 -849 -886 -181 -103 -986 205 3 303 78 -396 -529 453 352 -229 -186 -342 96 -401 -224 245
5532 245 -160 -150 -145 -14 -46 -10 232 340 232 -322 -293 -533 411 -346 -152 -684 55 -353 -298 685 -536 -26
5554 -26 -1000 5 182 -402 -245 145 283 -336 -250 -429 -707 686 -275 -460 595 -82 582 -36 311 855
5574 855 871 -350 120 374 154 -33 -153 1321 568 -440 358 852 -142 -226 19 -384 -96 -464 150 819
$$ packed form
5432C88o42P67k05l0J59m28k63P09J41j526J337L65j293J37K15K8K46l84k99j39
5452g17P92p41M30J99q88P56k52k21J631j289q5m45J280r8M36q15o55M64m12M33
5472a97q15J278k17p22P19O5p19j49K84J211j046l82N63QM13j220J180J74n35
5491a07m09k98L72M73o81J45L80j71k87M52j43N48j91m65M90l70l57k19K27Q57
5511B46l08p87l7P05P8q83J191k02L00k25m74j33R82j01n81M3j56M38m97J77M69
5532B45m05J0NJ31l2L6K42J08j08n54K9k40R44p57J94n32P39m08N5R83j221N10
5554b6r74J005J77n84J57L90J38o19Q6j79k78J393r61j85J055o77O64o18L47N44
5574H55J6j221M70K54k20j87j20J474p53j008P98M94r94q4K45m03K88l68O14O69
$$ plain form
5594 819 268 -565 -170 537 216 -138 -411 83 573 -192 -689 -1 455 -16 286 -263 401 86 -60 133
5614 133 173 767 656 -260 -202 -291 145 41 -128 323 471 82 505 469 -441 -391 526 3 -192 -197 -17 99
5636 99 419 -334 -369 -5 432 265 179 603 721 -83 -498 234 404 369 -322 367 271 -151 -411 181 -110 -328
5658 -328 410 -401 -364 21 46 473 275 497 -706 -293 319 116 8 -427 842 487 -490 -1076 -27 -227
5678 -227 632 -235 123 408 -607 -139 -198 -135 366 -1077 -452 -183 -516 -111 -63 203 -107 38 -350 -257 180
5699 180 65 -335 -283 473 -77 -700 251 -238 53 -1101 -25 -66 -655 -488 -482 248 300 -36 -259 491 148
5720 148 -596 -33 55 -191 -492 29 -392 -334 -329 2 -186 -288 -1220 -676 118 -58 -325 -150 -646 721 207
5741 207 -414 -541 364 343 -713 165 426 -23 731 -165 410 -115 -222 -3 -132 -186 -255 -666 538 -506
$$ packed form
5594H19n51q33L95P07l21l54k73M94M90p65m97O88M56m71L02n49O64l15j46J93
5614A33M0N94j11r16N8q9M36j04j69M51J48l89M23l6r10N0R17n23j95nJ80J16
5636I9L20p53l5L64M37j67q6M24J18q04m15P32J70l5o91O89r6m22k60N92k91k18
5658c28P38q11L7L85K5M27j98K22j203M13O12k03j08m35J269l55r77n86J049k00
5678b27Q59q67L58K85j015M68n9O3N01j443O25K69l33M05M8K66l10J45l88R3M37
5699A80j15m00N2P56n50o23R51m89K91j154J076m1n89J67OP30N2l36k23P50l43
5720A48p44N63Q8k46l01N21m21N8NL31j88j02r32N44P94j76k67J75m96J367n14
5741B07o21j27R05k1j056Q78K61m49P54q96N75n25j07K19j29n4o9m11J204j044
$$ plain form
5761 -506 125 -711 -159 -413 -258 -518 -644 207 -9 -598 -535 405 112 -63 -207 105 105 -130 -640 -131 593
5782 593 -254 -313 -133 143 -133 97 -567 228 138 -214 63 108 -258 -432 -635 -156 101 -467 -170 -124 468
5803 468 -417 387 45 -163 322 423 79 402 -304 -693 -129 562 -495 -243 250 37 -64 -17 -201 -98
5823 -98 96 -119 66 29 11 340 406 1033 -438 228 -191 -346 981 405 -30 -204 360 -225 -709 197 112
5844 112 103 293 -86 217 -265 196 7 -526 715 -744 -688 372 236 -46 -56 -38 -98 -174 51 254 470
5865 470 560 96 68 -325 -625 602 -234 541 319 -377 -360 731 -130 261 -613 -58 282 -388 -541 80
5885 80 372 673 -364 160 -582 126 289 187 -192 248 434 -551 269 405 426 -89 50 404 247 308 -324
5906 -324 846 190 -500 368 -206 104 434 -55 351 159 87 199 302 549 -97 -792 -202 368 135 -593
$$ packed form
5761e06O31q36N52k54J55k60j26Q51k16n89O3R40k93j75j44L12%k35n10N09P24
5782E93q47n9J80K76k76K30o64P95r0l52K77M5l66j74k03M79K57n68K97M6N92
5803D68q85Q04l42k08M85J01l44L23p06l89N64O91j057K52M93k13j01M7j84J03
5823i8J94k15J85l7j8L29O6O27j471O66m19j55J327n76m35j74N64n85m84R06q5
5844A12rJ90l79L03m82M61j89n33J241j459N6J060j36k82j0J8o0p6K25K03K16
5865D70R0m64k8l93l00J227q36P75k22o96J7J091q61L91q74N55L40o70j53O21
5885H0K92L01j037N24p42P08J63j02l79M40J86r85Q20J36K1n15J39L54j57O1o32
5906c24J170o56o90Q68n74L10L30m89M06j92p2J12J03K47o46o95N90N70k33p28
$$ plain form
5926 -593 135 238 -443 -100 341 332 -19 -216 -289 973 845 -35 -18 -60 865 559 343 585 245 674 -120
5947 -120 348 -872 -74 -280 -278 328 10 3 482 349 -105 366 722 -401 466 -12 -659 581 201 -583
5967 -583 -427 -144 266 139 -336 -219 -129 -710 -363 -190 239 131 -814 -594 -150 -368 -523 262 419 -479
5987 -479 -155 -259 -267 -82 -588 -502 98 335 42 -65 -253 199 261 -546 137 -244 -217 211 87 169 1058 -812
6009 -812 -353 -486 -407 -796 -980 -72 -796 137 -613 352 -244 -412 -761 498 -48 24 -102 -385 -83 -238
6029 -238 -512 -392 -176 291 -377 112 -103 -121 -497 -107 215 -421 296 -1112 -476 404 216 -246 -456 -138
6049 -138 191 -226 178 235 -441 -449 -340 58 -316 -953 -132 151 9 -294 174 135 -67 23 -179 -538 -79 -45
6071 -45 91 605 2 443 -771 140 181 -113 365 182 475 493 330 -182 224 467 -510 -120 -46 232 146
$$ packed form
5926e93P28J03o81L43M41rl51j97p3J262j28q80J7m2R25l06k16K42l40M29p94
5947a20M68j220P98k06KO06l18pM79j33m54M71L56j123Q67m78o47J240l80p84
5967e83J56K83M10j27m75J17R0n81L47J73M29j08r45K20M44k18j55P85J57q98
5987d79L24j04qJ85n06Q6O00K37k93j07j88M52O2q07O83l81K7M28j24Q2Q89j870
6009h12M59j33P9l89j84R08p24R33p50R65n96j68l49J259n46P2j26k83L02j55
6029b38k74J20K16M67o68M89k15j8l76L90L22o36P17j408O36Q80j88m62k10L18
6049a38L29m17M04N7o76qJ09L98l74o37Q21K83j42l03M68l9k02R0k02l59M59L4
6071d5J36N14o03M41j214R11M1k94M78j83K93J8j63n12M06K43r77L90P4K78q6
$$ plain form
6092 146 -325 397 693 -6 -975 479 149 273 244 -780 1065 -79 -404 601 480 734 321 353 435
6111 435 -34 -172 -902 760 210 22 -365 115 481 237 199 66 579 441 -110 -217 471 -269 -346 -30
6131 -30 67 506 32 -292 125 324 524 -948 630 251 579 776 -126 358 18 452 55 533 494 -362
6151 -362 62 257 438 -224 -336 -71 458 -519 190 222 885 72 325 864 1042 -49 16 845 318 -30
6171 -30 -385 536 -918 906 197 -214 845 -75 -880 -369 533 -787 165 -214 399 259 96 122 225
6190 225 611 318 -297 -200 -313 331 639 -578 85 -545 409 -212 326 -143 -363 -373 474 -200 71 231
6210 231 292 434 545 -445 -57 787 -188 949 358 223 171 168 -387 111 330 -325 -156 -25 -669 -297 -59
6231 -59 -134 43 -323 -425 -247 135 430 190 -295 372 -581 27 352 146 -291 167 168 40 30 -192 280 88
$$ packed form
6092A46m71P22K96o99r69J454l30J24k9j024J845j144l25J005j21K54m13L2Q2
6111D35m69j38p30J662n50j88l87M80L66k44l8j33N13j38n51j07O88p40p7L16
6131c0R7M39m74l24M17J99K00j472J578l79L28J97r02M84l40M34l97M78l9q56
6151c62M24J95J81o62j12K65N29r77P09L2O63q13K53N39J78j091O5Q29n27l48
6171c0l55R21j454J824p09m11J059r20q05N11R02j320R52l79O13j40j63K6J03
6190B25L86k93o15R7j13O44L08j217O63o30R54o21N38m69k20j0Q47o74K71J60
6210B31O1J42J11r90L88Q44r75J137n91j35n2ln55M98K19o55J69J31o44L72K38
6231e9p5J77l66j02J78L82K95k40m85O67r53O08L25k06m37M58Jj28j0k22M72j92
$$ plain form
6253 88 116 -60 -821 537 -663 -255 -497 -715 267 -51 -211 -375 252 -811 -83 121 698 0 23 -233
6273 -233 -691 -324 -559 -484 -461 -349 270 -281 -278 216 -683 -406 -387 -30 320 -626 -295 -11 -588 -235 -72 -51
6295 -51 320 79 -206 495 391 -214 247 543 173 -158 -224 214 273 -225 599 -10 47 -46 261 -152 -235 482
6317 482 144 -238 -96 641 -584 484 -311 -7 563 517 -393 402 390 -555 343 -29 122 -706 -298 -46
6337 -46 -765 -1023 307 -431 -134 126 287 -217 82 449 -192 58 336 217 699 609 -45 -397 -703 -264
6357 -264 174 -34 -104 143 7 -205 -412 540 19 -94 -190 -172 -405 223 159 -142 -489 374 80 -170 28
6378 28 346 -312 116 -197 -238 18 -77 519 159 371 119 129 -88 -480 103 128 -193 -226 72 457 161 -310
6400 -310 -298 -292 316 -75 465 176 -32 83 -42 18 497 33 213 -304 450 135 193 -622 -640 -24 190 18
$$ packed form
6253H8K8j76p61J358j200M08k42k18R82l18j60j64O27j063P28K04N77o98K3k56
6273b33m58L67k35P5K3J12O19n51LM94q99K77J9L57L50r46L31K84n77L53J63K1
6295e1L71k41k85P01j04o05M61K96l70l31o6M38N9m98Q24o09N7r3L07m13q3P17
6317D82l38l82J42P37j225J068p95L04N70m6r10P95j2r45Q98l72J51q28M08K52
6337d6p19k58J330p38K97K60J61n04K99L67o41K50K78j19M82r0o54l52l06M39
6357b64M38k08p0K47j36k12k07R52n21j13r6J8k33O28o4l01l47Q63k94k50J98
6378B8L18o58M28l13m1K56r5N96l60K12k52J0k17l92N83K5l21l3K98L85k96m71
6400c10J2OO08l91N40k89k08J15j25O0M79m64J80n17P54l15N8q15j8O16K14j72
$$ plain form
6422 18 356 507 -298 -30 -93 240 614 -116 -127 786 -135 -192 -56 -66 60 71 163 86 104 61 175 178 -239 -93
6446 -93 340 -516 -96 -22 275 -532 -203 -392 -107 139 -53 573 107 204 453 -138 -113 756 -367 -61 -96
6467 -96 -1050 -1040 1160 -261 -126 73 -63 490 -286 38 1413 583 -502 295 190 9 -44 -186 457 353
6487 353 -669 -668 -179 -97 127 78 190 -191 -614 368 -850 401 348 -290 -184 -43 -101 28 95 42 -233 425
6509 425 -653 29 -12 -387 -535 -42 -340 -136 -160 40 1 -126 175 -268 -66 45 -376 -296 69 160 -164
6530 -164 22 29 -229 98 0 -312 -336 -50 -259 -728 -74 78 -260 -375 95 46 -294 -38 146 152 -152 -193 -244
6553 -244 44 -78 -36 344 -512 125 -315 121 275 444 -300 101 -8 36 2 -17 111 -75 -318 215 28
6574 28 -18 133 -380 152 279 -169 104 254 380 -1 227 -389 88 -147 -23 53 267 122 -305 78 158
$$ packed form
6422A8L38J51q05K68o3L33L74p30j1R13r21n7J36j0J26J1R2p7J8m3J14Lm17J46
6446i3M33q56M20P4K97q07L29j89K85K46j92O26m66R7K49n91K5Q69j123L06l5
6467i6r54J0K200j421J35J99j36N53p76L24J375q30j085P97j05j81n3j42O43j04
6487C53j022JM89Q2K24m9J12l81m23R82j218J251n3o38J06J41n8J29O7n3k75O58
6509D25j078O82m1l75j48M93k98K04k4K00l9j27L01m43K02J11m21Q0L65R1l24
6530a64J86Pk58L27r8l12k4K86k09m69O54J52l38j15M70m9l40K56J84Ol04m1n1
6553b44K88j22M2L80q56O37m40M36J54J69p44M01j09M4l4j9J28j86k43N33j87
6574B8m6J51n13N32J27m48K73J50J26l81K28o16M77k35J24P6K14j45m27L83Q0
$$ plain form
6595 158 -114 -213 -238 196 -48 -319 162 219 -78 -170 31 46 194 154 -228 226 262 -3 -461 36 493 251
6617 251 -104 47 -94 362 205 -45 105 -53 123 33 127 38 -4 -237 150 -37 -293 -733 -99 337 -155
6638 -155 81 160 52 -168 -93 -155 379 -156 -41 -259 -66 596 -431 -123 269 -24 -122 -20 297 51 114
6659 114 265 348 434 90 -213 -48 297 2 -162 275 463 -168 424 36 382 254 36 149 124 53 271
6680 271 25 356 147 177 13 -36 81 241 167 -80 286 -159 -139 -84 338 288 180 -142 -93 -44 36 -296 33
6703 33 3 221 -65 435 22 -250 150 380 388 111 -630 352 -271 88 -130 -2 92 -531 -37 -111 122 -56
6725 -56 -205 -302 -132 335 -313 -199 -47 -2 29 -469 215 416 -98 109 145 239 0 106 -222 328 169 -306
6747 -306 328 257 -365 -6 -266 293 -197 -20 -189 302 294 -268 17 -66 595 -350 -272 -91 427 -133 -357 203
$$ packed form
6595A58k72r9k5M34k44k71M81N7k97r2K01J5J48m0l82M54L6k65m58M97M57k42
6617B51l55J51j41M56j57k50J50j58J76r0R4q9m2k33L87j87k56m40O34M36m92
6638a55K36P9j08k20P5o2N34n35J15k18J93O62j027L08L92k93r8J02L17k46O3
6659A14J51Q3Q6l44l03J65L45k95j64M37J88o31N92l88L46j28k18J13k5p1K18
6680B71k46L31k09L0j64m9J17J60p4k47L66m45K0N5M22n0j08l22M9M9Q0l32L29
6703C3l0K18k86N00m13k72M00K30Qk77p41R82o23L59k18J28R4o23M94p4K33j78
6725e6j49r7J70M67o48J14J52M5L1m98O84K01n14K07L6R4k39J06l28N50j59m75
6747c06O34p1o22L59k60N59m90J77j69M91qn62K85q3O61r45P8J81N18n60k24N60
$$ plain form
6769 203 490 -17 -41 235 -276 70 -23 -191 -188 -98 -226 -104 -163 -38 28 -549 174 -138 -252 -594 452 4
6791 4 -347 85 -572 -357 481 -207 -615 -167 -165 -13 -544 -50 -48 353 -21 -308 -433 -158 -73 187 149 -306 -214
6814 -214 101 -140 105 235 -11 -622 214 -117 -257 -267 -426 296 176 -129 26 -386 -148 84 400 19
6834 19 257 -67 -130 234 -316 -182 630 -221 419 409 336 218 -293 21 -103 -167 -245 256 35 -207 368 143
6856 143 253 -140 33 -173 42 -138 66 -158 672 215 493 19 183 478 -60 -472 34 171 -27 -119
6876 -119 84 112 456 531 -278 553 166 200 -337 -24 -302 128 -304 385 82 394 -175 561 -162 680 43
6897 43 -18 345 -545 -83 90 241 208 -73 330 -5 -525 -299 172 250 340 147 -232 -73 147 103 214 -67
6919 -67 413 105 -73 76 -236 -446 37 175 221 570 -859 664 1171 156 -255 104 -505 212 -56 154
$$ packed form
6769B03K87n07k4K76n11L46r3j68LR0j28J22n9J25O6n77P23l12j14l42J046m48
6791Dl51M32o57K15Q38o88m08M48KJ52n31M94KM01l74k87j25K75Q5K60l8m55R2
6814b14L15k41K45J30k46o11Q36l31j40j0j59P22j20l05J55m12K38K32L16l81
6834A9K38l24o3L64n50J34Q12q51O40j0p3j18n11L14j24o4p8N01k21k42N75k25
6856A43J10l93J73k06K15j80K04k24Q30m57K78m74J64K95n38m12N06J37j98r2
6876a19K03K8L44P5q09Q31l87L4n37L13k78M30m32O89l03L12n69P36p23Q42o37
6897D3o1L63q90M62J73J51l3k81M03l35n20K26M71P8R0j93l79J59K20m4J11k81
6919f7M80l08j78J49l12k10M83J38M6L49j429J523N07j015m11L59o09P17k68K10
$$ plain form
6939 154 -184 451 -496 -22 128 665 24 -259 -143 781 437 50 311 429 45 4 -52 -268 -391 -211 -208
6960 -208 -248 -310 406 234 -79 -259 23 83 -29 -6 -170 -75 -140 -381 354 312 267 471 318 61 -164 1044
6982 1044 393 -80 -361 525 -90 -502 -24 -93 -300 78 630 43 106 -236 -275 344 258 -408 -338 -284 97 -6
7004 -6 193 559 210 198 -527 158 434 558 163 -406 -220 -385 396 197 168 131 410 -63 -606 50 185 -82
7026 -82 362 219 3 -343 -387 -109 -345 822 -2 90 631 -377 -891 -744 -195 337 -254 215 -267 -227 -204
7047 -204 -228 -366 231 -412 -362 -3 -10 -396 -28 -253 511 6 -75 -18 -378 252 -464 -511 -194 636 103 475
7069 475 -14 -19 4 -417 -571 -343 -261 -78 -106 121 -337 -218 437 -241 149 -41 195 117 -147 -442 142 -41
7091 -41 -35 9 39 119 282 -481 -39 284 -198 -56 -639 -93 -571 -552 8 -451 142 -114 -269 45 -251 -164 -104
$$ packed form
6939A54l38O35r47M74J50N37o41k83J16R24l44l87K61J18l84m1n6k16j23J80L
6960b08m0o2P16j72l13j80K82O0j12K3j64R5o5k41P35m2m5K04j53k57k25J208
6982A044o51m73k81Q86o15m12M78o9k07L78N52n87O3l42l9O19q6o66P0N4L81j03
7004fJ99L66l49j2p25O85K76J24l95n69J86j65P81j99k9l7K79m73n43O56J35k67
7026h2M44j43k16l46m4K78k36J167q24R2N41j008n14J47N49N32n91M69m82M0K3
7047b04k4j38N97o43N0L59pl86L68k25P64n05q1N7l60O30p16m7L17Q30n33L72
7069D75m89nK3m21j54K28Q2J83k8K27m58J19O55o78L90j90K36p8k64k95N84j83
7091d1OM4L0Q0J63p63M42L23m82J42n83N46m78J9N60m59N93k56j55L14k96Q7O0
$$ plain form
7114 -104 -169 468 322 -221 122 10 2 317 -179 -84 507 579 231 -193 712 -41 447 91 -35 -319 320 -44
7136 -44 482 -389 153 -550 -396 34 -169 493 314 -85 -307 -599 336 584 318 -65 266 -69 -210 -261 471
7157 471 386 82 -235 129 -348 -67 732 -197 -188 -47 -80 122 -250 -718 327 -54 -92 333 350 -328 684
7178 684 -208 -371 220 937 190 -318 66 -339 674 106 217 68 -538 243 -233 -95 303 485 -450 -120
7198 -120 11 706 -673 -144 577 651 122 -390 337 276 -780 270 -318 307 107 270 186 830 345 304
7218 304 558 -887 653 -101 -329 21 -879 -311 -889 355 474 572 125 -889 414 299 -243 -659 -173
7237 -173 158 297 -146 472 25 238 191 151 -5 -769 -187 -37 -502 -314 -156 -258 -529 -200 288 22 254
7258 254 348 -253 570 227 -86 -376 152 -110 376 583 368 -369 -343 -140 -726 137 -264 -412 236 221 515
$$ packed form
7114a04o5O37j46n43L43j12qL15m96R5N91P2l48m24R05p53M88l56j26k84O39l64
7136d4N26q71N42p03J54M30k03O62j79l99k22k92R35K48k66l83L31l35j41n1P32
7157D71q5l04l17L64m77K81P99r29RJ41l3K02l72m68J045l81l8M25J7o78J012
7178F84q92j63N91P17p47n08L84m05J013n68J11j49o06P81m76J38L98J82r35L30
7198a20J31O95j379N29P21P4n29n12P27o1j056J050n88O25k00J63q4O44m85m1
7218C04K54j445J540p54k28L50r00N68n78J244J19R8m47j014J303j15n42m16M86
7237a73L31J39m43O18m47K13m7m0j56p64N82J50m65J88J58j02k71L29M88k66K32
7258B54R4o01Q23l43l13k90N28k62M86K07k15p37K6K03n86Q63m01j48O48j5K94
$$ plain form
7279 515 -228 -379 785 380 324 -38 -167 109 -552 63 134 -91 162 -194 659 -943 171 378 -861
7298 -861 127 384 -519 13 33 -134 -273 -29 -177 657 776 -872 -560 264 237 760 374 212 -152 189
7318 189 -622 739 129 -497 130 -570 637 -421 -602 215 -275 -262 162 302 521 347 -285 473 476 33
7338 33 682 96 -206 -430 -230 411 36 253 95 -549 -310 93 -210 -227 25 -39 -145 -743 -329 -133 342
7359 342 -263 95 314 -320 143 78 59 161 -248 251 173 -85 36 139 736 200 677 -702 662 -440
7379 -440 445 -484 349 -266 320 -46 -718 933 1014 -226 704 552 114 -138 257 -91 657 908 286 266
7399 266 -192 -30 263 589 43 57 -178 402 -326 292 667 -100 623 -52 -201 434 35 -292 1 -102
7419 -102 884 825 -162 444 -446 781 -1922 -523 480 581 123 -449 202 -109 376 474 276 232 447 -67
$$ packed form
7279E15p43j51J164m05n6l62j29K76o61O15P1k25K53l56Q53j602J114K07j239
7298h61R88K57r03N32K0j67j39K44j48Q34J19j648L12Q24k7N23l86j62l64L41
7318A89q11J361o10o26O27p00J207j058j81Q17m90J3M24J40K19j74o32P58Lm43
7338C3O49n86l02k24K00O41l75K17j58o44K39M03l03j7K52o4j06n98M14J96M75
7359C42o05L58K19o34M63o5j9J02m09M99p8k58J21J03N97n36M77j379J364j102
7379d40Q85r29Q33o15N86l66o72J651Q1j240R30j52m38k52L95l48P48K51o22k0
7399B66m58J62K93L26n46J4k35N80p28O18L75p67P23o75j49O35l99l27K93j03
7419a02R86n9r87O06q90J227k703J399J003J01m58n72O51l11M85R8j98m4K15n14
$$ plain form
7439 -67 -376 135 42 261 144 122 374 20 101 -437 623 891 -148 486 473 193 -123 -216 -219 -776 590 392
7461 392 -5 497 -115 -240 -133 637 -555 -312 372 515 -802 608 -488 510 367 -168 226 385 -472
7480 -472 55 -308 -646 261 167 -111 358 524 -13 135 398 -75 -276 -605 124 -168 -372 -1173 -70 751
7500 751 123 412 78 -439 -349 -20 225 560 767 13 -239 87 -207 308 -198 -360 -186 -270 -44 -119 123
7521 123 424 -409 11 1105 219 17 258 372 -841 73 594 -920 -134 -905 392 83 265 391 695
7540 695 471 45 -483 -403 -306 279 91 -323 187 -647 -290 -1356 -234 146 103 78 251 -193 -424 -156 226
7561 226 -483 -69 540 538 177 286 -1065 -443 -388 795 367 -867 206 651 186 -820 208 314 444
7580 444 -51 -192 -451 -242 -316 -251 674 -532 -407 -115 705 95 -521 -854 -146 -61 -714 -269 209 678 -480
$$ packed form
7439f7l09N11r3K19j17k2K52l54Q1n38J060K68j039O34j3k80l16r3ln57J366j98
7461C92l97N02o12j25J07P70j192K43O84J43j317J410j096R98j43n35L94J59q57
7480d72N27l63l38R07r4k78M69J66n37J48K63m73k01l29P29k92k04q01J103Q21
7500G51o28K89l34n17R0L29K45L35K07p54k52L26k94N15n06j62J74q4K26p5K42
7521A23L01q33M20J094q86k02K41J14j213R14N21j514P86p71J297l09J82J26L04
7540F95k24m26n28Q0R7N85j88m14N10q34L57j066J122L80m3k5J73m44k31K68L82
7561B26p09M14O09kl61J09j351O22N5J183m28j234J073M45m65j006J028J06J30
7580D44m95j41k59K09p4O5R25j206J25K92Q20o10o16l33P08Q5o53M45M78M69j158
$$ plain form
7601 -480 811 230 -506 -268 -291 42 436 -179 66 -907 266 -408 425 -216 833 -791 -628 -810 -211
7620 -211 -669 168 -892 826 466 -572 97 -926 65 -702 291 875 -767 -693 -481 -783 -219 557 -128
7639 -128 -9 96 275 -88 -558 333 -664 460 102 -9 18 340 122 220 -610 578 -653 -400 299 295
7659 295 -497 103 110 -493 591 -439 648 -1151 248 -255 406 360 -907 -858 -1507 -100 -277 761 -381
7678 -381 366 256 278 477 -134 320 47 248 643 -118 -394 173 -21 141 187 443 230 -492 -732 -419 -43
7699 -43 -514 -808 -830 700 356 -510 -12 -299 -173 392 -279 214 130 -234 65 99 174 -812 45 303 -172
7720 -172 22 -300 -50 247 71 -218 -213 -117 959 1205 -237 154 46 570 590 -720 69 292 944 -288
7740 -288 -415 256 89 -498 -529 972 333 9 -556 101 -44 419 -422 1149 -230 171 -674 72 1067
$$ packed form
7601d80J291n81p36K38k3L33L94o15K45r73J173o74Q33o41J049j624J63j82N99
7620b11m58Q37j060J718l60j038O69j023R91p67R93N84j642P4K12l02N64P76o85
7639a28J19J05J79l63m70Q91r97J124l58j11K7L22k18R8q30J188j231K53O99m
7659B95p92O00Po03J084j030J087j799J399n03O61m6j267M9o49J407j77J038j142
7678c81P47j10K2J99o11M54k73K01L95p61k76N67j94J62M6K56k13p22k40L13L76
7699d3m71k94k2J530l44q66M98k87J26N65o71M93q4l64K99L4P5r86Q57K58m75
7720a72J94l22K50K97j76k89NR6J076K46j442L91j08N24K0j310P89K23O52j232
7740b88j27O71j67n87l1J501o39l24n65O57j45M63q41J571j379M01q45P46R95
$$ plain form
7759 1067 -916 -769 -68 146 -676 179 -484 430 81 -527 745 304 -425 181 -99 -101 -297 32 646 533
7779 533 -120 -485 1251 121 168 -819 709 993 516 -680 149 557 -166 -444 418 -166 -347 -196 -236
7798 -236 -63 -289 -875 -692 -230 -79 -118 -133 -257 274 558 -531 398 103 -409 196 -641 -631 392 -108
7818 -108 -418 179 -815 -861 -1105 204 170 -414 -152 -468 565 -1113 181 4 572 551 -1041 345 -585
7837 -585 -157 -170 311 -106 196 -328 -189 -548 41 -9 -825 314 -506 -382 430 212 235 -510 -69 -712 450
7858 450 898 -98 467 272 283 344 -74 937 90 165 -640 -76 -426 129 -87 390 39 -281 -641 -170 147
7879 147 177 -160 216 -224 242 -71 -131 -413 284 -42 407 -129 -497 -48 94 608 621 191 -38 231 118
7900 118 -193 -836 202 -213 767 -44 307 789 534 -256 60 -593 45 -1063 186 -24 16 9 467 9
$$ packed form
7759A067j983J47P01K14q22Q55o63R14l49o08J272m41p29O06k80kj96L29O14j13
7779E33o53l65J736j130M7r87J528K84m77j196Q29M08p23k78Q62n84j81J51m0
7798b36J73k26n86J83M62J51l9j5j24N31K84j089R29k95n12O05q37J0J023n00
7818a08l10N97r94m6k44J309l4n84K62l16J033j678J294j77N68k1j592J386r30
7837e85M28j3M81m17L02n24J39l59N89n0q16J139q20J24Q12k18K3p45M41o43J162
7858D50M48r96N65j95J1O1m18J011q47P5q05N64l50N55k16M77l51l20l60M71L17
7879A47L0l37L76m40M66l13o0k82O97l26M49n36l68M49J42N14J3m30k29K69j13
7900A18l11o43J038m15R80q11L51M82k55p90L16o53O38j108J249k10M0pM58m58
$$ plain form
7920 9 390 -636 -871 179 -160 -594 807 333 -201 326 -677 111 160 -5 -357 114 -130 975 -226
7939 -226 91 244 87 -72 331 520 -71 -757 324 431 769 -15 804 -147 -217 828 48 155 -102 -400
7959 -400 -260 -5 144 -94 522 -436 -690 153 167 -147 -564 -9 205 -33 207 255 685 -361 488 286
7979 286 204 -18 -16 -295 355 -544 -169 168 -724 -168 425 -210 86 -204 418 789 76 419 39 -609 33
8000 33 -298 -342 -308 -288 559 320 -63 5 133 525 -548 -704 -317 -153 -367 52 -128 -126 360 -624 756 473
8022 473 274 -998 -459 -455 520 140 -216 -416 -304 -6 -151 -49 -847 443 451 503 -1034 -163 -76 -181 -54
8043 -54 -342 -161 -350 -190 -202 -506 -77 290 -586 683 -189 -472 212 -245 -23 -648 263 -157 -149 106 678
8064 678 242 -229 481 -416 -285 345 347 110 -401 522 -180 -409 465 -313 -74 -966 1606 276 -5 759
$$ packed form
7920IL81j026k35J050l39m34J401m74n34N27j003P88M9j65l52M71k44J105j201
7939b26L17J53j57j59M03J89n91o86J081J07L38p84Q19r51p0J045p80J07k57k98
7959d00J40K55J49k38O16r58k54Q43J4l14m17N55K14k38K40M8M30j046Q49k02
7979B86q2k22Kk79O50q99L75L37q92N56N93o35K96k90O22L71p13L43l80o48O42
8000C3l31m4L4K0Q47k39l83O8J28L92j073j56L87J64k14M19j80KM86r84J380k83
8022D73j99j272N39MR75l80l56k00J12K98j45J02p98J290QN2j537Q71Q7j05J27
8043e4k88J81j89J60j2l04M29L67q76J269q72k83O84m57K22o25R11m20QK55N72
8064F78m36m71P10q97J31O30Kk37n11R23p02k29Q74p78K39q92K572j330k81P64
$$ plain form
8084 759 -43 480 265 -534 220 -454 753 770 -839 -650 332 145 -422 -307 106 273 -276 -110 -20 -22 179
8105 179 -137 -405 -252 -61 432 391 906 -97 -651 47 -630 19 -101 1003 320 342 -35 -272 -820 -372
8125 -372 660 -178 -289 -242 -920 -19 262 137 46 200 70 86 -405 128 560 -226 147 -405 342 282 156
8146 156 -554 -427 280 9 -512 -417 139 1158 -498 381 -579 789 812 553 -528 20 -157 -110 -227 -402
8166 -402 472 146 799 -734 583 -111 -55 -747 1024 -534 -131 648 -677 582 136 244 1267 -998
8184 -998 539 -304 1133 454 17 631 -292
$$ packed form
8084G59q02N23k15p99P54o74J207J7j609J89R82j87n67J15M13J67n49J66R0kK01
8105A79l16k68J53J91M93m1N15j003n54O98o77O49j20J104o83K2l77k37n48M48
8125c72J032q38j11M7o78R01K81j25r1J54j30J6m91N33M32p86L73n52P47o0j26
8146A56p10J27P07k71n21R5N56J019j656Q79r60J368K3k59j081N48j77M7j17j75
8166d02Q74l26O53j533J317o94N6o92J771j558M03P79j325J259m46J08J023k265
8184i98J537q43J437o79m37O14r23
8191b92
$$ Imaginary data points
##PAGE= N=2
##DATA TABLE= (X++(I..I)), XYDATA
$$ plain form
0 0 0 0 0 0 0 0 5 -8 8 -8 15 -16 23 -24 31 -39 42 -49 63 -71 84 -95 112 -130 150 -170 195 -223 249 -282
30 -282 319 -359 400 -448 500 -556 619 -687 763 -845 936 -1036 1148 -1272 1408 -1563 1738
47 1738 -1933 2163 -2429 2743 -3122 3586 -4176 4949 -6013 7578 -10118 14932 -27312 126007
61 126007 221799 -66244 -78885 90182 145214 -29190 -63048 89636 145305 -28980 -105252
72 -105252 45396 156412 23380 -95359 1868 124417 35027 -82678 -5885 125712 64739
83 64739 -69448 -36559 92486 68765 -47916 -32782 91306 80723 -48345 -57327 71088
94 71088 92449 -34515 -73278 43339 90095 -23862 -82689 24909 99444 3486 -86780
105 -86780 -13487 74893 10424 -74585 -8177 89114 25034 -89347 -40467 87441 64796 -60048
$$ packed form
0@%%%%%%Nj3J6j6K3l1L9m7N5p0Q1r1J12j34J55j79K07k42K80l20L65m18M72n31
30b82O01o78P59q48R48j056J175j306J450j608J781j972K184k420K680k971L301
47A738l671M096m592N172n865O708p762R125j0962J3591j7696K5050m2244J53319
61A26007R5792k88043j2641J69067N5032j74404l3858J52684N5669j74285p6272
72a05252J50648J11016j33032j18739R7227J22549q9390j17705P6793J31597o0973
83F4739j34187L2889J29045k3721j16681J5134J24088j0583j29068q982J28415
94G1088K1361j26964l8763J16617M6756j13957n8827J07598P4535r5958r0266
105h6780P3293Q8380o4469q5009O6408R7291o4080j14381M8880J27908k2645j24844
$$ plain form
117 -60048 -62853 47962 59056 -41542 -50772 55178 73337 -43181 -83904 25533 81668
128 81668 -18604 -85880 5824 82933 -1855 -90608 -18509 83440 25761 -82186 -45489
139 -45489 62755 40727 -64479 -47424 65507 63166 -53577 -71913 36611 69598 -26089
150 -26089 -65489 23371 69057 -15318 -71613 2798 68512 4309 -67569 -21472 44889 2535
162 2535 -59788 -14065 55640 10874 -74695 -46399 40766 26500 -56427 -53352 24889 26144 -51041
175 -51041 -55978 23811 36676 -49254 -75996 4666 43092 -32042 -77991 -6268 49951 -14154
187 -14154 -81100 -30734 38411 -1362 -72051 -37963 35710 11402 -66058 -49207 31645 26508
199 26508 -53855 -61220 14330 28912 -38556 -57348 13324 41519 -26432 -67994 -9570 40690
$$ packed form
117f0048k805J10815J1094j00598r230J05950J8159j16518m0723J09437N6135
128H1668j00272o7276R1704P7109q4788q8753P2099J01949n7679j07947L6697
139d5489J08244k2028j05206J7055J12931k341j16743j8336J08524L2987r5687
150b6089l9400Q8860M5686q4375n6295P4411O5714o4203p1878M6097O6361m2354
162B535o2323M5723O9705m4766q5569K8296Q7165j4266q2927L075P8241J255p7185
175e1041m937P9789J2865q5930k6742Q0662L8426p5134m5949P1723N6219o4105
187a4154o6946N0366O9145l9773p0689L4088P3673k4308p7460J6851Q0852n137
199B6508q0363p365P5550J4582o7468j8792P0672K8195o7951m1562N8424N0260
$$ plain form
211 40690 -6794 -57635 -17791 35345 -32 -53035 -18511 42801 14973 -55314 -43077 26664
223 26664 31332 -28690 -38908 15569 28980 -22555 -40103 10319 32926 -14956 -44065 -668
235 -668 33502 -898 -35480 -6078 29548 3171 -37252 -18366 23348 12919 -25506 -16022 23164
248 23164 15809 -25453 -22561 18646 21564 -18858 -27221 11102 24582 -9370 -26049 6928 27854
261 27854 -5148 -34504 -9570 21912 4425 -25100 -9731 19809 4932 -27790 -19316 15351
273 15351 12635 -22241 -26148 7471 18539 -8303 -21365 3252 17924 -5175 -22029 -1954
285 -1954 17692 3108 -14486 41 21146 11131 -12065 -7520 15456 14250 -7282 -8427 14407
298 14407 19967 2202 -4732 11308 19053 3405 -6326 7503 21158 12419 -85 7637 23800
$$ packed form
211D0690m7484n0841L9844N3136l5377n3003L4524O1312k7828p0287J2237O9741
223B6664M668o0022j0218N4477J3411n1535j7548N0422K2607m7882k9109M3397
235f68L4170l4400l4582K9402L5626k6377m0423J8886M1714j0429l8425R484L9186
248B3164p355m1262K892M1207K918m0422q363L8323J3480l3952j6679L2977K0926
261B7854l3002k9356K4934L1482j7487k9525J5369K9540j4877l2722Q474L4667
273A5351k716l4876l907L3619J1068k6842j3062K4617J4672k3099j6854K0075
285a954J9646j4584j7594J4527K1105j0015k3196M545K2976j206k1532j145K2834
298A4407N560j7765o934J6040P745j5648r731J3829J3655q739j2504P722J6163
$$ plain form
311 23800 20570 4825 5318 19691 20461 6740 5988 21559 28700 16945 8627 15588 22529 16078
325 16078 6957 13410 24432 18933 6787 11120 25210 23334 8421 4923 16372 20651 9327
338 9327 4153 16288 25082 14627 3768 12340 24105 13673 -1754 5722 23847 20607 1687
351 1687 2640 21341 21243 640 -5294 13798 21342 751 -10673 8117 23886 6169 -12115 1489
365 1489 20233 5179 -17703 -7039 18391 12604 -13729 -11387 15213 15377 -13230 -19399 8855
378 8855 17824 -9993 -22370 5728 22450 -3016 -23718 -925 20724 -766 -26924 -9635
390 -9635 19966 7757 -22939 -12972 19569 11369 -23680 -22030 12443 14215 -19379 -23479 10639
403 10639 20319 -12781 -26449 5077 21749 -9615 -31497 -2336 25153 898 -27255 -4908
$$ packed form
311B3800l230j5745M93J4373P70j3721p52J5571P141j1755q318O961O941o451
325A6078r121O453J1022n499j2146M333J4090j876j4913l498J1449M279j1324
338I327n174J2135Q794j0455j0859Q572J1765j0432j5427P476J8125l240j8920
351A687R53J8701r8k0603n934J9092P544k0591j1424J8790J5769j7717j8284J3604
365A489J8744j5054k2882J0664K5430n787k6333K342K6600J64k8607o169K8254
378H855Q969k7817j2377K8098J6722k5466k0702K2793K1649k1490k6158J7289
390i635K9601j2209l0696R967L2541q200l5049J650L4473J772l3594m100L4118
403A0639R680l3100j3668L1526J6672l1364k1882K9161K7489k4255k8153K2347
$$ plain form
415 -4908 26679 6166 -29409 -14040 23098 12493 -25649 -19169 21073 20608 -20332 -26133 13573
428 13573 21903 -19828 -33731 8087 26774 -11380 -35915 -197 29005 -4052 -39286 -12361
440 -12361 23766 111 -37389 -16533 28023 11052 -37136 -27188 21108 16387 -32631 -34756 12814
453 12814 21861 -25041 -38474 7735 26272 -19680 -46658 -5375 24850 -12494 -47113 -11146
465 -11146 28862 -1707 -44260 -19829 24613 4276 -43353 -28793 21958 15989 -34438 -32628
477 -32628 18843 22863 -27953 -38514 11919 27593 -22098 -42173 6629 34389 -9492 -42683
489 -42683 -4327 32399 -4035 -44904 -14648 30993 7692 -39807 -19599 30873 15696 -38570
501 -38570 -29838 27026 24894 -30736 -34269 21221 33326 -17204 -34263 14273 37287 -11806 -41338
$$ packed form
415d908L1587k0513l5575J5369L7138j0605l8142O480M0242m65m0940n801L9706
428A3573Q330m1731j3903M1818J8687l8154k4535L5718K9202l3057l5234K6925
440a2361L6127k3655l7500K0856M4556j6971m8188R948M8296m721m9018k125M7570
453A2814R047m6902j3433M6209J8537m5952k6978M1283L0225l7344l4619L5967
465a1146M0008l0569m2553K4431M4442k0337m7629J4560N0751n969n0427J810
477c2628N1471M020n0816j0561N0433J5674m9691k0075M8802K7760m3881l3191
489d2683L8356L6726l6434m0869L0256M5641k3301m7499K0208N0472j5177n4266
501c8570Q732N6864k132n5630l533N5490J2105n0530j7059M8536K3014m9093k9532
$$ plain form
514 -41338 5087 41410 632 -38267 -1726 42396 7464 -40554 -14029 36974 17049 -35831
526 -35831 -23397 33846 27150 -29069 -29038 26361 32511 -23713 -35523 18445 36761 -13700 -36130
539 -36130 12115 43361 -3590 -41134 -1703 40447 4849 -37302 -6926 40222 15443 -34876
551 -34876 -15434 35668 20544 -33515 -26270 29051 30027 -23600 -29185 24690 37231 -14037 -32349
564 -32349 16487 39386 -6945 -33970 11989 45873 6539 -31084 2009 43117 14429 -29507
576 -29507 -6266 42697 25249 -25617 -12459 39572 33893 -18659 -21383 30695 36152 -13622 -25395
589 -25395 25631 44817 -2525 -27846 16493 46219 5662 -30169 5807 46705 15292 -25971
601 -25971 591 45500 22224 -25988 -8721 39627 28387 -21719 -17025 33665 36842 -13094
$$ packed form
514d1338M6425L6323m0778l8899L6541M4122l4932m8018K6525N1003j9925n2880
526c5831J2434N7243o696n6219L1N5399O150n6224j1810N3968J8316n0461k2430
539c6130M8245L1246m6951l7544L9431M2150l5598m2151L0376M7148k4779n0319
551c4876J9442N1102j5124n4059P245N5321R76n3627n585N3875J2541n1268j8312
564c2349M8836K2899m6331k7025M5959L3884l9334l7623L3093M1108k8688m3936
576b9507K3241M8963j7448n0866J3158N2031n679n2552k724N2078N457m9774j1773
589b5395N1026J9186m7342k5321M4339K9726m0557l5831L5976M0898l1413m1263
601b5971K6562M4909k3276m8212J7267M8348j1240n0106M694N0690L177m9936
$$ plain form
613 -13094 -22722 26143 38575 -9473 -28239 16336 40034 -921 -27425 10146 41767 6107
625 6107 -30964 -1042 37036 12052 -28861 -9088 35396 21048 -26002 -17289 27869 23101 -23409
638 -23409 -25284 19697 26275 -16986 -27878 13553 28637 -11703 -34022 1438 26964 -5561
650 -5561 -33947 -3497 27401 2174 -32391 -10113 25080 6924 -31216 -18922 20459 13474
662 13474 -25205 -22452 18080 21439 -20997 -29375 9252 20633 -14209 -28122 4295 24863 -6536
675 -6536 -29136 -662 24434 -495 -29559 -8738 21687 6199 -25467 -12047 22829 13482
687 13482 -21617 -18769 14265 14666 -18102 -20764 12953 19530 -11968 -23789 6443 20009 -7822
700 -7822 -26654 -974 20659 -1550 -24314 -3950 21695 4607 -22340 -10810 16497 7250
$$ packed form
613a3094r628M8865J2432m8048j8766M4575K3698m0955k6504L7571L1621l5660
625F107l7071K9922L8078k4984m0913J9773M4484j4348m7050Q713M5158m768m6510
638b3409j875M4981O578m3261j0892M1431J5084m0340k2319L5460K5526l2525
650e561k8386L0450L0898k5227l4565K2278L5193j8156l8140J2294L9381o985
662A3474l8679K753M0532L359m2436q378L8627J1381l4842j3913L2417K0568l1399
675f536k2600K8474K5096k4929k9064K0821L0425j5488l1666J3420L4876r347
687A3482l5099K848L3034M01l2768k662L3717O577l1498j1821L0232J3566k7831
700g822j8832K5680K1633k2209k2764K0364K5645j7088k6947J1530K7307r247
$$ plain form
712 7250 -20616 -14138 16066 13278 -16098 -16934 10726 14514 -13132 -21703 4329 14846 -9054
725 -9054 -21373 863 15756 -4373 -23851 -6492 13026 -2181 -22662 -11592 11722 1856
737 1856 -19929 -13014 9271 4345 -19662 -19654 2691 6392 -13169 -17349 2166 7966 -12310 -21698
751 -21698 -3775 7843 -7224 -20658 -7295 6015 -3750 -17867 -7267 7371 -2284 -18179
763 -18179 -13151 3779 3688 -11038 -9894 5773 6194 -9875 -13408 2112 7102 -5890 -12613 -358
777 -358 9151 -963 -9777 -1362 8885 1153 -9578 -5223 5727 4946 -6182 -4248 7537 6294
791 6294 -5316 -6308 4316 6637 -2548 -5903 3024 8480 3098 -3824 2454 9036 3334 -5417 -1362
806 -1362 8670 6696 -1651 -1134 7236 6942 -928 -2735 4317 7588 -88 -4867 2621 9970 5238
$$ packed form
712G250k7866O478L0204k788k9376q36K7660L788k7646q571K6032J0517k3900
725i054j2319K2236J4893k0129j9478J7359J9518j5207k0481J1070K3314r866
737A856k1785O915K2285m926k4007QK2345L701j9561m180J9515N800k0276r388
751b1698J7923J1618j5067j3434J3363J3310r765j4117J0600J4638r655j5895
763a8179N028J6930r1j4726J144J5667M21j6069l533J5520M990j2992o723J2255
777c58R509j0114q814Q415J0247p732j0731M355J0950p81j1128J934J1785j243
791F294j1610r92J0624K321r185l355Q927N456n382o922O278O582n702q751M055
806a362J0032j974q347N17Q370k94p870j807P052L271p676m779P488P349m732
$$ plain form
821 5238 -1759 1681 7098 4310 -4149 -558 7094 7209 -234 -1845 6351 9445 1848 -2284 4232
836 4232 7571 2178 -3063 3228 10435 7065 -633 1695 8443 6912 -1603 -897 7376 9772 1520
851 1520 -1235 7544 11744 3169 -2468 5032 11768 5536 -3485 4132 14522 10622 -51 2055 12722
866 12722 10510 -1023 -981 12409 14318 1974 -816 11000 15734 4396 -3710 6301 14689 5401
880 5401 -4426 4314 16288 8908 -3705 1774 14120 8649 -5878 -2073 13178 11595 -3499 -4408
894 -4408 10845 13599 -2277 -8785 5860 12845 -2194 -10085 4148 14979 1422 -11591 -462
907 -462 12844 2101 -14051 -5125 11432 5404 -12138 -9478 9596 8575 -12507 -14393 4538
920 4538 8122 -10180 -15477 3739 10944 -7853 -18414 -261 11007 -5292 -19507 -5796 11218
$$ packed form
821E238o997L440N417k788q459L591P652J15p443j611Q196L094p597m132O516
836D232L339n393n241O291P207l370p698K328O748j531q515P06Q273K396q252
851A520k755Q779M200q575n637P500O736o232r021P617J0390l900j0673K106J0667
866A2722k212j1533M2J3390J909j2344k790J1816M734j1338q106J0011Q388r288
880E401r827Q740J1974p380j2613N479J2346n471j4527L805J5251j583j5094r09
894d408J5253K754j5876o508J4645O985j5039p891J4233J0831j3557j3013J1129
907d62J3306j0743j6152Q926J6557o028j7542K660J9074j021k1082j886J8931
920D538L584j8302n297J9216P205j8797j0561J8153J1268j6299j4215J3711J7014
$$ plain form
933 11218 -415 -17878 -7103 11944 3408 -18860 -12437 8045 4935 -15976 -14603 9252 10717
946 10717 -11919 -18190 2988 12352 -9464 -19922 857 14266 -4158 -19069 -2211 16204
958 16204 1081 -19440 -7532 13552 3213 -18293 -9587 15343 10503 -14995 -13893 11146 11619
971 11619 -12440 -16944 8094 14390 -9065 -17617 5722 17108 -5472 -20055 -525 16014 -1989
984 -1989 -20995 -4625 18051 3634 -19236 -8997 14701 6218 -20090 -14702 11615 11024 -15230
997 -15230 -16893 9294 13130 -13708 -21493 3830 14737 -9421 -23234 -1020 15815 -4525 -21995
1010 -21995 -4730 14469 -1983 -25242 -11208 14134 3701 -21575 -14376 12205 8377 -19951
1022 -19951 -19066 8540 10514 -16429 -21921 6052 14332 -10613 -22037 1248 15879 -6955 -23999
$$ packed form
933A1218j1633j7463J0775J9047q536k2268O423K0482l110k0911J373K3855J465
946A0717k2636o271K1178R364k1816j0458K0779J3409j8424j4911J6858J8415
958A6204j5123k0521J1908K1084j0339k1506Q706K4930m840k5498J102K5039M73
971A1619k4059m504K5038O296k3455q552K3339J1386k2580j4583J9530J6539j8003
984a989j9006J6370K2676j4417k2870J0239K3698q483k6308N388K6317n91k6254
997a5230j663K6187L836k6838p785K5323J0907k4158j3813K2214J6835k0340j7470
1010b1995J7265J9199j6452k3259J4034K5342j0433k5276P199K6581l828k8328
1022a9951Q85K7606J974k6943n492K7973Q280k4945j1424K3285J4631k2834j7044
$$ plain form
1035 -23999 -3963 17394 -852 -22242 -5886 17814 4766 -20414 -11102 15147 8504 -17543
1047 -17543 -12403 14934 14465 -12133 -15655 11556 17511 -9134 -18345 7796 20748 -2742 -17309
1060 -17309 4562 22595 2317 -17986 -97 20856 5665 -17344 -4053 22545 12406 -14205
1072 -14205 -8353 19104 15435 -12388 -10924 16360 19486 -7318 -13129 12689 22661 -2607 -14391
1085 -14391 7889 22077 862 -16516 4338 24342 7306 -14405 -891 21895 9110 -14441
1097 -14441 -5252 18460 13966 -11122 -8304 18289 18603 -7901 -12309 13472 18604 -6052 -14322
1110 -14322 9074 21651 639 -14061 4556 20506 3522 -15397 -441 19542 7347 -13694
1122 -13694 -3091 19631 11493 -12487 -7255 16032 13881 -9095 -10003 14002 17437 -4678 -10973
$$ packed form
1035b3999K0036K1357j8246k1390J6356K3700j3048k5180R312K6249o643k6047
1047a7543N140K7337m69k6598l522K7211N955k6645r211K6141J2952k3490j4567
1060a7309K1871J8033k0278k0303J7889K0953j5191k3009J3291K6598j0139k6611
1072a4205N852K7457l669k7823J464K7284L126k6804n811K5818R972k5268j1784
1085a4391K2280J4188k1215j7378K0854K0004j7036k1711J3514K2786j2785k3551
1097a4441R189K3712m494k5088K818K6593L14k6504m408K5781N132k4656q270
1110a4322K3396J2577k1012j4700J8617J5950j6984j8919J4956J9983j2195k1041
1122a3694J0603K2722q138k3980N232K3287k151k2976r08K4005L435k2115o295
$$ plain form
1135 -10973 10239 18777 -2255 -14032 5526 19813 3083 -12175 3153 20540 5879 -12936
1147 -12936 -1610 18026 8931 -11380 -5694 16103 13084 -8851 -8234 13346 14220 -7722 -11886
1160 -11886 8600 15424 -3903 -12276 6563 17102 -21 -13411 447 14153 1375 -13129
1172 -13129 -1875 14656 5213 -13026 -6480 12827 6972 -12293 -10589 8799 8224 -9757 -11243
1185 -11243 6843 11065 -7576 -14070 1342 10101 -5010 -15576 -406 10509 -1483 -14200
1197 -14200 -3853 9400 -149 -14621 -7944 8500 3533 -12524 -10130 6239 5266 -10303 -12348
1210 -12348 2779 4896 -10332 -13977 1194 8431 -5130 -12742 -2014 6461 -3891 -13602 -5071
1223 -5071 7590 161 -11336 -5218 8017 3380 -10786 -7766 5207 3783 -8775 -8654 3946
$$ packed form
1135a0973K1212Q538k1032j1777J9558J4287j6730j5258J5328J7387j4661j8815
1147a2936J1326J9636r095k0311N686K1797l019k1935O17K1580Q74k1942m164
1160a1886K0486O824j9327q373J8839J0539j7123j3390J3858J3706j2778j4504
1172a3129J1254J6531r443j8239O546J9307n855j9265J704J9388n75j7981j486
1185a1243J8086M222j8641o494J5412Q759j5111j0566J5170J0915j1992j2717
1197a4200J0347J3253r549j4472O677J6444m967j6057K394J6369r73j5569k045
1210a2348J5127K117j5228l645J5171P237j3561p612J0728Q475j0352r711Q531
1223e071J2661p429j1497O118J3235m637j4166L020J2973j424j2558J21J2600
$$ plain form
1236 3946 7232 -4881 -9114 2134 6816 -3988 -10902 -1561 6993 -628 -8795 -1937 7304 1404
1250 1404 -8888 -4695 5354 2097 -8146 -6172 4603 4069 -5834 -6798 3211 5064 -5106 -8900
1264 -8900 37 3972 -3703 -8104 -1381 5099 -2232 -9191 -4938 2928 -616 -8993 -6075 2432 1355
1279 1355 -7555 -7511 990 1191 -6667 -8382 -1129 1846 -4888 -7631 -1893 2791 -2222 -8138 -4119 1678
1295 1678 -2128 -8070 -4337 2324 1172 -5434 -5582 601 1187 -5517 -6820 -606 2637 -3443 -6011
1310 -6011 -141 4065 -1384 -5209 -2061 3181 152 -4572 -1427 4539 4161 -2515 -3204 3633 4433 -1791
1326 -1791 -2991 2997 6103 1047 -2237 2476 7497 3250 -1988 1178 6768 3867 -1559 1143 8073
1341 8073 7687 564 -307 6650 7761 1242 -814 5988 8959 2885 -311 4889 9926 5275 -1340
$$ packed form
1236C946L286j2113m233J1248M682j0804o914R341Q554p621q167O858R241n900
1250A404j0292M193J0049l257j0243J974J0775n34r903r64J0009J853j0170l794
1264h900Q937L935p675m401O723O480p331o959M253P866l544q377K918Q507j077
1279A355q910M4Q501K01p858j715P253K975o734k743N738M684n013n916M019N797
1295A678l806n942L733O661j152o606j48O183N86o704j303O214L243o080k568
1310f011N870M206n449l825L148N242l029m724L145N966l78o676o89O837Q00o224
1326a791j200N988L106n056l284M713N021m247n238L166N590k901n426K702O930
1341H073l86p123q71O957J111o519k056O802K971o074l196N200N037m651o615
$$ plain form
1356 -1340 2291 8690 5467 -1196 1663 9691 7635 -354 -430 8008 7773 -177 -2057 5839 8949 1731
1372 1731 -2206 5217 10125 2290 -4428 2221 9243 4397 -3845 659 9247 5733 -2687 -904 7262
1387 7262 6134 -3977 -4275 6860 7877 -1421 -3806 4835 9031 -915 -5846 2531 8338 736 -6297
1402 -6297 713 9834 3575 -6178 -1237 8656 5430 -6960 -4117 6955 7005 -4619 -4592 6988 8271
1417 8271 -4465 -7168 3936 8918 -1477 -7786 2626 10255 976 -8497 60 10124 2361 -8370
1431 -8370 -2779 9056 5167 -6913 -3505 8682 6789 -6379 -7266 6264 8214 -5658 -8376 4758
1445 4758 10124 -3164 -9203 1658 9022 -2301 -11007 -887 9801 830 -10785 -3426 9369
1458 9369 3060 -10865 -6286 7328 4023 -10509 -8780 6459 7634 -7653 -11319 3311 7152
$$ packed form
1356a340L631O399l223o663K859Q028k056p989p6Q438k35p950j880P896L110p218
1372A731l937P423M908p835o718O649P022m846q242M504Q588l514q420J783Q166
1387G262j128j0111k98J1135J017r298k385Q641M196r946m931Q377N807p602p033
1402f297P010R121o259r753M941R893l226j2390K843J1072N0j1624K7J1580J283
1417H271j2736k703J1104M982j0395o309J0412P629r279r473Q557J0064p763j0731
1431h370N591J1835l889j2080L408J2187j893j3168q87J3530J950j3872k718J3134
1445D758N366j3288o039J0861P364j1323q706J0120J0688q971j1615P359J2795
1458I369o309j3925M579J3614l305j4532J729J5239J175j5287l666J4630L841
$$ plain form
1471 7152 -6915 -13010 94 8605 -5035 -12919 -1364 9183 -2180 -13669 -5118 7154 -531
1484 -531 -12644 -6635 8237 3886 -10903 -9379 6420 5536 -10959 -12105 3770 7212 -7206 -12627
1498 -12627 2480 8340 -5259 -13896 -1077 8812 -2427 -13309 -3082 9862 962 -12313 -5581
1511 -5581 9017 3247 -12818 -8702 7435 6393 -9313 -8849 6181 9440 -7371 -12222 3983
1524 3983 9267 -4455 -12525 1321 11161 -1085 -12667 -882 10715 15 -13357 -4285 9400
1537 9400 4092 -11635 -6781 9377 6365 -10512 -9375 6862 7659 -9976 -11777 5245 9574 -6069
1551 -6069 -12958 1980 10052 -4027 -13750 -1739 10150 -867 -13279 -3446 10712 1127 -13300
1564 -13300 -6315 9148 4136 -11759 -8318 7413 7322 -9470 -10546 6092 8006 -7313 -12168 3303
$$ packed form
1471G152j4067o095J3104Q511j3640p884J1555J0547j1363j1489Q551J2272p685
1484e31j2113O009J4872m351j4789J524J5799q84j6495j146J5875L442j4418n421
1498a2627J5107N860j3599q637J2819R889j1239j0882J0227J2944q900j3275O732
1511e581J4598n770j6065M116J6137j042j5706M64J5030L259j6811m851J6205
1524C983N284j3722q070J3846R840j2246j1582J1785J1597j0700j3372R072J3685
1537I400n308j5727M854J6158l012j6877J137J6237P97j7635j801J7022M329j5643
1551f069o889J4938Q072j4079r723J2011J1889j1017j2412R833J4158r585j4427
1564a3300O985J5463n012j5895L441J5731r1j6792j076J6638J914j5319m855J5471
$$ plain form
1578 3303 10401 -3674 -11474 1932 11364 -192 -11854 -1640 11215 1906 -11482 -3512 11993
1591 11993 6522 -8507 -5407 9611 8185 -7395 -7199 8677 10794 -3510 -7528 7660 12452
1604 12452 -771 -8221 4205 12862 1716 -8725 2779 14380 5149 -7132 796 13432 7255
1617 7255 -7492 -1986 12664 9090 -4953 -3835 11517 12189 -2693 -5285 8835 12552 -1919
1630 -1919 -7374 6532 14240 2113 -6824 5514 12579 2781 -7762 1036 13055 5089 -6415
1643 -6415 -759 12246 7504 -6803 -4253 9832 8883 -5825 -5749 7966 10476 -2382 -6466 5622
1657 5622 11138 -1907 -8689 2612 10501 1245 -7824 642 11121 3536 -9215 -2850 8460 3574
1671 3574 -7660 -4195 7381 6289 -6618 -5804 6293 6453 -4874 -7795 3793 7803 -2899 -7775
$$ packed form
1578C303P098j4075p800J3406R432j1556j1662J0214J2855r309j3388P970J5505
1591A1993n471j5029L100J5018j426j5580J96J5876K117j4304m018J5188M792
1604A2452j3223p450J2426Q657j1146j0441J1504J1601r231j2281P928J2636o177
1617G255j4747N506J4650l574j4043J118J5352O72j4882k592J4120L717j4471
1630a919n455J3906P708j2127q937J2338P065r798j0543Q798J2019p966j1504
1643f415N656J3005m742j4307K550J4085r49j4708P6J3715K510j2858m084J2088
1657E622N516j3045o782J1301P889r256r069Q466J0479p585j2751O365J1310m886
1671C574j1234L465J1576j092j2907Q14J2097J60j1327k921J1588M010j0702m876
$$ plain form
1685 -7775 2988 8361 -221 -8117 -200 7566 201 -7984 -1818 8536 3336 -7655 -3537 7247
1699 7247 4333 -6912 -5126 4802 5482 -5174 -5484 4352 6155 -2274 -7049 1957 5934 -1186 -7787
1714 -7787 127 7694 610 -6554 -1894 6546 1509 -6899 -2923 5228 3994 -6194 -5129 3759 4920
1729 4920 -4365 -5815 2650 4528 -4323 -7652 765 5550 -1693 -6791 -1020 4548 -1540 -7763 -2640
1744 -2640 4083 25 -5939 -3800 3696 1935 -6109 -5873 1369 2293 -5585 -6786 829 2395 -4003
1759 -4003 -6617 -451 3414 -3587 -7963 -2363 1215 -2294 -6653 -2179 2720 -1170 -6537 -4131 2009
1774 2009 756 -6613 -5177 1621 1825 -4110 -5172 555 2364 -2983 -5746 -1370 1993 -1731 -5364
1789 -5364 -1414 3233 -198 -5430 -2592 1988 53 -4607 -3385 1501 2167 -3394 -3587 1149 2290
$$ packed form
1685g775J0763N373q582p896P917P766p365q185O166J0354n200j0991M118J0784
1699G247k914j1245J786R928O80j0656l10R836J803q429m775R006L977p120o601
1714g787P914P567p084p164M660Q440n037q408L976Q151j234j0188J065Q888J161
1729D920r285j450Q465J878q851l329Q417M785p243n098N771N568o088o223N123
1744b640O723m058n964K139P496j761q044K36P242R24p878j201P615J566o398
1759d003k614O166L865p001m376N600L578l509m359M474M899l890n367K406O140
1774B009j253p369J436O798K04n935j062N727J809n347k763M376L363l724l633
1789e364L950M647l431n232K838M580j935m660J222M886O66n561j93M736J141
$$ plain form
1804 2290 -2085 -3897 263 2359 -1468 -4249 -81 3245 -126 -3388 -1958 1934 780 -3838 -2256
1819 -2256 1838 2013 -2984 -2446 1082 2512 -2256 -3997 456 2250 -858 -3002 -456 3459 -70
1834 -70 -3635 -1469 2002 454 -3146 -2185 2106 2289 -2151 -1655 1442 2155 -2353 -3609 1306 2696
1850 2696 -403 -2955 1058 3281 1063 -1616 -252 3462 1431 -2458 -851 3994 4038 -450 -1232 3330
1866 3330 3300 -1107 -2270 2803 4728 1071 -1103 2578 5674 1716 -1311 1221 5311 2916 -1509
1881 -1509 885 5934 5045 -442 764 5353 5219 -26 -1097 4087 5950 1166 -820 4109 7034
1896 7034 2271 -1504 3279 6912 3339 -1557 1722 6643 4170 -679 447 5894 5126 -1782 -1510
1911 -1510 4411 5846 -36 -1784 3603 6256 289 -3670 2592 5343 958 -3043 1476 6264 2771
$$ packed form
1804B290m375j812M160K096l827k781M168L326l371l262J430L892j154m618J582
1819b256M094J75m997N38L528J430m768j741M453J794l108k144K546L915l529
1834g0l565K166L471j548l600R61M291J83m440M96L097P13m508j256M915J390
1850B696l099k552M013K223k218k679J364L714k031l889J607M845M4m488p82M562
1866C330l0m407j163N073J925l657k174L681L096l958l027K532M090k395m425
1881a509K394N049q89n487J206M589j34n245j071N184J863m784j986M929K925
1896G034m763l775M783L633l573m896L279M921k473m849J126N447p68o908K72
1911a510N921J435n882j748N387K653n967l959O262K751m385m001M519M788l493
$$ plain form
1926 2771 -3672 -898 4904 2412 -3901 -2779 4395 3217 -3758 -2494 4663 3732 -3055 -4663 1023
1941 1023 3451 -2812 -5697 169 4804 -647 -5705 -491 4699 -165 -6495 -2101 5142 1797 -5396
1956 -5396 -2869 4559 2699 -4466 -5185 3280 2907 -4094 -5428 2667 5009 -2813 -5530 1317 5423
1971 5423 -1965 -6577 -182 6081 -183 -5772 -1804 5218 1755 -5360 -2922 4743 2455 -5435 -4577
1986 -4577 5034 3958 -4236 -5291 2810 5347 -3280 -6517 1379 5440 -1357 -6140 171 6854 102
2001 102 -7160 -2051 5090 186 -7283 -2875 5255 2807 -5775 -4167 4429 3817 -5129 -6943 1989
2016 1989 4009 -4199 -6574 2275 4940 -3945 -7842 -364 4497 -2280 -8238 -1421 4577 -320 -7900
2031 -7900 -2789 4619 -110 -7997 -6162 2989 2172 -7019 -6111 3320 3398 -5118 -8194 1187 4290 -4788
$$ packed form
1926B771o443K774N802k492o313J122P174j178o975J264P157r31o787j608N686
1941A023K428o263k885N866M635n451n058N214N190m864o330M394P243l345p193
1956e396K527P428j860p165p19Q465l73p001j334Q095K342p822k717O847M106
1971E423p388m612O395O263o264n589L968P022l463p115K438P665k288p890Q58
1986d577R611j076q194j055Q101K537q627l237P896M061o797m783O311O683o752
2001A02p262N109P141m904p469M408Q130k448q582J608Q596o12q946j814Q932
2016A989K020q208k375Q849K665q885l897P478M861o777n958O817N998m897p580
2031g900N111P408m729p887J835R151q17r191R08R431P8q516l076R381L103r078
$$ plain form
2047 -4788 -8003 165 4666 -2018 -8237 -1060 4537 -1552 -8783 -2932 5009 846 -7650 -4578 4675
2062 4675 2927 -6623 -5668 4243 4049 -5593 -6221 2764 4931 -3675 -6467 1849 6053 -2124 -7119 -102
2078 -102 5859 -311 -7035 -898 7435 2136 -6156 -2418 5307 3539 -5341 -4359 6196 4599 -3662
2093 -3662 -4517 4491 5950 -2664 -5537 2328 6663 -1236 -6389 1606 7186 -16 -5949 -226 6788
2108 6788 1562 -5768 -1679 7157 3092 -4225 -1576 6274 3952 -5447 -4166 5036 5400 -3356 -3948
2123 -3948 4010 6847 -1260 -4751 1996 6307 -371 -5620 1523 7310 2451 -4684 -537 7663 2778
2138 2778 -4146 -1593 6701 3748 -3682 -1843 5771 6256 -2309 -3709 4560 6240 -1386 -3532 3558
2153 3558 7368 500 -4498 2410 7702 1324 -4053 1426 6830 2895 -3196 -956 7335 3973 -3107
$$ packed form
2047d788l215Q168M501o684o219P177N597o089p231N851P941m163q496L072R253
2062D675j748r550R55R911j94r642o28Q985K167q606k792Q316M204q177m995P017
2078a02N961o170o724O137Q333n299q292L738P725j768q880R82J0555j597q261
2093c662q55R008J459q614k873P865M335p899n153P995N580p202n933N723P014
2108F788n226p330M089Q836m065p317K649P850k322r399J281R202L64q756n92
2123c948P958K837q107l491O747M311o678n249P143N787m859p135M147Q200m885
2138B778o924K553Q294k953p430J839P614M85q565j400Q269J680p626k146P090
2153C558L810o868m998O908N292o378n377N479N404l935o091K240Q291l362p080
$$ plain form
2168 -3107 -635 6004 5666 -2855 -2405 4983 6003 -1104 -2980 4551 6766 -289 -3900 2821 6111
2183 6111 1269 -3805 1005 6084 1877 -3531 -423 5303 2465 -3772 -2026 4594 3483 -2889 -2983
2198 -2983 3382 3402 -2879 -3171 2376 4360 -2134 -4318 693 4362 -313 -5006 -302 3705 -319 -4487
2214 -4487 -1808 3970 1165 -4756 -2313 3147 1877 -3908 -3504 1766 1972 -3145 -3708 861 3911 -2425
2230 -2425 -4720 529 2905 -1901 -5449 -590 2816 -616 -5012 -992 2831 -68 -4288 -2230 2082
2245 2082 685 -3168 -2726 1991 1753 -2758 -2310 1276 3000 -1900 -3652 952 2924 -602 -3316 -294
2261 -294 2310 -162 -3404 -1092 2539 1073 -3329 -1322 3018 1911 -3029 -3324 816 1643 -2020 -2683
2277 -2683 993 1898 -1356 -2724 28 2469 -772 -3469 -1006 1640 -394 -3355 -911 2107 112
$$ packed form
2168c107K472O639l38q521M50P388J020p107j876P531K215p055l611O721L290
2183F111m842n074M810N079m207n408L108N726k838o237J746O620j111o372r4
2198b983O365K0o281k92N547J984o494k184N011L669m675m693M704M007m024m168
2214d487K679N778k805n921K443N460j270n785M04N270K06n117n63M569L050o336
2230b425k295N249K376m806l548M859L406l432m396M020L823k899m220K058M312
2245B082j397l853M42M717k38m511M48L586J724m900j752M604J972l526k714L022
2261b94K604k472l242K312L631j466m402K007M340j107m940k95M140Q27l663o63
2277b683L676R05l254j368K752K441l241k697K463K646k034k961K444L018j995
$$ plain form
2292 112 -3185 -2782 312 162 -2367 -2013 438 184 -1958 -3191 -118 1284 -2139 -3526 -1394 927
2308 927 -1660 -3147 -1527 273 -1305 -2799 -1857 -314 -462 -2767 -2443 182 106 -2832 -3960 -646
2324 -646 96 -1984 -3008 -807 354 -1495 -2343 -488 -173 -26 -2434 -1885 379 -296 -2205 -1657 1245
2341 1245 990 -1086 -1102 488 1511 -451 -848 -89 1411 -293 -478 -119 2193 498 -1338 -676 1670
2358 1670 671 -1671 -272 1635 1859 -241 -1144 1954 1854 371 -1440 820 1895 349 -775 689
2374 689 2814 2625 267 118 2758 577 -313 161 3228 3171 261 734 1091 2717 -227 -1003 1577
2391 1577 3851 515 -736 500 2555 1241 -1501 102 2677 2151 -1449 274 2294 2395 -584
2406 -584 -39 1453 2148 -228 -710 1668 2096 733 -468 1691 3659 1025 -615 51 3453 1796
$$ packed form
2292A12l297M03L094j50k529L54K451k54k142j233L073J402l423j387K132K321
2308I27k587j487J620J800j578j494R42J543j48k305L24K625p6k938j128L314
2324f46P42k080j024K201J161j849q48J855L15J47k408N49K264o75j909N48K902
2341A245k55k076j6J590J023j962l97P59J500j704j85L59K312j695j836O62K346
2358A670r99k342J399J907K24k100r03L098j00j483j811K260J075j546j124J464
2374F89K125j89k358j49K640k181q90M74L067n7k910M73L57J626k944p76K580
2391A577K274l336j251J236K055j314k742J603K575n26l600J723K020J01k979
2406e84N45J492O95k376m82K378M28j363j201K159J968k634j640O66L402j657
$$ plain form
2422 1796 -1220 1020 3373 1241 -1418 -211 3107 2257 -185 -944 1968 2735 -88 -924 1779 3611
2438 3611 -230 -1294 1765 3996 447 -1726 1622 3479 1191 -1863 -488 3228 1808 -1597 -1447
2453 -1447 2963 2734 -1942 -587 1612 2720 -790 -1595 1600 2001 -594 -2223 1517 4309 328 -3403
2469 -3403 311 2511 951 -3168 -145 3698 1808 -2794 -2105 2940 1784 -2186 -2262 2644 2119 -2654
2485 -2654 -2857 1020 2126 -1202 -4307 -581 1976 -542 -3980 348 2511 -475 -3976 -1128 2163
2500 2163 -185 -4544 -1775 2268 829 -3698 -2848 1974 1112 -2408 -4660 1881 3022 -2004 -4247
2515 -4247 -1164 2351 -622 -4367 170 3133 -772 -4058 -2160 2672 332 -3097 -1779 2085 704
2530 704 -2881 -2679 1893 2041 -2636 -3246 1094 3022 -1201 -2358 37 2589 -1340 -3500 -479 3150
$$ packed form
2422A796l016K240K353k132k659J207L318q50k442p59K912P67k823q36K703J832
2438C611l841j064L059K231l549k173L348J857k288l054J375L716j420l405J50
2453a447M410k29m676J355K199J108l510q05L195M01k595j629L740K792l981l731
2469c403L714K200j560m119L023L843j890m602O89N045j156l970p6M906n25m773
2485b654k03L877J106l328l105L726K557k518l438M328K163k986l501K848L291
2500B163k348m359K769M043j439m527Q50M822q62l520k252O541J141n026k243
2515d247L083L515k973l745M537K963l905l286J898M832k340l429J318L864j381
2530G04l585K02M572J48m677o10M340J928m223j157K395K552l929k160L021L629
$$ plain form
2546 3150 121 -3507 -1966 2930 906 -4251 -1741 2222 1158 -3168 -2636 1522 1446 -3322 -3560 1024
2562 1024 2094 -2364 -4038 562 2771 -2592 -4439 -40 1607 -1715 -4364 -1470 2769 -711 -5653
2577 -5653 -2278 1988 1231 -3554 -2343 2129 2161 -3787 -4262 815 1848 -3459 -4292 427 2804 -2270
2593 -2270 -3851 454 2806 -866 -4678 -790 3547 -318 -4844 -1033 2709 -545 -3490 -2103 2638
2608 2638 1514 -2949 -2773 1802 2763 -2084 -3686 1342 3077 -1494 -2781 856 2655 352 -2259
2623 -2259 908 3921 782 -3236 270 4415 902 -3230 -745 4108 2633 -1259 -964 3833 3116
2638 3116 -22 -1780 2267 3814 663 -3211 3280 4204 -321 -2016 1770 3470 563 -1943 1874
2653 1874 3813 1292 -2253 1165 4482 2221 -1715 -562 3960 3346 -1133 -2000 4159 3637 265 -2036
$$ packed form
2546C150l029l628J541M896k024n157K510L963j064m326N32M158p6m768k38M584
2562A024J070m458j674M600K209n363j847M399J647l322k649K894M239l480m942
2577e653L375M266p57m785J211M472L2n948m75N077J033n307q33M719K377n074
2593b270j581M305K352l672l812L888M337l865m526L811L742l254k945J387M741
2608B638j124m463J76M575R61m847j602N028J735m571j287L637J799k303k611
2623b259L167L013l139m018L506M145l513m132K485M853j475l892K95M797p17
2638C116l138j758M047J547l151l874O491R24m525j695L786J700k907k506L817
2653A874J939k521l545L418L317k261l936J153M522o14m479q67O159n22l372k301
$$ plain form
2669 -2036 876 3770 -85 -1400 1127 4640 811 -2937 1086 4064 1136 -2381 -193 2911 1239
2684 1239 -2365 -1108 2791 2016 -1932 -1909 2406 2895 -1003 -2280 1599 4027 -268 -2051 1098 3260
2700 3260 -146 -2548 281 2218 1022 -2144 636 3862 2063 -2286 529 2428 972 -1593 -1962
2715 -1962 2520 2828 -1365 -1556 2103 2471 -196 -2193 1119 2556 -531 -254 52 2686 868 -2802
2731 -2802 -40 1736 -9 -1071 -1586 1717 682 -679 -1345 1792 678 -615 -1981 2241 2874 -1346
2747 -1346 -710 871 2138 -117 -2238 -924 1324 140 -2875 -1258 1875 320 -1996 -1396 1209
2762 1209 115 -1835 -2155 -913 1248 -1668 -2426 166 831 -172 -3124 372 153 -1356 -2479 -771
2778 -771 1041 -591 -1678 -1322 818 -1242 -1975 -1705 77 140 -1929 -992 -25 1049 -1454 -1752 -471
$$ packed form
2669b036K912K894l855j315K527L513l829l748M023K978k928l517K188L104j672
2684A239l604J257L899p75l948K3M315M89l898j277L879K428m295j783L149K162
2700C260l406k402K829J937j196l166K780L226j799m349K815J899j456k565l69
2715a962M482L08m193j91L659L68k667j997L312J437l087K77L06K634j818l670
2731b802K762J776j745j062n15L303j035j361o66L137j114j293j366M222O33m220
2747a346O36J581J267k255k121J314K248j184l015J617L133j555k316O00K605
2762A209j094j950l20J242K161k916p58K592O65j003k952L496k19j509j123J708
2778g71J812j632j087L56K140k060p33K70J782O3k069R37R67J074k503k98J281
$$ plain form
2795 -471 1518 -1552 -1488 -79 448 -92 -1596 -95 1160 187 -2435 -1719 492 77 -1428 -979 1622
2812 1622 531 -334 -1800 -486 165 -969 -1929 666 1823 -1110 -1644 209 1380 -371 -1593 -1611
2828 -1611 542 -734 -1825 -1522 515 -160 -1825 -1551 155 555 -650 -1646 329 492 -1048 -1398 -878
2845 -878 1103 -1543 -1878 -938 972 -303 -1164 -1190 450 280 -1992 -1763 -68 -428 -1644 -1801 394
2862 394 1223 -108 -1089 -279 1455 -358 -1357 478 1453 246 -804 -1492 1316 58 -1829 -920 1298
2879 1298 77 -736 -788 870 1812 -476 -1582 1417 437 -70 -1587 -21 2668 229 -1063 836
2895 836 2643 1193 5 318 1990 1506 -177 -737 1272 2337 -78 699 2112 2810 1274 -536
2911 -536 877 2244 539 -547 1677 2221 1721 -1052 1486 2206 2019 -511 -1110 2714 2044 -147 261
$$ packed form
2795d71J989l070O4J409N27n40j504J501J255r73k622P16K211m15j505M49K601
2812A622j091q65j466J314O51j134r60K595J157k933n34J853J171j751j222j8
2828a611K153j276j091L03K037o75j665K74J706M00j205r96J975J63j540l50N20
2845h78J981k646l35R40J910j275q61k6J640j70k272K29J695l60j216j57K195
2862C94Q29j331r81Q10J734j813r99J835R75j207j050o88K808j258j887R09K218
2879A298j221q13n2J658R42k288j106K999r80n07j517J566K689k439j292J899
2895H36J807j450j188L13J672m84j683n60K009J065k415P77J413O98j536j810
2911e36J413J367j705j086K224N44n00k773K538P20j87k530n99L824o70k191M08
$$ plain form
2928 261 2306 2342 353 -823 911 2299 226 -718 840 2101 1825 -304 -82 3589 1947 -1292
2944 -1292 579 1893 901 283 -647 3113 2563 -804 -816 -160 2215 -507 -1292 370 1886 -178 -967
2961 -967 -160 526 -295 -2680 490 1043 1275 -378 -1211 1592 1860 -767 -211 1530 -425 -600 -363 1202
2979 1202 1486 -624 -524 708 1861 -1523 -1861 843 1570 -310 -1508 772 1936 553 -1226 -1673
2995 -1673 2320 66 -695 -837 1109 1249 -1528 -1199 904 688 -601 -2501 1730 1855 -308 -1505
3011 -1505 358 1631 513 -2031 278 1499 -47 -3067 -1629 1178 945 -1857 -774 1354 1401 -1181
3027 -1181 -1850 1573 1013 -791 -1177 176 1047 -826 -2681 -17 1360 -1037 -3287 -765 1321 -108
3043 -108 -1857 -1560 408 -240 -4166 -1562 1761 497 -1396 -1069 582 1124 -2418 -2040 865 387 -2764
$$ packed form
2928B61K045L6j989j176J734J388k073r44J558J261k76k129K22L671j642l239
2944a292J871J314r92o18r30L760n50l367j2O56K375k722p85J662J516k064p89
2961i67Q07O86q21k385L170N53K32j653q33K803K68k627N56J741j955j75K37J565
2979A202K84k110J00J232J153l384l38K704P27j880j198K280J164j383j779m47
2995a673L993k254p61j42J946J40k777L29K103k16j289j900M231J25k163j197
3011a505J863J273j118k544K309J221j546l020J438K807k33k802J083K128M7k582
3027a181o69L423n60j804l86J353Q71j873j855K664J377k397k250K522K086j429
3043a08j749K97J968o48l926K604L323j264j893L27J651N42l542L78K905m78l151
$$ plain form
3060 -2764 -1197 390 1414 -598 -1618 -434 1572 -1723 -3380 -1036 1006 849 -2279 -2521 1421
3075 1421 -144 -2347 -2292 651 1587 -2209 -1727 -57 574 -1756 -2549 -518 1379 -1730 -3110 -737
3091 -737 1256 -975 -1466 -371 1987 341 -1546 -407 1233 221 -1833 -2797 2101 1653 17 -1081
3107 -1081 558 1528 -1272 -1632 949 1679 -924 -1829 303 2212 -522 -2319 514 1033 419 -800
3123 -800 -615 1870 543 -2822 -2416 -21 695 -2016 -2632 1048 1389 -1839 -849 564 1236 110 -1417
3140 -1417 483 4437 -173 -2180 962 2202 1344 -826 -76 2352 421 -1143 -110 2102 716
3155 716 -306 184 1753 1303 30 -942 608 2011 -655 -1745 1269 3064 -484 -2110 28 2434
3171 2434 150 -1747 263 2300 712 -429 -636 1895 1218 3 -515 2571 1428 -63 -991 3296
$$ packed form
3060b764J567J587J024k012j020J184K006l295j657K344K042j57l128k42L942
3075A421j565k203N5K943R36l796M82J670O31k330p93K031J897l109j380K373
3091g37J993k231m91J095K358j646j887J139J640j012k054r64M898m48j636j098
3107a081J639R70k800l60K581P30k603r05K132J909k734j797K833N19o14j219
3123h00J85K485j327l365M06K395P16k711o16L680L41l228R90J413O72j126j527
3140a417J900L954m610k007L142J240q58k170P50K428j931j564J033K212j386
3155G16j022M90J569m50j273r72J550J403k666j090L014J795l548j626K138K406
3171B434k284j897K010K037j588j141k07K531o77j215n18L086j143j491r28M287
$$ plain form
3187 3296 1278 1101 -45 1485 1987 691 -648 333 2440 759 34 50 2074 1168 388 46 1808
3204 1808 2022 -395 739 1703 1912 -728 -1654 1931 1189 -1139 -99 349 713 141 -669 177 1161 119
3222 119 -1950 -508 2887 1027 -1042 825 1841 473 -1892 3 1168 662 -836 -909 153 1898
3238 1898 -1332 -823 532 1352 -1090 -1613 -171 650 -297 -1515 -593 1018 2001 -1414 -1010 13 1938
3255 1938 -1832 -1125 -596 1395 -965 -171 1414 1158 -698 -1126 657 1951 -1398 -1342 863 425 -1675
3272 -1675 -1548 -182 939 524 -2229 28 792 680 -628 -309 294 1697 -1319 -1779 544 1067 109
3289 109 -1307 -732 821 552 -1382 290 794 -72 -849 -306 352 -382 -1086 -472 621 989 -1327 -1431
3307 -1431 -596 237 -1592 -1334 269 -78 95 -944 -805 1023 -664 -2635 55 349 -374 -1801 -1784
$$ packed form
3187C296k018j77j146J530N02j296j339R81K107j681p25J6K024r06p80l42J762
3204A808K14k417J134R64K09k640r26L585p42k328J040M48L64n72q10Q46R84j042
3222A19k069J442L395j860k069J867J016j368k365J895J165n06j498p3J062J745
3238A898l230N09J355Q20k442n23J442Q21r47j218R22J611R83l415M04J023J925
3255A938l770P07N29J991k360P94J585k56j856m28J783J294l349N6K205m38k100
3272a675J27J366J121m15k753K257P64j12j308L19O03J403l016m60K323N23r58
3289A09j416N75J553k69j934J672N04q66p77N43O58p34p04O14J093L68k316j04
3307a431Q35Q33j829K58J603l47J73j039J39J828j687j971K690K94p23j427J7
$$ plain form
3324 -1784 -577 312 -1220 -1741 -644 1134 -1121 -1819 -174 140 188 -800 -1820 -893 -911 -1190 -441 -100
3342 -100 -257 -1495 -1169 289 -640 -1466 -1761 393 880 -1664 -550 -250 1273 -1645 -1671 -493 -443 -1407
3360 -1407 -1968 280 906 -427 -1317 -1282 556 -45 -1355 -868 1242 -468 -1697 -1519 -180 -938 -1373
3377 -1373 -1623 232 -1765 -994 -1077 373 743 -1181 -2229 702 392 1052 -659 -182 568 410 -1425
3394 -1425 -1742 1115 -663 -352 -1148 812 1335 -1633 -323 -9 1547 1186 -1507 -301 -329 1074 -493
3411 -493 -323 1555 1117 326 848 827 805 -566 -602 726 1228 -1639 -402 86 220 -342 -1179 -617 -118
3430 -118 64 -572 425 2011 560 -1047 1079 2389 374 -1528 -627 1928 1349 -1206 -1475 496 1604
3447 1604 479 1240 1474 885 1008 346 525 2032 -447 -1411 1296 788 -47 -542 744 2252 1553 -145
$$ packed form
3324a784J207Q89j532n21J097J778k255o98J645L14M8r88j020R27j8k79P49L41
3342a00j57j238L26J458r29q26k95K154M87k544J114L00J523k918k6J178N0r64
3360a407n61K248O26j333q90L5J838o01j310M87K110j710j229J78J339p58m35
3377a373k50J855j997P71q3J450L70j924j048K931l10O60j711M77P50j58j835
3394a425l17K857j778L11p96J960N23k968J310L14J556l61k693J206k8J403j567
3411d93J70J878m38p91N22k1k2j371l6J328N02k867J237M88J34n62q37N62M99
3430a18J82o36R97J586j451j607K126J310k015j902R01K555n79k555k69J971J108
3447A604j125P61K34n89J23o62J79J507k479r64K707n08q35m95J286J508o99j698
$$ plain form
3465 -145 422 1928 1900 204 -316 1842 1516 -6 297 1481 445 -532 -915 1495 960 760 -53 713
3483 713 668 294 -864 -76 1052 526 -1315 -1139 567 -75 -1115 -56 780 4 -422 -1314 222 1249
3501 1249 -842 -1203 -242 1037 -1708 -1440 -260 935 179 -1006 -92 646 404 -503 -611 1780 -108
3518 -108 -602 -1481 1482 1461 -332 -1578 525 990 -580 -854 512 1691 -414 -1506 -397 747 -773
3535 -773 -791 -414 2709 -39 -838 -490 885 873 139 -656 -1147 1 -775 -143 709 925 -987 -839 292
3554 292 1314 110 -2298 -705 572 -689 -467 -1282 820 -510 -226 -588 1738 2 -1515 305
3570 305 2190 401 -931 -1346 149 1030 -1001 76 -305 261 -1462 -1562 -790 993 -70 -1559 375
3587 375 1466 -481 -1502 -113 401 111 -762 -723 545 -173 -1869 -1180 42 449 -2586 -3199 699
$$ packed form
3465a45N67J506k8j696n20K158l26j522L03J184j036r77l83K410n35k00q13P66
3483G13m5l74j158P88J128n26j841J76J706o42j040J059Q36p76m26q92J536J027
3501A249k091l61R61J279k745K68J180J195p56j185R14P38k42r07j08K391j888
3518a08m94q79K963k1j793j246K103M65j570k74J366J179k105j092J109J144j520
3535g73j8L77L123k748p99L48J375j2p34p95m91J148p76O32Q52K16j912J48J131
3554B92J022j204k408J593J277j261K22q15K102j330K84l62K326j736j517J820
3570C05J885j789j332m15J495Q81k031J077l81N66j723j00P72J783j063j489J934
3587C75J091j947j021J389N14k90q73L9J268p18j696O89J222M07l035o13L898
$$ plain form
3604 699 1362 -1460 -985 243 536 -239 -1565 -1023 127 197 -1955 109 247 -270 -2629 -1311 344
3621 344 -82 -1031 -807 -360 -1515 -1185 -1178 -733 -229 -1117 -689 295 790 -1775 -1928 -486 951 -886 -1174
3640 -1174 -1228 784 505 -1468 -14 -1077 1082 -1280 -1426 194 521 -766 -918 -136 774 407 277
3657 277 652 981 -939 -406 815 1058 -67 -584 -791 1042 169 -1210 852 697 202 -1050 -49
3674 -49 707 1041 342 -230 333 1548 -1028 -992 589 1298 -231 -247 1299 2377 581 -566 -534 1123
3692 1123 1015 -786 697 1672 779 -1076 -105 2878 1297 234 205 969 323 -100 16 1215 720 113
3710 113 -1879 823 1359 793 -1230 244 2097 606 -1654 -239 1497 981 -67 -1291 788 44
3726 44 -172 -747 1260 1181 -930 -628 445 894 -498 -197 14 1403 360 182 461 1123 841 -790
$$ packed form
3604F99O63k822M75J228K93p75j326N42J150P0k152K064J38n17k359J318J655
3621C44m26r49K24M47j155L30PM45N04q88M28R84M95k565j53J442J437j837k88
3640a174n4K012k79j973J454j063K159k362j46J620L27j287j52P82R10l67j30
3657B77L75L29j920N33J221K43j125n17k07J833q73j379K062j55m95j252J001
3674d9P56L34o99n72N63J215k576L6J581P09j529j6J546J078j796j147L2J657
3692A123j08j801J483R75q93j855R71K983j581j063k9P64o46m23J16J199m95o07
3710A13j992K702N36n66k023J474J853j491k260J415J736n16j048j224K079p44
3726D4k16n75K007p9k111L02J073M49j392L01K11J389j043j78K79O62k82j631
$$ plain form
3744 -790 848 -321 392 -984 -62 1524 -190 646 -453 -161 401 -1533 -1634 359 543 940 55
3761 55 1175 1353 478 -693 -1501 1536 304 -323 -485 794 752 -1730 -345 569 205 -638 -443 276
3779 276 -89 -229 -258 933 276 -556 -617 209 679 405 -186 77 1006 626 -1418 -1087 414 249 -1546
3798 -1546 124 265 -390 -370 -1623 -274 161 -296 -1636 985 -32 -251 -817 -246 1367 -133 -1155
3815 -1155 224 183 -610 -550 -745 210 -185 -464 -499 -779 128 -740 -891 -10 -64 -1068 -26 1028 50 137
3835 137 -1215 -251 547 -307 -84 -894 -95 445 -1099 -572 722 196 -977 -529 240 485 -123 -723 -2
3854 -2 100 -393 -1421 -137 465 128 -347 -823 -349 -562 -1252 -973 268 694 -1193 -1311 -414 -130 341
3873 341 -497 -329 -405 -932 112 -414 -42 -751 -594 -418 -449 -569 -1118 -604 569 347 -1282 -526 192 -87
$$ packed form
3744g90J638j169P13j376R22J586j714Q36j099K92N62j934j01J993J84L97q85
3761E5J120J78q75j171q08L037j232o27j62J279m2k482J385R14l64q43J95P19
3779B76l65j40k9J191o57q32o1Q26M70k74n91K63R29l80k044L31J501j65j795
3798a546J670J41o55K0j253J349M35m57j340K621j017k19n66N71J613j500j022
3815a155J379m1p93O0j95R55l95k79l5k80R07q68j51Q81n4j004J042J054r78Q7
3835A37j352R64P98q54K23q10P99N40j544N27J294n26j173M48P69K45o08o00P21
3854bJ02m93j028J284O02l37m75m76M74k13o90K79J241M26j887j18Q97K84M71
3873C41q38J68p6n27J044n26L72p09J57J76l1j20n49N14J173k22j629P56P18k79
$$ plain form
3893 -87 339 -882 232 720 -442 -638 -648 833 171 -1144 -314 635 -411 -1197 -87 -127 77 -316 223
3912 223 -73 33 71 -457 81 34 -9 -719 -717 53 226 -966 -389 291 -680 862 837 904 654 -304 611 177
3934 177 -194 -109 -282 1033 809 755 1168 525 1104 188 755 440 1883 219 -628 392 1682 511 -657
3953 -657 -427 717 1694 772 632 1631 974 -183 -464 607 102 -176 -1139 373 821 -809 706 1199
3971 1199 1195 -136 771 234 698 218 -363 215 547 380 -640 1013 938 332 -469 -374 1013 1103 17 -286
3991 -286 299 558 634 38 1040 1105 52 599 1657 931 652 -1 1300 944 -380 -599 292 -311 92
4010 92 -237 -596 904 310 -653 866 738 867 -313 -724 1020 146 231 160 -308 1242 399 -1187 862
4029 862 685 1329 -135 -70 1087 265 444 -109 402 403 -1158 -629 544 790 -558 -58 697 970 42
$$ packed form
3893h7M26j221J114M88j162j96j0J481o62j315Q30R49j046p86J110m0K04l93N39
3912B23k96J06L8n28N38m7m3p10KP70J73j192N77O80r71J542k5O7k50r58R15m34
3934A77l71Q5j73J315k24n4M13o43N79r16N67l15J443j664q47J020J290j171j168
3953f57K30J144R77r22j40R99o57j157k81J071n05k78r63J512M48j630J515M93
3971A199mj331R07n37M64m80n81N78L32j67j020J653p5o06q01R5J387R0j086l03
3991b86N85K59P6n96J002O5j053N47J058p26k79o53J301l56j324k19Q91o03M03
4010I2l29l59J500n94r63J519j28J29j180m11J744q74Q5p1m68J550q43j586K049
4029H62j77O44j464O5J157q22J79n53N11Jj561N29J173K46j348N00P55K73r28
$$ plain form
4048 42 -746 572 1068 893 -793 -518 -91 1024 -910 -862 538 -619 -891 -889 731 1047 -443 -864 264
4067 264 -548 -1190 -1059 -341 26 -572 -506 -106 236 -140 -1487 -610 964 7 -680 -1247 -465 423 -585
4086 -585 -24 651 346 -404 -561 308 12 -1006 -884 684 434 -402 -519 -270 804 -322 -626 -36 108
4105 108 265 -160 -739 408 389 -83 -475 562 535 -218 -151 -40 252 -1053 57 -40 587 -1382 -947 6
4125 6 5 -858 -1518 356 -618 -1006 -1070 -307 1141 -240 -1728 -129 -513 48 -772 -1073 307 882 -1918
4144 -1918 -413 323 1160 436 -639 -726 706 -488 -485 -642 858 -276 -1149 19 664 -131 -309 -7
4162 -7 465 -293 -658 -1277 863 -297 -544 -749 -319 -27 -361 -731 -486 870 -600 -131 573 232 73
4181 73 -834 -245 798 -638 -271 863 406 416 28 -152 21 -27 -153 244 238 595 657 -115 316 769 -794
$$ packed form
4048D2p88J318M96j75j686K75M27J115j934M8J400j157k72KJ620L16j490m21J128
4067B64q12o42J31P18L67n98O6M00L42l76j347Q77J574r57o87n67P82Q88j008
4086e85N61O75l05p50j57Q69k96j018J22J568k50q36j17K49J074j126l04N90J44
4105A08J57m25n79J147j9m72l92J037k7p53O7J11K92j305J110r7O27j969M35R53
4125Fjq63o60J874r74l88o4P63J448j381j488J599l84N61q20l01J380N75k800
4144a918J505P36Q37p24j075q7J432j194Lj57J500j134q73J168O45p95j78L02
4162gM72p58l65o19K140j160k47k05M30K92l34l70K45J356j470M69P04l41j59
4181G3r07N89J043j436L67J134m57J0l88j80J73m8j26L97oL57O2p72M31M53j563
$$ plain form
4202 -794 -1031 249 1857 146 -451 871 856 122 -631 337 51 1032 -34 -948 1002 1374 238 -198
4220 -198 -20 1293 227 556 746 115 812 -357 48 369 -493 474 10 1683 -384 -21 161 857
4238 857 1009 -802 -694 -48 1115 988 -1469 379 213 411 631 1277 921 387 -1108 593 814 -604
4256 -604 260 429 1307 8 -395 -261 -51 258 -805 -390 318 328 544 412 203 802 -353 -106 329
4275 329 2126 -172 -101 -617 1273 48 -350 264 -113 52 -220 293 -400 4 189 -258 329 531 -465
4294 -465 -543 381 773 -720 -343 -66 310 230 -545 33 313 -560 90 -329 -276 -309 -230 -239 406 952 -236 -941
4316 -941 -76 -895 -161 -83 61 -143 -639 -265 -102 -170 -516 -521 -732 -442 12 -135 -1024 417 -85 898 -1012
4337 -1012 86 -11 -664 -30 398 -600 -400 -395 266 142 339 -118 -1300 -207 -263 747 -1124 375 550
$$ packed form
4202g94k37J280J608j711n97J322j5p34p53R68k86R81j066r14J950L72j136m36
4220a98J78J313j066L29J90o31O97j169M05L21q62R67m64J673k067L63J82O96
4238H57J52j811J08O46J163j27k457J848j66J98K20O46l56n34j495J701K21j418
4256f04Q64J69Q78j299m03J34K10L09j063M15P08J0K16j32k09N99j155K47M35
4275C29J797k298P1n16J890j225l98O14l77J65k72N13o93M04J85m47N87K02r96
4294d65p8R24L92j493L77K77L76q0p75N78K80q73O50m19N3l3P9rO45N46j188p05
4316i41Q65q19P34P8J44k04m96L74J63o8l46nk11K90M54j47q89J441n02R83j910
4337a012J098r7o53O34M28r98K00NO61j24J97m57j182J093n6J010j871J499J75
$$ plain form
4356 550 -40 66 -801 242 -98 -595 -356 111 -918 -1395 -327 -97 -425 -721 969 -718 -134 -331
4374 -331 555 -83 -326 -414 -533 -430 92 -778 -159 -182 -29 -264 -209 879 732 174 154 344 -877 -283 -570
4395 -570 533 -337 -1159 -1329 -397 -545 -650 -513 -967 -508 -142 -1301 -671 -676 -76 -617 -363 -435 -712 330
4415 330 -645 -313 -470 -120 -214 -31 -18 518 -566 -1552 -410 22 -461 148 -268 424 -569 -567 -78 -317 -1405
4436 -1405 216 58 -314 395 48 216 553 294 -1141 200 1319 -490 -674 -172 427 -244 11 -524
4454 -524 44 -593 1195 184 -114 173 156 837 406 915 405 294 362 -300 530 -447 -254 617 -359 -950
4474 -950 54 145 118 13 -609 576 1503 492 -115 -302 603 -576 -201 585 -112 299 -491 -986 571
4493 571 165 -1269 -1355 1064 -879 -476 210 -753 311 -758 -215 -874 1419 680 -969 1514 1405 460
$$ packed form
4356E50n90J06q67J043l40m97K39M67j029m77J068K30l28k96J690j687N84j97
4374c31Q86o38k43q8j19J03N22q70O19k3J53k35N5J088j47n58k0J90j221N94k87
4395e70J103q70q22j70R32j48j05J37m54M59L66j159O30nO00n41K54p2k77J042
4415C30r75L32j57L50r4J83J3N36j084r86J142M32m83O09m16O92r93KM89k39j088
4436a405J621j58l72P09l47J68L37k59j435J341J119j809j84N02N99o71K55n35
4454e24N68o37J788j011k98K87j7O81m31N09n10j11O8o62Q30r77J93Q71r76n91
4474i50J004R1k7j05o22J185R27j011o07j87R05j179L75P86o97M11p90m95J557
4493E71m06j434q6K419j943M03O86r63J064j069N43o59K293p39j649K483j09r45
$$ plain form
4511 460 12 834 88 -359 715 571 771 662 49 -1034 395 625 345 -485 783 733 -139 674 547
$$ packed form
4511D60m48Q22p46m47J074j44K00j09o13j083J429K30k80q30J268n0q72Q13j27
$$ [...]
##END NTUPLES=NMR FID
##END=
