##TITLE=1H_Ser 7-2-t-2
 CDCl3
 8 sc, 
 27.10.2022
##JCAMPDX= 6.0         $$ Bruker NMR JCAMP-DX V2.0
##DATA TYPE= NMR FID
##DATA CLASS= NTUPLES
##ORIGIN= UXNMR, Bruker Analytische Messtechnik GmbH
##OWNER= root
$$ XWIN-NMR		Version 3.5
$$ Thu Oct 27 13:59:46 2022 Russian Standard Time (UT+4h)  she@DPX200
##.OBSERVE FREQUENCY= 200.1313499994
##.OBSERVE NUCLEUS= ^1H
##.DELAY= (6, 6)
##.ACQUISITION MODE= SIMULTANEOUS
##.ACQUISITION SCHEME= undefined
##.AVERAGES= 8
##.DIGITISER RES= 18
##SPECTROMETER/DATA SYSTEM= spect
##.PULSE SEQUENCE= zg30
##.SOLVENT NAME= CDCl3
##.SHIFT REFERENCE= (INTERNAL, CDCl3, 0, 15.7039)
##AUDIT TRAIL= $$ (NUMBER, WHEN, WHO, WHERE, WHAT)
$$ ##TITLE= Audit trail, XWIN-NMR		Version 3.5
$$ ##JCAMPDX= 5.01
$$ ##ORIGIN= Bruker BioSpin GmbH
$$ ##OWNER= she
$$ F:/spectra/data/she/nmr/H-F/1/audita.txt
$$ ##AUDIT TRAIL=  $$ (NUMBER, WHEN, WHO, WHERE, WHAT)
(   1,<2022-10-27 13:58:29.04 +0400>,<she>,<DPX200>,
      <created by zg, POWCHK disabled, PULCHK disabled
       configuration hash MD5:
       00 E9 B6 7A A2 85 ED C7 34 08 36 98 17 FE 4E 26
       data hash MD5: 16K
       BE 29 EA 76 BD CA D1 7B 76 CB 33 9E B7 CC 26 09>)
$$ ##END=
$$ 
$$ hash MD5
$$ 44 17 C9 E3 B8 4F 15 C7 BB 19 13 F2 80 CE C7 1D
##$RELAX= 
##$RELAX= 
##$RELAX= 
##$RELAX= 
##$RELAX= 
##$RELAX= 
$$ Bruker specific parameters
$$ --------------------------
##$DU= <F:/spectra>
##$EXPNO= 1
##$NAME= <H-F>
##$PROCNO= 1
##$TYPE= <nmr>
##$USER= <she>
##$AMP= (0..31)
100 100 100 100 100 100 100 100 100 100 100 100 100 100 100 100 100 100 
100 100 100 100 100 100 100 100 100 100 100 100 100 100 
##$AQSEQ= 0
##$AQ_mod= 1
##$AUNM= <au_zg>
##$AUTOPOS= <>
##$BF1= 200.13
##$BF2= 200.13
##$BF3= 200.13
##$BF4= 200.13
##$BF5= 200.13
##$BF6= 200.13
##$BF7= 200.13
##$BF8= 200.13
##$BYTORDA= 1
##$CFDGTYP= 0
##$CFRGTYP= 5
##$CHEMSTR= <none>
##$CNST= (0..31)
1 1 145 1 1 1 1 1 1 1 1 1 1 1 1 1 1 1 1 1 1 1 1 1 1 1 1 1 1 1 1 1 
##$CPDPRG= <>
##$CPDPRG1= <>
##$CPDPRG2= <>
##$CPDPRG3= <>
##$CPDPRG4= <mlev>
##$CPDPRG5= <mlev>
##$CPDPRG6= <mlev>
##$CPDPRG7= <mlev>
##$CPDPRG8= <mlev>
##$CPDPRGB= <>
##$CPDPRGT= <>
##$D= (0..31)
0 1.2 0 0 0 0 0 0 0 0.06 0 0.03 0 0 0 0 0.0002 0 0 0 0 0 0 0 0 0 0 0 0 
0 0 0 
##$DATE= 1666864708
##$DBL= (0..7)
120 120 120 120 120 120 120 120 
##$DBP= (0..7)
150 150 150 150 150 150 150 150 
##$DBP07= 0
##$DBPNAM0= <>
##$DBPNAM1= <>
##$DBPNAM2= <>
##$DBPNAM3= <>
##$DBPNAM4= <>
##$DBPNAM5= <>
##$DBPNAM6= <>
##$DBPNAM7= <>
##$DBPOAL= (0..7)
0.5 0.5 0.5 0.5 0.5 0.5 0.5 0.5 
##$DBPOFFS= (0..7)
0 0 0 0 0 0 0 0 
##$DE= 6
##$DECBNUC= <off>
##$DECIM= 32
##$DECNUC= <off>
##$DECSTAT= 4
##$DIGMOD= 1
##$DIGTYP= 9
##$DL= (0..7)
0 120 120 120 120 120 120 120 
##$DP= (0..7)
150 150 150 150 150 150 150 150 
##$DP07= 0
##$DPNAME0= <>
##$DPNAME1= <>
##$DPNAME2= <>
##$DPNAME3= <>
##$DPNAME4= <>
##$DPNAME5= <>
##$DPNAME6= <>
##$DPNAME7= <>
##$DPOAL= (0..7)
0.5 0.5 0.5 0.5 0.5 0.5 0.5 0.5 
##$DPOFFS= (0..7)
0 0 0 0 0 0 0 0 
##$DQDMODE= 0
##$DR= 18
##$DS= 0
##$DSLIST= <SSSSSSSSSSSSSSS>
$$ [...]
##$SUBNAM2= <"">
##$SUBNAM3= <"">
##$SUBNAM4= <"">
##$SUBNAM5= <"">
##$SUBNAM6= <"">
##$SUBNAM7= <"">
##$SUBNAM8= <"">
##$SUBNAM9= <"">
##$SW= 18.0517283424941
##$SWIBOX= (0..15)
0 0 2 0 0 0 0 0 0 0 0 0 0 0 0 0 
##$SW_h= 3612.71676300578
##$TD= 16384
##$TD0= 1
##$TE= 0
##$TE2= 300
##$TE3= 300
##$TEG= 300
##$TL= (0..7)
0 120 120 120 120 120 120 120 
##$TP= (0..7)
150 150 150 150 150 150 150 150 
##$TP07= 0
##$TPNAME0= <>
##$TPNAME1= <>
##$TPNAME2= <>
##$TPNAME3= <>
##$TPNAME4= <>
##$TPNAME5= <>
##$TPNAME6= <>
##$TPNAME7= <>
##$TPOAL= (0..7)
0.5 0.5 0.5 0.5 0.5 0.5 0.5 0.5 
##$TPOFFS= (0..7)
0 0 0 0 0 0 0 0 
##$TUNHIN= 0
##$TUNHOUT= 0
##$TUNXOUT= 0
##$USERA1= <user>
##$USERA2= <user>
##$USERA3= <user>
##$USERA4= <user>
##$USERA5= <user>
##$V9= 5
##$VALIST= <valist>
##$VCLIST= <CCCCCCCCCCCCCCC>
##$VD= 0
##$VDLIST= <DDDDDDDDDDDDDDD>
##$VPLIST= <PPPPPPPPPPPPPPP>
##$VTLIST= <TTTTTTTTTTTTTTT>
##$WBST= 1024
##$WBSW= 4
##$XGAIN= (0..3)
0 0 0 0 
##$XL= 0
##$YL= 0
##$YMAX_a= 82619
##$YMIN_a= -157147
##$ZGOPTNS= <>
##$ZL1= 120
##$ZL2= 120
##$ZL3= 120
##$ZL4= 120
##$ABSF1= 10
##$ABSF2= 0
##$ABSG= 5
##$ABSL= 3
##$ALPHA= 0
##$AQORDER= 0
##$ASSFAC= 0
##$ASSFACI= 0
##$ASSFACX= 0
##$ASSWID= 0
##$AUNMP= <proc_1d>
##$AZFE= 0.1
##$AZFW= 0.1
##$BCFW= 1
##$BC_mod= 2
##$BYTORDP= 1
##$COROFFS= 0
##$CY= 11.3945322036743
##$DATMOD= 1
##$DC= 2
##$DFILT= <>
##$DTYPP= 0
##$F1P= 2.36226072786647
##$F2P= -0.459571619588291
##$FCOR= 0.5
##$FTSIZE= 0
##$FT_mod= 4
##$GAMMA= 1
##$GB= 0.15
##$INTBC= 1
##$INTSCL= 1
##$ISEN= 128
##$LB= 0.24
##$LEV0= 0
##$LPBIN= 0
##$MAXI= 10000
##$MC2= 0
##$MEAN= 0
##$ME_mod= 0
##$MI= 1.114404
##$NCOEF= 0
##$NC_proc= 0
##$NLEV= 6
##$NOISF1= 3.799351
##$NOISF2= 2.8
##$NSP= 1
##$NTH_PI= 0
##$NZP= 0
##$OFFSET= 15.70392
##$PC= 1
##$PHC0= -18397.03
##$PHC1= 16.4007
##$PH_mod= 1
##$PKNL= yes
##$PPARMOD= 0
##$PSCAL= 0
##$PSIGN= 0
##$REVERSE= no
##$SF= 200.130013532006
##$SI= 16384
##$SIGF1= 3
##$SIGF2= 2
##$SINO= 400
##$SIOLD= 16384
##$SREGLST= <1H.CDCl3>
##$SSB= 0
##$STSI= 0
##$STSR= 0
##$SW_p= 3612.71676300578
##$SYMM= 0
##$S_DEV= 0
##$TDeff= 0
##$TDoff= 0
##$TI= <>
##$TILT= no
##$TM1= 0
##$TM2= 0
##$TOPLEV= 0
##$USERP1= <user>
##$USERP2= <user>
##$USERP3= <user>
##$USERP4= <user>
##$USERP5= <user>
##$WDW= 1
##$XDIM= 8192
##$YMAX_p= 0
##$YMIN_p= 0
$$ End of Bruker specific parameters
$$ ---------------------------------
##NTUPLES= NMR FID
##VAR_NAME=  TIME,          FID/REAL,        FID/IMAG
##SYMBOL=    X,             R,               I
##VAR_TYPE=  INDEPENDENT,   DEPENDENT,       DEPENDENT
##VAR_FORM=  AFFN,          ASDF,            ASDF
##VAR_DIM=   8192,          8192,            8192
##UNITS=     SECONDS,       ARBITRARY UNITS, ARBITRARY UNITS
##FACTOR=    0.0002768,     1,               1
##FIRST=     0,             0,               0
##LAST=      2.2672688,     0,               0
##MIN=       0,             -157147,         0
##MAX=       2.2672688,     82619,           0
$$ Real data points
##PAGE= N=1
##DATA TABLE= (X++(R..R)), XYDATA
$$ [...]
1883d59N19M65P0k4n70p3o02N20O42p7r43m39M77P08l98q9K31p2k63l50Q28O40
1905G41p23m74N58O95l08k23M01M5r79P3R91J18m14o31J62L97o41K22L23q1j088
1926h36j0R48J85q58kP38l24k44R9Q75n11n94K67Q67K74n77p68J204J04r11L01
1947B27O14m78j256P19J012o68q53N30L35l00l56L93J99m77m31M38R20n66q60
1966h58M57N91j47k54P69N1q64m12J310K82p86OnM3j64K40M06l50m15m27L70P80
1988F23l00o51j28j02NJ39Q29r2j015j81Q39j18k8L94k25r4MQO59K36l19o47J55
2011iK98J68r4O1m49m24M48K09J27l91k97k29L90K56j45m02L49l08j70O54L09
2032C51j11p41J99L35L30l10J52K49k86n16M31O91k00p73K18L57m19j96M28K03
$$ plain form
1883 -459 60 525 595 571 1 -72 -674 -154 488 411 -532 -971 -494 214 -184 -273 -42 -114 -377 -727 101 741
1905 741 18 -456 102 797 489 266 667 712 -267 -194 797 915 501 -130 32 429 -212 10 333 252 -836
1926 -836 -846 102 287 -571 -573 165 -159 -403 -304 571 60 -534 -267 600 874 297 -471 733 837 -74 227
1947 227 841 363 -893 -174 838 170 -683 -153 182 -118 -474 -81 118 -359 -790 -352 568 2 -858
1966 -858 -401 190 43 -211 558 609 -255 -667 643 925 139 145 140 183 19 259 665 315 -100 -527 -157 623
1988 623 323 -328 -456 -558 -553 -414 415 323 -692 -873 -34 -152 -180 214 -11 -105 -101 -93 566 802 483 -164 -9
2011 -9 289 457 363 424 -25 -449 -1 208 335 -56 -353 -582 -192 64 -81 -483 -134 -442 -612 42 351
2032 351 240 -501 -302 33 363 53 205 454 168 -348 83 774 574 -199 19 376 -43 -239 189 392
2052C92n34p46N99O02k30o96J24N83o59l58Q44N09n14o25M87O40p01K19M91R7
2072E24p75k0N02N45p37l85M06O37o61o57R25M41j336Q2Q98l03r07K21J009j58
2092B51n77j81M59j27m12K47Q97l8j194j40J717O5j097J64P78n44o74P11M86p12
2112G9k76L53K85m26j94J08N2l2l59K32L96l05j062N93Q26k89n75P26q1n29L03
2133a75Q65J06o35K8q8J16O03p7j38k34m82p73N89J128m59q99L07p2l34L91O70
2154D37m81m79Q3j17M67R30p67m37K57k8l4M91L52m61o20O80K81k19k20K7l2j48
2176c8P0o7M2jk27n09Q17L53p87j5M22q6k70M55K61n13l76M54J27J79nl47J46
2199H5L23n17j68P18J47q33L18O98p28l22O03M53q47K5K27J35l10j09n6M70m48
$$ plain form
2052 392 -142 -888 -289 313 83 -613 -489 94 -565 -923 -79 430 -84 -709 -222 418 -283 -64 427 524
2072 524 -251 -271 231 776 39 -346 60 697 36 -621 304 745 -591 -509 389 86 -821 -600 409 251
2092 251 -326 -507 -48 -175 -587 -340 557 519 -675 -815 902 967 -130 34 812 268 -406 305 791 79
2112 79 -197 156 441 15 -179 -71 -19 -51 -410 -178 218 -87 -1149 -556 270 -19 -594 132 51 -478 -175
2133 -175 690 796 161 189 101 217 820 743 605 371 -111 -884 -295 833 374 -525 -218 -290 -624 -233 437
2154 437 -44 -523 -440 -557 -90 840 73 -364 -107 -135 -169 322 674 213 -407 273 554 335 115 142 110 -38
2176 -38 32 -35 7 6 -221 -730 87 440 -347 -362 60 -26 -296 159 420 -93 -469 -15 112 291 286 -61 85
2199 85 408 -109 -277 441 588 -245 73 771 43 -279 324 777 -70 -45 182 317 7 -102 -158 312 -136
2220a36l24L95L87n34m35L49P52o48l87P94L50n61j80M93L03n65j39Q47K62j048
2240b5j32L73M42o23j51K86j10o34N4P05K09j078N7N37o2q4j30O24m12l75J46
2261c83O29M5l41q7L06J0k17L36M22k97o25N9M77K5k87j14Q4l94l16O31K32l06
2283a11n12j3Q00k12j37J66l70j01o1N25P89k55p13L43l02M09J14K22l98l90r9
2304c06M94M60l46k46l44j6P4L44j14r2m7m10J29O02J55n36l23L09p9K6K34J54
2326A22n6j79j8L62R0l10j41O9O43m02j48K59R2l79l58N38N5l60k40L82o9l58
2348d06L4N65l38l33r7N86o2l37j43O83l63O0J56K31Rn99N93N48k07j111M53L12
2370B34R2n37M38R2n29l73M23Q23q07l69J76M12m53O3L90K20n56l14L27Q18m85
$$ plain form
2220 -136 -460 -65 322 -212 -647 -298 454 -194 -581 213 563 2 -178 315 618 53 -86 761 1023 -25
2240 -25 -157 216 658 35 -116 170 60 -574 -520 185 394 -684 -627 -90 -152 -236 -366 258 -154 -529 -383
2261 -383 246 291 -50 -137 169 179 -38 298 720 423 -202 -143 334 359 72 -42 42 -352 -668 -37 195 -111
2283 -111 -623 -636 164 -48 -185 -19 -389 -490 -551 -26 763 508 -205 138 -164 245 359 581 183 -207 -306
2304 -306 188 648 302 56 -288 -304 -230 114 0 -92 -139 -549 -420 182 337 -199 -522 -213 -292 -266 -32 122
2326 122 66 -113 -131 231 321 11 -130 -61 582 180 32 291 383 4 -354 184 239 -121 -361 21 -48 -406
2348 -406 -372 193 -145 -478 -575 11 -51 -388 -531 152 -211 -151 5 236 245 -354 239 787 580 -531 -78 234
2370 234 326 -211 227 319 -210 -583 -160 663 -144 -513 -337 75 -378 -315 75 295 -261 -575 -248 570 85
2391H5o26N89K13l32J46M31J50p61k98P41J86k35m09K65Ol63J82K20Q3p59j02
2412e88K81L33j64o8K57k36j22j50N71L8j42j67J40J03j5J67K65k41m75J23M76
2433C86q7J34m21op3J64j71K10j74m89K06P2P06o23k43K32j22Q2K39J59j9k55
2455i3j61L44K02L7l35J46j03K82p4R7N6n08j17L96Qj86j72K93j33k71j33L94
2477c1K26m45k04J34M63k03q9l0L56m70J46M29J1n93J5O47K31q29J25K46J54m88
2499a99n1Q93j67p04j60M57J66n83M4M82l16o20M86J56J27o15K11N44J60p14L93
2520a0N16o33j57O53P6l46n17K46N83K0l02j17K37Po48K75O35l56q52Q3O48J5
2542E6l13J58M71p97j72L21Q25m59l48o3L53j24k4M47N5n06m57N38O62o44m7N15
$$ plain form
2391 85 -541 48 261 -71 75 506 656 -105 -403 338 524 289 -120 145 151 -212 -30 190 273 -486 -588
2412 -588 -307 26 -138 -206 51 -185 -307 -457 114 152 10 -157 -17 86 71 238 503 262 -213 -90 386
2433 386 299 433 12 6 -67 97 -74 136 -38 -527 -321 -249 457 -166 -409 -177 -299 -217 22 181 162 -93
2455 -93 -254 90 292 329 -6 140 37 319 245 342 398 -110 -227 169 177 -9 -181 112 -21 -292 -425 -31
2477 -31 195 -250 -454 -320 143 -60 -149 -179 177 -293 -147 282 293 -300 -285 362 593 -236 -111 135 289 -199
2499 -199 -250 643 476 -228 -388 69 235 -348 -304 178 -138 -758 -272 -116 11 -604 -393 151 311 -403 -10
2520 -10 506 -127 -284 369 445 99 -418 -172 411 431 129 12 249 256 -392 -117 518 162 -690 -607 41 56
2542 56 -257 -99 372 -425 -597 -276 549 90 -258 -321 32 -92 -116 331 386 -120 -577 -39 623 -21 -68 447
2564D47j91n69L56K90j62j35m81J60L59Ok53l15L59j74l16P57L66q99J32M29K0
2585A86K4O3J43o99L03J42J49K05K0p61o9L18L47j48j89n4n34J08N62j52k76K22
2607i0j73R5J34o3N3J5K66m58j53P50R6n07J80M20p53q8M82L05o31J58M11m77
2629b8j67M62k76j38L47k23k22P61o36n91M73O03p67k16M83L52o25L74O8Q7j85
2650f4K2L12J32k67k58K80M24n03m40N72N12j179k0Q61N5p88KM97m02m33P40K5
2672H0o4n69L29K89L58l68k58K93o0l87M43N43k91p70K92O85m85q6J64Q5l52P3
2694e6M89J82p49Q6j07J77M1l93N47k06m54j97K89M83m51k98J44J91m9L32K07
2715B08j3l32j92L39K82Ml22N7k7M9O7M5j07m31J05j87L67k4l54P9L3P9r2K59
$$ plain form
2564 447 256 -313 43 333 171 36 -445 -285 74 80 -173 -488 -129 -303 -619 138 504 -395 -263 166 186
2585 186 210 273 416 -283 20 162 311 516 536 -225 -294 24 371 223 34 -20 -554 -446 116 -36 -312 -90
2607 -90 -263 -168 -34 -97 -44 -29 237 -221 -374 376 472 -35 145 565 -188 -276 206 511 -120 38 449 -28
2629 -28 -195 267 -9 -147 200 -23 -245 516 -120 -711 -238 365 -402 -618 -135 217 -408 -34 34 121 -64
2650 -64 -42 270 402 135 -123 157 581 78 -362 210 722 -457 -477 384 439 -349 -347 150 -252 -685 55 80
2672 80 16 -553 -224 65 423 55 -203 90 30 -357 86 629 338 -432 -140 545 60 -26 138 223 -129 -56
2694 -56 433 615 -134 -48 -155 22 63 -330 217 11 -443 -640 -351 132 -319 -617 -473 -282 -331 1 208
2715 208 195 -137 -329 10 292 296 -26 31 4 53 120 165 58 -373 -268 -455 -88 -112 -466 -387 -354 -275 -367 -108
2739a08N44m69j35J49P7M6j73J26n5m0K23o3N35m33l08j10M77J1k61p0K82K4n38
2762b69K70Q2n6k98j13N43j96j72J11M1K09n01M4N61l3n16J66J24J47j56Q7J65
2784B40P3l72k37O54k84k59M28J06j7l65j76M66l49j27M9L23l01k54K92M40m87
2805a57j68K31P6J4j28J50J35k25n62O62L33n12L46M2J16o27L80J83M5k37k32
2826a35M28j26k84n6J2L53n50RK67J96m58J81J43J06k83n5O00l14k59O7K67P9
2848A88j6J67k9q4m93K99M90j89m89j47M08Kl29L55j30j3n39L20J38J58l51O3
2870b21j01K35j30J8Q5r9K04J72jM1j4k72K27K19k83K10rk34j40J54J22N5l95
2893a57J5N1J1k81J63K49K23n94R9Q0L76j49m46L23O1m9J8K66q2o2l21N24j71
$$ plain form
2739 -108 436 -33 -168 -19 58 104 -69 57 2 -38 185 122 657 224 -84 -194 283 294 33 -37 245 269 -269
2762 -269 1 83 27 -271 -384 159 -37 -209 -98 -57 152 -349 -305 256 223 -293 -127 -3 144 -12 75 240
2784 240 313 -59 -296 358 74 -185 243 349 332 -33 -209 257 -92 -219 -170 153 -148 -402 -110 330 -157
2805 -157 -325 -94 -18 -4 -132 18 153 -72 -634 28 361 -151 195 237 353 -274 106 289 334 97 -135
2826 -135 293 167 -117 -173 -161 192 -358 -349 -82 114 -344 -163 -20 86 -197 -252 348 34 -225 -158 109 188
2848 188 172 339 310 226 -267 32 522 333 -156 -303 105 107 -222 133 3 -10 -549 -229 -91 67 -284 -221
2870 -221 -322 -87 -217 -199 -114 -213 -9 163 162 203 189 -83 144 363 80 290 281 47 -93 61 183 238 -157
2893 -157 -142 -91 -80 -361 -198 51 274 -320 -221 -141 235 86 -360 -37 24 -25 -7 259 177 115 -206 318 147
2916A47k13o6L29O3l25L40k17J25l75OJ09p7j69L4L45j04j17j7J70l1l89J02P47
2939D17j46o96M63J21N2m28K61K78k61k35R0M59k35j91J07K89r3k45n7M54m66
2960f2m61L65K44J22n61Q4M17l82M3K84k7p0l65M52L02m18p2L93j05k92J25j1
2982EM40n97NK88L8j90j73J59K99n10k01P28j54l65l6J63J28j28J02R4k22j6N3
3005i0l4K97o8k08N5K31q5j47L04O1l35k3J26j39P8J83k68J5j8P1ro2K41m16K00
3030d0K2M6j98M90k37j94j87L16J37m58M22K12k25k59K82k18L77j60j68j60L98
3051A98o6k21L18J80n13n9K39k45L6K55j40r8j67J47k08K88J25j66Q6J83j56l98
3073c82P13j30m31K41L22k5l89M97l92m1k3o7J18R7j18m21N69K70o20j77J39K81
$$ plain form
2916 147 -66 -132 197 260 -65 275 58 183 -192 -186 -77 -154 -323 -289 56 -48 -165 -182 -12 -43 -432 -330 417
2939 417 271 -425 38 159 211 -217 44 322 61 -174 -84 375 140 -51 56 345 252 7 -50 404 -62
2960 -62 -523 -158 86 208 -353 -269 148 -234 -191 93 66 -4 -369 83 385 -33 -105 288 183 -109 16 5
2982 5 445 -152 -147 141 179 -11 -184 -25 274 -236 -437 291 137 -228 -264 -101 27 -101 1 95 -127 -143 -90
3005 -90 -124 173 105 -103 -48 183 98 -49 255 316 -19 -42 84 -55 23 206 -62 -47 -65 6 -3 -65 176 -240 -40
3030 -40 -18 28 -170 320 83 -111 -298 18 155 -303 119 331 106 -153 129 -89 288 128 -40 -200 198
3051 198 132 -89 229 409 -104 -163 76 -169 -133 122 -18 -116 -283 -136 -344 -56 69 -97 -11 172 16 -382
3073 -382 331 201 -230 11 333 308 -81 416 24 -17 -40 -107 11 108 -10 -431 138 408 -212 -389 -250 31
3095C1m58L70O09o69m31M01K72k01K18K55j57k36Nj81N71N6m86j6J45M7m32J82
3117a05N30o23j61L11K14l34j39M22k25j50J75o4J47j91j90J71L80j9n80O08M9
3138B26k97J12K7J61k46o8L67R3j00j75K6j82K06M7m03L40q1n52J45L38l3j73
3160b22M65l05l83QN97l05K01j21O4J02%j69J77J13k26j69K44J66j91N3J61m0
3182B20j52j28j59J9K57j17j21L45k29k49K30J12o4l75K77K13l37J45J16K21l67
3203a43O6l6M30j50k28K1L4J14l39L71kj01l45K04K93J9m22J28J1o6j16K10L56
3226C09l17k33O9M78l09o9L20K77n49r3N15k39k35O6L02j55j58J79j18L8l70j07
3248c99M54L06m59q2L44k52r5P5L33k86l60K29K69K10m42J75J0j43j21L76K31
$$ plain form
3095 31 -427 -57 552 -117 -548 -147 125 -76 142 397 240 4 9 -172 399 455 -31 -47 98 145 -287 -105
3117 -105 425 -198 -359 -48 166 -168 -307 115 -110 -260 -85 -149 -2 -193 -383 -212 168 149 -431 177 226
3138 226 -71 41 68 229 -17 -85 282 375 275 100 126 -56 150 197 -206 134 53 -499 -354 -16 -49 -222
3160 -222 243 -62 -445 -437 160 -145 56 -65 -1 101 101 -68 109 222 -4 -173 71 237 46 99 260 220
3182 220 68 -60 -219 -200 57 -60 -181 164 -65 -314 -84 28 -36 -411 -134 79 -258 -113 3 224 -143
3203 -143 -77 -113 317 167 -61 -40 -6 108 -231 140 138 37 -308 -104 189 208 -214 -86 -75 -141 -257 -47 309
3226 309 -8 -241 -172 306 -3 -72 248 525 -24 -117 398 159 -76 -10 292 137 -21 158 40 78 -292 -399
3248 -399 55 361 -98 -180 164 -88 -183 -108 225 -61 -421 -192 77 287 -155 20 30 -113 -234 142 373
3269C73k59j84L5K25K32n08m4L67k27m05M52R0k85j60j06K35J87K45l98K01j10
3290d4k65L44K02j93k38J15J49M8k58N13k73j81R1KL48k09j65j73K47k30L9R6
3312c5P9l18q3L29O0J81m14L5P7k34J88Q9R2q9k2m0K24J09j65r4O8J27k61l0K46
3337A19L1k90L71l01J72m14K32J48q6l52L41K20p1m06R1q9L67m83M08N7j24j6
3359g5JL01j35k31J91PJ15k65k9M54j06k61J32J00m36K61n3L11l82k16L57on3
3382a8l55L86Q6j56k40K74L13n35k2M83l28o1L0K28O0Ll45M38j53j83L83l1O4
3405C21o12K40M94j81l29OQ7k64J36q2J21L5m73N17l2J93k31j44L59l58J61N9
3427B3M99p8m79j06K75J40j88j4O4j55O4N1J14k6m18K00L9p2j19K35J10k92j53
$$ plain form
3269 373 114 -70 -35 190 422 -86 -130 237 10 -395 57 147 -138 -298 -404 -169 18 263 -135 66 -44
3290 -44 -309 35 237 44 -194 -79 70 118 -140 373 100 -81 10 12 360 151 -14 -187 60 -170 -131 -35
3312 -35 44 -274 -357 -28 32 213 -201 -166 -89 -323 -135 -46 46 -43 -65 -105 119 228 63 -31 37 164 -97 -127 119
3337 119 150 -140 231 -70 102 -312 -80 68 -18 -370 -29 191 120 -286 -195 -284 83 -400 8 65 -59 -75
3359 -75 -74 227 92 -139 52 59 174 -91 -120 334 228 -33 99 199 -237 24 -29 282 -100 -316 41 35 -18
3382 -18 -373 13 99 -57 -297 -23 290 -245 -267 216 -112 -173 -143 85 145 148 -197 241 88 -95 288 257 321
3405 321 -291 -51 443 262 -67 -61 26 -238 -102 -184 -63 -28 -501 16 -16 177 -54 -198 161 -197 -36 23
3427 23 522 444 -35 -141 134 274 86 72 136 -19 45 96 210 184 -234 -34 5 -67 -186 49 159 -133 -286
3450b86j13L59J29k0j67K08k00J19j7N0j1j09j52K72J82p3j24J09k2r8J1J07J21
3473B75m25j34M36J16l75p0Q9J64j85j89l9J65q7P6L30n9k37K94N1k7J41J59l95
3496G4O2j27j89K09j8j40rM17J74n03k7K52m4m19L1N33l90j49K6J30J51R0j28
3519FJ49k30l45M42K87N8o37K50K15L7n13L32L32j37n37M13m7J02k86K15l25K05
3541a4Kk41L90j31o77L73O26m63j84K79J24l26J59J37J74k77r2K91q2n6r8L18
3563B32m9N0k91J19K87l17m36J52L59p0j13J45j56K0k02J98o2J00j7k77L41Qk55
3586b34K08J58l16j27M96K13m50m4K09O2j84J76J15j3m13J53k43N29l57j13J2
3607a63J11j99o4M46j2l36L3K93J72k03K15k83J26j30J67k4O9j39k11J18K71k29
$$ plain form
3450 -286 -399 -40 89 69 -98 110 -90 29 12 62 51 -58 -210 62 244 171 47 156 134 36 47 154 275
3473 275 -150 -284 152 268 -107 -177 -88 76 -109 -298 -337 -172 -259 -183 147 88 -149 145 196 169 310 469 74
3496 74 136 9 -180 29 11 -129 -138 279 453 -50 -77 175 131 -288 -257 276 -114 -263 -237 -107 44 134 6
3519 6 155 -75 -420 22 309 367 -270 -20 195 232 -281 51 383 246 -291 122 75 177 -109 106 -219 -14
3541 -14 -12 -253 137 6 -671 -298 328 -135 -319 -40 84 -242 -83 54 228 -49 -141 150 68 12 -86 232
3563 232 183 233 -58 61 348 31 -405 -253 106 36 -77 68 -88 -68 -270 -72 -134 -34 -51 -328 13 21 -234
3586 -234 -26 132 -184 -311 185 398 -52 -96 113 175 -9 167 282 269 -144 9 -234 295 -62 -175 -163
3607 -163 -52 -251 -315 131 119 -217 -184 109 281 78 293 10 136 6 173 149 218 79 -132 -14 257 28
3629B8K3m1M22n69J90K13k45m8p1N5J3R5l56L83j3j59j2J12Kk31L0N5L25k82K21
3654A40J46m34o6J38L42%k10k59M75J93m04k68K93j06k42K49O7K41m05m3K61J6
3676A24k41J31K48l57k08J0N04J04n12P3J70k50o8M41J11m55K40J22p1J78m04
3697a10J95Lj48L3o1K41j50m42M48J49k56o7J06J20l03K30j82K35k22L14K4o4
3719I3k7l99L11N8j20j92L88N2j76k22K99N6n3p1K65Rl41o1r9J48J62l90N0K05
3743e5J4pl29M24j46J51K04q7l46J12J60P6p8j02O3L6J05l92J28J67j67l31K76
3766a24K2J90j47J98J27l16j01j97J90K8J2J28M9K37l26k5J08J22j96J65o6L5
3788A13l16N34j29j09r8J11j08j87J22Q5pk74J18K54j05n3N6M6K25m14p5K91L53
$$ plain form
3629 28 51 10 432 -137 53 266 21 -27 -98 -43 -30 65 -291 92 79 -80 -92 20 22 -209 -179 -124 201 -81 140
3654 140 286 -148 -214 -76 266 266 56 -203 272 465 61 -207 86 -20 -262 -13 54 295 -110 -153 108 124
3676 124 -117 14 262 -95 -303 -293 211 315 -197 -124 46 -204 -272 169 280 -175 65 187 116 294 -110
3697 -110 85 88 -60 -27 -88 153 3 -439 9 158 -98 -165 -59 61 -242 -12 -194 41 -181 133 157 93
3719 93 66 -333 -22 36 -84 -276 112 164 -12 -234 65 121 68 -3 262 271 -70 -131 -230 -82 80 -310 -260 -55
3743 -55 -41 -48 -377 47 -99 52 256 169 -177 -65 95 171 93 -9 54 90 195 -197 -69 98 -69 -400 -124
3766 -124 -102 88 -59 139 266 -50 -151 -348 -158 -130 -118 10 59 296 -30 -55 53 175 -21 144 78 113
3788 113 -203 331 202 93 -5 106 -2 -189 -67 18 11 -263 -145 109 4 -49 7 53 278 -136 -211 80 433
3811D33o78K18K88m36m3L62J84q3k22Q3j48M39l77j50K35P5n33L25r9O8j45l5
3833b39N66q7m67M93l96Pj51Q2M49ll59R8J10j50o5J55L00m88R4K29j86Q8j70
3856i0Q9Q6k34O6J70Q5k07k38J47M6J45k08k31M80r1k58M02j29J48r0r4J94r7
3879I1rk03L43mj62r3J93l97N2L72p5M1l11K22p2J71j17k71K73k27NK59n3P0l58
3904b60J47J00k88K18J52j57J31j38Q7P5No2P3M6m3r6m2R8n6L03k05J77m73m4
3928b52L52o1n6p6Q3K98m78j5m4K69j27K3o8K04m2k06K82Q4l45o3J94L52l49K03
3952A62j04K98j84n63M12J36J08m92j32O58j67m40J37J97j08j83K88J36j81k38
3972b60N6Q7J56kj14J98n9o9P2J64j19k98M82j39j08l73N13k46k0J62l13J66J24
$$ plain form
3811 433 -245 -27 261 -175 -218 144 328 245 23 106 -42 397 20 -130 105 180 -353 -28 -127 -59 -204 -239
3833 -239 327 240 -227 266 -130 -123 -274 -192 257 254 -105 -7 103 -47 -112 43 343 -145 -51 178 -8 80 -90
3856 -90 -1 85 -149 -83 87 172 -35 -273 -126 -80 65 -143 -374 106 15 -243 159 30 178 88 -6 188 91
3879 91 82 -121 222 218 56 -37 156 -241 -189 183 108 149 -162 60 -12 159 42 -229 44 -183 -178 81 28 98 -260
3904 -260 -113 -13 -301 -83 69 -88 43 -95 -8 67 72 10 83 129 86 -10 -52 46 -10 293 88 265 -208 -252
3928 -252 100 39 -17 -93 -10 288 -190 -205 -249 20 -107 -84 -152 52 10 -196 86 170 -175 -238 -44 308 -41 162
3952 162 58 356 172 -391 21 157 265 -227 -359 299 132 -308 -171 26 -82 -265 23 159 -22 -260
3972 -260 -204 -117 39 37 -77 121 62 -7 65 229 110 -188 294 155 47 -326 187 -59 -79 83 -230 -64 60
3995F0j74r8L15j96rJ9L67n28j16K78L11l63j27M52j82Ol9M8j80K03j8j80J75
4018B4k51K35J09j99J49J6j57J12j86P5J10J31l12m9K45q8J52l43K34j00l6j14
4040b43M27o6k50J73r4j3Q9r6R0j15J06N5k3M6q9Mj27L43j18k77M43j98k0k84
4064b37J69J4L5O5k89L06k82K02J70J11j52j42J76J12j07k10J26J72j92l50N0
4085b53K85j71Q0J33l3q4J84J22m65K1l9K01l0M6m2r8K71l70K04L15j76j91P5
4108a5Q9j64L4K57Ml6j82L8K92l97Qk44N26m01K29J90j24l05K3J87Q9j82l56M37
4132cJ00j87PJ15J09j48j66N27j78j18q7O4j02o7J02L89m55K41p9r8l3K8K5l76
4156c90M60k57J0J9R9o7J67r5q5o2K32N0k94J83J99k82m4j9J37j30J93J11k13
$$ plain form
3995 60 -114 -212 103 -93 -102 -83 284 -244 -360 -82 229 -134 -261 191 9 15 -24 24 -156 47 29 -151 24
4018 24 -227 8 117 -82 67 83 -74 38 -148 -73 37 168 -144 -193 52 -36 116 -227 7 -93 -129 -243
4040 -243 184 118 -132 41 -53 -66 23 -73 17 -98 8 63 40 86 -3 1 -126 217 99 -178 265 67 47 -237
4064 -237 -68 -54 -19 46 -243 63 -219 -17 153 264 112 -30 146 258 151 -59 67 239 47 -303 -253
4085 -253 32 -139 -59 74 41 -43 141 263 -202 -181 -220 -19 -49 -3 -45 -143 128 -242 -38 277 101 -90 -15
4108 -15 74 -90 -56 201 205 169 -13 25 317 -80 -72 -316 210 -191 38 228 104 -201 -178 9 98 -84 -440 -3
4132 -3 97 -90 -83 32 141 -7 -173 354 176 58 -29 35 -67 -134 -32 357 -98 143 64 -34 -67 -39 -14 -390
4156 -390 70 -187 -177 -158 -59 -126 41 -54 -139 -201 31 81 -213 -30 169 -113 -157 -176 -39 -169 24 135 -78
4179g8K75j27k1k66K78n3J25M7j75k54p7L72LJ10J14k45j08L70j83P7j47K56n68
4202b75L00j5N8j40J28N3k13K13Q2Jo2L4m32J12L69j03k25K30J6l38J83O1j93
4225a56M2J30j35p8M7K04k1K47l37j49OM92k31l18K97J85k82L6N05j80l69L5K0
4248a0K1j9k13K04K6j74J46K52l17j23K53n2P6j86j8L96k09j75NJ70N0l09J84
4271b2K91k77k72M15MO6j99J76J71k04j97n7J62j77J78j81J9O2j15J61j27L12
4293A89k25j62J34O6j9j66J95j48N6L00k01j05J73O2K4q3O1k13K05k1l33L02j74
4316h3J78j89k29L51o6K5j98K57Q7j80K62k62J70r2J86l5k85J88j30R3j7j53q1
4339b03O27l22j26J06M4k14k7K39o4Rk25J52r3J01j76K50l22K70j8n3M7mNp5L39
$$ plain form
4179 -78 197 70 49 -217 61 8 133 180 5 -249 -326 46 49 159 273 28 -80 290 107 184 37 293 -275
4202 -275 25 10 68 -72 56 109 -104 109 191 192 130 164 -268 -156 213 110 -115 115 131 -207 -24 37 -156
4225 -156 -114 16 -119 -197 -150 54 33 280 -57 -206 -200 292 61 -257 40 225 -57 -21 484 304 -65 -30 -10
4248 -10 11 -8 -221 -17 9 -165 -19 233 -84 -207 46 -6 70 -116 -134 262 53 -122 -117 53 103 -206 -22
4271 -22 269 -8 -280 135 139 205 6 182 353 149 -48 -105 57 -120 58 -123 -104 -42 -157 4 -123 189
4293 189 -36 -198 -64 2 -17 -183 12 -136 -80 220 19 -86 87 149 173 90 151 -62 143 122 -211 91 -83
4316 -83 95 -94 -323 28 -38 -13 -211 46 133 -47 215 -47 123 31 217 182 -103 85 -45 48 31 -122 -203
4339 -203 424 102 -24 82 126 -88 -115 124 60 69 -156 -4 -97 4 -172 78 -244 26 8 -45 2 -2 3 -72 267
4364B67k03k17j34N38l02k3J93K38m05J1j26L75k21r9J84o4p6k68M73q4k00K38
4386I5J02P9l76k31M17K45m07j23K59j98J85p0N6j82J5J37M28k50l81M84J16l44
4408E6m45M77Mj37m2J53Q9j13j92l8M22j23k19n4L26k21j04J74j75K28k1k57M17
4431B05j67j45J37K91j61k21J67N8j63j05n2P9P3l23M74J69k52k79J9M42k81J31
4453I6j56J40O6j61J37k9k99J63O6j5m5n4J32j18L89k75nK9J11m18L18j17k2L
4477f4P2l3J27k76p9K61n5j39J37r8j22K45j7j14L06j37J06J80m32J16k00K85
4499F9K82k75j87K60n0j27J07k9k72k2N2K03L6j44K12j69K5j28J19J58j95k86
4521c61L18J28k51J45J51R8k30oO7P5j29n0J07J84k03Q0J2K6j76PN3L12m04k55
$$ plain form
4364 267 64 -153 -287 251 -51 -74 119 357 -48 -37 -163 212 -9 -108 76 12 -64 -332 141 57 -143 95
4386 95 197 276 -100 -331 86 331 -76 -199 60 -138 47 -23 33 -149 -134 3 431 181 -200 284 400 56
4408 56 -389 88 92 -45 -87 66 155 42 -150 -188 234 111 -108 -162 164 -57 -161 13 -162 66 45 -212 205
4431 205 38 -107 30 321 160 -61 106 164 1 -104 -156 -77 -4 -327 147 316 64 -215 -196 246 -35 96
4453 96 -60 80 146 -15 122 93 -206 -43 23 8 -37 -91 41 -77 312 37 32 61 172 -246 72 -45 -67 -64
4477 -64 8 -25 102 -174 -253 8 -47 -186 -49 -147 -269 -24 -41 -155 151 14 120 300 -132 -16 -216 69
4499 69 351 76 -111 149 99 -28 79 50 -222 -244 -192 11 47 -97 115 -54 -29 -157 -38 120 -75 -361
4521 -361 -43 85 -166 -21 130 228 -2 -8 59 134 5 -45 62 246 43 123 135 161 -15 -8 45 357 -47 -302
4545c02M11p5j3k37J67J26j74R2P4o4k42K07K10j29J33l24K75R9K4j16l31K76
4567H7j02j29L88Rk82j28J3m4K68j79j34M27m67J31J04l2P0j09L2l0k02K41Q6
4590A8L40k67j07nQ9k2n1j11j18m0K85J82n3l79R3Q8O7qq0O8K4J5l53L53K13j68
4616G3R4j01j48Q8j89J69P8o7j53K95L1j01J84k23K11j3n59L70R5j43k4J17R6
4639A80k13L0J53j46O7k65L08l42L17l67N16k76j69K26k12M42m83l6M80j05q7
4660A8P5J45p9o1Lj99J50M4l90J64J26j31J31P1K05l82k51N74j52l84M7K87J88
4683A99k77J43n0J6N7J10K38L2l03k16L04j41l97J01K92j57j3m9j6q3O5O3K07
4706A25k38Q9L4Pm9M4K6J12n7k98j41M29j61R6J1K2R3j42K54k01M1k11J58m2K16
$$ plain form
4545 -302 109 34 21 -216 -49 77 -97 -5 69 5 -237 -30 180 51 184 -140 135 234 258 142 -189 87
4567 87 -15 -144 244 253 -29 -157 -144 -188 80 -99 -233 194 -273 -142 -38 -70 0 -109 -77 -107 -309 -68 18
4590 18 358 91 -16 -21 68 46 -5 -116 -234 -274 11 193 140 -239 -146 -58 9 1 -79 -11 13 28 -325 28 241 73
4616 73 167 66 -82 6 -183 -14 64 -3 -156 139 170 69 253 30 241 228 -331 39 134 -9 -33 84 180
4639 180 -33 -3 150 4 71 -194 114 -228 89 -278 238 -38 -207 19 -193 249 -234 -270 210 105 18
4660 18 93 238 159 98 101 -98 52 96 -294 -130 -4 -135 -4 67 272 -110 -361 213 61 -323 -276 11 199
4683 199 -78 65 15 31 88 198 436 468 165 -51 253 112 -285 -184 108 -49 -62 -111 -127 -210 -145 -82 125
4706 125 -113 -24 10 17 -32 12 38 150 93 -205 -346 83 -78 18 29 51 144 2 256 55 96 -115 43 1 217
4731B17l04L6L76k91N6p8m7K1m0J04j96J07O8jj32J12k6l2J81j20k4K2M9k5j09
4756g6J12L0N0k19K54j20K2k0p9LJ7j0j2k4k9J37j90P9P0j83K36m7K3k51K43K19
4782B35l59M7L8L56k02P6l03L7j47K19J06lo5K38l14K02j19r1N2l65L18r6J03
4805c7J05l83N6J70j05K87l32L21q2Q8J41l71L40k25J96J2q6l74L27p2J61k27
4827i0%R2k04N3%J37J53j22l46K84J02l9k60L87j8j37J44j8k31K85j63o2J94j59
4851a8M7J09k51M1J9O5O3J8n9q2K17k45OK32j86j73L56j70R6J19j96N2j20K59
4875A99o0m4L2j67Q7L0j16J63r2L3J13p2M0j91K65k43K19l22j1K40q8Qk77J77
4899g7N8J37k74K2J18K14j56j40K0J43k11J40Q0j41J26k26Q4n8J22j58P0J06Q6
$$ plain form
4731 217 -87 -51 325 34 90 12 -35 -14 -54 50 -146 -39 29 28 -104 8 -18 -50 131 11 -13 9 58 33 -76
4756 -76 36 66 116 -103 151 31 53 33 -46 -43 -26 -36 -48 -72 -101 36 -154 -75 -5 -188 48 1 24 -227 16 235
4782 235 -124 -77 -39 317 115 191 -112 -75 -222 -3 103 100 35 273 -41 161 42 -49 3 -362 -44 -140 -37
4805 -37 68 -315 -259 -89 -194 93 -239 82 0 88 229 -142 198 -27 169 181 95 -279 48 -24 137 -90
4827 -90 -90 2 -202 -149 -149 -12 141 19 -327 -43 59 20 -240 147 129 -8 136 118 -113 172 9 -53 141 -18
4851 -18 29 138 -113 -72 -53 12 75 93 34 -48 169 -76 -70 162 -24 -197 159 -11 85 204 8 60 -60 199
4875 199 139 95 127 -40 47 77 -39 124 32 65 178 106 146 -45 220 -23 196 -126 -137 103 15 23 -254 -77
4899 -77 -19 118 -156 -134 -16 198 42 -98 -78 65 -146 -6 74 -67 59 -167 -83 -141 -19 -177 -107 -1 85
4922H5K6p5L60n96K90p4Q0Q6l99J73K09j63k09K61R0k67l3K22j84j12J54L21j72
4945G3j84n7J74j3J50nl83M40j82n1J44O6l10K39M6r3J0k49K69r7j04j2q4J93
4969b0J94j63o5K59j03q7j03K17k07j2j66L96j19q8K12n9k98J76J25j64J49o9
4991Em6j35k2J29rR1k0n3O9r7q1r9L21r0L4j51L71j44j00N2J66j46j31Q9qK9j02
5018g8Q0KO5K14m68L36j69j64K22l2q8Q9p9J07p6j10J34J73j5l31J98j83J33J68
5042A28J6J7j00L7J30j96J8l26K28J01J3J08k1k30p3O5J51L0j64J83k9m3n0o6
5066g3r8J83N8j30O4K25k61l4p5K00j57p0L88k75K20m01J62K87k93K3j29K97k15
5089a04J90l35K34M1m6P6k63K80%l2j55K71N0r5j29m8K2K15j51q7j49L41J21m16
$$ plain form
4922 85 111 36 396 -200 90 16 96 182 -217 -44 165 2 -207 54 144 -123 -156 66 -118 -230 -76 245 73
4945 73 -111 -168 6 -7 143 138 -245 195 13 -38 106 172 -138 101 147 54 64 -185 84 -13 -117 -129 -213 -20
4969 -20 174 11 -54 205 102 15 -88 129 -78 -90 -256 140 21 -67 145 86 -212 -36 89 -75 74 5
4991 5 -41 -176 -198 -69 -78 13 -7 -60 9 -88 -169 -268 53 -37 -3 -154 217 73 -27 25 191 45 -86 3 -5 24 -78
5018 -78 2 4 69 283 -185 151 -18 -182 40 8 -80 9 -70 37 -39 -149 -15 158 143 -188 10 -173 -40 128
5042 128 144 161 61 98 228 32 50 -276 -48 53 66 174 153 -77 -150 -85 66 96 -68 115 86 43 -7 -73
5066 -73 -171 12 70 -60 4 229 -32 -66 -141 59 -98 -168 220 -55 165 -236 -74 213 -80 -57 -186 111 -104
5089 -104 86 -249 -15 26 -20 56 -207 73 73 41 -114 157 207 112 -17 -65 -43 172 21 -66 -215 126 247 -169
5113a69K58r0J78j37L1p9j19j06K12Q5j39p5nN3K80l06k84M62J98m91K51J4j1
5136A1K7k2m93N61j10J4LJ89j18l9j46M40k30j33R5K13m57K81j33QK6j9k96M79
5160A51k17o1J04K6L8k29j27N18k91L00j89k90K68N2Q7R1o7j60J0j55J70J29J1
5183A69j47J8kk9J34J72o00M15l1j89j12K83l1o3P3N0k8k53j49J96L44k55Nm7
5207g7r7p0K88J6J08j14nj20r7J89N4j79kJ58k2k06L36l60K3L18j71j17oK56L5
5232A38j39K9K13m71J58K1K74m1j78j00J94j74Q3R6j13O1o5M7J82j02l61K82K04
5255B38k43l00J09L36R5l09j10J42K3j5L28k90pKj54M94m89J74p8k5J43L8k38
5278a36J71K00m00K63j13J36j10k9l02L65J72k45rkQN2n8K1j32J04N8j85J63J07
$$ plain form
5113 -169 89 -1 177 40 71 -8 -127 -233 -21 64 -75 -150 -155 -102 178 -128 -412 50 248 -243 8 22 11
5136 11 38 16 -477 84 -26 -12 -9 180 62 23 -123 317 87 -46 49 262 -195 86 -47 -39 -13 -32 -328 151
5160 151 -66 -127 -23 3 41 -188 -315 203 -88 212 23 -267 1 53 140 231 164 4 14 -141 29 158 169
5183 169 22 40 38 9 143 315 -285 130 99 -90 -202 81 50 -13 60 110 82 -171 -320 -124 220 -35 -30 -77
5207 -77 -174 -244 44 60 168 54 49 -71 -168 21 75 -104 -106 52 30 -176 160 -200 -177 141 -30 -147 -153 103 138
5232 138 -1 28 241 -230 -72 -51 223 182 4 -96 98 -76 7 103 -10 51 -14 33 215 113 -248 34 238
5255 238 -5 -305 -196 140 235 -74 -184 -42 -19 -34 294 4 -3 -1 -155 339 -150 24 -54 -79 64 102 -136
5278 -136 35 235 -165 98 -15 121 11 -18 -320 45 217 -28 -37 -39 -31 21 -37 -16 -148 -44 14 -171 -8 99
5302I9k1k08J71q7N1L21l95r3J73j13K54j0j12J37k62O5L9K6P5j32J25r6k28J61
5326f0Mj57L08k33l7J77r9K19qm6r9J12J14p6j51P1K9R1j34P9r0j03K68l90jK44
5352C2L8j34k4Mq2K30l03M17k24J09r3j50L21M0l7k11j8Q3J89k00N9K25l40N5
5376a4l5L3J30l2j46m8M11l08k5R3j98j81J23L74j55o3J05q7L68m82J25J00J2
5399A00k87J73K79j47M1p0j04kPP8P5l28L18j24R6j15j43Q5K48j57j65L41j42
5422E7j07o5K01r2j45K68j29J12J6j12J39r5J99j24k10O3J41N0L0j59k6J7R1m8
5446G2Om34J73Q6m3J79j54K99j99k13l1K61K93j71j79M9J99j74Q3k02J50k98M71
5469B23k98J33k67J4M14l61k6J22Q3j85K65M9k64k36K33R5lk7j4J46m42J23L80
$$ plain form
5302 99 78 -130 41 -46 5 326 -69 -162 11 -102 152 142 30 167 -95 -30 9 35 110 -22 103 7 -221 -60
5326 -60 -56 -213 95 -138 -175 2 -97 122 114 68 -31 81 195 119 -32 39 68 159 25 104 14 -89 179 -211 -212 32
5352 32 70 -64 -88 -84 -166 64 -239 178 -46 63 -30 -180 141 181 144 -67 -85 -2 187 -13 46 271 -69 -14
5376 -14 -49 -16 114 82 -64 -112 299 -9 -34 59 -139 -320 -197 177 22 -41 64 -23 345 -137 -12 88 100
5399 100 -187 -14 265 118 159 89 -15 -17 -10 68 143 -185 133 9 105 -10 -153 -68 180 23 -142 199 57
5422 57 -50 -115 86 -6 -151 117 -12 100 116 4 143 48 247 123 -87 -24 117 167 197 38 12 29 120 72
5446 72 78 -356 -183 -97 -140 39 -115 184 -15 -228 -259 2 295 124 -55 -6 193 19 102 -100 50 -248 223
5469 223 -75 58 -209 -195 219 -142 -168 -46 37 -148 117 166 -98 -334 -101 -6 -9 -36 -50 96 -346 -223 157
5492A57j13j89K80N5j58m9Q3p3M5J57l02j32N78l72J19o4o6J53j3m0JR1l15n7
5516b24L97ok1k99n4P1J10P0L11n36K11L1J84k68L0j42J82n7N4M3j76L86n72K37
5540c8k19J98J44k47J47R7R6k96L00k18N0q9j5N4j22L57k67M5j2J15j60o6rJ36
5564a9J15n6J2j15J22k21N6m8M41j52j49k89N05q6k34J88j83J35O9l14M57j85
5586D9j97R7R5m6j9L30m74J88l3n8o9KJ80L6j6J22j68Q3j46J61j27K72n24K01
5610f1R9q3P1K9k17J63R8n17M93n13N57l12K71j68J86J40j37J38k2J5l60O9J20
5633E9j76N8J85j64L7j68J34J56m1j56K04j88j57M49k73J44K0k11J91p4j10N6
5655b5j4k00M19j1j94K41m08L17j83M4J16r1m3n9J49M7l0m8o4k37M79k05q9M2
$$ plain form
5492 157 44 -145 135 190 32 -17 66 -7 38 195 -107 -239 339 -33 86 22 -44 109 96 56 57 148 -167 -224
5516 -224 173 167 146 -153 -207 -136 -26 44 355 -181 30 61 245 -23 7 -135 47 -10 44 87 -89 297 -275 -38
5540 -38 -257 -59 85 -162 -15 82 178 -118 182 -36 14 -75 -90 -36 -158 199 -68 -23 -35 80 -80 -146 -155 -19
5564 -19 96 40 52 -63 59 -162 -106 -154 287 135 -14 -303 202 116 -118 70 -113 22 91 -223 234 49
5586 49 -148 -51 44 -2 -21 309 -165 23 -10 -68 -137 -135 45 81 65 187 19 102 -44 117 -10 262 -262 -61
5610 -61 38 -45 26 55 -162 1 99 -418 75 -438 119 -193 78 -90 96 236 99 237 215 230 -130 -61 59
5633 59 -117 -59 126 -38 -1 -169 -35 121 80 -76 128 -60 -217 232 -41 103 123 -88 103 29 -81 -25
5655 -25 -39 -239 180 169 -25 216 -192 125 -58 -14 102 11 -32 -91 58 105 75 27 -37 -274 205 0 -89 -47
5679d7J19j93K89j07j93J75J03n6Km6%l10K68R3j52j79L54j34J39j17J16k56K9
5702a03n0J30Q9j91J92j06J29q2l3r8L00j02l94M54m90M76p4k5O1l11K31R4J20
5725B17j94k18L23Q4n0o3l38K61Rj35O2j68K03PO1k54J19M2Q1m05q4K55J99j08
5749i4J7K7oR3r2J60l8j19K19j78J2J19j67j41J50j70J43j32K64J34n9m31M35
5772A46l3k42L40j50J52l48P5K75p8j11j03L63k81j21K3lR0J28k94n0K26K4j60
5795a32K72k55J33j50J03m5R6K1M1r4j44o1L45k88L46j03n1j16J03r6r8JJ33p
5819d6K66j08k66k7K92J93k26R0J06k21l1R4k71L11j40K0M3L41n17K24m21L15
5841B1k31K74ok03M09j36m0j69J15R5k50L0j1N9M02m16J48j28J17J32m93L11J70
$$ plain form
5679 -47 72 -121 168 61 -132 43 146 90 92 46 46 -264 4 97 -55 -234 120 -14 125 8 124 -132 -103
5702 -103 -153 -23 66 -125 67 -39 90 8 -25 -123 177 75 -319 135 -355 121 47 22 83 -228 3 97 217
5725 217 23 -195 128 212 162 99 -239 22 31 -104 -42 -210 -7 0 61 -193 -74 -32 49 -356 -440 -185 14 -94
5749 -94 -77 -50 -56 37 -55 105 67 -52 167 -11 1 120 -47 -188 -38 -208 -65 -197 67 201 142 -289 146
5772 146 113 -129 211 61 213 -135 -60 215 137 26 -77 286 5 -116 -93 -96 -6 122 -172 -222 4 28 -132
5795 -132 140 -115 18 -132 -29 -74 22 43 84 -10 -154 -215 130 -158 188 85 34 -82 21 -75 -173 -172 -39 -46
5819 -46 220 112 -154 -181 111 304 78 168 274 53 22 116 -155 156 16 36 79 420 -97 127 -294 21
5841 21 -210 64 58 -145 264 128 88 -81 34 129 -121 -91 -102 -43 359 -57 91 -37 80 212 -281 30 200
5864B00l06K98l7j83R3o7P8R2k44J89k81L70k48q8L8j8m8J41Q7j38J61J47j90
5887D6J6L4M8k40o9L25k75J86P5l1O0k45J61J05k77k2K93j81J56K6m15p9Q4J86
5911c3k0J62m4j15R4j41M7K2rk56K47J12n0lk75M86l03K88j76k6j6K34k28l9m7
5936h9p6J03J4R1n3k36K19p2K73j20J61k95KM1J34q2k23M59j47k38K07j25L8K81
5960B67l50l2J36j1p0K7J53l23K5J66P2L3L8J45j92K9p4j68J5K90k13K9J8k6J31
5985A15m3J06j95J9l9J83o6lm5K9r9j48J20N2n7J92l52K58J11N1J7k45n7J22l04
6010b78J88J73l42j44M12J21j90Q6j1j25Q9k0J22J19j28j60J17J21k52L19k87
6031g0L01l04L97j27k2M0l72K17J22j30Q8j52MP3j28J69M0m4o7J15k27L56j67
$$ plain form
5864 200 -106 192 155 -28 65 -2 76 168 -76 113 -168 202 -46 -134 -96 -114 -162 -21 66 -72 89 236 46
5887 46 62 96 144 -96 -165 160 -115 71 146 115 175 -70 91 196 -81 -103 190 9 165 191 -224 -303 -219 -33
5911 -33 -53 109 65 -50 44 -97 -50 -28 -37 -293 -46 66 16 13 -262 224 -79 209 33 7 -9 225 -3 -42 -89
5936 -89 -165 -62 -48 43 -10 -246 -27 -99 174 54 215 -80 -78 -37 97 15 -208 251 104 -134 73 -52 -14 267
5960 267 -83 -115 21 10 -60 -33 120 -203 -178 -12 60 93 131 276 84 113 39 -129 -114 176 -37 -8 10 -16 115
5985 115 72 178 -17 2 -37 146 80 77 32 61 -38 -186 -66 -14 -71 121 -231 27 138 189 206 -39 -96 26 -278
6010 -278 -90 83 -259 -403 9 130 -60 26 15 -110 -21 -41 81 200 72 -88 29 150 -102 217 -70
6031 -70 231 -73 324 197 175 215 -157 60 182 52 140 -12 -8 65 -63 106 146 102 35 150 -77 279 112
6054A12p3j62K90p3j16j08M48m13J70k71K36j46J47o8K08r4l1k00O3K05O6k9k79
6077a18R5N6Q8k54P5J30j12kJ21N7q9j92J94J0l0j37J01J16k4k56K00J31k66J68
6101F2R9k77j21K34K8J69k87M2J06O2j89K73j74q8R1J1Q6p4J23j51J1Q6j7j27
6125b2j82K21j83J65o1J21k6O1j8J3j27R6M8J4j19P7p0Jk00K70k45o3N56l23O3
6150F7K00j99k20K62j32r0K29p8j70K57j32Q2M8k51r6j1j40L89J21L9k78J42L1
6173G0j38Jj3J22j95J13P6r5N5Q7j71L25k10k2p2K84k1k04o6J23m5R8p8Ol9r0
6199i9Q4k5P1J4k74R3N7K95m8k74j66K07r1K71k9j37J88L4m3k04J57j37J8R1k24
6224a71k0L10j40k29L67j94J22j14J21k2j51K61p1J5N9J9m68J78L08k97o4M27
$$ plain form
6054 112 39 -123 167 94 -22 -130 318 -95 75 -196 40 -106 41 -27 181 87 56 -144 -81 124 190 161 -118
6077 -118 -23 33 121 -133 -58 72 -40 -42 79 136 47 -145 49 59 29 -108 -7 109 85 -171 29 160 -106 62
6101 62 161 -116 -237 -3 25 194 -93 -51 55 117 -72 201 27 -61 30 41 127 53 176 25 36 122 105 -22
6125 -22 -204 17 -166 -1 -62 59 33 94 76 89 -38 58 106 120 1 78 8 9 -191 79 -166 -229 327 4 67
6150 67 267 68 -152 110 -22 -112 117 39 -131 126 -6 76 124 -127 -223 -234 -374 15 136 175 -103 39 70
6173 70 -68 -67 -80 42 -153 -40 36 -59 -4 83 -88 237 27 5 -67 217 196 -8 -74 49 4 102 24 30 -9 -99
6199 -99 -15 -40 31 45 -229 -136 -79 216 168 -106 -272 -65 -156 115 86 -51 137 171 128 -76 81 -56 -38 53 -171
6224 -171 -191 119 -21 -250 117 -77 45 -69 52 30 -121 140 69 84 143 162 -306 -128 180 -117 -181 246
6246B46r5J02l10K44r1k63J89L10k00k02K05J14l54J05j84R8R3j75K49p5j58O8
6268h4j11K64K5l36L38K11n5k76k88L80j35rO0l38O36k58J5j49m7J62k47K69j89
6291a62K29j65J08J05j63L68n43J56J45k63K69k72K09l61K76J63p7K3J17r0k49
6312a77J99k27k74N55j74L62j65j86j45M24k45O0q7R8k81K80o6J20j82R9J92j19
6334F1k47K95k12k55N25j47k87L67J53k86O6J39P0k65p2J09n8n4Q5o3k50K07L61
6357B42k49j32K45j12m4J46o0l13K93N9j7k55K83k3k9N8J92r4l13MlqK77k2k23
6382i8N4J12r0j66K62N2j63k6j10K18l14K65K17J5l71J5L30o0j4o6j26n3J77J01
6406A61k72O9J61l99O8K38j14n0j52J89L45n57M56k1L1j99k0j7J60K40l75M9J69
$$ plain form
6246 246 151 253 -57 187 96 -167 22 332 132 -70 135 249 -105 0 -184 -86 7 -168 81 6 -152 -84
6268 -84 -195 69 94 -242 96 307 252 -24 -312 68 -67 -76 -16 -354 282 24 39 -110 -157 5 -242 27 -162
6291 -162 67 -98 10 115 -48 320 -223 -67 78 -185 84 -188 21 -340 -64 99 22 45 162 72 -177
6312 -177 22 -205 -479 76 -98 264 99 -87 -232 192 -53 7 -80 18 -263 17 -49 71 -111 -12 180 61
6334 61 -186 109 -103 -358 167 20 -267 100 253 -33 33 172 242 -23 -95 14 -44 -98 -13 -76 -326 -119 242
6357 242 -7 -139 106 -6 -50 96 36 -277 16 75 58 -197 86 63 34 92 284 190 -123 -119 -122 -130 147 125 -98
6382 -98 -44 68 -22 -188 74 126 -37 -63 -173 45 -269 -4 213 228 -143 -128 202 142 128 62 -64 -117 60 161
6406 161 -111 -42 119 -280 -212 26 -88 -138 -290 -101 244 -313 143 122 153 -46 -66 -83 77 317 -58 -9 160
6429A60R1j17Oj24j25m9K35J34j28k16J82j17P4p0K13p6k86K6K38k00K78P6k42
6452c7J72j07l05L84L1l65K44K3K31k63N6q8L68n20N23l46n7J21Po7r5K88j61
6475C7J8q6j36J03Q6j22J55N3j22o9rQ7p5j6o6J08j39L09j24l6R5Jj36N4K5k7
6501c2J79k24J44p5j39J73r1J10J60k13J4j6L0K26j98r9O8k7R6N3k42J5R0j96
6525a94J67J46j46m9j8J93M4K4N7j55p0N4j33k2O6j9J50k51K30R5j92KM0l7J0
6550hmN4m8J34r5k1j55m8L76k19l2q9M8K39k85J51m1j31K91O8l30N3J01j33M6
6575g8O9J7kJ2p8j5RJ20%K70l42L2j55J48j1J69J00j98qo3L2k15L31o4R4j52n9
6602c7L37l48j93l0L17N0j61K69j53K97l11K03m48K39p4k8P5O3j86Q8K71j82n2
$$ plain form
6429 160 251 134 140 16 -109 -158 77 211 83 -133 49 -68 6 -64 149 73 -213 -187 51 -149 129 205 -37
6452 -37 135 28 -277 107 138 -227 17 40 271 8 64 -24 344 -176 347 1 -56 65 72 5 -90 198 37
6475 37 55 -31 -167 -64 22 -100 55 108 -14 -83 -92 -5 -80 -96 -162 -54 -193 116 -8 -44 51 52 -84 -30 -5 -32
6501 -32 147 -77 67 -8 -147 26 -65 45 205 -8 6 -10 20 246 48 -51 17 -10 86 139 -103 -88 2 -194
6525 -194 -27 119 -27 -76 -94 99 143 167 224 69 -1 53 -80 -102 -36 -55 95 -156 74 169 -23 -21 19 -18 -8
6550 -8 -12 42 -6 128 33 12 -143 -191 185 -34 -66 -155 -107 132 -153 -2 -43 -174 117 185 -145 -92 9 -124 -78
6575 -78 -9 8 6 18 -60 -75 -66 54 54 324 -18 14 -141 7 -4 165 265 67 59 -4 28 -187 144 80 174 22 -37
6602 -37 300 -48 -241 -271 46 96 -65 204 51 348 37 240 -208 31 -43 -71 4 67 -119 -31 240 58 6
6625Fj7k46L79j10j54K58k9j79K04j07O6j23J23k2j23p7k6L23N9m60J90K7m5J82
6649I9j45j16L19k00P7r6J18ON2k7j51N4q5J46k9N0j17Q9K07r7j55N0J9Q8j6J6
6675A56l37R8J95j38m2J1J87q3O6j68k4J86l52M51j37p3j9j4j38P5P4J14j89J89
6699H8j19o8J88q2o0O3l3J4k4j1j10Q4m0n2K37j83KP9l2L1j39j1J45N1J83k65
6725f4J69p2J41l09R5J05l9m8J17J56K4l03J29m5NJ80k55p3m5J5MP6j9N7k1j1
6751c1o1Q4J74k16K85m24O6K33n0j1k62K91P8q7N0N4Q7j22n4Q0k61J47l4j29L42
6776B29j23j06j30Q8J68k1p0J33l4p6Oj9j06M1L3J48l69K96j83K95l12J11L6m1
6800fj61Q5R4K38m04K39k7m0j14r9J17j29K62J01k84k0J42l9m7J18k78L9J18L02
$$ plain form
6625 6 -11 -257 122 12 -142 116 87 -92 112 5 71 -52 71 49 -74 -151 -177 146 205 -255 -65 -38 -83 99
6649 99 -46 -162 157 -43 34 -62 56 62 114 87 -64 -10 -95 51 22 72 -45 44 251 154 -1 49 68 156 140 156
6675 156 -181 -83 112 -26 -68 -57 130 47 113 -55 -79 107 -245 206 69 -4 -23 -37 -175 -100 -26 88 -101 88
6699 88 -31 -99 89 7 -53 10 -23 -9 -33 -44 -154 -70 -110 -162 75 -108 -106 -27 -59 -28 -167 -178 -33 18 201 -64
6725 -64 105 33 174 -135 -40 65 26 -22 95 251 275 -28 101 56 61 241 -14 -87 -132 -117 -113 -37 -56 1 -20 -31
6751 -31 -92 -8 166 -50 235 -189 -123 110 60 49 -213 78 156 69 119 173 260 138 84 164 -97 50 16 -113 229
6776 229 106 0 -130 -42 126 105 35 168 134 58 64 45 -61 -20 13 161 -208 88 -95 200 -112 -1 35 -6
6800 -6 -167 -82 12 250 -154 85 58 18 -96 -195 -78 -207 55 156 -128 -148 -6 -45 -92 26 -252 -213 -95 207
6824B07O1l50K59l13Q2R5Lj08J07k97M51m0k31lo7J27J09j94K95l10J8L66m67
6847b00J80R3n5L44n28K88o3J01k81J54R0k82L59j91K99j55o8j25Q2N6o4o5K3
6870hJ02p7j26j93L11o1l1K35o3j38p1m1K53k66j8mM3K84r0J8%P9j36j5L72n39
6896a80K06J15j93M7K5m5k4%l1M7o2J53m7J70k39M7N1j81J74J9m5R6q5j0Q8m11
6922c15N51o0j36O2q2j59L4J13M7j62J04k98J56J11Q9r2J93m14J06J48j96L18
6944A18j30K4m2k1Kp4N1O0j42j69M49o6j09QJ37j61K6K25l0j27J44j01j6j6r0
6969e0L30j94j97K21M6l87J89m4M7n3L1k7k8K08Q5l55K25K19k67K5K6J25n8j54
6993c7P3L0j0J53q3k75J95k8j72K93l45K09J12J34k50J76j77K00k92Q8j16N2J46
$$ plain form
6824 207 268 -82 177 -136 -54 41 44 -64 43 -254 197 157 -74 -77 -144 -17 92 -102 193 -117 -99 267 -200
6847 -200 -20 73 18 362 -166 122 59 160 -121 33 123 -159 200 9 308 153 85 -40 42 98 34 -31 -8
6870 -8 94 17 -109 -302 9 -52 -83 152 89 -49 -120 -161 92 -174 -192 -196 -153 131 41 59 59 138 2 -13 359 -180
6896 -180 26 141 -52 -5 20 -25 -49 -49 -80 -33 -95 58 11 181 -58 -11 40 -141 33 52 7 103 18 8 96 -315
6922 -315 236 176 40 102 20 -139 -105 8 55 -107 -3 -301 -145 -34 55 -37 156 -258 -152 -4 -200 118
6944 118 -12 12 -30 -51 -49 -123 -72 -12 -154 -323 126 60 -49 -41 96 -65 -39 186 156 29 173 72 56 40 -50
6969 -50 280 86 -111 110 156 -231 -42 -86 -39 -92 -61 -88 -116 92 177 -178 47 266 -1 24 50 175 117 -37
6993 -37 36 66 56 209 126 -149 46 18 -154 139 -206 3 115 249 -1 175 -2 198 -94 -6 -122 -70 76
7016G6j53L86m69J94m9L00l13j41J04J71J96k73k53K22M0j40P7K06k70m4J06K77
7038B50m00K62J48j79j29k52J67L03k70l9O1N1J55O2j18j05o0J6K39l77R9J87
7060G1j53j43J79NkN4J12M8k17o9j6j49K90J22o8k63K08j7J0p9m0K39j96O0j60
7085a74K35k4j81J88L8q2l6J87m13N73l49Q9j91K76j20K39k04k64L51k46J86k59
7107a81J19J23K65l78k9Q1l27M25j32pno2J26o0l3K1j83Q7K69Mk33PL04j34Mj77
7133a06J58j07j61J83J41l39P4R7j32K18l06J46J58l1j01K12j00r3L7J51m4p4
7155a9J69j1k1j27R7L6j18j71k41M52j50l6Q9K25j06q1m4m3M4j22J58j43L10j04
7179D3r4M4m3J42J30p5j12k94L21K10m03P7j6J59j0j23n4N3l4J9o1o7R3L1J06
$$ plain form
7016 76 -77 309 -160 34 -15 285 -28 -169 -65 106 302 29 -224 -2 38 -102 -25 181 -89 -133 -27 250
7038 250 -150 112 260 81 -48 -300 -133 170 -100 -139 -78 -27 128 190 72 -33 -93 -77 162 -215 -116 71
7060 71 -82 -225 -46 -41 -43 11 123 171 -46 -115 -131 -280 10 132 64 -199 9 -8 2 -77 -117 122 -74 -14 -174
7085 -174 61 37 -144 44 82 0 -36 151 -262 311 -38 51 -140 136 16 255 51 -213 138 -108 78 -181
7107 -181 -62 61 326 -52 -81 0 -327 98 -34 -41 -46 -108 18 -42 -75 -54 -237 -150 119 123 -110 -103 201 67 71 -106
7133 -106 52 -55 -216 -33 108 -231 -157 -60 -192 26 -280 -134 24 -7 -108 104 4 -89 -52 99 55 -19
7155 -19 150 139 118 -9 88 124 6 -165 -406 46 -104 -140 -51 174 68 -13 -57 -100 -56 -178 -20 -163 147 43
7179 43 -51 -7 -50 92 222 147 35 -259 62 272 -131 -54 -70 89 79 -44 -98 -45 -79 -60 -121 -188 -95 -64 42
7204D2r9R6k21K28k21J74q5K68k14j48L03l1J8o9Q2m3J30j20j10L7Q6j10j29K17
7228H1j25k30K1K20J01m3j6m5j29L33m6k19J16L9Q0j83k0J28j04M5O9j02L6j6
7252iNQ0j42j91Q2J23n9J47k1n7k18K46L19p07L22K76l85k01L50K1RO9j74J67
7276E2o5j30p7K39n1K52l12N7m5K64l58J05K7J30k1l20J06M7J52K1m4m44K54J16
7300d5J45l68J48r0j00J19K77J94m96P8Q3J48j26J94j70J51lj32m5J00j40R8J69
7323A89n8k31K58j80j98K76K83k48J1j84O3n1J47j2l2P6o6J41l20J13J47j70j00
7346a46J62O2j22K0J6K12k87J43K22k17r9K78J63m14l9Q3J4j59J10o5N8L02k49
7369D8pq3kJ03K73m02L6L1r6K38j24n9R6q9j7J43p5j09L24m32K87j2j40K09l1
$$ plain form
7204 42 -57 39 -182 46 -175 -1 -86 182 -32 -180 123 92 110 41 123 80 210 90 -20 17 103 -7 -136 81
7228 81 -44 -274 -253 -33 68 25 9 -36 -165 168 122 -97 19 58 138 -45 -65 63 -41 4 73 -29 7 -9
7252 -9 -4 76 -66 -257 -175 -52 -111 36 15 -42 -260 -14 305 -402 -80 196 -189 -390 -40 -19 -10 59 -115 52
7276 52 -13 -143 -220 19 -32 220 -92 -35 -80 184 -174 -69 -42 88 67 -253 -147 -100 52 73 29 -415 -161 -45
7300 -45 100 -268 -120 -210 -310 -191 86 280 -216 -138 -55 93 -33 161 -9 142 139 7 -38 62 -78 20 189
7323 189 131 -100 158 -22 -220 56 339 91 102 -82 -19 -70 77 65 33 109 43 184 -136 -23 124 -46 -146
7346 -146 16 78 -44 -24 -8 204 -83 60 282 65 -34 244 407 -7 -46 37 51 -108 2 -63 -5 297 48
7369 48 41 -42 -44 59 332 -70 -34 -3 -99 139 15 -44 52 -37 -54 89 14 -95 229 -203 84 72 -68 141 110
7394A10j3j67n3J02Q4J2j55j47J15K64j96J35r5K22k57k58K82j6J44j98j8N3l31
7417c81N18r4p3k41J88K60n31M92l10J30j22K06n1L3O4j00J13k97L69J0j77M0
7439D6j09n7J71m4K75k72L7j66MN5R7L07l75j22K68m9L09n80M0J34j42M7K22R0
7463A86N5m00m3Q9K3l3J41p0K32k88L4k8L07j47N4q5K16k90O5j2P4O2k17l2K37
7488A30j94J27r0j63L51l83K40K66m11K34j8o9m7J09K5k45J13k3J84j03J5j25
7510g7o7J78J4J9r3J11L8r3j10J87j49K69k76o5J29j14J60Q6l7j20j84K77l25
7533b42J22L13k08J41l26K25N0N9j86J91J04l7r2j92L13k44J38k20O8J51l63M34
7555A99k67j53J78j10L43j58Q2k96j0O2J27j67L45k37lP5j4J6J51q6J23k40%m7
$$ plain form
7394 110 97 -70 -123 -21 63 75 -80 -227 -112 152 -44 91 -4 218 -39 -297 -15 -31 113 -85 -103 -50 -381
7417 -381 137 43 -30 -271 -83 177 -354 138 -172 -42 -164 42 -9 24 88 -12 101 -196 173 183 6 46
7439 46 -63 -120 51 7 282 10 47 -119 -115 -60 37 344 -31 -153 115 66 375 -205 -165 -31 -173 -126 96 186
7463 186 241 -159 -202 -113 -90 -123 18 -52 180 -108 -74 -102 205 58 112 27 243 -47 18 6 80 142 -75 -107 130
7488 130 -64 63 -27 -190 161 -222 18 284 -127 107 89 20 -27 82 107 -138 -25 -48 136 33 48 -77
7510 -77 -144 34 48 67 -26 85 123 30 -80 107 -42 227 -49 -114 15 -99 61 147 110 -10 -194 83 -242
7533 -242 -120 193 -15 126 -200 25 75 134 -52 139 243 206 114 -78 235 -9 129 -91 -23 128 -235 199
7555 199 -68 -221 -43 -153 190 32 114 -182 -192 -130 -3 -170 175 -62 -65 10 -4 12 163 77 200 -40 -40 -87
7579h7J10j25K07p6j15J98k00O7L69l76K03n2m5j48K26p1O3k93J29P7n8J92j90
7602Ej27J20J0j02nJ72l2r5k9J40k01N0j01J61l49L27M6j45J92o5K4j33L02j53
7626A2J84k99K57j94M5r2J52R1P9l94L50j65O0l4J24l07J24P1o0P5j5j63j1k8
7650a38J85j64J1N15k52j18l0m7J73J16j74j94M0P1j38L42j43J03r2o5J6j03m6
7673a32K12J90k24j36K7J82k46m9J20j26K64j11K21j73k24K44K31l27m0J79N0
7694A32J1j06k9K04k31r7K05j16K0M1q1L46m49J13M4M4J32l38L27j55m9k13J07
7717a38J00M1R8l35L96m62L23M9j31J52k1j3o3m5p7n5K79j2k57J06K05M3j49j57
7741a23K6J41l7K1M2M6p3j74J07J3o4p8K67j74j1J50J0K4k60L75K4j79J43k13
$$ plain form
7579 -87 23 -102 105 29 -86 112 -88 -21 348 -28 175 123 78 -70 156 85 148 -145 -16 61 3 195 5
7602 5 -122 -2 8 -94 -99 73 41 -54 -83 57 -144 -94 -195 -34 -383 -56 -10 -155 37 -28 -4 -137 165 12
7626 12 196 -103 154 -40 5 -87 65 156 235 -159 191 26 86 52 176 -131 -7 64 4 79 64 -99 -110 -138
7650 -138 47 -117 -106 409 157 39 9 -38 135 251 77 -117 -77 -6 -144 198 55 158 66 1 17 -86 -132
7673 -132 80 270 46 -90 -63 119 -127 -176 -56 -182 82 -29 192 19 -205 39 270 -57 -97 82 132
7694 132 143 37 8 212 -19 -116 89 -27 -7 34 -47 299 -150 -37 7 51 183 -155 172 17 -32 -245 -138
7717 -138 -38 3 101 -234 162 -300 23 72 -59 93 72 59 -4 -49 -126 -181 98 86 -171 -65 140 183 34 -123
7741 -123 -97 44 7 28 70 116 43 -131 -24 -11 -75 -153 114 -60 -71 79 89 113 -147 228 252 73 216 3
7765CP1j54J03j11P1J01j64QK37k35r3K79j65R8k04L50l43K29l56K72P9J40k09
7788Gn3O7J74j09k03OJ04PR1O0j53m4L67j08l13R3Rj02k3r3K22j1j55K41J35j77
7814C9J52l13K40k05j03K57l60L62K3K3m4J23k78m6K14j75J00Q7j99J82n5J47
7836A71j48j54L00m48J62r5K44k35J15j05K43j63K11M1p1R4J7k16k09J72m7P0
7858e1P1l29J65J80J85j84r7L23n62K24Q8Q0P0K1p5j33L6J39j35k83L09j20J43
7881F5k0oj66K79K2j53K09l49J5j15M00j71k07K07j86L36l13K18j91K90K1l02
7903a17J97JM9k30M3j03K92k55J21k23M02j59j22mj36K37J55mm0l24j4J01K85
7926A52k03N8j89J29Q0k76L97k96o5J31L2K61l72Q9j28J85j00Lj20J50j07L67
$$ plain form
7765 3 74 -80 23 -88 -17 84 -80 -72 165 -70 -163 116 -49 49 -155 195 -148 81 -275 -3 76 216 7
7788 7 -46 21 195 86 -117 -111 -7 0 91 151 -2 -46 321 213 -100 -7 2 -100 -123 -216 6 -5 -160 81 216 39
7814 39 191 -122 118 -87 -190 67 -293 69 92 115 71 194 -84 -130 84 -91 9 96 -103 79 24 171
7836 171 23 -131 169 -279 -117 -212 32 -203 -88 -193 50 -113 98 139 68 162 179 -37 -246 -74 -121 -51
7858 -51 20 -309 -144 36 221 37 -60 263 -299 -75 13 93 163 184 109 -24 12 151 16 -267 42 -78 65
7881 65 45 39 -127 152 174 21 230 -119 -104 -219 181 10 -197 10 -176 160 -153 65 -126 164 185 -117
7903 -117 80 81 130 -100 -57 -160 132 -123 -2 -225 177 18 -104 -108 -244 -7 148 144 104 -220 -234 -133 152
7926 152 -51 7 -182 -53 27 -249 148 -148 -213 -82 -50 211 -161 -72 -200 -15 -115 -112 -232 -82 -189 178
7948A78j88J63l41%J02R4J16l97M96r2o3M9j72K11j17j10J7J54j25j85K66k03
7970a47K44l40L47P9j08J1j0N0m6l1j59J73L9l23N26j78k02j40J98K4J20n4P2
7993A45n1j81K91n8j71j07K90K4o9k11J65K23j41m26M10m15L35j00o0J07L7j24
8015h7l7Q1m1M7J29l6j95J23M3J89k29k20J80K05j33p6j61L58j02m1rJ56j51P2
8039F5q4j14j22K47J6o9PK43k67J23r5M8L02k61j16J54Q8n0k46K46J03q1J90m07
8063h0J52on4jp1ro8J91N1k2M9l28K31l0J49Q4k14J55m24J05L96m10K38j45M0
8088b1j18O1O9M9K4l00J81J86R5k83mK55j16K2j09k30K53l17OJ55K36j73K41j80
8112a8j60J98l46J91J58J65m40L12k18J41O5o4K8J73k3m9r0n5l88L79O3j09k9
$$ plain form
7948 178 -10 153 -188 -188 -86 8 124 -273 223 131 68 117 -55 156 39 -71 -54 100 -25 -210 56 -147
7970 -147 97 -243 104 183 75 86 76 126 80 49 -110 63 102 -221 305 127 -75 -215 -17 7 127 73 145
7993 145 94 -87 204 146 -25 -132 158 182 113 -98 67 290 149 -277 133 -282 53 -47 -107 0 37 -87
8015 -87 -124 -43 -84 -37 92 56 -139 -16 27 216 -13 -233 -53 152 19 -57 -218 140 38 -3 -12 144 -7 65
8039 65 -19 -133 -255 -8 8 -61 -54 189 -78 45 -50 -2 300 39 -77 77 165 115 -131 115 218 137 327 -80
8063 -80 72 66 12 11 -60 -69 -137 54 105 83 132 -196 35 5 154 238 24 179 -245 -140 256 -154 84 -61 -21
8088 -21 -139 -78 -9 40 64 -236 -55 131 226 -57 -61 194 78 100 -9 -239 14 -303 -297 -142 94 -79 162 -18
8112 -18 -178 20 -326 -135 23 188 -252 60 -158 -17 48 -16 12 185 162 113 23 -32 -420 -41 22 -87 -116
8135a16L36l15j32R1K32k12j47J57L00k20K33k01R8j07j9J04p0j18j77J02J86
8156Ej01p3J62J1O1Oo8j64L29q0k60K94l73J46K53k19R0M3K5o6%p3M6K09l60K2
8182a35R4o5K10k7j36K87p6j30j22
$$ plain form
8135 -116 220 -95 -227 -136 96 -116 -263 -106 194 -26 207 6 104 -3 -22 82 12 -106 -283 -181 5
8156 5 -96 -169 -7 4 65 71 3 -161 168 88 -172 122 -251 -105 148 -71 19 62 87 21 21 -52 -6 203 -157 -135
8182 -135 -41 -106 104 77 -59 228 152 22 -100
8191a00
$$ Imaginary data points
##PAGE= N=2
##DATA TABLE= (X++(I..I)), XYDATA
0@%%%%%%%%%%%%%%%%Oj4J6j6J6j6K2l0L2l6M4m8N6o6P4q6R8j10J24j40J57j76
38i3J95k18K43k70L02l34L67m06M49m94N43n98O60p28Q03q85R77j083J203j340
58g07J500j690J919k199K553l019L658m592O100q911J5868o3588j04039J43636
72a3511R4818l5718k7594O743n0184r834O9448K1764o8912k2697M0800Q177l4771
85b1471L577L4376K914k8543K77K1556p563k3929J0158J5276j4632l558J9972
98H410j0065k0053K9367K6524k9602j3357L3426j007l4532Q451J9785k2844r305
111a4802K8932k175l2010O361K7404m108r091J0801o02k3062p870K0429J9264
124A9471j0348k8499q643J7906J4822K169J42q912j3871Q281K2865k919j9716
$$ plain form
0 0 0 0 0 0 0 0 0 0 0 0 0 0 0 0 0 0 6 -8 8 -8 8 -8 14 -16 16 -20 24 -24 32 -34 40 -46 52 -58 66 -74 83 -93
38 -93 102 -116 127 -143 159 -175 192 -214 235 -259 284 -314 346 -382 421 -464 513 -570 633 -707
58 -707 793 -897 1022 -1177 1376 -1643 2015 -2577 3523 -5388 10480 -53108 -157147 -13511
72 -13511 81307 45589 17995 24738 -25446 -35280 34168 55932 -12980 -35677 5123 13300 -21471
85 -21471 -17894 16482 19396 -9147 -8870 12686 5123 -18806 -8648 6628 -8004 -11562 8410
98 8410 -1655 -21708 7659 34183 4581 -8776 24650 23643 -10889 -2438 17347 -5497 -14802
111 -14802 14130 11955 -20055 -13694 13710 9602 511 11312 10710 -12352 -20222 207 19471
124 19471 9123 -19376 -28019 -10113 4709 6878 7020 -1892 -15763 -7482 15383 12464 -7252
137g252L45J0066k534l988L374j554j935M964P6n671Q76L067k426j298K804M35
153f51J526J0n499r06R256N715k557n348q614l959J4198J1782j4896j9354N874
168a3423J5481J474m295k136k306L149J0151K676p935m658O998Q673m538j2505
182c194j27J2530K434j2952n303P062K936l325p30q13m030j245L568L986Q2l764
198b885k463L677L327K90O122N570r734j1481R415J5666l657j2606l251r0j794
213c894M693P567j818j1667p417O397J3107L580q004p302j430J477O312P999m314
228E286j4792k636J2210P591m615n154J096K717L76j005K356L241l465n875J766
243i03M483k540j085M335j728p822J161Q818K91o399j834J742j276o59K678K116
$$ plain form
137 -7252 -6907 3159 625 -3363 11 -1543 -3478 1486 1562 -4109 -3233 -166 -2592 -3890 -1086 -651
153 -651 875 885 -4614 -5520 3736 9451 6894 1546 -7068 -11027 3171 14953 57 -19297 -13423
168 -13423 2058 3532 -763 -2899 -5205 -2056 8095 10771 2836 -1822 5176 13849 9311 -3194
182 -3194 -3321 9209 11643 -1309 -6612 450 3386 61 -669 -1482 -5512 -6757 -3189 797 879 -2885
198 -2885 -5348 -1671 1656 1946 8068 13638 3904 -7577 1838 17504 13847 1241 -2010 -2100 -3894
213 -3894 799 8366 6548 -5119 -12536 -6139 6968 10548 2544 -4758 -6188 -4711 1601 9600 5286
228 5286 -9506 -12142 68 7659 3044 -2110 -1014 1703 2079 1074 3430 6671 3206 -2669 -903
243 -903 3580 1040 -45 4290 2562 -5260 -4099 4719 5010 -1389 -3223 -1481 -2757 -3416 -738 1378
259A378k740m830P65N857L701k792l255J033J318J262K712M06m424l185M223M396
275E825j223m336l051J803M348J133m040l511j23J716K733R76l305m466k42M627
291a136L631j219l705j499J498L055J720O30n87l076j510L503M426j160m222j031
307f82J991o95n37K279J447l219m173J147L554N90k554m54j72l449j399N669M734
324D077m240n864J690M413J86N00L186j457p179j619Q353O082n566o653P91L209
340i1J88J782M620l341r038n57Q478L155o088l793J121o09j819M253N096l179
356A78p130P52P406K442m130j220L199j834m100L251O298j726n349O24M030j073
372A618q77L600J809n110n182K653N556j371m660r65J659k043q16N488L109n953
$$ plain form
259 1378 -1362 -6192 -5427 430 4131 1339 -1916 -883 435 1697 4409 4815 391 -2794 1429 5825
275 5825 4602 266 -2785 -982 3366 4499 459 -3052 -3175 -1459 1274 2250 -1055 -5521 -5763 -1136
291 -1136 2495 1276 -2429 -3928 -2430 625 2345 2975 2388 -688 -2198 1305 5731 4571 349 -682
307 -682 1309 614 77 2356 3803 584 -3589 -2442 1112 1702 -852 -1306 -1478 -4927 -6326 -657 4077
324 4077 -163 -6027 -4337 76 262 762 3948 2491 -4688 -6307 2046 8128 2562 -4091 -3300 -91
340 -91 97 1879 6499 3158 -5880 -6437 2041 5196 -892 -4685 -3564 -4173 -5992 -1739 3357 178
356 178 -6952 -6200 1206 3648 -482 -1702 1497 -337 -4437 -1186 5112 3386 -1963 -1339 2691 1618
372 1618 741 4341 6150 1040 -4142 -1489 4067 2696 -1964 -2929 -1270 -3313 -4129 1359 4468 -1485
388a485m713M498N165r22j841O58j521k355J855N286N45m908l533L337M663L89
404E118k431j133j470m55K662K701l007n590K4L727K199j102l478j467K196J810
420C04N76K3m88k774n49L733K376j589k597p69Q04L451K315q96k404q42p13K478
438B439L593k078o052j234L380O43j517K86n56k406J77K216J744M78k461k224
454c572K431K285k511L47M712j491o145K358N556r75k149J432j817m524R67N156
470B060J756l578n801j635O571M609l312j513J855m534k934Q301N286q674o491
485h034L984J764o20L389J618m547l442K587M770M143l316p686O98P152p76l594
501a910L831J92o163K329R225k633p782J746L886j602k340r13j181P61L39k218
$$ plain form
388 -1485 -6198 -1700 3465 2543 702 1360 -161 -2516 -661 4625 5170 262 -3271 66 4729 5118
404 5118 2687 1554 84 -371 2291 4992 1985 -3605 -3581 146 2345 1243 -2235 -3702 -1506 304
420 304 880 903 415 -2359 -2908 825 3201 1612 -985 -1754 -950 2501 4816 3920 1516 674 -39 2439
438 2439 6032 3954 -2098 -3332 48 691 -826 -540 -1096 -3502 -3325 -1109 635 1113 -1348 -3572
454 -3572 -1141 1144 -1367 -1020 3692 2201 -3944 -1586 3970 2995 846 2278 461 -4063 -3096 2060
470 2060 3816 238 -5563 -7198 -627 3982 670 -843 1012 -3522 -6456 1845 7131 -1543 -8034
485 -8034 -4050 -2286 -2906 483 2101 -2446 -5888 -3301 1469 5612 2296 -5390 -4692 2460 1684 -1910
501 -1910 1921 2113 -4050 -1721 7504 4871 -2911 -1165 2721 1119 -1221 -2134 -3315 -2554 -2215 -4433
517d433K062L583l006j323P197M29p785K249P658l948n725L885K286m516P91M609
533D013m42j963n10o71K543L479l960m610K359k69m382L804M005o081m379O105
549i59K386l178J219K069k631L39K255j060q76J784j020K03L781j609o118K463
565i52O722j286l457l43l290k429N466L786m795m058q52M36L406L975k744l877
581d292J350J308o58K313K772k725k373K004Q27m94J077k52j402N15n41k233J877
598i27K713k623k086J983Q02k110J860K330l474l250K878M195r78l593l110J483
614c907L630R76q28m38k448k250L717O096j041n374j178J641N47R91L267L79m821
631a041m051K185O418J601m599k325J167j146m72L964J414n081k966K735K721
$$ plain form
517 -4433 -2371 1212 -1794 -3117 4080 4509 -3276 -1027 6631 2683 -3042 843 3129 -1387 -596 4013
533 4013 3571 1608 1098 427 2970 6449 2489 -2121 238 -31 -4413 -609 3396 -2685 -7064 -959
549 -959 1427 -1751 -532 1537 -1094 -755 1500 440 -436 1348 328 531 4312 2703 -3415 -952
565 -952 5770 4484 1027 684 -2606 -5035 431 4217 -578 -4636 -5488 -5052 -1646 2329 -415 -4292
581 -4292 -2942 -1634 -2292 21 2793 68 -2305 -301 526 32 1109 857 -545 -30 -571 -2804 -927
598 -927 1786 -837 -2923 -940 -138 -2248 -388 1942 -1532 -4782 -1904 2291 1313 -2280 -5390 -3907
614 -3907 -277 699 -129 -567 -3015 -5265 -1548 4548 3507 -1867 -3045 -1404 -857 134 3401 3780 -1041
631 -1041 -5092 -2907 3511 5112 513 -1812 -645 -1791 -2263 1701 3115 -1966 -4932 -2197 524
646E24j298o34J662j38j861p18L725K816l337l689L245L886k789k595K731J076
662B606l044J094L406j787l460N08K364m17j318j61R28o76k983j4M009J102m646
679b489j263L786j10j810L054J859l627j563K772J712l30N6j239j505J040J265
695A608K15L45j852k843J766M220j075m229q18J450P43J283Kk719j701K161J570
712A26L78L86j438j840J298K159l97J01J502j564k498J672K822M51j222k121j353
729a538J581K354o82j604m55p06p93J902K010k520j851J008Q28j280P66J865J4
746H99j989j637J585L035R17k826n56J044n96j91L386J495m794k697K972K808
762B855j253m45J3k544k205K297M877n74n582k704L809L126j432j249P95j096
$$ plain form
646 524 -774 -1408 254 116 -1745 -2463 1262 4078 741 -2948 297 4183 1394 -1201 1530 2606
662 2606 -438 656 4062 2275 -1185 -677 1687 1270 -48 -209 719 43 -2940 -2954 1055 2157 -2489
679 -2489 -3752 34 -76 -1886 1168 3027 -600 -2163 609 2321 1991 2047 808 -697 343 1608
695 1608 1823 2168 316 -2527 -761 3459 2384 -1845 -2663 -1213 -470 813 815 -1904 -3605 -1444 126
712 126 504 890 -548 -2388 -1090 1069 672 773 2275 711 -1787 -115 2707 3158 1936 -185 -1538
729 -1538 43 2397 1715 111 -344 -1050 -1843 59 2069 -451 -2302 -1294 -466 -1746 -980 885 899
746 899 -1090 -2727 -1142 1893 2810 -16 -572 472 -124 -315 3071 4566 -228 -2925 47 2855
762 2855 1602 1157 1170 -1374 -3579 -1282 3595 3021 -2561 -5265 -1456 1670 238 -1011 -216 -1312
778a312j501J946L354r70l409N72K307m4p67J271J170j733k755J464L660m08l557
795g12o05K331r00k220J590K575k137l134N86K923L06j516M21r6k211k8M326J746
813C245m351k966K874M060r55j884K07L88p78L63K666m00l247j133K505J348j096
830H46j537J30l56n29Q74J817m44k894r87K624J776r25j404L20R8k02J329J502
848B038p34k332j35J671J862q16p90m8n96j17P11J532j029j938o83P98R87J73
866E54j104p09m87N14O22N20N41j202j321P32J584K68p13k38J53p37k39K001J877
885B616j138k629J43J831Q45p35m5m46k365r20K457K385k019l025J2K108M05N7
903d63O76l10k571m66K587L077k197l110Q84K411l03j0K116m49k944k90L793R47
$$ plain form
778 -1312 -2813 -867 2487 1517 -1892 -1320 987 943 176 1447 2617 884 -1871 -407 3253 2845 -712
795 -712 -1317 1014 114 -2106 -516 2059 -78 -3212 -2626 297 603 -913 -492 -588 -2799 -2827 1499 3245
813 3245 -1106 -4072 -1198 2862 1907 23 230 618 -160 203 2869 2469 -778 -1911 594 1942 846
830 846 -691 -561 -917 -1446 -572 1245 801 -2093 -3080 -456 1320 395 -1009 -689 -591 -793 536 2038
848 2038 1304 -1028 -1163 508 2370 1554 764 716 120 3 714 2246 1217 -721 -1404 -606 381 554
866 554 -550 -1259 -1746 -1232 -610 -90 451 -751 -2072 -1340 244 512 -201 -439 -286 -1023 -1262 739 2616
885 2616 1478 -1151 -1008 823 1668 933 888 442 -1923 -2843 -386 1999 -20 -3045 -3033 -925 -520 -463
903 -463 213 -97 -2668 -3134 -547 2530 333 -2777 -1893 518 215 205 2321 1872 -1072 -1362 2431 3378
921C378k906j491J066P77j171J2J556n8k596n20K798J247k817q22K627l14k923
938b157Q86L171m87k643J108J638r35m80J139J643j106k359nL083P92k792k01
955B95J762j714j247K515J599l190k576K954J505j813j213L56N6P1N55P42J26
972G83j395j454J870L102j209k965N33J355j090J050J960j253l135Q74K523K42
988A791m07j198j330M14J144j73l58j2j443q98K244J130j655j060R39k22J97J514
1006F17l03j748M3Q86N52J257J86j990j043K445J362j159J47K42j769r87J240
1023b2R71k56o00j104j441O17R28R39Q65j185l052k74M225J726k231j129N53r77
1041a447J95K779J111k402j754P72J980J017j337j188L12k15p85J346J758k730
$$ plain form
921 3378 472 -1019 47 824 -347 -335 1221 1163 -1433 -1953 845 2092 -725 -1547 1080 766 -2157
938 -2157 -1271 1900 1413 -1230 -122 1516 581 101 1240 2883 1777 -582 -587 2496 3288 496 295
955 295 2057 343 -904 1611 3210 20 -2556 398 1903 90 -1123 -767 -711 -640 -85 657 783
972 783 -612 -2066 -196 2906 1697 -1268 -735 620 -470 580 2540 1287 -1848 -974 1549 1791
988 1791 1384 186 -1144 -730 414 241 -117 -129 -1572 -2470 -226 904 -751 -1811 -872 -1094 -897 617
1006 617 314 -1434 -1391 -505 47 1304 1490 -500 -1543 902 2264 1105 1252 1494 -275 -1262 -22
1023 -22 949 693 93 -1011 -2452 -1835 -907 32 897 -288 -3340 -3614 611 2337 106 -1023 -470 -1447
1041 -1447 -1252 1527 2638 236 -1518 -746 1234 2251 914 -274 38 -177 -962 384 2142 -588
1057e88k691J705L120j167j958J72P95j179K78K454N45k644j225J216K192j85
1073H40j018O06L05k041J18K901J398k500j729J022J184j445K72J698m02k292
1089a083r08K053Q10q15p23J072p86j583J017K197n09k056P4J320L11l45k76J196
1107I66k7j570K58K407k95k386N58J713o65j178J018K22j371j39J447j6j087j374
1125a519L1J378Q78j271m53L71l23k21J551R46j726j239J469O01P5L94J97j080
1143E9q3O13k90M89P38j164j103Q58P59n47k66N73j425p41J684N71j073m8p94
1162a190m38J382Q62q33m99M35m08j20K042O96k186r80J480Q27j79L12J81j517
1180a33n13K93J514P00j444k165K32K091N9r07P63o90k876J074L515K20k826p14
$$ plain form
1057 -588 -3279 -1574 1546 379 -1579 -1407 -612 -1791 -1513 941 1486 -1158 -2383 -1167 1025 840
1073 840 -178 428 733 -1308 -1190 1711 3109 609 -1120 -98 1086 -359 -87 1611 1209 -1083
1089 -1083 -1991 62 872 57 -666 406 -380 -1963 -946 1251 742 -1314 -1240 80 391 46 -230 966
1107 966 939 -631 -373 2034 1739 -647 -89 1624 959 -219 799 1021 -350 -489 958 942 -145 -1519
1125 -1519 -1488 -110 768 -503 -956 -585 -908 -1129 422 1368 -358 -1597 -128 473 548 942 1139 59
1143 59 -24 589 299 788 1526 362 -741 117 876 329 63 636 -789 -1530 154 725 -348 -396 -1190
1162 -1190 -1628 -246 616 -217 -716 -281 -689 -809 1233 1929 -257 -1237 243 1070 891 1203 1384 -133
1180 -133 -646 -353 1161 1861 417 -1748 -1516 575 634 -273 490 -200 -3076 -2002 1513 1733 -1093 -1807
1198a807J160J71J99J166J56j176j176M92K288O36k020n19J232k0j659J269K252
1215B644j777k842J427J930j016j400R31L46j308o44J285J564j080k033O24J980
1231F31n65r59J352Q44j936p48K308J396k474p35J525R60j348l8P60j26j079q5
1249c17J123K0j449m37J260J85j307m92J575k34j171L46J500l84j407M07J297
1266E15J61o73J42M88k68k29P99N46p69q28q4J017J04r90J26J40m32k19J52M02
1286A00k03r04P2O49J76q9l24k1L57j92l98N61N49N8k05j22r7M19J85O23l18j253
1308c77l17J117J124l81j501j37L16j11L17M90K1j980o93J626J236o20j173j8
1326a061L97k23L91J428j50j840m62J707J452p72j207O03L38j052M89J382o6j840
$$ plain form
1198 -1807 -647 -476 -277 889 1045 -131 -1307 -815 1473 2109 89 -430 802 782 -877 392 2644
1215 2644 867 -1975 -548 1382 366 -1034 -103 243 -1065 -1709 -424 1140 60 -1973 -1349 631
1231 631 66 -893 459 1303 -633 -1381 927 2323 -151 -886 639 1599 251 213 973 847 -232 -317
1249 -317 806 826 -623 -1060 200 385 -922 -1414 161 -73 -1244 -898 602 218 -1189 -782 515
1266 515 676 3 145 633 365 136 935 1481 712 -116 -200 817 921 -69 57 197 -235 -454 -302 100
1286 100 -103 -1007 -935 -286 -110 -199 -523 -544 -187 -379 -777 -216 333 391 186 64 -33 386 571 1194 876 -377
1308 -377 -694 423 1547 1166 -335 -472 -156 -267 50 540 561 -1419 -2112 -486 750 130 -1043 -1061
1326 -1061 -664 -887 -496 932 782 -1058 -1520 187 1639 867 -340 263 601 -451 38 1420 1354 -486
1344d86q43J570M52j024r6Q42n43j490N39J912k47k106JJ301M47p79J9J173l57
1363B85j380N50J745L9j269j5J152o79o49R13J399j343j767Q94J619n32j178m29
1381f45J016l13q72O26J037j289j331J279J361o97q40L02N99o40K60J017N65k012
1399e77o64J764J203r47j258M73O03j80j5L57k72j438q2J555O20j476p73M04J44
1418e59m6M53J72p59n57N4R88Q28l57j148L7P36K06K13N78j99j253o7J173K77
1438G70j21m84l92m06L95K35K92k9o70r96J77J100L77l39m92j96m30N70Q29M27
1458F17o11n11l05O51P76J86n35j47k8n24J260R47o60k061K63J364rn12L02j06
1478C57j206j71J208P51r17r41n7R14J72l80L35P21j276r25J543J899j527r16
$$ plain form
1344 -486 -1329 241 693 -331 -427 415 -128 -1618 -1079 833 586 -1520 -1519 -218 229 -550 -531 642 285
1363 285 -1095 -545 1200 1239 -30 -45 1107 428 -221 692 2091 748 -1019 -125 1494 962 -216 -645
1381 -645 371 58 -814 -188 849 -440 -1771 -492 869 172 -668 -366 233 -407 -147 870 1435 -577
1399 -577 -1241 523 1726 779 -479 -6 597 417 402 759 487 -951 -1033 522 1142 -334 -1107 -703 -559
1418 -559 -605 -152 20 -739 -1296 -1242 -254 574 217 -931 -894 -158 48 261 839 640 -613 -680 493 770
1438 770 649 165 -227 -633 -238 -3 289 260 -410 -1406 -1229 -129 248 -91 -583 -779 -1209 -639 190 617
1458 617 6 -505 -810 -159 617 803 268 121 93 -431 829 1776 1116 -945 -682 682 673 161 463 357
1478 357 -849 -1020 188 939 22 -919 -976 -62 110 -270 65 786 -490 -1415 128 2027 500 -416
1496d16R16J79j371Q45J336j67j292n91O74O57l83m38O29j11j260p12K062N38
1514A095j582q05J702m14j239N33J479p04j212O42J303l57j016K73J046L72q64
1531B52o10J100m86p45J075R77r61j597N19J256o44n39M98J98j107l13R74O62
1549E09p06o41M88K82J94n21L30N00o77R4O19N02r12n27J112M69m15l53k25m8
1569G4k81L40Q16l2r71p60n3O90M71K39n69p68p23M92R41J015m48r64n97M43P27
1590H2M67N26l81q26n47M38J098M43k94j403j9N91J33k03P63n79j482J83J498
1609D88m91m52l4O6j59j90R77k9q18m26j2J565L95j337p24J061P99r27Q74R60
1629A586j685j216J347J287l50r57L37l83n06k44O90Q73m77j456j91J593l34q90
$$ plain form
1496 -416 500 679 -692 153 1489 1322 30 -561 113 770 387 -51 578 467 -793 -1505 557 1095
1514 1095 -487 -1292 410 -4 -1243 -710 769 65 -1147 -505 798 441 -575 -302 744 1116 252
1531 252 -358 742 256 -489 586 1563 602 -995 -476 780 136 -403 95 293 -814 -1127 -153 509
1549 509 -197 -838 -350 -68 126 -395 -65 435 -242 -148 471 973 61 -466 646 1115 700 347 122 74
1569 74 -207 133 949 917 -54 -814 -867 -177 294 533 -36 -804 -1527 -1035 -94 921 473 -491 -1088 -645 82
1590 82 549 1075 694 -132 -679 -241 857 1300 1006 -397 -416 175 308 105 868 289 -1193 -1010 488
1609 488 -3 -455 -489 -423 -582 -772 205 176 -642 -1068 -1080 485 880 -457 -1181 -120 679 -248 626 1586
1629 1586 -99 -1315 32 1319 969 12 349 -34 -540 -784 -94 779 302 -1154 -1345 248 -86 -976
1647i76R44Q50j694o05J438Q15p97n48J336l25o61J63J036m11l52n11P05Q87q83
1666D11j350Q41J430j434l75Q59m5j336P17J176o83j053L67M19k30O5K57J16n8
1685I4n18k22J491M33j443l09J148p2p63P14R75j287o80Q75L74j6r20j24P1r1
1705b70J13Q9O1j71j020J80J318M59j143j6L40l39j0J064k02m20k78r5O47L50
1725F57L28k59m78n04J11M95R41l28j309o75O61Q67L52o55n49n38l1R56L32K6
1745D00r32q19O28P90kj13J79m36m46R12J092Q5j420n21P00O24R0k86m3k22q51
1766e91R6J172J6n50p67J96K67l17L97N53m18j388J41J530L31q78j85P26l18l29
1786c16O31P15n09j239P43J068l40p95K41M70o12p92O97R12q32r99P64Q50o41
$$ plain form
1647 -976 -32 818 -876 -1481 -43 772 -25 -573 763 438 -223 -60 976 565 213 -298 407 1294 411
1666 411 -939 -98 1332 -102 -477 382 337 -999 -282 894 211 -842 -475 -56 -286 -221 36 152 94
1685 94 -424 -646 845 1278 -165 -474 674 602 -161 553 1528 241 -439 436 810 794 -126 -250 -179 -270
1705 -270 -157 -68 -7 -178 -1198 -1018 300 759 -384 -400 -60 -399 -409 655 453 33 -245 -340 307 657
1725 657 985 726 248 -256 -145 350 1291 963 -346 -1021 -360 507 859 204 -345 -883 -914 42 374 400
1745 400 -532 -1351 -723 67 65 -48 131 -305 -751 161 1253 1338 -82 -603 97 721 811 525 482 260 -591
1766 -591 -495 677 693 143 -624 -428 -161 -478 -81 472 54 -1334 -1193 337 668 -210 -395 331 13 -316
1786 -316 315 1030 521 -718 25 1093 753 -42 199 669 57 -735 -38 874 42 -957 -193 657 16
1805A6n42M19L94o65k27R06K22q45m77Q23P64q76l14Q10L44q89M6J319m9j436
1825b57k1Q98L23q95k07K92n3p34M62R78p83r82r6J264K43q43J03M04l87n17P66
1846d2N89k20m67k89O17M18k72K01j02m49k60N49M53L5m76l67O8j5m7K26j62k96
1868c08k32R3O57j07j66l95q0Q2M06K54Mj40m36n4K98R93m06k98k10K8n7N80L39
1891H45j83p18o87L66R47O2o80q3l48J03L6O57J76r51m81N80N27j33m05N75k00
1912En38J98O30O85q59l32L62N00l72q3J32M34q41j24Q08J93j104K5K56n0l50
1933d25K19N62k66r54K78Q67j50n32k31Q72K52n95j96O31j15q54O48J161q75o52
1953c55M46P53m66n41M36K57l33m50L95M54m57j059M81O69m25l80L08M95j100
$$ plain form
1805 16 -526 -107 287 -378 -605 301 523 -322 -799 24 788 -88 -402 408 752 -137 -91 1228 1179 -257
1825 -257 -278 620 943 48 -159 133 80 -654 -192 786 3 -979 -1075 189 432 -411 -308 96 -291 -808 -42
1846 -42 547 327 -140 -429 188 606 334 535 433 -16 -276 273 726 761 285 -82 -14 -29 -76 150 -12 -308
1868 -308 -540 -447 210 103 -63 -458 -538 -456 -50 204 208 68 -368 -422 -124 869 463 165 -45 -17 -74 506 845
1891 845 662 -56 -743 -377 570 632 -48 -131 -479 -376 -340 317 493 -458 -939 -359 168 35 -370 205 5
1912 5 -533 -335 295 980 121 -211 151 651 279 196 328 762 -79 -203 605 798 -306 -281 -25 -75 -425
1933 -425 -206 356 90 -864 -586 281 131 -401 -632 240 492 -103 -299 332 217 -637 11 1172 297 -355
1953 -355 91 844 378 -163 273 530 197 -253 142 596 139 -920 -439 230 -195 -575 -267 228 -872
1972h72j77J209M33r00m01M08L42p6J45K87j00l46l49R58O25o74q33L11J94l2
1992A52J51L80k12j129p6P16J91nj43k60j33l00L65N15k9m32m21M43N18J67j89
2013B69k6k75j94M31O39o7n83k71J07K99J33k68j46k59j3j20M71J75l83n91L25
2034c47N11J0k63L5J40j41m28L63Q35k81m63k57L63K8J36J73K89o19o22L41R47
2055G50l80p46O1L99j11n96R60J69q29m04K71M15l26n5N26j30m82j96O04O71n25
2076D6l48J77P31r93j61J047K60q75n15J275j75r62J93Q66M7q60j5J52J18m21
2096d13r0M91J72j092j73J221K88r64j36J100n44o57J046P51j099k80N58L62k79
2115B62j25J01L37j21n12M82L85o21o94L87O37l92r12K50O00r67M41Q33k51p62
$$ plain form
1972 -872 -1049 160 593 -307 -708 -300 42 -34 111 398 298 -48 -397 561 1186 512 -321 -10 184 152
1992 152 303 683 471 -658 -734 -18 173 168 25 -235 -368 -668 -303 212 183 -249 -670 -227 291 458 269
2013 269 243 -32 -226 205 844 777 194 -77 30 329 462 194 48 -211 -224 -344 127 302 -81 -672 -347
2034 -347 164 174 -89 -54 86 -55 -483 -120 715 434 -29 -286 77 105 241 414 703 84 -538 -197 750
2055 750 370 -376 -315 84 -27 -623 337 506 -323 -727 -456 -41 -367 -422 104 -26 -508 -704 -100 571 46
2076 46 -302 -125 606 -387 -548 499 759 -116 -631 644 469 -493 -300 566 613 -247 -262 -110 8 -413
2096 -413 -503 -12 160 -932 -1105 116 404 -560 -696 404 -140 -797 249 1000 -99 -379 179 541 262
2115 262 137 238 575 454 -58 424 809 188 -506 -119 518 126 -786 -536 64 -903 -462 371 120 -642
2135f42K70M1L25N32j21l38P8k10j19P89P99q73j019L29M73n41P13L43q36p58
2155g65L31J46L17L46m35q47N82M76m63K09L76m71o59O92N55m34n2M30m29J88
2175I3L16j62k74L27n97R3P05J9r25mQ38l83j65L98n1l01l11M40J22k09j89N5
2197a65q8J64l91J5N20J62r51M53N93k25l85L72M51l35n47O42M26p28K29K14K16
2218F42l53m22K87L77l69o84L64N24l41o60O73K61q48k61P71J77m66k45Q14K07
2238D48o66j00O50J92n59kN67j19m41j54J077k15q82j97M91J93j76m37M97k26
2258e9m52K6R22l19o80J34K80J34l12N59K48l73o39M01Q00k34k57m64M86l36J94
2279E9K21Q9j06j071M55L85N1q0k18J58o30K06L45K93o69k75K66M99J31o1Pj3
$$ plain form
2135 -642 -372 -331 -6 526 405 67 145 -65 -184 605 1404 531 -488 -159 314 -227 486 829 -7 -765
2155 -765 -434 -288 29 375 -60 -907 -325 151 -312 -103 273 -198 -857 -165 390 -44 -96 334 -95 93
2175 93 409 247 -27 300 -297 -204 501 520 -405 -409 429 46 -119 279 228 -73 -384 56 178 -31 -220 -165
2197 -165 -253 -89 -480 -465 55 217 -734 -281 312 87 -298 74 525 190 -357 285 711 -17 212 426 642
2218 642 289 -133 154 531 162 -522 -158 366 25 -635 38 299 -549 -810 -39 138 -328 -573 241 448
2238 448 -218 -318 332 524 -35 -37 530 411 -30 -184 893 678 -204 -401 90 283 107 -330 167 -59
2258 -59 -511 -485 437 118 -562 -428 -148 -14 -326 233 481 108 -531 -130 670 436 179 -285 201 -135 59
2279 59 280 369 263 -808 -353 32 83 3 -215 -57 -687 -481 -136 157 -512 -787 -521 -22 109 48 55 42
2301D2o28L39J94M15l44l59K24L82L76k29k72L9j65n27N57N21k96m14m25M28Q2
2322f0k8j32J46q0l91M12J13L27n98pM97N9k81O4J99P7m36J3N02r2j60k40M59
2345C63j3k00j74J57K50p32O8N93j29q20K58K94J49m83O2L84k15m14K42P83l69
2366E4q47M57O07K99n28K13P2j45l44N52L39n84m86M48L43k27l13j4K55m22k04
2387d75N21M74n87m42K01K29l26K40L88m1o82QO92N55o61m23N71K26n72K62N54
2408G12l41k84l67O33P7l80j3j1l98J34J4K43J76o43p0K87qK51J16K8j41m81M15
2431e1K18P4j32J15j30n5J79M6j17K7l58K28L82J7m74k01l7L61k43P7K41k92m33
2454e58p2M62L66j14o32L14J69R1l03N29K33n33l06N52K61l17M7J13l5l50p3M54
$$ plain form
2301 42 -586 -247 -53 362 18 -341 -117 265 641 412 140 179 14 -513 44 565 269 -145 -570 -142 -60
2322 -60 -88 -220 -74 -154 -545 -133 -20 307 -291 -298 199 258 -23 41 240 317 -119 -106 396 304 144 -96 363
2345 363 350 150 -24 133 383 -349 -281 312 183 -637 -379 -85 64 -419 -357 27 -188 -602 -360 423 54
2366 54 -793 -336 271 570 42 255 327 182 -162 390 729 145 -341 107 450 223 -90 -104 151 -271 -475
2387 -475 46 520 -67 -509 -308 -79 -405 -165 223 182 -500 -492 200 755 94 -329 242 468 -104 158 712
2408 712 371 87 -280 353 430 50 37 26 -372 -238 -224 19 195 -448 -518 -231 -239 12 128 156 15 -466 -51
2431 -51 167 241 109 224 94 39 218 264 147 174 -184 44 426 443 -31 -232 -269 92 -151 -74 167 -125 -558
2454 -558 -630 -168 198 84 -548 -234 -65 26 -277 252 485 -48 -354 198 459 142 189 302 267 -83 -156 298
2476B98Q0j98p56N31L53k01n69L97m1j37k10O25o6l95P0L6L78n86K40M92k12j55
2498b6k46P72j35q27K48L42K69n0l03K18j72l71Q3N05r3m86k07Q79M2p94j65O62
2520A45j61l22K25K38l17m45M07M39J6l19%M54q4k71L30M29m74p11O57J35j85
2541A86k25K87k9n04k24N54L45m49m13J42J08J89q5J89J21m80l02N27P89p60m23
2562d57L97R5k45R2L15J62m69K12K68k05K66k43l58N76k60n06N20J60q65k03O50
2583i8K34o11M49L9l63J5K16K78j67j09k64P7O98L32o21J74Q4k76o1Q07j74r16
2605b57J08N6j35NL64j36k97L20m22j70P12J59o49J40M50m27k45L75M03l43l45
2626c34P18o5kn3j79j34L30k09j2K54k03k54K81M45q24k84N13K26k25K7k8k06
$$ plain form
2476 298 378 180 -576 -45 308 107 -462 -65 -106 -243 -453 172 106 -289 -219 -183 195 -391 -151 341 129 -26
2498 -26 -272 500 365 -462 -214 128 397 347 44 262 90 -281 -198 307 214 -272 -479 400 442 -352 -517 145
2520 145 -16 -338 -113 125 -192 -637 -230 209 225 -94 -94 360 276 5 335 764 290 -421 236 371 186
2541 186 -39 248 219 -285 -509 45 390 -59 -472 -330 -222 -33 -118 71 192 -288 -590 -63 726 -34 -457
2562 -457 -60 35 -210 -118 197 359 -110 102 370 165 431 188 -170 406 146 -360 160 320 -545 -748 -98
2583 -98 136 -475 -26 13 -350 -335 -119 159 -8 -117 -381 -304 394 726 105 279 363 87 26 833 659 -257
2605 -257 -149 -93 -228 -223 141 5 -292 28 -394 -564 148 307 -342 -202 248 -179 -424 -49 354 11 -334
2626 -334 384 319 317 264 85 -49 281 72 60 314 111 -143 138 583 -241 -525 -12 214 -11 16 -12 -218
2648b18l49R2N67j30r5m05L18O32m66J5K80M03r74j50J203k4q20J10K23l72k9
2669a89l8M27k73k47M4O65n7l90k54O8M13n37K13N47k30r77M07N99Lm48R7J14
2691d3k79q1M95M40n10m73L74O25n7m28M14k73l0m18N22j02K78p90J00J59o3k22
2713c62M01l00j67j28K11N10m03j38K53L21k23%M61q3k82n5Q4J54k02oP5J20p8
2736A63j15j8j66Pr7r6K46K04m45J09k30L56j50L3L14l08j25K41L76K9m16J51
2758F3p3mj69L35R0j4k02K5K46N2n95N6M34m0n39J35M84l38j49j6L75j89l60J18
2782b75L23J28k73N3O2P0l35L76L49M2m99J56L9Jp4n1J30m89k40M55M88l43m38
2805c45K73n8nj78M47l6k55l64L82K47m37L29J42L3n83K64M13J05k59k95K70K91
$$ plain form
2648 -218 -567 -475 92 -38 -133 -538 -220 412 -54 -39 241 644 -330 -480 723 699 -121 -11 212 -160 -189
2669 -189 -227 200 -73 -320 -276 389 332 -58 -312 -244 169 -368 -155 392 162 -815 -408 191 194 -254 -157 -43
2691 -43 -322 -403 92 532 22 -451 -77 548 491 63 477 204 174 -244 278 176 454 -336 -236 -77 -140 -362
2713 -362 39 -261 -428 -556 -345 165 -238 -376 -123 198 -25 -25 436 353 71 16 100 254 52 46 121 241 163
2736 163 48 30 -136 -129 -226 -322 -76 128 -317 -208 -438 -82 -232 -199 115 -193 -318 -77 299 328 -88 63
2758 63 -10 -14 -183 152 242 228 26 51 297 349 -246 -190 244 204 -335 -200 284 -54 -203 -219 156 -33 -393 -275
2782 -275 48 176 -97 -44 18 88 -247 129 478 520 21 177 216 217 143 92 222 -267 -507 -52 436 93 -345
2805 -345 -72 -130 -135 -313 134 98 -157 -521 -139 108 -329 0 142 175 -408 -144 269 374 115 -180 90 381
2827C81k66j7K31k2n67j7M30R4o13k1K86J28j12l93M13j63l36M30M14l14M1j90
2849a83J51o6k2K89L60l31k99o2O43j09m17J48K13l83J65m6K53l14k53ML90q2
2871D9j55o5jj43J83p9K08J79k10m3O1k5J06j15K95k86M3o0L62K1k24j80J16L53
2895C90m53J4K23l65k7Q1M0K98m32K4K86k53J29l79L55J33k18l94M76K84m37j51
2917c76O86M9k86r7J92J50m11m2O02j2m45j17K52j45j38k43N91j71m52N5M79j52
2939c1n24L70M32l5l11j3k2M0j38K00L26pp73M68M36j69k26M5N61o14l34N79J37
2962C97J9o82J6M27k04j10O1J58m41j15N78N7j19j6j97L10l40k68Q76j54k56o3
2984f6K51q2J65j43K29j77k66j34O25k96l81L07N6J86k37n8j87N4j07M2K25P7
$$ plain form
2827 381 115 98 329 307 -260 -277 153 247 -366 -387 -101 27 -85 -478 -65 -228 -564 -134 280 -34 7 -183
2849 -183 -32 -98 -120 169 529 198 -101 -163 480 371 -46 102 315 -68 97 51 304 -10 -263 -259 131 49
2871 49 -106 -171 -172 -315 -132 -211 -3 176 -34 -77 -16 -41 65 -50 245 -41 2 -58 304 325 101 -79 37 390
2895 390 -63 -49 174 -191 -218 -137 -97 201 -231 -207 79 -174 -45 -424 -69 64 -154 -548 -72 212 -225 -376
2917 -376 310 359 73 -24 168 318 -93 -135 467 455 10 -107 145 0 -138 -381 210 39 -413 -358 121 -31
2939 -31 -555 -185 247 212 -99 -112 -134 -94 -232 -32 294 287 -486 -18 418 249 23 68 629 15 -319 260 397
2962 397 416 -266 -250 177 -27 -137 -76 82 -359 -474 104 161 42 26 -171 139 -201 -469 407 253 -3 -66
2984 -66 185 103 268 125 354 177 -89 -223 402 106 -275 32 88 274 37 -21 -208 -154 -261 -219 6 83
3006H3l58K80j56J69j54k37M63J14m76K53L34M4m1k64K64l05j7K98k42o3o0j10
3028a81K79m1J16m68L50J80k27l12L52j51k97K65k3JK1J77j60K53o9k72K03M01
3050C97j17l32J88N55p62n9K96L4l17J56K81j30l01p2M13k7M7l80J3J95j80l31
3072d33M92M05o70k7L92j45l26P5M68k24p3L51K2o2k19J27K2M65n65n58P35q1
3094A71n76K75J30J52p55L44M42k20l62K99k16J10R3L40j32K75p22O9M74L26l86
3115A31P8L70o57k73O69M2n48l7L37K06o09M78J38j71j05k00J4L21k43k31q0N43
3137A73k83k23M02j50k13M9M67q7k04L52l10R8P3J03j21P2l54l7L63j50J41l02
3159a41J52k4m4m1J91r5k60j25K08j98O08l33j99L47l1l26K42K79l56P8N6L08
$$ plain form
3006 83 -275 5 -151 18 -136 -373 90 204 -272 -19 315 359 318 54 318 13 -4 294 52 -11 -71 -181
3028 -181 98 57 173 -295 55 235 8 -304 48 -103 -400 -135 -158 -157 -136 41 -119 134 65 -207 -4 397
3050 397 280 -52 136 691 -71 -130 166 200 -117 39 320 190 -111 -183 230 203 250 -130 -117 78 -102 -433
3072 -433 59 464 -206 -233 159 14 -312 -237 231 7 -66 285 307 245 26 153 175 640 75 -483 252 171
3094 171 -405 -130 0 152 -603 -259 183 -37 -399 -100 -316 -206 -113 227 95 370 -352 -283 191 517 131
3115 131 209 579 -78 -351 318 360 -188 -225 112 318 -291 187 325 154 49 -151 -137 184 -59 -290 -370 173
3137 173 -110 -333 69 -81 -294 -245 222 135 -69 283 -27 71 144 247 126 198 -156 -193 170 20 161 -141
3159 -141 11 -13 -57 -98 93 -2 -262 -387 -179 -377 231 -102 -301 46 15 -311 -69 210 -146 -68 -12 296
3181B96k23o0j26K19P7j52K07k45O5R2k18P6j58O6j64L12l69j06L14J43j45k10
3203c09J36Q9p7qQ5L63k42k08O60j55k16L1k41L37j30nK3K08j62k05K58j13l03
3226a84j12K11N0J2l58L24L17n08o2L72M61m43m60N13m3L4o4J88j97K5l10N57
3248C23K57q23m7L99q2O8r1M75n16n05M35K06Q6k09j79j31L53j9J4K64k33n48
3270e03K21M38rk00N4R3k91J20J74L94l42p4q8K35k05L6q8j19k6l59P02j71M7
3293C9l01K16k5N1j40J25j0k35J45N18k41P5L2l65M33l44M6P8l4j5j63L27j62
3316E0o2l3j15K16o1Q4n6k13J35l26L70p7L9k37M4L7M37j99q6K97k82J56j90L33
3340B61j44j74l1L64k37J9n7K58k60l86M20M22m10j28k41M15k70p0R6QJ17l40
$$ plain form
3181 296 73 13 -113 106 183 31 238 -7 58 150 -68 8 -150 -84 -248 64 -305 -411 -97 46 -99 -309
3203 -309 -173 -84 -161 -169 -84 279 37 -171 489 334 118 149 -92 245 115 110 133 341 179 -26 232 119 -184
3226 -184 -296 -85 -35 -23 -381 -57 260 -248 -310 62 523 80 -380 133 90 124 60 248 51 76 -234 323
3248 323 580 -243 -290 109 27 95 4 479 -37 -542 -107 99 185 -24 -203 -334 19 0 14 278 45 -503
3270 -503 -282 156 147 -53 1 94 -197 -77 97 491 149 75 -13 222 17 53 -35 -154 -180 -539 163 -8 39
3293 39 -262 -46 -71 -20 -160 -35 -45 -280 -135 383 142 217 249 -116 317 -27 19 97 63 48 -115 212 50
3316 50 -12 -45 -160 56 -5 79 23 -190 -55 -381 -11 -88 -49 -286 -242 -205 232 33 -53 244 -38 118 -72 261
3340 261 117 -57 -88 276 39 58 1 259 -1 -387 33 455 45 -83 -324 91 -179 -249 -153 -145 -28 -368
3362c68K19K01l1j23J60K61l11k35K13K44m6k04j34J70M9k07L89j09j16k78M67
3383B11M8l38k86K84K92l31k1jJ78l79J77L65N5m45k65L86Q1k1m7K51q1k27L1
3406h3O91j68n24r8J12M05l74J7K34j40m65J12L82J35j90k12r3J58o2Q5K22k89
3428a45Ln5M18n4l44J08J97O7k43K81J66j32k44p6K3J89j06n0J15L2k12J72M3
3451A53M2j22q1J0r7j1J3J02q2k74L03o3J17l10L59m3J2Q3j27L53q2l59J85R4
3475A75k05K49k75J95m9j10j15J00R7k30L35P2l66q2L9K10r9l64L70j00o0O3P3
3498g7r6J59Kj71K46K27k02j49K44K38m38j17N49l99j8j77L79j61j05n4j6O6j20
3521a90n9L45K12q01KL67J89l4o2J78j37k36K01K87l45J00K03J25l94j3J62K87
$$ plain form
3362 -368 -149 52 21 -102 58 319 8 -227 -14 230 184 -20 -154 16 65 -142 247 138 22 -256 211
3383 211 259 -79 -365 -81 211 -120 -141 -142 36 -343 -166 199 254 -191 -456 -70 11 -10 -57 194 113 -114 -83
3406 -83 608 440 -84 -182 -70 335 -39 -22 212 72 -393 -281 101 236 46 -166 -259 -101 -163 -78 144 -145
3428 -145 -142 -197 221 167 -177 -69 128 195 -48 233 399 267 23 -53 -30 159 53 3 118 150 -62 110 153
3451 153 195 73 -8 2 -95 -106 -93 9 -73 -347 -44 -107 10 -300 59 16 28 111 -16 337 255 -104 81 175
3475 175 -30 219 -56 139 90 -20 -135 -35 62 -168 167 239 -127 -209 -170 40 -59 -423 -53 -153 -213 -150 -77
3498 -77 -173 -14 -12 -183 63 290 88 -61 183 421 -17 -134 415 16 -2 -179 200 39 -66 -120 -136 -70 -190
3521 -190 -249 96 308 -493 -491 -124 65 31 -31 147 10 -226 -25 262 -83 17 220 345 -49 -62 100 387
3543C87k77m97K19O26m08k19K44k03r4L3O8K70j37m34O24l34l0J47J58j43j6j68
3565a84J75M92l00q0j92N77m15K7R5l21q2K66J80j33o6r7Q0j91K66l39L6K10N0
3588E4k30K70j04K07k35J70j65j28K29j4n8K05J9j60R3Oj27k16N30k83K9k41L86
3611B37l44j00J72j34J58j18L62n56J77O8q9L54J18n20L43K2r4j47K26n5L1k08
3633i7K15J14r2p6Q7Q5l02L9N7J23J68o32K33K48l12j01L51L8j54k22R7J14k88
3656c07Q5L47k30rK1K17K47n22J39k50L73q5N9J19k94j93L06J79k42J39r1J31
3678A39q9j95J75L1L2l68j02M73j60j04J71o7j29Q1P3R4p1l0K57N9m32K50P6J68
3702C32k38l96J51N55m82l16K01L51Rl75J99q2Q8j93q8L47j71J50k2j42K87m28
$$ plain form
3543 387 110 -387 -168 458 50 -169 75 -128 -222 -189 -121 149 12 -422 202 -132 -162 -15 143 0 -16 -184
3565 -184 -9 483 183 103 -89 488 73 100 195 -126 -208 58 238 105 39 -58 22 -169 97 -242 -206 4 54
3588 54 -176 94 -10 197 -38 132 -33 -161 68 54 -4 201 220 60 153 159 32 -184 346 63 92 -149 237
3611 237 -107 -207 -35 -169 -11 -129 233 -323 -146 -78 -167 187 305 -215 128 150 56 -91 135 80 111 -97
3633 -97 118 232 140 64 151 236 -66 -27 30 153 321 -311 -78 170 -142 -243 108 146 -8 -230 -133 -19 -307
3656 -307 -222 125 -105 -114 -93 124 371 -151 -12 -262 111 26 85 204 -90 -283 23 202 -40 99 8 139
3678 139 50 -145 30 61 93 -275 -377 96 -64 -168 3 -64 -193 -112 -39 55 -16 -46 211 270 -162 88 164 332
3702 332 94 -302 -151 404 -78 -394 -193 158 167 -208 -9 -91 -3 -196 -284 63 -108 42 20 -122 165 -263
3724b63K36K97p7k04L04j60o4j85K87k18l07L99jJ1J54k75j02N79n74J38R6m4
3746B7j27K4k29K07R0p8K87m8m06L79j25J75n0r1k9n4K80m27J41L24k91o0J71
3769I0K52j54l27o5L56j15k16j89M54l0j09L3K45k27j88J30K45m71P3L25O5j51
3791B6j60K53n5R7o0M6J77j07l26n7N18l43j37q9K75j37n8L82k20k56K21K11j96
3814Eo5j03M05k66j46J4M06k20n3K2K02j10l0k97N59k01k57J54J5l7j37KJ23l9
3838e4k8O1Q9r3j44MK01j8l04K81P8j93j0P6K53n7j53k7K06Pk43J72m9J30m9j19
3864A7J91j16j70J42j3L7j14j08P5l3k30O2M26m00P4K88j77p2J82k48L27M6J7
3887B03l4o8J55l55K33p0K71l99o9N3Q8K9J62l08J32j71k5L49j06J44l24K22j9
$$ plain form
3724 -263 -27 270 193 -11 293 133 69 -116 171 -47 -354 45 44 55 209 -66 -168 411 -163 -25 71 27
3746 27 -100 -76 -305 -98 -8 -86 201 153 -253 126 1 176 126 35 6 -48 232 -195 -54 270 -21 -81 90
3769 90 342 188 -139 -204 152 37 -179 -368 86 56 -53 -20 225 -2 -190 -60 185 -286 -213 112 177 26
3791 26 -134 119 64 161 101 147 324 217 -109 -166 352 9 -128 -217 58 -79 -137 245 25 -231 -10 201 5
3814 5 -60 -163 242 -24 -170 -156 250 30 -23 -1 201 91 61 -236 323 122 -135 19 34 -3 -140 -138 -15 -54
3838 -54 -82 -21 68 -25 -169 -165 36 18 -286 -5 73 -120 -130 -54 199 142 -11 -38 168 175 -68 104 55 185 136 17
3864 17 208 92 -78 64 51 88 -26 -134 -59 -92 -322 -260 166 -234 -160 128 -49 -121 61 -187 140 186 203
3887 203 169 101 256 -99 134 64 335 -64 -133 -80 8 37 199 -109 23 -148 -173 176 70 214 -110 112 93
3910I3k56k0p0M38l77J43j66K25l4J77j13J59l61J81K86j18o7j82J44j1j74r1
3932a94M27j42k07J31J87j30k61j53K95L16k50k83L23J70m23L6J08Rj66N29p7
3953B45o3l69K46L25m43j99K21N4K1q4K04n7l08j36L05M9k81j2M31j42j73p7R5
3976a48K31k76O5M24L7k69k3k06L42k65K72j09K43m75L63J12m30L4K51k14m2J98
3998A15k1NM3k74k8K30O6r2q4J2j85L47j87P1k07J98N9k43O2J29Q2k16K79j97
4022c6J45J44o4j93j12L84j38k08J02Q6l54J74L04l45K08J78k18j11N1j19j5K85
4044A48nk14L30l77J50r6L90k94K24k82j13K31k35K06o5j82L52l75l0J82L2j05
4066a28j54M34j89k57K27M1P7l19J00P8M11j87l48L17k7o4j07L39j33j80M2K47
$$ plain form
3910 93 -163 -183 -253 185 -192 -49 -215 10 -24 153 40 199 -162 19 305 187 120 -62 82 71 -103 -194
3932 -194 233 91 -116 15 202 72 -189 -342 -47 269 19 -264 59 229 -194 -158 -50 -41 -207 322 245
3953 245 182 -187 59 384 -59 -258 -37 17 38 -46 158 101 -207 -343 -38 11 -270 -282 149 7 -166 -243 -148
3976 -148 83 -193 -128 296 333 64 41 -165 177 -88 184 75 318 -157 206 318 -112 -78 173 -41 -83 115
3998 115 94 99 142 -132 -160 70 136 44 -40 -28 -213 134 -53 18 -189 9 68 -175 -113 16 98 -118 161 -36
4022 -36 109 253 189 -4 -116 268 130 -78 24 110 -244 -70 234 -111 97 275 57 -54 -3 -122 -137 148
4044 148 143 -71 259 -118 32 -64 326 32 256 -26 -139 92 -143 63 -2 -184 168 -207 -237 -55 -23 -128
4066 -128 -282 152 -37 -294 -67 -26 51 -268 -168 -90 321 134 -214 103 76 12 -95 244 111 -69 -27 220
4088B20j56N2k87N05l35K3p1j37N94p20J16J93j9jl7kJ8k48J54M37k16M8k51j5
4112a35J68j81PK64o1j72J65l0l9J52r1J13l21l0K66k4J23l95J00Q0j94R3L7K80
4136A75l06j53M45K2j55j8k01L12k85mK7K41j57J91j11J85k67j60M58k62M1j78
4158a60N9O4J38j98L08l85Q6K2j71J44K27l16K08Mj48k19J46L41l30O1n8M08l52
4181a21k22L38j38n7L43j87J21j16R1J7j87M08m21J48J16k4j54R6J21j68j74j0
4203a80L43j75j31K52j93M3Q2k02K85k5r7M7O6k06K92j4m0m30kO92k15j39l25
4226b72L10m7j84J30O4K82l41m1j22K06J44m00L47j6l39J52M17j39l02K15K5J10
4248A99j44k37M11k99K4Q3r1J42k17J19K78k89N0o4R4k73J43R6K5k71K1j98O5
$$ plain form
4088 220 64 116 -171 334 -1 22 -49 -186 408 -312 -196 -3 -22 -23 -60 -62 -44 -292 -138 299 83 131 -120 -135
4112 -135 33 -148 -141 123 62 -110 55 25 -14 138 47 160 -161 -191 75 51 174 -221 -121 -41 -235 -142 -105 175
4136 175 -131 -284 161 183 28 10 -191 121 -164 -168 -141 100 -57 134 23 208 -59 -219 239 -23 18 -160
4158 -160 -101 -37 101 -97 211 -174 -88 -66 -237 -93 134 -182 26 30 -118 -337 -191 150 -180 -119 -177 231 -121
4181 -121 -343 -5 -143 -200 143 -44 77 -39 52 69 -118 290 -131 17 133 109 -45 51 172 4 -170 -180
4203 -180 163 -12 -143 109 -84 -41 41 -161 124 99 2 49 115 -91 201 187 147 -283 -285 407 192 53 -272
4226 -272 38 -9 -193 -63 1 283 -58 -99 -221 -15 129 -271 76 60 -279 -127 290 151 -151 64 89 199
4248 199 55 -182 229 -70 -46 37 -54 88 -129 -10 268 -21 29 -35 59 -214 -71 25 50 -221 -200 -398 -333
4271c33M01k74J31K23q4Q0m9J95j81k03K45k19j42k0L02J08k44O7O2K50l01Kp6
4294f0N6l8L9j88M25l77M3J59o0Q2M9l8n4N2j13J08J95m41L46j44L7K34n31J66
4318e3p2K9J90q0j1k8k76j3L09jl27K64J25j87J67J11j16n3m3J96j43Q5k11J82
4342D4R0j57J14M1j49k65L60n2R8k7q8q7Q5j03j05K41j32k8J25m0J65k29J32N4
4366H7n2r5N4N8K67l80J56k10K10m4k6Pnl5P5O0k11P2K0j45J49k67K32o2J7j12
4392a80J59l6O5N8l68M20q0k36L07r5P4n7r9J95k6q6J5k5J95j59l4Q9j59M0j64
4417a87M1J70K7p8J08l32j14P7K65M7o9J23o1j84NK25j04J21k30J54J27m6k69
4440a84N79k98Nr2J77p6M7j77k6N3j70J76J68k08M1k00jK82k71j05P8M39n09m7
$$ plain form
4271 -333 68 -206 -75 148 64 144 95 290 109 -94 151 -68 -210 -230 72 180 -64 3 65 315 14 16 -60
4294 -60 -4 -42 -3 -191 234 -143 -100 59 -1 81 130 92 38 90 -23 85 280 -161 185 41 78 312 -219 -53
4318 -53 -125 -96 94 14 3 -25 -301 -314 -5 -6 -333 -69 56 -131 36 147 31 -22 -65 131 -12 73 -138 44
4342 44 134 -23 91 132 -17 -282 78 26 124 97 9 -78 7 -96 -201 40 -92 -120 5 -35 130 -99 33 87
4366 87 35 -60 -6 52 319 -61 95 -115 95 51 25 32 27 -8 67 127 -84 -12 8 -137 12 -255 -23 -85 -68 -180
4392 -180 -21 -57 8 66 -302 118 38 -198 109 14 88 31 -68 127 101 15 30 5 200 41 7 96 -63 -23 -187
4417 -187 -146 24 51 -27 81 -251 -365 -288 -23 24 -45 78 17 -167 -162 63 -41 80 -150 4 131 85 -184
4440 -184 395 97 102 10 187 111 158 -19 -45 8 -162 14 182 -26 15 -185 -186 96 -175 -280 -202 237 -272 -319
4464c19K47K24j06j31J14Lj6R0L0j38m6K87k73K38k42K4J55j91L08m17Q0o2K61
4487A20p0l24%K99l2j54L82j66j59M8K6j35r2n2N41k16J08k34J8P1J25r9O2K54
4511C21j13l64M13m20j22J31J29k34J54J28K12m64K70l8j29J13j05L22j95R7l92
4532b86j2M55n9j99J84J31k48J31q4Q1L0K5l16J17K2J09j64K5J19j90J3K00j80
4555i6o8K84n9k14o8K18k11P9k35K98L2J3l40N24j02j91P2R6P3j79R8kJ14Rl59
4580b14K68j13J25q7P0j13NN8L6j56J39k29L5J34j1o5J57j21R6j17K71k41K4K1
4604b8R5K39l80K9J6L14m96L60L3l29n7n5L96q3j60J6O7q9Rp1J23n7l4k15N46
4629A89n4j28j79L19k07p5L74j14j15J20l8m4O6m36L37n7K64j46m9O4R0l17J7
$$ plain form
4464 -319 -72 152 46 -85 29 32 16 106 136 -2 -48 239 -34 204 -38 -14 141 -50 258 -159 -79 -141 120
4487 120 50 -274 -274 25 -7 -161 221 55 -104 -56 -30 -165 -257 -309 232 16 124 -110 -92 -21 104 5 67 321
4511 321 208 -156 257 -163 -285 -154 -25 -259 -105 23 235 -229 41 3 -126 -13 -118 204 9 106 -286
4532 -286 -298 157 98 -101 83 214 -34 97 13 94 124 149 -167 -50 -28 81 -83 -58 61 -129 -116 84 -96
4555 -96 -164 120 61 -153 -221 -3 -214 -135 -370 -72 -40 -27 -367 157 55 -136 -64 32 105 -74 24 22 136 145 -214
4580 -214 54 -59 66 -21 49 -64 -59 -1 35 -121 18 -211 -176 -42 -53 -118 39 -82 14 -103 168 -73 -49 -28
4604 -28 67 306 -74 -45 -29 285 -211 149 182 -147 -204 -259 137 54 -106 -90 -23 -112 -103 -174 -51 -108 -142 -357 189
4629 189 135 7 -172 147 -60 -135 239 125 10 130 92 48 114 -322 15 -42 222 76 27 91 181 -136 -119
4652a19Q8k6j27JK01K46k55Kl8j3O8k09K85j20j19K9K58j9k38O6J36k99K2K09
4676B9K22l10P7N5K9K18k63j68L03n5r7j34r5J17l08J12L43k54n5M1L40j27j89
4699a69L17j40k5n0J22P4j24J04j18N6N4l77m7L97q1k7j28J99J66l10J36j9l0
4722b0K05j19R1J33k21o0O0j5J39k86K84j58J1P9j42j26J28N3J91q6j05p1j53
4745a88k1j12L41r5n8j9j89L59K4j06J67j34K7o3J95j47K75m33L01J18j74j91
4767a23j26K21j84R4J81J8J07j72Q7nj81J61Lm0P5j19J84j93j00o2J78j72K57
4790H9j70q1j14L19j11K3J44J00l03L9J90R0l23L27j81j28J39k07K63k24J08L7
4812B6J73m23k8J88%n7j17L34n4m0kK5p6Pq1L48j82j45K74P2j52k54J74J79o3
$$ plain form
4652 -119 -31 -57 -184 -183 18 264 9 11 -27 -40 28 -181 104 -16 -135 -106 152 133 -105 -39 97 -202 -180 29
4676 29 251 -59 18 73 102 320 57 -111 192 137 40 -94 -189 -72 -380 -268 75 -179 -234 -193 147 20 -169
4699 -169 148 8 -17 -67 55 129 5 109 -9 47 101 -276 -323 74 -7 -34 -162 37 203 -107 29 10 -20
4722 -20 185 66 157 290 69 9 69 54 193 -93 191 33 44 123 -19 -145 -17 36 227 141 36 -35 -188
4745 -188 -209 -321 20 -75 -133 -152 -341 18 42 -64 103 -31 -4 -67 128 -19 256 -177 124 242 68 -123
4767 -123 -249 -28 -212 -118 63 81 188 16 103 98 -83 78 81 41 116 -3 181 -12 -112 -174 4 -168 89
4790 89 -81 -162 -276 43 -68 -45 99 199 -104 -65 125 215 -108 219 38 -90 49 -158 105 -119 -11 26
4812 26 199 -224 -252 -64 -64 -121 -238 96 42 2 0 25 -51 -44 -125 223 41 -104 170 242 90 -164 10 189 126
4837A26k92l6K56j06R6r5qJ39P0j4p5k2l38K88k1L8j20J80j26R9k1j06J23J0R2
4862A37k4j06J79m02K02N9o1l21L55J93l68K89n9J24k35p4O7P1j08K1K04j06k67
4885b30m8K37K53j50J7p6j33K03k27M6J93p7j70N6J04J50k08M7N8K1k53O1qK9
4909a05K2k79M65N3l37K18J06o7R8q9N1j95l43M96j12J21k5j42K37n12M60j36
4931a5K4J13k85L43j96N4k88J57O0K5J83r4j55J50j74M0J57k50P3K07L2j67j06
4954a12Q9K68k92o1J14Rj78K69k37K19l10K32k41K66Om6Q4K7o9m44M10L7j61O8
4978e3J12O1j68N2p5N3k84J33K49R0k41J86P7r9j01j00N7N5O9j90L09k7l88K89
5002F6o9P3J0j40J01j4k92Q6K88L8k67J30l18K50K62l10K31n4l51K37l4l5oK50
$$ plain form
4837 126 -166 -202 54 -52 44 -51 -59 80 150 136 61 39 -299 -11 -32 6 -114 66 -60 39 18 -88 35 45 137
4862 137 113 7 186 -216 -14 45 -16 -337 18 211 -157 132 73 197 -38 -112 -45 26 -82 -61 143 37 -230
4885 -230 -278 -41 212 62 79 3 -130 73 -154 -108 85 8 -162 -106 -2 148 -60 -13 45 66 -187 -126 -134 -105
4909 -105 -83 -362 103 156 -181 37 143 76 174 85 136 -59 -402 94 -18 103 78 -64 173 -339 121 -15
4931 -15 9 122 -163 180 -16 38 -250 -93 -33 -8 175 81 -74 76 -98 -58 99 -151 -78 129 161 -6 -112
4954 -112 -23 245 -47 -108 6 15 -163 106 -131 88 -222 10 -231 35 41 -5 79 106 37 -407 3 40 -121 -53
4978 -53 59 120 -48 4 -71 -18 -302 -169 80 170 -71 115 192 93 -8 -108 -51 4 73 -117 192 165 -223 66
5002 66 -3 70 80 -60 41 27 -265 -179 109 147 -120 10 -308 -58 204 -106 125 71 -280 -43 -77 -112 -118 132
5026A32k76j14N7M05j60Q1K7j80PO2Q7j87J7J18l65K65K79k56j2Q5k22J44O6o9
5050iR4p1K12l8l60L67j93l0o9L85k08j6l7j1j63J79Mk5j13j14K06J71k86j07
5074b32K97r8J32k25J72Nj82P0k1K37P1m32M03k37K18k20j58J17j27J17K40p8
5096F9J21k20L20l28K35j81p1J06l33J84K6J36j26L6J03l0l5N1oj52J14j52K94
5119A61n8j58p2L67j60q4j58K77j47j04Q7K5j56p8L99n40P8J39L36j8l95K92J94
5142B27o7k34L5J05j47J34k08J51J7L19m74J30p2M7o9r3J46J8r0j59J76j6J20
5165dj18P8K03l34K06k5J22k44J13j56L6l0K36J11k81J99k40K6P3k8o5J97l3j18
5189g6J77J09m72K36K40N0m40J17J43J78o7k67j38J29R6m1J12pk38J01O1Q8j42
$$ plain form
5026 132 -144 -258 -201 204 44 125 152 -28 -21 41 128 -59 -42 76 -289 -24 255 -1 -13 72 -150 -6 60 -9
5050 -9 85 14 226 188 -172 195 2 -28 -97 288 80 64 27 16 -147 32 36 11 -102 -216 -10 161 -125 -232
5074 -232 65 -33 99 -126 46 51 -131 -61 -82 155 226 -206 197 -40 178 -42 -200 -83 -210 -93 147 69
5096 69 190 -30 290 -38 197 16 -55 51 -282 -98 -72 64 -62 -26 77 47 12 63 57 -95 19 -133 161
5119 161 103 -55 -127 240 80 -4 -162 115 -32 -136 -49 -24 -180 -258 141 -399 -321 -182 154 136 -259 33 227
5142 227 160 -74 -39 66 -81 53 -155 -4 13 332 -142 -12 -84 -37 -106 -199 -53 -35 -125 -284 -108 -124 -4
5165 -4 -122 -44 159 -175 31 6 128 -116 -3 -159 -123 -153 83 194 -87 112 -128 -102 -29 -57 -122 75 42 -76
5189 -76 101 210 -262 -26 214 264 -176 -59 84 262 195 -72 -210 -81 15 -26 86 79 -159 -58 3 91 -51
5212e1J07J29l75K40q6N2K22l70J61K01k21P3K8o9k1l5k07P8P9L33m15K65j04
5235A4j22J35K8L7j12P7j64J70L3M9r2K6j61J84j18R5Lq9L53m64J7p5L00j10N0
5260F4J50k92K20k45j37J92J83k98J08L16j98Jj26k52N16l50K10k9qP9K58k20
5282A42l1k64K28J1L9j54J16p8J55j44%q3Mp6K43j26j68q2J13N7J02oK4l5J36
5307A23j08j62J98j18j50J43J98j03r4J28Oo4l9J57j0j0k34J53j73L1L74j70k5
5330E1j41L53j91N2j67mJ80Kk54J42oJ9j44j8J46j37K22r2J13J02m71L58RP6K2
5355B22j08j29K8k50K26J49j20O1P6j87K2j40O0k7K58k09P9QJ15j48j36J00J01
5378E1o2K2l2r0J6l6O3P2O8JJ64k86j39M5L09p9k76j1K60k4J9j1j67K61j14p2
$$ plain form
5212 -51 56 185 -190 50 -36 16 238 -132 29 230 9 82 110 41 20 -15 -222 -144 -65 268 -147 118 14
5235 14 -108 27 55 92 -20 57 -107 63 96 145 53 79 -82 102 -16 79 82 -7 346 -118 -101 -176 124 14 64
5260 64 214 -78 142 -103 -240 -48 135 -163 -55 261 63 64 -62 -314 202 -148 62 33 25 104 362 142
5282 142 111 -153 75 86 125 -29 87 9 164 20 20 -63 -59 -135 108 -18 -186 -268 -155 -98 4 -2 22 -13 123
5307 123 15 -147 51 -67 -217 -74 124 21 -73 55 61 -3 -42 115 105 95 -139 14 -159 -128 246 76 51
5330 51 -90 263 72 124 -43 -47 133 135 -119 23 17 36 -108 -126 20 -117 105 13 126 228 -243 115 124 200 222
5355 222 114 -15 13 -237 -11 138 18 79 155 -32 -10 -150 -90 -117 141 -68 11 19 134 -14 -150 -50 51
5378 51 -11 11 -21 -111 -95 -131 -68 4 72 73 237 -49 -188 -143 166 87 -189 -200 60 36 55 44 -123 138 24 -48
5404d8O0K19k85n9K32Rq9j07J09p0j65K33L3j59J11j17K15n2J56l52J34l2k3o3
5428a10p7K72J85j74O2k66P5o6rP7N9J21j83J00j42J44K9k2l28K70j19N3k1J87
5452A17j48J94k32P5k6K1l28J35L19j33j66J40m9N9m4K23j10q7j42J99l6O4j43
5475i8K73j43J65j43J8jj61K13q6j09J59j43K5J95j47j88R1K48j49k27J76K46
5497B14k72K4N1j27j23K39J32L6j47oJ30r8j63K51p3n2J2j12J47J64L1l83j75
5520c00J62N9k04j58L42P7j1j4P3l23J15L66j89J21k47N0j9K51j14J57M0m26J61
5543c1j31J44R9l85N57n9k64J54k8k26Q9M09k52j32j59J49N3j68J5Q5j53J58J32
5566E6q6K1K5j63K1J89k48j37J82l7J57J97k39LJ01k28R5m0l3NK21J16j81j47
$$ plain form
5404 -48 12 231 -54 -113 119 128 39 -68 41 -29 -194 39 72 -87 24 -93 122 70 226 -126 8 -24 -47 -110
5428 -110 -187 85 270 96 158 -108 -33 -99 -108 -31 28 149 -34 66 -76 68 97 75 -253 17 -102 -49 -70 117
5452 117 -31 163 -69 6 -20 1 -327 -192 127 -6 -172 -32 -81 -22 -66 157 47 -40 -182 17 -19 45 -98
5475 -98 175 32 197 54 72 71 -90 123 37 -72 87 -56 -31 164 17 -171 -80 168 19 -208 -32 214
5497 214 -58 -34 17 -110 -233 6 138 174 27 21 151 53 -110 141 68 16 28 -84 63 227 258 -125 -300
5520 -300 -138 -79 -283 -441 -99 -22 -33 -47 26 -297 -182 184 -5 116 -131 -81 -100 151 37 194 234 -192 -31
5543 -31 -162 -18 81 -304 253 194 -70 84 56 -170 -81 328 76 -56 -215 -66 -13 -181 -166 -81 -234 -76 56
5566 56 -30 -9 16 -147 -126 63 -185 -322 -140 -177 -20 177 -62 -59 42 -186 -91 -131 -164 -159 62 178 -3 -150
5590a50L13n5j92K82o5p6m4J35j84J60J25l30j87K95r4J87l49K02J28k94L83j35
5612E5J25J56n9k83K8L0j5R2Jq5j80J00k11J95Q9Oq5O6n0L9kK29j2k68J54K7j05
5639C7J98j30k3j01p5J93j82m3r4K10p4Q2n9M3O5k66K88k35j18J22J55J53r2j13
5663e9J15N6j22q7L11l34L74j90O1j24K2K00j86P6j65P0P9j2m2K7j17J01n6R4
5687I2O3l56J08J4k4m8K66j85m1j53K44M2O6p0m9j29J03k08M18o3l3J60m70N36
5711B83m81P7J11K31O8l02K78m0l93P1K52j78p7K03k38K27r5L2O9j40j49K16k09
5734a84L45j09%k1r6J5jJ11j26L09m51K69k2k17%J73K8P2j76P8j6r2J94k62M09
5759B30k00j10K0J52ol06L02m1km5P7O6K46j78r4k02L29j35l9j6J42k28J2K34
$$ plain form
5590 -150 163 108 -84 198 133 57 13 148 -36 124 249 -81 -268 27 -67 120 -229 -27 101 -193 190 55
5612 55 180 336 277 -6 22 52 37 129 130 45 -135 -35 -246 -51 38 44 -41 25 -25 14 12 241 229 -39 115 142 37
5639 37 235 105 82 -19 -94 99 -83 -126 -220 -10 -84 -2 -61 -18 47 -219 69 -166 -284 -162 -7 146 54 -59
5663 -59 56 112 -10 -97 214 -120 254 64 125 1 23 223 37 113 -52 18 97 85 43 70 -47 54 -2 92
5687 92 155 -201 -93 -79 -103 -151 115 -70 -111 -264 -20 22 88 18 -31 -160 -57 -265 153 90 57 217 -253 283
5711 283 -198 -121 -10 221 289 -13 265 225 -168 -97 155 -23 -100 103 -135 92 -3 29 98 -42 -191 25 -184
5734 -184 161 52 52 31 -65 -50 -51 60 -66 243 -208 61 39 -178 -178 -5 23 95 -81 -3 -19 -111 83 -179 230
5759 230 30 -80 -60 92 86 -220 82 41 39 -6 71 137 383 205 111 -91 238 103 64 48 190 -38 -26 208
5783B08k22o8O9L7k2J48p0j42K40n4j15J99m9r4j97J11l0k55L06q4J19j18KJ13
5807C2R2j52L8nJ04k70n5K83j3o7k03J07K82o8l1J45k02ml70K76Q6j04j47K78
5831C2r4J31k1J19m76M79k83j01J52J42L9q6k5M2KJ6j51j11J80j7j02P4J07J21
5855A69j18p3J00J06k24j19K9R6L6k7J78j70k15K86k8j9L04j97P8k8k55Q8N4Q
5879E9m8R5j51J60k15j12K98k07k32J40J95J13q2P4k58M0J12J28k23K29l04K9
5901a60o5N14k76N8j05L8O4J61k97N7K10J0j93J5k31J49K91k39j01PJ08N9J40
5924B14k88L7R9J65jj70L5j15l4K41j9k51K1R0q8J28k04M25m02J64j5j44L14j71
5948C1Q9j35J98l95K73k38J31J19m00N13p5jk21J75k39J56jN4M7Qk41J14Pq8L03
$$ plain form
5783 208 -14 -82 -13 24 2 150 80 -62 178 124 9 208 159 65 -132 -21 -51 -306 0 -84 35 -83 -81 32
5807 32 124 -28 10 5 109 -161 -216 67 54 -13 -216 -109 173 105 74 219 17 13 -357 -81 5 -99 -246 32
5831 32 -62 69 48 167 -309 170 -113 -214 -62 80 119 33 8 50 52 68 -83 -194 -14 -31 -133 -59 48 169
5855 169 51 -22 78 184 -40 -159 -130 -34 2 -25 153 -17 -232 54 26 7 311 114 192 164 -91 -3 51 59
5879 59 11 106 -45 115 -100 -212 86 -121 -353 -213 -18 95 13 87 -171 -131 -19 109 -114 115 -189 -160
5901 -160 -225 289 13 71 -34 4 68 229 -68 -11 199 209 16 31 -200 -51 240 1 -100 -93 15 74 214
5924 214 -74 -37 62 227 226 56 91 -24 -58 183 164 -87 -66 24 -64 64 -140 285 -117 47 32 -112 202 31
5948 31 120 -15 183 -212 61 -177 -46 73 -327 186 111 110 -111 64 -175 -19 -20 34 81 89 -152 -38 -31 -119 184
$$ [...]
8191A54
##END NTUPLES=NMR FID
##END=
