##TITLE=1H_Ser 7-2-i
 CDCl3, 8 sc, 
 2.9.2020
##JCAMPDX= 6.0         $$ Bruker NMR JCAMP-DX V2.0
##DATA TYPE= NMR FID
##DATA CLASS= NTUPLES
##ORIGIN= UXNMR, Bruker Analytische Messtechnik GmbH
##OWNER= root
$$ XWIN-NMR		Version 3.5
$$ Wed Sep  2 13:27:02 2020 Russian Standard Time (UT+4h)  she@DPX200
##.OBSERVE FREQUENCY= 200.1315066352
##.OBSERVE NUCLEUS= ^1H
##.DELAY= (6, 6)
##.ACQUISITION MODE= SIMULTANEOUS
##.ACQUISITION SCHEME= undefined
##.AVERAGES= 8
##.DIGITISER RES= 18
##SPECTROMETER/DATA SYSTEM= spect
##.PULSE SEQUENCE= zg30
##.SOLVENT NAME= CDCl3
##.SHIFT REFERENCE= (INTERNAL, CDCl3, 0, 15.7039)
##AUDIT TRAIL= $$ (NUMBER, WHEN, WHO, WHERE, WHAT)
$$ ##TITLE= Audit trail, XWIN-NMR		Version 3.5
$$ ##JCAMPDX= 5.01
$$ ##ORIGIN= Bruker BioSpin GmbH
$$ ##OWNER= she
$$ F:/spectra/data/she/nmr/H-F/1/audita.txt
$$ ##AUDIT TRAIL=  $$ (NUMBER, WHEN, WHO, WHERE, WHAT)
(   1,<2020-09-02 13:25:55.79 +0400>,<she>,<DPX200>,
      <created by zg, POWCHK disabled, PULCHK disabled
       configuration hash MD5:
       00 E9 B6 7A A2 85 ED C7 34 08 36 98 17 FE 4E 26
       data hash MD5: 16K
       8C 09 9C 64 04 0D AF 5D 28 B8 44 9A 99 05 2D 3D>)
$$ ##END=
$$ 
$$ hash MD5
$$ 36 CD 70 34 6F 54 BB B6 6C FA E4 CD 9F D9 71 E2
##$RELAX= 
##$RELAX= 
##$RELAX= 
##$RELAX= 
##$RELAX= 
##$RELAX= 
$$ Bruker specific parameters
$$ --------------------------
##$DU= <F:/spectra>
##$EXPNO= 1
##$NAME= <H-F>
##$PROCNO= 1
##$TYPE= <nmr>
##$USER= <she>
##$AMP= (0..31)
100 100 100 100 100 100 100 100 100 100 100 100 100 100 100 100 100 100 
100 100 100 100 100 100 100 100 100 100 100 100 100 100 
##$AQSEQ= 0
##$AQ_mod= 1
##$AUNM= <au_zg>
##$AUTOPOS= <>
##$BF1= 200.13
##$BF2= 200.13
##$BF3= 200.13
##$BF4= 200.13
##$BF5= 200.13
##$BF6= 200.13
##$BF7= 200.13
##$BF8= 200.13
##$BYTORDA= 1
##$CFDGTYP= 0
##$CFRGTYP= 5
##$CHEMSTR= <none>
##$CNST= (0..31)
1 1 145 1 1 1 1 1 1 1 1 1 1 1 1 1 1 1 1 1 1 1 1 1 1 1 1 1 1 1 1 1 
##$CPDPRG= <>
##$CPDPRG1= <>
##$CPDPRG2= <>
##$CPDPRG3= <>
##$CPDPRG4= <mlev>
##$CPDPRG5= <mlev>
##$CPDPRG6= <mlev>
##$CPDPRG7= <mlev>
##$CPDPRG8= <mlev>
##$CPDPRGB= <>
##$CPDPRGT= <>
##$D= (0..31)
0 1.2 0 0 0 0 0 0 0 0.06 0 0.03 0 0 0 0 0.0002 0 0 0 0 0 0 0 0 0 0 0 0 
0 0 0 
##$DATE= 1599038755
##$DBL= (0..7)
120 120 120 120 120 120 120 120 
##$DBP= (0..7)
150 150 150 150 150 150 150 150 
##$DBP07= 0
##$DBPNAM0= <>
##$DBPNAM1= <>
##$DBPNAM2= <>
##$DBPNAM3= <>
##$DBPNAM4= <>
##$DBPNAM5= <>
##$DBPNAM6= <>
##$DBPNAM7= <>
##$DBPOAL= (0..7)
0.5 0.5 0.5 0.5 0.5 0.5 0.5 0.5 
##$DBPOFFS= (0..7)
0 0 0 0 0 0 0 0 
##$DE= 6
##$DECBNUC= <off>
##$DECIM= 32
##$DECNUC= <off>
##$DECSTAT= 4
##$DIGMOD= 1
##$DIGTYP= 9
##$DL= (0..7)
0 120 120 120 120 120 120 120 
##$DP= (0..7)
150 150 150 150 150 150 150 150 
##$DP07= 0
##$DPNAME0= <>
##$DPNAME1= <>
##$DPNAME2= <>
##$DPNAME3= <>
##$DPNAME4= <>
##$DPNAME5= <>
##$DPNAME6= <>
##$DPNAME7= <>
##$DPOAL= (0..7)
0.5 0.5 0.5 0.5 0.5 0.5 0.5 0.5 
##$DPOFFS= (0..7)
0 0 0 0 0 0 0 0 
##$DQDMODE= 0
##$DR= 18
##$DS= 0
##$DSLIST= <SSSSSSSSSSSSSSS>
$$ [...]
##$SUBNAM2= <"">
##$SUBNAM3= <"">
##$SUBNAM4= <"">
##$SUBNAM5= <"">
##$SUBNAM6= <"">
##$SUBNAM7= <"">
##$SUBNAM8= <"">
##$SUBNAM9= <"">
##$SW= 16.880792210976
##$SWIBOX= (0..15)
0 0 2 0 0 0 0 0 0 0 0 0 0 0 0 0 
##$SW_h= 3378.37837837838
##$TD= 16384
##$TD0= 1
##$TE= 0
##$TE2= 300
##$TE3= 300
##$TEG= 300
##$TL= (0..7)
0 120 120 120 120 120 120 120 
##$TP= (0..7)
150 150 150 150 150 150 150 150 
##$TP07= 0
##$TPNAME0= <>
##$TPNAME1= <>
##$TPNAME2= <>
##$TPNAME3= <>
##$TPNAME4= <>
##$TPNAME5= <>
##$TPNAME6= <>
##$TPNAME7= <>
##$TPOAL= (0..7)
0.5 0.5 0.5 0.5 0.5 0.5 0.5 0.5 
##$TPOFFS= (0..7)
0 0 0 0 0 0 0 0 
##$TUNHIN= 0
##$TUNHOUT= 0
##$TUNXOUT= 0
##$USERA1= <user>
##$USERA2= <user>
##$USERA3= <user>
##$USERA4= <user>
##$USERA5= <user>
##$V9= 5
##$VALIST= <valist>
##$VCLIST= <CCCCCCCCCCCCCCC>
##$VD= 0
##$VDLIST= <DDDDDDDDDDDDDDD>
##$VPLIST= <PPPPPPPPPPPPPPP>
##$VTLIST= <TTTTTTTTTTTTTTT>
##$WBST= 1024
##$WBSW= 4
##$XGAIN= (0..3)
0 0 0 0 
##$XL= 0
##$YL= 0
##$YMAX_a= 113238
##$YMIN_a= -109844
##$ZGOPTNS= <>
##$ZL1= 120
##$ZL2= 120
##$ZL3= 120
##$ZL4= 120
##$ABSF1= 10
##$ABSF2= 0
##$ABSG= 5
##$ABSL= 3
##$ALPHA= 0
##$AQORDER= 0
##$ASSFAC= 0
##$ASSFACI= 0
##$ASSFACX= 0
##$ASSWID= 0
##$AUNMP= <proc_1d>
##$AZFE= 0.1
##$AZFW= 0.1
##$BCFW= 1
##$BC_mod= 2
##$BYTORDP= 1
##$COROFFS= 0
##$CY= 11.3945322036743
##$DATMOD= 1
##$DC= 2
##$DFILT= <>
##$DTYPP= 0
##$F1P= 16.9975609425685
##$F2P= -3.02152046262296
##$FCOR= 0.5
##$FTSIZE= 0
##$FT_mod= 4
##$GAMMA= 1
##$GB= 0.15
##$INTBC= 1
##$INTSCL= 1
##$ISEN= 128
##$LB= 0.24
##$LEV0= 0
##$LPBIN= 0
##$MAXI= 10000
##$MC2= 0
##$MEAN= 0
##$ME_mod= 0
##$MI= 1.114404
##$NCOEF= 0
##$NC_proc= 0
##$NLEV= 6
##$NOISF1= 3.799351
##$NOISF2= 2.8
##$NSP= 1
##$NTH_PI= 0
##$NZP= 0
##$OFFSET= 15.70392
##$PC= 1
##$PHC0= -9976.548
##$PHC1= 16.6009
##$PH_mod= 1
##$PKNL= yes
##$PPARMOD= 0
##$PSCAL= 0
##$PSIGN= 0
##$REVERSE= no
##$SF= 200.130013532006
##$SI= 16384
##$SIGF1= 3
##$SIGF2= 2
##$SINO= 400
##$SIOLD= 16384
##$SREGLST= <1H.CDCl3>
##$SSB= 0
##$STSI= 0
##$STSR= 0
##$SW_p= 3612.71676300578
##$SYMM= 0
##$S_DEV= 0
##$TDeff= 0
##$TDoff= 0
##$TI= <>
##$TILT= no
##$TM1= 0
##$TM2= 0
##$TOPLEV= 0
##$USERP1= <user>
##$USERP2= <user>
##$USERP3= <user>
##$USERP4= <user>
##$USERP5= <user>
##$WDW= 1
##$XDIM= 8192
##$YMAX_p= 0
##$YMIN_p= 0
$$ End of Bruker specific parameters
$$ ---------------------------------
##NTUPLES= NMR FID
##VAR_NAME=  TIME,          FID/REAL,        FID/IMAG
##SYMBOL=    X,             R,               I
##VAR_TYPE=  INDEPENDENT,   DEPENDENT,       DEPENDENT
##VAR_FORM=  AFFN,          ASDF,            ASDF
##VAR_DIM=   8192,          8192,            8192
##UNITS=     SECONDS,       ARBITRARY UNITS, ARBITRARY UNITS
##FACTOR=    0.000296,      1,               1
##FIRST=     0,             0,               0
##LAST=      2.424536,      0,               0
##MIN=       0,             -109844,         0
##MAX=       2.424536,      113238,          0
$$ Real data points
##PAGE= N=1
##DATA TABLE= (X++(R..R)), XYDATA
$$ [...]
1825D99j76q61P77K35j526J638p16p34J592j356M33O52j179O77N89j381J079m0
$$ 499 323 -538 239 474 -1052 586 -130 -864 728 -628 -195 457 -722 -45 544 -837 242 202
1843B02j450J597p19l62J284j032j00J409j606L54J066j641J080K73j191J325
$$ 202 -1248 349 -370 -732 552 -480 -580 829 -777 -423 643 -998 82 355 -836 489
1859D89p50l99J102q95l03J630j390J34J272j785J111J04j251J155J51j125J490
$$ 489 -261 -660 442 -453 -756 874 -516 -382 890 -895 216 320 -931 224 375 -750 740
1876G40p19n35J487j377K07Q26r14K60O36j202J101J56j684J669l72r46J426r20
$$ 740 21 -514 973 -404 -197 629 -285 -25 611 -591 510 666 -1018 651 279 -667 759 -161
1894a61l02J127j070j55J331j498Q81M94j758J836q87p23J242l53r23J584j305
$$ -161 -463 664 -406 -561 770 -728 153 647 -1111 725 -162 -885 357 4 -919 665 -640
1911f40K53J368k025J029N25j407R20M23j446J303k32j009J865j378K20Q79j319
$$ -640 -387 981 -1044 -15 510 -897 23 446 -1000 303 71 -938 927 -451 -231 648 -671
1928f71N94Q06j526N57J012j768J578l07j070J438q45j81R79p70j38J453j582
$$ -671 -77 729 -797 -240 772 -996 582 275 -795 643 -202 -383 596 -174 -312 1141 -441
1945d41P36O67j885J420J59j227J230l48r52J531p39m63J912k121O91N09j229
$$ -441 295 962 -923 497 656 -571 659 311 -641 890 151 -312 1600 -521 170 679 -550
1962e50Q75M96j417J334j72j240K046j639K8J206j386Q8J187j727R23N07j859
$$ -550 325 821 -596 738 566 -674 1372 -267 -239 967 -419 -331 856 -871 52 559 -1300
1979a300J929n87p14J499j276p7J176j152j60J651j962P38R26k023J568P5j239
$$ -1300 629 42 -672 827 -449 -526 650 -502 -662 989 -973 -235 691 -1332 236 311 -928
1996i28J056l00p87J394r05l09J588j856O82Q83j638J181L25j327J157j83j377
$$ -928 128 -172 -959 435 -470 -779 809 -1047 -365 518 -1120 61 386 -941 216 33 -1344
2013a344K041q81n74J515j023k31J093j097L68Q07j498J224L1j281J653p31q50
$$ -1344 697 -184 -758 757 -266 -497 596 -501 -133 674 -824 400 431 -850 803 72 -778
2030g78J549r00l22J542j792O72R31j626J229j15j280J559m78p39J366j050l83
$$ -778 771 -129 -451 1091 -701 -29 902 -724 505 390 -890 669 191 -548 818 -232 -615
2047f15J658j682N84P45j337R61J30j461J473k08j234J712q51k40J067j351K86
$$ -615 1043 -639 -55 690 -647 314 444 -1017 456 248 -986 726 -125 -365 702 -649 -363
2064c63J025j250M22P96j659J425k70q53J154o19o54J255q57j47J380j395K71
$$ -363 662 -588 -166 630 -1029 396 126 -727 427 -192 -846 409 -448 -595 785 -610 -339
2081c39J161j843J302p6p71J335l02j240J562r90m65J806j608M34J001j678J079
$$ -339 822 -1021 281 205 -566 769 467 -773 789 -201 -666 1140 -468 -34 967 -711 368
2098C68N61j787J080J83j418J566n66k68J290j579L75J383j345J27Q68j834J347
$$ 368 929 -858 222 405 -1013 553 -13 -281 1009 -570 -195 1188 -157 -30 838 -996 351
2115C51K74j308J632r60n89J131q98J88J163j290P4J061j771J147J22j164J101
$$ 351 625 -683 949 -11 -600 531 -367 -179 984 -306 -232 829 -942 205 327 -837 264
2132B64p9j308J576o06p89J812j347l3J067j267O14N62j309J126K20j453J461
$$ 264 185 -1123 453 -153 -942 870 -477 -510 557 -710 -96 466 -843 283 503 -950 511
2149E11p79j80J029r46k4J078j274M95Q18j648J228K40j448J408q18j09J148r16
$$ 511 -268 -448 581 -365 -389 689 -585 -90 728 -920 308 548 -900 508 -310 -419 729 -187
2167a87k89J398j266J03J074j683J098K24j077J051j37p87J249o65o24J379j133
$$ -187 -476 922 -344 -241 833 -850 248 472 -605 446 309 -478 771 106 -518 861 -272
2184b72J61R48j214P84L47j147N10L08j119J388n46o75J442j446K76Q91j124K55
$$ -272 -111 837 -377 407 754 -393 117 425 -694 694 148 -527 915 -531 -255 636 -488 -233
2202b33Q36j068P04K56j361J277k13n23R26q64l51J239r80j33R29j185Q32J63
$$ -233 603 -465 239 495 -866 411 198 -325 601 -263 -614 625 -355 -488 441 -744 88 251
2220B51j132J196p9q68R62k34r09J424j246L66J016j537Q89L21r79Q42qq53J098
$$ 251 -881 315 236 -632 330 96 -813 611 -635 -269 747 -790 99 420 -559 283 275 -578 520
2239E20o45m60J498j307Q2J212j203N8P97q75N78M08j402J377l90q15J257q45
$$ 520 -125 -585 913 -394 -312 900 -303 -245 552 -323 255 663 -739 638 248 -567 690 -155
2257a55j17J088j043J84P20j311O44O59j328J037m9n99N39l64j91J254j383L4
$$ -155 -272 816 -227 -43 677 -634 10 669 -659 378 329 -270 269 -95 -286 968 -415 -381
2275c81J152j544O55M43o45N48J40j245J194k12j005J601r57q8P61p45J19P47
$$ -381 771 -773 -118 325 -320 228 368 -877 317 105 -900 701 -256 -344 417 -328 -209 538
2293E38j123O31K93j145J149m01j031J686p96j74R65r64o0Q39r57P94R4j019Q42
$$ 538 -585 46 339 -806 343 -58 -1089 597 -199 -373 592 -372 -432 407 -550 244 338 -681 161
2312A61n1o91J028l47p17J213q98o2R13r87M74M78j096O43M39q92P28l35n66J295
$$ 161 110 -581 447 100 -617 596 -302 -364 549 -438 36 514 -582 61 500 -392 336 1 -565 730
2332G30j067R4O11n58K97O47r59M11L16q18O45n1p40J031q58J86Q02r62J81N16
$$ 730 -337 -243 368 -190 107 754 -205 206 522 -296 349 298 -442 589 -269 -83 719 -243 -62 454
2352D54o91L46L82j094Q05j19l86L97j5n59Q71p43J48P15q35L52K62p69K24N13
$$ 454 -237 109 491 -603 202 83 -303 94 79 -480 391 -352 -204 511 -324 28 290 -479 -255 258
2372B58q48Q42j68r26J323n06k41O71o13j93Q23q62K43L32p70Q01J13p00N96j65
$$ 258 -590 252 84 -842 481 -25 -266 405 -208 -401 422 -440 -197 135 -635 166 279 -421 175 10
2392A0m02Q19n20k03P83j041N83O54j246J052l32m99P39k15l27P17l89l79Q59
$$ 10 -392 427 -93 -296 487 -554 29 683 -563 489 157 -342 397 182 -145 572 183 -196 663
2411F63q12L66K01o22M63J99o94N78J38p66Q50o14O6N44r07K15L44l16L83J89
$$ 663 -149 217 418 -204 259 458 -236 342 480 -286 564 -50 16 560 -347 -132 212 -104 279 468
2431D68r44P64k46m89Q87o40n8N01l27l24Q10n98%P04q20K57J10n48O31l07l24
$$ 468 -476 288 42 -447 440 -200 -258 243 -84 -408 402 -196 -196 508 -312 -55 55 -493 138 -169 -493
2452d93M69k89j45P06n51J34K81n72N30J61m68K54qm00P23m05j80O97p35J66N81
$$ -493 -24 -313 -458 248 -303 -169 112 -460 70 231 -237 17 9 -391 332 -73 -253 444 -291 -125 456
2473D56p86L40L92o49M03M5n81P94n67J45L93m08j18N33n18QL19o35M12M5k15
$$ 456 -330 10 402 -247 156 201 -380 414 -153 -8 385 -23 -141 392 -126 -118 201 -434 -22 23 -192
2494a92M51n4n12L98J27o76O69n52K40L11l76LL74m93J88M38p58Q98n28l36K68
$$ -192 259 205 -307 91 218 -458 211 -341 -101 210 -166 -163 211 -282 -94 344 -414 484 -44 -380 -112
2515a12j56pM05j90J01m5m70K88K03o07P48k99p1K55j78l44O14m94pQ13j103O76
$$ -112 -268 -275 130 -60 41 -4 -474 -186 17 -590 158 -141 -212 43 -135 -479 135 -359 -366 447 -656 20
2537B0j7l05M29k19j2K30j49J39J59k99j07J96k23Q7K10p5k3q8Q3K48n7k73N77
$$ 20 3 -302 127 -92 -104 126 -23 116 275 -24 -131 65 -158 -71 139 64 41 -47 36 284 227 -46 531
2560E31n51k9N00n11K55O4j73qR3m73O18k51l52L90p9k13M88m62k2O05n40J15
$$ 531 -20 -49 451 -60 195 259 86 78 171 -302 316 65 -287 103 24 -189 299 -163 -185 420 -120 -5
2582eP2l80M07k48MJ2K00k43K41l33L64J39o53L84P1k12j86K41r8L42j87j76N07
$$ -5 67 -313 94 -154 -150 -138 62 -181 60 -273 91 230 -423 -39 32 -180 -366 -125 -223 119 -68 -244 263
2605B63k85J4J04j53j1K37n42K84L35m48L87j69j30L92l11J21P0k71J75p1k36
$$ 263 -22 -8 96 -57 -68 169 -373 -89 246 -202 185 16 -114 278 -33 88 158 -113 62 -9 -245
2626b45M33m9k47K43k5j37o4K81k42K27j39n6K19j24j65jL12k26%j30K31j50K0
$$ -245 188 139 -108 135 110 -27 -91 190 -52 175 36 -20 199 75 -90 -91 221 -5 -5 -135 96 -54 -34
2649c4L64l48K27l71J43l2K18j89L1Q1j22J63l43J91J22l38O3K48k00l33L82n26
$$ -34 330 -18 209 -162 -19 -51 167 -22 9 90 -32 131 -212 -21 101 -237 -174 74 -126 -459 -77 -603
2671f03O22N0q1q4j40L18l22L00l72L64m2l15L60j60n9J61j63M6Q8N2r2l8K08
$$ -603 19 69 -12 -96 -236 82 -240 60 -312 52 10 -305 55 -105 -164 -3 -166 -120 -32 20 -72 -110 98
2694I8j3n1J03L1N7l30L18k01QL19m95K78l1n3p6J57k28K60k6k44K67nk12J6O4
$$ 98 85 34 137 168 225 -105 213 12 20 339 -156 122 91 38 -38 119 -109 151 125 -119 148 143 -69 -53 11
2719A1J22k25P5j07R1p0J64k6k29M15l90L74l77O8l1J58m58K40K41k66J15J97
$$ 11 133 -92 -17 -124 -33 -103 61 35 -194 221 -169 205 -172 -104 -135 23 -435 -195 46 -220 -105 92
2741I2Q6k35J93k03O7r1k3K7MJ6J84n50K65olr3L13j20J76k28J97p0j2q9m8K9
$$ 92 178 -57 136 -67 0 -91 -114 -87 -83 -67 117 -433 -168 -174 -177 -270 43 -77 99 -129 68 -2 -14 -103 -151 -122
2767a22J29J40qm9J75j75M5k43K05k47r9L16J32l02M0K47k66J29k2j3L1j2J02
$$ -122 7 147 139 90 265 90 135 -108 97 -150 -249 67 199 -103 -63 184 -82 47 25 12 43 31 133
2790A33O7k05k15M20j54q9L04l49J12o0k04p8M46j93L2k9PM9j41j7K63l38j03
$$ 133 200 -5 -220 200 46 -43 261 -88 24 -36 -240 -318 128 -65 -33 -62 -55 -6 -147 -164 99 -239 -342
2813c42K23l2K38j66P5m3j87K51L1l4j0J82k06j20P0k3K4pn5Q5M4m6n3K50j94
$$ -342 -119 -151 87 -79 -4 -47 -234 17 48 14 4 186 -20 -140 -70 -93 -69 -76 -131 -46 -2 -48 -101 149 -45
2838d5J14J00m83M62j31m0L04p4n10N39k05k5K44l07l8M17m77J05J09p3J58J6
$$ -45 69 169 -314 148 17 -23 281 207 -303 236 31 6 250 -57 -95 322 -155 -50 59 -14 144 160
2860A60k18L87k12k49L26k57J03k02P4J0M8l1L55n23K7K61k23k57L74O0p3m7k20
$$ 160 -58 329 117 -132 194 -63 40 -162 -88 -78 -30 -61 294 -229 -202 59 -164 -421 -47 13 -60 -107 -327
2883c27K02N7%J44j85K48k02N1k64L66L4k99K12J47r4k90J6J42K40l20K60j21
$$ -327 -125 -68 -68 76 -109 139 -63 -12 -276 90 124 -175 37 184 90 -200 -184 -42 198 -122 138 17
2905A7k2R1j69l8J56j74j00M25k15J01J0j18J53q5J98j86O9j52J51l67K47L78
$$ 17 -5 86 -83 -121 35 -139 -239 186 -29 72 82 -36 117 32 230 44 113 -39 112 -255 -8 370
2927C70p22L53K47k36J86j71J92k22J27q7K2Q4l30L19j93K45k57L6M4k1M0Pp0
$$ 370 -352 1 248 12 198 27 219 -3 124 37 59 143 -187 132 -61 184 -73 -37 7 -14 26 33 -37
2950c7l4K37j60j39L29l46Q3J00n2J79o2m86L75n9l07N84k51j32L1L55m21L56
$$ -37 -71 166 6 -133 196 -150 -67 33 -19 160 98 -388 -13 -72 -379 205 -46 -178 -147 208 -213 143
2972A43m46M91j75l49N02k11Q2K07k08l56M31jk86N04l89k2K66l04J84J74k94
$$ 143 -303 188 13 -336 166 -45 37 244 36 -320 111 110 -176 328 -61 -83 183 -121 63 237 -57
2993e7M15l11l59M43l31K34R8k1j05k7N0Q6j84r6M21l83j97M41j63q9L47l41m5
$$ -57 358 47 -312 131 -200 34 132 111 6 -21 29 115 -69 -165 256 -127 -324 117 -46 -135 212 -129 -174
3016a74L84k30o2K68l61K15R9k31q4L49l25J72J3l66M22k14K5J02k49J08J4J22
$$ -174 210 -20 -82 186 -175 40 139 -92 -176 173 -152 20 33 -333 89 -125 -100 2 -247 -139 -125 -3
3038cJ33j66k16L09j99m5L34l3j43j15l7L26K23m15J40j19l23N79l92P0J56j28
$$ -3 130 -36 -252 57 -142 -187 147 114 -29 -144 -181 145 368 -47 93 -26 -349 230 -162 -92 64 -64
3060f4rL08m73J90K59l93L83m75L53m4N2m4K18j03l45L56k59N0Q4n3J2K05l25
$$ -64 -73 235 -238 -48 211 -182 201 -274 79 35 87 43 261 158 -187 169 -90 -40 44 -9 3 208 -117
3083a17J80n5m8J91k47j83N03k97j06K20n7q2K45o52P51N9m10K85j82q0L31l35
$$ -117 63 8 -40 151 -96 -279 224 -73 -179 41 -16 -98 147 -505 246 305 -105 180 -2 -82 249 -86
3105h6J56K3l28J92L96n78J50o6kL83l51k31N98l08j36L03l49K75J21l21P9J21
$$ -86 70 93 -235 -43 353 -225 -75 -141 -143 240 -111 -342 256 -52 -188 115 -234 41 162 -159 -80 41
3127D1l19J80k4J39m9r7N2K22k65K12O2q1j28K25l65J79N15o02K41l2j56J13j80
$$ 41 -278 -98 -122 17 -32 -129 -77 145 -120 92 154 73 -55 170 -195 -16 499 -103 138 106 -50 63 -117
3150a17j5M26l56K04M1q7nJ0k13K19j21j04M46m48J7L97n47N9K43j06j52J27K16
$$ -117 -132 294 -62 142 183 96 91 101 -112 107 -14 -118 328 -120 -103 294 -253 -194 49 -57 -209 -82 134
3173A34j31K0k52M65n6l45L84m99K98K44j76k88J76j84j1J50r3L43Rl42J03j99
$$ 134 3 23 -229 236 180 -165 219 -280 18 262 86 -202 -26 -210 -221 -71 -164 179 188 -154 -51 -250
3195b50J07L50m53J67J48q9o7J60l69J80J81J80j8k80j48J51L2J9K84l51j50K97
$$ -250 -143 207 -246 -79 69 -20 -87 73 -296 -116 65 245 227 -53 -201 -50 -18 1 285 -66 -216 81
3217H1j96K03j04j84L46l90P8M07o04L10J72j91J71k1l22K62K0k11L82J3k02J38
$$ 81 -115 88 -16 -200 146 -244 -166 241 -363 -53 119 -72 99 78 -244 18 38 -173 209 222 20 158
3239A58j16m3q5J30J02p9k56R1J11m2q8R0pPo6k77N01j90j30K36l87M17j1l85
$$ 158 42 -1 -86 44 146 67 -189 -98 13 -29 -117 -27 -34 -27 -93 -370 131 -59 -189 47 -340 77 66 -319
3263c19N33k7l86J50J03j1n0j64L6K98k91Q0J31k82L08ml52N17k54N9o7Q2k93
$$ -319 214 187 -199 -49 54 43 -7 -171 -135 163 -128 -48 83 -199 109 105 -247 270 16 75 8 90 -203
3286b03K53k72K59R1m23J40M85l82O0Q8k4K17p9j35k2k51o1N74m51J78mj45K95
$$ -203 50 -222 37 128 -295 -155 330 -52 8 96 72 289 210 75 53 -198 -259 315 -136 42 38 -107 188
3309A88j13l87O22k63j26K88k3j57M6q4k35M33j66R7p3j56K45k67O8K04m5j88
$$ 188 75 -312 310 47 -79 209 186 29 75 -9 -244 189 23 120 47 -109 136 -131 -63 141 96 -92
3331i2K2j59k4M18k98K04J36l31O7L9qJ20k34q1K51j20n1J12k74L52J81m45K27
$$ -92 -70 -229 -253 165 -133 71 207 -124 -57 -18 -26 94 -140 -221 30 -90 -141 -29 -303 49 230 -215 12
3354A2m9P2j20J16k53M62k39j01J07l30L56K1q4l9K4q1K93j04k32L93k36M4O1
$$ 12 -37 35 -85 31 -222 240 1 -100 7 -323 33 54 -30 -69 -45 -126 167 63 -169 224 -12 32 93
3377I3o4j49M22n7j83R9l73N20m58J9L06n21K59L77k98j31J93j35J65J7l80K62
$$ 93 29 -120 302 245 62 161 -212 308 -150 -131 175 -346 -87 290 -8 -139 54 -81 84 101 -279 -17
3399a7M7j19K30l37K01K01j85j6J48k58Q8J42n50K76L40m22L87k01j37M59n03
$$ -17 30 -89 141 -196 5 206 21 5 153 -105 -17 125 -425 -149 191 -231 156 -45 -182 277 -226
3420b26K34J91j90j09K28l5K7P1m92M75L9p9J0j82M0K51j53p4K1m37O73l62m8
$$ -226 8 199 9 -100 128 93 120 191 -301 174 213 134 144 -38 2 253 100 26 47 -390 283 -79 -127
3443a27L47k77J21k1J18j95J49l36J49J95j78L82j09l16J59l1%Q9N6p0J23j59
$$ -127 220 -57 64 43 161 -34 115 -221 -72 123 -55 327 218 -98 61 30 30 119 175 105 228 69
3465F9j56K76j19N4J1k59K25j2k53L36j26j37j15J17J04k90P9O6K95l93L44j57
$$ 69 -87 189 70 124 135 -124 101 89 -164 172 46 -91 -206 -89 15 -275 -196 -130 165 -228 116 -41
3487d1N8J82k40Q6K3j66k05N79k49j29K7k2J30Q1o5L1M2k59J13P0J12m8k52K2
$$ -41 17 199 -41 45 68 -98 -303 276 27 -102 -75 -97 33 114 49 80 122 -137 -24 46 158 110 -142 -120
3511a20J25r8J34K61l98J1J29j23K14l3QO2k37o9L40k07j31K08k22Q6j2J99J04
$$ -120 5 -93 41 302 -96 -85 44 -79 135 102 110 172 -65 -134 206 -1 -132 76 -146 -60 -72 127 231
3534B31J8k93K24l50J41K07k50M32k82P0j0j95k6mK28l27J8K68l18K52k25L37
$$ 231 249 -44 180 -170 -29 178 -72 360 78 148 138 -57 -83 -87 141 -186 -168 100 -218 34 -191 146
3556A46n9Jk30L19k03J96P4n16M77l42J33o4k35K80j63J90N7J9k4j01Q5l17K75
$$ 146 87 88 -142 177 -26 170 244 -272 205 -137 -4 -68 -303 -23 -186 4 61 80 56 -45 40 -277 -2
3579bR8l31N4J88j95K62j22k1K88l01J11J19k23K63q2J06j40j35N4K71m6j54n6
$$ -2 96 -235 -181 7 -188 74 -48 -69 219 -82 29 148 -75 188 106 212 72 -63 -9 262 216 62 6
3602Fn2k39J96J18l5K38r7J14l76J61J01l06K00o3Q0l2j7q4J49j21J6J00nJ7J12
$$ 6 -46 -285 -89 29 -6 232 135 249 -127 34 135 -171 29 -34 46 14 -3 -87 62 -59 -43 57 52 69 181
3627A81j54k65K91Q1l02O2O4K45k95oJ24p9q1J88J2j79K88l92J21j07J27p0J36
$$ 181 27 -238 53 134 -168 -106 -42 203 -92 -98 26 -53 -134 54 66 -113 175 -217 -96 -203 -76 -146 -10
3650a0J62l31J68k0k4k1M3J29m2m8L2k02NL51j09j73J07p9J96R3k24J00Q9j04
$$ -10 152 -179 -11 -31 -55 -76 -33 96 54 6 38 -164 -159 192 83 -90 17 -62 134 227 3 103 192 88
3674H8L1k53K9l9R8J58j12j84J24J48j87L09j42P0r5J47k11p9K5J75k28J10J61
$$ 88 119 -134 -105 -144 -46 112 0 -184 -60 88 -99 210 68 138 43 190 -21 -100 -75 100 -128 -18 143
3697A43L4l34J87l18K81J93l47K18RR7j58O2K1M7j06p3J35J7k30N2l9J23lJ94
$$ 143 177 -157 30 -288 -7 186 -161 57 66 163 5 67 88 135 29 -44 91 108 -122 -70 -109 14 11 205
3721B05j47k50L52j14Q7j58j06m6R2K18l62J55M8J72k35J46Ml75L05k0J02K4j05
$$ 205 58 -192 160 46 133 -25 -131 -177 -85 133 -229 -74 -26 146 -89 57 61 -314 -9 -29 73 97 -8
3744hL8L1J67J55l26n2m32O24qj04j65Q7%k2N1o4Q8M4j89L59k88j05j5N30m29
$$ -8 30 61 228 383 57 5 -427 197 189 85 -80 7 7 -15 36 -28 60 104 -85 274 -14 -119 -134 396 -33
3769c3J67K37m30J26l82K23Q3o2M5L0M4n0j62K52j25J82j23q4m9rK07q2J43n3
$$ -33 134 371 -59 67 -315 -92 -9 -71 -26 4 48 -2 -164 88 -37 145 22 -62 -111 -120 87 5 148 95
3793I5j01j34m3J1K37ql8r0J90l68K08K25l12J53k0R4j51Q5k80P3J11J07M2r5
$$ 95 -6 -140 -183 -172 65 57 19 -71 119 -249 -41 184 -128 25 5 99 -52 33 -247 -174 -63 44 86 -9
3817iJ54l92J73M2P1j08O4j06m1J81jJO4J3ML5l15L48r1k47L28Nk83O0Q2j19Q2
$$ -9 145 -247 -74 -32 39 -69 -5 -111 -152 29 28 29 93 106 110 145 -170 178 87 -160 168 173 -110 -50 32 -87 -5
3844ek5l1L04k60r3nL3J53j30J62k51M5J32P1j84p4Q9J94k45M2J49O1l39J77J4
$$ -5 -30 -61 243 -17 -110 -115 -82 71 -59 103 -148 -103 29 100 -84 -158 -69 125 -120 -78 71 132 -207 -30 -16
3869a6K3j74K83oN5m60N52k59k2J8j52L47l16K58J63j80l21L26j5r8k12R8N5l5
$$ -16 7 -167 116 110 165 -295 257 -2 -24 -6 -158 189 -127 131 294 114 -207 119 104 6 -206 -108 -53 -88
3893h8n9K78Jl61L88j90K2J99N3j01q4lqK9K7n5L5p6M3m6K11j38p9j08O5j9q2
$$ -88 -147 131 132 -229 159 -31 -9 190 243 142 58 55 47 76 103 48 83 7 50 4 215 77 -2 -110 -45 -64 -146
3920a46J37j19j04J73J13M1k57O8j19R6p6L24l27L57j69q0O0kj03K21nk11o0Q4
$$ -146 -9 -128 -232 -59 54 95 -162 -94 -213 -117 -193 131 -196 161 -8 -88 -28 -30 -133 88 83 -128 -188 -104
3944a04K34k53j20J40J09k51J74J27M8r2L8j46J8K77k44K2J47k33j44L41k31J67
$$ -104 130 -123 -243 -103 6 -245 -71 56 104 12 50 -96 -78 199 -45 -23 124 -109 -253 88 -143 24
3966B4K42l27M1K0j04k8j32Q9J52N4L2J13p3k13K12Ok54J30q6K29k95N0R4P6J87
$$ 24 266 -61 -20 0 -104 -132 -264 -175 -23 31 63 176 103 -110 102 108 -146 -16 -102 127 -168 -118 -24 52 239
3991B39k25p4q9J33q7Q7P6k29J87m2OJ60j87O7k18J82J21p7j10K39j05j05p3K04
$$ 239 14 -60 -149 -16 -103 -16 60 -169 18 -24 -18 142 -45 22 -196 -14 107 30 -80 159 54 -51 -124 80
4015H0k29J82K6j79L51o09L92m7r2K53j92K04j89J32k4N8K8l19k3K02L23l01L25
$$ 80 -149 33 59 -120 231 -378 14 -33 -125 128 -64 140 -49 83 59 117 145 -174 -197 5 328 27 352
4038C52l51J14j60j09o3K06N0j10p7K76k97L79j10KPJ8j91K9M3Q6P3k77o0J79
$$ 352 1 115 -45 -154 -217 -11 39 -71 -148 128 -169 210 100 102 109 127 -64 -35 8 94 167 -110 -170 9
4062IJ59J9l11J57K45j31j74J43qk53n6kK01O6j86J4K91l2l59L15l48M58l90J71
$$ 9 168 187 -124 33 278 147 -27 116 108 -145 -201 -203 -2 64 -122 -108 183 151 -208 107 -241 217 -173 -2
4086bJ99q6j83j9J89M9k47L43l62K96k40P0j51n3K86qM5r4j64N9m0K73o2J12m
$$ -2 197 111 -72 -91 98 147 -100 243 -119 177 -63 7 -144 -197 89 81 126 32 -132 -73 -113 160 98 210 206
4111B06n21N09l65K63J04j64k5N6O2j0j87J88J11l79L25k9j01J8j83J2K3Q1j31
$$ 206 -315 194 -171 92 196 32 7 63 125 115 -72 116 227 -152 173 144 43 61 -122 -110 -87 -6 -137
4134a37L31m3l23k5K43j24J26j51J47J26j76n4R4j7L09n86J17K39j76O2kl5J01
$$ -137 194 151 -172 -197 46 -78 48 -103 44 170 -6 -60 34 17 326 -260 -143 96 -80 -18 -20 -55 46
4157D6J11o3o4M3j57k26M74j63J41J11k64j33K5J32J85r9j75R0j7M1L0k48L51
$$ 46 157 94 30 73 -84 -310 164 1 142 253 -11 -144 -119 13 198 99 -76 14 -3 38 68 -180 171
4180A71j49l9J98k91J08M2q0J44j13OJ31j43r9r8J80J26k7jN6j00K2j48J98q5
$$ 171 22 -17 181 -110 -2 40 -40 104 -9 -3 128 -15 -114 -212 -32 94 67 66 122 22 44 -104 94 9
4204Ij48O5o1K50k41K16Q1r3K0j99j2M6Q6N1l55J74K22k55K57j8j64j8K71k92
$$ 9 -139 -74 -135 115 -126 90 171 78 98 -101 -113 -67 19 70 -285 -111 111 -144 113 95 -69 -87 184 -108
4228a08j0k07K22j07K94j2j0r1j80K5L76m8j12j37j77K83K9M6N4j02O6j25J68
$$ -108 -118 -325 -103 -210 84 72 62 -29 -209 -184 192 144 32 -105 -282 1 30 76 130 28 94 -31 137
4251A37j89k9k38J50K05J04j78J64k22K73j47km6n0m0O6R3j43J05J01l11L76M7
$$ 137 -52 -81 -319 -169 36 140 -38 126 -96 177 30 28 -18 -68 -108 -42 51 -92 13 114 -197 179 226
4274B26j64J61m22M60k33n5R5m6j74J86q1Kk47J79M0J83j54R7j5n6N6m6R9L2m26
$$ 226 62 223 -199 261 28 -27 68 22 -152 34 -47 -45 -292 -113 -73 110 -44 53 38 -18 38 -8 91 123 -303
4299c03J84RN2P0p5P9j24l2O8P8r2J4Q3j72N12l23o9J96P5l22o3J42j56L46l25
$$ -303 -119 -110 -58 12 -63 16 -108 -140 -72 6 -86 -72 11 -161 351 28 -41 155 230 -92 -155 -13 -169 177 -148
4324a48j03J63J93L5Ql90J10J08l03L66j25O5O0r6P4N4l46J74K80k06l3J11l93
$$ -148 -251 -88 105 140 148 -242 -132 -24 -327 39 -86 -21 39 -57 17 71 -275 -101 179 -27 -60 51 -342
4347c42N25j01j17K05m3P8k22O9p6q1j19K69P9k20L7K7Q4L5j10j04O7J74l51L22
$$ -342 183 82 -35 170 127 205 -17 52 -24 -105 -224 45 124 -96 -59 -32 52 87 -23 -127 -60 114 -237 85
4371H5j34QJ93m7o5M2R9j89N9M7l50L71l41L63N5k10P1k0j00J2P0k65J47k61K82
$$ 85 -49 -41 152 105 40 82 181 -8 51 98 -252 119 -222 141 196 -14 57 37 -63 -51 19 -246 -99 -360 -78
4396g8pK2Q6p2J1J49PM7l75K41j74J49kJ23r5P0jr4J09o7j59J44l9J93n3k58J30
$$ -78 -85 -63 23 -49 -38 111 118 165 -210 31 -143 6 4 127 32 102 101 7 116 49 -110 34 -5 188 135 -123 7
4423GN3k26N62m63n2L8L19j13k29j13K82j32J22J45j71NL0K9k47J14L9j68K1N8
$$ 7 60 -166 396 -67 -119 -81 238 125 -104 -217 65 -67 55 200 29 34 64 93 -154 -40 -1 -169 -148 -90
4447i0J54j15J61k94J51rN5j11Q3n8J72n3QK2j20n2J00j79K21M8n3q8J63j19p4
$$ -90 64 -51 110 -184 -33 -42 13 -98 -15 -73 99 46 54 76 -44 -96 4 -175 46 94 41 -47 116 -3 -77
4472g7J59k20N5j5J63J13j69P6Q2m51J69K06j41m1J50l71L67l07n3K47O6J85n7
$$ -77 82 -138 -83 -98 65 178 9 85 167 -284 -115 91 -50 -91 59 -312 55 -252 -305 -58 8 193 136
4495A36r6k1j59N5L47l13J17r9j13R6J77k31pO3J38k55K55j14J14j35j18K12j56
$$ 136 40 19 -140 -85 262 -51 66 -33 -146 -50 127 -104 -111 -48 90 -165 90 -24 90 -45 -163 49 -107
4518a07J77q1j70K13p7j67J44J54j00R5L8j0M7l14K2J76j86J25j97J64P8l7p5
$$ -107 70 -11 -181 32 -45 -212 -68 86 -14 81 119 109 156 -158 -136 40 -146 -21 -218 -54 24 -13 -88
4541h8m2K75k8J02j00j16L15m96K71j52K29j74K16m41K12k06M4j3J50l6J62j42
$$ -88 -130 145 117 219 119 3 318 -178 93 -59 170 -4 212 -229 -17 -223 -179 -192 -42 -78 84 -58
4563e8l0J61q6L21m28L82m69M27k33R5n4j18QJ23m9J33OJ72l59K59r0P0j91n0
$$ -58 -88 73 -13 308 -120 262 -207 220 -13 82 28 -90 -82 41 -8 125 131 303 -56 203 113 183 -8 -58
4587e8J89k84m2L55l00K96J6J4n9o3o2j36J95j99L67j62j2j15J23k96K46J05k36
$$ -58 131 -153 -195 160 -140 156 172 186 127 64 2 -134 61 -138 229 67 55 -60 63 -233 13 118 -118
4610a18J74q2J29R9l80Q4J91j09p0K66k76J87l94J98LJ3j04L28k54R7K00j50J14
$$ -118 56 -26 103 202 -178 -94 97 -12 -82 184 -92 95 -299 -101 -98 -85 -189 139 -115 -18 182 32 146
4633A46o8l6l9j20L23m8k17J26n0J25n3jp3j2J3j61J32k29L13N9j72l2N9J2j7
$$ 146 78 42 3 -117 206 158 -59 67 17 142 89 88 15 3 16 -145 -13 -242 71 130 -42 -74 -15 -3 -20
4658b0KK4R2o1j64J4L6j5J54N8l7m21N03n1j2k66J89j23N4J52k60J66J0j9j93
$$ -20 -18 6 98 37 -127 -113 -77 -92 62 120 83 -338 165 114 102 -164 25 -98 -44 108 -152 14 24 5 -188
4683a88NJ82j4J30j63Q1j90O6j65L03J25j57k7J81j46r4J45o9K72k36o6K1K99
$$ -188 -183 -1 -15 115 -48 33 -157 -91 -256 47 172 15 -12 169 23 -71 74 5 277 41 -25 -4 295
4706B95m89K54J51j79l34M1L37j21O7Jj17o3j63L79N0j0N7k01J73j62p8J35j39
$$ 295 -194 60 211 32 -302 -261 76 -45 22 23 -94 -157 -320 59 109 99 156 -45 128 -34 -112 23 -116
4729a16L07k01P9j2O1k61p2K38k36K80J65j84O6m5J4j12Q0Lm9j96L36k91k7K96
$$ -116 191 -10 69 57 118 -143 -215 23 -213 67 232 48 114 69 83 -29 51 54 5 -191 145 -146 -173 123
4753A23N0J17n4l92L8K98k85N4O5j58N9J12j53k6L0r3J63l1J63j98J61L9j24P2
$$ 123 173 290 236 -156 -118 180 -105 -51 14 -144 -85 27 -126 -152 -122 -215 -52 -83 80 -118 43 82 -42 30
4777C0q1J51o7J62l12K86k76O2N9j54J66J38k03j18k0J57p8J04J6Q3l5j65J87
$$ 30 -51 100 33 195 -117 169 -107 -45 14 -140 26 164 -39 -157 -177 -20 -98 6 22 105 70 -95 92
4800I2J4n0k06N9J50k01J40o2O9P5o8J90r4j1q5j30j7J52k44L7J95k8J27p4j04
$$ 92 106 56 -150 -91 59 -142 -2 -64 5 80 12 202 108 97 12 -118 -135 17 -227 -190 5 -23 104 30 -74
4825g4m8r3K02k76J78M5M9j16N1J21j16k5J52P5k36J19n6K59p5k67K25J50l10
$$ -74 -122 -215 -13 -289 -111 -66 -17 -133 -82 39 -77 -102 50 125 -111 8 -48 211 136 -131 94 244 -66
4848f6JJ13N0k73K08j13J12j08J32L1k99J84J1P3k35J0O0N9J05p0r4j6J68k63
$$ -66 -65 48 98 -175 33 -80 32 -76 56 87 -212 -28 -17 56 -179 -169 -109 -50 55 -15 -109 -125 43 -220
4872b20K17m9N5j1m6kr5K26j21N2l4j13J92k47K51N9l17M45m80K43K22j7j66N3
$$ -220 -3 -52 3 -8 -54 -56 -151 75 -46 6 -28 -141 51 -196 55 114 -203 242 -238 5 227 210 44 97
4896I7j46J7j16L5J60r5J9K24j41j53K46k35K51l31M13k92O1p9J45r4R5j95Q0
$$ 97 -49 -32 -148 -113 47 -48 -29 195 54 -99 147 -88 163 -168 245 -47 14 -65 80 -14 81 -114 -34
4919c4J86k23j41K44k25M27k3k43m5P8J15q5PK1p4j87J8J37J58l43K72r3mk9J07
$$ -34 152 -71 -212 32 -193 234 211 -32 -77 1 116 31 38 59 -15 -202 -184 -47 111 -232 40 -53 -57 -86 21
4944B1L1j21K00p2k45K05J7j16j02J62j6J87k5j76L3j20j43K63l7J16r3K3J17
$$ 21 52 -69 131 59 -186 19 36 -80 -182 -20 -36 151 126 -50 -17 -137 -280 -17 -54 62 -31 -8 109
4967A09J46n2j63r6j13K72l26L39J28k32K47m43J65n3j16L91k16J92j94O3j00
$$ 109 255 203 40 -56 -169 103 -223 116 244 12 259 -184 -19 -72 -188 203 -13 179 -15 48 -52
4988e2J00N8k33J47P5j40l1K30j50k43K87j19J29j3o5m7o0J21l7Q9J0k95K73J29
$$ -52 48 106 -127 20 95 -45 -76 154 4 -239 48 -71 58 45 -20 -67 -127 -6 -43 46 56 -239 34 163
5012A63l6J36l41J51oK7l4k5k52K60K4o0k2m1M3P9KM1j93L03j43J29l09K72j95
$$ 163 127 263 -78 73 67 94 60 35 -217 43 67 7 -15 -56 -13 66 68 109 -84 219 76 205 -104 168 -27
5037b7Oo8J24J06m7j02O0k23L68j70K2R3l25K56o1l8m3p1M10m17L7j3K1K14j57
$$ -27 -21 -89 35 141 94 -8 52 -171 197 27 49 142 -183 73 12 -26 -69 -140 270 -147 -110 -123 -102 112 -45
5062d5K40j45j7o0j6j00J89j32R6j96N6J21Q3q1j74Q2K37k37J37r7K38n0k18j5
$$ -45 195 50 33 -27 -43 -143 46 -86 10 -186 -130 -9 74 -7 -181 -99 138 -99 38 -59 179 129 -89 -104
5086a04L14r8K1Q0k18J2J48j03j38Rl0K43k9j13R3j20mn8J06K3j92J41l1j63K92
$$ -104 210 112 133 213 -5 7 155 52 -86 -77 -107 136 107 -6 87 -33 -37 -95 11 34 -158 -17 -48 -211 81
5111H1k1N2r0K6q0p6o2qM6J44m0k6M1p9L4L6K20n44K67R5l7l28O12k72j77O6N3
$$ 81 60 112 22 48 -32 -108 -170 -178 -132 12 -28 -54 -13 -92 -58 -22 198 -346 -79 16 -21 -349 263 -9 -186 -120 -67
5138f7K49k44O5k15J43j48L47M5p1j03jL1J95r9k46K97j90R7l04R8K46%l8k19
$$ -67 182 -62 3 -212 -69 -217 130 175 104 1 0 31 226 127 -119 178 -12 85 -219 -121 125 125 87 -132
5162a32K44k47j09J83O0J27j16q9K57k59j34J89L5k33J94k01K74J23l28J18r1
$$ -132 112 -135 -244 -61 -1 126 10 -79 178 -81 -215 -26 9 -224 -30 -231 43 166 -162 -44 -135
5183a35J24Rp6J15Jo6j71J18N8J7O2j08oJ02k29J96j11j65L53k2p2K8k86L55j24
$$ -135 -11 -2 -78 37 38 -28 -199 -81 -23 -6 56 -52 -58 44 -185 11 -100 -265 88 66 -6 22 -264 91 -33
5208c3J29j63q1J96K4j19j15J73j32q7J01J06R7O7l44J67j21J80j20L1J40k26
$$ -33 96 -67 -148 48 72 -47 -162 11 -121 -208 -107 -1 96 163 -181 -14 -135 45 -75 -44 96 -130
5230a30j51J02J21j38P4K52Q7k18L0R4J5k32J25r3o3J08K73j89L4j28j11K50j76
$$ -130 -281 -179 -58 -196 -122 130 217 -1 29 123 138 -94 31 -62 -125 -17 256 67 101 -27 -138 112 -64
5253f4KL09m66J06O7K2M5k23J85n6Q2J00N9N9j80Jk81L58J55j25n3k08R7jm4L00
$$ -64 -62 247 -219 -113 -46 -24 21 -202 -17 -73 9 109 168 227 47 48 -233 125 280 155 102 -106 -9 -10 -54 246
5279B46jj26k49K7K95j04k18R5L1o0O4j0j39o5K79O4j97lJ52R4k53L73k74J54
$$ 246 245 119 -130 -103 192 88 -130 -35 -4 -64 0 -10 -149 -214 65 129 -68 -71 81 175 -78 295 21 175
5303A75j02q5l4M2J50K2k60K09k85J87J96o8q2k58M05m42J84L96l45P8q1j6Po8
$$ 175 73 -12 -46 -4 146 168 -92 117 -168 19 215 147 65 -193 212 -230 -46 350 5 83 2 -14 -7 -75
5327g5J9J83j05k46K11JL4k68J04K34r5J5j70L67l00Q2P3n0r9K8K2P9k30K99q2
$$ -75 -56 127 22 -224 -13 -12 22 -246 -142 92 -3 12 -158 209 -91 -9 64 14 -85 -57 -35 44 -186 113 31
5352C1K3M6J19j08k13Q6O7p4lJ78o4o7J23j92N0L8L0j58K56j60J5p3j00n1L23
$$ 31 54 100 219 111 -102 -16 51 -23 -26 152 88 21 144 -48 2 40 70 -88 168 8 23 -50 -150 -201 122
5377A22p9N5q6j20Q0J05k98J77M5q6j61J41J88J48P7l47JJ11L9j83K48R0j28j44
$$ 122 43 98 12 -108 -28 77 -221 -44 1 -85 -246 -105 83 231 308 -39 -38 73 112 -71 177 267 139 -5
5401eJ36k77K33k4j56J46j23J29l29L98j80%r8M3LK44o4K0j8K1k35l5J74o3J21
$$ -5 131 -146 87 63 -93 53 -70 59 -270 128 -52 -52 -150 -107 -104 140 76 96 78 99 -136 -171 3 -60 61
5426F1p7j35K20Q7j96J33j83J70j32j26K41j79L25l1l37L00p7j03K24j09l5j6
$$ 61 -16 -151 69 156 -40 93 -90 80 -52 -178 63 -116 209 178 -159 141 64 -39 185 76 41 25
5448B5J64k17l3J16r8r5N0Q9O3N9K8j01l1O1m9j00K71k96J40j43K00j55j4J31
$$ 25 189 -28 -61 55 -43 -138 -88 1 64 123 151 50 19 80 31 -69 202 -94 46 -97 103 -52 -66 65
5472F5l23M16n3P7M9k69K2L52l47r4mL5P8J17j40K95l73N6J56j53P1k24K7L16
$$ 65 -258 158 105 182 231 -38 -16 336 -11 -105 -109 -74 4 121 -19 276 -97 -41 115 -38 33 -191 -164 152
5496A52l03k7K76j3j91N6J41l8J55l33J40j66J73j01n0p3L32p0Jm6Q0j09q9K64
$$ 152 -151 -178 98 85 -106 -50 91 53 208 -125 15 -151 22 -79 -129 -202 130 60 61 15 95 -14 -103 161
5520A61j53J7mj55q3R2Q8K72j63ok6j10l6J70l6j16J60j36J9j7N6J57r1j04K7
$$ 161 8 25 21 -134 -217 -125 -37 235 72 66 40 -70 -106 64 28 -88 72 -64 -45 -62 -6 151 60 -44 -17
5545a7n1P1Q4k29K96k87K88k52R6L4%k74K27Q6k26J81j96K20r1J90l01L16j00
$$ -17 -68 3 87 -142 154 -133 155 -97 -1 33 33 -241 -14 72 -154 27 -169 51 -40 150 -151 165 65
5568F5m5L5j13L0J24j93O9K19j44J56k41J63j69j27J55K23m10J94m3J37k02L10
$$ 65 20 55 -58 -28 96 -97 -28 191 47 203 -38 125 -44 -171 -16 207 -203 -9 -52 85 -117 193
5590A93k22j01Q9j90J25j6Q2J15j9J7l10K14R8j87L87k60o0j3O7Q2N3l27J84J36
$$ 193 -29 -130 -41 -231 -106 -122 -40 75 56 73 -237 -23 75 -112 275 15 -45 -58 9 91 144 -183 1 137
5614A37j04j21p1J74q0J96k15J55l6j49J87j67L5L39l28k8k2L2K4j31mjJ68m8
$$ 137 33 -88 -159 15 -65 131 -84 71 35 -114 73 -94 -59 280 -48 -76 -98 -66 -42 -173 -177 -178 -10 -58
5638e8N8J20j65n7L94l66r2K39j60J88J14j71m6n1n5O6r5kJ51j49L8N9J71l43
$$ -58 0 120 -45 -102 292 -74 -166 73 -87 101 215 44 -2 -53 -108 -42 -137 -139 12 -137 -99 -40 131 -212
5662b12r7K67J57j4j59P5n2K9K36j66k09Q9J7O5J20k9P8k22J61J8j12j76J11O9
$$ -212 -309 -42 115 101 -58 17 -35 -6 230 64 -145 -56 -39 26 146 117 195 -27 134 152 40 -136 -25 44
5686D4O7r0K8m3jJ79j61J86J83l23Q3j90p9J48j60K73j20K28k72J8k86M33k7l0
$$ 44 111 21 49 6 5 184 23 209 392 69 152 -38 -117 31 -129 144 24 252 -20 -2 -288 145 118 88
5710H8q2k7J35K02k85j04L30k21p4J1m0L54l12O4j53N7J15q7J40j29j67j03L35
$$ 88 6 -21 114 316 31 -73 257 36 -38 -27 -67 287 -25 39 -114 -57 58 -29 111 -18 -185 -288 47
5733D7M0k3n0L1r8Pn7RK0J15L8j90J84N0k32J71j24N3J97k37J04Jj29p1L14k35
$$ 47 87 64 14 45 -53 -46 -103 -94 -74 41 79 -111 73 123 -109 62 -62 -9 188 -49 55 56 -73 -144 170 -65
5759f5J02j16N2m9K0j03N7J44j0j9J00l07N59k89l22L84l89L77j57k41K33R6n3
$$ -65 37 -79 -27 -76 -56 -159 -102 42 32 13 113 -194 365 76 -246 138 -251 126 -31 -272 -39 57 4
5782Dj38L93k49O6j87r1M6J75k25R6m6l6J6L45j91M9J21k55J74k13p1K59j89J65
$$ 4 -134 259 10 76 -111 -202 -156 19 -206 -110 -156 -192 -176 169 -22 27 148 -107 67 -146 -217 42 -147 18
5806A8p1J28j85p5J02k03K21J47J06kq6k37K11Q1n8j7l1k08R0J30J46k00N4R1
$$ 18 -53 75 -110 -185 -83 -286 -65 82 188 186 100 -137 74 155 97 80 49 -159 -69 61 207 7 61 152
5830A52Kj5j39o3J06r8J49q6N1q8J24M1m04M67q1o1J13j40n3L54k02mN4oj61j3
$$ 152 154 139 0 -63 43 -55 94 8 59 -29 95 136 -268 199 118 57 170 30 -23 331 129 125 179 173 12 -1
5856aj48J8L4j4K1q6K7Q9k4J96l42J56j84J17J56n2J81o7J31m33L54k97J14q9
$$ -1 -149 -131 -97 -111 -90 -176 -149 -60 -84 112 -230 -74 -258 -141 15 -37 144 77 208 -225 129 -168 -54 -143
5880a43L26l39J57j61Q4L58r3j82MJ16j32J69j15l44M49k95J02J91k16L49l85
$$ -143 183 -156 1 -160 -76 282 189 7 11 127 -5 164 49 -295 154 -141 -39 152 -64 285 -100
5901a00p4o3L90j41J25j94Q7L4n5l7L6k03K07K1J13m28J03K75j81k12J83K9j08
$$ -100 -174 -237 153 12 137 -57 30 64 9 -28 8 -195 12 33 146 -282 -179 96 -85 -297 -114 -85 -193
5924a93K36j7j71k7L74j29k6p3J82l13Q8n6J37m6J34j72o4l3J43j27J32m3L40
$$ -193 43 26 -145 -172 202 73 47 -26 156 -157 -69 -125 12 -34 100 -72 -136 -169 -26 -153 -21 -64 276
5947B76l41R5k5j50m9J85J60j87J04M9l3m7m1J9j26M5J25o8m36M48j79N8J75p6
$$ 276 -65 30 5 -145 -194 -9 151 -36 68 117 84 37 -4 15 -111 -66 59 -9 -445 3 -176 -118 57 -19
5971a9J47k56L7N8O7p2M1L00k75r5K17k49M30k96J57j41J49j47K72l37j61J02
$$ -19 128 -128 -91 -33 34 -38 3 303 28 -67 150 -99 331 35 192 51 200 53 325 -12 -173 -71
5993g1j35J45n6K78k91J64N5Q5r5j71N4k3Q6j31R1j12K69k85N5j16K12j12M2Q0
$$ -71 -206 -61 -117 161 -130 34 89 174 79 -92 -38 -61 25 -106 -15 -127 142 -143 -88 -204 8 -104 -62 18
6017A8N5L5k38O5K4K36k91J52j08P2J04p3j07J58p7Mj77N4K0j03o7L39q7J26j8
$$ 18 73 108 -130 -65 -41 195 -96 56 -52 20 124 51 -56 102 25 29 -148 -94 -74 -177 -244 95 8 134 116
6042A16O2k28J56j78P2Qj77L30n2J21j27l04L57j41N1n8J2j42J60K35j83Q8m4
$$ 116 178 -50 106 -72 0 8 -169 161 109 230 103 -201 156 15 66 8 20 -122 38 273 90 178 134
6065A34J33l54J17K01j23r3j65J12J65l04K09j12L7J00r6j71K32J11p9j57J1K70
$$ 134 267 -87 30 231 108 15 -150 -38 127 -177 32 -80 -43 57 -39 -210 22 133 54 -103 -92 178
6087A78j19k37J03J3J19k18J47O4n7J0p5j81J95j7J30Q6j57K8m7m4j04J97j53
$$ 178 59 -178 -75 -62 57 -161 -14 50 -7 3 -72 -253 -58 -75 55 141 -16 12 -35 -79 -183 14 -139
6110a39K69j29l32K32L00j60l7OO5j44L65m75J24k3J37k4k03QJO8K42P8j49o5
$$ -139 130 1 -331 -99 201 41 4 10 75 -69 296 -179 -55 -78 59 35 -168 -160 -159 -91 151 229 80 15
6134A5J65p8j77l6R5j08p6L70k58J45L1j43J9K40l50J89J2L5j63J78m6k72J49
$$ 15 180 102 -75 -111 -16 -124 -200 170 -88 57 88 -55 -36 204 -146 43 55 90 -73 105 59 -213 -64
6157f4L15j72j82J92jj01P4p7j57K40p3r8J62p9P7K8j03M4j80K72k80J53k2J44
$$ -64 251 79 -103 89 88 -13 61 -16 -173 67 -6 -104 58 -21 56 84 -19 25 -155 117 -163 -10 -32 112
6181A12j54R7k83K54N3k14J32L09l78Q8j05P2n1m2J52p2j30R8l4R7j20J74K3l1
$$ 112 -42 55 -228 26 79 -135 -3 306 -72 16 -89 -17 -68 -110 42 -30 -160 -62 -96 1 -119 55 78 47
6205D7p4J84k37K87j67%j55J3J27m15N34k67J98R7k82J33J66k39J12j91J26p6
$$ 47 -27 157 -80 207 40 40 -115 -102 25 -390 144 -123 75 172 -110 23 189 -50 62 -129 -3 -79
6227g9J43J37l50K57k35J15JJ31q0p2Q6j83L7kN8J06j16K28j61O0j41mr1L05M5
$$ -79 64 201 -149 108 -127 -12 -11 120 40 -32 54 -129 -92 -94 -36 70 -46 182 21 81 -60 -64 -155 150 195
6252A95j20k37J46J78k28K62j88j9j96K01j17J93j83K44r7K45j08K2r9n6j69J37
$$ 195 75 -162 -16 162 -66 196 8 -11 -207 -6 -123 70 -113 131 34 279 171 193 94 38 -131 6
6274FJ71j49j05m8N0P5j71n0K99j93J56j61J10j10M1J26j53p7K08K18o7j24j28
$$ 6 177 28 -77 -125 -75 0 -171 -221 78 -115 41 -120 -10 -120 -79 47 -106 -183 25 243 176 52 -76
6297g6J01K16k63J86m01J24J51O5k47J82p7J04k27K15J1j29j38M67l55K2o5P0
$$ -76 25 241 -22 164 -237 -113 38 103 -144 38 -39 65 -162 53 64 -65 -203 264 -91 -69 -134 -64
6319f4J50Q8k8k47J36jk7pJ7J57j82J03j46J19j47m3J70j37j03J79l6M2J16k05
$$ -64 86 174 146 -101 35 34 7 0 17 174 -8 95 -51 68 -79 -122 48 -89 -192 -13 -49 -7 109 -96
6343i6K90k75K1O8R8q9k05K87jQ5l35M24k78l3j7O6k4K3K5k12O3j5K74j93K23
$$ -96 194 -81 -60 8 106 17 -188 99 98 183 -152 272 -6 -39 -56 10 -14 9 34 -178 -115 -130 144 -49 174
6368A74j39J07q6l46L38j32j26L01l46K56J72j29k15Q4L16l13J98r4n3J35o6j91
$$ 174 35 142 56 -290 48 -84 -210 91 -255 1 173 44 -171 -87 229 -84 114 20 -33 102 36 -155
6390a55J54J29K5J5j26l51M41k62OJ28l2L07k74J69k71K18l00J82L3n4J53j47
$$ -155 -1 128 153 168 42 -309 132 -130 -124 4 -28 279 5 174 -97 121 -179 3 36 -18 135 -12
6412a2K0l1r9J08K87j78k83P1K59P9J15l12Qj18K70k28P2J31j60j5J05J9j52K25
$$ -12 8 -23 -122 -14 273 95 -188 -117 142 221 336 24 32 -86 184 -44 28 159 -1 -16 89 108 -44 181
6436A81j81M6q6k79j66N45j66K73j33k83K42j2N4N0N8k01K35j22r4J68J1o0j62
$$ 181 0 46 -40 -319 -485 60 -106 167 34 -249 -7 -19 35 85 143 -58 177 55 -39 129 140 80 -82
6459h2k29J91J4J23kq8L36k20K5j76n7K48j91OR3r0j13M1J62k5J00j42J78n8O4
$$ -82 -311 -120 -106 17 15 -73 263 43 68 -108 -165 83 -108 -102 -9 -99 -212 -171 -9 -34 66 -76 102 44 108
6484A08j30K56l3j53k47Q9m6j4J76nl8j50J57j85K21J27r8K34l09J9k76L24p3
$$ 108 -22 234 201 48 -199 -110 -156 -170 6 1 -37 -187 -30 -215 6 133 35 269 -40 -21 -297 27 -46
6507d6r1J09L2r5NR9m0L8L2j07J66p3l6QJ1R9l23J23K48j73j60P3J21j28NJ87
$$ -46 -137 -28 4 -91 -86 13 -27 11 43 -64 102 29 -7 1 12 111 -212 -89 159 -14 -174 -101 20 -108 -103 84
6533H4Nj30L4L53o31N29k32J52J1kj95J27k32%J03J5M2j95K37n0N5j14kJ43O2
$$ 84 89 -41 -7 346 -285 244 12 164 175 173 -22 105 -127 -127 -24 -9 33 -162 75 25 80 -34 -36 107 169
6558A69j59n5k39J85R1m2m9n9K72j13J01M9j47j7R3j8J28k77J75K38l98K30k79
$$ 169 10 -45 -284 -99 -8 -50 -99 -158 114 1 102 151 4 -13 80 62 190 -87 88 326 -72 158 -121
6581a21O2j24K16k70K78O0k3P9k15n2K64n5j90O8j13K73lj17J31l52K73k0k19
$$ -121 -59 -183 33 -237 41 101 78 157 -58 -110 154 99 -91 -23 -136 137 134 17 148 -204 69 49 -170
6604a70Q9m2K76k54J99j67LL8M4Mr4J30j63m6K69j86K7O4P0l04p7K90j10Q2m1
$$ -170 -81 -123 153 -101 98 -69 -66 -28 16 20 -74 56 -107 -153 116 -70 -43 21 91 -213 -290 0 -110 -28 -69
6629f9j31O2K08j28j15o7L08j5k20J91R6k17K96j35l70K15q0L09j78o2L14J5m52
$$ -69 -200 -138 70 -58 -173 -240 68 53 -167 24 120 -97 199 64 -306 -91 -171 138 -40 -102 212 227 -225
6652b25L05k4q6P5N0j68J52q0j42J73l3j00J4K88k61J10j73J41R4k01k9J17R1
$$ -225 80 56 -30 45 95 -73 79 -1 -143 30 -3 -103 -89 199 -62 48 -125 16 110 -91 -120 -3 88
6675H8l1N2j21j08N5j83J05J73k13K94j14j10l2J49k3k6L20j62n5j34L50l69K60
$$ 88 57 109 -12 -120 -65 -248 -143 30 -183 111 -3 -113 -145 4 -19 -45 275 113 58 -76 274 -95 165
6698A65m52K96N0p1pN9k9k6J99k41KK44k97M42j57j25Q6m9j6l46M22p5pl56L66
$$ 165 -287 9 59 -12 -19 40 11 -15 184 -57 -55 189 -108 334 177 52 138 89 73 -273 149 74 67 -289 77
6723G7N3j61N2l8m5J58J01j68j86K33l1J26l21J31L5n3J47k62O0M6j0J29m1P7
$$ 77 130 -31 21 -17 -62 96 197 29 -157 76 45 171 -150 -19 16 -37 110 -152 -92 -46 -56 73 32 109
6747A09mj3j76Q4o6N5K07l11o0L34l8r2J63p2j75P3rQ5j94j11J37K39j82J23k89
$$ 109 105 92 -84 0 -66 -11 196 -115 -175 159 121 29 192 120 -55 18 9 94 -100 -211 -74 165 -17 106 -183
6772a83R8jP2L0J22k93L66l18L2J00O1q4r4J01k7p4J71m9j63J18M8M7j60M02j8
$$ -183 -85 -86 -14 16 138 -155 211 -107 -75 25 86 2 -92 9 -18 -92 79 30 -133 -15 33 80 -80 322 304
6797C04k68Q8j19kJ50j96N5R2K3l93M72l22L65l82Q3R5l1m1P6rl4J35j17J43n5
$$ 304 36 124 5 3 153 -43 12 104 127 -266 206 -116 249 -133 -50 45 14 -27 49 40 6 141 24 167 112
6822A12k61L0j53J39K79j70K34k33J57m6o8J57l10K49n8J02j78J74k29o6K21J65
$$ 112 -149 -119 -272 -133 146 -24 210 -23 134 88 20 177 -133 116 58 160 -18 156 -73 -139 82 247
6844B47k05k5j39J8N9M3o9O9j16J06r7K50j32j33j03J70J52j96K79j37j51k1J80
$$ 247 42 17 -122 -104 -45 -2 -71 -2 -118 -12 -109 141 9 -124 -227 -57 95 -101 178 41 -110 -131 49
6867D9K0Q3j02j26K52j99J7k7J68J25k93r5m8J99O7j20J81l14J98m9k1J1r8R8
$$ 49 69 152 50 -76 176 -23 -6 -33 135 260 -33 -128 -176 23 90 -30 151 -163 35 -14 -35 -24 -122 -24
6891b4J47m3J36j59Q4j76r3K25L3k62ML42k84j68L35l61K35J28L5j30J23L1j71
$$ -24 123 80 216 57 141 -35 -128 97 130 -132 -128 214 -70 -238 97 -264 -29 99 134 4 127 158 -13
6914a3J3o6K26k47K05q3Q4j19K84k55l1k0J37j83m8O9N9j44J16l02J88q0k2L6
$$ -13 0 -66 160 -87 118 35 119 0 284 29 -2 -22 115 -68 -116 -47 12 -132 -16 -318 -130 -210 -232 -196
6938a96K22m0j18J77j71K42J24l44M18k62J44om1k34J26j15Q1J11k74Q5Q9k37
$$ -196 26 -14 -132 45 -126 116 240 -104 314 52 196 190 149 -85 41 -74 7 118 -156 -71 18 -219
6960b19N42k53j1K6o7R0k90o5K29J04j53P1J23k11J50J47j30p7R7j85J33j01J14
$$ -219 323 70 59 85 18 108 -182 -247 -18 86 -67 4 127 -84 66 213 83 6 103 -82 51 -50 64
6983F4k10J33K10m04K22j7K07r4M1m66K87K39k84r1J47j53l2K55j32K83l1l51
$$ 64 -146 -13 197 -207 15 -2 205 111 152 -314 -27 212 -72 -163 -16 -169 -201 54 -78 205 174 -177
7005a77K46J91j86K0k82J7L82k25l20M69j46Q7k61L83k27J7J07j93O4l4J65l7
$$ -177 69 260 74 94 -188 -171 211 -14 -334 135 -11 76 -185 198 -29 -12 95 -98 -34 -68 97 60
7027F0p0j03l7RK70j54rJ21J37k16k82J96J07K4j72k3K33j55k0P6L4j34O1j45
$$ 60 -10 -113 -150 -141 129 -25 -34 87 224 8 -274 -78 29 53 -119 -142 91 -64 -84 -8 26 -108 -47 -192
7051a92J76J34m47J11K73J41r0k05k96M13J20m1lK7q0l01M68l42J30l0j5L40j75
$$ -192 -16 118 -329 -218 55 196 106 -99 -395 18 138 97 94 121 41 -260 208 -134 -4 -34 -49 291 116
7074A16O0k04J75j16j2N6l1j8l27L50K16k23R3r9k11j4O6O8K3K0j14j39N40m28
$$ 116 176 -28 147 31 19 75 44 26 -301 49 265 42 135 36 -175 -189 -123 -55 -32 -12 -126 -265 275 -153
7098a53J08k16O4L75j65k3M6Pk11J21o6K13j64J24J58k21j67L12k90o6K78j05
$$ -153 -45 -261 -197 178 13 -10 36 43 -168 -47 -113 100 -64 60 218 -3 -170 142 -148 -214 64 -41
7120d1r7J8M66l14q2J28Rj63R6J38j72M8j74J29Q9j89K24j73J68jq8r7J6K45m29
$$ -41 -138 -120 346 32 -50 78 87 -76 20 158 -14 34 -140 -11 78 -111 113 -60 108 107 19 -78 -62 183 -246
7145b46L21j12k6J28K6J11q7k07KK40j45r2J21J29l41K47j5J31o4j73J50j64J97
$$ -246 75 -37 -63 65 91 202 115 -92 -90 150 5 -87 34 163 -178 69 54 185 121 -52 98 -66 131
7168A31k03K10k31oJ2j07O2L49J55k26k16j76J83j9J28k32O2LJ16J89R3l96K68
$$ 131 -72 138 -93 -99 -87 -194 -132 217 372 146 -70 -246 -63 -82 46 -186 -124 -121 -5 184 277 -119 149
7191A49k13P1J50q3j90J86l8n0N9q5P9J3k17L00j52k6q7O3p5K13O2N4l13J76j7
$$ 149 -64 7 157 74 -116 70 32 -18 41 -44 35 48 -169 131 -21 -47 -134 -71 -146 67 129 183 -130 46 29
7216B9j76Q3K89k04j57K15l16J50P0K47l92K17l40o1M33j16l8N5N2j33J5O4J15
$$ 29 -147 -64 225 21 -136 79 -237 -87 -17 230 -162 55 -285 -346 87 -29 -67 -12 40 -93 -78 -14 101
7239A01k64M6K90J2l41R1J33q5J01k05m3J30J00k86K53J3j2j83J47K8j18j1L70
$$ 101 -163 -117 173 185 -156 -65 68 -17 84 -121 -164 -34 66 -220 33 46 34 -149 -2 26 -92 -103 267
7262B67l31r2K76l9J35l80R5K1J70q4k72K79N5k01n1K14j71R9nO9n7K10k34q7
$$ 267 -64 -156 120 81 216 -164 -69 -48 122 38 -234 45 100 -101 -152 62 -109 -10 -15 54 -3 207 -27 -114
7286a14K27j44P7J07j93l6j55M14j44p4J34l33K42j6J0N8q1l9J66o9q6M7j12K55
$$ -114 113 -31 46 153 -40 -76 -231 183 39 -35 99 -234 8 -8 2 60 -21 -60 106 37 -49 -2 -114 141
7310A41k29O3k15J60L31j62j21mj95K54n8N1J45k99M45n66K09L02l68J59o3P6
$$ 141 -88 -25 -240 -80 251 89 -32 -36 -231 23 -35 16 161 -138 307 -259 -50 252 -116 43 -20 56
7332E6k97K63P3j88R2J67Ml13j43K11J09j3o0J14L6rl5J69j17k11%L1M7k5Q2m5
$$ 56 -241 22 95 -93 -1 166 170 -143 -286 -75 34 21 -39 75 111 102 67 236 119 -92 -92 -61 -14 -39 43 -2
7358bN7kmJ26m91K51J15j11K74k41k0o4m4L36k8k18K0k6J20j40K99k51l5o0P3
$$ -2 55 53 49 175 -316 -65 50 -61 213 -28 -48 -112 -156 180 152 -66 -46 -72 48 -92 207 -44 -79 -139 -66
7383f6k9J48r3J73k82J33J59p7q2j05N4n5J38K6j43k3n3J80Q4m9J35j63K6N1n7
$$ -66 -95 53 -40 133 -149 -16 143 66 -16 -121 -67 -122 16 42 -101 -124 -177 3 87 38 173 10 36 87 30
7408C0J6j66J41J52j50j36K46k68J3J74k4j45O7J6n5K39k20K5O2r9R0J5j24L09
$$ 30 46 -120 21 173 23 -113 133 -135 -122 52 28 -117 -50 -34 -89 150 -70 -45 17 -82 8 23 -101 208
7432B08l36J93k17R7P1Q4k95QJ69l1K24j54j67q8K76j45J66k21J84N0k32J3L23
$$ 208 -128 65 -152 -55 16 100 -195 -187 -18 -49 175 21 -146 -234 42 -103 63 -158 26 76 -156 -143 180
7455A80k23q8J82jk6l6m5Q0k0o3M6Q6J04K6j3l61K06n6N0J05j19j5J55q9q0j6
$$ 180 -43 -131 51 50 24 -12 -57 23 3 -60 -14 72 176 202 189 -172 34 -22 28 133 14 -1 154 65 -15 -31
7481c1m7OJ81j55k2O8J08R1k06Mk78L96qj60j80K18L5j01j98K07j63J8L43k27
$$ -31 -78 -72 109 -46 -68 0 108 199 -7 -3 -281 115 107 -53 -233 -15 20 -81 -279 -72 -235 -217 126 -101
7505a01R7K9l0m3q3J05j5QJ21Kl68K50r9K7Q4J74k30P7K39j62j92J36l02M20k31
$$ -101 -4 25 -5 -48 -131 -26 -41 -33 88 90 -278 -28 -127 -100 -16 158 -72 5 244 82 -110 26 -276 144 -87
7530h7K5M29l57K27nl47J65N8j15j23L16j68J33l7k64J71m8J02k79K55l90L61
$$ -87 -62 367 10 237 232 -115 50 108 -7 -130 186 18 151 114 -150 21 -27 75 -204 51 -339 22
7552B2J4l9L09l26M8r1J50J1k28N1L7L2O9J05j4k59J17j95P0J32np3j2J96q8q7
$$ 22 36 -3 306 -20 28 -63 87 98 -130 -79 -42 -10 59 164 150 -109 8 -187 -117 15 10 -63 -75 121 33 -54
7578e4J84m47J49J76M5k32J05J1M35m20P3M3J31j37nO4K9j21j05J08k5N0n7n3
$$ -54 130 -317 -168 8 53 -179 -74 -63 372 -48 25 68 199 62 57 121 150 29 -76 32 7 57 0 -53
7602e3K1J64k69j2M46l50J20j64l3J77r3J7K23j57m69L88p3J51O9j58l9K23J1
$$ -53 -32 132 -137 -149 297 -53 67 -97 -130 47 -46 -29 194 37 -432 -44 -117 34 103 -55 -94 129 140
7625A40J9q4k22J63J65k74K17l13J35J29M1j86J70Pn2L6j89J78j10R9rj3N5L5
$$ 140 159 75 -147 16 181 -93 124 -189 -54 75 116 -70 100 107 55 91 -98 80 -30 69 60 47 102 137
7649A37k11N0R7J91k92r9K90q9j85K20r1J0M8k93K07K8j5M1K7j49O5j49L89k91
$$ 137 -74 -24 73 264 -28 -127 163 74 -111 109 18 28 76 -217 -10 18 3 44 71 -78 -13 -162 227 -64
7673f4j00K33p9p2K79j23l5l32M22K5q3o4J4K35j80j90L9K62o7k59j1J02J67o9
$$ -64 -164 69 -10 -82 197 74 39 -293 129 154 71 7 21 256 76 -114 -75 187 120 -139 -150 -48 119 50
7697E0pj03k07J65L42l64J52k31N8j26pq7L11J54K26l07M0k30MK59j70Q4J0N5
$$ 50 43 -60 -267 -102 240 -124 28 -203 -145 -271 -278 -365 -54 100 326 19 59 -171 -167 92 -78 6 16 71
7721G1J4j46K11n8n9RQLk29R2J30l6jJ1K59R6m61p2O4p1K39O2j04j64j39P7J36
$$ 71 85 -61 150 92 33 42 50 53 -176 -84 46 10 9 20 279 375 -86 -158 -94 -165 74 136 32 -132 -271 -194 -58
7748e8N0r4L9N8K13r7k23N7K7j23J68r0q6k7K7r6J32P7K49j31k06m8K0J44j71
$$ -58 -8 -102 -63 -5 208 111 -112 -55 -28 -151 17 -73 -159 -186 -159 -255 -123 -46 203 72 -134 -182 -162 -18 -189
7773a89M02l11K81k03j23J67k9j47j6J06K10j07p1K7N3q4l9J42k0O8J15m42Q3
$$ -189 213 -98 183 -20 -143 24 -5 -152 -168 -62 148 41 -30 -3 50 -34 -73 69 49 117 232 -210 -127
7796a27J57n2J13j42J95j24K69k60j28J03rK9K38k30Q3J9j6k02J5R7l2j61L6j18
$$ -127 30 -22 91 -51 144 20 289 29 -99 4 -5 24 262 32 115 134 118 -84 -69 28 -4 -165 -129 -247
7820b47L31J6m0J98l01LK3J79j94J33k46l7L57k44o0O5J08J48k73r8L8J70q3j6
$$ -247 84 100 60 258 -43 -40 -17 162 -32 101 -145 -182 175 -69 -129 -64 44 192 -81 -179 -141 29 -54 -70
7844g0J05O0l2pj74j19K40j9o0l7jj2Q1J84j01j18O4r6J69p1O2k15K02q6K2M6
$$ -70 35 95 63 56 -118 -237 3 -16 -76 -113 -114 -126 -45 139 38 -80 -16 -112 57 -14 48 -167 35 -51 -29 17
7870A7j18K62j58p2J37K5o9%L4K08l90K02k03O7K13k55L1J25pl6J17r5J6l4k20
$$ 17 -101 161 3 -69 68 93 24 24 58 266 -124 78 -125 -58 155 -100 -69 56 49 13 130 35 51 17 -203
7895b03M6J77k10J04j05P4K60mj85J7l2K33l55K71J9j45l2J29Rj09J03m1q2R8
$$ -203 -157 20 -190 -86 -191 -117 143 139 -46 -29 -61 172 -183 88 107 -38 -70 59 68 -41 62 21 -61 37
7919C7j11L6J18M8Nj33R4o6L42l10l21J71M0J26k51K02P5j50K36j27qm8J7K0J43
$$ 37 -74 -38 80 128 133 0 94 28 370 60 -261 -90 -50 76 -175 27 102 -48 188 61 53 5 22 42 185
7944A85j32m4j8j1j51K91k70J57J54r9M2L9p5j5q3N4M4q9o6J04j27J6K39l9k65
$$ 185 53 9 -9 -20 -171 120 -150 7 161 62 104 143 68 53 -30 24 68 -21 -87 17 -110 -94 145 106 -159
7969a59K70j06O5J27n2l82M77k57M6Q7j23K17k34J33o6l61M00m2L7J67l61J20
$$ -159 111 5 70 197 145 -237 240 -17 29 116 -7 210 -24 109 43 -318 82 40 77 244 -117 3
7991Cn0j01J50m7r4K61k47J55J92j42r6J68p9j48P9J6M8j72J57j38R8j72j5K30
$$ 3 -47 -148 2 -45 -139 122 -125 30 222 80 -16 152 73 -75 4 20 68 -104 53 -85 13 -159 -174 56
8015E6N6j50L4Q0j25K24r8o7j16j4J24J46p0n3J08k4j51p2l9J90L32m53M0N0k77
$$ 56 112 -38 -4 76 -49 175 77 10 -106 -120 4 150 80 27 135 111 -40 -112 -151 39 371 -82 -42 8 -269
8040b69K48J51j47P6k17J16j65K61o1R5m9j3k38J12J13j22j00L35j48j13K01j5
$$ -269 -21 130 -17 59 -158 -42 -207 54 -7 88 39 26 -212 -100 13 -109 -209 126 -22 -135 66 51
8062E1k07K80k04Q1Mj48J63P1j43k34K24K4K3j76L8L5J88l56J65k6J88J3p0q4
$$ 51 -156 124 -80 1 5 -143 20 91 -52 -286 -62 -38 -15 -191 -153 -118 70 -286 -121 -147 41 54 -16 -100
8086a00N4P2J55k05J66k82r6L76j71O3J2J94j20j07m6J94k23r6K09k84L24p9L2
$$ -100 -46 26 181 -24 142 -140 -236 140 -31 32 44 238 118 11 -35 159 -64 -160 49 -235 89 10 42
8109D2j13M5J36l31Q0qO4J22l6n2K03j69j60Q6J76l83L52k19R1o5n4R1K83j33
$$ 42 -71 -26 110 -221 -141 -149 -85 37 1 -51 152 -17 -177 -91 85 -298 54 -165 -74 -139 -193 -102 181 48
8133D8k03J62k78N15j41o7J35j24r6Q1l0k89K1J73K91p7j36K16k46O7L7nr9J79
$$ 48 -155 7 -271 244 103 36 171 47 -49 32 2 -287 -266 -93 198 121 -15 201 -45 22 59 54 -45 134
8157A34k59J7J64k6m1K4J23j60J45j15j22J31j28J73l7k24M21k20P5p3N8q1n6
$$ 134 -125 -108 56 30 -11 13 136 -24 121 6 -116 15 -113 60 23 -201 220 0 75 2 60 -21 -77
8180g7J3N6j4K54j87J72j37j70j78L60k0
$$ -77 -64 -8 -22 232 45 217 80 -90 -268 92 72
8191G2
$$ Imaginary data points
##PAGE= N=2
##DATA TABLE= (X++(I..I)), XYDATA
0@%%%%%%%%%%%%qJ6j6J6k2L0l2M0m8N6p2Q1q9J05j29J52j71J95k24K56k91L31
$$ 0 0 0 0 0 0 0 0 0 0 0 0 0 -8 8 -8 8 -14 16 -16 24 -24 32 -40 41 -48 57 -72 80 -91 104 -120 136 -155 176
34A76l76M24m75N32n95O64p39Q21r12J011j118J233j360J501j654J823k008K212
$$ 176 -200 224 -251 281 -314 350 -389 432 -480 531 -587 646 -714 787 -867 956 -1052 1160
52A160k437K686k967L282l639M049m523N079n743O552p561Q859j0600J3067j6849
$$ 1160 -1277 1409 -1558 1724 -1915 2134 -2389 2690 -3053 3499 -4062 4797 -5803 7264 -9585
67i585K3425l7980J24686k8583j56268J97543j09744r690R6272j32899M7227J02466
$$ -9585 13840 -24140 100546 71963 -84305 113238 3494 -6196 90076 -42823 4404 106870
79A06870j76717Q4413M9661j17495R1895j6345p4437J01110m0286l0203P5860
$$ 106870 -69847 14566 64227 -53268 38627 22282 -52155 48955 8669 -21534 54326
90E4326q5940J5657P5108r6332L8610K2875m6403M6875l5898k3405Q1731o9834
$$ 54326 -31614 -15957 59151 -37181 1429 24304 -22099 24776 -11122 -34527 47204 -22630
102b2630j3007P7126q2423M4402L3068r9646P7683Q260q9418R5436j4976p7870
$$ -22630 -35637 41489 -40934 3468 36536 -63110 14573 22833 -66585 28851 13875 -63995
114f3995J06332o4203l1119J02663r4545J0085P8321r9368L8845N2160j00231
$$ -63995 42337 -21866 -52985 49678 -44867 -34782 43539 -55829 -16984 35176 -65055
125f5055Q4623R36r7302J16550k5020o5366R1227m5063k1090P6150q0885K0560
$$ -65055 19568 20504 -76798 39752 14732 -50634 40593 -4470 -25560 50590 -30295 -9735
137i735O3140r4515N2071J8461p0106O8155j7896n2202P4928m5058j9008Q3732
$$ -9735 53405 -41110 10961 29422 -40684 27471 9575 -42627 32301 -12757 -31765 51967
149E1967q8499R045P2395p7974K3957K8981n3027N6021j3650o4114R2341l0402
$$ 51967 -36532 -27487 44908 -33066 -9109 19872 -33155 22866 9216 -54898 37443 7041
161G041m7297P2486n1357L159N3327p1217K5096M8791q0783M7658K0504p0858
$$ 7041 -40256 32230 -19127 -15968 37359 -33858 -8762 40029 -40754 6904 27408 -43450
173d3450O9135j2106m3134N7779l4002q537N5879o8762J5166N8373p7173L6414
$$ -43450 25685 13579 -29555 28224 -5778 -14315 41564 -27198 -12032 46341 -30832 5582
185E582J8036n8270N9136j4536n0034P2805k6871l8344O7635n0978M106M9183
$$ 5582 23618 -34652 24484 9948 -40086 32719 5848 -32496 35139 -15839 -11733 37450
197C7450o4297L1894K4643o0005M8874N114n9027O8424k3194m0851O9501m6399
$$ 37450 -26847 5047 29690 -30315 18559 23673 -35354 33070 9876 -30975 38526 -7873
209g873r495N4861n4960Q187M2158n9383L3052J7901n8315N8042j2935l7983N7383
$$ -7873 -17368 37493 -17467 -9280 32878 -26505 6547 24448 -33867 24175 11240 -26743 30640
222C0640l2526j8794N7860m9847j35N2200o5364K6727K5890n7418M2369K921m2800
$$ 30640 -1886 -20680 37180 -12667 -12802 39398 -25966 761 26651 -30767 11602 14523 -28277
235b8277M5586j8411k5892N7879m7217k691N0875n6310J8692K7407n0396L5843
$$ -28277 17309 -1102 -26994 30885 -16332 -19023 31852 -24458 -5766 21641 -28755 7088
247G088J1502n4942N1426p654l9770N3205l1518r964M2053m2269P164L3752m9975
$$ 7088 18590 -36352 15074 7420 -32350 20855 -10663 -20627 21426 -20843 -13679 20073 -29902
260b9902K8297J9982n5226M9036m018l9364M9016j9297k1795M8240l5141q913
$$ -29902 -1605 18377 -36849 12187 8169 -31195 17821 -1476 -23271 24969 -10172 -19085
272a9085M5804m7046J6115K3281m4639L5179R67l8331M3714j0518l0725N1771
$$ -19085 26719 -20327 -4212 19069 -25570 9609 10576 -27755 15959 5441 -25284 26487
284B6487l2424j1728M7688m4175R689L0422m1592K1228J5432m2216L7460l904
$$ 26487 -5937 -17665 30023 -14152 -4463 25959 -15633 5595 21027 -21189 16271 12367
296A2367l3127M6862k8450j1506M1524l8331K133L6978m4559J6439K5495m8300
$$ 12367 -20760 26102 -2348 -13854 27670 -10661 -8528 28450 -16109 330 25825 -22475
308b2475L5422K930l5196L9539j3069k1281L7578k6178q580L8408m1745J3461
$$ -22475 12947 15877 -19319 20220 7151 -14130 23448 -2730 -11310 27098 -14647 -1186
320a186K3533m5526K9841P885l8234L4349j663l2372L9754j9330j3637L8003l4835
$$ -1186 22347 -23179 6662 14547 -23687 10662 8999 -23373 16381 -2949 -16586 21417 -13418
333a3418P471K4585l5721J7747J4716l6171L1588j531l2326M3636k2019j7004
$$ -13418 -5947 18638 -17083 664 15380 -20791 10797 9266 -23060 20576 -1443 -18447
345a8447L9389k7165n550L1590l1329P900K0746l7141K8930J793l1197L5300j2262
$$ -18447 20942 -6223 -11773 19817 -11512 -3612 17134 -20007 8923 10716 -20481 14819 2557
358B557k0251L4089k0706j0393L5818l6142O085K7472l8458J8819J2693k9809
$$ 2557 -17694 16395 -4311 -14704 21114 -15028 -8943 18529 -19929 -1110 11583 -18226
370a8226K2642K12k3726L2607j6283j2237L4710l0141L203K4627l0782J2516J6342
$$ -18226 4416 4628 -19098 13509 -2774 -15011 19699 -10442 -7239 17388 -13394 -878 15464
383A5464l2401K2006N819l1220L1198j0351j5840K7207j9904k884K1968k5758
$$ 15464 -16937 5069 10888 -20332 10866 515 -15325 11882 -8022 -10906 11062 -14696
395a4696P201J9293l2333K2269M537k8530K9470o116j9533K8392j1291j4448K8646
$$ -14696 -7495 11798 -20535 1734 6271 -22259 7211 1095 -18438 9954 -1337 -15785 12861
408A2861k1463P20K0995k6799J5292P802k4411K0354K900k2679K6199q567j5849
$$ 12861 -8602 -7882 13113 -13686 1606 9408 -15003 5351 8251 -14428 11771 3204 -12645
421a2645L0771k2662k670K4442k2989K541J7096k2790J1289P306k3615K4841q663
$$ -12645 18126 -4536 -7206 17236 -5753 -3212 13884 -8906 2383 9689 -13926 10915 2252
434B252j4503K5532j6661o072K3019j9219R65K0471k6760J3781J1165k5044K0228
$$ 2252 -12251 13281 -3380 -9452 13567 -5652 -4687 15784 -10976 2805 13970 -11074 9154
447I154J010j6432J6712n302j0118K1001j8286J93K0201k6312R731J1433k1183
$$ 9154 10164 -6268 10444 5142 -4976 16025 -2261 -2068 18133 -8179 1552 12985 -8198
460h198J2208O253k1031J8962j643j8631K4033j1648o763J7703j5246J342J2672
$$ -8198 4010 10263 -10768 8194 6551 -12080 11953 305 -6458 11245 -4001 -2659 10013
473A0013j8664Q847J0122k3807J9441j147j8952K2189q170j0759J9750j1948o412
$$ 10013 -8651 196 10318 -13489 5952 4805 -14147 8042 -128 -10887 8863 -3085 -9497
486i497J9901j8808N502J1461j9979J4768k13j4758J6937m988j2725K1510j3626
$$ -9497 10404 -8404 -2902 8559 -11420 3348 3135 -11623 5314 326 -12399 9111 -4515
499d515p051K1615k0286M057J2789j7231P778P910j6625J2403K220j3658J8039
$$ -4515 -11566 10049 -10237 -6180 6609 -10622 -2844 5066 -11559 844 3064 -10594 7445
512G445j0065m012J6436j4206l28J4910j4562K888J2156j9667J2137M899j6519
$$ 7445 -2620 -6632 9804 -4402 -4730 10180 -4382 -1494 10662 -9005 3132 8031 -8488
525h488J4438j425r875J2035n553n970J6088j3974J680J2710j8417J0036N659
$$ -8488 5950 4525 -5350 6685 1132 -4838 11250 -2724 -1044 11666 -6751 3285 8944
538H944j5949J2181K834j6285J5858m222j1697J8436j2756j238J1519j3356M643
$$ 8944 -7005 5176 8010 -8275 7583 3361 -8336 10100 -2656 -3894 7625 -5731 -1088
551a088P672j5107J0429M111j6735J7782o383j0268J7792r520m931J3878j0283
$$ -1088 6584 -8523 1906 6017 -10718 7064 681 -9587 8205 -1315 -6246 7632 -2651
564b651j725J2675j4992P324O046j3485J0840j950p649J1939m632q052J5990r954
$$ -2651 -4376 8299 -6693 631 6677 -6808 4032 2082 -5567 6372 1740 -6312 9678 -276
578b76l889J4356j3781M370Q419j2960N144O264j2105Q840K20j0012J4562r273
$$ -276 -4165 10191 -3590 780 9199 -3761 1383 7647 -4458 4382 4602 -5410 9152 -121
592a21l951J2516j1061P75J0727j3563M333R916j7390J1300K233j2134J2638m063
$$ -121 -4072 8444 -2617 -1842 8885 -4678 -345 9571 -7819 3481 5714 -6420 6218 2155
606B155o823J1042p490l132J2753j4310M406P977j5192J0362J074j1535J2071
$$ 2155 -4668 6374 -1116 -4248 8505 -5805 -1399 6578 -8614 1748 2822 -8713 3358
619C358j817j2002J4530n390o694J3035j0664K122O941j0528N158M199j0732R183
$$ 3358 1541 -10461 4069 -1321 -8015 5020 -5644 -3522 3419 -7109 -1951 2248 -8484 699
633F99R19j2516J4747n921o323J1958p887j090J0614j0507j84J1324j2542O722
$$ 699 1618 -10898 3849 -2072 -8395 3563 -4324 -5414 5200 -5307 -5491 5833 -6709 13
647A3K499r470J1203m216o960J2077n076o721J4010j1572j66J2059j3978N924
$$ 13 2512 -6958 4245 29 -6931 5146 70 -6651 7359 -4213 -4379 7680 -6298 -374
661c74N536j0778O628L200j0587J0266j803o818J1886r425N49R280j0785K548
$$ -374 5162 -5616 1012 4212 -6375 3891 2088 -4730 7156 -2269 -1720 7560 -3225 -677
675f77P954j0955N152M978j3021J1363j268p806R753m615l488Q112o491n70R157
$$ -677 7277 -3678 1474 6452 -6569 4794 3526 -4280 5473 858 -2630 5482 -1009 -1579 7578
690G578j1441N820M172j1942J0049K05q961R150j916q596J2531p326m305J2379
$$ 7578 -3863 1957 6129 -5813 4236 4441 -4520 4630 2714 -5882 6649 -677 -4982 7397
704G397j0844K250N258q841N792K714j0874J0520l53j1046J3705o812m315J1122
$$ 7397 -3447 -1197 4061 -4780 1012 3726 -7148 3372 3019 -8027 5678 -1134 -5449 5673
718E673q311j283R509j0320K155Q326j2496Q068J574q391R559n080m153J1306
$$ 5673 -2638 -3921 5588 -4732 -2577 5749 -6747 1321 2895 -5496 4063 -1017 -5170 6136
732F136p036m182J2549j1055J509Q228j1501P375K444r745P323J346q928J0381
$$ 6136 -900 -5082 7467 -3588 -2079 6149 -5352 2023 4467 -5278 2045 3391 -5537 4844
746D844m526m547J0698j0260K608O871j1144N185O503j2510P256L826j1984J2001
$$ 4844 318 -4229 6469 -3791 -1183 5688 -5456 -271 6232 -6278 978 4804 -7180 4821
760D821m240n494J0862p051k951R046q133J226P856j2857Q422J967j1493J1047
$$ 4821 581 -4913 5949 -1102 -4053 4993 -3140 -1914 5942 -6915 1507 3474 -8019 3028
774C028j972p727J0496m534o397J2165q810n82R365j1522N427L387r016P434M56
$$ 3028 1056 -6671 3825 -709 -7106 5059 -3751 -4333 5032 -6490 -1063 2324 -6692 742 1198
789A198q898J1481m374p366J3891r642p80R691r490K106P214j0412M977N570j1335
$$ 1198 -7700 3781 -593 -7959 5932 -3710 -4490 5201 -4289 -2183 5031 -5381 -404 5166 -6169
804f169J0146k111o445J0435o863j937R952q423o66J0408j2849M959O011j1097
$$ -6169 3977 1866 -4579 5856 -1007 -2944 7008 -1415 -2081 8327 -4522 437 6448 -4649
818d649Q517K47q082Q837k068o751J1034p286j428R290j1321N332M620j0587P082
$$ -4649 3868 4115 -3967 4870 2802 -3949 7085 -201 -1629 7661 -3660 1672 6292 -4295 2787
833B787K841j1154R657n00r527J2312o992k930R614q909O91P263r710M684N060
$$ 2787 5628 -5526 4131 3631 -5896 6416 -576 -3506 6108 -2801 -2110 5153 -4557 127 5187
848E187j2058J0263j603q917J2208n352n246J0440p096l251J1038j0798L006O621
$$ 5187 -6871 3392 1789 -7128 5080 -272 -5518 4922 -2174 -5425 5613 -5185 -2179 4442
862D442j1516Q019K78q036R150k107p145J1516p322l005J1509j1164K943P269
$$ 4442 -7074 945 1223 -6813 2337 230 -6915 4601 -2721 -5726 5783 -5381 -2438 4831
876D831j0452M860M281r869P843N28q294J1409o495k940R904q746J038Q200j0401
$$ 4831 -5621 -761 3520 -6349 1494 2022 -6272 5137 -1358 -4298 5606 -3140 -2102 6098 -4303
891d303L734O836j2714R311J205r807J0624l748n396R457n880k916R964j0095
$$ -4303 -569 6267 -6447 2864 4069 -5738 4886 1138 -4258 5199 -681 -3597 6367 -3728
905c728K837O572j2340Q810J242r271R253j287q288J1148n508m583J1866r962
$$ -3728 -891 5681 -6659 2151 3393 -5878 3375 2088 -6200 4948 -560 -5143 6723 -3239
919c239J688O577r363M619L489r230Q330j88r123J1741o018m760J1201p975q76
$$ -3239 -1551 5026 -4337 282 3771 -5459 2871 2683 -6440 5301 -717 -5477 5724 -2251 -3127
934c127P995r098K349O881j1189P203J998r056R417l783m498R713o150l181J0506
$$ -3127 4868 -4230 -1881 5000 -6189 1014 3012 -6044 3373 -410 -4908 4805 -1345 -4526 5980
949E980r758J706Q091j1481O748L332r447P486K97p506R755l787n253J1374r405
$$ 5980 -3778 -2072 6019 -5462 1286 4618 -4829 2657 2954 -4552 5203 1416 -3837 7537 -1868
964a868J405P033r826M952M538j0797P572K084j0294J0872l614n369R736p400
$$ -1868 -463 6570 -3256 1696 6234 -4563 3009 5093 -5201 5671 2057 -3312 6424 -976
978i76j149P724p796J652O125r859O540J533r347J0041l065o178R392m451m658
$$ -976 -2125 5599 -2197 -545 5580 -4279 2261 3794 -5553 4488 1423 -4755 4637 186 -4472
993d472R887q273P7Q400j0813M808L525q588O714r7p117R044l644o015J1475q645
$$ -4472 5415 -2858 -2781 5619 -5194 -386 3139 -5449 1265 1168 -5949 3095 -549 -6564 4911 -3734
1009c734n64Q978j0022L124N639r572N626L408r820R950l094o155J0777p040j085
$$ -3734 -4298 4680 -5342 -2218 3421 -6151 -525 2883 -6937 3013 -81 -6236 4541 -2499 -3584
1024c584Q279q371J959P464j1694O877L926j0736R625j837o005Q812m484l497
$$ -3584 4695 -3676 -1717 5747 -5947 930 4856 -5880 3745 1908 -4097 4715 231 -3266
1038c266R215p537Q3P490j0029N688K626q579P511K92p907Q517j951o518J0255
$$ -3266 5949 -1588 -1505 5985 -4044 1644 4270 -4309 3202 3494 -4413 4104 2153 -4365 5890
1053E890o870r11P484q501K405M750p766M763K555r275R099k489o715J0303n743
$$ 5890 -980 -1891 5593 -2908 -503 4247 -3519 1244 3799 -5476 3623 1134 -5581 4722 -1021
1068a021k488Q246p486J78P685r811M268M270r526Q403j714o221Q863m250l440
$$ -1021 -3509 4737 -2749 -2571 5114 -4697 -429 3841 -5685 2718 1004 -5217 3646 -604 -4044
1083d044Q701p270o13Q731j0802M949M433r174O575J042p100P684k149n515R809
$$ -4044 4657 -2613 -3226 5505 -5297 -348 4085 -5089 1486 2528 -4572 3112 963 -4552 5257
1098E257o649j155P767q449L386M356q159M767K982q680P917q79o382Q744m766
$$ 5257 -1392 -2547 5220 -3229 157 4513 -3646 1121 4103 -4577 3340 2461 -3921 4823 57
1113E7k228O920n979O0O242p713L110L723q493P601j159o463Q519l146m727Q479
$$ 57 -2171 4749 -1230 -1170 5072 -2641 469 4192 -4301 3300 2141 -4322 4197 1051 -3676 4803
1129D803n892k141Q506q824L137M152q187N731O28o621P507j847n899R011n899
$$ 4803 -1089 -3230 5276 -3548 -411 3741 -4446 1285 1913 -4708 2799 952 -4947 4064 -1835
1144a835k109Q356q235J994N074p990L861L589q011P005o89o231Q286m776k062
$$ -1835 -3944 4412 -3823 -1829 3245 -4745 -884 2705 -5306 1699 1010 -5221 3065 -1711 -3773
1159c773P296o094K96O164p833L053M558q917O742K68o126P075k498l928P182
$$ -3773 3523 -2571 -2275 3889 -3944 -891 3667 -5250 1492 1760 -4366 2709 211 -3717 3465
1174C465m478j374P097p726K563M229p882O027R22o568O681j139n684Q517m753
$$ 3465 -1013 -2387 4710 -3016 -453 3776 -4106 1921 2843 -3725 2956 1817 -3867 4650 -103
1189a03k291P650p264J817M376o928L630K821p201O119m74o250Q709m644k457
$$ -103 -2394 5256 -2008 -191 4185 -2743 887 3708 -3493 2626 2152 -4098 4611 -33 -2490
1204b490O917n717l43O017o912K250M173p723N630O7n711O548k533l392O709m482
$$ -2490 4427 -1290 -1633 4384 -2528 -278 3895 -3828 1802 1869 -3842 2706 173 -3219 3490 -992
1220i92j650O657p024J970M658p962M855J270n875N351q8m995O568l401k291O719
$$ -992 -2642 4015 -3009 -1039 3619 -4343 512 1782 -4093 1258 1170 -3825 2743 -658 -2949 3770
1236C770o429J615L987o070K836L124o892N447M76o035P266l034k731O070m880
$$ 3770 -2659 -1044 2943 -3127 -291 2833 -4059 1388 1864 -4171 3095 61 -2670 3400 -1480
1251a480l45N278n471J573L739o687M717M66n349O460k334l385O096l486k419
$$ -1480 -1825 3453 -2018 -445 3294 -3393 1324 1790 -3559 2901 567 -2818 3278 -208 -2627
1266b627O617n801R38M178o475L975J299m833M495k88m812O218l107k575O731
$$ -2627 3990 -1811 -873 3305 -3170 805 2104 -2729 1766 1478 -3334 2884 -223 -2798 3933
1281C933o124R40M395n835J989K954n729L926J109n268N989k621k681N388l889
$$ 3933 -2191 -1251 3144 -2691 -702 2252 -3477 449 1558 -3710 2279 -342 -3023 2365 -1524
1296a524m00M392m656Q93L644o181M519J153n656N590j513l197M714k080j970
$$ -1524 -1924 2468 -2188 -1295 2349 -3832 687 1840 -3816 1774 261 -2936 1778 -302 -2272
1311b272N291n089Q17M173o102L716J289m605M238m8m132N456k391k744N988m584
$$ -2272 3019 -2070 -1253 2920 -3182 534 1823 -2782 1456 1408 -2724 2732 341 -2403 3585 -999
1327i99O8L843m474J676K458m528L296P35m831N783k350k668N355l654j006M207
$$ -999 -931 2912 -1562 114 2572 -1956 1340 2075 -2756 3027 677 -1991 3364 -290 -1296 2911
1343B911m085O26L964n493L037J074m367M320j278k594M106k048k006M699m257
$$ 2911 -1174 -548 3416 -2077 960 2034 -2333 1987 709 -1885 2221 173 -1833 2866 -1391
1358a391N04L531m968K676J414m300L285L31l703M200j424k485M741l965J59L589
$$ -1391 -887 2644 -2324 352 1766 -2534 751 1082 -2621 1579 155 -2330 2411 -1554 -1395 2194
1374B194m290J634K278m444K787J173m580M710q70l298M686k900r03L338k816
$$ 2194 -2096 -462 1816 -2628 159 1332 -3248 1462 592 -2706 1980 -920 -1823 1515 -1301
1389a301J21L241m531K789J198m462M391j073k640M145j912j988M298l242k27
$$ -1301 -1180 2061 -2470 319 1517 -2945 1446 373 -2267 1878 -34 -2022 2276 -966 -1193
1404a193L677m497K267J387l544K455L97k802L542j410k226M461l102l85L343
$$ -1193 2484 -2013 254 1641 -1903 552 949 -1853 1689 279 -1947 2514 -588 -973 2370
1419B370l442O33K332l512J981J385l764L391o56k718L967k512m69K903k557l99
$$ 2370 -1072 -439 1893 -1619 362 1747 -2017 1374 718 -2000 1967 -545 -1014 1889 -668 -1067
1435a067L325m047J838J703m089L209k39k601L101j104j700K968k124m62L313
$$ -1067 2258 -1789 49 1752 -2337 872 633 -1968 1133 29 -1671 1297 -827 -1289 2024
1450B024m096K027J090k992K634J38k751L037p71k460M065k196q79K568k664Q34
$$ 2024 -2072 -45 1045 -1947 687 825 -1926 1111 340 -2120 1945 -251 -1130 1438 -1226 -392
1466c92J751k522J241J115k898K803l96k259L291k015o29K314j703m40K631k582
$$ -392 1359 -1163 78 1193 -1705 1098 702 -1557 1734 -281 -910 1404 -299 -739 1892 -690
1482f90N78J943k992J775M62j911K043q67j235K754j869j117L230k860O74J945
$$ -690 -112 1831 -1161 614 1076 -835 1208 341 -894 1860 -9 -1126 2104 -756 -82 1863
1498A863l153J920M52k525K331K77k658L099k117o18K494k246N65J399k049P91
$$ 1863 -1290 630 1082 -1443 888 1165 -1493 1606 -511 -1129 1365 -881 -316 1083 -966 -175
1514a75J182k477J888L5k356K709j235r19J870j227n53K276k084N09J289k540
$$ -175 1007 -1470 418 453 -1903 806 -429 -1348 522 -705 -1258 1018 -1066 -557 732 -1808
1530a808K146j28j459J772l91j515J898o21j375K486j863J32J476j776P64Q43
$$ -1808 338 210 -1249 523 132 -1383 515 -106 -1481 1005 -858 -726 750 -1026 -262 581
1546E81j423Q31P98k202K364p95j295K191j448o9J396j460K72J628k241J234P57
$$ 581 -842 -11 787 -1415 949 154 -1141 1050 -398 -467 929 -531 -259 1369 -872 362 1119
1563A119k322K439p06j216J873j121o91J991j636j23J554k120J575M32k033J570
$$ 1119 -1203 1236 530 -686 1187 66 -625 1366 -270 -393 1161 -959 616 1048 -985 585
1579E85K1j355J549l27j405K108j348j43J382j669O41N16j295L80J031j932J795
$$ 585 606 -749 800 473 -932 1176 -172 -315 1067 -602 39 555 -740 -360 671 -1261 534
1596E34q7j446J749j151l88J135q58k89J548j370j0J454k032J535k80j213J658
$$ 534 447 -999 750 -401 -789 346 -512 -801 747 -623 -633 821 -1211 324 44 -1169 489
1613D89m97r90J652p70o97J958k185J082M65j625J427L9j019J152j78j498J943
$$ 489 -8 -998 654 -116 -813 1145 -1040 42 507 -1118 309 348 -671 481 303 -1195 748
1630G48j012l09J489j485L72P11r72P9J379j646J010M04j380J287p35kN74m07
$$ 748 -264 -573 916 -569 -197 514 -458 -379 1000 -646 364 768 -612 675 -60 -62 512 105
1648A05m30J196j163J90J070j582J014Q6r62Q01k4j021J028k6j132J492j322L18
$$ 105 -325 871 -292 -102 968 -614 400 486 -476 325 301 -720 308 282 -850 642 -680 -362
1666c62P74j135M93O15q93K33M07j219J394l51q64J341o57k36P43p04k20J237
$$ -362 412 -723 -230 385 -508 -275 132 -1087 307 -44 -908 433 -224 -460 283 -421 -641 596
1684E96j088L11O85j439J159j34p38P21K72q41J183p74m35J285j362O88M99j139
$$ 596 -492 -181 504 -935 224 90 -648 73 345 -496 687 -87 -522 763 -599 89 588 -551
1702e51O50N83r62M81L48j146J442p30l81J165p88n6Q59j094K20J278j623N90
$$ -551 99 682 -280 201 549 -597 845 115 -266 899 111 55 914 -180 40 1318 -305 285
1720B85M76j456J441l20p29R79n25p37J560j204K25R52j647J003N7p99R11J33
$$ 285 761 -695 746 426 -303 676 151 -586 974 -230 -5 947 -700 303 360 -439 472 605
1738F05j005J006m23r19J491j430L51R85j409P49Q5q49K69Q73j358J213m54m10
$$ 605 -400 606 183 -736 755 -675 -324 661 -748 1 86 -763 -494 379 -979 234 -220 -630
1756f30J161q49m01J088q03j59J256j371L74M41q69J009j0j153J154k27p04J175
$$ -630 531 -318 -719 369 -434 -593 663 -708 -334 107 -762 247 237 -916 238 11 -693 482
1774D82p22l43J345j394N55M99r82O68M72j149P55K96j058J622j296n5J083j114
$$ 482 -240 -583 762 -632 -77 422 -560 108 580 -569 186 482 -576 1046 -250 -305 778 -336
1792c36K14R90r34j2J189j676J127m3j217J284n10n32J159q07k86J523j503L05
$$ -336 -122 868 -66 -78 1111 -565 562 519 -698 586 76 -456 703 -104 -390 1133 -370 -65
1810f5Q91j839J227K50j223Q74J74j072J204l84r11J721j576M62Q02j233N13O27
$$ -65 826 -1013 214 464 -759 115 289 -783 421 37 -874 847 -729 -267 535 -698 -185 442
1828D42j147O05M52j435J682o76r99J654q70k05J227r31l81J329j623R85N14j444
$$ 442 -705 -100 352 -1083 599 -77 -1076 578 -292 -497 730 -201 -582 747 -876 109 623 -821
1846h21J650p15n94J061o37n38J508j353R9J390j800R33L97j058J045lj159J516
$$ -821 829 114 -480 581 -56 -594 914 -439 -340 1050 -750 183 580 -478 567 564 -595 921
1864I21n08q17J641j371J46J298j567K62Q76j511J009P58j761J400p67n17J479
$$ 921 413 -404 1237 -134 12 1310 -257 5 881 -630 379 1137 -624 776 9 -508 971
1881I71r79l33R34o63k28J184j612R42M57j544J198j67j089J099l61n20J243j096
$$ 971 -8 -341 593 -70 -298 886 -726 216 673 -871 327 160 -929 170 -191 -711 532 -564
1899e64j85J452j633P99O13j486J071J56j411J414j59j053J489j089j71J340j278
$$ -564 -749 703 -930 -131 482 -1004 67 223 -1188 226 67 -986 503 -586 -757 583 -695
1916f95M41M91j054P97N67j751J743l32j138J760j084k73J151o38k50J371j535
$$ -695 -254 237 -817 -20 547 -1204 539 207 -931 829 -255 -528 623 -15 -265 1106 -429
1933d29L92Q10j721J683n29p63R83j41o71J412p91m88J432j785O99Q44j358N70
$$ -429 -37 773 -948 735 206 -557 426 285 -386 1026 235 -253 1179 -606 93 937 -421 149
1951A49P17j541J191O9j548J987j190j49J379j232Q6Q98j398O12Q27k069J362
$$ 149 866 -675 516 585 -963 1024 -166 -315 1064 -168 -82 816 -582 30 857 -1212 150
1968A50J18j275J502o81k92J140r41l75J394j492L14Q95j771J657l03j223J336
$$ 150 268 -1007 495 -186 -478 662 -279 -654 740 -752 -438 457 -1314 343 40 -1183 153
1985A53j42j093J865j232l94J736j804P93O85j426J245Q8j263J128Lj394J748
$$ 153 11 -1082 783 -449 -843 893 -911 -118 567 -859 386 474 -789 339 342 -1052 696
2002F96n40r35J776j414K66Q16j143N59R31j636J352o9j439J828r16o75J499q58
$$ 696 156 -779 997 -417 -151 665 -478 81 1012 -624 728 659 -780 1048 132 -543 956 98
2020I8q52J793j482L68J386k045J195J84j493J486n07o90J281q10p34J948j743
$$ 98 -754 1039 -443 -75 1311 -734 461 645 -848 638 131 -559 722 -88 -822 1126 -617
2037f17L72P83j377R90K96j282Q58K70j298J427o50p05J610j269L8Q74p66J71
$$ -617 -245 538 -839 151 447 -835 23 293 -1005 422 -228 -933 677 -592 -554 320 -446 -275
2055b75P95j512J097K95j430J504o05o50R93o79k73J448j179q7J352j631J093
$$ -275 520 -992 105 400 -1030 474 -131 -781 212 -467 -740 708 -471 -558 794 -837 256
2072B56L25j371J052O7j165J466n22p33J593j264L68J038j610O59N68j107J070
$$ 256 581 -790 262 329 -836 630 108 -625 968 -296 72 1110 -500 159 727 -380 690
2089F90n6j540J647o87o20J861j631K52J001j133J30J013j778J114J51j183J519
$$ 690 634 -906 741 54 -566 1295 -336 -84 917 -216 -86 927 -851 263 414 -769 750
2106G50p25q46J551q80k39J047j126K18Q99j644J251K61j498J505o31n12R37n01
$$ 750 25 -821 730 -150 -389 658 -468 -250 649 -995 256 517 -981 524 -107 -619 318 -183
2124a83p20J561j170l9J323j682Q08M62j254J026N1j287J106R5j227J876j255
$$ -183 -903 658 -512 -551 772 -910 -102 360 -894 132 183 -1104 2 97 -1130 746 -509
2141e09J89R58j227K82R35j410R49N66j606J816m54j011J367q49m69J078r59J27
$$ -509 -320 638 -589 -307 628 -782 167 733 -873 943 489 -522 845 -4 -473 605 -354 -227
2159b27J279j900Q78P89j323J425n93o72R56m65p87J678j315r3J121j347O07L46
$$ -227 1052 -848 30 819 -504 921 328 -344 612 147 -640 1038 -277 -370 751 -596 11 357
2177C57j020R89K09j111J219l81r60J612j085j84R39j031K58P41j330Q65K27j386
$$ 357 -663 326 535 -576 643 262 -698 914 -171 -355 584 -447 -189 552 -778 87 314 -1072
2195a072J510m00o96R84n67k81R52p81l32J269j548Q34M39j152Q74j95n09R52
$$ -1072 438 38 -658 326 -241 -522 430 -351 -683 586 -962 -128 311 -841 33 -162 -671 281
2213B81l92o73J349q81j58J403j318O00N20j365P43J95p98J260m77q04J380j249
$$ 281 -111 -784 565 -316 -474 929 -389 211 731 -634 109 304 -494 766 289 -515 865 -384
2231c84K13J133q75m4O65j061M85M93j352J437r5j149J082l60q15J413q27n1P76
$$ -384 -171 962 87 43 708 -353 132 625 -727 710 615 -534 548 188 -627 786 -41 -92 684
2250F84j196M50P66j308J189m93n61Q23k75m68J142q18n05J390j360O48K92j040
$$ 684 -512 -62 704 -604 585 92 -469 354 79 -389 753 -65 -570 820 -540 108 400 -640
2268f40N72L07r76P54k2p17J184q61j63J017j042K08P88r74L68N22j100J198l66
$$ -640 -68 239 -737 17 -5 -722 462 -399 -562 455 -587 -379 409 -565 -197 325 -775 423 57
2287E7p99J258o54l18R68p44j23J004j163L33O67j142Q56O6j074J322n29k14Q56
$$ 57 -742 516 -138 -456 512 -232 -355 649 -514 -181 486 -656 200 266 -808 514 -15 -229 627
2306F27n87l74J023r95N75N37j182N45L60q33O86J45j031J218q40j19R16r62L22
$$ 627 40 -334 689 -306 269 806 -376 169 529 -304 382 527 -504 714 -126 -245 671 -291 31
2325C1O13j051K78P15j178J039k81q26J056l18n10P07n77r2J012j156L23O91r34
$$ 31 644 -407 -129 586 -592 447 166 -660 396 78 -432 275 -302 -394 618 -538 -215 476 -458
2344d58N80k37n04R55k47n03P71l62o11J389j393P39N5p86O09J80p69O98J59r28
$$ -458 122 -115 -619 336 89 -414 357 -5 -616 773 -620 119 174 -612 -3 177 -592 106 265 -663
2364f63J167n49o6O29q75K03O87p77K40N10o61M10L0p46J179p83l07Q46n54j90
$$ -663 504 -45 -111 518 -357 -154 533 -244 -4 506 -155 255 285 -461 718 -65 -372 474 -80 -270
2384b70Q99j009J76J213j508J008k22p15P79m36k68Q37l05l12M78o87K63P72q20
$$ -270 629 -380 -204 1009 -499 509 287 -428 351 -85 -353 484 179 -133 345 -342 -79 693 -127
2403a27J00J92n97O47r1o66Q37l93m12N66o40O80J63n97K41L61q22N47L47o06
$$ -127 -27 165 -432 215 124 -542 295 -98 -510 56 -584 96 259 -338 -97 264 -558 -11 336 -270
2423b70O13p61J58P13m76l44O93n28J31N28q21O49k11m75O92l6n88N92l13k17
$$ -270 343 -418 -260 453 -23 -367 326 -202 -71 457 -364 285 74 -401 291 255 -333 259 -54 -271
2443b71M80l94K06N24q88O5M63m39M99N3o04P12k31n86Q65p14J68O67p83Q0N37
$$ -271 209 -185 21 545 -343 -278 185 -254 245 298 -306 406 175 -411 454 -260 -92 575 -208 -128 409
2464D09q65O25K23p41R61l98m78L58j44p1L54j98r5M02q65N71J76m78M68k29k57
$$ 409 -456 169 392 -349 612 214 -264 94 -50 -121 233 35 -60 342 -523 48 224 -254 214 -15 -272
2485b72M17j28m73O57m29N3L47n46K38M5n6J41Ll72P12k55l63P19n91L7L04l83
$$ -272 145 17 -456 201 -228 -175 172 -374 -136 -91 -147 -6 -3 -375 337 82 -281 438 -153 -116 188 -195
2507a95lO10o96L63o8k73O41n28J57K08j63k25L94n24K13N15p48L20L99p57O55
$$ -195 -198 412 -284 79 11 -262 379 -149 8 216 53 -172 222 -302 -89 426 -322 -2 397 -360 295
2528B95j57l30K43k0l25M72k16j53N17k31K7J50m64M02R2n73N19R5l46K96j86
$$ 295 138 -192 51 31 -294 178 -38 -191 326 95 122 272 -192 210 302 -271 248 343 -3 293 107
2549A07k1K01l09P6J12j23j57L17n62O24j85k09L35j16l56M84l02l04P46o06L55
$$ 107 86 287 -22 54 166 43 -114 203 -359 265 80 -129 206 90 -266 218 -84 -388 358 -248 107
2570A07m2l17L95k01k19J45K0M7K49n43K76J10j56jJ87k60K42M1m74O07k76j12
$$ 107 65 -252 143 -58 -277 -132 -112 -65 184 -359 -83 27 -129 -130 57 -203 39 80 -394 213 -63 -175
2592a75L42k71O1J16j51J03o0J16j86J25j42J43j59n9M67j98j56K70o0j86L47
$$ -175 167 -104 -43 73 -78 25 -35 81 -105 20 -122 21 -138 -197 270 72 -84 186 126 -60 287
2613B87n00L89M1m28K34j49J60j20L26l43K86j08Q2J33m19L09J0j92K0K16j81
$$ 287 -213 176 217 -211 23 -126 34 -86 240 -103 183 75 157 290 -129 180 190 -2 18 234 53
2634E3mJ72n09N00l09k1M91n20P1K5j43J33J40n81M99o7j44L65j36j5j27J71k64
$$ 53 49 221 -288 212 -97 -118 373 -147 -76 -51 -194 -61 79 -502 -3 -70 -214 151 15 0 -127 44 -220
2657b20L51m31L89r7j52J93o9l3J24L2l19L30mk42K77l68L09M8j21J58m1j09L6
$$ -220 131 -300 89 -8 -160 33 -36 -69 55 87 -232 98 94 -148 129 -239 70 118 -3 155 114 5 41
2680D1L8l33N75k09o2K11k25k62K37O4m9Q3l05N0K71k92M34l7l11K25k30J00J06
$$ 41 79 -254 321 112 50 261 36 -226 11 75 26 109 -196 -146 125 -167 267 230 -81 144 -86 14 120
2703A20J59k60n2K1K52j97Jo7K5j15L13k84K7q7M0Q7j1J47n6k23K69m79N81k92
$$ 120 279 19 -33 -12 240 43 44 -23 2 -113 200 -84 -57 -144 -104 -17 -28 119 63 -160 109 -370 211 -81
2727h1J91k28L05M3j50k52J07k2k45M12l30J46K85j24J34l89J6P6N8J4K4p4J6
$$ -81 110 -118 187 230 80 -172 -65 -87 -332 80 -250 -104 181 57 191 -198 -182 -106 -48 -34 -10 -84 -68
2750f8P0j23L36j68p9Q8j65J84k0L64l78L7k4k64L81o7j12L2l4J25j9j05N4k03
$$ -68 2 -121 215 47 -32 56 -109 75 55 419 41 78 54 -210 171 104 -8 24 -10 115 96 -9 45 -158
2774a58K18K40l98L09k95J64j47L01m39J12M19m85J20n9L56l25m9j66j6L51q5
$$ -158 60 300 -98 211 -84 80 -67 234 -205 -93 326 -159 -39 -98 258 -67 -116 -282 -298 53 -32
2795c2K91l11k46p0L79j25M8r2M1N0p0J63k01J3J05r3j73K53j2j17K21k33P2O0
$$ -32 259 -52 -298 -368 11 -114 -66 -158 -117 -67 -137 26 -175 -162 -57 -150 -323 -70 -82 -199 22 -211 -139 -79
2819g9j36J85K3Oj47N32l96o7Q7j96L88k02N0J12r2J06j11j91qm5J31J51J98j57
$$ -79 -215 -30 -7 -1 -148 384 -12 -79 8 -188 200 -2 48 160 68 174 63 -128 -136 -181 -50 101 299 142
2843A42o9l7j01L64k21n0J90l53K39J61l01R4J7k70K40m2k42L08k28j6L91l92
$$ 142 73 36 -65 299 78 28 218 -135 104 265 -36 58 75 -195 45 3 -239 69 -159 -175 216 -176
2865a76R3J73J21k94K65n63M69k01J33J01j33OP5nk90M24k25J14J74l14pN5l60
$$ -176 -83 90 211 -83 182 -381 88 -113 20 121 -12 -6 69 64 -226 198 -27 87 261 -53 -60 -5 -365
2888c65L41K28l50K29r2k28L30l49J60N09n07K29j32N6j5J97j42j62J30k37P49
$$ -365 -24 204 -146 83 -9 -237 93 -256 -96 413 -94 135 3 59 44 241 99 -63 67 -170 579
2909E79n67k2N3k6q5K22j43K46K0o53M40jm08K97L3J00J12l23O7K61l85L79N5
$$ 579 12 -10 43 17 -68 154 11 257 277 -376 64 63 -345 -48 -15 85 197 -126 -59 202 -183 196 251
2932B51m80K85N3l66L87j7l30J98j0k4K5J91k17O8m63J11L57l26J66oJ5J87R6
$$ 251 -229 56 109 -257 130 113 -217 -19 -29 -53 -28 163 -54 14 -449 -338 19 -307 -141 -147 -132 55 151
2955A51l56K32j16q1L91k17L02l32k61L40m9l03L44K2j45j8M6j65J95j59K10j37
$$ 151 -205 27 -89 -170 221 4 306 -26 -287 53 4 -299 45 67 -78 -96 -50 -215 -20 -179 31 -106
2977a06k85O41j67l9K0Rm6J87k61k5M35l06N3L4l16J93J93j78K75k06l31M58k16
$$ -106 -391 250 83 44 64 73 27 214 -47 -72 363 57 110 144 -172 21 214 36 311 105 -226 232 16
3000A6l22O98k51j40j12J89j30J78m02M02L7k40J54j01j8J93k20r0M31n08l7L18
$$ 16 -306 392 141 1 -111 78 -52 126 -276 126 163 -77 77 -24 -42 151 -69 -159 272 -236 -273 45
3022D5j08K0J15l90L56q9l44P56k16l78K31L8j53j5j74K72J97m19L68R7l01M74
$$ 45 -63 -43 72 -318 38 -51 -395 361 145 -233 -2 36 -117 -132 -306 -34 163 -256 112 209 -92 382
3044C82m07k59M50j67l0L24j48l08L82m46N52l09k17N75l49l2K54k13q5J42k29
$$ 382 -25 -284 166 -1 -31 293 145 -163 219 -227 325 16 -201 374 25 -7 247 34 -51 91 -138
3065a38J21J80k57J64PJ02o8p5n4rLo1L47n51P2L37j77J42K91p04L77j21k15N73
$$ -138 -17 163 -94 70 77 179 111 36 -18 -27 -24 -85 262 -289 -217 120 -57 85 376 -328 49 -72 -287 286
3089B86n41K20J88k84J92k85LJ43J91m43J73K78l05K73o7m34J68Q5r1L94l61K31
$$ 286 -255 -35 153 -131 61 -224 -221 -78 113 -330 -157 121 -184 89 22 -412 -244 -159 -250 144 -217 14
3111A4J04k97Q8K24k35Q3M7k16K91j20QR6k60K5K43m14R4J90J02KM6k66L94m4
$$ 14 118 -179 -91 133 -102 -19 28 -188 103 -17 -9 87 -173 -148 95 -319 -225 -35 67 69 115 -151 243 199
3135A99k69L25l71qK76l24l8M08j67j87L96l68L07j39j90L4J78l11M54l56P8J38
$$ 199 -70 255 -116 -124 152 -172 -210 198 31 -156 240 -128 179 40 -150 -116 62 -249 205 -151 -73 65
3157F5k31J24J97k68L30k20k52K39o3j33M30j67q4Q9m32K50J80j91R5J99m95J36
$$ 65 -166 -42 155 -113 217 -3 -255 -16 -79 -212 218 51 -33 56 -376 -126 54 -137 -42 157 -338 -202
3179b02r6L69n7j24P7J84k69k2K08m73M13r1lP9r6r8L32j89l4N25n81O3O0rJ09
$$ -202 -298 71 14 -110 -33 151 -118 -140 68 -405 8 -83 -86 -7 -103 -201 131 -58 -92 433 -148 -85 -25 -34 75
3204G5q8r7J44K4j51L04K0l74M95l84j41M05m32L41j75k30K94J32k41L70l38N
$$ 75 -13 -110 34 58 -93 211 231 -143 352 -32 -173 232 -200 141 -34 -264 30 162 -79 291 -47 -42
3226d2J24k67N8K38l49O9L97l48r8M33k74K64Kl02M01m19J89j07Lr0K23m73N27
$$ -42 82 -185 -127 111 -238 -169 228 -120 -218 215 -59 205 207 -95 306 -113 76 -31 -28 -118 105 -368 159
3249A59p3l71K72J47j24q9P0j58N21m78R5Q3j65O0K99j71j37J81j31K99k74j75
$$ 159 86 -285 -13 134 10 -79 -9 -167 354 -124 -29 54 -111 -51 248 77 -60 121 -10 289 15 -160
3271a60L54l25J41L41l26l3L20m75L12pk37J37K3L5L14n37J77j29M8q5K06k86
$$ -160 194 -131 10 351 25 -8 312 -163 149 142 -95 42 65 100 414 -123 54 -75 -27 -112 94 -192
3293a92J53J90n07L47J7j93K39j4j71N46m83L7J16k21N7K05q3j29J92m38K26J10
$$ -192 -39 151 -356 -9 8 -185 54 40 -131 415 -68 -31 85 -136 -79 126 43 -86 106 -332 -106 4
3315Dk19L23k84N9P8o4m8J20j76K09J58m06L42m6j39J91k23M2K0K7q6K33l73Q2
$$ 4 -215 108 -176 -117 -39 -103 -151 -31 -207 2 160 -246 96 50 -89 102 -121 -79 -59 -32 -118 115 -258 -176
3339a76L08l40M57k57j93J49L32n25M49l20n8L23k68K47Kk70J13q1j65L41q0r4
$$ -176 132 -208 249 -8 -201 -52 280 -245 204 -116 -174 149 -119 128 130 -140 -27 -108 -273 68 -12 -106
3361a06J88j2j90M3L4m7L48l86Q8K23k02K93k08j40K56k45l3K18l8r3N8k26K66
$$ -106 82 70 -120 -77 -43 -90 258 -128 -40 183 -19 274 66 -74 182 -63 -96 122 84 -9 49 -177 89
3384H9L1o2l9j14j6m4J58r4J64k40M0K28k83N0L45k28o7o3j6L72j84j85L46l28
$$ 89 120 58 19 -95 -111 -155 3 -91 73 -167 -127 101 -182 -132 213 -15 -82 -145 -161 211 27 -158 188 -140
3408a40J69p4K54k43J30j93J97p3k86O59l96n9L96l35k14N16k08l08M09m69K35
$$ -140 29 -45 209 -34 96 -97 100 27 -259 400 4 -55 341 6 -208 308 100 -208 201 -268 -33
3429c3pq4L31m2l71K74L7k32J81q6Q0J95l66R0J48k29rK81j58j49J58J1j03N6
$$ -33 -40 -124 207 165 -206 68 105 -127 54 -32 48 243 -123 -33 115 -114 -123 158 0 -149 9 20 -83 -27
3453b7k67K22P0q3M04n11J01J0K13n5k11J94n9j0k0j06J3J69J59n67L86j3j77
$$ -27 -294 -72 -2 -85 319 -192 -91 -81 132 77 -134 60 1 -9 -29 -135 -122 47 206 -361 25 12 -165
3476a65K65l9k77J67J00j6m4k30K60j8j83J48L83n77K68K67l11j10K6K27lk11
$$ -165 100 61 -216 -49 51 35 -9 -239 21 3 -180 -32 351 -226 42 309 -2 -112 -86 141 138 -73
3498g3L34j53k89K37K69k11K1j20j90L26P7k35J05j44j02J27ln8M96o46J30J41
$$ -73 261 108 -181 56 325 114 135 15 -175 151 228 -7 98 -46 -148 -21 -24 -82 414 -232 -102 39
3520C9J41k62%M0K75j29k57K64o0j04k8J03l1L68o26K85M2K3j15Q8j35K11j05
$$ 39 180 -82 -82 -42 233 104 -153 111 51 -53 -81 22 -9 359 -267 18 60 83 -32 56 -79 132 27
3543B7q5J59o9j07J85o5m12L58k20J60j09K15J02j13L5jj15J45j7j54J60L8j74
$$ 27 -58 101 32 -75 110 45 -367 -9 -229 -69 -178 37 139 26 61 60 -55 90 73 -81 79 117 -57
3566e7M2N3j03L5j00q8L08k8k32M38o80N58J06j98l1M5r9L60k63P4K00l25j22
$$ -57 -15 38 -65 -30 -130 -218 90 62 -170 268 -412 146 252 54 23 68 -31 329 66 140 340 15 -107
3589a07J01j14Q0J16Rj78L50k38J71k57M8n8PO6j23j7J61O4j45K57p4j80J58j48
$$ -107 -6 -120 -40 76 85 -93 257 19 190 -67 -19 -77 -70 -4 -127 -144 17 81 -64 193 119 -61 97 -51
3613e1j78J22j4K02j58J43j02nnn0j29J85J96j32M9k74K46O3o8k28L16j61k9q7
$$ -51 -229 -107 -121 81 -77 66 -36 -41 -46 -96 -225 -40 156 24 73 -201 45 108 40 -188 128 -33 -62 -149
3637a49L8L3P5J6J90j23p7m7J44l23J45L9j15m1M23m5l02L11o3J58k05K9o6M3
$$ -149 -111 -78 -3 13 203 80 3 -44 100 -223 -78 -39 -154 -195 228 183 -119 192 129 287 82 111 45 88
3661H8l10K59J69k97M46p2l1k36J16m6L5k11k72L72j08J42L3j24J02pR8Pr9k2
$$ 88 -222 37 206 -91 355 283 252 16 132 86 121 -90 -362 10 -98 44 77 -47 55 48 146 153 54 32
3685C2J26k82J12l5k8L62m77L74l7j61Ml3J80r3J01k92M11kj77j14j8R6Oj33k75
$$ 32 158 -124 -12 -47 -75 287 -190 184 147 -14 -10 -43 137 44 145 -147 264 262 85 -29 -47 49 55 -78 -353
3710c53L58Or3O2Q0K8K1j65J23J86k38n9J70l14J8K05J65l83K83j71Q9o7j17M97
$$ -353 5 11 -82 -20 60 88 109 -56 67 253 15 -44 126 -188 -170 35 200 -183 100 -71 18 -49 -166 331
3734C31l69L06k55J19j3j34K67j06q1q7j1J28o8L42j37j95j1O5L5K4l12Q9r8J67
$$ 331 -38 268 13 132 119 -15 252 146 65 -22 -33 95 27 369 232 37 26 91 126 150 -162 -73 -171 -4
3758dM0lJ4j81J71j94J38q6L03k25k2k8M8n9J91k71j72L61K39l64k03N67n17L66
$$ -4 36 33 47 -134 37 -157 -19 -105 198 -27 -49 -77 -29 -88 103 -168 -340 21 260 -104 -307 260 -257 109
3782A09j36R0J10j30k0l9j94j6J17J85j22P2rj98J32o7J71J3J5K6j40Jk3j3R7
$$ 109 -27 63 173 43 23 -16 -210 -226 -109 76 -46 26 17 -181 -49 -116 55 68 83 109 -31 -30 -53 -66 31
3807C1P3K3j92Q8j0K2P1l0m9k1K61j51k73K1L1J86J4k15K18k84J69J10m1j21M0
$$ 31 104 127 -65 23 13 35 106 76 27 6 267 116 -157 -136 -105 81 95 -120 98 -186 -17 93 52 -69 -29
3832b9m9J35j2j89P1J25j05JN6r1KK62j38P3kk63J51L38k16k29K85l11K46j83
$$ -29 -78 57 45 -144 -73 52 -53 -52 4 -87 -85 177 39 112 110 -153 -2 336 120 -109 176 -135 111 -72
3856g2Q2o2j71J06j51M00L7k15j73L00O7m11M00Jk00m2J2K14j93M3j24j9J52J23
$$ -72 10 -52 -223 -117 -268 132 169 -46 -219 81 148 -263 137 138 -62 -104 -92 122 -71 -28 -152 -171 -19 104
3880A04j86J96j09L28k76k44M40l08J1J94j14J59l29J92k22J75j1J10r8J56j5
$$ 104 -82 114 5 333 57 -187 253 -55 -44 150 36 195 -134 58 -164 11 0 110 12 168 153
3901A53j36n2Q2p3J63j60j49J30j05R9K37m08J40L05m30L32k1j81J57J2j61R7
$$ 153 17 -35 47 -26 137 -23 -172 -42 -147 -48 189 -219 -79 226 -204 128 107 -74 83 95 -66 31
3923C1j39J12m0k04L33j16m7J33J25j71K0p8knR9M1j14j13j3K60l00J85r2Jl0
$$ 31 -108 4 -36 -240 93 -23 -70 63 188 17 37 -41 -43 -48 51 92 -22 -135 -148 112 -188 -3 -95 -94 -124
3948a24q6J77j4m1K32J00l42N1K04l46K13Q0m4Q8k22P6J93N6j77R5j24J62j87
$$ -124 -210 -33 -47 -88 144 244 -98 -47 157 -189 24 104 60 148 -74 2 195 251 74 169 45 207 20
3971B0k11K75j62J12p3R7p5J10j72J86K1j02j26K74k34o8J38l3pk70J01J42K32
$$ 20 -191 84 -78 34 -39 58 -17 93 -79 107 128 26 -100 174 -60 -128 10 -23 -30 -300 -199 -57 175
3994A75k05J02p2j09mQ1J0J6m0J77K5l06L09r0Q5l43J61J55K91k97k44J83k32
$$ 175 -30 72 0 -109 -113 -32 -22 -6 -46 131 156 -150 159 69 154 -189 -28 127 418 121 -123 60 -172
4017a72J88K42j17o4l34L08r4j40K41j10P9O6j43O7J04R8j61o6P2m05M17j06J85
$$ -172 16 258 141 77 -257 51 -43 -183 58 -52 27 93 -50 17 121 219 58 -8 64 -341 76 -30 155
4040A55j88P3m2N8n0J9J30k29J67K41j95p2n4j1O5K24k77l5M04o73M06j0j24L4
$$ 155 -33 40 -2 56 6 25 155 -74 93 334 139 67 13 2 67 291 14 -21 383 -290 116 106 -18 16
4064A6L2O8l12J45m4K03j63k23L12mj19K60k21R3J2P7j12k02J18J37k58L32p9
$$ 16 48 116 -196 -51 -95 108 -55 -278 34 30 -89 171 -50 43 55 132 20 -182 -64 73 -185 147 68
4087F8p3M09l13o3n2N5K02r5r1j58J41j64L5J6L7J41l8j79J41j90K24O4j55J12
$$ 68 -5 404 91 28 -24 31 233 138 47 -111 30 -134 -99 -83 -46 95 57 -122 19 -171 53 117 -38 74
4111G4Pr3k2J23J18l48J08o2K57k33k0J47N7jp9j88J62M8j98K39j09l8O7q0p6
$$ 74 81 -12 -34 89 207 -141 -33 -95 162 -71 -91 56 113 112 33 -155 7 55 -143 96 -13 -51 16 -64 -140
4136a40K03o5j04m9M9J38m0J48k05L06j25j49k33r7O26l72L1J20k73M29m54L2
$$ -140 63 -2 -106 -155 -106 32 -8 140 -65 241 116 -33 -266 -363 263 -109 -78 42 -231 198 -256 -224
4158b24K19L35l09J5J46k54J58%o9O2J94k70j42J30m3J49K22p3K4k88K5M11k16
$$ -224 -5 330 21 36 182 -72 86 86 17 79 273 3 -139 -9 -52 97 319 246 270 -18 7 418 202
4181B02j93k8J32Q2m54L27o3o1q5J18j34L89k33j67QJ93K94k21k94K82o7j96L04
$$ 202 9 -19 113 195 -259 68 5 -56 -141 -23 -157 232 -1 -168 -160 33 327 106 -188 94 27 -169 135
4204A35L0P0j55K4k06O7j41J82l1k32K13K00j54Nj00J74J46l06J37j84R3k55K94
$$ 135 165 235 80 104 -102 -35 -176 6 -25 -257 -44 156 2 7 -93 81 227 -79 58 -126 -33 -288 6
4227Fn6p7L44j44j34n9K31%k88J74j13r1K89o9NJ54j32l0o2L17l83J95N4Q9j92
$$ 6 -50 -127 217 73 -61 -120 111 111 -177 -3 -116 -207 82 13 18 172 40 10 -52 265 -118 77 131 220 28
4252B8p6k4m3L40k61N6L36m13M3n6k8J61l2j41L46k65j43K14j13N2Q4L6k66J20
$$ 28 -48 -72 -115 225 -36 20 356 -57 -14 -70 -98 63 31 -110 236 -29 -172 42 -71 -19 65 101 -165 -45
4276d5mM5L7L41n08k12N17Kl01J72J55j37j76j42O5L15o3j76N7j63J85o5N6p0
$$ -45 -49 -4 33 374 -134 -346 171 173 -128 44 199 62 -114 -256 -191 124 61 -115 -58 -221 -36 -101 -45 -115
4300a15J25m4M1Q8j55l8R2j17J68k40L27j52J36j37M5j91K51k39n6J78J99k0j31
$$ -115 10 -34 7 95 -60 -98 -6 -123 45 -195 132 -20 116 -21 24 -167 84 -155 -211 -33 166 146 15
4323A5qp7O5J28J15O3j57m7l47L8K46M6P6j30K82j88j33l5P9J1j75K58J41k14
$$ 15 7 -70 -5 123 238 301 144 97 -250 -212 34 80 156 26 308 120 -13 -48 31 42 -133 125 266 52
4347E2j26O7J23j19Q0P5k75K5J2O0O7om4j83K72k35J78J54k91K97M3k40J54m92
$$ 52 -74 -7 116 -3 77 152 -123 -98 -86 -26 41 35 -9 -192 80 -155 23 177 -114 183 226 -14 140 -352
4371c52K52L10k18j68J09%P7L1j86P4K35p8j66j20O4J88l0j46J15M1k73K57k36
$$ -352 -100 210 -8 -176 -67 -67 10 41 -145 -71 164 86 -80 -200 -136 52 22 -124 -9 32 -241 16 -220
4394b20J44j5J60j6J25p8J6l24L90n6Mk14K94k25p3N8nJ21J46k01j04PO1Q5j39
$$ -220 -76 -91 69 53 178 100 116 -208 182 126 130 -84 210 -15 -88 -30 -35 86 232 31 -73 -66 -5 80 -59
4419e9j29Q8J75l1K21l15J22j70P5M2R6k5q1L6p3O5k46K54k09q0N5J25J80k65
$$ -59 -188 -100 75 44 265 -50 72 -98 -23 19 115 90 9 45 -28 37 -209 45 -164 -244 -189 -64 116 -149
4443a49K02lK28k63O9l16L13q7J23l0k51L78k2q4j65R0P8jj04N4k57J64K19j89
$$ -149 53 50 278 15 84 -232 81 -6 117 87 -164 214 192 108 -57 33 111 110 6 60 -197 -33 186 -3
4467cm5J86j94j76J41M2o3Q6K57n09J98J81j98j00N6R2K12Mj31j72N1J35m01K50
$$ -3 -48 138 -56 -232 -91 -49 -112 -26 231 -278 -80 101 -97 -197 -141 -49 163 167 36 -136 -85 50 -351 -101
4491a01K13n1k50K13j95K03nn8J22q9j46J68O9n3j49O4K74j77p8o6p0K13J4j06
$$ -101 112 61 -189 24 -171 32 27 -31 91 2 -144 24 93 40 -109 -45 229 52 -26 -92 -162 51 65 -41
4515d1Pj46K15k1J71j87O1k46nL48j43j38J90K22l73J68J1l7Kk38K10J05k17K13
$$ -41 -34 -180 35 14 185 -2 59 -187 -192 156 13 -125 65 287 -86 82 93 56 58 -180 30 135 -82 131
4539A31k16P7R4K3j73P3j14JL02j08p2l4j6L22k26k1o3J39j82J47n7l3k6k33L19
$$ 131 -85 -8 86 109 -64 9 -105 -104 198 90 18 -16 -32 290 64 43 -20 119 -63 84 27 -6 -32 -265 54
4564E4K0O8k97K90k06rJ81k31J63j61M9J14j38K95k14K8O1N4j18p5J32o3k76J30
$$ 54 74 142 -155 135 -71 -80 101 -130 33 -128 -79 35 -103 192 -22 6 67 121 3 -72 60 -3 -279 -149
4588a49J33r4K78j01K3l1n6K4l2k7R3l9M9J12k21r1l2J63K49j52o4J02j51M5m2
$$ -149 -16 -110 168 67 90 59 3 27 -5 -32 61 22 71 183 -38 -129 -161 2 251 99 35 137 -14 31 -11
4613a1m5J55p2r5K49k48j54K58o0q6l5L04m2j59j7J32q7J99n2k26P4K09j56r3
$$ -11 -56 99 27 -68 181 -67 -221 37 -23 -109 -144 160 118 -41 -58 74 -13 186 134 -92 -18 191 35 -58
4637e8K37k76K58k15j32M14k56J7K06o3n19N51j84K39j58RK5k12M75l40o0J22
$$ -58 179 -97 161 -54 -186 228 -28 -11 195 132 -387 164 -20 219 61 70 95 -117 358 18 -42 80
4659H0r5K32k83j55K65j11J13Q8j96k1MK19k23M4J79j93Q5l8Q7j37q5r4K26q0
$$ 80 -15 217 -66 -221 44 -67 46 134 -62 -83 -79 140 -83 -39 140 -53 32 -6 81 -56 -141 -235 -9 -89
4683h9Q6J19k70J74K4j6j67J12K04n0l8p8K80r3k55J58j14N3J17j67j21L08j7
$$ -89 -3 116 -154 20 44 28 -139 -27 177 127 89 11 291 198 -57 101 -13 40 157 -10 -131 177 160
4706A60j87J54j17j48L04k35J61j16j29L42j50j78N5k0p7K02L8q7J35l11K72Q1
$$ 160 -27 127 10 -138 166 -69 92 -24 -153 189 39 -139 -84 -104 -181 21 59 -28 107 -204 68 149
4728A49k31M8J46l18M5M4m1J89j96J22j21K67j01o3R7k8J46j22k66K47R3k49J56
$$ 149 -82 -34 112 -206 -161 -117 -158 31 -165 -43 -164 103 2 -61 36 8 154 32 -234 13 106 -143 13
4751A3l7Q8k41Q1Q5J14j93J94J18l10j60L08n2j10p8K21M2l2n0Nj85J42m5l9Q0
$$ 13 -24 64 -177 -96 -11 103 -90 104 222 -88 -248 60 8 -102 -180 41 83 51 1 6 -179 -37 -82 -121 -41
4776d1j11N1q2L58l29K91j89j50N8J60J20j71J65o5k39J59j44J46j8P6j03N2p0
$$ -41 -152 -101 -183 175 -154 137 -52 -202 -144 16 136 -35 130 65 -174 -15 -159 -13 -31 45 -58 -6 -76
4799g6j45R3P3N8L4J59j20j07j83K98J14k37q1J02j23J54J26o7k7j94J57q5o0
$$ -76 -221 -128 -55 3 37 196 76 -31 -214 84 198 -39 -120 -18 -141 13 139 72 45 -149 8 -77 -137
4822a37K99j24J30j47k9j7o7J34k2JM8l01N1K64j83J43O2k46K25k08O5q1L13p5
$$ -137 162 38 168 21 -8 -25 -92 42 20 21 69 -232 -181 83 -100 43 105 -141 84 -124 -59 -140 173 98
4846I8J70n3r2j55K4k9j36K22n3J20q9Q5j41k7J30K24j97j66K21k72L94m75Q1
$$ 98 268 215 123 -32 -8 -37 -173 49 -4 116 27 112 -29 -56 74 298 101 -65 156 -116 278 -197 -116
4869a16p3K34k04J92m2J35pk12J45J75r9k49J20O8k10l5K28j03K7J03q9M2r2J24
$$ -116 -189 45 -159 33 -9 126 119 -93 52 227 128 -121 -1 67 -143 -178 50 -53 -26 77 -12 30 -62 62
4893F2N5j18j45J24j33J93n2j32J07j7r9J33j30j6J81Q6j56Q3J71k61J4J19p7
$$ 62 117 -1 -146 -22 -155 38 -14 -146 -39 -56 -155 -22 -152 -168 13 99 -57 26 197 -64 -50 69 -8
4916hJ17k1j33L33n4j36J0k62MK49j75J03J0k29L70m92L95j43l4J80j77K39k03
$$ -8 109 88 -45 288 234 98 108 -154 -150 99 -76 27 37 -192 178 -314 81 -62 -96 84 -93 146 -57
4939e7lJ62n4O1j1j87j60K39M4l0q5J13k75J47j6j33M33p9p6j37K89l7p5N1m1
$$ -57 -60 102 48 109 98 -89 -249 -10 34 4 -81 32 -243 -96 -112 -245 188 109 33 -104 185 148 73 124 83
4964H3k44J56j49J55qJ81K5m7p1n4rj42L8J09j64kK61r3j18K34k93J18K43j76
$$ 83 -161 -5 -154 1 -7 174 199 152 81 27 18 -124 -86 23 -141 -143 118 25 -93 141 -152 -34 209 33
4988C3p2k76M06k14J93Jr6P5jj74J15O1k5j6J80j76l0L53n09K35j55J47j53o4
$$ 33 -39 -315 91 -123 70 71 -25 50 49 -125 -10 51 26 10 190 14 -16 337 -172 63 -92 55 -98 -162
5012a62L11k42m0J76K4N5k37K0J08N9n1p2O3L62l36Q5j06J71j45pj54L9K79k40
$$ -162 149 -93 -133 43 67 122 -115 -95 13 72 21 -51 12 374 38 123 17 188 43 36 -118 -79 200 -40
5036d0K29J8j63m7K9jj66M22k95J14j78L48m16J31P4j48J38k31L02j98K3J58o4
$$ -40 189 207 44 -3 26 25 -141 281 -14 100 -78 270 -146 -15 59 -89 49 -182 120 -78 -55 103 39
5059C9k53J01R0K1j17K59j40o1R3J1j46K93j12k94J68Q0j24Q9k4q4J97p9r1j0
$$ 39 -214 -113 -23 -2 -119 140 0 -61 32 43 -103 190 78 -216 -48 32 -92 -3 -27 -111 86 7 -84 -94
5083i4J94p1j11K19j13%j74L25j85j16J58j13rL30m23J98j64Q7O3n4J33j67J16
$$ -94 100 29 -82 137 24 24 -150 175 -10 -126 32 -81 -90 240 -183 15 -149 -62 1 -53 80 -87 29
5106B9r7n7m2J23j42L75j07j12k61Q3K49j6N5Q2j08M7j0o8K7l3q9j04K06r4N1
$$ 29 -68 -125 -167 -44 -186 189 82 -30 -291 -208 41 25 80 162 54 101 91 23 50 17 -72 -176 30 -64 -13
5131a3j83K46k36k0K69m3M7J22j44k6j10k8L1M2j3rR4J46Jj67p5j71J92j06P3
$$ -13 -196 50 -186 -206 63 20 67 189 45 19 -91 -119 -88 -46 -59 -68 26 172 173 6 -69 -240 -48 -154 -81
5156h1K13l28J43Q1Lp1O5L6q1O3Q6j33J59j4j33L39m37O0o5L74k48O3J02k17n6
$$ -81 132 -196 -53 28 31 -40 25 61 -20 43 129 -4 155 141 8 347 -90 -30 -95 279 31 94 196 -21 -77
5181g7Q7k8L6l7j12NJ65k2J04m13K73j00L43j28k48J93l0N7L6l7j17j2P6j1l13
$$ -77 10 -18 18 -19 -131 -126 39 17 121 -292 -19 -119 224 96 -152 41 11 68 104 67 -50 -62 14 3 -310
5206c10L07o2Ok1K61k06K44k84O4K6j67K10p1j06J46m5k3J30q8p0L3K03q0j25
$$ -310 -3 -65 -59 -80 181 -25 219 -65 -1 25 -142 68 -3 -109 37 -8 -31 99 11 -59 -26 177 97 -28
5230b8O9o1l9K66j72j03J42k12N9K37nj5j93O6Or2J26k19J33K11j20m4j14RK88
$$ -28 41 -20 -59 207 35 -68 74 -138 -79 158 153 138 -55 11 17 -75 51 -168 -35 176 56 12 -102 -93 195
5255A95k11k0R0r3j19l7J18J21Rp4o0J1Q9j05Q2kM4p8j36l2J15P3J00kj10Q1j30
$$ 195 -16 -36 54 -39 -158 -195 -77 44 53 -21 -81 -70 19 -86 -4 -6 38 -40 -176 -208 -93 -20 80 78 -32 49 -81
5282h1N2j00L29j36k58L84l11M9M4Mq3OK41j17j33Q7l4J21k0jJ09j05q8L45j80
$$ -81 -29 -129 200 64 -194 190 -121 -72 -28 -24 -107 -101 140 23 -110 -23 -57 64 44 43 152 47 -41 304 124
5307A24n3q8L43m86J89j93J76k4j3O1k31J44p6K12k4J22k54K21q6R5j16P5j95
$$ 124 71 -17 326 -160 29 -164 12 -12 -25 36 -195 -51 -127 85 61 183 -71 150 64 159 43 118 -77
5330g7O3l7j15J60j85J00j64K07j60K72j41o1K40j17j5N4p1r9L31k11n5K7J49
$$ -77 -14 -51 -166 -6 -191 -91 -255 -48 -208 64 -77 -138 102 -15 -30 24 -47 -146 185 -26 -81 -54 95
5353I5j29j99L01J23j29P2r2L1k4j12K04j95j56L51O8j33k2J09m8J08k60J51j60
$$ 95 -34 -233 68 191 62 134 42 73 49 -63 141 -54 -210 141 209 76 54 163 115 223 -37 114 -46
5376d6J5j06K6K95qj71p3l5K30k78J11P1J33j86j3N6n7M9j62J16j9k9J88k13j20
$$ -46 -31 -137 -111 184 176 5 -68 -103 127 -151 -40 31 164 -22 -35 21 -36 13 -149 -33 -52 -81 107 -106 -226
5401b26Q1K07j75J85J54l43o2J47o4k75K38L31k22J94O4k22L7k33K78j61NL9o8
$$ -226 -145 62 -113 72 226 -117 -179 -32 -96 -371 -133 198 -24 170 234 12 49 -184 94 -67 -62 -23 -91
5424i1L17l10Q8j20L66j02q1k28N4K50k4J02j62k07K17O1k32K34j00j5J02j26
$$ -91 226 -84 4 -116 250 148 67 -161 -107 143 119 221 59 -148 69 130 -102 132 32 17 119 -7
5446gl5L5j9j31N6J47l30P8K70k22J11R9j45R0n5NQJ03P2m7j57N3l9r4K96k40
$$ -7 -42 -7 -26 -157 -101 46 -284 -206 64 -158 -47 52 -93 -3 -58 -53 -45 58 130 83 -74 -21 -60 -154 142 -98
5472i8m0K84l19O0K36n1R4p0J9J07l50J02J24M2m2j09M7j03O2p2P4J21k18j4P6
$$ -98 -138 146 -173 -113 123 72 166 96 115 222 -128 -26 98 140 98 -11 36 -67 -5 -77 -3 118 -100 -114 -38
5497c8q4k46J88J72J87j1k01N4N2k01K31j7j6q9R1K42k48K01m52K08K1j4q4MP2
$$ -38 -122 -368 -180 -8 179 168 -33 21 73 -128 103 86 70 -19 72 314 66 267 -185 23 44 30 -54 -50 22
5522B2Q7k24J57LK1j59K16j44o0O0p4m8M9J26o1j21J59k15k4L43n51L86J85j21
$$ 22 109 -115 42 45 66 -93 123 -21 -81 -21 -95 -143 -94 32 -29 -150 9 -206 -230 113 -438 -52 133 12
5546A2M2j99K14o8j78J78mp3J68Kr0J26j83p1M30k76J94k14M5m5K71m59M59j62
$$ 12 54 -145 69 1 -177 1 -3 -76 92 94 4 130 -53 -124 306 30 224 10 55 10 281 -178 281 119
$$ [...]
8191g7
##END NTUPLES=NMR FID
##END=
