##TITLE=1H_Ser 7-2-i-H
 CDCl3, 8 sc, 
 4.9.2020
##JCAMPDX= 6.0         $$ Bruker NMR JCAMP-DX V2.0
##DATA TYPE= NMR FID
##DATA CLASS= NTUPLES
##ORIGIN= UXNMR, Bruker Analytische Messtechnik GmbH
##OWNER= root
$$ XWIN-NMR		Version 3.5
$$ Fri Sep  4 12:04:07 2020 Russian Standard Time (UT+4h)  she@DPX200
##.OBSERVE FREQUENCY= 200.1315066352
##.OBSERVE NUCLEUS= ^1H
##.DELAY= (6, 6)
##.ACQUISITION MODE= SIMULTANEOUS
##.ACQUISITION SCHEME= undefined
##.AVERAGES= 8
##.DIGITISER RES= 18
##SPECTROMETER/DATA SYSTEM= spect
##.PULSE SEQUENCE= zg30
##.SOLVENT NAME= CDCl3
##.SHIFT REFERENCE= (INTERNAL, CDCl3, 0, 15.7039)
##AUDIT TRAIL= $$ (NUMBER, WHEN, WHO, WHERE, WHAT)
$$ ##TITLE= Audit trail, XWIN-NMR		Version 3.5
$$ ##JCAMPDX= 5.01
$$ ##ORIGIN= Bruker BioSpin GmbH
$$ ##OWNER= she
$$ F:/spectra/data/she/nmr/H-F/1/audita.txt
$$ ##AUDIT TRAIL=  $$ (NUMBER, WHEN, WHO, WHERE, WHAT)
(   1,<2020-09-04 12:02:56.04 +0400>,<she>,<DPX200>,
      <created by zg, POWCHK disabled, PULCHK disabled
       configuration hash MD5:
       00 E9 B6 7A A2 85 ED C7 34 08 36 98 17 FE 4E 26
       data hash MD5: 16K
       48 1B 2D 9A 19 B6 8B 82 0B 1F D8 3E 6F D0 84 6B>)
$$ ##END=
$$ 
$$ hash MD5
$$ E3 40 F6 A1 67 E9 EA 53 48 E4 00 4F 16 A6 0C 2E
##$RELAX= 
##$RELAX= 
##$RELAX= 
##$RELAX= 
##$RELAX= 
##$RELAX= 
$$ Bruker specific parameters
$$ --------------------------
##$DU= <F:/spectra>
##$EXPNO= 1
##$NAME= <H-F>
##$PROCNO= 1
##$TYPE= <nmr>
##$USER= <she>
##$AMP= (0..31)
100 100 100 100 100 100 100 100 100 100 100 100 100 100 100 100 100 100 
100 100 100 100 100 100 100 100 100 100 100 100 100 100 
##$AQSEQ= 0
##$AQ_mod= 1
##$AUNM= <au_zg>
##$AUTOPOS= <>
##$BF1= 200.13
##$BF2= 200.13
##$BF3= 200.13
##$BF4= 200.13
##$BF5= 200.13
##$BF6= 200.13
##$BF7= 200.13
##$BF8= 200.13
##$BYTORDA= 1
##$CFDGTYP= 0
##$CFRGTYP= 5
##$CHEMSTR= <none>
##$CNST= (0..31)
1 1 145 1 1 1 1 1 1 1 1 1 1 1 1 1 1 1 1 1 1 1 1 1 1 1 1 1 1 1 1 1 
##$CPDPRG= <>
##$CPDPRG1= <>
##$CPDPRG2= <>
##$CPDPRG3= <>
##$CPDPRG4= <mlev>
##$CPDPRG5= <mlev>
##$CPDPRG6= <mlev>
##$CPDPRG7= <mlev>
##$CPDPRG8= <mlev>
##$CPDPRGB= <>
##$CPDPRGT= <>
##$D= (0..31)
0 1.2 0 0 0 0 0 0 0 0.06 0 0.03 0 0 0 0 0.0002 0 0 0 0 0 0 0 0 0 0 0 0 
0 0 0 
##$DATE= 1599206575
##$DBL= (0..7)
120 120 120 120 120 120 120 120 
##$DBP= (0..7)
150 150 150 150 150 150 150 150 
##$DBP07= 0
##$DBPNAM0= <>
##$DBPNAM1= <>
##$DBPNAM2= <>
##$DBPNAM3= <>
##$DBPNAM4= <>
##$DBPNAM5= <>
##$DBPNAM6= <>
##$DBPNAM7= <>
##$DBPOAL= (0..7)
0.5 0.5 0.5 0.5 0.5 0.5 0.5 0.5 
##$DBPOFFS= (0..7)
0 0 0 0 0 0 0 0 
##$DE= 6
##$DECBNUC= <off>
##$DECIM= 32
##$DECNUC= <off>
##$DECSTAT= 4
##$DIGMOD= 1
##$DIGTYP= 9
##$DL= (0..7)
0 120 120 120 120 120 120 120 
##$DP= (0..7)
150 150 150 150 150 150 150 150 
##$DP07= 0
##$DPNAME0= <>
##$DPNAME1= <>
##$DPNAME2= <>
##$DPNAME3= <>
##$DPNAME4= <>
##$DPNAME5= <>
##$DPNAME6= <>
##$DPNAME7= <>
##$DPOAL= (0..7)
0.5 0.5 0.5 0.5 0.5 0.5 0.5 0.5 
##$DPOFFS= (0..7)
0 0 0 0 0 0 0 0 
##$DQDMODE= 0
##$DR= 18
##$DS= 0
##$DSLIST= <SSSSSSSSSSSSSSS>
$$ [...]
##$SUBNAM2= <"">
##$SUBNAM3= <"">
##$SUBNAM4= <"">
##$SUBNAM5= <"">
##$SUBNAM6= <"">
##$SUBNAM7= <"">
##$SUBNAM8= <"">
##$SUBNAM9= <"">
##$SW= 16.880792210976
##$SWIBOX= (0..15)
0 0 2 0 0 0 0 0 0 0 0 0 0 0 0 0 
##$SW_h= 3378.37837837838
##$TD= 16384
##$TD0= 1
##$TE= 0
##$TE2= 300
##$TE3= 300
##$TEG= 300
##$TL= (0..7)
0 120 120 120 120 120 120 120 
##$TP= (0..7)
150 150 150 150 150 150 150 150 
##$TP07= 0
##$TPNAME0= <>
##$TPNAME1= <>
##$TPNAME2= <>
##$TPNAME3= <>
##$TPNAME4= <>
##$TPNAME5= <>
##$TPNAME6= <>
##$TPNAME7= <>
##$TPOAL= (0..7)
0.5 0.5 0.5 0.5 0.5 0.5 0.5 0.5 
##$TPOFFS= (0..7)
0 0 0 0 0 0 0 0 
##$TUNHIN= 0
##$TUNHOUT= 0
##$TUNXOUT= 0
##$USERA1= <user>
##$USERA2= <user>
##$USERA3= <user>
##$USERA4= <user>
##$USERA5= <user>
##$V9= 5
##$VALIST= <valist>
##$VCLIST= <CCCCCCCCCCCCCCC>
##$VD= 0
##$VDLIST= <DDDDDDDDDDDDDDD>
##$VPLIST= <PPPPPPPPPPPPPPP>
##$VTLIST= <TTTTTTTTTTTTTTT>
##$WBST= 1024
##$WBSW= 4
##$XGAIN= (0..3)
0 0 0 0 
##$XL= 0
##$YL= 0
##$YMAX_a= 730323
##$YMIN_a= -634044
##$ZGOPTNS= <>
##$ZL1= 120
##$ZL2= 120
##$ZL3= 120
##$ZL4= 120
##$ABSF1= 10
##$ABSF2= 0
##$ABSG= 5
##$ABSL= 3
##$ALPHA= 0
##$AQORDER= 0
##$ASSFAC= 0
##$ASSFACI= 0
##$ASSFACX= 0
##$ASSWID= 0
##$AUNMP= <proc_1d>
##$AZFE= 0.1
##$AZFW= 0.1
##$BCFW= 1
##$BC_mod= 2
##$BYTORDP= 1
##$COROFFS= 0
##$CY= 11.3945322036743
##$DATMOD= 1
##$DC= 2
##$DFILT= <>
##$DTYPP= 0
##$F1P= 16.9975609425685
##$F2P= -3.02152046262296
##$FCOR= 0.5
##$FTSIZE= 0
##$FT_mod= 4
##$GAMMA= 1
##$GB= 0.15
##$INTBC= 1
##$INTSCL= 1
##$ISEN= 128
##$LB= 0.24
##$LEV0= 0
##$LPBIN= 0
##$MAXI= 10000
##$MC2= 0
##$MEAN= 0
##$ME_mod= 0
##$MI= 1.114404
##$NCOEF= 0
##$NC_proc= 0
##$NLEV= 6
##$NOISF1= 3.799351
##$NOISF2= 2.8
##$NSP= 1
##$NTH_PI= 0
##$NZP= 0
##$OFFSET= 15.70392
##$PC= 1
##$PHC0= -9974.04
##$PHC1= 14.0009
##$PH_mod= 1
##$PKNL= yes
##$PPARMOD= 0
##$PSCAL= 0
##$PSIGN= 0
##$REVERSE= no
##$SF= 200.130013532006
##$SI= 16384
##$SIGF1= 3
##$SIGF2= 2
##$SINO= 400
##$SIOLD= 16384
##$SREGLST= <1H.CDCl3>
##$SSB= 0
##$STSI= 0
##$STSR= 0
##$SW_p= 3612.71676300578
##$SYMM= 0
##$S_DEV= 0
##$TDeff= 0
##$TDoff= 0
##$TI= <>
##$TILT= no
##$TM1= 0
##$TM2= 0
##$TOPLEV= 0
##$USERP1= <user>
##$USERP2= <user>
##$USERP3= <user>
##$USERP4= <user>
##$USERP5= <user>
##$WDW= 1
##$XDIM= 8192
##$YMAX_p= 0
##$YMIN_p= 0
$$ End of Bruker specific parameters
$$ ---------------------------------
##NTUPLES= NMR FID
##VAR_NAME=  TIME,          FID/REAL,        FID/IMAG
##SYMBOL=    X,             R,               I
##VAR_TYPE=  INDEPENDENT,   DEPENDENT,       DEPENDENT
##VAR_FORM=  AFFN,          ASDF,            ASDF
##VAR_DIM=   8192,          8192,            8192
##UNITS=     SECONDS,       ARBITRARY UNITS, ARBITRARY UNITS
##FACTOR=    0.000296,      1,               1
##FIRST=     0,             0,               0
##LAST=      2.424536,      0,               0
##MIN=       0,             -634044,         0
##MAX=       2.424536,      730323,          0
$$ Real data points
##PAGE= N=1
##DATA TABLE= (X++(R..R)), XYDATA
$$ [...]
1984g97J44K196k343O92R69j884K117n59k340L401j153j532K115k018M08K583
$$ -797 -653 1543 -800 -108 861 -1023 1094 535 -1805 1596 443 -1089 1026 -992 -584 1999
2000A999l646J518J854l878K911n05j946L780l032r17M219l606O50K001l849L849
$$ 1999 -1647 -129 1725 -2153 758 253 -1693 2087 -945 -1862 2357 -1249 -599 1402 -2447 1402
2016A402p27l513M599j683j703L566l335J116K170m368K886J360l616L251j537
$$ 1402 675 -2838 1761 78 -1625 1941 -1394 -278 1892 -2476 410 1770 -1846 1405 -132
2031a32j195L680l414j6L167l184J292Q22k303K498n50k549L300j052j296J881
$$ -132 -1327 2353 -1061 -1077 2090 -1094 198 1020 -1283 1215 665 -1884 1416 364 -932 949
2047I49j607R30J382l026J486J371k634J628j19j384K358j507j527L038j739p32
$$ 949 -658 272 1654 -1372 114 1485 -1149 479 360 -1024 1334 -173 -1700 1338 -401 -1133
2063a133K242k367J508N51k887K422O35k691K156p88p92K894l345N98K765l092
$$ -1133 1109 -1258 250 801 -2086 336 971 -1720 436 -352 -1144 1750 -1595 -997 1768 -1324
2079a324J253J148k850K899j130k158M227k356q54K616k937J599J449l579L058
$$ -1324 -71 1077 -1773 1126 -4 -2162 2065 -291 -1145 1471 -1466 133 1582 -1997 1061
2094A061J44k776L094j461q20K962l671J488J930l451K075L43k284K851j392j437
$$ 1061 1205 -1571 1523 62 -758 2204 -1467 21 1951 -1500 575 918 -1366 1485 93 -1344
2110a344L487k670j06K215k645J384P64k556K334J51k634K401o70r23J846k119
$$ -1344 2143 -527 -633 1582 -1063 321 1085 -1471 863 1014 -1620 781 111 -812 1034 -1085
2126a085P20J596k178N89J287k228J624P6j663K459j438p92K242j773p0J886k251
$$ -1085 -365 1231 -947 -358 929 -1299 325 401 -1262 1197 -241 -1033 1209 -564 -634 1252 -999
2143i99J038J047k878K365K56k301K646j531n49K627k792M14K189k634J391K91
$$ -999 39 1086 -1792 573 829 -1472 1174 -357 -906 1721 -1071 -657 1532 -1102 289 580
2159E80j976K733j142j605K873k226K9K058k419J191J128l185K776l57k047K614
$$ 580 -1396 1337 195 -1410 1463 -763 -734 1324 -1095 96 1224 -1961 815 458 -1589 1025
2175A025j503l62K312k333N48K118l101J547N28k067K182o62j504K812j647p44
$$ 1025 -478 -840 1472 -861 -313 1805 -1296 251 779 -1288 894 232 -1272 1540 -107 -851
2191h51K216k141R25J170l077K388K65k157J970m07j237K119j696k26K265k559
$$ -851 1365 -776 149 1319 -1758 630 895 -1262 708 301 -936 1183 -513 -739 1526 -1033
2207a033J056J027k172J776l58j734K345j058j037K121j553K38J404k414J734
$$ -1033 23 1050 -1122 654 296 -1438 907 -151 -1188 933 -620 -382 1022 -1392 342
2222C42L60k190K209k58j545K101j400j54K141k612O65J489k414J675J75j781
$$ 342 702 -1488 721 463 -1082 1019 -381 -535 1606 -1006 -341 1148 -1266 409 584 -1197
2238a197K105o84j636K498j408n96J901k070J299P74k085J564Q3j497J848j142
$$ -1197 908 224 -1412 1086 -322 -918 983 -1087 212 986 -1099 465 548 -949 899 -243
2254b43n42K162j887M9J628j927J075M27k054K164n72j604K565j349o36J739j674
$$ -243 -785 1377 -510 -461 1167 -760 315 742 -1312 852 280 -1324 1241 -108 -744 995 -679
2271f79O81J093k325J621M13j695J494n15r17K086j561l23K029k172M86J048k000
$$ -679 2 1095 -1230 391 804 -891 603 88 -829 1257 -304 -627 1402 -770 -284 764 -1236
2288a236K159o04j806K676j076q48J706j529K45J336k252J644M42k163J876l58
$$ -1236 923 319 -1487 1189 113 -735 971 -558 -313 1023 -1229 415 857 -1306 570 212
2304B12j404J987j337j88K112k150M44J284k180J864m21j507K309j024j092K134
$$ 212 -1192 795 -542 -730 1382 -768 -324 960 -1220 644 223 -1284 1025 1 -1091 1043
2320A043j638K07J349k008J274N94k142K135m31j417K144j571P7J890k533Q34
$$ 1043 -595 -388 961 -1047 227 821 -1321 814 383 -1034 1110 -461 -384 1506 -1027 -193
2336a93J648k350J322J64j475J900r70r69K055j192l52J492j803J036M76k134
$$ -193 1455 -895 427 591 -884 1016 46 -923 1132 -60 -412 1080 -723 313 789 -1345
2352a345J957M0j418J254o76l91J740j676L9J763j924M93O71j559J630k22j929
$$ -1345 612 652 -766 488 -188 -579 1161 -515 -476 1287 -637 -144 527 -1032 598 376 -1553
2369a553K714j053j168K147j701M61J274k382J395J077k525K040o72j126K493
$$ -1553 1161 108 -1060 1087 -614 -153 1121 -1261 134 1211 -1314 726 54 -1072 1421
2384A421k158PK285k470O98J134j925J777m70j825K668j341p10K066j630N58R20
$$ 1421 -737 -730 1555 -915 -217 917 -1008 769 299 -1526 1142 -199 -909 1157 -473 85 1005
2401A005k478J903M93k366K091o85o18J746j834M31J561j950Q30N10j332J479
$$ 1005 -1473 430 923 -1443 648 -37 -655 1091 -743 -312 1249 -701 129 639 -693 786
2417G86n91j014J814q26q20J444q31l5R01j393K59J487j872P42K88j024J698j072
$$ 786 195 -819 995 169 -651 793 -38 -73 828 -565 -306 1181 -691 51 339 -685 1013 -59
2435e9p96J960j411l89J506j474O58N34j774J689j8j619J880q24p70K047k071
$$ -59 -855 1105 -306 -695 811 -663 -5 529 -1245 444 426 -1193 687 -137 -907 1140 -931
2452i31N61J734k644J338M85j774J893q61o74K271j916j75J844k242J461J63j966
$$ -931 -370 1364 -1280 58 543 -1231 662 -199 -873 1398 -518 -693 1151 -1091 370 533 -1433
2469a433K270l58j630K184j208j30J448k191J112R87k051J572J9j424J615o25
$$ -1433 837 479 -1151 1033 -175 -305 1143 -1048 64 1051 -1000 572 591 -833 782 157
2485A57q31J626j291k03J268j242Q71Q3j170J018J44j140J290p28m03J267j225
$$ 157 -674 952 -339 -542 726 -516 355 438 -732 286 430 -710 580 -148 -551 716 -509
2502e09O8J069j137O32M03j403J090J20j230J279m34q75J506q51r6J580k110Q40
$$ -509 -441 628 -509 123 526 -877 213 333 -897 382 -52 -927 579 -272 -368 1212 -898 -58
2520e8Q48j940J588l46j325K051j039l04J323j390O93N83k042K201m29j476J901
$$ -58 790 -1150 438 92 -1233 818 -221 -525 798 -592 101 684 -1358 843 414 -1062 839
2537H39p61n28J579j923M43J290j855J074L60j713K096j273p39K267j569o1J223
$$ 839 78 -450 1129 -794 -351 939 -916 158 518 -1195 901 -372 -1111 1156 -413 -474 749
2554G49j175N55P40j713J327l7j275J265n45l93J311j349L64J036j195M33K21
$$ 749 -426 129 869 -844 483 446 -829 436 -109 -502 809 -540 -176 860 -335 98 319
2571C19p90R34k66q54J448q62l38J119q10O4P54j429P68N65j389J192k71n94J071
$$ 319 -471 463 197 -657 791 -71 -409 710 -100 -36 718 -711 57 622 -767 425 154 -440 631
2590F31r80l13J641j423M4J183j366Q09r0j225J866o82p93J260p99K7R80j794
$$ 631 -349 -662 979 -444 -400 783 -583 226 136 -1089 777 95 -698 562 -237 -210 770 -1024
2608a024J018O20j262J050l41p73J562j140l45J806j940N97Q82j410J140j37j099
$$ -1024 -6 614 -648 402 61 -712 850 -290 -635 1171 -769 -172 710 -700 440 303 -796
2625g96J563p60n16J316j048R1Q50j386Q44K81j011Q57j15p39J289r13j67J165
$$ -796 767 7 -509 807 -241 -150 700 -686 158 439 -572 285 170 -569 720 -193 -360 805
2643H05j126R3N15o46N81J41j152J012rp85J209p23k54Q33j106N08O04r74M83
$$ 805 -321 -228 287 -359 222 363 -789 223 214 -571 638 -85 -339 494 -612 -104 500 -474 9
2662IM67j090J181p98k64J382j318N2Q83j214O09L42p94R23l57m23J080j063j67
$$ 9 476 -614 567 -231 -495 887 -431 -379 504 -710 -101 241 -553 370 13 -410 670 -393 -560
2681e60J007r58M27N12j276J021M36j406J033k98n5P39j206K63Q14r40K27O42
$$ -560 447 -511 -84 428 -848 173 609 -797 236 -62 -117 622 -584 -321 493 -447 -220 422
2699D22r23R40l50o01J273p10n92J268q25J69M00q86L60M74j147Q87j84m14Q90
$$ 422 -501 439 89 -512 761 51 -541 727 -98 71 471 -415 -55 419 -728 159 -25 -439 451
2718D51q47K04R48j238J90R13r79R52o80p81J214l52l98Q67o63j09Q10q67N06
$$ 451 -396 -192 756 -482 -292 621 -358 594 -86 -867 347 -5 -403 464 -199 -308 502 -365 141
2737A41J85r23R33k33o03P20m90l1N74q09M07N02r48M99K83q06R93l44n16J200
$$ 141 326 -597 336 103 -500 220 -270 -301 273 -536 -129 373 -575 -76 207 -599 394 50 -466 734
2757G34r01L2L68o09M54K58r64P86J18p60O32m16k6J027j407N77O43q56M10k0
$$ 734 -167 -135 233 -376 78 336 -628 158 276 -484 148 -268 -294 733 -674 -97 546 -310 100 80
2777H0n38J009p33l53R16n20J4N56p07K46L40q73Q22K26o34L57m52P6Q21r62L2
$$ 80 -458 551 -182 -535 381 -139 -125 431 -276 -30 310 -563 259 485 -149 208 -244 -168 653 -309 -277
2798b77P49q60K93M58p05P19k28n83Q79o47m6N91m91J0K10m11N96N0o21N70j19
$$ -277 472 -388 -95 363 -342 377 149 -434 445 -202 -248 343 -148 -138 72 -339 257 307 -314 256 137
2819A37o36R91o80J26P11r26K30N22j056P71K8q79J392j182k08J010o40J21N38
$$ 137 -499 492 -188 -62 649 -277 -47 475 -581 190 218 -661 731 -451 -659 351 -289 -168 370
2838C70r38O89L16r37R28m43j43M25o43K27O85r36M48L70q55N85K2o48R86o11
$$ 370 -568 121 437 -500 428 -15 -158 267 -376 -149 536 -400 48 418 -437 148 170 -478 508 -103
2858a03j28M14k36j55O29o60L05J43m76M90k33k01M87k85j18K09k54J57M26o67
$$ -103 -231 183 -53 -208 421 -239 66 209 -267 223 -10 -211 276 -9 -127 82 -172 -15 411 -256
2878b56J17L35p8j5j16j67M74l20k93K54J93k2J90p12N55P9p68N26J33l42O19
$$ -256 -139 196 118 103 -13 -180 294 -26 -319 -65 128 106 296 -416 139 218 -550 -24 109 -233 386
2899C86n03J11M37n80j66N94q73P44r3m95R23n49m09J004o79L23M1n49P78j99
$$ 386 -117 -6 431 -149 -315 279 -594 150 57 -438 485 -64 -473 531 -148 175 216 -333 445 246
2919B46o38O91l55J69K26j016M73O73j008K01M81j38K15o61N99L43n76O1R7j69
$$ 246 -392 299 -56 113 339 -677 -204 469 -539 -338 143 5 220 -441 158 501 -75 -14 83 -86
2939h6K96l50M5L69j18m78K41J99Q6q7j60J34J46l94L5N32l35m44M64k30K85N4
$$ -86 210 -140 -95 274 156 -322 -81 118 204 117 -43 91 237 -157 -122 410 75 -369 95 -135 150 204
2961B04l78L18j72k81K07Jj36L99n90L66N60p51M63l71k66Q46o41j08O65l38j09
$$ 204 -174 144 -28 -309 -102 -101 -237 162 -428 -62 498 -253 210 -161 -427 419 -222 -330 335 -3 -112
2982a12Q8l45P70k35n68P34m65K17j1l89M06K82p63M38k8j3K48n00M08K91n87
$$ -112 -24 -369 401 166 -402 332 -133 84 73 -316 90 372 -391 47 19 6 254 -246 162 453 -134
3003a34J28K37m83L60k92j26R06n18p8L19k46r2J0l16L63nj18k36K32K32k01J65
$$ -134 -6 231 -252 108 -184 -310 596 78 0 319 73 -19 -9 -325 38 33 -85 -321 -89 143 -58 107
3025A07j35j31J47j72J85J46k50J80k20M4J69j94K10O9j75K06l65J50L81o03L18
$$ 107 -28 -159 -12 -184 1 147 -103 77 -143 -99 70 -124 86 155 -20 186 -179 -29 352 -251 67
3046F7J50l64O2N4j02L94k81m82O23k60P0J77l02K97R1m19M12l63J34K60k78q4
$$ 67 217 -147 -85 -31 -133 261 -20 -502 121 -139 -69 108 -194 103 194 -225 187 -176 -42 218 -60 -144
3068a44L20k79K91l24pM03k76m3j20J05K75j15l12L65m1q5JJ45k66L41k12J29
$$ -144 176 -103 188 -136 -143 260 -16 -59 -179 -74 201 86 -226 139 98 13 14 159 -107 234 22 151
3090A51j20j92N6m7Q3N29l44N9k47Q1j33R0k5P1Q1k62J51J24j82Q4P9J57l19M0
$$ 151 31 -161 -105 -152 -69 460 116 175 -72 9 -124 -34 -59 12 93 -169 -18 106 -76 8 87 244 -75 -35
3114c5j83L26j4j63J45j04j47PL10m1J75n01R1O2j45J98j68J1J21J17j15K6q2
$$ -35 -218 108 94 -69 76 -28 -175 -168 142 101 276 -225 -134 -72 -217 -19 -187 -176 -55 62 -53 -27 -109
3137a09J59l86K98M52j38m02K38j69MK08m16J22K69j45j83M06l48Q3Q4J80O7l95
$$ -109 50 -336 -38 414 276 -126 112 -57 -53 155 -261 -139 130 -15 -198 208 -140 -57 27 207 274 -121
3159a21j67M07k39J14O0j22M48m78J54j42J30l52L44m5J65j76R1r6m8L13l68R2
$$ -121 -288 119 -120 -6 54 -68 380 -98 56 -86 44 -308 36 -9 156 -20 71 -25 -73 240 -128 -36
3181c6K2J14l07P5jL2J48o8K2J89j5m30K95kk31L61q2Q8k2J7Kp3k3l31M64J0k43
$$ -36 -14 100 -207 -132 -133 -101 47 -21 1 190 175 -255 40 38 -193 168 86 174 152 169 171 98 75 -256 208 218 -25
3208b5j06L17k94K43j26j17J72J21k05J7J77l04J38J09m91O28l04K8L22j51l5
$$ -25 -131 186 -108 135 9 -108 64 185 -20 -3 174 -130 8 117 -374 254 -50 -22 300 149 114
3229A14j2r0N0M8j11K78l20L36m29K47N0o3q2r0M6j28J69L2NmR6j25J57l6k05
$$ 114 102 12 62 110 -1 277 -43 293 -136 111 161 98 16 -74 -28 -156 13 45 50 46 142 17 174 138 -67
3254f7j3j04R5J21R1k50K26J9k46Q4N4nk78K48Q6p0k96L08Q5j63J36L7m3j6J31
$$ -67 -80 -184 -89 32 123 -127 99 118 -128 -44 10 5 -273 -25 61 -9 -305 3 88 -75 61 98 55 39 170
3279A70k1O1j6l90mK52K39m68K18mR9P5j94j2K93l70M2J7o5L17l57L4L10n09L12
$$ 170 149 210 194 -196 -200 52 291 -177 41 37 136 211 17 5 298 -72 -30 -13 -78 239 -118 -84 226 -283 29
3304B9oj26J76k12J1P0kRJ97m07M24k57o1L56j60M5L5j06Q5N5m61L75Ok10J95
$$ 29 23 -103 73 -139 -128 -58 -60 -51 146 -261 163 -94 -155 201 41 86 121 15 100 155 -306 69 75 -135 60
3329F0r2o4J28j17J75k1k46l0K42k18J13P3j35L85n19K47J7P1Q6k79M5K65k45
$$ 60 -32 -96 32 -85 90 69 -177 -207 35 -183 -70 3 -132 253 -266 -19 -2 69 155 -124 -79 186 -59
3352e9J53k28R8K23k85J04kq3q8j91M12Q0j86j94J73j9J34j86L11l7k44N32l45
$$ -59 94 -134 -36 187 -98 6 4 -79 -167 -358 54 134 -52 -246 -73 -92 42 -144 167 130 -114 418 73
3375G3j7J23k85J56K99k89K13j07j21M6p3o5L89l96k7J53o1J27K4o3L7k33m7L22
$$ 73 56 179 -106 50 349 60 273 166 45 91 18 -47 342 -54 -81 72 11 138 162 99 136 -97 -144 178
3399A78n50M42n7j91K48k59J58K8q1k9M14m66L7R9j3J20j08j52J72Q4j52l0Q3
$$ 178 -372 70 13 -178 70 -189 -31 -3 -84 -113 301 -165 -128 -29 -42 78 -30 -182 -10 74 -78 -108 -25
3422b5j20p4J69m9K23k8m5k21K65k45L73k60J11R3m46M33k13n7L12k24q7K83k80
$$ -25 -145 -219 -50 -99 124 96 51 -170 95 -150 223 -37 74 167 -279 154 -59 -116 196 -28 -115 168 -112
3445a12K04r4k69L75N6n28L53j36L1L01l59K62K52m15L28P1l59K68p00K48M87
$$ -112 92 -2 -271 104 160 -368 -15 -151 -120 181 -178 84 336 -79 249 320 -39 229 -471 -223 264
3466B64p5m2k26J46M9k30j88P27m45j70K11J32o1k26k17M42k6j54L5j10O1P0K05
$$ 264 189 147 -79 67 116 -114 -302 425 -20 -190 21 153 92 -134 -351 91 65 -89 -54 -164 -103 -33 172
3489A72j80Q6n6j92J69j10J52j35nP4j49O3J52L6k47J13K43l43N82o28M2O2L12
$$ 172 -8 78 22 -170 -1 -111 41 -94 -99 -25 -174 -111 41 77 -170 -57 186 -157 425 -203 -161 -99 213
3512B13k46r8k9J56K07l26K41k51P1K36k91J37J45n14L65j28J30K86n95K29K59
$$ 213 -33 -131 -160 -4 203 -123 118 -133 -62 174 -117 20 165 -349 16 -112 18 304 -291 -62 197
3533A97k03j66K74n11N45m5j76N06m50j49M07l24O7KqL23r5l38p5K55k74M18n04
$$ 197 -6 -172 102 -409 136 91 -85 421 -29 -178 229 -95 -28 -26 -34 289 194 -144 -219 36 -238 180 -324
3556c24Q7K62k60K05j49N4q2J99j1J12j22j0K36k08j28NJ51M8J93m40R4M51m45
$$ -324 -237 25 -235 -30 -179 -125 -207 -8 -19 93 -29 -39 197 -11 -139 -134 17 65 258 -182 -88 363 -82
3579h2M20l82j05J84j08J92qm28JK36j05K90o9j78L07k34J8O6j52K90m60J64K3
$$ -82 338 -44 -149 35 -73 119 111 -317 -316 -80 -185 105 36 -142 165 -69 -51 15 -137 153 -307 -143 -120
3602a20J12J0J79k31j68N14m42j66O24o16L69J54j99J98O5m26L71l09j48M93j64
$$ -120 -8 2 181 -50 -218 296 -146 -312 312 -304 65 219 20 218 283 -143 228 -81 -229 264 100
3623A00j37O2m49O29P0n41J75j8o6K88l89M19J66m14J5K18k28P1j35k5K30n4r4
$$ 100 -37 25 -424 205 275 -266 -91 -109 -175 113 -276 143 309 -105 -90 128 -100 -29 -164 -189 41 -13 -107
3646a07N1J17k35O18n13K33k37j42J77J42m43N38j94l06N67n38K47J39O0j31j17
$$ -107 -56 61 -174 444 -69 164 -73 -215 -38 104 -339 199 5 -301 266 -272 -25 114 174 43 -74
3667g4k29L53Qk22L92k77N7J28K8K5j26m12M95J00j25O3j91J30j00j14J57J81
$$ -74 -303 50 58 -164 228 -49 8 136 164 189 63 -349 146 246 121 184 -7 123 23 -91 66 247
3689B47k49n6K67j90M18l94l49M37k71K09L5k47J74K3j02J08R3j30o5k60J10L36
$$ 247 -2 -58 209 19 437 43 -306 131 -140 69 104 -143 31 54 -48 60 153 23 -42 -302 -192 144
3711A44l74M4L12k74k2K48j72K50j78J93Mq6m07L44m8K93n2m39J75P8k28L85l33
$$ 144 -230 -186 126 -148 -170 78 -94 156 -22 171 175 89 -318 26 -22 271 219 -220 -45 33 -195 190 -143
3734a43j05L11J58l98L62k64k6K0J67k3L35n48L10j60k30N27k83KM44o21K77J9
$$ -143 -248 63 221 -177 185 -79 -105 -85 82 59 394 -154 156 -4 -234 293 10 12 456 -165 112 131
3756A31m16N13r0l61M54k29J35L1j94J07K98m19J57j31M8k4j18R2L59k22j92J72
$$ 131 -285 228 138 -223 231 2 137 168 -26 81 379 -40 117 -14 34 10 -108 -16 343 121 -71 101
3778A01p6J47j94nK13k49L3j36J39k6Q8l94L21R2k06N5K73m42N20m41J10K95k81
$$ 101 25 172 -22 -27 186 -63 -30 -166 -27 -53 35 -359 -38 54 -152 -97 176 -266 254 -187 -77 218 -63
3801f3j03N0J75M8p2n0J03m6L9m7J09l81N40o20N29j27k82J94Pj91K54k63J83
$$ -63 -166 -116 59 107 35 -15 88 42 81 34 143 -238 302 -318 211 84 -198 -4 3 -188 66 -197 -14
3824a4M26n35N5L55k47p0k0k14N18on28K90J24j17P9o2o0L97m21j27N21l64J13
$$ -14 412 -123 -68 287 40 -30 -50 -264 254 248 -280 10 134 17 96 34 -26 371 -50 -177 344 -20 93
3847I3K6j79K21r7j54J40P4n1l1j8j76M9n4K45l94K73J34j23m7L4j47JJ06Q5j32
$$ 93 119 -60 161 64 -90 50 124 73 42 24 -152 -103 -157 88 -306 -33 101 -22 -69 -35 -182 -181 -75 10 -122
3872a22J92q1k06L40l98J93J95j28l5Qk5K64l77R5K12m69N12kl50M25l17l51M07
$$ -122 70 -11 -217 123 -275 -82 113 -15 -50 -42 -67 197 -180 -85 127 -342 170 168 -182 243 -74 -425 -18
3895a8m6J03P0l15L20J91l79J95p9k34K92m07N00J46p79M73M9k97M87k92kK10
$$ -18 -64 39 109 -206 114 305 -74 121 42 -192 100 -307 193 339 -440 33 82 -215 272 -20 -22 188
3917A88l49J86K41m23M58k60k28J48L6Q3J4k15j37K67j30K01lj70q0J87M8q2J43
$$ 188 -161 25 266 -157 301 41 -187 -39 -3 80 94 -121 -258 9 -121 80 77 -93 -173 14 62 -20 123
3940A23l48J82L40l21n4J32p5rk17J04J03m7J13L1q7q4J65N5J33k13J48j13j39
$$ 123 -225 -43 297 -24 -78 54 -21 -30 -247 -143 -40 -87 26 57 -30 -114 51 106 239 26 174 61 -78
3963g8k1L84l24J24P3j16j63r8L24K37k63Pl4j65J69K7N5Q5n6l50O21n33kK98
$$ -78 -99 285 -39 85 158 42 -121 -219 105 342 79 86 52 -113 56 83 138 223 167 -183 438 -95 -97 201
3987B01n41Q3K63o3M5J9r6Q6n2J21j7j36j48K69J40j24n4r7R5j31J85J50j41Q
$$ 201 -340 -257 6 -57 -12 7 -89 -3 -55 66 49 -87 -235 34 174 50 -4 -101 -6 -137 48 198 57 65
4011F5M5p4J76l13J28j4J68k62M8J55l05J80o5l68O44j72j80J91k34K65N9j20
$$ 65 110 36 212 -101 27 13 181 -81 -33 122 -183 -3 -68 -436 208 36 -144 47 -187 78 137 17
4033A7J02j42j05L86j98j40M4M2k46M91j34J02L8m42N29n30J39J95j01J4K35l81
$$ 17 119 -23 -128 258 60 -80 -36 6 -240 251 117 219 257 -185 344 -186 -47 148 47 61 296 -85
4055h5J70Pj96R6J22j19J64l13L3K25N8k62K85j33j88L51p6j57P5j08k0J52n8
$$ -85 85 92 -104 -8 114 -5 159 -154 -121 104 162 -100 185 52 -136 215 139 -18 57 -51 -71 81 23
4078B3J75j37k4l7j27J60q9Kj11K16j26j84K18R5o8M9j98J99n0j9N3k05K16j81
$$ 23 198 61 37 0 -127 33 -56 -54 -165 51 -75 -259 -41 54 -14 35 -163 36 -14 -33 20 -185 31 -150
4102a50J00K13k30J11q8j66K72R8m16J84m4J8M35l13P7J31r7j02R3j38K3J98m43
$$ -150 -50 163 -67 44 -44 -210 62 160 -256 -72 -116 -98 337 24 101 232 135 33 126 -12 11 209 -234
4125b34M76l43PN44o59j04M61l95K74J28l37K00J32l13K60j56O5J72k17J7J35
$$ -234 242 -101 -94 450 -209 -313 148 -247 27 155 -182 18 150 -163 97 -59 6 178 -39 -22 113
4146A13l22K8N54l53q5L21j51J08k57n9L04k53R7J83l86R5j48J19Q5R7k82J87
$$ 113 -209 -181 373 20 -65 256 105 213 -44 -103 201 -52 45 228 -158 -63 -211 -92 -7 90 -192 -5
4168eRm16P19n21J77L16m80L38M7l70L32J31l93J45n0L2J42k57J33J39l12K11
$$ -5 4 -412 307 -214 -37 279 -201 137 184 -186 146 277 -116 29 -21 11 153 -104 29 168 -144 67
4190F7M2m47N48l25j18N56k95l4O4j16j0K46j83K67l17k04L69j28QJ20k84K08
$$ 67 109 -338 210 -115 -233 323 28 -6 58 -58 -68 178 -5 262 -55 -259 110 -18 -10 110 -174 34
4212C4J05j82J86l56J55K16j27r2M36n56M3M89l14j52K50m20L90j89K1q6J07q4
$$ 34 139 -43 143 -213 -58 158 31 -61 375 -181 -138 351 37 -115 135 -285 105 -84 -63 -149 -42 -126
4234a26L61n73J71M94k57rOj79M6J68k97L20r9k09K53l9j56M30l67J66j54k69
$$ -126 235 -338 -167 327 70 61 67 -112 -66 102 -195 125 26 -183 70 31 -125 305 -62 104 -50 -319
4256c19M00m16K53J76k54J15L82k65j30L03n02K80nk89M31j9m13O34p32K05L16
$$ -319 81 -335 -82 94 -160 -45 337 72 -58 245 -257 23 18 -271 160 141 -272 362 -370 -165 151
4277A51l24K87o1k28K33o6j74K22j46K05P3m4R2o3l92J50J88k55N24l73q2L15
$$ 151 -173 114 53 -175 58 -8 -182 40 -106 99 172 128 220 157 -235 -85 103 -152 372 -1 -83 232
4299B32m49J04M87m45K65J28o01K98k0k05J21J7o8J73j17N4O3k67J40K53n87M47
$$ 232 -217 -113 374 -71 194 322 -279 19 -1 -206 -85 -68 -136 37 -80 -26 37 -230 -90 163 -424 23
4321B3M5k30K22j02j57M46k27k59M81l03J5J25k89J74Ok01K85p2m9L40l94o2M21
$$ 23 68 -162 60 -42 -199 247 20 -239 242 -61 -46 79 -210 -36 -30 -231 54 -18 -67 273 -121 -183 238
4344B38l41J73R1k07K11k36q0N95m70KK06n21M84m1m37M60N7j44K49k71N6K90
$$ 238 -103 70 161 -46 165 -71 -151 444 -26 -24 182 -339 145 104 -333 127 184 40 289 18 74 364
4366C64n85J79K88l30j2J51J84k20j32R3J29p5k63L51p3n7m8k34K46L02n86L47
$$ 364 -221 -42 246 -84 -96 55 239 19 -113 -20 109 34 -229 122 49 -8 -56 -290 -44 258 -328 19
4388A9k5k8K26k82R1N18o08J00L56n28K70J04m57K67j14j89L75k22n8M60n20L24
$$ 19 -6 -34 192 -90 1 519 -89 11 367 -161 109 213 -244 23 -91 -280 95 -127 -185 275 -245 79
4410G9K24o00L47j4j96L88m81N8N59o16M38n2m64L77K17n11K81k0l5J95k70P8
$$ 79 303 -297 50 36 -160 228 -253 -195 364 -252 186 134 -330 47 264 -247 34 14 -21 174 -96 -18
4432a8J52l83L56J19l86L21L59n21K85n44J28M14l00j49L98l11j0j6m1K19K30
$$ -18 134 -249 107 226 -160 161 520 -1 284 -260 -132 282 -18 -167 231 -80 -90 -106 -147 72 302
4453C02k61R0pq2J13k92J56K92l65J59%j27M18m53j94L12j24J31L37n19L53j24
$$ 302 41 131 124 42 155 -137 19 311 -54 105 105 -22 396 -57 -251 61 -63 68 405 -114 239 115
4475A15n13M31j3j67M28k23k33K73k01K26J30l82J64J46n39P98n19j53O09n44
$$ 115 -398 33 20 -147 281 58 -175 98 -103 123 253 -129 35 181 -358 440 -79 -232 377 -167
4495a67L4N49o90L71ql24M74p9l91N09k87R2rk32p3L15j80Q4R7l04M05l67K18
$$ -167 -133 416 -274 97 89 -235 239 160 -231 278 -9 83 74 -158 -231 84 -96 -12 85 -219 186 -181 37
4518C7J9k68l5M32n30J43P4j68L12l8l55M21O0j94K66k10j55K12j67L24j88k16
$$ 37 56 -212 -247 185 -345 -202 -128 -296 16 -22 -377 44 104 -90 176 -34 -189 23 -144 180 -8 -224
4540b24L79J21n26K07p2j04L03k43J70K33l03J61J10k84J21j00l19M88l83M7L31
$$ -224 155 276 -250 -43 -115 -219 84 -159 11 244 -59 102 212 -72 49 -51 -370 118 -265 -218 113
4561A13k42Q7K23m61M18j83J68O4p8m0J05k89M5K90j14k01K35l73K50N2k35L41
$$ 113 -129 -42 181 -280 138 -45 123 187 109 69 174 -115 -70 220 106 -95 140 -233 17 69 -166 175
4583A75m9j48O7m38M68L35q23O07j83j75J66k72M9M53m41m5M48r8j55L54l96K32
$$ 175 126 -22 45 -393 75 410 -413 194 11 -164 2 -270 -221 232 -209 -254 194 96 -59 295 -101 131
4605A31j63%PL17n82J23J02Q5K18l72L43l94j7K81J1m01M03j18p8l9nK36o9j29
$$ 131 -32 -32 -25 292 -290 -167 -65 20 238 -134 209 -185 -202 79 90 -311 92 -26 -104 -143 -148 88 19 -110
4629a10M01j32j76K06l76J67J02Ql95M55k96J76P4p1J60k57J50K50k78k72M01
$$ -110 291 159 -17 189 -187 -20 82 90 -305 150 -146 30 104 33 193 -64 86 336 58 -214 187
4650A87l61J48K07m11R9L16l49L44p5k09J37L1j0K1q9j4O5l74M96j63L6Q4j88
$$ 187 -174 -26 181 -230 -131 185 -164 180 105 -104 33 64 54 75 -14 -28 37 -337 159 -4 32 116 -72
4673g2K01r1k86J18K64k08p8L76n90L03L87n38K39J62k02J87k91L5K54k82K66
$$ -72 129 38 -248 -130 134 -74 -152 224 -366 -63 324 -214 25 187 -15 172 -119 -84 170 -112 154
4694A54J5o25M02J95j55K34l87K27K4j49k42M26j53L42l98k11M42k39P4K28n9
$$ 154 169 -456 -54 141 -14 220 -167 60 84 -65 -307 119 -34 308 -90 -301 141 -98 -24 204 145
4715A45j48L7j03M3K13l25M24k27j77J80O0O3j55J28j59L07l02O0Qk5K51k82j21
$$ 145 -3 34 -69 -26 187 -138 286 59 -118 62 122 185 30 158 -1 306 4 64 72 47 298 16 -105
4738a05K12k96K6K83k99J24J38k9p3J81l22r1L29j90K30j19M0k8l18M05k43j00
$$ -105 107 -189 -163 120 -179 -55 83 54 -19 162 -160 -251 78 -112 118 -1 39 11 -307 98 -145 -245
4760b45L37l1q7K62j36j65J17j1j10K68m31K01K1J4K73k57j04L08j31k04J98k30
$$ -245 92 61 -26 236 100 -65 52 41 -69 199 -232 -31 -10 4 277 20 -84 224 93 -111 87 -143
4782a43L14J50l23l6j36j12L49J7o8j2j97L02J74k95J2K57n47O40l17k09M65j2
$$ -143 171 321 -2 -38 -174 -286 63 80 12 0 -197 105 279 -16 -4 253 -294 346 29 -180 285 273
4804B73j65J75n02L02J01j56j16m7L6N1J48O9j20p5j32L75k40J54K3l13J64J48
$$ 273 108 283 -219 83 184 28 -88 -135 -99 -48 100 169 49 -26 -158 217 -23 131 154 -159 5 153
4826A53k82n0L28k19N5j40J51J54p7J36k43N8j06O4j55J63j3j1J08l09J68L02
$$ 153 -129 -179 149 -70 -15 -155 -4 150 73 209 -34 24 -82 -18 -173 -10 -23 -34 74 -235 -67 235
4848B35n56J60N6k24N43k49m0K38m66J86L47o35L93K32k43J27J13k99K57j59j19
$$ 235 -321 -161 -105 -329 214 -35 -75 163 -303 -117 230 -405 -12 220 -23 104 217 -82 175 16 -103
4869a03K20l3p6p1J96o4k9j00K23j55k89J98J19j28J2j09L6K25o8J16j48J32j23
$$ -103 117 84 8 -63 133 69 40 -60 163 8 -281 -83 36 -92 -80 -189 -153 72 4 120 -28 104 -19
4892a9j39j3K96l37K07m8J30j96o%j7L77k10P8j3k38L36k58j53J88j14J69J98
$$ -19 -158 -171 125 -212 -5 -53 77 -119 -125 -125 -142 235 25 103 90 -148 188 -70 -223 -35 -149 20 218
4915B18m83K52j04lK06q9j28L94l82k5K73l05J06K26j45J38l45J47J89l70J78
$$ 218 -265 -13 -117 -120 86 -3 -131 263 -119 -144 129 -176 -70 156 11 149 -196 -49 140 -230 -52
4936e2J86j47R8k87M6M40n54j3K70m3j46J25m6J95j15K06j71P7k02K30j89J42
$$ -52 134 -13 85 -202 -156 284 -270 -283 -13 -56 -202 -77 -123 72 -43 163 -8 69 -133 97 -92 50
4958E0J25k27n9j9KL09J3l16P3P7n3M6K9j33J99l45J36P1j5M7J90k25N0o6l8K82
$$ 50 175 -52 -111 -130 -128 181 194 -122 -49 28 -25 21 50 -83 116 -229 -93 -22 -37 10 200 -25 25 -41 -79 203
4984B03l19J28J1J51k13J38K3q3K84p47M20O4k93J86P1j63M29m44K01O8Q3l41
$$ 203 -116 12 23 174 -39 99 122 39 323 -424 -4 60 -233 -47 24 -139 290 -154 47 115 198 -143
5006a43J37k62K76k08J68J09m2j85J35OJ30K38m48K60j14j58J43J70l46M77n84
$$ -143 -6 -268 8 -200 -32 77 35 -150 -15 -9 121 359 -89 171 57 -101 42 212 -134 343 -241
5027b41K11j1N0J37l18K20J16j20q8j48L14l57M25p2r7Rk11Q2L45m67l5J44P5
$$ -241 -30 -41 9 146 -172 48 164 44 -44 -192 122 -235 190 118 21 30 -181 -99 246 -221 -256 -112 -37
5050c7K50k22m9lQ2q4K14k0k9J08l71L0L82k89J8j45j13M17l61J08J73o2K9k83
$$ -37 213 -9 -58 -61 21 -63 151 131 102 210 -161 -131 251 -38 -20 -165 -278 139 -222 -114 59 -3 26 -257
5074b57O9M27k80K4O3j57n3L30j09K7R3k69K63j27j28J11K05r3o8k98K74j22Q5
$$ -257 -188 239 -41 -17 46 -111 -164 166 57 84 177 -92 171 44 -84 27 232 139 71 -227 47 -75 10
5097A0j12K22Lj96J68P6k01l49J23K93Mj47L1P8J70K3l53K99k33qK21k05J71r5
$$ 10 -102 120 123 -73 95 171 -30 -379 -256 37 41 -106 -75 3 173 196 -157 142 -91 -99 122 -83 88 -7
5121gQ5k1K92l98J77N4K8n8k66J57LK48k75k7N7q9q0R8j41n4J06J62j93k30M78
$$ -7 78 57 349 -49 128 182 210 152 -114 43 46 294 19 -8 49 -40 -120 -22 -163 -217 -111 51 -142 -372 106
5146A06j03L2J6q2J43O2n9Ok11J6J38j78Q3J51j80J16J6j46J74j48M23k81p0r
$$ 106 3 35 51 -31 112 174 115 121 -90 -74 64 -114 -31 120 -60 56 72 -74 100 -48 375 94 24 15
5170A5k10K62M7m9L4j13J77j04j15j29J00Q7j35JK24j53j11L84k03J89j99K5J00
$$ 15 -195 67 114 65 99 -14 163 59 -56 -185 -85 2 -133 -132 92 -61 -172 212 9 198 -1 24 124
5193A24R1m41K77pN0K8k71J67J23k54J18J08r1J31j66j85K96o2l15N10j44J30
$$ 124 215 -226 51 44 94 122 -149 18 141 -113 5 113 22 153 -13 -198 98 36 -279 231 87 217
5215B17k72M7L82m93K91J0j77o5J60l98K11J56k23K75OK8j52M1r0J02j8Q3l33
$$ 217 -55 -8 374 -119 172 182 5 -60 100 -298 -87 69 -154 121 127 155 3 44 -46 56 38 121 -212
5238b12K17J26J41l16J99k91O0j77J24l7L71k28n4K37k96p3J29J74p2R0K0K5k58
$$ -212 5 131 272 -44 155 -136 -76 -253 -129 -166 205 -23 -77 160 -136 -209 -80 94 22 112 132 157 -101
5261a01nL67m03J14R3q3J26p7j33J81j7k36J88j82M11j67k20j85J84n8J67J16
$$ -101 -106 261 -142 -28 65 -18 108 31 -102 79 62 -174 14 -168 243 76 -144 -329 -145 -203 -36 80
5283H0q6K29Ol70J09m4j24L90o1p0n7n6L05l28J5K25k00J00j42l9J05P6j67J21
$$ 80 -6 223 229 -141 -32 -76 -200 190 129 59 2 -54 251 -77 -62 163 -37 63 -79 -118 -13 63 -104 17
5307A7P7Ko3M9nj37P8k25K46j3L7K9k26J41J26k28R3j45K31Nj94P9J35j29J32
$$ 17 94 96 33 82 77 -60 18 -207 39 26 63 92 -134 7 133 -95 -2 -147 84 89 -105 -26 109 -20 112
5332A12k03J02OrK7J35Q0k93o2J97j64j10K28j24J24j62K68J70l14pj95J16J91
$$ 112 -91 11 17 8 35 170 250 -43 -105 92 -72 -182 46 -78 46 -116 152 322 8 1 -194 -78 113
5355A13j41r9L48k17L03l09QJ14k76O7K07K8P5r9l85N71j51j74J02k66J86J04
$$ 113 -28 -127 221 4 307 -2 6 120 -156 -89 118 146 221 122 -263 308 157 -17 85 -181 5 109
5377A09l48K64Q2j47k63L27k69L41n8J77k27k48L67j62j81K46j7j27J05J23n0
$$ 109 -239 25 107 -40 -303 24 -245 96 38 215 -12 -260 107 -55 -236 10 -7 -134 -29 94 44
5398D4P6k43o9J95J07r2j1j27M9Q8j02K91j1m41K24M0j03q4J2P0j90L82j05o9
$$ 44 120 -123 -192 3 110 18 7 -120 -71 17 -85 206 195 -246 -22 18 -85 -169 -157 -87 -277 105 0 -69
5422f9M2m5J71j94o6K25OJ56q2k11N3j10K58k33k08M46j02k90N21l07p1J26n5
$$ -69 -27 -72 99 -95 -161 64 70 226 144 -67 -14 -124 134 -99 -307 139 37 -253 268 -39 -110 16 -39
5445c9J4k23ML30k75J24K72m20K15o5j49K90j42j27K68r7K26j34n7M3Kj79J01
$$ -39 -25 -248 -244 86 -189 -65 207 -213 2 -63 -212 78 -64 -191 77 -20 206 72 15 58 60 -119 -18
5468a8J01J26J08j60j40K49l35O0o9K10q7j04K23L9m8k01J42r3o4L0q3O9M1j74
$$ -18 83 209 317 157 17 266 -69 -9 -78 132 45 -59 164 203 155 -46 96 3 -61 -31 -114 -45 -4 -178
5492a78J20JN2j10K4J99P6j77j26J62K72l20N5m4q8r3R2O5jR6j08J59j46N7j36
$$ -178 -58 -57 -5 -115 -91 108 184 7 -119 43 315 -5 50 6 -82 -175 -83 -18 -19 77 -31 128 -18 39 -97
5517i7L6K23o2j97J52j45K29k01R8K89j93l6nj94K99l19J40j9L7q5j67n5o2L59
$$ -97 -61 162 100 -97 55 -90 139 -62 36 325 132 96 91 -103 196 -123 17 -2 35 -50 -217 -272 -334 25
5541B5j16K21j8P1j53P9J7Mj86o7L66l57K20K2j55J27k38J76R5j48L9J02j29m16
$$ 25 -91 130 112 183 30 109 126 130 -56 -123 243 -114 106 128 -27 100 -138 38 133 -15 24 126 -3 -419
5565d19M44P6k21J42k08J71J16P3k16J3P0j27J61k53J27N7J12j27K3J2j24J32
$$ -419 25 101 -120 22 -186 -15 101 174 -42 -29 41 -86 75 -178 -51 6 118 -9 14 26 -98 34
5587C4o1j9K41l49M6J98l4k5j58o4J89o0j28N3k41L96p1j95K79J13k18J16R9p3
$$ 34 -27 -46 195 -154 -108 90 56 31 -127 -191 -2 -62 -190 -137 -378 18 -53 -248 31 144 -74 42 141 68
5611F8j23p3R1J9j4J52j87N5K0P6Nj27M8K73l16O4k1QP2n0K5j74O1J37k28J78
$$ 68 -55 -128 -37 -18 -32 120 -67 -12 8 84 89 -38 10 283 -33 31 10 18 90 40 65 -109 -48 89 -139 39
5637C9K76j87j01J24k35K49N7k11j40J93p4j18J82l22L29J6l79R1J34K73k31O6
$$ 39 315 128 27 151 -84 165 222 11 -129 64 -10 -128 54 -268 61 77 -302 -211 -77 196 -35 31
5659C1j22j04K27Kl1L5k81R2k2O3J84k22M07l14K16m03O3K74j54J11J05j03N9
$$ 31 -91 -195 32 34 3 38 -243 -151 -173 -110 74 -148 259 -55 161 -242 -179 95 -59 52 157 54 113
5682A13q8r7J13p1K3Rj39K88k64K26j6k27J53j32K0L0M3m1j15K91k23j11J65N8
$$ 113 25 -72 41 -30 -7 2 -137 151 -113 113 97 -130 23 -109 -89 -59 -16 -57 -172 119 -104 -215 -50 8
5706HN2j80R7K21l01L71j18J67l72J06r1K54j97K4J26j89k11M61j58j2j96J00
$$ 8 60 -120 -23 198 -103 268 150 317 -55 51 -40 214 17 41 167 -22 -233 228 70 58 -138 -38
5728c8m5J15k7j94J77Q2r2m3j94K77j57M8k0L79m56L44P9j66k53O7N8J00p2pM1
$$ -38 -83 32 5 -189 -12 70 -22 -65 -259 18 -139 -91 -111 268 -188 156 235 69 -184 -117 -59 41 -31 -38 3
5753Cj9k5q9N1J73q6K64M2m92M36l04JJ05j12J47J32k13J06l20K46k7M2J09l09
$$ 3 -16 -41 -130 -79 94 8 272 314 -178 258 -46 -45 60 -52 95 227 14 120 -200 46 19 61 170 -139
5777a39q0K54R1j52n1J95j05L3j9n4p7QpJ20J9n5l9k07K86r1K75k77J30j34J50
$$ -139 -219 35 126 -26 -77 118 13 46 27 -27 -104 -96 -103 17 36 -19 -58 -265 21 -70 205 -72 58 -76 74
5802G4M7j92q2J00kJ62j46q1J61N1j34K56j49mj85J56l4K78j68j08l7j31K51k75
$$ 74 121 -71 -153 -53 -55 107 -39 -120 41 92 -42 214 65 61 -124 32 -2 276 108 0 -37 -168 83 -192
5826a92K49kk09J60J13j21m5q3K17K8j70R8j82m4K32k04P8k2P9P0K2L0p3k1j29
$$ -192 57 55 -154 6 119 -2 -47 -130 87 115 -55 43 -139 -183 49 -155 -77 -99 -20 50 72 102 29 8 -121
5851a21L17l67K89N5l85K92j74m6K21K48n55J01P8q1N0J04j1l1RJ9L6k14M05k23
$$ -121 196 -171 118 173 -212 80 -94 -140 81 329 -226 -125 -47 -128 -78 26 15 -16 -7 12 48 -166 239 16
5875A6k83M52r3j78K02j23LJ80k9LK8l97J56O3R3m5J84k26j07O3M5j08O6K03j54
$$ 16 -267 185 92 -86 116 -7 -4 176 147 150 178 -219 -63 0 93 48 232 6 -101 -38 7 -101 -35 168 14
5900A4k90K98J38j70k52K99j52j14J63J23L22n76L38n1j80K55j92K6pj67J69p5
$$ 14 -276 22 160 -10 -262 37 -115 -229 -66 57 379 -197 141 90 -90 165 -27 -1 -8 -175 -6 -81
5922h1O3N3J8k1K66k48j56J09k68K58o2qN9J53j50P8J56m52J99o7K92l1k46J52
$$ -81 -18 35 53 32 298 50 -106 3 -265 -7 -69 -77 -18 135 -15 63 219 -233 -34 -101 191 160 -86 66
5946F6k10P1M5K08l11R5o4K36k7j01m1n6p0K01P3k48K57k92Q0j04J18M9N1l15
$$ 66 -144 -73 -28 180 -131 -36 -100 136 109 8 -33 -89 -159 42 115 -133 124 -168 -88 -192 -74 -25 26 -289
5970b89L36r0J4J92k51Qm2K34P2j23K98n46J52R9n1j35O0P5Q6l21K45P4K5l26
$$ -289 47 -43 -29 163 -88 -80 -122 112 184 61 359 -187 -35 64 13 -122 -62 13 99 -222 23 97 122 -204
5994b04J92r5K15o4j64J48j28K43j96p8L50l00k7J12j56J10N4k32K86r1q5J26
$$ -204 -12 -107 108 44 -120 28 -100 143 -53 -131 219 -81 -108 4 -152 -42 12 -220 66 -25 -110 16
6016A6M2j51J20kO3j60q2K49L9k84k9L76j26r4j01J77P3j75p1J08m3l2k3J64Q1
$$ 16 58 -93 27 25 88 -72 -154 95 134 -150 -179 197 71 -23 -124 53 126 -49 -120 -12 -55 -87 -110 54 135
6041A35j07j98J65Pl50M59k33j7L56l25O3K11k30J61P5n2J29q9j92L32l85M38
$$ 135 28 -170 -5 2 -348 111 -122 -139 217 -108 -45 166 -64 97 172 120 249 160 -32 300 -85 353
6063C53j63m23J24o8K41kk80LR4q0K14N9k65L28P5l95J97P4l88L33q6m3K76j3
$$ 353 190 -233 -109 -177 64 62 -218 -215 -121 -201 13 72 -193 135 210 -185 12 86 -302 31 -55 -98 178 165
6087A65l4P8l88L60j87j18K1J21J93j23n14L85Qm3j12M57k29K6l42J81K10J39
$$ 165 131 209 -179 181 -6 -124 -103 18 211 88 -426 -41 -33 -76 -188 269 40 66 -276 -95 115 254
6109B54j60j08j23K6N8r9R6N4J44p6Q1k85K49lk96L42k72R2J72l97K51J02l34
$$ 254 94 -14 -137 -111 -53 -152 -56 -2 142 66 147 -138 111 108 -188 154 -118 -26 146 -251 0 102 -232
6132b32K63o9K9Q4K0j57J79j85L4jq0K56j2k50K10j84J92J0j20J86o7k99J25M
$$ -232 31 -38 -9 75 95 -62 117 -68 -34 -35 -115 141 129 -121 89 -95 97 107 -13 173 106 -193 -68 -64
6156f4m5L15j4r3j78K19l2J57l89j12L05j26J78j8N4L3l46P6L07j71j96J20p4
$$ -64 -109 206 192 99 -79 140 108 265 -124 -236 69 -57 121 103 157 190 -156 -80 227 56 -140 -20 -94
6179i4M3J29L0j21l21K28J48Q6m26N64Q1m91J74J0p9J89j53J44k17L43M2m96J61
$$ -94 -51 78 108 -13 -334 -106 42 128 -298 266 347 -144 30 40 -39 150 -3 141 -76 267 309 -187 -26
6202b6J71k04K0q4K05J12o0j7N9j69k51L74l38J17J5r5K6J36rj06k0K31O3j89
$$ -26 145 -59 -39 -123 82 194 134 117 176 7 -244 130 -208 -91 -76 -171 -145 -9 -18 -124 -144 87 150 -39
6226c9J31k04Q6J76K3j22k9K7l01N57m35j3K44m36K69j13L0M27r0j4j22j05o1
$$ -39 92 -112 -26 150 173 51 22 49 -252 305 -130 -143 101 -335 -66 -179 -149 278 188 174 52 -53 -114
6249a14L46k89n2N4n0O7m4l1K09k0p8k1J44n2K1l52K57J11j01j1o5K63j30j70
$$ -114 232 -57 -109 -55 -105 -38 -82 -113 96 76 -2 -23 121 69 90 -262 -5 106 5 -6 -71 192 62 -108
6273a08j33o2kJ81R6J7O1q9n0P7K53K7k98j08N9K10l73M54j14p9P0k04K41n3j59
$$ -108 -241 -303 -305 -124 -28 -11 50 -39 -89 -12 241 268 -30 -138 -79 131 -242 212 98 19 89 -115 126 73 -86
6298h6J35j13J28j67m2p1J90R0l22L16J3j28P5j86P0K85r4L5o9j20j8N1j20K4
$$ -86 49 -64 64 -103 -145 -216 -26 64 -258 58 71 -57 18 -168 -98 187 93 128 59 -61 -79 -28 -148 -124
6322a24J54K20j46j57J14J74k61J23J54j10k41L16j62k16J4J03J74k78P6J7m6
$$ -124 30 250 104 -53 61 235 -26 97 251 141 -100 216 54 -162 -148 -45 129 -149 -73 -56 -102
6343a02J02k66K92J66k19j08K78j19o6oj33MK75Q7n7l07L54M7l2m71K61l10J86
$$ -102 0 -266 26 192 -27 -135 143 24 -42 -48 -181 -177 98 185 128 -179 175 222 190 -281 -20 -330 -144
6366a44L11k08q8J90j60O3P4r3K49k21k68K13M8L0P1k70K27j03M1J21n5m7M4p4
$$ -144 167 -41 -129 61 -99 -36 38 -55 194 -27 -295 -82 -34 -4 67 -203 24 -79 -38 83 28 -19 25 -49
6390d9q0K15j3j16N7R2o8k03K19P3m8J99l80J40j1L4j95J16l7J89k11m3K37m08
$$ -49 -129 86 73 -43 14 106 38 -165 54 127 79 278 -102 38 27 61 -134 -18 -55 134 -77 -120 117 -291
6414b91K93K4j46J9J02Q3k14J58J75k42M4Mr5O7Q8k0O2k50J68K25l16j70K14j47
$$ -291 2 26 -120 -101 1 84 -130 28 203 -39 5 9 -86 -19 69 49 111 -139 29 254 -62 -232 -18 -165
6438a65K47l17K02j11K39J41n08J71J58O1j71K25j31j42J72l0j86p2L93k21P4
$$ -165 82 -235 -33 -144 95 236 -272 -101 57 118 -53 172 41 -101 71 41 -145 -217 176 -45 29
6459B9K4NO2l0l19N8J00J26n7M0O9k29R3J16k70J85M8l35J10J09J51r3j72L46
$$ 29 53 58 120 90 -229 -171 -71 55 -2 38 107 -122 -29 87 -183 2 50 -285 -175 -66 85 -8 -180 166
6483A66j54j66o7K62k25k1L33m12L28j77r6J51o2L8J17J11l16K15k08J81R4j39
$$ 166 12 -154 -221 41 -184 -205 128 -284 44 -133 -229 -78 -140 -102 15 126 -190 25 -183 -2 92 -47
6505d7K06J36l76oK35k28J59j08J26l16M5K13j86j38K2K44Jl8j39Q8J35k47P0
$$ -47 159 295 -81 -87 148 -80 79 -29 97 -219 -174 39 -147 -285 -263 -19 -18 -56 -195 -107 28 -219 -149
6528a49K03k35K29R9k66K08O1k43O8j16J98j08M5M0o9J6K24j62k24J74O2j15%
$$ -149 54 -181 48 147 -119 89 150 -93 -25 -141 57 -51 -6 34 -35 -19 205 43 -181 -7 55 -60 -60
6551f0J10J87l66N5L8k2K04jO4O3j80M3j09k01J71p1P5j83L45J0m53L87J72l82
$$ -60 50 237 -129 -74 -36 -58 146 145 209 272 92 135 26 -175 -4 -75 0 -183 162 172 -281 106 278 -104
6575a04j55L36O2j10k2Q8o9j58K21j6k69K56o8P8j24Qj13P6K24k08J03k05J94
$$ -104 -259 77 139 29 7 95 26 -132 89 73 -196 60 -8 70 -54 -46 -159 -83 141 -67 36 -169 25
6598B5l3q3K60n8j85o9j38M65k07o5K15np6l6j00r9J98J77j43l5J30k7j40J1P1
$$ 25 -8 -91 169 111 -74 -143 -281 184 -23 -88 127 122 46 10 -90 -189 9 186 43 8 138 111 -29 -18 53
6623E3q0Q0jO4j51Q2k65K84k3J48nl58J06m8K13k6j93K8L31j24m8K5k25K28K5
$$ 53 -27 53 52 116 -35 47 -218 66 43 191 186 -172 -66 -114 99 73 -120 -92 239 115 67 92 -133 95 120
6648A20q9j18K37k04J97k90R5M5l3o3j17J39L14k90K29l66L04j75P7k9L4L2lp8
$$ 120 31 -87 150 -54 143 -147 -52 -7 -40 -103 -220 -81 233 -57 172 -194 110 -65 12 -17 17 49 46 -32
6672c2J22j03Q3O4j77J29M1q5O3l5L9j20QLKM1J18m2m42J92J37K69j17j60j93
$$ -32 90 -13 70 134 -43 86 127 42 105 70 109 -11 -3 0 2 43 161 119 -323 -131 6 275 158 -2 -195
6697a95J41K69k03q4N6M3J45l30K4L81j29j96J14l8L4n1J4p2J2J41M3K1k30L27
$$ -195 -54 215 12 -72 -16 27 172 -158 -134 247 118 -78 36 -2 32 -19 -5 -77 -65 76 119 140 -90 237
6721B37l52K23j69n3J52o0j7J21j06P2J93k88j02n2J43J76r9m16N91P4m29K76
$$ 237 -115 108 -61 -114 38 -22 -39 82 -24 48 241 -47 -149 -201 -58 118 19 -397 194 268 -161 115
6743A15j40K8rR8j93J62l88K85K08M5j89M6j9j1J8j39J79J7j41M4k20L83n07L76
$$ 115 -25 3 -6 92 -101 61 -327 -42 166 211 22 68 49 38 56 -83 96 113 -28 16 -204 179 -328 48
6767D8Q7n3k95O02n88K52k5j28K75o2l18J82J04J68j83k9l02L26N9k21K98m33
$$ 48 135 82 -213 389 -199 53 28 -100 175 113 -205 -23 81 249 66 37 -265 61 120 -101 197 -236
6789b36K21qM0j21J22J8R4j85J79q1m2m1J65k36K05k32J12J36k0N1n1j63k4J02
$$ -236 -15 -23 17 -104 18 36 130 -55 124 43 1 -40 125 -111 94 -138 -26 110 90 141 90 -73 -97 5
6813EJ45j43k06L03j60m2J67n5q7p2J28m2J79O1j69k7O5K0j76K19j39K5q2K5J95
$$ 5 150 7 -199 104 -56 -98 69 14 -73 -145 -17 -59 120 181 12 -15 50 70 -106 113 -26 -1 -83 -58 137
6838A37j72J97j56j61K37j27J13n4p8o0J63J22k9k46J77K3j01P0m7j89J51K00
$$ 137 -35 162 6 -155 82 -45 68 14 -64 -124 39 161 132 -114 63 86 -15 55 8 -181 -30 170
6860A70l71K98l7k13L83l95M09k82NK66k6k76K8L14k17jq6J4r2M00j32r8K2j21
$$ 170 -201 97 60 -153 230 -165 244 -38 -33 233 207 -69 -41 273 56 55 -31 -17 -109 291 159 61 83 -38
6884c8L7J27p0n0J13n8NJ9j24M3J04N6l95K04O9q0J77j89j43L24j43k09J80O1
$$ -38 -1 126 56 6 119 61 66 85 -39 4 108 164 -231 -27 42 -38 139 -50 -193 131 -12 -221 -41 20
6908B0J45l99K59p7J30p3j0j2J2r1Q4J04k96Q7L08m5j34J43j64r0J20j1j79L7
$$ 20 165 -234 25 -52 78 5 -5 -17 -5 -96 -12 92 -204 -117 191 146 12 155 -9 -99 21 10 -169 -132
6932a32J25r1J19o5l8n7K38j50L7R1N8j20k51L10nj48j7Q3l7l6J7L35m8n56M55
$$ -132 -7 -98 21 -44 -82 -139 99 -51 -14 77 135 15 -236 74 69 -79 -96 -13 -50 -86 -69 266 218 -338 117
6957A17K6k21P7M2K30k55j90K06j26J69M7o9l23K26J51k18K57l86L10q8J12k36
$$ 117 143 -78 -1 41 271 16 -174 32 -94 75 122 53 -270 -44 107 -111 146 -240 70 -18 94 -142
6979a42J11j22k98L44J42L46l15J54j95P1k09J34J19l21K64J1q1L5j89L3J68L6
$$ -142 -31 -153 -451 -107 35 381 66 220 25 96 -113 21 140 -181 83 94 13 48 -141 -108 60 96
7001I6k01j2N6p1M9O1J87k47j18L17l11K79j7J02j67J13r3K44k82LK7K9j91J51
$$ 96 -105 -117 -61 -132 -83 -22 165 -82 -200 117 -194 85 68 170 3 116 23 267 -15 -12 15 44 -147 4
7025DL01k83l1K7j17R7m6M33l24O3k86K30p4J6n1o7J83j2j20r9j12J35M7MJ04
$$ 4 305 22 -9 18 -99 -2 -48 385 61 124 -162 68 -6 10 -41 -108 75 63 -57 -156 -268 -133 -86 -82 22
7050B2r9j18L63j10k29J75K2k04K33r9O3K56l06k03LM00j42l1j38R7J1K03j38
$$ 22 -77 -195 168 58 -171 4 26 -178 55 -44 19 275 -31 -234 -231 169 27 -4 -142 -45 -34 169 31
7073C1r1Q9J35J9m95L16L8jq1j50J35L9k82K11P5j14J89o6Pj43K07j54J8J57k9
$$ 31 -60 29 164 183 -312 4 42 41 -40 -190 -55 -16 -298 -87 -12 -126 63 -3 4 -139 68 -86 -68 89 60
7098F0j33J47q0j6J67k6j21K5k4K4J05k4j48R4j3o3R8j24J78r4J34j1o2J9q8j54
$$ 60 -73 74 -6 -22 145 119 -2 23 -1 23 128 104 -44 50 37 -26 72 -52 126 32 166 155 93 112 24 -130
7124a30K27L6o1k67J00J79l84J69K85l65R6K38k91n1K59k9q4Q5Q0L2M1j54n1j87
$$ -130 97 133 72 -195 -95 84 -300 -131 154 -211 -115 123 -168 -219 40 11 -73 12 92 124 165 11 -40 -227
7148b27L81J8k73K24k75Q7j8K4k27L76MRk00J94o6j7j57J40K1K32l13j9L00m14
$$ -227 154 172 -101 123 -152 -65 -83 -59 -286 90 94 103 -97 97 31 14 -143 -3 18 250 -63 -82 218 -196
7172a96K02n1L9j66K14M3j12K6o0P4p3k8K23p9O6l55K55L7J22p4j47k19J69J02
$$ -196 6 -45 -6 -172 42 85 -27 -1 -61 13 -60 -88 135 56 122 -233 22 59 181 107 -40 -259 -90 12
7196A2rJ20j86M9j63J55J8nJ30j99j44L80j55j8j65L96j94kJ05j69J5k5P0J00
$$ 12 3 123 -63 -14 -177 -22 -4 -9 121 -78 -222 158 3 -15 -180 216 22 20 125 -44 -29 -54 16 116
7220A16l2N8j20J06j36J80m3j8k38N1n3J19P4j10l2J23j21J09p4jP9J54j64j46
$$ 116 84 142 22 128 -8 172 129 111 -127 -76 -129 -10 64 -46 -78 45 -76 33 -41 -42 37 191 27 -119
7244a19n1K80K1j4n5O3p7P1j63j3J58k41j04J92J54q0l1M4j28mqL7J17j87J03
$$ -119 -170 110 131 117 62 125 48 119 -44 -57 101 -140 -244 -52 102 22 -9 35 -93 -97 -105 -68 49 -138 -35
7269c5qj78K04j28J90q1P6lk10L33Ml02J17j38L53l05J89N2j85L38k48Np7L7J92
$$ -35 -43 -221 -17 -145 45 -36 40 37 -173 160 164 -138 -21 -159 194 -111 78 130 -55 283 35 40 -37 0 192
7294A92j42j12j51J56J08k58P6J51m2k60L14p8J72j27Q3l9o6mJ58J76j46r0k70
$$ 192 50 -62 -213 -57 51 -207 -131 20 -22 -282 32 -46 126 -1 82 43 -23 -27 131 307 161 71 -199
7317a99J03L5j08J92J68k39K8j23R1J5NJ5Lj41O7kJ71Q7j49k53R0P9J69j50n6
$$ -199 -96 -61 -169 23 191 -48 -20 -143 -52 -37 -32 -17 -14 -155 -88 -90 81 168 19 -234 -144 -65 104 -46 -102
7342a02P7L3m7Q0J4P9j55j0r9L7K26k70L39k84K37j41M4q5r4M4J08p3L2n0R0L0
$$ -102 -25 8 -39 41 55 134 -21 -31 -130 -93 133 -137 202 -82 155 14 58 -27 -121 -77 31 -42 -10 -60 30 60
7368F0j72K97k98J61J8k15J47K41k99J47J6K0kj81J02j2Kj8j28R9L5J54o3N4k0
$$ 60 -112 185 -113 48 66 -149 -2 239 -60 87 103 123 121 -60 42 30 32 14 -114 -15 20 174 111 165 145
7393A45k43K07P7j13o2Q4p4P2L1R5j21k93Q8K19j04k49O6J80Q4J09k97K0L9OJ25
$$ 145 -98 109 186 73 11 95 21 93 124 219 98 -195 -107 112 8 -241 -175 5 89 198 -99 -79 -40 -34 91
7418I1m9pk79K23O4k62M3K12K0o1l8J58k48J37K55l88l8K9K30j26j35Q7J27K19
$$ 91 42 35 -244 -21 43 -219 -176 36 56 -5 -43 115 -133 4 259 -129 -167 -138 92 -34 -169 -82 45 264
7442B64k85j49K64l0r4k01k2J74j15L02q9j51K41k35r1L4N4J9K01j75q5J7L33
$$ 264 -21 -170 94 64 -30 -231 -253 -79 -194 108 19 -132 109 -126 -217 -183 -129 -110 91 -84 -169 -152 181
7465A81k00M1J53k0j23k43L12j13J07K2q6K09k07j0R8k35L03k77K36o2j66K64
$$ 181 -19 22 175 155 32 -211 101 -12 95 117 31 240 33 23 121 -114 189 -88 148 86 -80 184
7487A84l29m5R1L59k30j80L0J30j00p6K8J93j3q8n7P3J06m1J2J2N8P5l28K0J78
$$ 184 -145 -190 -99 260 30 -150 -120 10 -90 -166 -138 55 42 -46 -103 -30 76 35 47 59 117 192 -136 -116 62
7512F2j07m6j67K34p5k9J29K21j22q7k53K01J62j62K7j82o9M42j64M2j18q0L46
$$ 62 -45 -91 -258 -24 -99 -128 1 222 100 13 -240 -39 123 -39 -12 -194 -263 179 15 57 -61 -141 205
7535B05k85k48L20q8p4P4J6Q2j35O9J44j16j54K55r3K1LL87l50R6k99K68p6Q8
$$ 205 -80 -328 -8 -96 -170 -96 -80 2 -133 -64 80 -36 -190 65 -28 -7 -4 383 33 129 -170 98 22 110
7559A10k27j36M9J57R6j91K6J34j69M0QN4J49j5j08k6J0M1m0Q7jl3Q9k51K56j88
$$ 110 -117 -253 -204 -47 49 -142 -116 18 -151 -111 -103 -49 100 85 -23 -49 -39 2 -38 49 48 15 104 -147 109 -79
7585g9m9R1O0j88L32l82P3J90K72n09K84j72M7q%r4Q1M0j27N1K32O7l05M2Q7P7
$$ -79 -128 -37 23 -165 167 -215 -142 48 320 -189 95 -77 -30 -38 -38 -132 -51 -11 -138 -87 145 212 -93 -51 36 113
7611A13j40jq2L30K2l57O8K97k48j88J32p0J81m3j03p3L3K92k32K22p4m8j66K70
$$ 113 -27 -28 -110 220 242 -115 -47 250 2 -186 -54 -124 57 14 -89 -162 -129 163 -69 153 79 31 -135 135
7635A35k44J39J88j62j02J59N3k77R1J36K4q8q1r2P8L8L6p3O8k11J42QJk57L14
$$ 135 -109 30 218 56 -46 113 166 -111 -20 116 140 52 -29 -121 -43 -5 31 -42 26 -185 -43 -35 -34 -291 23
7660B3r4L5O5k21M8K24j53k27M51L9l42K23k4PJ74m5l57J76P0J27j35q8N5J61
$$ 23 -71 -36 29 -192 -144 80 -73 -300 151 190 -152 71 47 54 228 183 -174 2 72 199 64 -24 31 192
7684A92m89J48M11k50nR0N4k39J95j5n4k8j07NJ2m7M20m97K55k15O8NJ67n6N9
$$ 192 -297 -149 262 12 7 97 151 -88 107 92 38 10 -97 -92 -80 -127 293 -204 51 -164 -96 -91 76 20 79
7709G9J54l65L28k4k54J69j75J63n7r4J14j05m7R2M8P2rnJ36j57Mm8K0j37q2O7
$$ 79 233 -132 196 172 -82 87 -88 75 18 -76 38 -67 -114 -22 26 98 89 84 220 63 67 19 39 -98 -180 -113
7735a13K44j29J12j91M0kL77m85j4K17OR0l4r1M0o6q7J44j12j15K4P7J53P3j67
$$ -113 131 2 114 -77 -37 -39 338 -147 -161 56 62 152 118 27 67 1 -86 58 -54 -169 -145 -68 85 158 -9
7760iK42k32j17O3P8k27K76j57K11j70p8J22k21K10o9k8N6J26p2J51j02K16m93
$$ -9 233 1 -116 -53 25 -202 74 -83 128 -42 -120 2 -219 -9 -78 -106 -50 76 4 155 53 269 -224
7783b24p5K82p8J09j27L09p1l00J95J0j68Q9q6K47j40K33o1j03j40J50j13j61
$$ -224 -299 -17 -95 14 -113 196 125 -175 20 30 -138 -49 -135 112 -28 205 144 41 -99 51 -62 -223
7805b23J15M2N3j22m8L24q5qp4j4K39j82P6M0k07J52p3p7L9j5J23r7J13j55K43
$$ -223 -108 -66 -13 -135 -183 141 56 48 -26 -40 199 17 93 133 -74 78 5 -72 -33 -48 75 -22 91 -64 179
7830A79j14k30J5Q4J55K17m46J56Q0k38J07K14j41L3j00n7o0N1J17N3q4J75k00
$$ 179 65 -165 -150 -66 89 306 -140 16 96 -142 -35 179 38 71 -29 -86 -146 -95 22 75 -9 166 -34
7853c4K80l10L0L0R2j90j96K70n8k17L48J14jk98J52Mm0K33j34%j21m8J80J44
$$ -34 246 -64 -34 -4 88 -102 -298 -28 -86 -303 45 159 158 -140 12 16 -24 209 75 75 -46 -94 86 230
7877B30l11J79j90o8J49N4j09K81k29K02J26m19J11j06N16k84j95m5K58p9J24
$$ 230 -81 98 -92 -160 -11 43 -66 215 -14 188 314 -105 6 -100 416 132 -63 -108 150 71 195
7898A95j77n2n1j43J62Q4P3j07l1j16J72K91j30j04J62j77k25J18L1j15J57J93
$$ 195 18 -34 -85 -228 -66 18 91 -16 -47 -163 9 300 170 66 228 51 -174 -56 -25 -140 17 210
7920B10r0l75L34L9k32J0J50R0r6Q8k54J43N8j39j24J14km6JJ25r2J79J26j97
$$ 210 120 -255 79 118 -114 -104 46 136 40 128 -126 17 75 -64 -188 -74 -76 -122 -121 4 -88 91 217 20
7944B0K13k84O8l40K39N4J29k08K33j43J45j39J00J07j91K26j03j27r1M7kk52
$$ 20 233 -51 17 -323 -84 -30 99 -109 124 -19 126 -13 87 194 3 229 126 -1 -92 -45 -47 -299
7966b99J13K42m34Q9J96K27j45J95n7j43J20O7l15R3J34j93Rq1J70l4j49K83N5
$$ -299 -186 56 -378 -289 -93 134 -11 184 127 -16 104 171 -144 -51 83 -110 -101 -182 -12 -46 -195 88 143
7989A43k30J97q4o2R7J87k51Pk5J24l68L96j83P9j94nJ83n5k68M61k9j47j3J05
$$ 143 -87 110 26 -36 61 248 -3 4 -21 103 -265 131 -52 27 -167 -172 11 -44 -312 149 120 -27 -40 65
8013F5k20L04l01N1Q9R9k04J40j2O9l5p6j49M34j47k16PQ0j71j54K05J52j0k34
$$ 65 -155 149 -152 -101 -12 87 -117 23 11 80 45 -31 -180 254 107 -109 -102 -22 -193 -347 -142 10 0 -234
8037b34K63k14J78MJ5L7O4m6j92K82j86J61Oj06N2M6k06j73L9M19k81J96o1k67
$$ -234 29 -185 -7 -3 12 49 113 67 -125 157 -29 132 138 32 84 130 -76 -249 -210 209 -72 124 63 -204
8061b04K72L0P3l07K20J12k82o3L63r7L7J34k38Q2Kn3j63J14j69O0J5J61k45J39
$$ -204 68 98 171 -136 84 196 -86 -149 214 117 154 288 50 132 134 81 -82 32 -137 -77 -62 99 -146 -7
8085gj54L55j40k1R0jl45L22L1m2J96l12J9L3r9l7p4J94J34k52J86O5K8R8l78
$$ -7 -161 194 54 33 123 122 -223 99 130 88 284 -28 -9 24 -75 -112 -186 8 142 -110 76 141 169 267 -111
8110a11L18j90m1J28j71P4k4J52k56K44k23J61r7J64r2J33p7J3n2r8KJ35o9k28
$$ -111 207 17 -24 104 -67 7 -17 135 -121 123 -100 61 -36 128 36 169 92 105 53 -45 -43 92 23 -205
8134b05K86l27L40J2k7k79J81K35k53NJ40Lm1l0J20l6k91K22j7K7m1j1M1m1j95
$$ -205 81 -246 94 106 79 -200 -19 216 -37 -32 108 111 70 40 160 124 -167 55 38 65 24 13 54 13 -182
8159a82J41R6j14K8j1L3mJ91Jk14J91j19j81J85j92J8J00m9n4K71k3n6R4k17j32
$$ -182 -41 55 -59 -31 -42 -9 -13 178 179 -35 156 37 -144 41 -151 -133 -33 -82 -136 135 112 56 150 -67 -199
8184a99L05j09o1O5j89K66j48
$$ -199 106 -3 -64 1 -188 78 -70
8191g0
$$ Imaginary data points
##PAGE= N=2
##DATA TABLE= (X++(I..I)), XYDATA
0@%%%%%%qJ6j6J6k4L2m0N6q0J04j28J53j85K24k68L24l84M56n36O24p24Q37r65
$$ 0 0 0 0 0 0 0 -8 8 -8 8 -16 16 -24 32 -48 56 -72 81 -104 120 -148 176 -208 248 -288 336 -388 449 -516
29e16J111j271J447j644J861k103K370k663K982l332L718m138M596n101N652o250
$$ -516 595 -676 771 -873 988 -1115 1255 -1408 1574 -1758 1960 -2178 2418 -2683 2969 -3281
45c281O903p618Q399r255J0196j1229J2369j3632J5034j6603J8374k0385K2689
$$ -3281 3622 -3996 4403 -4852 5344 -5885 6484 -7148 7886 -8717 9657 -10728 11961
58A1961k5360K8498l2246L6816m2532M9908n9827P3922r5589J33303k16472O87228
$$ 11961 -13399 15099 -17147 19669 -22863 27045 -32782 41140 -54449 78854 -137618 549610
70E49610j17819j041008J277084o55135K2451M26834r13032O35302K98933j012164
$$ 549610 431791 -609217 667867 12732 35183 462017 -451015 184287 483220 -528944
80e28944Q08569j10843n49464P93731m54824k59702O80620n06272J28535K11970
$$ -528944 279625 168782 -380682 413049 -41775 -301477 379143 -127129 1406 213376
90B13376n32719N30152R45n43154N52650j85719j90392M15879m16878J01242K98486
$$ 213376 -319343 210809 211754 -331400 221250 35531 -154861 261018 -155860 -54618 243868
101B43868m64746L14880k914l78714N65184k72411l21388O20122l76380j13463
$$ 243868 -220878 94002 91088 -287626 277558 5147 -316241 303881 -72499 -185962
111a85962M48072m62559J93723K36580n56776M45482N0568m85833N46314k12855
$$ -185962 262110 -200449 -6726 229854 -326922 118560 169128 -316705 229609 16754
121A6754l03588N87628l70239q1166M01762n01483K93446K18803o20474M87051
$$ 16754 -286834 300794 -69445 -150611 251151 -250332 43114 261917 -358557 128494
131A28494N0699m76617M96155k05650j69295M64879m73561Q0155L72887n00562
$$ 128494 179193 -297424 198731 -6919 -176214 288665 -184896 -104741 268146 -232416
141b32416K96891M7875m33136N30906j76101l12204M86095l54414K2604L85624
$$ -232416 64475 112350 -320786 210120 34019 -278185 207910 -146504 -123900 261724
151B61724n72021K67110K82145n44926L63218K7761l22363M38947k76394j13800
$$ 261724 -310297 -43187 238958 -305968 57250 85011 -237352 201595 -74799 -188599
161a88599M76409m38393O0483L35376m54191K74311J03069m07371M06432j04346
$$ -188599 287810 -150583 -90100 245276 -208915 65396 168465 -238906 167526 63180
171F3180k67730M45583k93072r9956M03323l82515Q1019K34755l78083K59172
$$ 63180 -204550 241033 -52039 -151995 251328 -131187 -50168 184587 -193496 65676
181F5676L0158l13683L71643j52020j93374L85591k97197K703L07889m08493J67983
$$ 65676 95834 -217849 153794 1774 -191600 193991 -103206 -100503 207386 -201107 -33124
192c3124K10248l63049K40390j0776k23255L63964k17196j28160L60103k94893
$$ -33124 177124 -185925 54465 43689 -179566 184398 -32798 -160958 199145 -95748
202i5748M2395K18688l27657K28140M9163l25586L54449q3614k26878L56444k52467
$$ -95748 -53353 165335 -162322 65818 114981 -210605 143844 60230 -166648 189796 -62671
213f2671n1521L34020l25786P1253J72225k98566K46426o193k57261L27784j70372
$$ -62671 -114192 219828 -105958 -34705 137520 -161046 85380 79187 -178074 149710 -20662
224b0662j20058L30470k83984L1560K24448l27263J96529R6866l19005K89931
$$ -20662 -140720 189750 -94234 -62674 161774 -165489 31040 127906 -191099 98832
234I8832m7827k15172L10906j85675o0555K58864k72680Q3872J60294k85567K07273
$$ 98832 51005 -164167 146739 -38936 -99491 159373 -113307 -29435 130859 -154708 52565
245E2565J8288k37722K90087j28275j40266L04178k16886k3492K26432k60989
$$ 52565 70853 -166869 123218 -5057 -145323 158855 -58031 -81523 144909 -116080
255a16080J15843J20464k56946K19383k5617j97877K73355j25002p6593K15263
$$ -116080 -237 120227 -136719 82664 57047 -140830 132525 7523 -69070 146193
265A46193k44070Q0050J91066k94702J52743O7161k38592K46302p0720j60151
$$ 146193 -97877 -17827 173239 -121463 31280 98441 -140151 106151 35431 -124720
275a24720K57045j71942m7538K10490k14686Q9628Q8023k45908K15473l163j90962
$$ -124720 132325 -39617 -87155 123335 -91351 -1723 86300 -159608 55865 52702 -138260
286a38260K32743j27612p3525K39291k16296K6403J85912k48282J22164Q7423
$$ -138260 94483 -33129 -106654 132637 -83659 -57256 128656 -119626 2538 89961
296H9961k03276J83645m6300j23040K17389j40373m1450J84988j88291P4377R3799
$$ 89961 -113315 70330 24030 -99010 118379 -21994 -63444 121544 -66747 7630 101429
307A01429k16815J76389J2784j86268K01351p4301j05233J96623j45320m729J47598
$$ 101429 -115386 61003 73787 -112481 88870 14569 -90664 105959 -39361 -44090 103508
318A03508j94842Q7407P8012j67006J45082l4640j19246J92456j07818n4837J78171
$$ 103508 -91334 -3927 74085 -92921 52161 17521 -101725 90731 -17087 -71924 106247
329A06247j72701K7350J30893j74857J05203L3350j68518J65750j9367j16424
$$ 106247 -66454 -39104 91789 -83068 22135 55485 -113033 52717 33350 -83074
339h3074J52020j06194j0482J39068j69291O8054Q5385j74730J26949J3312j35346
$$ -83074 68946 -37248 -47730 91338 -77953 -9899 75486 -99244 27705 41017 -94329
350i4329J68198q0346q6853J88922j21377k2321J22278j35638P1937N3141j39617
$$ -94329 73869 -6477 -93330 95592 -25785 -48106 74172 -61466 10471 63612 -76005
361g6005J26057j8191j01219J53817r0023l4386J34010j44598M3541J03308j64661
$$ -76005 50052 31861 -69358 84459 -5564 -39950 94060 -50538 -6997 96311 -68350
372f8350Q3291M3499j29589J30046m5379r0907J50260r0900l0391J05903j12636
$$ -68350 14941 58440 -71149 58897 13518 -77389 72871 -18029 -48420 57483 -55153
383e5153N1486M5809j28674J23618o714j21548J44639m9532n5124J22952j07362
$$ -55153 -3667 42142 -86532 37086 30372 -91176 53463 3931 -51193 71759 -35603
394c5603P753J10647j21589M2365N1614j05273R2547j5361p5125J13455p2416
$$ -35603 -27850 82797 -38792 3573 55187 -50086 42461 27100 -48025 65430 -6986
405f986m3195J13560q4613N914O2042j21613Q2043M8167j31255Q8358L217q0926
$$ -6986 -50181 63379 -21234 -15320 46722 -74891 7152 55319 -75936 12422 15639 -65287
417f5287J02023m8308l4858R5374r5811K3541P6674j11159P3852J4118j03772
$$ -65287 36736 -11572 -46430 48944 -46867 -23326 53348 -57811 16041 30159 -73613
428g3613J21704l1922p8920J26665q2269k4398J13975j15945M0879O4485j28832
$$ -73613 48091 16169 -62751 63914 -18355 -42753 71222 -44723 -3844 60641 -68191
439f8191R0116K2601r7640R2710m3678k2424J01344j23637L0216J00381j30255
$$ -68191 21925 44526 -53114 39596 -4082 -26506 74838 -48799 -18583 81798 -48457
450d8457N8646L2401r9861J05923k5848p9151J13879o3226k8139Q5503q6489L8059
$$ -48457 10189 42590 -57271 48652 22804 -56347 57532 -5694 -33833 51670 -34819 3240
462C240M1919j06791O6718K3615o6954O4099m9085k5587J00250q2090j1930Q2543
$$ 3240 45159 -61632 5086 28701 -38253 25846 -23239 -48826 51424 -30666 -42596 39947
474C9947q0564J1415N2581o2913M2562O497o8427P3999r157l9728O4754o0850
$$ 39947 -40617 -29202 23379 -39534 3028 9525 -58902 15097 5940 -33788 30966 -29884
486b9884K40Q5825q2408R665O0280q0584O0638J0426q7038J03330k4840p1501
$$ -29884 -29644 56181 -26227 -16562 43718 -36866 23772 34198 -52840 50490 25650 -45851
498d5851J00093n3652j7793P8331r1086L4934M2867r0887Q2515k5709o8191J20199
$$ -45851 54242 590 -17203 61128 -29958 4976 47843 -43044 39471 13762 -54429 65770
510F5770p2860m4159J06397q4937J7996N7296j11266P5284K2328q9930Q6649l3770
$$ 65770 -7090 -51249 55148 -29789 -11793 45503 -65763 9521 31849 -58081 28568 -5202
522e202m2269Q7779o4735K630N9269q3414N0954K0510p6209Q4028k0299o3988
$$ -5202 -47471 40308 -24427 -21797 37472 -45942 5012 25522 -50687 33341 13042 -50946
534e0946Q4307k9874k7247N9913n4962O442M4846n3610L4188O530n5119N6774
$$ -50946 33361 3487 -23760 36153 -18809 -12367 32479 -21131 13057 19587 -35532 21242
546B1242L44m5706M6451k1301j5977N3401n3187O517N6045p1756J6992M9118n9686
$$ 21242 21586 -24120 22331 1030 -14947 38454 -14733 -8216 47829 -23927 -6935 42183 -17503
559a7503L0580O249n3774O9168j9343m4770N7014m6075J7506M5207r6139M7209
$$ -17503 13077 19326 -34448 34720 15377 -29393 27621 -18454 -948 44259 -51880 -4671
571d671M9853q9470N2272m589m2821Q7133p2028k4367J01464p1741l043M4948
$$ -4671 45182 -44288 7984 3395 -39426 47707 -24321 -48688 52776 -18965 -22008 22940
583B2940n9805O2961p706p1041Q7735k8334k5130O1821p5613L1808O1996r7561
$$ 22940 -36865 26096 18390 -52651 35084 6750 -18380 43441 -32172 -364 61632 -35929
595c5929L9163M0208o7451M9191j6555k7285O9330o0857j6726O8211m6787L871
$$ -35929 3234 43442 -24009 25182 8627 -18658 50672 -10185 -26911 41300 -5487 -1616
607a616J9292n0905N1178J19n5067N8278k1619l2018N8945l7286j0306N0470n4910
$$ -1616 17676 -33229 17949 18068 -36999 21279 -340 -32358 26587 -10699 -21005 29465 -25445
620b5445Q718M4940m7638K3540K176l5321N4463k3360k9548O2253m3641j4673
$$ -25445 -16727 28213 -19425 4115 6291 -29030 25433 2073 -27475 34778 -8863 -23536
632b3536N9347n1022J6254K3576o3511N8941Q491o9014N7063p598k8367M9181
$$ -23536 35811 -15211 1043 24619 -38892 20049 28540 -40474 16589 8991 -19376 29805
644B9805n4602J2779N2346o9284K9695J4627m7623O4913l2105m2534Q5082m7031
$$ 29805 -24797 -12018 40328 -28956 739 15366 -32257 32656 551 -41983 43099 -3932
656c932k4916N9237n0954K7538J9079o9889N6034J0518m8407M4594k7690r639
$$ -3932 -28848 30389 -20565 6973 26052 -43837 12197 22715 -25692 18902 -8788 -18427
668a8427N0481n4825J7306L4333o3069L6548J5018m5075M8331j7070l8254N9238
$$ -18427 32054 -22771 -5465 28868 -34201 2347 17365 -27710 20621 3551 -34703 24535
680B4535k2324j6240L5401l8327J7861K2667m3567L2146O224m0981M0888r784
$$ 24535 2211 -14029 21372 -16955 906 23573 -19994 12152 18376 -22605 18283 8499
692H499k2077M2468l7893k327M3110m5787R681K8766m3902K3263P691l2659L7531
$$ 8499 -13578 28890 -9003 -11330 31780 -14007 -4326 24440 -19462 3801 11492 -21167 16364
705A6364k2467j6562M4966l8076k09L0415m2200K9774J2596n5964M8261L732m0185
$$ 16364 -6103 -22665 22301 -15775 -15984 14431 -27769 2005 14601 -41363 6898 10630 -29555
718b9555M5019k4067j1106M3719m1100Q933L2384m5167K4858P412k9632M4860
$$ -29555 15464 -8603 -19709 24010 -17090 -8157 24227 -20940 3918 11330 -18302 26558
730B6558k9171j9383N2870l7663j080L5859m7196K1208K1129m5370L7494l218
$$ 26558 -2613 -21996 30874 -6789 -7869 27990 -19206 2002 23131 -22239 15255 12037
742A2037l3552L8172j6815o136K8313l8563J2931K7188l9588K4293K281l1418
$$ 12037 -21515 16657 -158 -6294 22019 -16544 -3613 23575 -16013 8280 10561 -20857
754b0857M0932j6625k1303M0965k8155q981L5001l1018R200J3662l4303L1476
$$ -20857 20075 3450 -17853 23112 -5043 -14024 20977 -10041 -841 12821 -21482 9994
766I994j818k8475L3152j6822j1159L3272l2938N432K9851m3329J8709J9423l4020
$$ 9994 8176 -20299 12853 -3969 -15128 18144 -14794 -9362 20489 -22840 -4131 15292 -18728
779a8728K4107m210j9290L5886j9184j4452L1147k2936R227J2628l4028L0812
$$ -18728 5379 1169 -18121 17765 -1419 -15871 15276 -7660 1567 14195 -19833 10979
791A0979K497l2874L5198r843k2449L5834k4526l439L1942l9501Q846K3520k8684
$$ 10979 13476 -19398 15800 5957 -16492 19342 -5184 -8623 23319 -16182 -7336 16184 -12500
804a2500J7675l424k0570L4034j8628j1281L3697l2278O140K2830l2982K6928
$$ -12500 5175 1751 -18819 15215 -3413 -14694 19003 -13275 -7135 15695 -17287 9641
816I641L768l8441L6591P42k5031K9777k2015k020K9244l2119J2506J4564l2208
$$ 9641 13409 -25032 11559 12301 -12730 17047 -4968 -6988 22256 -9863 2643 17207 -15001
829a5001K3769Q62k2642L2247k1213j3832L7981k8510j789K2914k8571J5332P941
$$ -15001 8768 9630 -13012 19235 -1978 -15810 22171 -6339 -8128 14786 -13785 1547 9488
842I488k8887K6631k704k1651K6938j7104r17K1573l0448J4667J8422l4412J9088
$$ 9488 -19399 7232 4528 -17123 9815 -7289 -8206 13367 -17081 -2414 16008 -18404 684
855F84Q717k4226K8470j2461j7663L2701j7072m722K0200k2996R770R995k3349
$$ 684 9401 -14825 13645 1184 -16479 16222 -850 -5572 14628 -8368 1402 11397 -11952
868a1952K4876o025k3771L1035j4482o057K5339l1321N677K5639l2328J4690J2027
$$ -11952 12924 6899 -16872 14163 -319 -6376 18963 -12358 -6681 18958 -13370 1320 13347
881A3347k9422K2224m029j1661K5658k3236l159K4539k2455R571P920k6301K6585
$$ 13347 -16075 6149 2120 -9541 16117 -7119 -10278 14261 -8194 1377 9297 -17004 9581
894I581m450k2500K9404j2822j1728K1763j7873L782J4603k4830J2612Q910j8301
$$ 9581 5131 -17369 12035 -787 -12515 9248 -8625 -4843 9760 -15070 -2458 6452 -11849
907a1849J4270o766m364K0454j8971m042K3235j6122o12J3685j6093J1638L341
$$ -11849 2421 -4345 -8709 11745 -7226 -11268 11967 -4155 -4767 8918 -7175 4463 7804
920G804j7527J8090J515j6174J2300m015j107J3621k1732N077J5774k0709J1043
$$ 7804 -9723 8367 9882 -6292 6008 1993 886 14507 -7225 -2148 13626 -7083 3960
933C960K282j7896K0962q118j6642K9543j5471j3528K2248j4852P001N637k3504
$$ 3960 6242 -11654 9308 1190 -15452 14091 -1380 -14908 7340 -7512 -511 5126 -18378
946a8378K0329L082j9798K0441j0643m025J9985k5588J2620J6608l0675J4905
$$ -18378 1951 5033 -14765 5676 -4967 -8992 10993 -14595 -1975 14633 -16042 -1137
958a137Q615j5291J8535j3799q291K7170j6438l811J0819j1667J4319n500j4790
$$ -1137 7478 -7813 10722 -3077 -11368 15802 -636 -4447 6372 -5295 9024 3524 -11266
971a1266K2922n655j4320J4020m675K729L673j6242J1208R255j3276q52M993N61
$$ -11266 11656 6001 -8319 5701 1026 3755 7428 -8814 2394 11649 -1627 -2479 2514 3075
985C075K366o939k502J0363k770p145L951L04m95L463j1050M244J4189j8744m98
$$ 3075 5441 -1498 -4000 6363 3593 -3552 399 703 208 3671 -7379 -3135 11054 -7690 -8188
1000h188J2432q318N735l580r966J7217n268q478J3740j1983M830O975j5847J7603
$$ -8188 4244 -4074 1661 -1919 -11885 5332 64 -8414 5326 -6657 -1827 5148 -10699 6904
1014F904k877j6596K0731p198n552J7914k1299N193J6501k0232J0470J761j1645
$$ 6904 4027 -12569 8162 964 -4588 13326 -7973 -2780 13721 -6511 3959 5720 -5925
1027e925J4090j0333k68J4972j9824M801J0528j4662J2643n227j0732J8402r086
$$ -5925 8165 -2168 -2436 12536 -7288 -2487 8041 -6621 6022 795 -9937 8465 -621
1040f21n618J1236q700L406L765r615Q690j349n174O925n232K610K697p070M522
$$ -621 -6239 4997 -3703 -297 3468 -6147 2543 1194 -3980 2945 -2287 323 3020 -4050 472
1055D72M269n314j422K885J702q58j870J58j592M426j666k936M604m180R69J509
$$ 472 4741 -573 -1995 890 2592 1734 -136 22 -1570 2856 1190 -1746 2858 -1322 -353 1156
1071A156l451N815k739n103O334m150L425N084j5604P906P442j0116O285l696
$$ 1156 -2295 3520 781 -4322 2012 -2138 1287 6371 -9233 -1327 6115 -4001 2284 -1412
1085a412l586J0312p265j494O984q168N976k207n805J3052p960n376R540o061
$$ -1412 -4998 5314 -1951 -3445 3539 -4629 1347 -860 -6665 6387 -1573 -6949 2591 -3470
1099c470L338L170j1679Q837M309r175M855j218J474K617o477M623K064m841L675
$$ -3470 -132 3038 -8641 196 4505 -4670 185 -1033 441 3058 -3419 1204 3268 -1573 2102
1114B102l41j237L775m779N62M560k217j714j043L170P00k749k08p62J707M12
$$ 2102 1761 524 4299 -480 82 4642 2425 711 -332 2838 3538 789 581 -181 1526 1938
1130A938l401J970J350m513J660l04K297p58p099O844J727n980M339k138j931
$$ 1938 -1463 507 1857 -2656 -996 -1300 997 239 -6860 -16 1711 -4269 70 -2068 -3999
1145c999O651o377O63O429p220J992J060l40N012p796o62Q513m426L84Q38n866
$$ -3999 2652 -3725 -3062 3367 -3853 -1861 -801 -1141 3871 -3925 -4587 3926 -500 -116 722 -5144
1161e144R738k268q056Q702j170l743K648j376K620N08n885L703K383k127J027
$$ -5144 4594 2326 -5730 2972 1802 -1941 707 -669 1951 2459 -3426 277 2660 533 1560
1176A560m253L272L776n818k39M158j837n76O85j546K318p20k998K628J998l159
$$ 1560 -2693 579 4355 -1463 -1702 2456 619 43 728 -818 1500 780 -2218 410 2408 -751
1192g51j144J669J158P39m292M74M101k672n8J011k695K498R60l693M705j507
$$ -751 -1895 -226 932 1671 -2621 -2147 1954 -718 -776 235 -2460 38 998 -2695 2010 503
1208E03m370M815J71l55j13l021L655J375l976L439j420k537M839m072J068M930
$$ 503 -3867 948 1119 764 651 -2370 1285 2660 -1316 2123 703 -1834 3005 -1067 1 4931
1224D931p621M79N611l223L78j209k285N348k268j931K684k276J571j90l127N167
$$ 4931 -2690 -2211 3400 177 555 -654 -2939 2409 141 -1790 894 -1382 189 -1 -3128 2039
1240B039r51n642N636k99k620K891k855J151L464m361j91L553j463L19j211o52
$$ 2039 1088 -4554 1082 783 -1837 1054 -1801 -650 2814 -1547 -1738 1815 352 671 -540 -1192
1256a192L870l434p61M040k877n07J769k195L164L21o046M348J003k087J686k472
$$ -1192 2678 -756 -1517 2523 -354 -861 908 -1287 1877 2198 -3848 500 1503 -584 1102 -1370
1272a370P25K251k848J720J839m445K092M94j311M323m472j532N204j461j817
$$ -1370 -645 1606 -1242 478 2317 -2128 -36 458 -853 3470 -1002 -2534 2670 1209 -608
1287f08J580j516J292q0k386L507q53k343J702q00J483P62m773K169M091n043
$$ -608 972 -544 748 668 -1718 1789 936 -1407 295 -505 978 1740 -3033 -864 3227 -1816
1303a816J207R08k168L100j461k336L861p76k584K505j035J395j154k476M847
$$ -1816 -609 299 -1869 1231 -230 -2566 1295 519 -2065 440 -595 800 -354 -2830 2017
1318B017j313k945K556j100K83K556m578R85L730m274J381J166j590J218j307
$$ 2017 704 -2241 315 -785 -502 2054 -2524 -1539 2191 -2083 -702 464 -1126 92 -1215
1333a215k65L487k726j214K568j509K098k86l245L694K36k639K513K02k126K025
$$ -1215 -1480 2007 -719 -1933 635 -874 1224 938 -2307 1387 1623 -1016 1497 1699 -427 1598
1349A598j731J503J910m610J426K051j507J234j872j665M723k929k187M680l414
$$ 1598 -133 1370 3280 -1330 96 2147 640 1874 2 -1663 3060 131 -2056 2624 -790
1364g90l29K484k952K345L40m553L543P47k267K373l745K307K937n932L355J241
$$ -790 -1119 1365 -1587 758 1098 -3455 88 835 -1432 941 -2804 -497 2440 -3492 -137 1104
1380A104m317M632j859k556O079m652p56M697m291J736N69k610M223k101j789
$$ 1104 -3213 1419 -440 -2996 3083 -1569 -2325 2372 -1919 -183 386 -2224 1999 -102 -1891
1395a891M069l782J652K235m780L735k46k788M072j281j966K218j309Q75Q29k173
$$ -1891 2178 -1604 48 2283 -2497 1238 992 -1796 2276 995 -971 1247 -62 813 1642 -531
1411e31J073K04p69J354o61pl26o32Q48J235j357k025J254J440j194j48K32j241
$$ -531 542 746 -23 1331 670 663 337 -295 553 1788 431 -1594 -340 1100 -94 -242 -10 -1251
1429a251K291j548o82K512k487N08N79p94K877k725k161N137k641r13K989l962
$$ -1251 1040 -508 -1190 1322 -1165 -657 -78 -872 2005 -720 -2881 2256 -385 -1298 1691 -2271
1445b271L442P14n082N041p20k586K987k408J632J169n161M757L43m082L787l245
$$ -2271 1171 1885 -3197 1844 1124 -1462 1525 -883 749 1918 -3243 1514 1857 -2225 1562 -1683
1461a683R33M297o427J273L961m511K522p08j414M382m753P22L591k845Q05j427
$$ -1683 -750 3547 -2880 -1607 2354 -2157 365 -343 -1757 2625 -2128 -1406 2185 -660 145 -1282
1477a282p82N535l513k825M324j714J092r74j620M245k190j911K454j36R82j857
$$ -1282 -2064 3471 -42 -2867 1457 -257 835 -139 -1759 2486 296 -1615 839 703 1685 -172
1493a72k446M567o5k910P24l95K974j601k672L113n10l46l03j207L152n04m190
$$ -172 -2618 1949 1884 -1026 -302 -697 2277 676 -1996 1117 607 261 -42 -1249 1903 1399 -2791
1510b791L471J076j545l23j850L338K86l366J011M55P91L85l542K114K095l547
$$ -2791 680 1756 211 -112 -1962 1376 1662 -1704 -693 -238 553 938 -2604 -490 1605 -1942
1526a942J359K25L07M35k707J536K411k185l66k33J261J555l191P45K343k492
$$ -1942 -583 -358 -51 384 -2323 -787 1624 -561 -927 -1160 101 1656 -1535 -790 1553 -939
1542i39J372p16L85J595k740M31K522j484K36j472J04L630l338p91K342j586J573
$$ -939 433 -283 102 1697 -1043 -612 1910 426 662 -810 -706 2924 -414 -1205 1137 -449 1124
1559A124r53j783L576j942j871L016j569J281q95l098M848p61k782K473j454P79
$$ 1124 171 -1612 1964 22 -1849 1167 -402 879 -16 -3114 1734 973 -1809 664 -790 -11
1575a1J404l364K016J368k783K074q04n9J724k997J279J515k251R43L02o78J587
$$ -11 1393 -1971 45 1413 -1370 704 -100 -159 1565 -1432 -153 1362 -889 54 356 -322 1265
1592A265j284j087K224o62o27L79k4k23K53j01J79np73M67N47k82k08kq79J662
$$ 1265 -19 -1106 1118 456 -171 208 184 -39 214 113 292 287 -486 -19 528 246 38 36 -843 819
1612H19l35j235K176j998m73K258k061Q28O90k414K034O91k595K393j501l84K349
$$ 819 484 -751 1425 -573 -1046 1212 -849 -21 669 -1745 289 980 -1615 778 -723 -1107 1242
1629A242k874J593J609l895K767P40k957L419k086r61M084l875J003K007l255
$$ 1242 -1632 -39 1570 -2325 442 1182 -1775 1644 -442 -1403 2681 -1194 -191 1816 -1439
1644a439K782l80k899M009j820k154M343l131N04K215l532K437P42l350K713m20
$$ -1439 1343 963 -1936 2073 253 -1901 2442 -689 -185 2030 -1502 935 1677 -1673 1040 620
1660F20j481K263k188J18K462l331J519J298k796J650m2j484K833j576k356L847
$$ 620 -861 1402 -786 -668 1794 -1537 -18 1280 -1516 134 92 -1392 1441 -135 -2491 1356
1676A356j441p72J540k326J032K000k816J407P54k571K489j034n37K908l530K00
$$ 1356 -85 -857 683 -1643 -611 1389 -1427 -20 734 -1837 652 -382 -919 1989 -1541 -1341
1692a341L133k720N70J458l231L266l35k954L951j379j588K587k148R13J786m068
$$ -1341 1792 -928 -358 1100 -2131 1135 800 -2154 1797 418 -1170 1417 -731 182 1968 -2100
1708b100K770J255l702K854q42j446L665k795j046L700l386P35K026l313K701
$$ -2100 670 1925 -1777 1077 235 -1211 2454 -341 -1387 2313 -1073 -338 1688 -1625 1076
1723A076n31k757M154j509k075L443k482N10K259m373K298J823l601K751k45k275
$$ 1076 545 -2212 1942 433 -1642 1801 -681 -171 2088 -2285 13 1836 -1765 986 741 -1534
1739a534L296k159p25L398l373J64K412k985K538o71k635L877j374k117L561k608
$$ -1534 1762 -397 -1122 2276 -1097 -933 1479 -1506 1032 361 -2274 1603 229 -1888 1673 -935
1755i35l39K949l545K125J156l879K849L17k268K816k077p96L882l385L87K457
$$ -935 -1274 1675 -1870 255 1411 -2468 381 698 -1570 1246 -831 -1627 2255 -1130 -743 1714
1771A714l181J953K37k439L305j054k485L708k060p9K195l232J807J590l829K437
$$ 1714 -1467 486 723 -1716 1589 535 -1950 1758 -302 -381 1814 -1418 389 1979 -1850 587
1787E87L78k669L288j493j437L359l156M77K877l565J488Q44k571L167r10k884
$$ 587 965 -1704 1584 91 -1346 2013 -1143 -666 2211 -1354 134 978 -1593 1574 664 -2220
1803b220M079j983p76K688l357J391J901m030K987O98l417L170j257j152L286
$$ -2220 1859 -124 -900 1788 -1569 -178 1723 -2307 680 1378 -2039 1131 -126 -1278 2008
1818B008l312R1K904k901J147P12k384K359k85k435L950k091j148K794k455Q16
$$ 2008 -1304 -1213 1691 -1210 -63 649 -1735 624 339 -2096 1854 -237 -1385 1409 -1046 -230
1834b30J850l640K358J239l472K616m29j756L241k310p73L307l107K26K410k994
$$ -230 1620 -2020 338 1577 -1895 721 292 -1464 1777 -533 -1306 2001 -1106 -880 1530 -1464
1850a464K365O2l443M250j143k423L358k278K22K441l938K151J714m133L201j62
$$ -1464 901 963 -2480 1770 627 -1796 1562 -716 -494 1947 -1991 160 1874 -2259 942 780
1866G80k747L981k669o87L971m106Q85K444l568K968l67l479M528j647j933L505
$$ 780 -1967 2014 -655 -1342 2629 -1477 -592 1852 -1716 1252 885 -2594 1934 287 -1646 1859
1882A859k712M25K184l894K812J071l757L066j050j247L315k925j95L117l206
$$ 1859 -853 -428 1756 -2138 674 1745 -2012 1054 4 -1243 2072 -853 -1048 2069 -1137
1897a137P64J745k816K120j40k236K998r43j848K336j397l5J763k799J275K066
$$ -1137 -373 1372 -1444 676 536 -1700 1298 355 -1493 843 -554 -589 1174 -1625 -350 1716
1913A716l462J875O88k029K062n31k050L323j933j058L200k586M72J611l182K550
$$ 1716 -1746 129 817 -1212 850 319 -1731 1592 -341 -1399 1801 -785 -313 1298 -1884 666
1929F66P73l611L796j182k069M066l410K20L083m264K435J004l591L854j289k444
$$ 666 1439 -2172 1624 442 -1627 2439 -971 -751 2332 -1932 503 1507 -2084 1770 481 -1963
1945a963M553l576k93L575m068K097J680m359L363p6k947M239k644j253M066l567
$$ -1963 2590 -986 -1279 2296 -1772 325 2005 -2354 1009 933 -2014 2225 -419 -1672 2394 -1173
1961a173Q98J915l401K259L32k750L527j400j938L082k373P61J972l353J428J428
$$ -1173 -275 1640 -1761 498 830 -1920 1607 207 -1731 1351 -1022 -261 1711 -1642 -214 1214
1977A214k489J604K26k129K728j407j109K672j637p66K203j842P14J118k905K026
$$ 1214 -1275 329 555 -1574 1154 -253 -1362 1310 -327 -1093 1110 -732 -18 1100 -1805 221
1993B21R60k870K293n56j270K988k787l88L405l152P01K035l551L184m87l148
$$ 221 1181 -1689 604 48 -1222 1766 -1021 -1409 1996 -1156 -455 1580 -1971 1213 726 -2422
2009b422M310j830j885L603k490L10K586m547K783J239l760L585j348j230L157
$$ -2422 1888 58 -1827 1776 -714 -404 2182 -2365 418 1657 -2103 1482 134 -1096 2061
2024B061l267M47L347m004J613J151l232L850j576k759M321j792j354K500k143
$$ 2061 -1206 -759 2588 -1416 197 1348 -1884 1966 390 -2369 1952 160 -1194 1306 -837
2039h37J071J154l557K718N14k584K291q00q35K171k446P2K858k818M46J336j919
$$ -837 234 1388 -2169 549 1063 -1521 770 -30 -865 1306 -1140 -1068 1790 -1028 -582 754 -1165
2056a165J574q9k003K230k17k032K247p46l88J758k842J318K097l238J371J010
$$ -1165 409 320 -1683 547 330 -1702 545 -201 -589 1169 -1673 -355 1742 -1496 -125 885
2072H85k450K661j137j805L737k054j204K863k539J198J105l040L192j06l511
$$ 885 -1565 1096 -41 -1846 1891 -163 -1367 1496 -1043 155 1260 -1780 1412 1306 -2205
2087b205L650j805m63K858l440J375K039l538J824R44l024L447j639j395L567
$$ -2205 1445 -360 -823 2035 -1405 -30 2009 -1529 295 1239 -1785 1662 23 -1372 2195
2102B195k903j71K475k656J720K12k698L039q70j981K952j379p22K201k154M11
$$ 2195 -708 -879 1596 -1060 660 872 -1826 1213 343 -1638 1314 -65 -787 1414 -740 -329
2118c29J808k756J423Q72k342K254j027j042K423j449p45K108j722L61J078k086
$$ -329 1479 -1277 146 1018 -1324 930 -97 -1139 1284 -165 -910 1198 -524 -163 915 -1171
2134a171J492K09j990K424l57j705K150j168m00K135k691P32J688k808J708N07
$$ -1171 321 530 -1460 964 607 -1098 1052 -116 -516 1619 -1072 -340 1348 -1460 248 755
2150G55k247K619j029j389K741j764m44K092k335J232Q70k652K250j58j839K439
$$ 755 -1492 1127 98 -1291 1450 -314 -758 1334 -1001 231 1101 -1551 699 541 -1298 1141
2166A141j407p58K729k976J191J736l123J913L86k181K466r39j248K713j924o84
$$ 1141 -266 -1024 1705 -1271 -80 1656 -1467 446 832 -1349 1117 178 -1070 1643 -281 -965
2182i65K456k261J047L90j984K020j30k069K367r62p77K245k572P73J673k518
$$ -965 1491 -770 277 667 -1317 703 573 -1496 871 -91 -868 1377 -1195 -422 1251 -1267
2198a267J285R12k216J983n52j341K649j923o27K447k177P08P72k127J853M66
$$ -1267 18 930 -1286 697 145 -1196 1453 -470 -1097 1350 -827 -119 653 -1474 379 845
2214H45k479K366m95j116J953j736P8K021k446J038J308k557J514o4j346K532
$$ 845 -1634 732 237 -879 1074 -662 -584 1437 -1009 29 1337 -1220 294 230 -1116 1416
2230A416j578r02K511j834P6J555k399J604N32k085J989l08j714K065j155l03
$$ 1416 -162 -1064 1447 -387 -311 1244 -1155 449 981 -1104 885 577 -1137 928 -227 -530
2246e30J712k078N37J395j964J178L67k000K674j228j213K410j472n40J968k071
$$ -530 1182 -896 -359 1036 -928 250 617 -1383 1291 63 -1150 1260 -212 -752 1216 -855
2262h55R35P78k304K144J66k170K190j253l54J862j940M17J742k601J262R23k059
$$ -855 80 858 -1446 698 864 -1306 884 -369 -723 1139 -801 -384 1358 -1243 19 942 -1117
2279a117K035q62j369K463j444p82K105j945N78J048j957J685K01k030K177m17
$$ -1117 918 56 -1313 1150 -294 -1076 1029 -916 -338 710 -1247 438 639 -1391 786 369
2295C69j272J707j416J04J967k494R96J048k080J678j56j755K460j310q62K507
$$ 369 -903 804 -612 -508 1459 -1035 -39 1009 -1071 607 451 -1304 1156 -154 -1016 1491
2311A491k123L71J453k471J660O38k371K256n17j395K228j484l48K002k413J291
$$ 1491 -632 -261 1192 -1279 381 1019 -1352 904 387 -1008 1220 -264 -612 1390 -1023 268
2327B68Q14k129J368J48j328K100j425p05K053j485J1R97j575J092L98j753J726
$$ 268 1082 -1047 321 469 -859 1241 -184 -889 1164 -321 -310 687 -888 204 602 -1151 575
2344E75k23j280J373m49m66J331j772O43J421k057P97O24j065R87k89j215J807
$$ 575 352 -928 445 -4 -470 861 -911 -268 1153 -904 -107 517 -548 439 150 -1065 742
2361G42q77p23J855j613K59J048j997J776P05k646J987j47j281J855j546j74K260
$$ 742 -135 -858 997 -616 -357 691 -1306 470 1175 -1471 516 369 -912 943 -603 -777 1483
2378A483k223L33J790k581K062p03j574K861j413j085K148j779P76J081k695K456
$$ 1483 -740 -407 1383 -1198 864 161 -1413 1448 35 -1050 1098 -681 95 1176 -1519 937
2394I37K03k750K628j007o83J992k020K04K019k676J121R74j946J732p96r14K272
$$ 937 1140 -1610 1018 11 -672 1320 -700 -496 1523 -1153 -32 942 -1004 728 -68 -982 1290
2411A290j460o47J798j351L62P47j763J367O11k238J727P6j262J375j091J37J632
$$ 1290 -170 -817 981 -370 -8 739 -1024 343 954 -1284 443 519 -743 632 -459 -322 1310
2428A310j876j22J307j145O98J26j201J386j50j499J681o86m87J429j749J031
$$ 1310 -566 -688 619 -526 172 298 -903 483 333 -1166 515 -171 -658 771 -978 53
2444E3J156k289J365L25j628J859p15j115K587k232M1J839j925O22Q24j949J980
$$ 53 1209 -1080 285 610 -1018 841 126 -989 1598 -634 -593 1246 -679 -57 767 -1182 798
2461G98oj895K321j127o86J995k412R01J454k564J768N7j473J794j264j94K221
$$ 798 792 -1103 1218 91 -595 1400 -1012 -111 1343 -1221 547 604 -869 925 -339 -533 1688
2478A688k419N29J369k008J034L84j677J754m49r33J381j065J85J035j598P31
$$ 1688 -731 -202 1167 -841 193 577 -1100 654 205 -728 653 -412 -227 808 -790 -59
2494e9Q38j611R32M55j264J609r50p20J528j112l30J195r24J24Q19j351R44M14
$$ -59 779 -832 100 555 -709 900 -50 -770 758 -354 -684 511 -413 -289 530 -821 123 537
2512E37j626J435k38j117J965j303k18J733k017P62R07k044J680L0j279J677r02
$$ 537 -1089 346 108 -1009 956 -347 -565 1168 -849 -87 820 -1224 456 486 -793 884 -18
2529a8o88J903j963O22J565k431J171M67j703J676r14o11J869j348j46J453j697
$$ -18 -706 1197 -766 -144 1421 -1010 161 628 -1075 601 -313 -924 945 -403 -549 904 -793
2546g93J178L09j854J845k64j507J871q74l78J559j847R30O30j648J155N7j071
$$ -793 385 694 -1160 685 421 -1086 785 -89 -467 1092 -755 175 805 -843 312 369 -702
2563g02J290p96m58J637j266j66J222j198L53N89j629J706l16j275J436k68o76
$$ -702 588 -208 -666 971 -295 -461 761 -437 -84 505 -1124 582 266 -1009 427 159 -517
2580e17R40q69o3J245j377M19Q22j092M84J90r73J620q57q30J788j258J52P03
$$ -517 423 -446 -509 736 -641 -222 600 -492 -8 182 -791 829 -28 -858 930 -328 -176 527
2598E27j448J331K94j888J765l72r08J590j287k3J824k019O10P55j499J441r9
$$ 527 -921 410 704 -1184 581 209 -699 891 -396 -419 1405 -614 -4 751 -748 693 594
2615E94j350J422p12n34J499j039j42J253j683J041K12j354J290j73q52J020n27
$$ 594 -756 666 -46 -580 919 -120 -262 991 -692 349 561 -793 497 324 -528 492 -35
2632c5k33J118j470L86J006j107N75j8q93J356r78l75J404r60o8P49j027O85L74
$$ -35 -268 850 -620 -234 772 -335 240 222 -671 685 -293 -668 736 -224 -292 457 -570 115 489
2651D89j412J206p3o90Q60n90J00Q15j152L12P36j019O90N2p90J033o96m88J260
$$ 489 -923 283 210 -480 380 -210 -110 705 -447 -135 601 -418 272 324 -466 567 -129 -617 643
2670F43r59k0Q91r75O01K83j319J300j52j038J266m37m38P75q90L21Q46j092L48
$$ 643 -316 -336 555 -420 181 464 -855 445 293 -745 521 84 -354 421 -469 -148 698 -394 -46
2689d6N49j091J200o19n62J294q58l49J026p59L80L24j220J207l05r91J307l65
$$ -46 503 -588 612 -7 -569 725 -133 -482 544 -215 165 489 -731 476 171 -820 487 122
2707A22j46M97r06J45Q24r29L30N13q96Q82m59n65R72o36m71J279q82J52N66r91
$$ 122 -24 473 -433 -288 536 -393 -63 450 -446 436 -23 -588 384 -252 -723 556 -326 -174 392 -599
2727e99O76j6q90J241l86n69O87n56J49P05j012N96N27r13M92k09m82J117o44
$$ -599 77 61 -829 412 26 -543 144 -412 -263 442 -570 26 553 -360 132 -77 -559 558 -86
2746h6m76J205q52P6N41r02O88J73j079Q84K87q63R21n30k36J008j228M64M88
$$ -86 -562 643 -209 -133 408 -494 194 367 -712 172 459 -404 517 -13 -249 759 -469 -5 483
2765D83r27M74K6l79P92m33m93J135q75j84J051r49L93R2r54J002k8n79O06l04
$$ 483 -444 30 56 -323 469 36 -457 678 -197 -381 670 -279 114 206 -748 254 226 -353 253 -51
2785e1k0O28p50K33L52o89K97K64p82Q20j38m41Q12o83qL15k38K8M5l60M68L0
$$ -51 -71 557 -193 40 392 -297 0 264 -518 302 164 -277 535 -148 -156 159 -79 -51 -6 -366 102 132
2807A32m94O82m03j72P66o83lO85q88K13M35q82N75J69o70J226q81l01J191r41
$$ 132 -362 320 -83 -255 511 -172 -175 510 -378 -165 270 -612 -37 132 -538 688 -193 -494 697 -244
2827b44J2P91j085R52m5o52P06k90p06J040o44J06O00j015P66O3q43P74l29l21
$$ -244 -232 559 -526 426 381 -271 435 145 -561 479 -165 -59 541 -474 292 355 -488 286 -43 -364
2847c64P14n04M2P96j065K36M78p60O06q5n33J053n36l90N23l02K8L32p24P92
$$ -364 350 -154 -112 684 -381 -145 333 -427 179 94 -439 614 78 -312 211 -91 -63 269 -455 337
2867C37j68l50L01J0l36J96j88o1P02l34k68R7K19k08k17lK78J09n50M63J71n39
$$ 337 169 -181 120 130 -206 -10 -198 -259 443 109 -159 -62 157 -51 -268 -271 7 116 -434 29 200 -339
2889c39L21l25L56L01n73K85L59r49L66M05o29R05r08J39O79n25q0M15p11P45
$$ -339 -18 -343 13 314 -259 26 385 -564 -198 207 -422 483 -425 -286 393 -132 -212 203 -508 237
2909B37K33j029R27j97l07M45o44N47L18q56L73M11p50L62l25kQ13q09p4P19n56
$$ 237 470 -559 368 171 -136 309 -335 212 530 -326 47 458 -292 70 -255 -257 556 -253 -327 392 -164
2930a64N7N0j50N16k41l12L35P1kk30j99N95Oq42L69N23l85N3k60K06j0R0n34
$$ -164 -107 -57 -207 309 68 -244 91 162 160 -70 -269 326 332 -510 -141 382 -3 50 -210 -4 -14 76 -458
2953d58P08r2m52K1K50P0J35q04M71O03q38P8N24k32M69p75n2J031p98P8J45m40
$$ -458 250 158 -294 -273 -23 47 182 -622 -151 452 -386 -308 216 -16 453 -322 -374 657 -141 -63 82 -358
2975c58O71m83l01Q67l48j19M25o20L10L99p82L18N31m94J71l04K12J50p20L78
$$ -358 313 -170 -471 396 48 -71 354 -266 44 443 -339 -21 510 16 187 -117 95 245 -475 -97
2995i7M88l47j55pl0N80n35LL84m29j3p2J7K26N8r3K00N6j44k79L23J4j91J97
$$ -97 391 44 -111 -118 -148 432 -103 -100 284 -145 -158 -230 -213 13 71 -22 178 234 90 -189 134 148 -43 154
3019A54j53j04L4J6ok6K92j91k47M28j77j47J66J48k56J55k21j57N98m61p6L41
$$ 154 1 -103 -69 -53 -59 -85 207 16 -231 197 20 -127 39 187 -69 86 -135 -292 306 -155 -231 110
3041A10l00L23r8j89K04j58P1M43n07J34K43m49J69j18M2K70j60k38K14MN8j29
$$ 110 -190 133 35 -154 50 -108 -37 406 -101 33 276 -173 -4 -122 -80 190 30 -208 6 10 68 -61
3063f1l7M35k92j55K11j24L4J92k88R6J33Q9j88rJ74r5k84K28K29l33K24n2L5
$$ -61 -98 337 45 -110 101 -23 11 203 -85 11 144 233 45 36 210 115 -169 59 288 -45 179 127 162
3086A62j49N7k46J93J83l83J20N5o3L4m8j5L03k85k23K86j40J88N0k32N5P4Q1
$$ 162 13 70 -176 17 200 -183 -63 -8 -71 -37 -85 -100 203 -82 -305 -19 -159 29 79 -153 -98 -24 57
3109E7K17k14j39o3N8J47o2j97K14M9p4k03K17M6k8L3j20M9P8K3j22j16J43J62
$$ 57 274 60 -79 -142 -84 63 1 -196 18 67 -7 -210 7 53 25 58 -62 -13 65 88 -34 -150 -7 155
3133A55l56L11k2L4K4k05J20Pk17M01K5l04j05L21l38K21l31m1N89k14K1j21Q9
$$ 155 -201 110 88 122 146 -59 61 68 -149 252 277 -27 -132 189 -149 72 -259 -300 289 75 96 -25 64
3156F4Q2l01O8J82J73k44K8n3P1n5j77J40J33Q6k31j69jJ54J23j32M4m74M48K4
$$ 64 146 -155 -87 95 268 24 52 -1 70 15 -162 -22 111 197 -34 -203 -204 -50 73 -59 -15 -489 -41 -17
3180a7oK53k10l24N27l26J89R8l77L55j58j04M0J84p2k52J03M88k29l76P4K94
$$ -17 -23 230 20 -304 223 -103 86 184 -193 162 4 -100 -60 124 52 -200 -97 391 162 -214 -140 154
3202A54l72L41j48J16j54J15o7J62o6k07K03m1K24k35O0NK42n61J38p1J99p3Q1
$$ 154 -218 123 -25 91 -63 52 -15 147 81 -126 77 36 260 25 85 90 332 -229 -91 -162 37 -36 45
3225D5O1n6p0j34K62p8l1j10R7J93k23J21j35K00k76O1L12l4k92n6R1J28J54l99
$$ 45 106 50 -20 -154 108 30 -1 -111 -14 179 -44 77 -58 142 -134 -73 239 205 -87 -143 -52 76 230 -169
3249a69j22L91j49k08J59Kj3J78k19J20K43j21q8k46K46O3N1n8l88L54j88L12
$$ -169 -291 100 -49 -257 -98 -96 -109 69 -150 -30 213 92 4 -242 4 67 118 60 -328 26 -162 150
3271A50M6j24k23K84j47j4j19J78M3n7Q0Nj5m7J15j70K1l8J0K7J10N8j41k06K11
$$ 150 196 72 -151 133 -14 -28 -147 31 74 17 97 102 87 40 155 -15 6 -32 -22 5 115 173 32 -174 37
3296C7k9j78M7K66k05J75k92J24n2J36r4L6K59Q6k58J79j88K8L03n91L00j36k3
$$ 37 8 -170 -123 143 -62 113 -179 -55 -107 29 -65 -29 230 316 58 237 49 77 380 -211 89 -47 -70
3319g0K64l31M35k05k63N75k00k02J8N3J4p0r8o8N9j38J11NL27k58q6Q6K69k72
$$ -70 194 -137 298 93 -170 405 205 3 21 74 88 18 -80 -148 -89 -227 -116 -111 216 -42 -128 -42 227 -45
3343d5mR0P1j00j06l1K71R1k36J56j48k21L02k18M56l19J21l29Q1L30n34K83J23
$$ -45 -49 41 112 12 -94 -125 146 237 1 157 9 -212 90 -128 328 9 130 -199 -118 212 -322 -39 84
3366H4k17K22q1R8q1L4j17J95l52N17j53k92P8p6L91j38l23L23n2j81M37n05O2
$$ 84 -133 89 8 106 25 59 -58 137 -215 302 149 -143 -65 -141 250 112 -211 112 60 -121 316 -189 -127
3389a27L45l51lJ88j70k33L98o1j04M4l2K63k08P0n1l47M59r6Jp5NJ39k14J9L7
$$ -127 218 -133 -136 52 -118 -351 47 -14 -118 -74 -106 157 -51 19 -32 -379 80 -16 -15 -90 -85 54 -160 -141 -104
3414a04M5R3P2o0Rj3j43J12Pj26K82j46N8j77J81j62m2M83m21j75M05j06k76K13
$$ -104 -59 34 106 46 55 42 -101 11 18 -108 174 28 86 -91 90 -72 -114 369 -52 -227 178 72 -204 9
3438InM3J58o23K90J56j02J38j80J24K69k88M2K5j40J51k63J36N50n49N6K50m58
$$ 9 4 47 205 -418 -128 28 -74 64 -116 8 277 -11 31 56 -84 67 -196 -60 490 -59 -3 247 -211
3461b11N40l33N4K02k81k95K53j20N14Q0n37J35%l11M23k33J40j81j9L26p3r5
$$ -211 329 -4 50 252 -29 -324 -71 -191 323 403 -134 1 1 -310 113 -120 20 -161 -180 146 73 -22
3483b2j49L80l52K80l91K81R4M4k58K64l4j67j26Q9O5j03p9M0K65k51l5J57k48
$$ -22 -171 209 -143 137 -254 27 121 165 -93 171 137 -30 -156 -67 -2 -105 -184 -144 121 -130 -165 -8 -256
3506b56L60j31k62N72l64j08R6M4o0K29l13L38j01n9m6o4n1J75J5J4L97n77J98
$$ -256 104 -27 -289 283 -81 -189 -93 -49 -109 120 -193 145 44 -15 -61 -125 -176 -1 14 28 425 -152 46
3529D6j9k04N89p31J64K74l51M91j03k80N00l35n00P29j53J97l64j62K45K29l82
$$ 46 27 -177 412 -319 -155 119 -232 259 156 -124 376 41 -459 270 117 314 -50 -212 33 262 -120
3550a20R1K85l59L26k27Q3l7k70m9K20N8L8j22J92j39J86j32QL0j25J64j2j43
$$ -120 -29 256 -103 223 -4 79 42 -228 -277 -57 1 39 -83 109 -30 156 24 32 62 -63 101 89 -54
3573e4J52m05J05po8N39l58J40J4k09l4J83J48p7m4l6j94M98m40L16j41k94L33
$$ -54 98 -307 -202 -209 -277 262 -96 44 58 -151 -185 -2 146 69 25 -11 -205 293 -147 169 28 -266 67
3596F7Lj67J30k3K1J74k15N0M6l02K92j14k61O39l58k07M80r9l3O4m54L73k00
$$ 67 70 -97 33 10 31 205 -10 40 86 -216 76 -38 -299 340 -18 -225 255 156 123 187 -267 106 -94
3619i4n3j2K22l73L23o3m3K11l04j9K38j42k8J87l70N22k30j54N12l25j17K26
$$ -94 -147 -159 63 -310 13 -50 -93 118 -186 -205 33 -109 -137 50 -320 202 -28 -182 330 5 -112 114
3641A14l36L04p8j45J38J18j38J85l40J31L10k64k2J78l00K79Q0k48J42m20J80
$$ 114 -222 82 4 -141 -3 115 -23 162 -178 -47 263 -1 -23 155 -145 134 214 -34 108 -312 -132
3662a32K52n8k93N23l41K73j97k37K81p0L4p0r8M15p3l02K54Om85M12l1k95K07
$$ -132 120 62 -231 292 -49 224 27 -210 71 1 35 -35 -133 282 209 -93 161 167 -318 94 63 -232 -25
3685b5r9N7K46m19O0K80o1j33J78l70J96J73k13RK23Q8j86j45M5M42l88j07J2
$$ -25 -124 -67 179 -240 -180 100 39 -94 84 -286 -90 83 -130 -121 102 190 4 -141 -96 346 -42 -149 -137
3708a37K89l02j5j25K44j08J5L13k51N4K2j10J48K52l63J58K3l03L42j35RO2k
$$ -137 152 -150 -165 -290 -46 -154 -139 174 -77 -23 -1 -111 37 289 -74 84 107 -196 146 11 20 82 80
3731H0q2k5r2K11j15n8J92J48k56K10j18k0j68j80N53q1l52L13m1k15N23l20k60
$$ 80 -2 -27 -119 92 -23 -81 111 259 3 213 95 75 -93 -273 280 199 -153 160 119 -96 427 107 -153
3754a53M06k63K9j21j41M00j38p5L78m90J33K64m19K25r6j45K70j73p3L48m22
$$ -153 253 -10 19 -102 -243 157 19 -56 322 -168 -35 229 -190 35 -61 -206 64 -109 -182 166 -256
3775b56K83J06k94J12J69j46n6J51m18R8R0K10o8j6j97M89m67K60O6l34K09K59
$$ -256 27 133 -161 -49 120 -26 -82 69 -349 -251 -161 49 -19 -35 -232 257 -210 50 116 -218 -9 250
3797B50m28K92K23p45O96l07k90K36J34k08K39j37M3k4k10R1J63j81K62j63k98
$$ 250 -178 114 337 -408 288 -19 -309 -73 61 -147 92 -45 -2 -26 -236 -145 18 -163 99 -64 -362
3818c62M59j37j67L09q9r8L04m25J94p2J40J38l08L90j03m22L34J98l53K5J54
$$ -362 97 -40 -207 102 13 -85 219 -206 -12 -84 56 194 -114 276 173 -249 85 283 -70 -45 109
3839A09j88M28n34p2N24k40J63k77K0K03j27k60J71P9N9k36L1K42K06m60o2L59
$$ 109 -79 349 -185 -257 267 27 190 -87 -67 136 9 -251 -80 -1 58 -178 -147 95 301 -159 -221 138
3861A38l25m4K14j34K65l75L57R4k87P8ljO9K11n72M60k1l58K83o5j83L00k76
$$ 138 -187 -231 -17 -151 114 -261 96 190 -97 -19 -22 -23 46 257 -315 145 124 -234 49 -16 -199 101 -175
3884a75k6L59j87o1M76l31J22P4l55K62l56n2N09l56r0M89m29k2J75j97L86k17
$$ -175 -201 158 -29 -90 386 55 177 251 -104 158 -198 -250 259 -97 -187 302 -127 -149 26 -171 215 -2
3906bk28K82n02M51L06m59o9J01k72M48l01k5N06l38J59j74M2K54l4j81Q0j6n3
$$ -2 -230 52 -450 1 307 -152 -221 -120 -392 56 -245 -270 236 -102 57 -117 -75 179 145 -36 44 28 -25
3929b5j3O0j29l4L43j35n4p9j96L09j44M7m0K65j57p9L8Kj6j43L14k10O3j10m0
$$ -25 -38 22 -107 -141 202 67 13 -66 -262 47 -97 -50 -90 175 18 -61 -23 -21 -37 -180 134 -76 -13 -123 -163
3954a63L0L47k46K62q8j52K30j23k77L03j62N6K69o28M61j48j24K65Nj89J51j54
$$ -163 -133 214 -32 230 142 -10 220 97 -180 123 -39 17 286 -342 119 -29 -153 112 117 -72 79 -75
3976g5J24J11j93JJ06m47M90m8j51N3j94R1K57k32j58K74j64L95k10p9J41J00
$$ -75 49 160 -33 -32 74 -373 117 69 -82 -29 -223 -132 125 -107 -265 9 -155 240 30 -49 92 192
3998A92m27O28k80j16J51l24J41J01j69m9J20R3N6j1k92L37j82J50K49n45P1K41
$$ 192 -235 393 113 -3 148 -176 -35 66 -103 -152 -32 61 117 106 -186 151 -31 119 368 -177 -106 135
4020A35l66J68p5J7J61J0l0R0l24K52K48m06L4J47o8O1j37j0L67k86p0LL28n19
$$ 135 -231 -63 -138 -121 40 50 20 110 -214 38 286 -120 -86 61 -7 54 -83 -93 274 -12 -82 -79 249 -270
4044b70M97k47J66L3n15M26k21J42J65q0j74M42n54r4M68k56K98j91j07K84k32
$$ -270 227 -20 146 179 -336 90 -131 11 176 96 -78 364 -190 -284 184 -72 226 35 -72 212 -20
4065b0k22L59k27n0J34Q7j35K85m68L43R2l98J91q0J85l28K29j27L13j54J60j74
$$ -20 -242 117 -110 -160 -26 61 -74 211 -257 86 178 -220 -29 -109 76 -252 -23 -150 163 9 169 -5
4087ej7OK2k02K57j36r7K15k38K69L0k07J54m8q2L90k25k85K46r1K42Jj45k7j2
$$ -5 -22 -16 6 -196 61 -75 -172 43 -195 74 104 -103 51 3 -79 311 86 -199 47 -44 198 199 54 27 15
4112A5j72N2J60L1J98l67L4L05l08p6J61j17J30J44l06J43J60l06J26j59J56K28
$$ 15 -157 -105 55 86 284 -83 -49 256 -52 -128 33 -84 46 190 -116 27 187 -119 7 -152 4 232
4134B32k99l0J70o2r4P2j2J2J80k97P1K73m40K14L58q7l32j44J89J98p2k79J06
$$ 232 -67 -97 73 11 -83 -11 -23 -11 169 -128 -57 216 -224 -10 348 261 -71 -215 -26 172 100 -179 -73
4157g3K11M8km38M71k81J83P2j63K2l7j89J70P9k65M08j33l1K93n34L55J05o21
$$ -73 138 186 184 -254 217 -64 119 191 28 50 13 -176 -6 73 -192 216 83 52 345 -189 166 271 -350
4180c50N19j07j61K54l7m16N36k64rP4r8K12q2k10L99p3k37M56m02J23j32k47
$$ -350 169 62 -99 155 118 -298 238 -26 -35 39 -59 153 71 -139 260 187 -50 406 4 127 -5 -252
4202b52K47N2l00L09j09j36K66j0j11Q2l1j83L40k90K7K92l61N39j88l25M34l77
$$ -252 -5 47 -253 56 -53 -189 77 67 -44 38 7 -176 164 -126 -99 193 -168 371 183 -142 292 -85
4224h5J4K46j47J27j84o8J14J45k84K25r7k95L40j98J35J1p5N1J50j55L31j31
$$ -85 -71 175 28 155 -29 -97 17 162 -122 103 6 -289 51 -147 -12 -1 -76 -25 125 -30 301 170
4246A70k58J64P3l87N53k19k64N59n40K87Rl45LK80j28M1o5l2L45o07N68l6j07
$$ 170 -88 76 149 -238 315 96 -168 391 -149 138 147 -198 -195 85 -43 -2 -67 -99 246 -361 207 171 64
4269F4k72K73l37O52k93k93L58k20l6K93k36j30N96n30KJ64k85P07m60n6L4j46
$$ 64 -208 65 -272 380 87 -206 152 -68 -104 189 -47 -177 419 -111 -109 55 -230 477 17 -39 -5 -151
4291a51o1M26l27L02r5k26K61j24k43K81r4j26J94j88J66L15n45K18m7L0Q1k2
$$ -151 -212 214 -113 189 94 -132 129 5 -238 43 -51 -177 17 -171 -5 310 -235 -17 -64 -34 47 25
4313B5m6K84k17l70M19l44L00J94l29K09J02m19M15j83k71L18j15j17L30n60M69
$$ 25 -21 263 46 -324 95 -249 51 245 -84 125 227 -192 223 40 -231 87 -28 -145 185 -375 94
4334I4j78j64M60k15j31M19n29J15N09k26k30K99m52L91j86m88Q42k91k38N25
$$ 94 -84 -248 212 -3 -134 285 -244 -129 380 154 -76 223 -229 162 -24 -512 330 39 -199 326
4354C26l29JQ4m73M93K45m50j0O1j6K59k99J96k07%J36p0k40M82k88j23K56l21
$$ 326 -3 -2 82 -391 102 347 -103 -113 -52 -68 191 -108 88 -119 -119 17 -53 -293 189 -99 -222 34 -287
4377b87K11J90q4o9K04l25J59J82j44o0J40j00p9N6k89N69j04k76J39j41J72o6
$$ -287 -76 114 30 -39 165 -160 -1 181 37 -23 117 17 -62 -6 -295 274 170 -106 33 -108 64 -2
4399bj42J96L28p06O79m26K7K00j22J2L96q61N08j0n09N18Q4k50L95n82K62J29
$$ -2 -144 52 380 -326 353 -73 -46 154 32 44 440 -421 87 77 -432 86 170 -80 315 -267 -5 124
4421A24k59J55L8j62M31r7p82P65l04K75p6l23P9L29l34L18j60k73K28P3j02J57
$$ 124 -135 20 58 -104 327 230 -552 213 -91 184 108 -215 -136 193 -141 177 17 -256 -28 45 -57 100
4443A00j27k10K79k38J14J00r3m6J73k15J57M1j96L20k88j65L62k17P4M4j8J81
$$ 100 -27 -237 42 -196 -82 18 -75 -121 52 -163 -6 35 -161 159 -129 -294 68 -149 -75 -31 -49 132
4465A32J63o43M18M4l58K33Q8j43L02o65M55J85k90J87r0k90K52J3m51N61k98
$$ 132 295 -348 70 114 -244 -11 77 -66 236 -429 26 211 -79 108 18 -272 -20 -7 -458 103 -195
4486a95J26K44k40J5J62l20N02j57m22P63o42o3L96l67k8J68J89j79K53m24L08
$$ -195 -69 175 -65 -50 112 -208 294 137 -285 478 -164 -227 169 -198 -226 -58 131 -48 205 -219 89
4507H9M6m47M71j90j19M76l94J29P0k29K27j43k68K60J50l29M63k48j10L23l72
$$ 89 135 -312 159 -31 -150 326 -68 61 131 -98 129 -14 -282 -22 128 -201 262 14 -96 227 -145
4528a45K20j47QK05l13RL11j91l86M95Q1j28J41l30L9J00l96N34J28l80N09l64
$$ -145 75 -72 -64 141 -172 -163 148 -43 -429 66 147 19 160 -170 -131 -31 -427 107 235 -145 364 0
4550@j30K79k25j0L59l58L5J50j94N35m77QM76m55L2L06j95j44K03j21J89j28
$$ 0 -130 149 -76 -86 273 -85 -50 100 -94 441 -36 -28 448 -7 25 331 136 -8 195 74 263 135
4572A35l01O68l64l65L46j10q5M68o75K41J12l22K80N2jK00k98K10r6j86K21j42
$$ 135 -166 502 138 -227 119 9 -76 392 -283 -42 70 -252 28 80 79 279 -19 191 95 -91 130 -12
4594a2j45K50j19j41L82m09n2M01j53kP6k74K42j3k68L26k06q0K80j08j44M27
$$ -12 -157 93 -26 -167 215 -194 -246 155 2 0 76 -198 44 31 -237 89 -117 -197 83 -25 -169 258
4616B58m20m9M43j15j71K20n29N34P6l02J86j15l05N53j61j03K88l91J81k69J70
$$ 258 -162 -211 232 117 -54 166 -363 171 247 -55 131 16 -289 264 103 0 288 -103 78 -191 -21
4637b1O7k47L10O7m10K46J03j91k5M2k21M53l26OM90k19j21R4j81Q3J38k90J66
$$ -21 46 -201 109 176 -234 12 115 -76 -101 -59 -280 173 -153 -147 343 124 3 97 -84 -1 137 -153 13
4660A3J48l59K78j97N9N26m08J00L1l76J88K8q1J81k32m3K18j29k6K17k13K11
$$ 13 161 -198 80 -117 -58 468 60 160 191 -185 3 31 -50 131 -101 -144 74 -55 -81 136 -77 134
4682A34l4k64L33j12l67K49K52j66o0j71J76J33j41J42K1k28n2L89m31J56K3m1
$$ 134 100 -164 169 57 -310 -61 191 25 -35 -206 -30 103 -38 104 125 -103 -155 234 -197 -41 -18 -59
4704e9R8r0O9K40n91J55L37j86K24j46j34M59m19QM11m11O2J73k33K07l14M4L63
$$ -59 39 -51 18 258 -333 -178 159 -27 197 51 -83 376 -43 -35 376 -35 27 200 -33 174 -140 -96 267
4727B67q4k64J12j61J28j8j15K83k0k82L79k05Q6J57k22p8Ll20J93K49m87L72
$$ 267 183 -81 31 -130 -2 -20 -135 148 128 -154 225 20 106 263 41 -37 -34 -354 -161 88 -399 -27
4749b7j56P6K92J23m36J91q0j18R0K48k34j25J56m8K40l68K03N8j99K23j37k06
$$ -27 -183 -107 185 308 -128 63 -17 -135 -45 203 -31 -156 0 -48 192 -176 27 85 -114 109 -28 -234
4771b34K94j14K97m2j63K4r2l46M63l4k04K38q9j10M13l52L8J30j33J07j95L6
$$ -234 60 -54 243 201 38 62 -30 -376 87 53 -151 87 -2 -112 301 -51 -13 117 -16 91 -104 -68
4793f8M09l47K2J60k51J35l39L07o5k9k7P3P1j18m2p1K09j39K2L23j40OJ22k24
$$ -68 341 -6 16 176 -75 60 -279 28 -37 -66 -93 -20 51 -67 -109 -180 29 -110 -88 235 95 101 223 -1
4817ap5K43k77M08k30J92k41M7q8l5J13Q0n7J89m88J95J04j50L44l64N8L08j71
$$ -1 -76 167 -110 298 68 260 19 66 -22 -57 56 136 79 268 -220 -25 79 -71 273 -91 -33 275 104
4840A04n7J37l17L22j79k47K19j97J81J92m09L20j6j25J89j56j79L07o7j27K89
$$ 104 47 184 -133 189 10 -237 -18 -215 -34 158 -251 69 53 -72 117 -39 -218 89 22 -105 184
4861A84j99J58J84k80j01J91j89J03k18L47n2k65L48n6l75K89J97k99L79k90k32
$$ 184 -15 143 327 47 -54 137 -52 51 -167 180 128 -137 211 155 -220 69 266 -33 346 56 -176
4882a76J75j54K45p1J22j81m4J12K9j16j25J87q5M7J57j31j1Q5p8j15N7J11k68
$$ -176 -1 -155 90 19 141 -40 -84 28 57 -59 -184 3 -82 -35 122 -9 -20 65 -13 -128 -71 40 -228
4905b28L34k0m9L8m4j67K05l64K42P4MJk10J47j20J35J33j38M5J63j03k44K85
$$ -228 106 86 37 75 31 -136 69 -295 -53 21 25 26 -184 -37 -157 -22 111 -27 18 181 78 -166 119
4928A19l29K36m1k66M59j1l37K65j41j32L15j92K71k56o5J75O7j72J24j81Q2K18
$$ 119 -210 26 -15 -281 178 167 -170 95 -46 -178 137 -55 216 -40 -105 70 137 -35 89 -92 -10 208
4950B08j50p7J73l09J83R5l46L72j38k53K71j78K47n4j89J67m3J3m8J5k1OJ32
$$ 208 58 -19 154 -155 28 123 -223 149 11 -242 29 -149 98 44 -145 22 -21 -8 -56 -41 -62 -56 76
4973G6j33Nj24j13K86m3l7n7J5Q6L09l87K40o7k50M39l58N7K08l50R1J07j96J46
$$ 76 -57 -52 -176 -289 -3 -46 -83 -140 -125 -39 270 -117 123 56 -194 245 -113 -56 152 -198 -107 0 -196 -50
4997e0L04m21M17k2n73O23m3k70J10J19j96J8O5m5l3r6P5M3K2K10l43R1J24l49
$$ -50 254 -167 250 228 -345 278 235 -35 75 194 -2 16 81 36 3 -93 -18 25 47 257 -86 5 129 -220
5021b20kM70k56K57l79J80j16J53J71n2k06J48l3k18J28J2q5K11j72n3J2j5K4
$$ -220 -222 248 -8 249 -130 50 -66 87 258 206 0 148 115 -103 25 37 -48 163 -9 -62 -50 -65 -41
$$ [...]
8191G4
##END NTUPLES=NMR FID
##END=
