##TITLE=1H_Ser 7-2-V
 CDCl3, 108 sc, 
 26.8.2020
##JCAMPDX= 6.0         $$ Bruker NMR JCAMP-DX V2.0
##DATA TYPE= NMR FID
##DATA CLASS= NTUPLES
##ORIGIN= UXNMR, Bruker Analytische Messtechnik GmbH
##OWNER= root
$$ XWIN-NMR		Version 3.5
$$ Thu Aug 27 12:30:51 2020 Russian Standard Time (UT+4h)  she@DPX200
##.OBSERVE FREQUENCY= 200.1315066352
##.OBSERVE NUCLEUS= ^1H
##.DELAY= (6, 6)
##.ACQUISITION MODE= SIMULTANEOUS
##.ACQUISITION SCHEME= undefined
##.AVERAGES= 108
##.DIGITISER RES= 18
##SPECTROMETER/DATA SYSTEM= spect
##.PULSE SEQUENCE= zg30
##.SOLVENT NAME= CDCl3
##.SHIFT REFERENCE= (INTERNAL, CDCl3, 0, 15.7039)
##AUDIT TRAIL= $$ (NUMBER, WHEN, WHO, WHERE, WHAT)
$$ ##TITLE= Audit trail, XWIN-NMR		Version 3.5
$$ ##JCAMPDX= 5.01
$$ ##ORIGIN= Bruker BioSpin GmbH
$$ ##OWNER= she
$$ F:/spectra/data/she/nmr/H-F/1/audita.txt
$$ ##AUDIT TRAIL=  $$ (NUMBER, WHEN, WHO, WHERE, WHAT)
(   1,<2020-08-27 12:29:13.67 +0400>,<she>,<DPX200>,
      <continue with go, POWCHK disabled, PULCHK disabled
       configuration hash MD5:
       00 E9 B6 7A A2 85 ED C7 34 08 36 98 17 FE 4E 26
       data hash MD5: 16K
       AD 27 25 09 69 3B 21 0E DC 6D 6A 16 E5 C4 E1 AC>)
$$ ##END=
$$ 
$$ hash MD5
$$ 3C 35 A4 38 A3 6D 34 7D 53 05 24 EF 4A 75 D3 89
##$RELAX= 
##$RELAX= 
##$RELAX= 
##$RELAX= 
##$RELAX= 
##$RELAX= 
$$ Bruker specific parameters
$$ --------------------------
##$DU= <F:/spectra>
##$EXPNO= 1
##$NAME= <H-F>
##$PROCNO= 1
##$TYPE= <nmr>
##$USER= <she>
##$AMP= (0..31)
100 100 100 100 100 100 100 100 100 100 100 100 100 100 100 100 100 100 
100 100 100 100 100 100 100 100 100 100 100 100 100 100 
##$AQSEQ= 0
##$AQ_mod= 1
##$AUNM= <au_zg>
##$AUTOPOS= <>
##$BF1= 200.13
##$BF2= 200.13
##$BF3= 200.13
##$BF4= 200.13
##$BF5= 200.13
##$BF6= 200.13
##$BF7= 200.13
##$BF8= 200.13
##$BYTORDA= 1
##$CFDGTYP= 0
##$CFRGTYP= 5
##$CHEMSTR= <none>
##$CNST= (0..31)
1 1 145 1 1 1 1 1 1 1 1 1 1 1 1 1 1 1 1 1 1 1 1 1 1 1 1 1 1 1 1 1 
##$CPDPRG= <>
##$CPDPRG1= <>
##$CPDPRG2= <>
##$CPDPRG3= <>
##$CPDPRG4= <mlev>
##$CPDPRG5= <mlev>
##$CPDPRG6= <mlev>
##$CPDPRG7= <mlev>
##$CPDPRG8= <mlev>
##$CPDPRGB= <>
##$CPDPRGT= <>
##$D= (0..31)
0 1.2 0 0 0 0 0 0 0 0.06 0 0.03 0 0 0 0 0.0002 0 0 0 0 0 0 0 0 0 0 0 0 
0 0 0 
##$DATE= 1598516520
##$DBL= (0..7)
120 120 120 120 120 120 120 120 
##$DBP= (0..7)
150 150 150 150 150 150 150 150 
##$DBP07= 0
##$DBPNAM0= <>
##$DBPNAM1= <>
##$DBPNAM2= <>
##$DBPNAM3= <>
##$DBPNAM4= <>
##$DBPNAM5= <>
##$DBPNAM6= <>
##$DBPNAM7= <>
##$DBPOAL= (0..7)
0.5 0.5 0.5 0.5 0.5 0.5 0.5 0.5 
##$DBPOFFS= (0..7)
0 0 0 0 0 0 0 0 
##$DE= 6
##$DECBNUC= <off>
##$DECIM= 32
##$DECNUC= <off>
##$DECSTAT= 4
##$DIGMOD= 1
##$DIGTYP= 9
##$DL= (0..7)
0 120 120 120 120 120 120 120 
##$DP= (0..7)
150 150 150 150 150 150 150 150 
##$DP07= 0
##$DPNAME0= <>
##$DPNAME1= <>
##$DPNAME2= <>
##$DPNAME3= <>
##$DPNAME4= <>
##$DPNAME5= <>
##$DPNAME6= <>
##$DPNAME7= <>
##$DPOAL= (0..7)
0.5 0.5 0.5 0.5 0.5 0.5 0.5 0.5 
##$DPOFFS= (0..7)
0 0 0 0 0 0 0 0 
##$DQDMODE= 0
##$DR= 18
##$DS= 0
$$ [...]
##$SUBNAM2= <"">
##$SUBNAM3= <"">
##$SUBNAM4= <"">
##$SUBNAM5= <"">
##$SUBNAM6= <"">
##$SUBNAM7= <"">
##$SUBNAM8= <"">
##$SUBNAM9= <"">
##$SW= 16.880792210976
##$SWIBOX= (0..15)
0 0 2 0 0 0 0 0 0 0 0 0 0 0 0 0 
##$SW_h= 3378.37837837838
##$TD= 16384
##$TD0= 1
##$TE= 0
##$TE2= 300
##$TE3= 300
##$TEG= 300
##$TL= (0..7)
0 120 120 120 120 120 120 120 
##$TP= (0..7)
150 150 150 150 150 150 150 150 
##$TP07= 0
##$TPNAME0= <>
##$TPNAME1= <>
##$TPNAME2= <>
##$TPNAME3= <>
##$TPNAME4= <>
##$TPNAME5= <>
##$TPNAME6= <>
##$TPNAME7= <>
##$TPOAL= (0..7)
0.5 0.5 0.5 0.5 0.5 0.5 0.5 0.5 
##$TPOFFS= (0..7)
0 0 0 0 0 0 0 0 
##$TUNHIN= 0
##$TUNHOUT= 0
##$TUNXOUT= 0
##$USERA1= <user>
##$USERA2= <user>
##$USERA3= <user>
##$USERA4= <user>
##$USERA5= <user>
##$V9= 5
##$VALIST= <valist>
##$VCLIST= <CCCCCCCCCCCCCCC>
##$VD= 0
##$VDLIST= <DDDDDDDDDDDDDDD>
##$VPLIST= <PPPPPPPPPPPPPPP>
##$VTLIST= <TTTTTTTTTTTTTTT>
##$WBST= 1024
##$WBSW= 4
##$XGAIN= (0..3)
0 0 0 0 
##$XL= 0
##$YL= 0
##$YMAX_a= 2701288
##$YMIN_a= -2011839
##$ZGOPTNS= <>
##$ZL1= 120
##$ZL2= 120
##$ZL3= 120
##$ZL4= 120
##$ABSF1= 10
##$ABSF2= 0
##$ABSG= 5
##$ABSL= 3
##$ALPHA= 0
##$AQORDER= 0
##$ASSFAC= 0
##$ASSFACI= 0
##$ASSFACX= 0
##$ASSWID= 0
##$AUNMP= <proc_1d>
##$AZFE= 0.1
##$AZFW= 0.1
##$BCFW= 1
##$BC_mod= 2
##$BYTORDP= 1
##$COROFFS= 0
##$CY= 11.3945322036743
##$DATMOD= 1
##$DC= 2
##$DFILT= <>
##$DTYPP= 0
##$F1P= 16.9975609425685
##$F2P= -3.02152046262296
##$FCOR= 0.5
##$FTSIZE= 0
##$FT_mod= 4
##$GAMMA= 1
##$GB= 0.15
##$INTBC= 1
##$INTSCL= 1
##$ISEN= 128
##$LB= 0.24
##$LEV0= 0
##$LPBIN= 0
##$MAXI= 10000
##$MC2= 0
##$MEAN= 0
##$ME_mod= 0
##$MI= 1.114404
##$NCOEF= 0
##$NC_proc= 0
##$NLEV= 6
##$NOISF1= 3.799351
##$NOISF2= 2.8
##$NSP= 1
##$NTH_PI= 0
##$NZP= 0
##$OFFSET= 15.70392
##$PC= 1
##$PHC0= -9971.415
##$PHC1= 10.40092
##$PH_mod= 1
##$PKNL= yes
##$PPARMOD= 0
##$PSCAL= 0
##$PSIGN= 0
##$REVERSE= no
##$SF= 200.130013532006
##$SI= 16384
##$SIGF1= 3
##$SIGF2= 2
##$SINO= 400
##$SIOLD= 16384
##$SREGLST= <1H.CDCl3>
##$SSB= 0
##$STSI= 0
##$STSR= 0
##$SW_p= 3612.71676300578
##$SYMM= 0
##$S_DEV= 0
##$TDeff= 0
##$TDoff= 0
##$TI= <>
##$TILT= no
##$TM1= 0
##$TM2= 0
##$TOPLEV= 0
##$USERP1= <user>
##$USERP2= <user>
##$USERP3= <user>
##$USERP4= <user>
##$USERP5= <user>
##$WDW= 1
##$XDIM= 8192
##$YMAX_p= 0
##$YMIN_p= 0
$$ End of Bruker specific parameters
$$ ---------------------------------
##NTUPLES= NMR FID
##VAR_NAME=  TIME,          FID/REAL,        FID/IMAG
##SYMBOL=    X,             R,               I
##VAR_TYPE=  INDEPENDENT,   DEPENDENT,       DEPENDENT
##VAR_FORM=  AFFN,          ASDF,            ASDF
##VAR_DIM=   8192,          8192,            8192
##UNITS=     SECONDS,       ARBITRARY UNITS, ARBITRARY UNITS
##FACTOR=    0.000296,      1,               1
##FIRST=     0,             0,               0
##LAST=      2.424536,      0,               0
##MIN=       0,             -2011839,        0
##MAX=       2.424536,      2701288,         0
$$ Real data points
##PAGE= N=1
##DATA TABLE= (X++(R..R)), XYDATA
$$ [...]
$$ plain form
2598 -911 -266 1587 1104 -325 -623 1673 1762 611 -141 -211 859 1818 -919 -1079 -856 1673 504 -1349
2616 -1349 -1348 -1170 734 458 -1246 -1777 459 305 28 -1344 -1645 -46 1057 228 -552 -27 975 25
2634 25 -872 -337 -351 774 279 -1237 -1556 60 1662 541 -1761 -1058 459 48 -162 -654 -1028 222
2652 222 741 -889 -1341 740 1956 772 -596 -1057 627 986 710 -437 -298 1098 1238 578 -549
2669 -549 354 831 1829 -436 13 596 1172 274 -695 -568 809 1566 416 -701 505 684 1138 76
2687 76 -870 -952 184 1268 -554 -747 -300 772 1219 -1261 -1627 170 197 -589 -1028 -1457 743 257 47
2706 47 -1300 -1507 -373 -31 -793 -1252 -361 355 351 -1431 -2131 263 877 -78 -1100 -1069 392 459 42 -972
2726 -972 -677 1363 368 -1043 -888 889 1116 121 121 -300 -292 1282 338 120 -1106 2022 947 456 -1176
$$ packed form
2598i11O45J853m83j429k98K296Q9j151p52p0J070R59k737j60K23K529j169j853
2616a349JJ78J904k76j704n31K236j54k77j372l01J599J103q29p80N25J002r50
2634B5q97N35j4J125m95j516l19J616J602j121k302P03J517m11k10m92l74J250
2652B22N19j630m52K081J216j184j368m61J684L59k76j147J39J396J40o60j127
2669e49R03M77R98k265M49N83N76q98r69J27J377P57j150j117J206J79M54j062
2687G6r46q2J136J084j822j93M47J072M47k480l66J797K7p86m39m29K200m86k10
2706D7j347k07J134L42p62m59Q91P16mj782p00K394O14r55j022L1J461O7m17j014
2726i72K95K040r95j411J55J777K27r95%m21QJ574r44k18j226L128j075m91j632
$$ plain form
2745 -1176 24 1486 404 1278 -835 315 623 99 414 -103 -21 2169 225 -1265 12 766 681
2762 681 320 -678 -200 209 332 -690 -1297 -106 -397 -231 -1047 -314 -154 1320 -512 -912 -1099 374
2780 374 -927 -992 -1670 -465 2013 -423 -431 -1447 -83 74 -797 -816 -1513 -535 398 12 -711 -424 -256
2799 -256 -325 -30 -988 -702 290 953 -134 -899 133 944 302 -427 -746 331 483 349 -429 985 1311
2818 1311 1591 486 496 137 1457 1125 -733 -493 1371 1192 589 735 -138 1476 1682 1199 537 -183
2836 -183 577 122 -791 -592 262 148 100 -727 -823 -474 346 512 -436 -448 781 -221 -380 -960 -464 -83
2856 -83 232 24 -1166 -167 354 392 -117 -522 407 335 586 -697 -582 666 217 -361 -274 -1130 1314 949
2876 949 -32 -182 -163 112 265 -666 -608 -85 1987 262 -71 -10 1457 1015 1424 41 -513 1079 1275
$$ packed form
2745a176J200J462j082Q74k113J150L08n24L15n17Q2K190j944j490J277P54q5
2762F81l61r98M78M09J23j022o07J191k91J66q16P33J60J474j832m00j87J473
2780C74j301o5o78J205K478k436qj016J364J57q71j9o97R78R33l86p23K87J68
2799b56o9K95r58K86R92O63j087p65J032Q11o42p29l19J077J52j34p78J414L26
2818A311K80j105J0l59J320l32j858K40J864j79o03J46q73J614K06m83o62p20
2836a83P60m55r13J99Q54j14m8q27r6L49Q20J66r48j2J229j002j59n80M96L81
2856h3L15k08j190R99N21L8n09m05R29p2K51j283J15J248m49n78Q7q56K444l65
2876I49r81j50J9K75J53r31N8N23K072j725l33O1J467m42M09j383n54J592J96
$$ plain form
2895 1275 1471 -118 8 1164 1099 -198 64 435 1094 834 288 139 543 677 98 -453 -844 -531 -415
2914 -415 -32 -91 -221 540 -376 -679 -327 146 -246 -665 -715 -309 -425 -256 261 -353 -320 581 -129 -383 -508
2935 -508 178 684 351 -131 -953 -193 -465 248 -956 -684 294 1481 140 -975 842 419 -208 246
2953 246 -43 -431 1085 180 -495 -499 -68 1695 1128 -381 -309 602 849 984 111 -64 1305 906 -139
2972 -139 -619 719 418 1126 362 -464 -14 588 -140 -13 -847 -115 735 409 -407 -773 803 1089 -84
2991 -84 -935 603 1096 423 -173 -202 -401 358 487 -1321 -1128 329 418 -217 -887 -697 -351 -833 -126 -1676
3011 -1676 -164 915 250 -1155 -1454 -246 562 -83 12 -503 -62 -129 506 -878 -608 226 -20 297 -967
3030 -967 -278 375 800 25 -727 215 152 97 -595 -945 490 1453 -37 349 277 -275 677 819 376 561
$$ packed form
2895A275J96j589J26J156o5j297K62L71O59k60n46j49M04J34n79n51l91L13J16
2914d15L83n9j30P61r16l03L52M73l92m19n0M06j16J69N17o14L3R01p10k54j25
2935e08O86N06l33m82q22P60k72P13j204K72R78J187j341j115J817m23o27M54
2953B46k89l88J516r05o75mM31J763n67j509P2R11K47J35q73j75J369l99j045
2972a39m80J338l01P08p64q26M50O02p28J27q34P32Q50l26q16l66J576K86j173
2991h4q51J538M93o73n96k9j99P59J29j808J93J457Q9o35o70J90L46m82P07j550
3011a676J512J079o65j405k99J208Q08o45R5n15M41o7O35j384K70Q34k46L17j264
3030i67O89O53M25p75p52R42o3n5o92l50J435R63j490L86p2n52R52J42m43J85
$$ plain form
3050 561 425 341 435 -16 377 1319 147 -257 -690 752 98 383 129 -171 181 -323 140 -321 290 -587
3070 -587 -351 -491 -1375 -863 620 288 -5 -614 -160 1003 -156 9 -432 537 -237 -42 -132 -498 246
3089 246 176 -20 354 -125 221 469 286 -669 -711 332 275 -572 -889 -407 698 -739 -1163 172 -192 433
3109 433 122 -495 781 681 678 -515 -162 -126 186 655 872 214 361 397 222 515 59 427 853 397 49
3130 49 -296 12 745 74 -871 372 -201 456 175 -200 687 -68 -94 -326 415 736 -471 -219 -203 -595
3150 -595 -273 -484 -219 549 57 829 -577 -275 -218 -753 -27 -436 -641 592 432 -173 -387 -351 72 52
3170 52 -74 -621 -177 -5 771 218 -402 -619 -173 641 -1074 -544 -324 652 74 364 235 -192 502 870
3190 870 519 530 222 561 417 537 309 581 558 -387 1324 -19 -544 -28 -116 -176 234 526 656 -189 147
$$ packed form
3050E61j36q4R4m51L93R42j172m04m33J442o54K85k54l00L52n04M63m61O11q77
3070e87K36j40q84N12J483l32k93o09M54J163j159J65m41R69p74J95r0l66P44
3089B46p0j96L74m79L46K48j83r55m2J043n7q47l17M82J105j437m24J335l64O25
3109D33l11o17J276j00lj193L53L6L12M69K17o58J47L6j75K93m56L68M26m56l48
3130D9l45L08P33o71r45J243n73O57k81l75Q87p55k6k32P41L21j207K52J6l92
3150e95L22k11K65P68m92P72j406L02N7n35P26m09k05J233j60o05k14L6M23k0
3170E2j26n47M44J72P76n53o20k17M46Q14j715N30K20R76n78K90j29m27O94L68
3190H70l51J1l08L39j44J20k28K72k3r45J711j343n25N16q8o0M10K92J30q45L36
$$ plain form
3211 147 -126 5 -51 -384 -56 145 238 -221 -168 -231 -291 273 -322 -1085 -555 -335 517 -532 -414 -1329 -924
3232 -924 -326 -40 20 -828 607 -582 -710 -437 -236 -693 386 -1158 -253 -301 -132 -616 182 675 294
3251 294 276 -309 -227 97 -343 -370 -746 -80 201 139 723 -87 -127 316 17 322 -616 133 -54 571 256 -277
3273 -277 396 0 481 61 -339 727 1289 40 -968 156 407 301 295 -523 -353 231 455 522 -157 -228
3293 -228 -249 409 -964 461 360 184 -157 -568 284 -520 -507 143 -1020 -601 -362 328 -238 553 -215 174
3313 174 332 -343 -242 786 464 -912 -780 486 -329 56 -60 -738 -797 626 -455 73 -85 -582 174
3332 174 -347 -437 -43 -63 665 -444 -547 -485 370 -696 -1071 317 6 542 -34 79 285 -101 458 172
3352 172 -120 -187 174 -234 -852 -702 278 525 776 -1043 -729 -263 1202 -761 -442 -1382 344 -744 -652
$$ packed form
3211A47k73J31n6l33L28K01R3m59N3o3o0N64n95p63N30K20Q52j049J18r15M05
3232i24N98K86O0q48J435j189j28K73K01m57J079j544R05m8J69m84P98M93l81
3251B94j8n85Q2L24m40k7l76O66K81o2N84q10m0M43k99L05r38P49j87O25l15n33
3273b77O73l96M81m20m00J066N62j249j008J124K51j06oq18J70N84K24O7o79p1
3293b28k1O58j373J425j01j76l41m11Q52q04J3O50j163M19K39O90n66P91p68L89
3313A74J58o75J01J028l22j376J32J266q15L85j16o78n9J423j081N28j58m97P56
3332A74n21r0L94k0P28j109j03O2Q55j066l75J388l11N36n76J13K06l86N59k86
3352A72k92o7L61m08o18J50R80K47K51j819L14M66J465j963L19r40J726j088R2
$$ plain form
3371 -652 -967 -655 430 -541 -142 364 81 -181 393 -176 -896 181 -383 115 -728 -742 94 -231 -3 42
3391 42 -513 -959 158 -249 -733 -417 131 -308 -1088 40 166 40 -234 640 330 525 1200 324 -263 339
3411 339 -538 746 657 89 -581 240 902 -305 370 -26 592 -25 -155 -7 676 238 686 822 -92 308
3431 308 1318 349 643 -350 896 369 165 204 149 277 672 -705 -407 -447 16 -524 -1402 -518 233 42
3451 42 7 -646 -221 113 -224 -554 -743 -213 406 -352 309 -703 -155 -86 -428 -579 157 -393 59 215 -47
3472 -47 37 717 252 148 -699 403 -263 272 29 -839 -609 -92 -126 -863 -445 -379 85 -325 -378 -268 544
3493 544 425 -604 14 245 44 867 283 -41 -286 509 -74 313 872 679 313 243 203 337 448 316
3513 316 45 -38 -587 -359 129 -158 -190 -90 -143 -148 646 -676 119 -47 -251 -196 -447 -303 324 134 -246 -242
$$ packed form
3371f52l15L12J085r71L99N06k83k62N74n69p20J077n64M98q43j4Q36l25K28M5
3391D2n55m46J117m07m84L16N48m39p80J128J26j26k74Q74l10J95O75q76n87O02
3411C39q77J284q9n68o70Q21O62j207O75l96O18o17j30J48O83m38M48J36r14M00
3431C08J010r69K94r93J246n27k04L9n5J28L95j377K98m0M63n40q78Q84P51j91
3451D2l5o53M25L34l37l30j89N30O19p58O61j012N48O9l42j51P36n50M52J56k62
3472d7Q4O80m65j04q47J102o66N35k43q68K30N17l4p37M18O6M64m10n3J10Q12
3493E44j19j029O18K31k01Q23n84l24k45P95n83L87N59j93l66p0m0J34J11j32
3513C16k71q3n49K28M88k87l2J00n3nP94j322P95j66k04N5k51J44O27j90l80M
$$ plain form
3535 -242 192 -493 -201 35 608 -922 178 -615 -492 -360 851 -570 -355 439 -330 -330 -447 325 73
3554 73 541 579 213 -1099 185 -512 29 -118 -491 418 1146 -46 -284 281 178 787 1167 427 -326 370
3574 370 1313 49 177 564 525 -117 417 -636 -325 50 704 -208 428 -101 -57 226 17 982 305 1341
3594 1341 463 -685 130 634 -454 -250 -33 -542 408 -60 -628 98 200 260 -668 40 -434 -242 310
3613 310 -204 -257 -891 -84 -355 -185 -893 372 36 -266 347 -752 651 -159 197 -565 -893 164 -533
3632 -533 -478 79 854 -308 -674 -548 -620 1040 -402 -575 -30 -274 134 433 788 -847 -1123 1468 -10
3651 -10 676 -150 -221 54 28 -125 -312 -96 967 443 1381 -468 -380 301 -176 374 -719 -453 310 272 716
3672 716 -791 126 -216 -130 423 213 -424 275 773 -610 -235 -769 -484 -1218 -674 75 736 -676 -533
$$ packed form
3535b42M34o85K92K36N73j530J100p93J23J32J211j421K15P94p69%j17P72k52
3554G3M68L8l66j312J284o97N41j47l73R09P28j192k38N65j03O09L80p40p53O96
3574C70R43j264J28L87l9o42N34j053L11L75O54r12O36n29M4K83k09R65o77J036
3594A341q78j148Q15N04j088K04K17n09R50m68n68P26J02O0r28P08m74J92N52
3613C10n14n3o34Q07k71J70p08J265l36l02O13j099J403q10L56p62l28J057o97
3632e33N5N57P75j162l66J26p2J660j442j73N45k44M08K99L55j635k76K591j478
3651a0O86q26p1K75k6j53j87K16J063n24R38j849Q8O81m77N50j093K66P63l8M44
3672G16j507R17l42Q6N53k10o37O99M98j383L75n34K85p34N44P49O61j412J43
$$ plain form
3691 -533 -259 866 -159 -775 -483 400 79 99 280 -33 140 -726 -930 169 -608 -88 -172 -35 308 396
3711 396 280 -300 1004 80 62 -272 -358 -480 -31 -358 227 -641 89 -627 -154 104 -481 -253 -159 319 101
3732 101 -42 259 -836 825 553 -684 -413 38 1220 -299 -285 544 876 452 -253 78 -213 216 -183
3751 -183 35 352 104 -106 -714 -1369 -161 -117 -498 -447 -73 387 -806 -377 602 -176 -284 41 -246 -635
3771 -635 -694 -86 -1120 385 -1350 -1526 -426 -448 280 -1052 -360 -138 896 569 -390 -137 -318 556 359
3790 359 -646 -50 229 460 574 1076 1166 -141 455 -642 -909 574 243 -146 -173 -250 -514 867 537
3809 537 -501 -688 726 -657 -1208 -275 651 530 518 -447 -476 -68 -452 203 -571 -22 -998 572 495 -984
3829 -984 -444 357 -67 61 -435 -151 789 -337 -447 -520 1072 -173 -561 -632 -66 -143 -148 -509 -700 167 -525
$$ packed form
3691e33K74J125j025o16K92Q83l21K0J81l13J73q66k04J099p77N20q4J37L43Q8
3711C96j16n80J304r24j8l34q6j22M49l27N85q68P30p16M73K58n85K28R4M78k18
3732A01j43L01j095J661k72j237K71M51J182j519J4Q29L32m24p05L31k91M29l99
3751a83K18L17k48k10o08o55J208M4l81N1L74M60j193M29R79p78j08L25k87l89
3771f35n9O08j034J505j735j76J100k2P28j332O92K22J034l27r59K53j81Q74j97
3790C59j005N96K79K31J14N02R0j307N96j097k67J483l31l89k7p7k64J381l30
3809E37j038j87J414j383n51R33R26j21j2r65k9M08l84O55p74N49r76J570p7j479
3829i84N40Q01m24J28m96K84R40j126j10p3J592j245l88p1N66p7nl61j91Q67o92
$$ plain form
3850 -525 -269 116 156 280 452 -415 -1204 382 790 609 344 -785 -372 668 -70 -662 160 417 324 408
3870 408 779 -359 449 117 -94 -154 -267 364 683 9 -17 129 129 -131 347 312 666 108 420 -345 -23
3891 -23 -349 709 106 -359 604 -792 -42 -735 -622 -198 450 543 -657 -420 570 266 410 -32 631 -400
3911 -400 45 503 -101 -480 -41 -226 -121 311 -461 476 776 -29 -557 -205 -313 312 -763 -340 -66 -163
3931 -163 -656 -374 214 178 -236 227 -399 50 991 -288 167 135 262 -419 -493 -554 -237 552 165 748 158
3952 158 -243 156 -390 283 -52 -441 467 93 -67 495 -152 776 10 149 410 -565 -159 -186 143 125 375
3973 375 132 20 22 924 150 -336 688 542 -1095 462 -582 -683 428 -479 230 120 166 -625 -239
3992 -239 -126 1170 309 -340 -253 383 -277 466 -339 -65 -378 200 -310 -574 -77 -363 -765 473 192 -533
$$ packed form
3850e25K56L85M0J24J72q67p89J586M08j81k65j129M13J040p38n92Q22K57r3Q4
3870D08L71j138Q08l32k11o0j13O31L19o74k6J46%k60M78l5L54n58L12p65L22
3891b3l26J058o03m65R63j396P50o93J13M24O48R3j200K37R90l04J44m42O63j031
3911d00M45M58o04l79M39j85J05M32p72R37L00q05n28L52j08O25j075M23K74r7
3931a63m93K82N88l6m14M63o26M49R41j279M55l2J27o81p4o1L17P89l87N83n90
3952A58m01L99n46O73l35l89R08l74j60N62o47R28p66J39K61r75M06k7L29j8K50
3973C75k43j12KR02p74m86J024j46j637J557j044j01J111r07P09j10M6p91L86
3992b39J13J296q61o49Q7O36o60P43q05K74l13N78n10k64M97k86m02J238k81p25
$$ plain form
4012 -533 -747 172 -96 -272 903 308 -219 -425 87 -532 1013 -337 594 498 336 240 -17 865 2 25
4032 25 -314 241 264 970 884 -12 -239 286 555 588 863 457 506 382 145 -406 284 589 -722 -623 -726 -56
4054 -56 511 -1094 422 -214 -598 -228 -103 279 -34 -401 -768 -631 -75 265 107 39 37 -316 -188 331 206
4075 206 -347 -186 -536 125 -277 -1095 -861 -363 11 -936 -226 -519 -418 -101 -288 -1333 -824 -204 320 -230
4095 -230 -1213 1914 -375 -309 721 471 -118 532 -840 222 -459 -17 702 -67 412 -586 414 285
4113 285 -581 -325 679 -917 703 -293 556 48 101 -299 -381 650 380 -585 -407 237 -633 43 -90
4132 -90 484 -258 404 21 279 -138 -465 -66 881 -353 711 495 1194 68 -164 905 -37 -226 147
4151 147 10 107 242 -35 -533 -1622 20 -48 -399 44 187 338 188 -277 297 -286 886 -184 440
$$ packed form
4012e33k14R19k68j76J175n95n27k06N12o19J545j350R31r6j62r6k57Q82q63K3
4032B5l39N55K3P06q6q96k27N25K69L3K75m06M9j24k37n51O90L05j311R9j03O70
4054e6N67j605J516o36l84L70J25L82l13l67l67J37N56L40j58o8kl53J28N19j25
4075B06n53J61l50O61m02q18K34M98L74r47P10k93J01L17j87j045N09O20N24n50
4095b30r83L127k289O6J030k50n89O50j372J062o81M42P19p69M79r98J000j29
4113B85q66K56J004j596J620r96Q49n08N3m00q2J031k70r65J78O44q70O76j33
4132i0N74p42O62l83K58m17l27L99R47j234J064k16O99j126k32J069r42j89L73
4151A47j37R7J35k77m98j089J642o8l51M43J43J51j50m65N74n83J172j070O24
$$ plain form
4170 440 -513 -130 64 114 213 715 -378 35 -153 -701 563 19 560 476 507 -105 417 -22 114 -51 591
4191 591 265 542 -135 149 402 -501 -255 100 344 -712 -559 4 -1788 322 -312 -163 192 86 -123
4210 -123 148 412 469 -88 -650 69 624 105 -210 552 -388 109 -20 606 -351 454 -469 263 529 722
4230 722 -712 207 -249 514 -77 -68 -714 -388 232 -183 107 80 229 63 365 -9 -168 -740 604 -476
4250 -476 -274 -361 151 -306 991 118 621 402 -262 -179 -40 -358 -206 1148 -169 -287 692 -198 666 -461
4270 -461 -642 914 -35 -213 -407 420 -642 80 1418 394 32 -444 27 68 -89 321 -94 -169 -931
4289 -931 -423 1179 572 641 437 -75 529 -541 286 277 41 -696 820 237 -158 91 -378 183 -321 581
4309 581 -195 978 597 -473 -559 228 -586 375 -24 646 -124 31 -531 -1028 -318 -388 -335 -115 -56 -572 -149
$$ packed form
4170D40r53L83J94N0R9N02j093M13j88n48J264n44N41q4L1o12N22m39J36j65O42
4191E91l26K77o77K84K53r03K46L55K44j056J53N63j792K110o34J49L55j06k09
4210a23K71K64N7n57n62P19N55n19l15P62r40M97j29O26r57Q05r23P32K66J93
4230G22j434R19m56P63n91Ro46L26O20m15K90k7J49j66L02l74j59n72J344j080
4250d76K02q7N12m57J297q73N03k19o64Q3J39l18J52J354j317j18R79q90Q64j127
4270d61j81J556r49j78j94Q27j062P22J338j024l62m76M71M1j57M10m15p5p62
4289i31N08J602o07O9k04n12O04j070Q27rk36p37J516n83l95K49m69N61n04R02
4309E81p76J173l81j070q6P87q14R61l99O70p70J55n62m97P10p0N3K20N9n16M23
$$ plain form
4330 -149 13 -989 -705 254 264 245 -262 72 32 -185 165 -255 868 708 543 578 -87 375 23 -199 733
4351 733 464 165 476 537 203 374 931 -282 425 -309 -251 -141 -189 -66 -588 598 454 319 -811 586
4371 586 -596 111 176 -56 172 -117 47 -571 -1114 -194 -450 -66 209 177 31 -526 538 -568 -184 -402
4391 -402 -126 633 175 -121 -241 64 -423 -262 0 -65 -70 27 -194 1023 183 1179 -500 -963 -1162 817
4411 817 -200 618 -136 102 359 668 -58 -144 401 -1016 681 231 200 177 -523 -393 187 -180 768 41
4431 41 -79 -80 48 -186 413 76 46 -225 -454 -528 202 182 114 815 -142 -699 148 444 62 495 -77 82
4453 82 235 -351 -443 -577 -882 649 -441 392 283 -690 246 1120 -72 53 -418 420 333 -410 -128 270
4473 270 -202 -359 740 -128 482 -115 505 -684 261 87 283 116 -556 -144 -394 -679 -654 422 -417
$$ packed form
4330a49J62j002K84R59J0j9n07L34m0k17L50m20J123j60j65L5o65M62l52k22R32
4351G33k69k99L11O1l34J71N57j213P07p34N8J10m8J23n22J186j44j35j130J397
4371E86j182P07O5k32K28k89J64o18n43R20k56L84K75l2j46n57J064j106L84k18
4391d02K76P59m58k96j20L05m87J61K62o5nR7k21J217q40R96j679m63j99J979
4411H17j017Q18p54K38K57L09p26q6N45j417J697m50l1k3p00J30N80l67R48p27
4431D1j20jJ28k34N99l37l0k71k29p4P30k0o8P01r57n57Q47K96l82M33n72J59
4453H2J53n86r2j34l05J531j090Q33j09r73R36Q74j192J25m71Q38q7p43K82L98
4473B70m72j57J099q68O10n97O20j189R45j74J96j67o72M12k50k85K5J076q39
$$ plain form
4492 -417 -64 -787 117 -279 260 161 -8 -482 -180 -369 -342 -13 710 -827 129 173 -339 146 68 -280 -1088
4513 -1088 458 -162 -65 -243 -170 -456 667 -86 -623 -76 -409 644 -181 325 -45 -817 378 60 -504
4532 -504 196 -622 -424 307 280 199 765 -410 -949 -713 -617 845 352 -833 983 309 108 571 -485
4551 -485 -76 2 99 190 -271 -114 1233 -531 -161 -724 -521 304 -372 -296 -920 178 -128 618 854 -367
4571 -367 21 157 -215 -194 240 -249 -355 -275 -138 -6 130 -29 -314 -710 328 -450 785 -685 229 -112
4591 -112 731 240 -449 259 -296 53 -1075 -225 -396 -292 -464 -664 447 36 -146 -352 -217 60 266
4610 266 -433 789 688 131 56 -156 -415 19 536 -150 109 520 237 -194 -750 457 -441 9 -519 130
4630 130 605 -335 43 448 671 -216 456 -106 668 290 113 72 1140 520 6 608 726 -147 -651 -27
$$ packed form
4492d17L53p23R04l96N39r9j69m74L02j89K7L29P23j537R56M4n12M85p8l48q08
4513a088J546o20R7j78P3k86J123p53n37N47l33J053q25N06l70p72J195l18n64
4532e04P00q18J98P31k7q1N66j175n39K36R6J462m93j185J816o74k01M63j056
4551d85M09P8R7R1m61J57J347j764L70n63K03Q25o76P6o24J098l06P46K36j221
4571c67L88J36l72K1M34m89j06Q0J37J32J36j59k85l96J038p78J235j470R14l41
4591a12Q43m91o89P08n55L49j128Q50j71J04j72k00J111m11j82k06J35K77K06
4610B66o99J222j01n57p5k12k59M34N17o86K59M11k83m31n56J207q98M50n28O49
4630A30M75r40L78M05K23q87O72n62P74l78j77m1J068o20n14O02J18q73n04O24
$$ plain form
4650 -27 -211 150 342 606 368 -290 102 77 -270 -206 539 -552 1071 316 -110 976 -341 -914 109
4669 109 146 -327 710 67 -214 -573 379 52 -526 552 -715 167 643 -399 -405 27 -67 226 -136 -205
4689 -205 447 -440 -215 -695 124 938 565 -388 -356 298 -185 371 258 -300 335 -958 194 -183 -434 -1026
4709 -1026 -68 1006 -549 -393 486 387 -167 534 1173 318 -71 -314 468 182 -869 231 462 105 -332
4728 -332 186 206 517 -443 230 -1091 752 275 413 -480 -393 600 184 432 -47 -130 304 -269 293 605
4748 605 -154 -354 -531 -837 -777 284 -74 -421 133 -514 28 362 -379 -65 -406 166 -223 554 -157 314
4768 314 -1229 -994 438 322 213 -20 398 408 795 518 261 -327 -667 57 -167 1 -4 -14 215 -129 -392
4789 -392 145 104 -461 778 -949 -251 43 169 13 -152 -985 727 597 72 -587 -85 99 868 -567
$$ packed form
4650b7j84L61J92K64k38o58L92k5l47O4P45j091J623p55m26J086j317n73J023
4669A09L7m73J037o43k81l59R52l27n78J078j267Q82M76j042oM32r4K93l62o9
4689b05O52q87K25m80Q19Q14l73r53L2O54m83N56j13n58O35j293J152l77k51n92
4709a026R58J074j555J56Q79r9n54P01O39q55l89k43P82k86j051J100K31l57m37
4728c32N18K0L11r60O73j321J843m77J38q93Q7R93m16K48m79q3M34n73N62L12
4748F05p59k00j77l06O0J061l58l47N54o47N42L34p41L14l41N72l89P77p11M71
4768C14j543K35J432j16j09k33M18J0L87k77k57n88l40P24k24J68nj0K29l44k63
4789c92N37m1n65J239j727O98K94J26j56j65q33J712j30n25o59N02J84P69j435
$$ plain form
4808 -567 -370 167 -734 -131 291 175 -156 -410 93 513 494 -715 872 -9 -574 839 463 -241 -433
4827 -433 285 -1040 -221 -489 -116 -117 62 70 -68 -165 -92 -170 -759 465 12 581 618 -31 -546 -762 446 -221
4849 -221 472 29 268 284 -783 -215 299 345 765 464 -288 40 677 33 -349 315 -309 357 390 487 920
4870 920 456 -483 -249 234 -31 323 326 -701 419 -280 526 13 75 211 -453 555 681 -525 82 119
4890 119 -482 -24 -118 456 589 316 -989 -810 -923 86 353 -588 -18 368 801 508 61 65 77 -247 -1082
4911 -1082 -316 -209 -556 324 58 -335 -15 -148 460 913 -983 783 287 -473 675 418 219 589 -54
4930 -54 -122 981 -311 577 252 106 -34 131 491 -718 142 402 329 454 -436 -261 -984 400 812 -313
4950 -313 1017 -1048 -561 -182 516 20 322 102 657 166 973 -544 6 -136 750 298 -438 5 247
$$ packed form
4808e67J97N37r01O03M22j16l31k54N03M20j9j209J587q81n65J413l76p04j92
4827d33P18j325Q19k68L73jJ79Qj38r7P3p8n89J224m53N69L7o49n15k16J208o67
4849b21O93m43K39J6j067N68N14M6M20l01p52L28O37o44l82O64o24O66L3R7M33
4870I20m64r39K34M83k65L54Lj027J120o99Q06n13O2J36o64J008J26j206O07L7
4890A19o01M58r4N74J33k73j305J79j13J009K67r41N70L86M33k93m47MJ2l24q35
4911a082P66J07l47Q80k66l93L20j33O08M53j896J766m96p60J148k57j99L70o43
4930e4o8J103j292Q88l25j46j40J65L60j209Q60K60p3J25q90J75p23J384M12j125
4950c13J330k065M87L79O98m96L02k20N55m91Q07j517N50j42Q86m52p36M43K42
$$ plain form
4969 247 -106 -1207 -397 -100 -232 -666 620 57 -94 317 -526 -132 -156 191 763 -285 212 -750 56
4988 56 -183 103 -216 364 -343 195 -419 -161 -760 -27 -544 -647 366 -12 -528 163 360 623 -931 738
5008 738 -645 288 570 610 1014 186 229 305 -328 46 264 147 342 -446 -129 80 190 -906 558 169
5028 169 -54 230 -64 382 531 594 -90 -450 877 -233 326 22 -864 -202 55 -820 -475 -425 164 -536
5048 -536 639 -609 77 -770 179 1484 -501 -415 623 160 482 294 608 170 1306 102 -1355 -458
5066 -458 -115 -436 194 28 -447 -464 -223 351 25 137 -19 46 244 -91 -441 -93 -886 13 -870 138
5086 138 -379 -158 77 104 482 425 1206 167 -88 -290 -54 -492 -487 124 -155 49 -233 65 532 552 675
5107 675 195 171 -24 646 -79 -327 -320 -45 -110 -314 5 -616 61 -402 -161 1197 58 235 553 407 -312
$$ packed form
4969B47l53j101Q10K97j32m34J286n63j51M11q43L94k4L47N72j048M97r62Q06
4988E6k39K86l19N80p07N38o14K58n99P33n17j03J013l78n16O91J97K63j554J669
5008G38j383R33K82M0M04q28M3P6o33L74K18j17J95p88L17K09J10j096J464l89
5028A69k23K84k94M46J49O3o84l60J327j110N59l04q86O62K57q75L45N0N89p00
5048e36J175j248O86q47R49J305j985Q6J038m63L22j88L14m38J136j204j457Q97
5066d58L43l21O30j66m75j7K41N74l26J12j56O5J98l35l50L48p93Q99q83J008
5086A38n17K21K35K7L78n7P81j039k55k02K36m38NO11k79K04k82K98M67K0J23
5107F75m80k4j95O70p25k48PK75o5k04L19o21O77m63K41J358j139J77L18j46p19
$$ plain form
5128 -312 -876 -345 96 769 -99 -814 -1003 454 -461 400 195 466 -435 -286 247 -158 645 -256 -70 537
5148 537 -186 -259 814 -1107 509 4 -164 -4 -309 -33 -439 285 475 20 198 1089 -267 -108 107
5167 107 126 -60 849 303 -282 438 16 1277 -16 718 1253 -286 552 10 -242 27 741 430 -630
5186 -630 77 -73 -157 -1279 -531 358 -181 -325 1158 566 -1037 -89 434 -192 -228 141 -702 -304 243 -367
5206 -367 -854 -681 -411 -327 -221 -103 584 331 434 -352 -66 -64 -138 -382 -433 294 333 537 213 -199 544 42
5228 42 255 -290 -491 -215 -373 -910 -280 -103 -1042 154 -736 -345 94 419 -380 -188 577 -736 35 208
5248 208 -904 362 535 633 -731 937 3 -92 325 -186 -564 151 -244 26 254 -444 701 -58 -191
5267 -191 317 417 -388 -619 -639 -425 -1038 -425 -564 308 -440 8 253 -668 98 -799 407 -47 29 -113
$$ packed form
5128c12n64N31M41O73q68p15j89J457r15Q61k05K71r01J49N33m05Q03r01J86O07
5148E37p23p3J073j921J616n05j68J60l05K76m06P24J90m55J78Q91j356J59K15
5167A07J9j86R09n46n85P20m22J261j293P34N35j539Q38n42k52K69P14l11j060
5186f30P07j50q4j122P48Q89n39j44J483n92j603R48N23o26l6L69q43L98N47o10
5206c67m87J73K70Q4J06J18O87k53J03p86K86Kp4k44n1P27L9K04l24m12P43n02
5228D2K13n45k01K76j58n37O30J77r39J196q90L91M39L25p99J92P65j313P71J73
5248B08j112J266J73R8j364J668r34r5M17n11l78P15l95K70K28o98J145p59j33
5267a91N08J00q05k31k0K14o13O13j39Q72p48M48K45r21P66q97J206m54P6j42
$$ plain form
5287 -113 1164 -11 313 -582 -597 120 -19 -383 336 326 446 217 211 958 749 -323 -317 -6 436 -307 -276
5308 -276 441 -428 -55 420 119 220 -286 292 615 -178 193 -632 564 -71 10 -454 -522 116 -407 -146
5328 -146 398 437 -291 -327 1370 35 -569 764 -202 280 -502 -597 257 279 191 -305 480 -172 -575 -658 249
5349 249 152 515 639 60 151 19 -36 -55 521 584 -174 -555 23 228 -415 -1298 -53 45 292 292 -38 -17 -490
5372 -490 -1059 495 -233 65 646 -621 284 90 -198 -431 -122 147 -337 86 208 -621 169 -149 -383
5391 -383 -883 -240 2 851 -573 -519 18 1069 306 -334 889 357 112 490 -331 -269 12 4 -202 -275 -191
5412 -191 163 168 150 29 -49 -149 -420 373 -436 -395 -136 172 493 -751 285 -104 -431 21 -612 291 -423
5433 -423 96 -61 67 -639 551 -687 76 9 618 408 -744 -237 579 -92 -78 -587 -204 -225 -75 535
$$ packed form
5287a13J277j175L24q95j5P17j39l64P19j0J20k29oP47k09j072OL11M42p43L1
5308b76P17q69L73M75l01J01n06N78L23p93L71q25J196o35Q1m64o8O38n23K61
5328a46N44L9p28l6J697j335o04J333r66M82p82r5Q54K2q8m96P85o52m03q3R07
5349B49r7L63J24n79R1j32n5j9N76O3p58l81N78K05o43q83J245R8K47%l30K1m73
5372d90n69J554p28K98N81j267R05j94k88k33L09K69m84M23J22q29P90l18k34
5391c83n00O43K42Q49j424N4N37J051p63o40J223n32k45L78q21O2K81qk06p3Q4
5412a91L54Nj8j21p8j00k71P93q09M1K59L08L21j244J036l89l27M52o33R03p14
5433d23N19j57J28p06J190j238P63o7O09k10j152N07Q16o71J4n09L83k1J50O10
$$ plain form
5453 535 639 149 540 -6 -856 569 -73 -648 -174 -466 772 329 -174 -414 396 177 -110 -581 -1162
5472 -1162 313 139 -514 -476 443 362 -143 -447 -263 -117 1010 -599 51 509 -228 -1023 -387 -293 -21 -399
5492 -399 18 -676 119 -67 249 356 -207 634 -185 -361 333 -192 360 -456 -111 -322 -465 -456 186 167 232
5513 232 172 312 29 -938 -613 438 -590 -98 -117 -259 581 -73 -448 -595 18 -274 -57 -458 -270 368
5533 368 -350 -233 1070 11 721 319 461 -108 -114 -282 138 -467 -313 -188 47 -1190 842 191 127 892
5553 892 -93 162 -62 -304 148 -107 176 -242 510 141 188 -936 3 189 208 -105 977 -457 267 -303
5573 -303 -220 247 774 1136 763 179 191 538 -519 103 -887 -232 487 -350 -954 341 -239 -68 39 412
5593 412 -1464 997 -61 -245 252 152 -745 424 566 156 558 382 181 475 -343 345 294 -1271 224
$$ packed form
5453E35J04m90L91n46q50J425o42n75M74k92J238m43n03k40Q10k19k87m71n81
5472a162J475j74o53L8R19q1n05l04J84J46J127j609O50M58p37p95O36R4K72l78
5492c99M17o94P95j86L16J07n63Q41q19j76O94n25N52q16L45k11j43RO42j9O5
5513B32o0J40k83r67L25J051j028M92j9j42Q40o54l75j47O13k92K17m01J88O38
5533C68p18J17J303j059P10m02J42n69oj68M20o05J54J25K35j237K032o51o4P65
5553H92r85K55k24k42M52k55K83m18P52l69M7j124R39J86J9l13J082j434P24n70
5573c03Q3M67N27L62l73n84J2L47j057O22r90O55P19q37o04J295n80J71J07L73
5593D12j876K461j058j84M97j00q97J169J42m10M02j76k01K94q18O88n1j565J495
$$ plain form
5612 224 -167 610 -638 -686 -1486 438 -210 -292 -666 -1168 -571 197 -1176 675 -574 353 -314 -523 119
5631 119 57 -31 -722 648 -193 46 -657 940 -485 973 639 209 -192 -204 335 -255 144 984 -194
5650 -194 108 579 -481 449 -15 834 -211 -453 368 103 -230 -316 -70 106 900 158 -742 -1179 -578 187
5670 187 -51 -200 -294 561 708 82 6 956 709 -262 383 -157 -52 306 101 282 42 1006 397 335 451
5691 451 132 1 370 -241 348 -4 1 1065 276 -770 -7 -21 83 821 622 433 200 -564 -533 95 360
5712 360 202 -410 -661 528 261 63 -447 -377 -93 650 -341 350 -253 -79 257 -671 379 257 253 386
5732 386 275 -169 -440 -833 -917 611 -391 302 85 99 -1117 -516 -1296 -935 417 -653 -231 -94 -47
5751 -47 340 -111 -253 -528 -430 -302 -398 40 165 -371 155 -85 417 -103 83 714 334 643 345 475 -365
$$ packed form
5612B24l91P77j248m8q00J924o48q2l74n02N97P68j373J851j249R27o67k09O42
5631A19o2q8o91J370q41K39p03J597j425J458l34m30m01j2N39n90L99Q40j178
5650a94L02M71j060R30m64Q49j045k42Q21k65l33q6K46J76P94p42r00m37O01P65
5670A87k38j49r4Q55J47o26p6R50k47r71O45n40J05L58k05J81k40R64o09o2J16
5691D51l19j31L69o11N89l52NJ064p89j046P63j4J04P38j99j89k33p64L1O28K65
5712C60j58o12k51J189k67j98n10P0K84P43r91O91o03J74L36r28J050j22mJ33
5732C86j11m44k71l93q4J528j002O93k17J4j216O01p80L61J352j070M22J37M7
5751d7L87m51j42k75R8J28r6M38J25n36N26k40N02n20J86O31l80L09k98J30q40
$$ plain form
5772 -365 174 -532 670 296 -710 -623 -281 -439 -52 -694 -468 448 41 -29 671 -231 -565 -407 -283 -533
5792 -533 239 397 473 448 -281 -121 -500 -151 -179 -283 -615 -60 187 328 405 479 -264 597 104 115 -347 -80
5814 -80 -23 1100 -121 244 976 962 18 430 -50 -361 -178 -880 -679 -480 48 -496 -558 -712 702 556
5834 556 477 51 151 155 -754 199 21 -942 596 444 310 -266 129 -139 -2 200 761 -640 703 -347
5854 -347 -33 445 -263 -501 287 583 193 559 -274 226 -883 328 79 434 -398 -89 493 -270 -216 -1056
5874 -1056 -527 633 270 -164 -482 -495 -341 -40 821 -227 452 340 -261 37 -700 -512 -548 -914 283
5893 283 347 -672 -699 777 460 -424 -274 -501 303 596 722 61 232 -186 100 487 -622 -85 -36 1063
5913 1063 112 -181 -408 646 -526 -478 231 -228 0 340 120 251 297 987 -471 -99 -60 -956 -849 -402
$$ packed form
5772c65N39p06J202l74j006Q7L42j58L87o42K26R16m07p0P00r02l34J58J24k50
5792e33P72J58P6k5p29J60l79L49k8j04l32N55K47J41P7P4p43Q61m93J1m62K67
5814h0N7J123j221L65P32j4r44M12m80l11J83p02K01J99N28n44o2j54J414j46
5834E56p9m26J00Mr09R53j78r63J538j52j34n76L95k68J37K02N61j401J343j050
5854c47L14M78p08k38P88K96l90L66q33N00j109J211k49L55q32L09N82p63N4q40
5874a056N29J160l63m34l18j3J54L01Q61j048O79j12o01K98p37J88l6l66J197
5893B83O4j019k7J476l17q84J50k27Q04K93J26o61J71m18K86L87j109N37M9J099
5913A063r51k93k27J054j172M8P09m59K28L40k20J31M6O90j458L72L9q96J07M47
$$ plain form
5933 -402 -232 -408 363 -926 60 19 -620 912 746 -337 -902 -15 459 -238 -230 -128 -315 -256 -307 226 676
5954 676 765 474 326 -513 176 718 -72 -153 238 46 -93 467 339 54 -792 -196 1260 -366 -531 771
5974 771 511 -72 -667 351 -404 -1062 -664 418 -487 105 -252 140 336 -60 926 -200 -135 514 -191
5993 -191 -115 257 -514 248 -209 189 -251 -115 248 723 -44 -160 -63 872 45 136 223 96 292 339 -1130
6014 -1130 -187 -25 -689 -248 -265 -7 351 114 -489 357 -40 -93 223 765 -654 -101 -383 742 150 71
6034 71 -445 59 -146 793 -268 117 -327 9 217 -56 296 -375 385 43 591 157 51 -1091 -81
6053 -81 524 353 299 521 -122 -1121 -576 276 220 672 530 -158 69 -597 -53 384 91 -79 327 387 681
6074 681 23 347 233 -17 240 1015 -398 1146 163 43 354 -346 127 -163 190 189 -628 642 702 -632
$$ packed form
5933d02J70j76P71j289R86m1o39J532j66j083n65Q87M74o97QJ02j87N9n1N33M50
5954F76Q9k91j48q39O89N42p90q1L91j92j39N60j28k85q46N96J456j626j65J302
5974G71k60n83n95J018p55o58L98J082r05N92l57L92J96l96R86j126O5O49p05
5993a91P6L72p71P62m57L98m40J36L63M75p67j16R7R35q27R1Q7j27J96M7j469
6014a130R43J62o64M41j7K58L58k37o03Q46l97n3L16N42j419N53k82J125n92p9
6034G1n16N04k05R39j061L85m44L36K08k73L52o71P60l42N48m34j06j142J010
6053h1O05j71n4K22o43r99N45Q52n6M52j42o88K27o66N44M37k93j70M06O0K94
6074F81o58L24j14k50K57P75j413J544r83j20L11p00M73k90L53jq17J270O0j334
$$ plain form
6094 -632 -55 -148 610 -404 -27 485 -579 -175 93 378 161 -156 645 533 -465 -59 222 484 -237 -387
6114 -387 -121 -1012 320 -639 92 -349 251 1099 7 204 399 921 882 -235 -212 61 -306 -368 102 240
6134 240 -478 132 1039 -308 -52 108 657 -364 -314 742 -204 487 -427 -182 -209 -503 274 423 692 660
6154 660 587 391 109 400 -312 277 463 343 318 -412 610 118 31 -826 173 347 -68 -375 701 -68
6174 -68 -96 -321 -539 400 -425 -737 -361 -135 130 -432 -289 -60 -680 -593 64 157 538 -244 834 -180 -237
6195 -237 336 261 -61 -321 850 -125 769 -779 -255 380 485 173 473 274 -436 25 -158 -287 -629 221
6215 221 652 266 -461 -51 -151 61 879 8 566 258 434 -484 -212 -505 144 17 -455 -276 -265 329
6235 329 -101 158 -49 9 -5 700 26 195 268 565 265 -315 580 912 -805 414 357 465 -111 -146 271
$$ packed form
6094f32N77r3P58j014L77N12j064M04K68K85k17l17Q01j12r98M06K81K62p21j50
6114c87K66q91J332r59P31m41O00Q48j092J97J95N22l9j117K3K73l67o2M70J38
6134B40p18O10R07j347K56J60N49j021N0J056r46O91r14K45k7k94P77J49K69l2
6154F60p3j96k82K91p12N89J86j20k5p30J022m92q7q57R99J74m15l07J076p69
6174f8k8k25k18R39q25l12L76K26K65n62J43K29o20Q7O57R3L81p82J078j014n7
6195b37N73p5l22k60J171r75Q94j548N24O35J05l12L00j99p10M61j83j29l42Q50
6215B21M31l86p27M10j00K12Q18q71N58l08J76r18K72k93O49j27m72J79J1N94
6235C29m30K59k07N8j4P05o74J69P3K97l00n80Q95L32j717J219n7J08n76l5M17
$$ plain form
6256 271 481 -579 -539 282 243 -395 -403 288 169 304 -251 614 106 -190 324 592 -471 -79 345 -837
6276 -837 -562 659 -677 -793 834 943 800 826 1082 -261 204 -796 -488 335 -733 -442 803 -310
6294 -310 463 -791 -507 78 -460 365 -675 -38 -381 -297 478 -124 -235 -18 -87 33 275 174 -480 50
6314 50 -156 192 947 -1132 252 -662 109 227 -154 243 198 -429 21 -422 67 548 -225 414 -980 328
6334 328 139 -256 242 230 -1065 -690 -242 -134 1060 -523 -379 63 19 120 -133 64 187 -67 -331 385
6354 385 -166 297 -33 373 -190 471 375 -213 -15 -246 438 -135 394 -882 -502 492 -597 -110 -168 -303
6374 -303 229 -520 -431 -333 483 245 -775 -633 32 241 -712 -540 850 -517 650 -55 829 330 -727
6393 -727 -6 402 194 -192 868 -384 283 1042 491 156 89 -469 -1154 506 292 -775 162 -246 316
$$ packed form
6256B71K10j060M0Q21l9o38qO91j19J35n55Q65n08k96N14K68j063L92M24j182
6276h37K75J221j336j16J627J09j43K6K56j343M65j000L08Q23j068K91J245j113
6294c10P73j254K84N85n38Q25j040O37l43Q4P75o02j11K17o9J20K42j01o54N30
6314E0k06L48P55k079J384r14P71J18l81L97m5o27M50m43M89M81p73O39j394J308
6334C28j89l95M98j2j295L75M48J08J194j583J44M42m4J01k53J97J23k54k64P16
6354C85n51M63l30M06n63O61r6n88J98k31O84n73N29j276L80R94j089M87n8j35
6374c03N32p49Q9R8Q16k38j020J42O65K09r53J72J390j367J167p05Q84m99j057
6393g27P21M08k08l86J060j252O67P59n51l35o7n58o85J660k14j067R37m08N62
$$ plain form
6412 316 -218 380 36 -639 -367 -448 -210 -152 -632 203 1316 341 849 -1076 357 -226 -1041 22 894
6431 894 -554 -202 -818 854 -404 -89 184 -702 323 417 -67 -437 42 374 -364 25 -623 -3 130
6450 130 -413 186 -140 -160 -314 -188 -110 56 -84 -137 30 165 -213 511 136 -698 -168 -533 735 1027 750
6471 750 422 -485 -85 -97 54 423 -302 -184 1301 -43 -100 322 1032 68 83 955 363 260 1211 459
6491 459 -59 -276 -491 496 12 462 -451 -279 -674 -621 -279 519 383 224 -331 -73 -99 480 1226 -284
6511 -284 -53 389 973 -329 136 -393 688 385 914 -137 176 276 408 926 318 591 -328 286 -93
6530 -93 235 -87 -215 104 -1051 -125 -405 604 420 -784 444 107 -442 -1363 -193 200 -46 -401 282
6549 282 -332 1590 -423 603 1016 -300 219 -755 -13 -345 -308 288 -727 -263 -601 41 412 -441 -233
$$ packed form
6412C16n34N98l44o75K72q1K38N8m80Q35J113r75N08j925J433n83q15J063Q72
6431H94j448L52o16J672j258L15K73q86J025R4m84l70M79L32p38L89o48O20J33
6450A30n43N99l26k0j54J26P8J66j40n3J67J35l78P24l75q34N30l65J268K92k77
6471G50l28r07M00j2J51L69p25J18J485j344n7M22P10r64J5Q72n92j03R51p52
6491D59n18k17k15R87m84M50r13J72l95N3L42P98j36j59n55K58k6N79P46j510
6511b84K31M42N84j302M65n29J081l03N29j051L13J00J32N18o08K73r19O14l79
6530i3L28l22j28L19j155R26k80J009j84j204J228l37n49r21J170L93k46l55O83
6549B82o14J922k013J026M13j316N19r74P42l32L7N96j015M64l38O42L71q53K08
$$ plain form
6568 -233 113 -428 322 39 420 -192 174 -809 77 305 374 -11 -318 -364 -657 -1364 325 -36 162 316
6588 316 163 871 -217 -312 -169 242 -539 -228 -670 -241 -433 420 -251 -581 -616 51 -331 -600 208 827
6608 827 310 -291 -43 -641 -316 -347 -134 216 -200 336 174 -291 257 509 -334 547 -207 -808 273 -13
6628 -13 -474 151 -471 511 601 -360 222 246 193 500 -796 114 -419 583 -225 -620 -398 620 809 -739
6648 -739 700 -32 550 -318 34 182 -403 -1264 200 77 -379 552 809 533 -852 -196 94 -300 -135
6667 -135 -393 -339 146 -581 -192 150 -492 202 118 -50 86 150 240 -332 89 381 531 440 -158 451 513 -49
6689 -49 366 305 662 -163 283 465 380 -183 386 359 -609 150 270 112 377 128 78 326 494 -542 173
6710 173 -185 117 -49 572 339 541 486 237 365 269 -118 -547 928 -613 641 288 217 -148 126 -794
$$ packed form
6568b33L46n41P50k83L81o12L66r83Q86K28O9l85l07m6k93p07J689l61J98J54
6588C16j53P08j088r5J43M11p81L11m42M29j92Q53o71l30l5O67l82k69Q08O19
6608H27n17o01K48n98L25l1K13L50m16N36j62m65N48K52q43Q81p54o01J081k86
6628a3m61O25o22R82R0r61N82K4n3L07j296R10n33J002q08l95K22J018J89j548
6648g39J439p32N82q68L52J48n85q61J464j23m56R31K57k76j385O56K90l94J65
6667a35k58N4M85p27L89L42o42O94q4j68J36O4R0n72M21K92J50r1n98O09O2n62
6689d9M15o1L57q25M46J82q5n63N69k7r68P59J20j58K65k49n0K48J68j036P15
6710A73l58L02j66O21k33K02n5k49J28r6l87m29J475j541J254l53p1l65K74r20
$$ plain form
6730 -794 518 -226 -425 -28 -624 -745 -380 249 90 398 -1143 -170 -229 -436 67 -121 -1214 -211 1194
6749 1194 657 98 -54 -46 85 67 80 1550 -182 19 427 14 -713 -178 176 -133 163 -312 -49 248
6769 248 275 -969 211 -61 -597 -590 -433 1045 -118 -43 -956 -217 -708 228 -444 -1158 -375 -367 301 338 -332
6790 -332 185 445 -532 1394 650 -67 134 230 23 392 253 577 -260 743 498 -63 472 368 -470 473
6810 473 -195 680 323 -32 149 -209 -476 -80 846 -281 -492 -492 -181 385 598 326 25 -784 561 -282
6830 -282 -50 259 -33 130 417 -235 -65 -18 76 339 -117 368 -84 574 -82 492 -77 103 197 -392 -273
6851 -273 -225 376 297 -534 295 106 -18 94 999 -958 -512 -164 192 -867 291 -447 -416 609 692 488
6871 488 -116 -203 111 -422 24 -8 98 392 -93 194 651 774 -313 -278 348 158 123 919 -678 64 -303
$$ packed form
6730g94J312p44j99L97n96j21L65O29j59L08j541R73n9k07N03j88j093J003J405
6749A194n37n59j52QJ31j8J3J470j732K01M08m13p27N35L54l09K96m75K63K97
6769B48K7j244J180k72n36PJ57J478j163P5r13P39m91R36o72p14P83QO68L7o70
6790c32N17K60r77J926p44p17K01R6k07L69j39L24q37J003k45n61N35j04q38R43
6810D73o68Q75l57l55J81l58k67L96R26j127k11%L11N66K13k72l01q09J345q43
6830b82K32L09k92J63K87o52J70M7R4K63m56M85m52O58o56N74n69J80R4n89J19
6851b73M8O01p9q31Q29j89j24J12R05j957M46L48L56j059J158p38L1J025Q3k04
6871D88o04q7L14n33M46l2J06K94m85K87M57J23j087L5O26j90l5P96j597P42l67
$$ plain form
6892 -303 340 -219 -1201 47 -895 115 557 -284 -352 890 -315 -442 365 -46 -652 212 91 750 968
6911 968 544 547 277 34 282 438 -793 805 -546 -95 312 -233 468 -361 -98 -1158 -882 -691 -645 889
6931 889 64 -319 -353 192 -639 723 -214 251 354 456 -492 -546 184 -492 10 798 -123 221 -555 564
6951 564 506 76 -443 -655 175 820 -354 -389 198 -755 -750 -179 204 36 -545 -32 -71 -98 225 645 -793
6972 -793 -332 -997 921 -60 -117 -1122 -455 645 -1028 466 -301 201 142 -89 -102 423 249 -907 -753
6991 -753 -70 -552 827 -532 724 -543 957 53 -244 158 -523 472 -1164 758 -319 -231 238 862
7009 862 179 -801 312 411 -193 -424 928 152 -524 -24 437 -304 160 311 -264 -35 -539 175 -191 177
7029 177 39 -118 -468 721 -491 -584 -115 -220 -345 -208 -962 847 -73 242 -192 161 -477 -513 -509 -1159
$$ packed form
6892c03O43n59r82J248r42J010M42q41o8J242j205j27Q07m11o06Q64j21O59K18
6911I68m24Lk70k43K48J56j231J598j351M51M07n45P01q29K63j060K76J91M6J534
6931H89q25l83l4N45q31J362r37M65J03J02r48n4P30o76N02P88r21L44p76J119
6951E64n8m30n19k12Q30O45j174l5N87r53NN71L83j68n81N13l9k7L23M20j438
6972g93M61o65J918r81n7j005O67J100j673J494p67N02n9k31j3N25j74j156J54
6991g53O83m82J379j359J256j267J500r04k97M02o81R95j636J922j077Q8M69O24
7009H62o83r80J113R9o04k31J352p76o76N00M61p41M64J51n75K29n04P14l66L68
7029A77j38j57l50J189j212r3M69j05j25J37p54J809r20L15m34L53o38l6Mo50
$$ plain form
7049 -1159 178 159 313 -508 -536 -629 -3 -452 -86 -311 73 -576 -400 -929 -6 -809 448 361 41 244
7069 244 -306 -130 790 256 -259 -245 -321 33 447 -348 -232 -846 -79 451 625 68 -76 399 -159 534 -323
7090 -323 -411 -64 -26 -153 -15 431 -51 -400 439 -366 653 357 -552 201 -383 543 494 -163 -164 112 95 213
7112 213 -112 -88 -332 -251 -80 -1009 84 -135 -448 187 105 378 797 538 117 -8 352 168 -233 -56 194
7133 194 -315 1306 -90 114 399 -271 901 472 61 429 76 -757 285 251 138 -141 533 734 231
7152 231 535 318 -173 253 -39 17 262 -82 919 303 27 -222 -118 -84 -420 4 -977 282 -82 -518
7172 -518 85 -162 219 -202 188 -269 108 -198 -93 628 614 444 567 99 -33 -303 -1011 1222 -602 -1692
7192 -1692 200 668 -120 -570 147 -101 362 -98 -152 1461 522 524 133 1002 -391 739 -99 -67 -384 -732
$$ packed form
7049a159J337j9J54q21k8r3O26m49L66k25L84o49J76n29R23q03J257q7l20K03
7069B44n50J76R20n34n15J4p6L54M14p95J16o14P67N30J74n57j44M75n58O93q57
7090c23q8L47L8j27J38M46m82l49Q39q05J019k96r09P53n84R26m9o57jK76j7J18
7112B13l25K4k44Q1J71r29J093k19l13O35q2K73M19k59m21j25L60j84m01J77K50
7133A94n09J621j396K04K85o70J172m29m11L68l53q33J042l4j13k79O74K01n03
7152B31L04k17m91M26k92N6K45l44J001o16k76k49J04L4l36M24r81J259l64m36
7172e18O03k47L81m21L90m57L77l06J05P21j4j70J23m68j32k70p08K233j824j090
7192a692J892M68p88m50P17k48M63m60n4J613r39Kl91Q69j393J130q38L2l17l48
$$ plain form
7212 -732 -1282 858 -132 -8 -427 141 -808 386 452 175 -542 -736 228 -136 1258 722 -420 210 795
7231 795 -367 -122 542 253 -69 444 606 423 -175 401 160 -955 -386 461 -199 146 -371 -105 -236
7250 -236 63 -34 1009 335 112 -663 -355 165 -400 416 -247 53 218 893 -274 485 -32 -105 -490 637
7270 637 -25 -718 755 629 -737 -14 -262 -432 -19 247 -865 360 772 -370 810 -162 -600 98
7288 98 -628 31 -945 175 217 -383 -977 198 -12 255 -378 -302 483 -78 -349 131 163 -438 758 486
7308 486 166 -98 178 392 975 126 -47 407 -27 -125 392 -710 369 -669 -742 2 260 -31 199 -722
7328 -722 -1444 -50 -656 41 -50 -950 -302 -766 225 -60 -479 -228 988 470 289 585 177 -75 346 -617
7348 -617 569 -830 -578 589 -336 288 360 324 86 -206 -127 -174 -264 -118 -218 731 -464 -72 243 -577
$$ packed form
7212g32n50K140r90J24m19N68r49J194O6k77p17j94R64l64J394n36j142O30N85
7231G95j162K45O64k89l22N13J62j83n98N76k41j115N69Q47o60L45n17K66j31
7250b36K99r7J043o74k23p75L08N20n65Q16o63L00J65O75j167P59n17p3l85J127
7270F37o62o93J473j26j366P23k48j70M13K66j112J225M12j142J180r72m38O98
7288I8p26O59r76J120M2o00n94J175k10K67o33P6P85n61k71M80L2o01J196k72
7308D86l20k64K76K14N83q49j73M54m34r8N17j102J079j038p3P44K58k91K30r21
7328g22p22J394o06O97r1r00O48m64R91k85m19K51J216n18j81K96m08k52M21r63
7348f17J186j399K52J167r25O24P2l6k38k92P9m7r0J46j00R49j195L92L15q20
$$ plain form
7368 -577 -17 -834 -833 1030 49 360 -382 -519 53 74 -11 23 -105 -6 308 392 -134 -477 -560 532 475 -127
7390 -127 421 -310 -823 -320 406 576 307 -112 -692 1007 -104 -75 -42 -1091 -479 -1258 -728 -496 446 -533
7410 -533 -734 887 100 576 -243 -105 -428 414 -569 761 330 -405 -29 719 -354 -287 -543 384 -187
7429 -187 -988 -279 -470 204 -63 115 73 -629 -1064 532 34 -73 -421 -318 -62 431 -389 -1477 81
7448 81 -456 -168 -264 -198 -72 272 75 -5 895 -1085 628 413 -858 -659 -346 15 123 -510 180 -96
7468 -96 -696 214 -565 470 -128 -425 99 895 -407 55 -427 329 -205 -268 -772 -795 407 119 13 -760
7488 -760 -526 362 -1302 426 522 -586 -174 24 -471 597 482 181 124 -44 -135 -701 349 -21 480
7507 480 -5 -276 -249 -118 -449 -271 -316 -202 333 -85 127 167 -800 461 -84 -94 424 -800 595 -333
$$ packed form
7368e77N60q17JJ863r81L11p42j37N72K1q5L4j28R9L14Q4n26l43q3J092n7o02
7390a27N48p31n13N03P26J70k69m19n80J699j111K9L3j049O12p79N30K32R42r79
7410e33k01J621p87M76q19J38l23Q42r83J330m31p35L76P48j073O7k56R27n71
7429a87q01P09j91O74k67J78m2p02m35J596m98j07l48J03K56M93q20j088J558
7448H1n37K88r6O6J26L44j97q0R00j980J713k15j271J99L13L61J08o33O90k76
7468i6o00R10p79J035n98k97N24P96j302M62m82P56n34o3n04k3J202k88j06p73
7488g60K34Q88j664J728R6j108M12J98m95J068j15l01n7j68r1n66J050l70N01
7507D80m85k71K7J31l31J78m5J14N35m18K12M0r67J261n45j0N18j224J395r28
$$ plain form
7527 -333 -177 -141 300 396 -269 -200 -60 189 312 635 -322 -426 1035 -469 437 -288 -44 611 344 -434
7547 -434 -901 -280 299 -337 -236 -214 -210 -625 482 427 724 -742 -368 67 -589 -340 -109 999 -56 -1319
7567 -1319 241 18 -145 443 233 -680 585 -687 -231 400 -297 190 382 557 -438 -179 -533 73 -438
7586 -438 -391 -176 123 -161 507 50 776 321 709 -978 -505 114 407 224 -701 226 -407 -87 -401 -414
7606 -414 -231 -498 172 343 565 392 -453 210 389 536 9 489 -116 -231 -670 -72 230 -53 -540 -412
7626 -412 -392 -543 -684 -303 885 -462 -109 -39 123 -177 80 125 -357 344 706 662 953 110 51 -805 710
7647 710 -59 199 234 -490 626 -119 354 408 -309 552 -734 -534 113 -306 -235 -249 268 242 -296 -90 252
7668 252 113 644 264 67 -22 -12 211 70 -5 134 -370 9 354 43 -377 -19 350 20 135 -209 -101
$$ packed form
7527c33J56L6M41R6o65O9J40K49J23L23r57j04J461j504R06p25K44O55k67p78
7547d34m67O21N79o36J01K2Mm15J107n5K97j466L74M35o56K49K31J108j055j263
7567a319J560k23j63N88k10r13J265j272M56O31o97M87J92J75r95K59l54O06n11
7586d38M7K15K99k84O68m57P26m55L88j687M73O19K93j83r25R27o33L20l14j3
7606d14J83k67O70J71K22j73q45O63J79J47n27M80o05j15m39N98L02k83m87J28
7626d12K0j51j41L81J188j347L53P0J62l00K57M5m82P01L62m4K91q43n9q56J515
7647G10p69K58L5p24J116p45M73N4p17Q61j286K00O47m19P1j4N17k6n38K06L42
7668B52j39N31l80j97q9J0K23j41p5J39n04L79L45l11m20L58L69l30J15l44J08
$$ plain form
7689 -101 11 -513 -136 -272 -223 655 62 103 173 376 -147 293 685 38 77 727 211 631 158 569 -110
7710 -110 915 -595 -105 385 729 264 -93 479 394 -34 -153 315 -1 32 883 245 -1460 -461 292 -550
7730 -550 448 -35 819 878 446 72 119 -820 -1264 -694 -177 -160 825 379 479 589 163 201 -229 597 -207
7751 -207 -121 -773 -1033 -343 468 769 1552 909 -391 565 -1116 -1407 430 -562 560 -1039 -147 613 516
7770 516 -200 -1360 -482 180 28 102 -339 135 1 303 -276 141 955 368 -539 56 125 -190 -462 -246
7790 -246 331 -826 -661 -364 387 779 219 336 39 -462 40 -415 -302 125 -309 -100 102 -196 509 -48
7810 -48 407 347 -612 117 789 42 173 55 311 -356 763 -510 203 417 -484 478 -213 80 326 560
7830 560 433 271 -1079 154 157 162 312 -937 57 -1088 333 497 -46 -643 508 444 -98 -5 -340 -722
$$ packed form
7689a01J12n24L77j36M9Q78n93M1P0K03n23M40L92o47L9O50n16M20m73M11o79
7710a10J025j510M90M90L44m65l57N72q5m28j19M68l16L3Q51o38j705R99P53q42
7730e50R98m83Q54N9m32l74M7r39m44N70N17J7R85m46J00J10m26L8m30Q26q04
7751b07Q6o52k60O90Q11L01P83o43j300R56j681k91J837r92J122j599Q92P60r7
7770E16p16j160Q78O62j52P4m41M74j34L02n79M17Q14n87r07N95O9l15k72K16
7790b46N77j157J65K97P51L92n60J17k97n01N02m55J13M27m34K09K02k98P05n57
7810d8M55o0r59P29O72p47J31j18K56o67J119j273P13K14r01R62o91K93K46K34
7830E60j27j62j350J233LNJ50j249R94j145J421J64n43n97J151o4n42R3l35l82
$$ plain form
7850 -722 -130 435 1188 -56 -88 -226 404 844 71 -58 -64 -278 101 955 -82 258 207 -1079 321 57
7870 57 175 509 -346 -231 506 32 48 -86 385 -72 -15 -934 -394 -325 154 -245 -827 392 782 -401 -312
7891 -312 -136 -1144 -348 149 190 -168 -512 344 -253 52 -687 -352 -222 -232 -185 -326 -244 -545 -1069 -254 62
7912 62 -86 -367 -743 495 -117 272 336 462 263 568 -369 -70 -916 217 -194 558 45 -182 -266 -600
7932 -600 -596 -1064 30 390 -320 43 -478 -57 -366 363 985 -59 354 424 -34 359 -18 58 365 38 593
7953 593 -80 47 -460 -963 -256 736 122 102 -374 -55 -279 -491 621 -532 -138 -477 -249 -380 -100 -506
7973 -506 -136 385 81 490 623 -219 445 -508 495 -833 -742 -133 52 -32 1757 90 32 -290 -319 195
7993 195 -179 -168 -277 -285 -95 206 179 493 -173 -523 -403 -266 75 -65 -142 137 -130 139 435 434 139 348
$$ packed form
7850g22N92N65P53j244l2j38O30M40p73j29ok14L79Q54j037L40n1j286J400k64
7870E7J18L34q55J15P37m74J6j34M71m57N7r19N40O9M79l99n82J219L90j183Q9
7891c12J76j008P96M97M1l58l44Q56n97L05p39L35J30j0M7j41Q2l01n24Q15L16
7912F2j48k81l76J238o12L89O4J26j99L05r37K99q46J133m11P52n13k27q4l34
7932f00Mm68J094L60p10L63n21M21l09P29O22j044M13P0m58L93l77P6L07l27N55
7953E93o73J27n07n03P07R92o14k0m76L19k24k12J112j153L94l39K28j31K80m06
7973e06L70N21l04M09J33q42O64r53J003j328R1O09J85q4J789j667n8l22k9N14
7993A95l74J1j09qJ90L01k7L14o66l50J20J37L41j40p7K79k67K69K96jk95K09
$$ plain form
8015 348 -270 411 469 772 1016 -127 -389 112 410 529 -15 -456 359 84 -144 33 -153 -502 39 212
8035 212 -92 -99 -679 -239 110 -96 -234 -473 -1019 142 759 721 -90 400 -30 -353 -672 -112 -725 -245 76
8056 76 221 721 299 235 81 11 -353 450 -11 4 693 139 -620 711 375 85 -674 289 -137 228 -71
8077 -71 -1318 -1544 -136 42 -206 -190 53 -94 307 -42 -38 45 104 510 303 -478 243 278 304 576 -320 -792
8099 -792 1196 -599 418 -356 729 562 14 -21 290 143 7 420 -55 548 -342 256 -33 -55 440
8118 440 515 -221 165 -181 -28 103 48 450 -86 268 750 -283 222 244 -157 -62 -273 -600 -164 -263 664
8139 664 -71 95 535 -333 230 -242 179 495 -124 -87 49 253 187 262 -1100 -299 -448 0 -988 -604 -306
8160 -306 277 238 -186 47 -398 177 250 -140 79 736 -437 253 1014 44 -493 102 378 -498 -222 464
$$ packed form
8015C48o18O81N8L03K44j143k62N01K98J19n44m41Q15k75k28J77j86l49N41J73
8035B12l04pn80M40L49k06j38k39n46J161O17l8q11M90m30l23l19N60o13M80L21
8056G6J45N00m22o4j54p0l64Q03m61J5O89n54p59J331l36k90p59R63m26L65k99
8077g1j247k26J408J78k48J6K43j47M01l49MQ3N9M06k07p81P21L5K6K72q96m72
8099g92J988j795J017p74J085j67n48l5L11j47j36M13m75O03q90N98k89k2M95
8118D40P5p36L86l46J53J31n5M02n36L54M82j033N05K2m01R5k11l27M36r9R27
8139F64p35J66M40q68N63m72M21L16o19L7J36K04o6P5j362Q01j49M48r88L84K98
8160c06N83l9m24K33m45N75P3l90K19O57j173O90P61r70n37N95K76q76K76O86
$$ plain form
8180 464 -10 803 -777 -1011 509 160 320 722 70 -647 265
$$ packed form
8180D64m74Q13j580k34J520l49J60M02o52p17R12
8191B65
$$ Imaginary data points
##PAGE= N=2
##DATA TABLE= (X++(I..I)), XYDATA
$$ plain form
0 0 0 0 0 0 0 0 0 0 0 0 0 108 -108 108 -108 216 -216 216 -324 345 -432 540 -648 756 -864 1008 -1188
27 -1188 1404 -1609 1834 -2055 2375 -2694 3027 -3426 3849 -4320 4842 -5410 6024 -6706 7448
42 7448 -8255 9141 -10109 11160 -12316 13575 -14962 16481 -18153 19998 -22050 24336
54 24336 -26893 29788 -33081 36877 -41303 46527 -52815 60572 -70378 83232 -100921
65 -100921 126840 -168603 246821 -443763 2017963 2701288 -1181839 640683 1409120 1352294
75 1352294 1230481 -152815 -209971 1574747 320097 -320100 562160 -159834 -115023 1060769
85 1060769 -378880 -880929 644945 460508 -94345 14094 -546814 464668 1095456
94 1095456 -558259 -345247 972956 -35929 26862 804242 -163588 1108 720545 -59413
$$ packed form
0@%%%%%%%%%%%J08k16K16k16L24m32M32n40O69p77R72j188J404j620J872k196
27a188K592l013L443l889M430n069N721o453P275q169R162j0252J1434j2730J4154
42G448j5703J7396j9250K1269k3476K5891k8537L1443l4634L8151m2048M6386
54B4336n1229N6681o2869O9958p8180Q7830r9342J13387j30950J53610j84153
65a00921K27761k95443M15424o90584K461726O83325l883127J822522P68437n6826
75A352294j21813j383296n7156J784718j254650o40197Q82260p21994M4811J175792
85A060769j439649n02049J525874j84437n54853J08439n60908J011482O30788
94A095456j653715K13012J318203j008885O2791P77380r67830J64696P19437p79958
$$ plain form
104 -59413 183873 612530 -227299 166853 675594 -132897 -49568 298616 60370 289949
114 289949 84674 -536471 75816 462672 -250529 -400699 -188117 -76789 173540 -236647
124 -236647 -639731 40982 123146 -303675 116312 6998 -393925 257677 526963 -109203
134 -109203 -122794 342245 535371 313209 -143936 64240 601788 369554 -133733 -25066
144 -25066 206148 69341 -103537 -52573 -83410 -388860 -249251 168856 -147865 -731827
154 -731827 -375115 300740 22398 -536460 -347966 175916 218229 -91183 -214112 5181
164 5181 274923 283595 54449 -183195 -2669 332970 305232 -56444 -374814 -58298 492943
175 492943 111221 -630887 -272497 346257 140440 -293790 -393499 -115562 222713 89670
$$ packed form
104e9413K43286M28657q39829L94152N08741q08491Q3329L48184k38246K29579
114B89949k05275o21145O12287L86856p13201j50170K12582J11328K50329m10187
124b36647m03084O80713Q2164m26821M19987j09314m00923O51602K69286o36166
134a09203j3591M65039J93126k22162m57145K08176N37548k32234n03287J08667
144b5066K31214j36807j72878N0964l0837l05450J39609M18107l16721n83962
154g31827L56712O75855k78342n58858J88494N23882M2313l09412j22929K19293
164E181K69742Q672k29146k37644J80526L35639k7738l61676l18370L16516N51241
175D92943l81722p42108L58390O18754k05817m34230r9709K77937L38275j33043
$$ plain form
185 89670 -347402 -294386 106910 213557 -88348 -347074 -133363 165241 93732 -166695
195 -166695 -236969 -113753 90042 80302 -201335 -199479 53227 93780 531 -35172 -126406
206 -126406 29981 280607 59275 -140966 50149 153248 36434 27073 16024 -74666 -49842
217 -49842 64797 19978 -235464 -242894 13247 77779 -148246 -308071 -169211 82199 85473
228 85473 -207951 -218267 96289 181581 -13924 -70604 -4680 48781 209639 163320 -137327
239 -137327 -137055 204593 213935 -123627 -229682 -20107 155225 12475 -225678 -253092 -23686
250 -23686 119702 -71882 -258419 -140296 42897 19879 -55867 -159671 -149673 75167 143308
261 143308 -133658 -282512 -30371 113588 -33000 -185608 -207480 -103083 47608 -43670
$$ packed form
185H9670m37072N3016M01296J06647l01905k58726K13711K98604p1509k60427
195a66695p0274J23216K03795r740k81637J856K52706M0553r3249l5703r1234
206a26406J56387K50626k21332k00241J91115J03099j16814r361j1049r0690K4824
217d9842J14639m4819k55442p430K56141O4532k26025j59825J38860K51410L274
228H5473k93424j0316L14556Q5292j95505n6680O5924N3461J60858m6319l00647
239a37327K72L41648R342l37562j06055K09575J75332j42750k38153k7414K29406
250b3686J43388j91584j86537J18123J83193k3018p5746j03804R998K24840O8141
261A43308k76966j48854K52141J43959j46588j52608k1872J04397J50691r1278
$$ plain form
271 -43670 -305857 -229774 24647 40994 -143538 -230991 -123165 41465 83492 -76648 -188086
282 -188086 -36061 187856 70735 -164183 -101397 81705 128612 19662 -129941 -155780
292 -155780 63516 152617 -85374 -201901 -12508 101243 21563 -43660 -117283 -25076 188821
303 188821 126710 -107216 -82789 126872 158258 32444 -69745 -32611 62009 94573 -16055
314 -16055 -176376 -112288 56107 32399 -137065 -182083 -101727 11451 39996 -123373 -195568
325 -195568 22235 176709 -19457 -133914 880 93923 116411 70893 -66700 -73718 117944
336 117944 126433 -67857 -154298 -38632 75579 -6235 -159584 -207977 -71258 58819 -39752
347 -39752 -230997 -164576 42582 30639 -87739 -118571 -54108 60010 130004 -17994 -143964
$$ packed form
271d3670k62187P6083K54421J6347j84532q7453J07826J64630M2027j60140j11438
282a88086J52025K23917j17121k34918O2786J83102M6907j08950j49603k5839
292a55780K19296Q9101k37991j16527J89393J13751p9680o5223p3623R2207K13897
303A88821o2111k33926K4427K09661L1386j25814j02189L7134R4620L2564j10628
314a6055j60321O4088J68395k3708j69464m5018Q0356J13178K8545j63369p2195
325a95568K17803J54474j96166j14457J34794R3043K2488m5518j37593p018J91662
336A17944Q489j94290q6441J15666J14211q1814j53349m8393J36719J30077r8571
347c9752j91245O6421K07158j1943j18378l0832O4463J14118O9994j47998j25970
$$ plain form
358 -143964 44561 189678 71259 -28193 4284 51722 143853 118272 -55270 -45325 138318
369 138318 186800 16439 -86615 13072 142779 103751 -18188 -65060 1940 114344 44895
380 44895 -105049 -84440 23769 27104 -15928 -73796 -157783 -47789 113581 -19701 -204622
391 -204622 -47138 127107 46016 -43634 -39987 56323 160660 143315 34380 27986 130081
402 130081 196058 153506 56047 40902 105761 184527 102150 -91553 -61197 135434 96817
413 96817 -128772 -140271 -24012 -2659 -43127 -95622 -149733 -67085 70929 -17636 -134930
424 -134930 -66092 55204 92162 43867 -47241 -19529 134281 150668 12626 -45202 88703
435 88703 165087 71295 -4382 -7612 49269 130631 98127 -53717 -34003 113097 109680 -2250
$$ packed form
358a43964J88525J45117j18419r9452L2477M7438R2131k5581j73542R945J83643
369A38318M8482j70361j03054R9687J29707l9028j21939m6872O7000J12404o9449
380D4895j49944K0609J08209L335m3032n7868q3987J09994J61370j33282j84921
391b04622J57484J74245q1091q9650L647R6310J04337j7345j08935o394J02095
402A30081O5977m2552r7459j5145O4859P8766q2377j93703L0356J96631l8617
413I6817k25589j1499J16259K1353m0468n2495n4111Q2648J38014q8565j17294
424a34930O8838J21296L6958m8295r1108K7712J53810J6387j38042n7828J33905
435H8703P6384r3792p5677l230N6881Q1362l2504j51844J9714J47100l417j11930
$$ plain form
447 -2250 -19273 35337 56981 99377 38940 -82618 -16714 118323 58025 -68330 -68705 -9346
459 -9346 48019 991 -106047 -105683 14949 59476 -59651 -113352 -30531 27942 21162 13368
471 13368 -41836 -48805 78908 103562 -32145 -85633 52713 113424 15790 -61119 -61857 6100
483 6100 68166 -14612 -136444 -67606 21160 -15634 -81851 -113798 -86270 -14081 22489 -89213
495 -89213 -172118 -53288 58654 -43979 -145951 -84754 -13916 797 -58325 -127131 -102119
506 -102119 10517 26965 -89761 -115593 -22474 24230 6232 -13181 -48445 11654 117724
517 117724 69629 -17244 25043 125292 131244 85172 50070 51251 103670 145689 70510 -21927
529 -21927 48014 112188 55608 -18647 -32638 -4659 38003 39813 -50637 -88880 7508 62683
$$ packed form
447b250j7023N4610K1644M2396o0437j21558O5904J35037o0298j26355l75N9359
459i346N7365m7028j07038L64J20632M4527j19127n3701Q2821N8473o780p794
471A3368n5204o969J27713K4654j35707n3488J38346O0711r7634p6909p38O7957
483F100O2066q2778j21832O8838Q8766l6794o6217l1947K7528P2189L6570j11702
495h9213q2905J18830J11942j02633j01972O1197P0838J4713n9122o8806K5012
506a02119J12636J6448j16726k5832R3119M6704j7998j9413l5264O0099J06070
517A17724m8095q6873M2287J00249N952m6072l5102J181N2419M2019p5179r2437
529b1927O9941O4174n6580p4255j3991K7979M2662J810r0450l8243R6388N5175
$$ plain form
541 62683 -21362 -60183 -13407 25302 65810 23521 -58810 -22368 89842 73939 -33126 -45235
553 -45235 14379 39124 10803 -36940 -84762 -26979 44640 -25573 -118561 -84305 1133 -1163
565 -1163 -47521 -84264 -71611 4976 40753 -52188 -107449 4991 66045 5538 -48036 -45808
577 -45808 292 61292 34524 -61997 -45370 54572 64347 -24273 -46806 -1067 48680 65681
589 65681 -4330 -64819 -2099 92089 43027 -55700 -37831 35964 43737 -5855 -56034 -70838
601 -70838 14966 51954 -54245 -110889 -31009 23288 -16056 -52585 -62769 -20776 37225 18408
613 18408 -58205 -45853 50315 58134 6710 -18039 -3730 26683 55612 15098 -53535 -13912
625 -13912 50217 10407 -64074 -48128 -24545 -16617 -7739 -52517 -88480 -42703 11703 -25175
$$ packed form
541F2683q4045l8821M6776L8709M0508m2289q2331L6442J12210j5903j07065j2109
553d5235N9614K4745k8321m7743m7822N7783P1619p0213r2988L4256Q5438k296
565a163m6358l6743J2653P6587L5777r2941n5261J12440O1054o0507n3574K228
577d5808M6100O1000k6768r6521J6627R9942R775q8620k2533M5739M9747J7001
589F5681p0011o0489O2720R4188m9062r8727J7869P3795P773m9592n0179j4804
601g0838Q5804L6988j06199n6644P9880N4297l9344l6529j0184M1993N8001j8817
613A8408p6613J2352R6168P819n1424k4749J4309L0413K8929m0514o8633L9623
625a3912O4129l9810p4481J5946K3583P928Q878m4778l5963M5777N4406l6878
$$ plain form
637 -25175 -68507 -53416 -3727 22980 -1234 -50820 -47634 41810 59704 -23904 -50429 15408
649 15408 34742 4348 -8875 -38662 -24669 40496 25876 -70118 -65380 13966 28248 -9685
661 -9685 -58028 -47363 19306 42256 -25578 -65620 -4510 55569 22751 -43756 -32268 3938
673 3938 28802 28037 -33949 -63001 17356 60044 -27635 -63144 -11103 28386 32757 -750 -54901
686 -54901 -18084 72100 41391 -30225 -19894 35829 56353 19353 -25234 -17472 34389 48760
698 48760 5527 -53223 -26933 31849 15123 -28969 -40432 -27405 11155 36844 -40300 -75700
710 -75700 18905 60281 -11118 -43019 -5829 17898 33387 4122 -36143 -9162 32609 20471
722 20471 -22850 -36748 -19435 16676 14378 -23608 -56726 -27157 37551 4914 -58607 -28864
$$ packed form
637b5175m3332J5091M9689K6707k4214m9586L186Q9444J7894q3608k6525O5837
649A5408J9334l0394j3223k9787J3993O5165j4620r5994M738P9346J4282l7933
661i685m8343J0665O6669K2950o7834m0042O1110O0079l2818o6507J1488L6206
673C938K4864p65o1986k9052Q0357M2688q7679l5509N2041L9489M371l3507n4151
686e4901L6817R0184l0709p1616J0331N5723K0524l7000m4587P762N1861J4371
698D8760m3233n8750K6290N8782j6726m4092j1463J3027L8560K5689p7144l5400
710g5700R4605M1376p1399l1901L7190K3727J5489k9265m0265K6981M1771j2138
722B0471m3321j3898J7313L6111k298l7986l3118K9569O4708l2637o3521K9743
$$ plain form
734 -28864 32338 14759 -8886 -11107 -17755 18473 50717 9987 -30114 8893 38182 29694 10200
747 10200 -19111 -65 53155 44420 -26446 -27642 34253 54804 14395 -16305 3388 27920
759 27920 45609 20449 -23082 -3754 62451 47461 -18995 -17340 15581 34877 29376 -5500
771 -5500 -39016 5433 52573 2566 -44098 -14359 29179 28157 3855 -31176 -18551 43374
783 43374 44558 -12677 -26838 23753 43020 16674 -9633 -18761 3009 41278 22761 -51113
795 -51113 -44802 19530 21009 -34040 -52126 -25437 1410 9025 -33812 -58877 -9890 40326 4762
808 4762 -31187 -11699 15528 40636 34246 -4628 -9437 53194 70045 8416 -16452 24158 53872
821 53872 35225 7248 -15417 2430 39606 23884 -26105 -27539 18866 22415 -3958 -26309
$$ packed form
734b8864O1202j7579k3645k221o648L6228L2244m0730m0101L9007K9289q488j9494
747A0200k9311J9046N3220q735p0866j196O1895K0551m0409l0700J9693K4532
759B7920J7689k5160m3531J9328O6205j4990o6456J655L2921J9296n501l4876
771e500l3516M4449M7140n0007m6664K9739M3538j022k4302l5031J2625O1925
783D3374J184n7235j4161N0591J9267k6346k6307r128K1770L8269j8517p3874
795e1113O311O4332J479n5049j8086K6689K6847P615m2837k5065M8987N0216l5564
808D762l5949J9488K7227K5108o390l8874m809O2631J6851o1629k4868M0610K9714
821E3872j8647k7977k2665J7847L7176j5722m9989j434M6405L549k6373k2351
$$ plain form
833 -26309 -26453 2886 35461 3336 -46942 -11001 36101 17735 -13211 -11999 4505 31693 35986
846 35986 -10347 -24476 24734 55083 16711 -11565 4094 26140 41560 18471 -18589 -8692
858 -8692 41383 36881 -17963 -34034 -121 19955 3145 -20548 -43292 -17389 19354 -9279
870 -9279 -56021 -34714 9809 5873 -15227 -34419 -26955 11999 34020 -5769 -34543 7829 39036
883 39036 19309 -8418 -10054 10559 38003 26414 -22037 -27189 20517 34813 -10477 -30338
895 -30338 -9617 9830 18582 -8637 -38519 -13649 40157 22017 -22469 -18505 16967 35453
907 35453 23591 278 -10087 31427 55769 16106 -21520 10110 45854 33327 3175 -16937
919 -16937 -667 30373 26942 -21683 -33424 14012 26950 -5821 -28518 -19898 812 22900
$$ packed form
833b6309j44K9339L2575l2125n0278L5941M7102j8366l0946J212J6504K7188M293
846C5986m6333j4129M9210L0349l8372k8276J5659K2046J5420k3089l7060R897
858h692N0075m502n4844j6071L3913K0076j6810k3693k2744K5903L6743k8633
870i279m6742K1307M4523l936k1100j9192P464L8954K2021l9789k8774M2372L1207
883C9036j9727k7727j636K0613K7444j1589m8451n152M7706J4296m5290j9861
895c0338K0721J9447Q752k7219k9882K4870N3806j8140m4486L964L5472J8486
907C5453j1862k3313j0365M1514K4342l9663l7626L1630L5744j2527l0152k0112
919a6937J6270L1040l431m8625j1741M7436J2938l2771k2697Q620K0710K2088
$$ plain form
931 22900 208 -38660 -20212 19451 16803 -22646 -25687 -4482 12770 12700 -20393 -39444 -5408
944 -5408 29187 -3873 -36420 -23133 3949 6502 -10501 -28054 -29082 7245 17161 -21702 -43997
957 -43997 -11330 13930 3929 -18470 -33254 -8455 23054 9079 -32448 -20447 25622 26697
969 26697 -694 -9455 1869 20438 39922 17529 -10488 12007 44586 34807 835 766 19210
982 19210 37068 30086 -8496 -20297 19408 37631 -649 -22679 -7838 13521 13204 -4196 -25820
995 -25820 -17897 23500 23070 -19431 -28888 8457 24003 11115 -11918 -18955 11593 31493 5908
1008 5908 -31169 -11987 24304 16434 -13482 -25758 -15094 5535 12553 -24772 -39604 -7420
1020 -7420 14852 -8526 -34787 -25408 -3820 14043 3618 -30580 -26349 19490 25398 -14885 -21963
$$ packed form
931B2900k2692l8868J8448L9663k648l9449l041K1205J7252p0l3093j9051L4036
944e408L4595l3060l2547J3287K7082K553j7003j7553j028L6327R916l8863k2295
957d3997L2667K5260j0001k2399j4784K4799L1509j3975m1527J2001M6069J075
969B6697k7391q761J1324J8569J9484k2393k8017K2495L2579r779l3972o9J8444
982A9210J7858o982l8582j1801L9705J8223l8280k2030J4841K1359l17j7400k1624
995b5820P923M1397m30m2501r457L7345J5546j2888k3033p037L0548J9900k5585
1008E908l7077J9182L6291p870k9916j2276J0664K0629P018l7325j4832L2184
1020g420K2272k3378k6261R379K1588J7863j0425l4198M231M5839N908m0283p078
$$ plain form
1033 -21963 2223 25294 17048 -8066 -19403 3863 33569 14941 -18214 -11460 18497 19725
1045 19725 6142 -14096 -12638 19144 28651 -4072 -29400 355 27770 12163 -10630 -13632
1057 -13632 -1495 17956 16413 -17680 -20257 11888 24700 324 -20955 -10466 11243 24154
1069 24154 3063 -23662 -6740 30456 17616 -16587 -13089 8568 22486 11448 -10804 -20402
1081 -20402 4724 25960 2406 -26715 -13226 13532 8588 -8601 -25538 -16063 15353 15211 -18882
1094 -18882 -33151 -735 18105 2408 -18677 -17448 81 19398 6481 -27974 -16246 16987
1106 16987 19209 -10658 -24015 -9283 11013 13405 -11055 -27699 -5616 24457 3826 -25822
1118 -25822 -17237 7052 19286 3193 -18561 -16499 14127 22750 -6443 -20689 1389 20902
$$ packed form
1033b1963K4186K3071q246k5114j1337K3266K9706j8628l3155O754K9957J228
1045A9725j3583k0238J458L1782R507l2723k5328K9755K7415j5607k2793l002
1057a3632J2137J9451j543l4093k577L2145J2812k4376k1279J0489K1709J2911
1069B4154k1091k6725J6922L7196j2840l4203L498K1657J3918j1038k2252r598
1081b0402K5126K1236k3554k9121J3489K6758m944j7189j6937R475L1416j42l4093
1094a8882j4269L2416J8840j5697k1085J229J7529J9317j2917l4455J1728L3233
1106A6987K222k9867j3357J4732K0296K392k4460j6644K2083L0073k0631k9648
1118b5822Q585K4289J2234j6093k1754K062L0626Q623k9193j4246K2078J9513
$$ plain form
1130 20902 11219 -5221 -17364 -1467 26504 16484 -17533 -16932 15603 22190 2178 -14086 -4983
1143 -4983 15079 24228 3369 -22465 -339 26444 17559 -8869 -12560 3158 17458 12508 -14262
1156 -14262 -19465 7295 23938 -4360 -25401 -11646 7164 10634 -3663 -22273 -14399 15505
1168 15505 11126 -17229 -21419 2902 15735 4158 -11539 -19044 1295 20117 1189 -24494
1180 -24494 -14583 10447 8698 -9972 -24163 -12341 7378 11695 -15926 -30258 -4796 15483
1192 15483 1974 -18471 -12977 3111 15288 5797 -16550 -10406 17867 25129 -1738 -12576 2225
1205 2225 19016 19535 1741 -12285 2616 27460 13673 -13494 -12604 12595 19575 3760 -11866
1218 -11866 -12772 9972 17474 -5204 -22077 -2977 15353 6610 -10721 -18120 -4025 15316 10892
$$ packed form
1130B0902r683j6440j2143J5897K7971j0020l4017O01L2535O587k0012j6264R103
1143d983K0062R149k0859k5834K2126K6783q885k6428l691J5718J4300m950k6770
1156a4262n203K6760J6643k8298k1041J3755J8810L470j4297j8610P874K9904
1168A5505m379k8355m190K4321J2833j1577j5697p505K0339J8822j8928k5683
1180b4494R911K5030j749j8670j4191J1822J9719M317k7621j4332K5462K0279
1192A5483j3509k0445N494J6088J2177r491k2347O144K8273P262k6867j0838J4801
1205B225J6791N19j7794j4026J4901K4844j3787k7167Q90K5199O980j5815j5626
1218a1866r06K2744P502k2678j6873J9100J8330q743j7331p399J4095J9341m424
$$ plain form
1231 10892 -16064 -19575 8391 17946 -1604 -16371 -5559 10575 16203 -2521 -19556 -6790
1243 -6790 16534 11655 -13738 -16505 -2257 7877 1368 -17262 -23491 -3372 11999 -8388 -27584
1256 -27584 -17909 2096 3534 -9769 -20682 -14939 7243 9567 -12217 -20272 2724 17363 6660
1269 6660 -7937 -8988 6565 20463 9979 -11826 -6302 16525 18283 -2166 -12358 -284 14286
1282 14286 16312 -5186 -16518 1773 20259 7956 -11896 -5880 8978 16092 7633 -6085 -6302
1295 -6302 14912 24924 2546 -10625 2060 19073 14833 581 -8961 2099 19531 9725 -12578
1308 -12578 -13232 8244 13290 -887 -13416 -13228 2103 10350 -3753 -23089 -10272 11112 7280
1321 7280 -13279 -17259 -1262 11820 8763 -11537 -13757 7014 18117 1089 -13036 -2714 10060
$$ packed form
1231A0892k6956l511K7966R555j9550j4767J0812J6134N628j8724j7035J2766
1243f790K3324m879k5393k767J4248J0134o509j8630o229K0119J5371k0387j9196
1256b7584R675K0005J438j3303j0913N743K2182K324k1784q055K2996J4639j0703
1269F660j4597j051J5553J3898j0484k1805N524K2827J758k0449j0192J2074J4570
1282A4286K026k1498j1332J8291J8486j2303j9852O016J4858P114q459j3718k17
1295f302K1214J0012k2378j3171J2685J7013m240j4252r542J1060J7432r806k2303
1308a2578o54K1476N046j4177j2529J88J5331Q247j4103j9336J2817K1384l832
1321G280k0559l980J5997J3082l057k0300k220K0771J1103j7028j4125J0322J2774
$$ plain form
1334 10060 13545 865 -11827 -6261 13662 13757 -8766 -13915 648 10955 2952 -9853 -14494
1347 -14494 587 12698 -321 -18045 -10110 9524 10474 -2823 -10654 -2700 13693 15102 -384
1360 -384 -8939 9544 22628 14503 -927 406 11843 21023 15916 -4663 -1789 16282 19050 -949
1374 -949 -9556 1089 11966 9208 -5157 -13827 -4753 11851 5048 -12809 -11917 659 9125 250
1388 250 -12032 -12402 4889 13287 -3860 -17666 -5602 10598 3926 -7956 -12833 -4201 7811
1401 7811 3843 -14499 -17208 730 8821 -3396 -16587 -11072 393 5911 -3294 -16796 -5952
1414 -5952 9606 7600 -8483 -11333 1374 13146 8617 -4868 -7947 4303 17952 4824 -9864
1427 -9864 -1925 11704 12644 1707 -7460 -3198 11838 12487 -3939 -11576 1869 11594 2993 -7444
$$ packed form
1334A0060L485j2680j2692N566J9923R5k2523n149J4563J0307q003j2805m641
1347a4494J5081J2111j3019j7724P935J9634R50j3297p831P954J6393J409j5486
1360c84q555J8483J3084q125j5430J333J1437R180n107k0579K874J8071K768j9999
1374i49q607J0645J0877k758j4365q670R074J6604o803j7857Q92J2576Q466q875
1388B50j2282l70J7291Q398j7147j3806J2064J6200o672j1882m877Q632J2012
1401G811l968j8342k709J7938Q091j2217j3191N515J1465N518r205j3502J0844
1414e952J5558k006j6083k850J2707J1772m529j3485l079J2250J3649j3128j4688
1427i864P939J3629R40j0937r167M262J5036O49j6426p637J3445R725q601j0437
$$ plain form
1441 -7444 -9347 2125 11080 2618 -12499 -9229 7628 9635 -1891 -11235 -2482 7561 8734 -2481
1455 -2481 -12237 584 13257 5196 -10551 -8207 2752 9518 1328 -11051 -10009 1998 7053
1468 7053 -9188 -17583 -8368 2145 315 -10596 -18228 -9771 2804 -2128 -14537 -16220 -2355
1481 -2355 4159 -6549 -12448 -9795 1818 8168 -1930 -13379 -5158 8633 6122 -3978 -9685
1494 -9685 542 7455 5317 -6263 -10809 2977 11356 488 -11230 -5225 4690 7805 -1936 -10992
1508 -10992 -4443 7773 7172 -6984 -10632 710 8452 3943 -4871 -8044 774 9925 1258 -7934
1522 -7934 -5597 6722 7542 -1853 -7351 -3162 7380 8606 -2431 -10732 598 8803 4161 -6595
1536 -6595 -8732 1378 7783 1024 -10625 -10009 2570 6088 -5481 -12501 -7283 -64 806 -6490
$$ packed form
1441g444j903J1472Q955q462j5117L270J6857K007j1526r344Q753J0043J173j1215
1455b481r756J2821J2673q061j5747K344J0959O766q190j2379J042J2007N055
1468G053j6241q395R215J0513j830j0911p632Q457J2575m932j2409j683J3865
1481b355O514j0708n899K653J1613O350j0098j1449Q221J3791k511j0100n707
1494i685J0227O913k138j1580m546J3786Q379j0868j1718O005R915L115r741r056
1508a0992O549J2216o01j4156l648J1342P742m509q814l173Q818R151q667r192
1522g934K337J2319Q20r395n498M189J0542J226j1037q301J1330Q205m642j0756
1536f595k137J0110O405o759j1649O16J2579L518j1569p020N218P219Q70p296
$$ plain form
1550 -6490 -13569 -5604 5395 2428 -11383 -11524 321 6446 428 -6829 -6698 2681 9718 -202 -8135
1565 -8135 -1910 8097 7376 -2034 -6149 -671 8999 7208 -4026 -7752 4157 9062 1932 -5080
1579 -5080 -3573 6035 9008 2493 -6636 -2362 9297 8286 -1421 -4431 2721 8553 6883 -1321 -4020
1594 -4020 5267 12124 6428 -3944 -1566 7110 10336 3209 -3214 -1402 8504 9711 -1963 -6207
1608 -6207 1372 9099 4761 -4436 -6834 514 6004 1147 -7911 -6727 3917 5629 -2756 -8516 -6081
1623 -6081 3895 5587 -3163 -9046 -1556 5449 3024 -6056 -5874 1492 5030 2715 -6358 -6945 1648
1638 1648 7640 -1268 -7837 -4485 2899 4524 -3758 -6793 -1526 6824 7035 -3710 -4185 4073 10317
1653 10317 4753 -4 91 7094 11757 6255 -1516 2214 11891 10785 2631 -963 4945 9851 8677
$$ packed form
1550f490p079P965J0999k967j3811j41J1845O125o018p257J31R379P037r920p933
1565h135O225J0007p21r410m115N478R670j791j1234l726J1909M905p130p012
1579e080J507R608K973o515r129M274J1659j011r707l010P152N832j670q204k699
1594d020R287O857n696j0372K378Q676L226p127o423J812R906J207j1674m244
1608f207P579P727m338r197k398P348N490m857r058J184J0644J712q385n760K435
1623f081R976J692q750n883P490P005k425r080J82P366L538k315r073n87Q593
1638A648N992q908o569L352P384J625q282l035N267Q350K11j0745m75Q258O244
1653A0317n564m757R5P003M663n502p771L730R677j106q154l594N908M906j174
$$ plain form
1668 8677 525 -2714 4287 9346 4575 -4478 -2707 4381 6782 1680 -5551 -2760 4640 7424 -833
1683 -833 -5676 624 5900 4337 -1665 -4552 1729 8716 4207 -4567 -3399 4176 6520 822 -4587
1698 -4587 -2505 3639 4776 -1515 -8357 -1494 5519 1719 -4711 -6995 -1658 3500 970 -6036 -6516
1713 -6516 1428 4799 -2167 -6886 -3404 2724 3675 -1376 -7161 -1955 4675 3678 -4111 -4492 1805 5317
1729 5317 2309 -4074 -4329 2411 7159 1560 -4742 -1618 5556 4917 -958 -2652 911 7401 6148
1744 6148 176 -2131 4559 9122 5414 -309 -948 4785 7222 3445 -2782 -1997 4645 4356 -1615 -6115
1760 -6115 -3173 2228 1263 -5271 -8531 -3244 1048 -1800 -8365 -8058 -1386 676 -2606 -7108 -5314
1775 -5314 438 3358 -2262 -6013 -1240 4284 3218 -2474 -3920 155 5869 3714 -3865 -3905 1326
$$ packed form
1668H677q152l239P001N059m771r053J771P088K401n102p231K791P400K784q257
1683h33m843O300N276j563o002k887O281O987m509q774J168P575K344n698n409
1698d587K082O144J137o291o842O863P013l800o430k284N337N158k530p006m80
1713f516P944L371o966m719L482O128R51n051n785N206O630r97p789l81O297L512
1729E317l008o383k55O740M748n599o302L124P174o39n875j694L563O490j253
1744F148n972k307O690M563l708n723o39N733K437l777o227P85O642k89n971m500
1760f115K942N401r65o534l260N287M292k848o565L07O672K062l282m502J794
1775e314N752K920n620l751M773N524j066n692j446M075N714k155p579m0N231
$$ plain form
1790 1326 4461 -474 -5006 -5028 -5 1552 -2688 -7718 -5257 1486 284 -5043 -7269 -1206 1023
1805 1023 527 -4929 -4896 1417 4551 798 -4194 -1504 4014 6159 2365 -778 -254 5734 6159 500
1821 500 -1836 2246 6541 3446 -1057 -2956 793 4993 806 -4272 -4079 1287 1260 -3051 -6131 -3328
1837 -3328 1041 1486 -3341 -7216 -2725 3017 -864 -4761 -5392 -603 1969 -1326 -5045 -4623 119 2031
1853 2031 -2587 -7373 -3955 329 786 -3686 -6653 -3381 403 116 -5767 -5622 -1089 1986 -971 -4689
1869 -4689 -3793 132 2372 -36 -3970 -1906 3142 2790 -870 -2804 323 4332 3502 -1694 -3744 1657
1885 1657 4450 1275 -2483 -2805 1136 3505 237 -3770 -1347 4061 3310 -1589 -3727 881 3472
1900 3472 3878 -1285 -2160 644 4615 2674 -2461 -1966 2267 4481 341 -2142 -1171 2414 3230 -671
$$ packed form
1790A326L135m935m532k2N023J557m240n030K461O743j202n327k226O063K229
1805A023m96n456L3O313L134l753m992K690N518K145l794l143N24N988M25n659
1821E00k336M082M295l095m503j899L749M200m187n078J93N366k7m311l080K803
1837c328M369M45m827l875M491N742l881l897o31M789K572l295l719M22M742J912
1853B031m618m786L418M284M57m472k967L272L784k87n883J45M533L075k957l718
1869d689Q96L925K240k408l934K064N048l52l660j934L127M009q30n196k050N401
1885A657K793l175l758l22L941K369l268m007K423N408p51m899k138M608K591
1900C472M06n163q75K804L971j941n135M95M233K214m140k483R71L585Q16l901
$$ plain form
1916 -671 -2764 -816 3479 1598 -3355 -4492 -885 2721 47 -4257 -5641 166 2001 -1879 -4086
1931 -4086 -3672 593 1115 -2702 -4923 -1554 2039 2022 -1700 -3492 162 2087 792 -2881 -1684 2091
1947 2091 4284 1114 -2758 -2496 1714 2575 -820 -3159 -1666 2584 1982 -1887 -3777 611 3356 1244
1963 1244 -2039 -2705 1867 3972 727 -2671 -1346 4194 3975 55 -1315 194 3136 2537 -423 -2114
1979 -2114 1405 3505 2542 -2005 -1460 1178 2642 1245 -1880 -1624 1531 2826 -1378 -3570 -2551 1444
1995 1444 1639 -3431 -4489 -2062 1088 -199 -4108 -4955 -158 1954 -1228 -3778 -3432 1562 1941 -78
2011 -78 -2503 -1158 3349 1496 -508 -883 884 3936 3226 -240 -1063 1335 3494 1848 -1950 -1787
2027 -1787 2713 2950 687 -2527 -241 3330 3591 -1132 -687 1257 4505 3726 -67 430 2974 5238
$$ packed form
1916f71k093J948M295j881m953j137L607L606k674m304j384N807J835l880k207
1931d086M14M265N22l817k221L369L593j7l722j792L654J925j295l673J197L775
1947B091K193l170l872K62M210Q61l395k339J493M250o02l869j890M388K745k112
1963A244l283o66M572K105l245l398J325N540k19l920j370J509K942n99k960j691
1979b114L519K100r63m547N45K638J464j397l125K56L155J295m204k192J019L995
1995A444J95n070j058K427L150j287l909q47M797K112l182k550L46M994L79k019
2011g8k425J345M507j853k004l75J767L052p10l466q23K398K159j646l798J63
2027a787M500K37k263l214K286L571K61m723M45J944L248p79l793M97K544K264
$$ plain form
2043 5238 3600 -274 1056 5017 5330 1763 325 1507 3834 4769 288 -1467 1441 3948 2501
2058 2501 -1047 -1338 249 2732 1445 -1999 -1544 1804 1690 -52 -3482 -925 1077 1040 -962 -2569
2074 -2569 -811 1480 1737 -2032 -2082 -126 2409 120 -1972 -1500 1565 2199 -919 -3252 -2813 990
2090 990 626 -2485 -3465 -2651 150 -893 -4038 -4774 -1498 1622 -499 -3849 -3073 1250 2840 1321
2106 1321 -2146 -586 3599 3959 2157 209 2612 6227 5036 1683 1129 2939 6244 3494 -762
2121 -762 -221 2018 3519 307 -2513 -947 2543 2450 -1220 -2276 -137 2478 1783 -1816 -1774 660 3078
2138 3078 825 -1023 -980 2541 3633 1713 -665 -109 3096 2967 411 -1804 573 3422 1720 -1062
2154 -1062 -2281 582 1135 811 -1628 -3095 -57 2222 -1098 -3541 -2028 -398 1538 -2626 -3317 -3217
$$ packed form
2043E238j638l874J330L961L13l567j438J182K327R35m481j755K908K507j447
2058B501l548k91J587K483j287l444M55L348j14j742l430K557K002l7k002j607
2074b569J758K291K57l769n0J956K535k289k092M72L065O34l118k333M39L803
2090I90l64l111r80Q14K801j043l145p36L276L120k121l350P76M323J590j519
2106A321l467J560M185L60j802j948K403L615j191l353n54J810L305k750m256
2121g62N41K239J501l212k820J566L490r3l670j056K139K615o95l599M2K434K418
2138C078k253j848M3L521J092j920k378N56L205j29k556k215K377K849j702k782
2154a062j219K863N53l24k439j467L038K279l320k443J513J630J936m164o91J00
$$ plain form
2170 -3217 20 263 -2918 -3388 -923 2228 -1739 -2718 -2274 427 1635 16 -1648 -1557 1851 1078 -145
2187 -145 -1872 581 1759 1985 -862 -2053 369 1809 2047 -1049 -1100 1324 3824 1860 -1367 -1087
2203 -1087 2348 2964 -100 -2577 -239 2052 2109 -1324 -2463 -1036 1216 1324 -2403 -2720 -689 1114
2219 1114 -1639 -4168 -3367 -391 478 -2147 -3782 -1890 1199 -169 -2158 -2746 -412 1027 294 -2486
2235 -2486 -2482 769 1868 512 -2987 -1455 714 536 -692 -3431 -2256 881 1121 -3547 -2455 -675
2251 -675 897 -45 -2521 -2270 394 1528 860 -2568 -566 1969 2173 -600 -1324 191 2564 1672 -534
2268 -534 -659 2026 3417 1786 -424 295 2296 3676 1830 807 -84 2427 2076 943 -1203 68
2284 68 1938 1215 -631 -2934 449 1450 870 -1174 -1974 383 2627 -214 -2186 -1646 511 2142
$$ packed form
2170c217L237K43l181m70K465L151l967r79M44K701J208j619j664R1L408p73j223
2187a45j727K453J178K26k847j191K422J440K38l096n1K424K500j964l227K80
2203a087L435O16l064k477K338K291N7l433j139J427K252J08l727l17K031J803
2219A114k753k529Q01K976Q69k625j635J892L089j368j989n88K334J439p33k780
2235b486ML251J099j356l499J532K169j78j228k739J175L137K40m668J092J780
2251f75J572r42k476K51K664J134o68l428K002K535K04k773p24J515K373q92k206
2268e34j25K685J391j631k210P19K001J380j846j023q91K511l51j133k146J271
2284F8J870p23j846k303L383J001n80k044q00K357K244k841j972N40K157J631
$$ plain form
2300 2142 -568 -1575 -407 1137 2343 -1890 -2373 -607 1320 1082 -2283 -1772 742 1536 -210 -1947
2316 -1947 -2357 1169 1642 -315 -2333 -1703 1522 1743 -771 -2424 492 2031 1825 -353 -660 1027
2332 1027 2006 1293 -1435 -58 1650 2000 763 -549 -34 2164 1912 -101 -500 822 2779 2654 -715
2349 -715 183 1836 3510 1536 -1092 805 3422 2881 844 -639 321 2002 2012 382 -858 661
2365 661 1996 2472 -1273 -1302 -109 1026 789 -1021 -367 1186 1339 179 -1396 -713 903 1667 -1529
2382 -1529 -1932 -519 1552 641 -2655 -598 -3 1653 -695 -1479 -378 1076 1738 -231 -511 -652 2184
2399 2184 1650 -652 -953 223 2431 553 -300 -708 772 2189 588 -1572 -1355 1086 2153 906
2415 906 -673 864 1547 2335 59 -651 1548 1849 2056 -1271 -664 1307 2575 1621 -794 -183 1775
$$ packed form
2300B142k710j007J168J544J206m233m83J766J927k38l365N11K514P94j746j737
2316a947m10L526M73j957k018O30L225K21k514j653K916J539k06k178l07J687
2332A027R79p13k728J377J708L50j237j312N15K198k52k013l99J322J957j25l369
2349g15Q98J653J674j974k628J897K617n41k037j483R60J681J0j630j240J519
2365F61J335M76l745k9J193J135k37j810O54J553J53j160j575O83J616P64l196
2382a529m03J413K071r11l296K057N95J656k348p84J101J454O62j969k80j41K836
2399B184n34k302l01J176K208j878q53m08J480J417j601k160K17K441J067j247
2415I06j579J537O83P88k276p10K199L01K07l327O07J971J268r54k415O11J958
$$ plain form
2432 1775 2304 608 -1250 -221 1836 1218 -370 -1118 11 1620 31 -1335 -1216 25 1463 147
2448 147 -2367 -1246 1260 33 -1250 -1864 -481 484 84 -1279 -2285 -605 452 -132 -1332 -1072
2464 -1072 225 1451 -74 -1891 -1305 620 1645 -512 -1651 52 953 732 -395 -1420 -485 1989
2480 1989 212 -804 -1459 680 2075 174 348 -118 880 1709 -172 -587 797 1579 2621 724 -1663
2497 -1663 41 1956 2544 -24 -266 838 1372 831 -456 56 1216 1096 -82 -1173 -618 1046 1146
2514 1146 215 -2242 -610 558 -221 -1563 -1479 -611 1093 -338 -2220 -493 754 117 -389 -1907 -1243
2531 -1243 1001 345 -1806 -1603 -129 972 -1194 -2283 -2236 -1291 -446 -1180 -2485 -2796 -415 -215 -686
2548 -686 -2581 -1542 -843 -807 -1681 -2225 -1370 117 -278 -1683 -1722 -86 1768 1326 -1315 -660 -680 1605
$$ packed form
2432A775N29j696j858J029K057o18j588p48J129J609j589j366J19J241J438j316
2448A47k514J121K506j227j283o14J383R65m00j363j006J680J057n84j200K60
2464a072J297J226j525j817N86J925J025k157j139J703R01k21j127j025R35K474
2480A989j777j016o55K139J395j901J74m66R98Q29j881m15J384P82J042j897k387
2497a663J704J915N88k568k42J104N34n41j287N12J160j20j178j091N55J664J00
2514A146r31k457J632J168p79j342Q4Q68J704j431j882J727J247o37n06j518O64
2531a243K244o56k151K03J474J101k166j089M7R45Q45p34j305l11K381K00m71
2548f86j895J039O99L6q74n44Q55J487l95j405l9J636J854m42k641O55k0K285
$$ plain form
2566 1605 -408 -726 -468 1277 2269 -325 -667 1148 1759 484 -520 -1558 279 681 556 -1279 -738
2583 -738 1312 777 -251 -1731 -79 1707 620 742 -1046 -40 1245 963 -436 -1466 534 1063
2599 1063 75 -919 -223 397 1298 56 -1207 -986 205 538 -812 -1236 -375 705 416 -787 -1561 -444
2617 -444 997 304 -1026 -1954 -67 95 157 -857 -1270 752 482 -585 -1879 156 1453 398 -662
2634 -662 -934 534 780 184 -872 -761 1490 1635 479 326 240 1733 1549 250 -289 1432 1357 1659
2652 1659 -582 33 1672 818 1036 -575 -431 589 1601 -62 -10 1183 984 503 421 -1318 321
2669 321 1001 -809 -954 -1290 223 561 29 -1672 -938 447 615 -1346 -1513 -543 194 717 -378 -1264
2687 -1264 -556 763 485 -427 -694 -3 843 874 -1007 -747 829 1172 -857 -663 -1380 267 276 -517 -909
$$ packed form
2566A605k013l18K58J745R92k594l42J815O11j275j004j038J837M02j25j835N41
2583g38K050n35j028j480J652J786j087J22j788J006J285k82j399j030K000N29
2599A063r88r94O96O20R01j242j263K21J191L33j350m24Q61J080k89j203p74J117
2617d44J441o93j330r28J887J62O2j014m13K022k70j067j294K035J297j055j060
2634f62k72J468K46n96j056J11K251J45j156j53q6J493j84j299n39J721p5L02
2652A659k241O15J639q54K18j611J44J020J012j663N2J193j99m81q2j739J639
2669C21O80j810j45l36J513L38n32j701P34J385J68j961j67R70P37N23j095q86
2687a264P08J319k78r12k67O91Q46L1j881K60J576L43k029J94p17J647Rp93l92
$$ plain form
2706 -909 -9 763 -771 -350 -858 -301 752 498 -762 -282 743 1264 1386 -137 -219 1368 807 -24
2724 -24 -771 668 1487 380 -640 105 -156 1111 961 -136 139 315 1273 -371 -130 -368 839 845 -718
2743 -718 -592 372 842 -318 -1099 -1139 17 1103 167 -458 -1427 -655 1150 -446 -861 -1175 366 339 -913
2762 -913 -771 -648 851 -621 -946 -707 -871 371 -165 -1580 -874 -221 733 -1221 -1508 -1353 -528 127
2780 127 -903 -232 -120 1327 711 -751 211 748 559 588 -123 -399 742 379 -117 -344 35 1426 1223
2799 1223 116 -60 519 782 888 225 -316 1430 1122 901 392 -626 1019 431 -546 -635 -20 617 322
2818 322 344 -590 131 498 -1039 -805 -1122 615 1037 873 -1802 -850 -399 1246 67 -1785 -730 250
2836 250 -506 -719 -1290 -1419 -35 -62 -1551 -1971 238 656 -727 -813 -1540 -766 -233 -507 -606 -669 860 -147
$$ packed form
2706i09R00P72j534M21n08N57J053k54j260M80J025N21J22j523q2J587n61q31
2724b4p47J439Q19j107j020P45k61J267j50j097K75J76R58j644K41k38J207Oj563
2743g18J26R64M70j160p81m0J156J086r36o25r69P72J805j596m15l14J541k7j252
2762i13J42J23J499j472l25K39j64J242n36j415P06O53R54j954k87J55Q25O55
2780A27j030O71J12J447o16j462R62N37j89K9p11k76J141l63m96k27L79J391k03
2799A223j107j76N79K63J06o63n41J746l08k21n09j018J645n88r77q9O15O37k95
2818C22K2r34P21L67j537K34l17J737M22j64k675R52M51J645j179j852J055R80
2836B50p56k13n71j29J384k7j489m20K209M18j383q6p27P74N33k74r9o3J529j007
$$ plain form
2856 -147 235 -1275 -788 615 1422 -213 -529 -8 913 244 -1834 70 423 -169 -135 -993 -1054 425 1074
2875 1074 455 -564 659 1148 632 -170 468 -536 671 368 428 -266 710 -87 -50 -979 -1048 1495 23
2894 23 -129 -824 -268 255 -969 -1408 -943 32 167 841 -738 -845 757 -31 -927 -977 -687 83 807 -942
2914 -942 -796 -176 -61 -256 -1352 -586 -248 174 434 -1854 -718 288 752 64 -106 -451 -366 1441 -416
2933 -416 -1850 -42 431 -344 -237 -621 758 1213 18 -172 -534 582 846 -78 684 715 496 964 860
2952 860 -248 571 1068 1282 -989 117 767 775 504 -709 312 1097 648 -376 366 -587 784 326
2970 326 -791 -649 -703 479 56 -299 245 -240 300 -355 -389 -601 133 930 -750 -307 -641 -1 492 -794
2990 -794 287 -862 -22 361 -804 -336 -60 -339 -593 -416 -124 -42 -78 -657 -776 -909 163 -237 -626
$$ packed form
2856a47L82j510M87J403Q07j635l16N21R21o69k078J904L53n92L4q58o1J479O49
2875A074o19j019J223M89n16q02O38j004J207l03O0o94R76p97L7r29o9K543j472
2894B3j52o95N56N23j224m39M65R75J35O74j579j07J602p88q96n0K90P70P24j749
2914i42J46O20J15j95j096P66L38M22K60k288J136J006M64o88j70l45Q5J807j857
2933d16j434J808M73p75J07l84J379M55j195j90l62J116K64r24P62L1k19M68j04
2952H60j108Q19M97K14k271J106O50Qk71j213J021P85m49j024P42r53J371m58
2970C26j117J42n4J182m23l55N44m85N40o55l4k12P34P97j680M43l34O40M93j286
2990g94J081j149Q40L83j165M68K76k79k54J77K92Q2l6n79j19j33J072m00l89
$$ plain form
3009 -626 -1228 -105 386 334 -386 -847 391 1911 1284 -90 -387 -121 195 474 -137 -452 336 37 -110
3028 -110 -635 276 291 -206 139 -875 666 935 372 -300 -581 -36 1166 217 175 -126 654 -702 -427
3047 -427 -761 -331 518 616 -270 -1099 -237 -1017 -462 -339 -84 -80 872 -731 -726 -375 68 -582 -1050 -294 -538
3068 -538 513 -781 -201 -1101 -301 677 66 57 -814 -583 202 -342 -432 -884 424 646 112 -35 -403 -377
3088 -377 43 -621 -124 -145 1276 271 -566 192 -262 371 -124 740 -223 -338 -314 558 -115 613 855 255
3108 255 650 -51 -393 -64 362 682 235 -133 451 806 448 -792 81 172 -540 -260 610 686 -694 -361
3128 -361 -732 -89 -286 528 -281 -747 97 -152 31 -1295 -248 -596 577 352 -612 -376 -605 -87 -616
3147 -616 -680 64 -629 -722 -133 -947 -165 585 -320 -109 31 -275 1643 211 427 -832 249 34 -900
$$ packed form
3009f26o02J123M91n2p20m61J238J520o27j374k97K66L16K79o11l15P88k99j47
3028a10n25R11J5m97L45j014J541K69n63o72k81N45J202r49m2l01P80j356K75
3047d27l34M30Q49R8q86q29Q62p80N55J23K55MR52j603NL51M43o50m68P56k44
3068e38J051j294N80r00Q00R78o11rq71K31P85n44r0m52J308K22n34j47l68K6
3088c77M20o64M97k1J421j005q37P58m54O33m95Q64r63j15K4Q72o73P28K42o00
3108B55L95p01l42L29M26L20m47l68N84L55l58j240Q73R1p12K80Q70P6j380L33
3128c61l71O43j97Q14q09m66Q44k49J83j326J047l48J173k25r64K36k29N18n29
3147f16o4P44o93r3N89q14P82P50r05K11J40l06J918j432K16j259J081k15r34
$$ plain form
3166 -900 103 -48 128 849 176 106 935 724 734 393 26 1233 642 375 -1126 411 1039 -197 707
3185 707 365 854 136 -391 222 -49 801 -335 331 -467 305 692 -15 1045 -692 36 576 714 -11
3204 -11 -46 -607 447 -739 -1337 192 429 325 352 107 -823 -1238 10 230 -1097 69 260 74 -94
3223 -94 -479 -354 993 181 -57 -644 43 1250 883 318 -330 926 164 -276 833 386 900 585 330
3242 330 252 140 -231 -88 983 -26 293 1091 371 146 563 287 150 549 -45 -397 367 -261 437 761
3262 761 81 704 -523 -996 -376 -460 187 -299 -812 -452 355 -237 307 -459 -85 415 899 -384 -208 287
3282 287 -256 348 -814 -82 -564 -53 -679 -948 -1526 141 52 -383 -222 -377 306 433 90 -294 -391 -299
3302 -299 -297 -415 -864 -205 -329 -89 373 -554 -204 332 1003 54 -649 85 -238 371 -94 -83 855 436 80
$$ packed form
3166i00J003j51J76P21o73p0Q29k11J0l41l67J207n91k67j501J537O28j236R04
3185G07l42M89p18n27O13k71Q50j136O66p98P72L87p07J060j737P28N40J38p25
3204a1l5n61J054j186n98J529K37j04K7k45r30m15J248K20j327J166J91j86j68
3223i4l85J25J347q12k38n87O87J207l67n65o48J256p62m40J109m47N14l15k55
3242C30p8j12l71J43J071j009L19P98p20k25M17k76j37L99n94l52P64o28O98L24
3262G61o80O23j227m73O20q4O47m86n13L60Q07n92N44p66L74N00M84j283J76M95
3282B87n43O04j162P32m82N11o26k69n78J667q9m35J61j55O83J27l43l84r7R2
3302b99Kj18m49O59j24K40M62r27L50N36O71r49p03P34l23O09m65J1R38m19l56
$$ plain form
3323 80 -324 373 153 7 -616 -764 114 1416 -520 -191 291 937 131 -616 -862 314 612 339 -17
3342 -17 157 -544 234 -548 -416 77 322 -270 345 -777 -944 -344 -175 -204 -415 302 706 -742 -608 -699
3362 -699 -154 62 -335 -24 -439 280 681 91 -1145 105 -191 -462 -144 -607 251 790 -130 -441 49
3381 49 -380 558 -47 -916 -328 -38 280 -10 33 645 19 413 100 99 -131 476 621 -345 -85 644 242
3402 242 142 675 -494 -125 1263 866 191 -1327 -8 579 658 -100 356 564 1155 361 -462 -411 500
3421 500 -449 -1 -130 -486 1108 -33 -626 -922 120 215 -102 -279 -896 759 -249 -1172 -805 560
3439 560 169 -352 -516 -342 -308 -101 699 259 157 86 162 -278 -805 -968 131 -164 -1116 552 515 614 -963
3460 -963 49 680 856 651 -15 -294 -527 175 535 -97 -338 -695 329 846 832 443 95 774 332 178
$$ packed form
3323H0m04O97k20j46o23j48Q78J302j936L29M82O46q06p47k46J176K98k73l56
3342a7J74p01P78p82J32M93K45n92O15j122j67O00J69k9k11P17M04j448J34r1
3362f99N45K16l97L11m15P19M01n90j236J250k96k71L18m63Q58N39r20l11M90
3381D9m29R38o05q69N88K90L18k90M3O12o26L94l13jk30O07J45r66K60P29m02
3402B42j00N33j169L69J388l97o75j518J319N87P9p58M56K08N91p94q23N1R11
3421E00r49M48j29l56J594j141n93k96J042R5l17j77o17J655j008r23L67J365
3439E60l91n21j64J74L4K07Q00m40j02p1P6m40n27j63J099k95r52J668l7R9j577
3460i63J012O31J76k05o66k79k33P02L60o32k41l57J024N17j4l89l48O79m42j54
$$ plain form
3480 178 -890 133 464 -122 368 501 -398 596 -28 -456 -890 308 425 453 -756 -65 153 -77 414
3499 414 -52 -77 290 495 191 -609 458 98 -526 -313 -666 358 -357 -874 -13 -128 101 -471 257 -264
3519 -264 -130 119 281 -94 433 -162 44 130 -410 -210 -567 -221 175 -310 -372 -330 -143 -606 -138 237 282
3540 282 986 70 -398 910 986 -154 532 224 800 204 -97 -167 813 31 108 46 140 -356 508 324 272
3561 272 190 121 870 -796 -322 76 758 475 423 378 269 -80 488 192 -226 172 37 -420 -403 65 199
3582 199 1321 637 -1276 110 185 127 -14 -761 -1025 -414 232 -240 -567 -347 492 -275 -435 -455 -454 -39 213
3603 213 -60 -604 217 1156 50 39 -172 411 -161 762 -698 49 390 -223 -66 708 -607 -117 353
3622 353 339 175 436 981 575 -389 136 625 622 -145 -386 -509 401 -116 255 343 -387 -428 -181 -279 130 656
$$ packed form
3480A78j068J023L31n86M90J33q99R94o24m28m34J198J17K8j209O91K18k30M91
3499D14m66k5L67K05l04q00J067l60o24K13l53J024p15n17Q61j15K29n72P28n21
3519b64J34K49J62l75N27n95K06Q6n40K00l57L46L96m85o2M2J87m63M68L75M5
3540B82P04r16m68J308P6j140O86l08N76n96l01p0R80p82P7o2R4m96Q64j84n2
3561B72q2o9P49j666M74L98O82k83n2m5j09l49N68k96m18L98j35m57J7M68J34
3582A99J122o84j913J386P5n8j41p47k64O11O46m72l27K20Q39p67j60k0JM15K52
3603B13k73n44Q21R39j106j1k11N83n72R23j460P47L41o13J57P74j315M90M70
3622C53j4j64K61N45m06r64N25M89lp67k41j23R10n17L71Q8p30m1K47r8M09N26
$$ plain form
3644 656 399 581 201 54 451 66 -474 653 -121 1018 504 212 -371 -469 -422 -347 386 334 238 -278 279
3665 279 -136 -252 -1038 -408 -402 -596 621 -545 -583 -401 89 -1017 -883 -815 -615 -688 -373 -659 -546 -445 -220
3686 -220 -193 119 -208 -35 -642 394 709 -270 -9 186 -274 -307 -416 174 1014 628 -467 -10 400 372
3706 372 774 -391 -458 145 511 -303 536 354 -112 -202 24 -276 -474 507 386 971 58 236 -235 46
3726 46 713 505 -245 1208 428 -279 316 -848 46 -347 140 -767 38 -415 -920 -519 -375 262 101 -598
3746 -598 -206 -229 115 155 -511 -307 139 389 -149 -463 -447 -227 -285 -344 -1137 -887 221 -259 -409 413 -91
3767 -91 592 -70 103 -813 1035 1070 591 533 339 163 573 789 27 679 -88 728 98 -157 -554 525
3787 525 475 797 412 533 283 552 -249 309 177 528 178 -416 -664 99 128 612 210 -323 793 63
$$ packed form
3644F56k57J82l80j47L97l85n40J127p74J139n14k92n83r8M7P5P33n2r6n16N57
3665B79m15j16p86O30Oj94J217j166l8J82M90j106J34O8K00p3L15k86J13J01K25
3686b20K7L12l27J73o07J036L15r79K61J95m60l3j09N90Q40l86j095M57M10k8
3706C72M02j165o7O03L66q14Q39j82m66r0K26l00j98R81j21N85r13J78m71K81
3726D6O67k08p50J453p80p07N95j164Q94l93M87r07Q05m53n05M01J44O37j61o99
3746e98L92k3L44M0o66K04M46K50n38l14J6K20n8n9p93K50J108m80j50Q22n04
3767i1O83o62J73r16J848L5m79n8j94j76M10K16p62O52p67Q16o30k55l97J079
3787E25n0L22l85J21k50K69q01N58j32L51l50n94k48P63K9M84m02n33J116p30
$$ plain form
3807 63 43 -1003 -439 685 899 -19 -15 664 304 63 -274 -413 -293 122 -284 365 -895 -280 -1438 -311
3827 -311 -1043 66 -69 564 -197 -189 487 158 -53 -258 -447 -476 -323 -174 -304 -630 309 368 909 -259 751
3848 751 -375 -306 197 -753 -118 745 -720 -829 -158 604 754 92 -118 -327 89 -651 438 -195 -276 575
3868 575 456 688 -244 -394 -316 208 -404 -181 102 -111 176 320 533 -1027 -993 1173 334 -40 721 -35
3888 -35 165 -1185 -118 243 -409 -301 89 -307 821 127 -607 568 -601 -733 -280 -737 240 555 -124
3907 -124 -611 -618 446 1128 -512 -1171 -643 79 -72 587 297 -574 688 -549 436 178 -139 245 211 628
3927 628 -384 261 -60 -16 829 82 297 662 -332 325 100 518 544 304 359 305 -150 498 265 357 472
3948 472 296 -605 393 116 262 105 -325 -580 314 893 1134 -1067 -31 289 -235 213 -275 -190 -117 44
$$ packed form
3807F3k0j046N64J124K14r18MO79l60k41l37j39J20M15m06O49j260O15j158J127
3827c11p32J109j35O33p61QO76l29k11k05j89k9J53J49j30l26R39N9N41j168J010
3848G51j126O9N03r50O35Q63j465j09O71P62J50o62k10k09M16p40J089o33q1Q51
3868E75j19K32r32j50P8N24o12K23K83k13K87J44K13j560L4K166q39l74P61p56
3888c5K00j350J067L61o52J08L90l96J128o94p34J175j169j32M53m57R77L15o79
3907a24m87pJ064O82j640o59N28P22j51O59k90q71J262j237R85k58l17L84l4M17
3927F28j012O45l21M4Q45p47K15L65r94O57k25M18K6k40N5n4m55O48k33R2J15
3948D72j76r01R98k77J46j57m30k55Q94N79K41k201J036L20n24M48m88Q5P3J61
$$ plain form
3968 44 39 343 458 227 938 472 130 -21 453 298 555 102 -126 -243 -244 -70 -431 679 -315 -371 -201 69
3990 69 -315 482 -1136 136 -1042 374 497 24 -882 -461 517 1050 498 253 -516 -891 163 1290
4008 1290 -103 -35 125 -208 -983 -834 777 530 80 62 -174 -436 646 -127 -282 6 555 343 -208
4027 -208 490 -195 -794 65 -460 -890 284 668 -42 353 812 604 376 154 455 154 764 -136 -188 -985
4047 -985 247 423 -295 -146 -143 92 -324 -321 -129 163 -226 -69 -380 -755 878 215 -706 -391 621 -751
4067 -751 -238 320 162 227 -1071 -735 -455 -282 -261 554 175 226 -508 1431 395 106 -958 643 695 420
4087 420 -186 688 -575 523 -43 57 184 444 197 485 330 -98 -682 201 -266 145 365 -494 618
4106 618 -359 325 302 67 9 -117 549 -378 930 56 -6 -549 469 -152 128 376 -85 -79 -421 -438 -409 -305
$$ packed form
3968D4nL04J15k31P11m66l42j51M74j55K57m53k28j17jJ74l61J110r94n6J70K70
3990F9l84P97j618J272j178J416J23m73r06M21R78N33n52k45p69l75J054J127
4008A290j393O8J60l33p75J49J611k47m50j8k36k62J082p73j55K88N49k12n51
4027b08O98o85n99Q59n25m30J174L84p10L95M59k08k28k22L01l01O10r00n2p97
4047i85J232J76p18J49LK35m16LJ92K92l89J57l11l75J633o63r21L15J012j372
4067g51N13N58j58O5j298L36K80J73K1Q15l79N1p34J939j036k89j064J601N2k75
4087D20o06Q74j263J098n66J00J27K60k47K88j55m28n84Q83m67M11K20q59J112
4106F18r77O84k3k35n8j26O66r27J308q74o2n43J018o21K80K48m61Ol42j7K9J04
$$ plain form
4128 -305 443 -251 -224 -420 -177 534 201 -93 -426 -1379 -457 -235 853 783 -277 51 -727 132 -608 -369
4148 -369 867 473 -436 -189 1125 8 -173 -545 289 -295 -159 763 -240 -234 263 411 242 317 170 289
4168 289 397 -175 -321 147 888 -499 52 633 1382 35 96 -326 -177 105 543 -421 457 -234 -12 39
4188 39 745 228 435 -174 -41 -668 -130 -397 -585 -360 -652 -864 333 -483 -733 143 -108 -181 -468 -67
4208 -67 -119 206 -41 -474 222 -309 -318 813 -7 -462 -302 -354 -395 507 -119 -661 147 -250 -566 -671 208 -335
4230 -335 -371 -57 -52 637 -389 -166 -149 482 785 131 -247 -179 -103 274 535 69 871 -5 -262 128 61 -108
4252 -108 -136 199 -227 -30 -170 347 204 434 196 463 303 49 -341 -113 281 -210 247 690 54 582
4272 582 -94 103 138 -108 217 -679 249 -117 176 334 323 4 431 -590 -101 -181 221 365 626 939 -10
$$ packed form
4128c05P48o94K7j96K43P11l33k94l33r53R22K22J088p0j060L28p78Q59p40K39
4148c69J236l94r09K47J314j117j81l72Q34n84J36R22j003OM97J48j69P5j47J19
4168B89J08n72j46M68P41j387N51N81P49j347O1m22J49K82M38r64Q78o91K22N1
4188C9P06n17K07o09J33o27N38k67j88K25k92k12J197q16k50Q76k51p3k87M01
4208f7n2L25k47m33O96n31rJ131q20m55J60n2m1R02o26n42Q08l97l16j05Q79n43
4230c35l6L14NO89j026K23J7O31L03o54l78O8P6L77K61m66Q02q76k57L90o7j69
4252a08k8L35m26J97j40N17j43K30k38K67j60k54l90K28L94m91M57M43o36N28
4272E82o76J97L5k46L25q96R28l66K93J58j1l19M27j021M89q0M02J44K61L13r49
$$ plain form
4293 -10 -258 -207 -291 -100 -454 374 -116 -402 163 162 619 -79 -135 1415 28 198 423 548 48 -1177 -664
4314 -664 -37 714 -21 203 -91 -44 -122 -449 -107 6 -217 -98 -144 -67 -332 -304 498 792 124 495 -244 -258
4336 -258 -557 807 136 169 -244 400 24 523 -124 -188 203 -262 -547 639 -45 296 189 606 335 -667
4356 -667 69 -76 -25 557 -416 -93 -309 -318 -243 -553 -358 -630 -856 19 71 174 26 -845 -954 166 50
4377 50 1014 38 -244 549 -274 -768 -1528 339 268 408 -98 202 -612 568 -19 -5 -21 -907 -602 -477 532
4398 532 125 630 -294 -244 367 728 354 239 252 252 380 -256 749 912 402 679 453 -308 -137 329 -554
4419 -554 420 168 3 98 -39 -686 -545 -87 -206 25 -653 217 -320 -151 192 -594 151 -457 -227 -277 116
4440 116 165 -245 -388 179 -279 -123 20 114 666 624 -667 -52 -623 -242 60 -414 231 101 209 472 -124
$$ packed form
4293a0k48N1q4J91l54Q28m90k86N65jM57o98n6J550j387J70K25J25n00j225N13
4314f64O27P51p35K24k94M7p8l27L42J13k23J19m6P7k65K8Q02K94o68L71p39j4
4336b58k99J364o71L3m13O44l76M99o47o4L91m65k85J186o84L41j07M17k71j002
4356f67P36j45N1N82r73L23k16rP5l10J95k72k26Q75N2J03j48q71j09J120j16
4377E0R64r76k82P93q23m94p60J867p1J40n06L00q14J180n87J4j6q86L05J25J009
4398E32m07N05r24N0O11L61l74j15J3%J28o36J005J63n10K77k26p61J71M66q83
4419e54R74k52j65R5j37o47J41M58j19K31o78Q70n37J69L43p86P45o08K30n0L93
4440A16M9m10j43N67m58J56J43R4N52m2j291O15n71L81L02m74O45j30J08K63n96
$$ plain form
4461 -124 112 -237 -310 -603 -427 704 -307 100 177 -280 903 199 337 -54 424 622 -281 806 -1150
4480 -1150 -96 37 652 -42 537 495 43 -285 228 1138 -462 -29 600 -105 -183 674 320 2 -2 -155
4500 -155 -57 -177 -35 -482 -272 -122 -841 -607 633 -525 896 97 291 314 -447 550 186 462 135 272
4520 272 -399 -202 399 379 -370 -70 -275 -50 -910 272 734 -84 -861 405 827 -206 39 474 407 642
4540 642 799 798 591 670 -23 -440 -335 -222 493 21 564 581 621 -601 410 -3 -198 155 194 -352 -34
4561 -34 545 -82 -518 314 -258 102 313 -494 -21 253 -238 -107 186 -767 -170 -348 -442 -416 531 -133 -793
4582 -793 -417 -215 -36 -503 -457 -466 -197 591 -187 -53 -494 -349 -406 -424 543 -540 -179 451 278 262 289 212
4604 212 317 169 -133 213 -235 444 24 -805 -384 -370 -118 -397 237 -76 -626 -110 -189 119 -260 -161 -340
$$ packed form
4461a24K36l49p3k93J76J131j011M07P7m57J183p04J38l91M78J98r03J087j956
4480a150J054J33O15o94N79m2m52l28N13R10j600M33O29p05p8Q57l54l18mj53
4500a55R8j20J42m47K10J50p19K34J240j158J421p99J94K3p61R97l64K76l27J37
4520B72o71J97O01k0p49L00k05K25q60J182M62q18p77J266M22j033K45M35o7K35
4540F42J57jk07P9o93m17J05J13P15m72N43J7M0j222J011m13j95L53L9n46L18
4561c4N79o27m36Q32n72L60K11q07M73K74m91J31K93r53N97j78r4K6R47o64o60
4582g93L76K02J79m67M6rK69P88p78J34m41J45n7j8R67j083L61O30j73j6K7p7
4604B12J05j48l02L46m48O79m20q29M21J4K52k79O34l13n50N16p9L08l79R9j79
$$ plain form
4625 -340 -378 -449 -482 -455 165 -856 -93 -324 -478 593 -272 -536 168 -214 814 238 223 -40 -413 18 -370
$$ packed form
4625c40l8p1l3K7O20j021P63k31j54J071q65k64P04l82J028n76j5k63l73M31l88
$$ [...]
8191a74
##END NTUPLES=NMR FID
##END=
