##TITLE=1H_Ser 7-2-V-H
 CDCl3, 8 sc, 
 28.8.2020
##JCAMPDX= 6.0         $$ Bruker NMR JCAMP-DX V2.0
##DATA TYPE= NMR FID
##DATA CLASS= NTUPLES
##ORIGIN= UXNMR, Bruker Analytische Messtechnik GmbH
##OWNER= root
$$ XWIN-NMR		Version 3.5
$$ Fri Aug 28 12:33:59 2020 Russian Standard Time (UT+4h)  she@DPX200
##.OBSERVE FREQUENCY= 200.1315066352
##.OBSERVE NUCLEUS= ^1H
##.DELAY= (6, 6)
##.ACQUISITION MODE= SIMULTANEOUS
##.ACQUISITION SCHEME= undefined
##.AVERAGES= 8
##.DIGITISER RES= 18
##SPECTROMETER/DATA SYSTEM= spect
##.PULSE SEQUENCE= zg30
##.SOLVENT NAME= CDCl3
##.SHIFT REFERENCE= (INTERNAL, CDCl3, 0, 15.7039)
##AUDIT TRAIL= $$ (NUMBER, WHEN, WHO, WHERE, WHAT)
$$ ##TITLE= Audit trail, XWIN-NMR		Version 3.5
$$ ##JCAMPDX= 5.01
$$ ##ORIGIN= Bruker BioSpin GmbH
$$ ##OWNER= she
$$ F:/spectra/data/she/nmr/H-F/1/audita.txt
$$ ##AUDIT TRAIL=  $$ (NUMBER, WHEN, WHO, WHERE, WHAT)
(   1,<2020-08-28 12:32:46.79 +0400>,<she>,<DPX200>,
      <created by zg, POWCHK disabled, PULCHK disabled
       configuration hash MD5:
       00 E9 B6 7A A2 85 ED C7 34 08 36 98 17 FE 4E 26
       data hash MD5: 16K
       13 80 BF 68 1D 22 E3 3E 2D 99 95 E6 A7 F9 81 E8>)
$$ ##END=
$$ 
$$ hash MD5
$$ D6 CA BD 54 70 95 F0 CF 28 37 7C A6 9B 70 17 9C
##$RELAX= 
##$RELAX= 
##$RELAX= 
##$RELAX= 
##$RELAX= 
##$RELAX= 
$$ Bruker specific parameters
$$ --------------------------
##$DU= <F:/spectra>
##$EXPNO= 1
##$NAME= <H-F>
##$PROCNO= 1
##$TYPE= <nmr>
##$USER= <she>
##$AMP= (0..31)
100 100 100 100 100 100 100 100 100 100 100 100 100 100 100 100 100 100 
100 100 100 100 100 100 100 100 100 100 100 100 100 100 
##$AQSEQ= 0
##$AQ_mod= 1
##$AUNM= <au_zg>
##$AUTOPOS= <>
##$BF1= 200.13
##$BF2= 200.13
##$BF3= 200.13
##$BF4= 200.13
##$BF5= 200.13
##$BF6= 200.13
##$BF7= 200.13
##$BF8= 200.13
##$BYTORDA= 1
##$CFDGTYP= 0
##$CFRGTYP= 5
##$CHEMSTR= <none>
##$CNST= (0..31)
1 1 145 1 1 1 1 1 1 1 1 1 1 1 1 1 1 1 1 1 1 1 1 1 1 1 1 1 1 1 1 1 
##$CPDPRG= <>
##$CPDPRG1= <>
##$CPDPRG2= <>
##$CPDPRG3= <>
##$CPDPRG4= <mlev>
##$CPDPRG5= <mlev>
##$CPDPRG6= <mlev>
##$CPDPRG7= <mlev>
##$CPDPRG8= <mlev>
##$CPDPRGB= <>
##$CPDPRGT= <>
##$D= (0..31)
0 1.2 0 0 0 0 0 0 0 0.06 0 0.03 0 0 0 0 0.0002 0 0 0 0 0 0 0 0 0 0 0 0 
0 0 0 
##$DATE= 1598603566
##$DBL= (0..7)
120 120 120 120 120 120 120 120 
##$DBP= (0..7)
150 150 150 150 150 150 150 150 
##$DBP07= 0
##$DBPNAM0= <>
##$DBPNAM1= <>
##$DBPNAM2= <>
##$DBPNAM3= <>
##$DBPNAM4= <>
##$DBPNAM5= <>
##$DBPNAM6= <>
##$DBPNAM7= <>
##$DBPOAL= (0..7)
0.5 0.5 0.5 0.5 0.5 0.5 0.5 0.5 
##$DBPOFFS= (0..7)
0 0 0 0 0 0 0 0 
##$DE= 6
##$DECBNUC= <off>
##$DECIM= 32
##$DECNUC= <off>
##$DECSTAT= 4
##$DIGMOD= 1
##$DIGTYP= 9
##$DL= (0..7)
0 120 120 120 120 120 120 120 
##$DP= (0..7)
150 150 150 150 150 150 150 150 
##$DP07= 0
##$DPNAME0= <>
##$DPNAME1= <>
##$DPNAME2= <>
##$DPNAME3= <>
##$DPNAME4= <>
##$DPNAME5= <>
##$DPNAME6= <>
##$DPNAME7= <>
##$DPOAL= (0..7)
0.5 0.5 0.5 0.5 0.5 0.5 0.5 0.5 
##$DPOFFS= (0..7)
0 0 0 0 0 0 0 0 
##$DQDMODE= 0
##$DR= 18
##$DS= 0
##$DSLIST= <SSSSSSSSSSSSSSS>
$$ [...]
##$SUBNAM2= <"">
##$SUBNAM3= <"">
##$SUBNAM4= <"">
##$SUBNAM5= <"">
##$SUBNAM6= <"">
##$SUBNAM7= <"">
##$SUBNAM8= <"">
##$SUBNAM9= <"">
##$SW= 16.880792210976
##$SWIBOX= (0..15)
0 0 2 0 0 0 0 0 0 0 0 0 0 0 0 0 
##$SW_h= 3378.37837837838
##$TD= 16384
##$TD0= 1
##$TE= 0
##$TE2= 300
##$TE3= 300
##$TEG= 300
##$TL= (0..7)
0 120 120 120 120 120 120 120 
##$TP= (0..7)
150 150 150 150 150 150 150 150 
##$TP07= 0
##$TPNAME0= <>
##$TPNAME1= <>
##$TPNAME2= <>
##$TPNAME3= <>
##$TPNAME4= <>
##$TPNAME5= <>
##$TPNAME6= <>
##$TPNAME7= <>
##$TPOAL= (0..7)
0.5 0.5 0.5 0.5 0.5 0.5 0.5 0.5 
##$TPOFFS= (0..7)
0 0 0 0 0 0 0 0 
##$TUNHIN= 0
##$TUNHOUT= 0
##$TUNXOUT= 0
##$USERA1= <user>
##$USERA2= <user>
##$USERA3= <user>
##$USERA4= <user>
##$USERA5= <user>
##$V9= 5
##$VALIST= <valist>
##$VCLIST= <CCCCCCCCCCCCCCC>
##$VD= 0
##$VDLIST= <DDDDDDDDDDDDDDD>
##$VPLIST= <PPPPPPPPPPPPPPP>
##$VTLIST= <TTTTTTTTTTTTTTT>
##$WBST= 1024
##$WBSW= 4
##$XGAIN= (0..3)
0 0 0 0 
##$XL= 0
##$YL= 0
##$YMAX_a= 132998
##$YMIN_a= -114496
##$ZGOPTNS= <>
##$ZL1= 120
##$ZL2= 120
##$ZL3= 120
##$ZL4= 120
##$ABSF1= 10
##$ABSF2= 0
##$ABSG= 5
##$ABSL= 3
##$ALPHA= 0
##$AQORDER= 0
##$ASSFAC= 0
##$ASSFACI= 0
##$ASSFACX= 0
##$ASSWID= 0
##$AUNMP= <proc_1d>
##$AZFE= 0.1
##$AZFW= 0.1
##$BCFW= 1
##$BC_mod= 2
##$BYTORDP= 1
##$COROFFS= 0
##$CY= 11.3945322036743
##$DATMOD= 1
##$DC= 2
##$DFILT= <>
##$DTYPP= 0
##$F1P= 16.9975609425685
##$F2P= -3.02152046262296
##$FCOR= 0.5
##$FTSIZE= 0
##$FT_mod= 4
##$GAMMA= 1
##$GB= 0.15
##$INTBC= 1
##$INTSCL= 1
##$ISEN= 128
##$LB= 0.24
##$LEV0= 0
##$LPBIN= 0
##$MAXI= 10000
##$MC2= 0
##$MEAN= 0
##$ME_mod= 0
##$MI= 1.114404
##$NCOEF= 0
##$NC_proc= 0
##$NLEV= 6
##$NOISF1= 3.799351
##$NOISF2= 2.8
##$NSP= 1
##$NTH_PI= 0
##$NZP= 0
##$OFFSET= 15.70392
##$PC= 1
##$PHC0= -9971.713
##$PHC1= 6.200918
##$PH_mod= 1
##$PKNL= yes
##$PPARMOD= 0
##$PSCAL= 0
##$PSIGN= 0
##$REVERSE= no
##$SF= 200.130013532006
##$SI= 16384
##$SIGF1= 3
##$SIGF2= 2
##$SINO= 400
##$SIOLD= 16384
##$SREGLST= <1H.CDCl3>
##$SSB= 0
##$STSI= 0
##$STSR= 0
##$SW_p= 3612.71676300578
##$SYMM= 0
##$S_DEV= 0
##$TDeff= 0
##$TDoff= 0
##$TI= <>
##$TILT= no
##$TM1= 0
##$TM2= 0
##$TOPLEV= 0
##$USERP1= <user>
##$USERP2= <user>
##$USERP3= <user>
##$USERP4= <user>
##$USERP5= <user>
##$WDW= 1
##$XDIM= 8192
##$YMAX_p= 0
##$YMIN_p= 0
$$ End of Bruker specific parameters
$$ ---------------------------------
##NTUPLES= NMR FID
##VAR_NAME=  TIME,          FID/REAL,        FID/IMAG
##SYMBOL=    X,             R,               I
##VAR_TYPE=  INDEPENDENT,   DEPENDENT,       DEPENDENT
##VAR_FORM=  AFFN,          ASDF,            ASDF
##VAR_DIM=   8192,          8192,            8192
##UNITS=     SECONDS,       ARBITRARY UNITS, ARBITRARY UNITS
##FACTOR=    0.000296,      1,               1
##FIRST=     0,             0,               0
##LAST=      2.424536,      0,               0
##MIN=       0,             -114496,         0
##MAX=       2.424536,      132998,          0
$$ Real data points
##PAGE= N=1
##DATA TABLE= (X++(R..R)), XYDATA
0 0 0 0 0 0 0 0 0 0 0 0 0 0 0 0 0 -8 8 -8 8 -8 10 -16 16 -18 24 -26 32 -40 42 -49 56 -65 74 -85 97 -109 122
37 122 -138 154 -174 192 -214 238 -263 290 -322 358 -393 434 -478 527 -579 640 -704 777 -857
56 -857 951 -1055 1172 -1311 1475 -1670 1908 -2207 2595 -3122 3875 -5060 7268 -23626 115884
71 115884 23660 -114496 -8216 12256 17247 -145 -48410 17461 51273 -49705 -3700 31954
83 31954 -45643 -7724 56674 -41278 -52989 24220 1889 -2600 -4237 -36597 21829 45530 -27768
96 -27768 377 40793 2515 44069 28401 -32104 36686 69230 -10544 -12765 19724 13532 16044
109 16044 -26964 -33039 14865 -4480 -42700 -20969 -16707 -34821 -532 -5781 -41638 -17244 17331
122 17331 1862 -10281 -3689 12151 33113 4 -4556 31672 17722 566 17866 10057 -11548
135 -11548 6144 13056 -3710 -26559 -14832 12178 -9048 -34854 -19339 8131 -8979 -28674
147 -28674 -12632 7089 -8032 -18455 4979 2542 -11335 -7880 9446 5284 -13952 -12298 5881
160 5881 10952 -16599 -21420 1828 11269 -12095 -20433 -5434 4226 6661 -14115 -13581 8901 9424
174 9424 -4783 -1443 2068 1222 11330 2812 -3742 -3669 2242 9141 -784 -18954 -12344 14308 126
189 126 -24187 -20621 1818 6597 -12562 -24389 -11264 11765 1605 -14822 -15086 3142 16090
202 16090 2393 -15441 -6660 20295 13912 -6495 -12269 6126 19617 4326 -11978 -9209 8993
215 8993 10629 -1366 -17188 -8551 12411 6629 -12667 -17988 4022 13022 721 -16384 -7319
228 -7319 13845 13228 -2160 -13673 2014 19232 14233 -10998 -12542 14938 21593 -2707 -18756
241 -18756 3233 17379 4784 -14431 -9023 9213 6853 -3496 -10060 -3223 4389 9582 -1005
254 -1005 -11636 -1978 13510 11692 -9868 -8598 8499 15255 -653 -12262 -182 10262 5095
267 5095 -9806 -8240 -7 7000 -1688 -13315 -7303 2539 5165 -7708 -10804 -2870 6315 724
281 724 -6761 -3241 1027 5844 55 -1987 -2027 3340 5086 -469 -3387 -2814 4747 2055 -3707 -6575
297 -6575 2 2857 -1258 -3455 -6751 1000 3801 320 -3632 -985 3307 5384 4349 -1802 2644
312 2644 5900 7005 3086 -339 1770 6793 8146 -3055 -3699 3591 8467 -50 -6942 -3153 4392
327 4392 7028 -5119 -6776 -531 5921 3605 -3261 -6698 1478 10859 865 -6725 -3963 7822 7779
342 7779 -4676 -9553 154 10778 847 -9885 -9007 4881 7996 -3957 -12895 -4843 10700 4312
356 4312 -7450 -9512 4343 11394 1188 -8601 -2878 10895 8264 -1367 -9622 319 12826 4546
370 4546 -10805 -11326 4947 8705 -4708 -18411 -6204 8700 1516 -12322 -12202 3874 7281 392
384 392 -8274 -2426 10757 11910 1042 -4890 6157 15335 12998 -4471 -4908 12255 14447 255
398 255 -10239 -497 9115 4679 -10280 -9662 1287 3903 -2873 -11450 -5824 1296 4416 -4674 -10892
413 -10892 -2381 7521 3200 -9169 -7005 1884 8011 -3883 -11242 -3134 2703 769 -8433 -8283 -2319
428 -2319 2389 -2637 -6806 -5091 1491 5615 -2456 -3597 -632 5794 4769 -1916 -3247 509 4194
443 4194 -302 -5010 -7987 -1589 -2274 -7402 -10712 -10530 -4090 -6903 -10337 -9542 -5486 -5036 -3402 -3246
459 -3246 -4396 -256 2266 5835 984 163 5924 9961 6850 -853 2489 8102 7034 -1416 -1742 81
475 81 2281 1292 -6342 -5064 -2768 608 -2204 -6977 -6458 728 3553 -4269 -7444 -2486 6913 1771
491 1771 -6165 -5804 1934 6742 -2652 -8210 -3991 4334 1753 -5090 -7917 -1036 5712 382 -4810
506 -4810 -5526 5703 9007 789 -5144 453 11271 8630 -2251 -6387 5306 9547 1007 -8477
520 -8477 -6416 4997 2500 -6689 -12698 -4051 3813 -2161 -12563 -10052 2271 4289 -3776 -11728
534 -11728 -772 8579 3876 -3751 -3604 5479 9170 4356 -3639 -564 6868 8344 -551 -6720 1665
549 1665 6340 3784 -7603 -7166 3482 5166 -3528 -8895 -4034 2989 4403 -6269 -8377 -1299 5349
564 5349 1349 -9649 -5556 3693 4128 -5887 -8242 -946 4553 -1522 -7299 -2953 -470 3200 -909
579 -909 -4970 -2608 2635 4256 -1002 -3901 145 5638 1248 -1285 -1660 1519 4141 -393 -1130 -2117
595 -2117 1296 3433 -440 -5188 -962 4028 1245 -2932 -4131 3292 3090 -851 -671 -32 2320 2541
611 2541 2048 206 456 2349 5791 1916 -2457 2523 5059 4656 -1497 -338 4079 4830 2111 -1557
627 -1557 -527 3978 5764 -1542 -2268 252 4326 3561 -3565 -2710 2167 3294 -316 -2185 -3121 1250
643 1250 4116 -930 -5226 -2972 5784 2610 -5368 -5705 2160 6491 -1918 -7121 -1550 5250 1422
658 1422 -2342 -5165 -997 5211 816 -4565 -5439 3144 5404 -2233 -8104 -530 6803 1262 -5471
673 -5471 -4943 3890 4051 -200 -4157 -2842 3933 5358 -608 -6232 151 6858 4625 -5446 -4519 5790
689 5790 6004 -1098 -6205 248 6048 3658 -3575 -4757 1833 6243 2472 -6943 -2591 5492 5810 -3109
705 -3109 -5329 3379 5270 846 -3313 -492 1889 3445 522 -3329 -2149 1758 5533 -1940 -6949
720 -6949 -775 6692 1115 -7585 -2757 3698 2900 -3573 -3546 -223 2542 574 -2625 -1739 -398 3185
736 3185 1032 -3400 -3479 2988 2824 -3106 -3395 -1227 1862 -71 -2657 -3343 -759 1003 -499 -1719
752 -1719 -3531 667 2728 -235 -3687 -139 3385 882 -324 -1688 1865 2625 1944 -617 -960 1052
768 1052 2715 2168 -3052 -1238 2194 2387 -1364 -3016 -12 1798 1263 -2605 -1864 -431 1834 896
784 896 -2811 -3056 1158 4149 -1856 -4467 -1271 3759 1778 -4130 -3854 1396 3913 -1517 -3402 -2228
800 -2228 1730 2998 -1524 -3692 -804 4254 1351 -2399 -3823 1812 5042 18 -4431 -1965 5107
815 5107 2901 -2063 -4615 350 5267 1037 -4853 -3764 3357 3133 -1772 -5551 -1160 3727 1262
830 1262 -3600 -4852 1843 4052 619 -4638 -1830 4704 4835 -884 -4001 2205 6094 3685 -2308
845 -2308 -1333 4606 5622 1050 -3818 584 4726 3157 -3152 -3950 1072 3310 -143 -6049 -3456 1411
861 1411 2474 -3184 -5719 -1472 2685 1311 -4425 -3328 1123 3799 -680 -4091 -467 2942 2841
876 2841 -2252 -2863 604 3798 493 -3427 -2412 1139 3292 -1368 -3330 -1585 2343 1565 -2189 -2073
892 -2073 320 2681 540 -1453 -1958 2066 2706 -442 -1795 -1341 2970 1160 -1847 -3207 229 1536
908 1536 -128 -2166 -1847 1107 1225 825 -1829 -507 3016 2789 895 -346 2085 4020 3568 -73
924 -73 490 2550 3693 2504 -1690 -688 1287 2756 -755 -4306 -1692 1696 -36 -4310 -3104 -912
940 -912 1455 -1623 -3469 -1302 664 2375 -877 -2604 -1112 3104 2203 -1709 -2887 1210 4338 -944
956 -944 -2786 -2123 1498 2177 -2154 -3869 -1322 2160 993 -2449 -4854 1436 3889 -836 -4337 -1429
972 -1429 4913 2351 -2600 -2745 2271 3722 1052 -3363 -1739 3155 2271 -252 -4002 -862 3612 1528
988 1528 -3162 -3175 2104 4007 331 -3707 272 3679 3752 329 -3026 2394 5335 3299 -1808 -1901 3313
1005 3313 5177 -364 -4047 318 2757 1867 -3357 -3040 780 1678 -49 -3823 -2469 1661 2849 -1786
1021 -1786 -3561 -213 3531 1981 -3061 -1024 1977 3332 -564 -2339 -109 2170 1238 -1771 -2030
1036 -2030 -611 2483 -203 -3009 -1864 671 1967 -1207 -2745 -728 2378 1109 -791 -1762 455
1051 455 2939 900 -745 -1569 1971 2264 -550 -1438 -455 1887 858 -930 -2526 338 1431 635
1067 635 -1135 -2004 1277 1731 462 -1702 -266 2306 1936 -193 -989 804 1246 1912 -865 -926 193
1084 193 924 765 -2168 -2119 334 1571 -1100 -2775 -1476 2073 680 -2756 -1762 -94 2613 84
1100 84 -2685 -1222 1765 2029 -967 -2040 -495 3019 583 -2087 -1989 775 2246 -1134 -2873 -1613
1116 -1613 1200 1804 -1254 -3174 -226 2963 1207 -1613 -2474 2181 3206 -147 -2144 -261 3438
1131 3438 2070 -1285 -2484 1705 2656 1003 -2494 -2065 2610 2404 -456 -3227 -213 3304 2084 -2266
1147 -2266 -2028 2322 3133 662 -2847 -159 2357 2218 -905 -2946 793 2996 735 -3074 -2106 966
1163 966 2512 -1107 -4084 -810 1685 1289 -2313 -2149 530 2253 303 -2533 -1214 1475 2786 -1557
1179 -1557 -2319 -237 2114 1084 -2557 -1800 839 2110 -1016 -2546 -1686 1011 1022 -1561 -1871 -325
1195 -325 2153 352 -1311 -789 1148 2223 39 -782 35 2399 1155 -208 -871 455 2242 833
1211 833 -720 -1328 1258 1358 184 -1182 -463 1432 1421 149 -1379 1049 2060 1495 -16 -229 1775
1228 1775 2112 998 -1057 -24 1217 1474 -438 -1530 -417 660 747 -1858 -1642 -491 801 -341
1244 -341 -1979 -1317 591 1885 -806 -1689 -344 2204 1106 -1528 -897 387 2118 13 -1744 -1410
1260 -1410 1016 1056 -1472 -2334 -1491 1356 496 -2043 -2707 303 1889 -697 -1989 -1292 2006 1936 -718
1277 -718 -2074 700 3107 1319 -1482 -1774 1688 2047 -291 -2466 -576 2325 863 -1384 -2284 698
1293 698 2025 771 -2212 -1182 2233 2520 -210 -2537 476 3191 1982 -1517 -1262 2004 2377 303
1309 303 -2210 -377 1251 1638 -1276 -2663 -329 1415 302 -2832 -1763 1042 2260 -860 -2509
1324 -2509 -109 2103 1328 -1970 -1180 548 2190 607 -1671 -1153 1339 1645 -1268 -2159 -489 1757
1340 1757 167 -1676 -1560 311 1546 -622 -1384 -1022 1109 1721 -577 -1480 -83 2306 644 -1104
1356 -1104 -518 1436 1614 -115 -821 -360 1564 587 -204 -1000 -300 1107 546 -877 -1485 770 1353 210
1374 210 -1235 -660 1036 914 -223 -1369 473 1066 569 -578 -791 283 723 135 -1953 -738 482
1391 482 805 -1084 -1879 -445 592 493 -1531 -1772 -408 692 -5 -1098 -968 230 1470 -1220 -1576
1408 -1576 -518 1213 649 -968 -1245 114 1658 443 -1593 -1561 1460 1433 -956 -1778 -537 1762 987
1425 987 -1577 -1505 997 1686 82 -1484 -442 2090 1449 21 -1217 574 2771 793 -988 -605
1441 -605 1392 2216 473 -2071 -15 1855 1204 -392 -2157 401 1778 767 -1588 -822 1278 1755
1457 1755 -599 -1862 578 1350 1491 -1594 -1538 1334 1557 -199 -2275 -913 1566 1375 -1978 -1990 -203
1474 -203 1147 -88 -2550 -982 487 829 -527 -2053 -419 1692 596 -1405 -801 -34 1991 154
1490 154 -1757 -537 508 1380 -537 -1361 -409 1179 240 -881 -1538 116 2122 -381 -980 -616 1123
1507 1123 1668 -384 -1060 596 1749 834 -227 -955 1350 1455 219 -457 -406 1519 971 -526 -916
1524 -916 334 793 526 -673 -740 624 610 711 -722 -460 883 772 -63 -940 107 936 691 -1061
1542 -1061 -488 -87 549 602 -1683 -673 -15 887 -629 -1955 -747 1228 45 -1569 -1054 113 1314
1559 1314 -209 -1123 -178 316 1053 -348 -1095 -291 1026 159 -730 -1449 -271 1032 -461 -1192 -1327 732
1577 732 752 -644 -1382 -516 1273 1134 -629 -1648 1245 1920 352 -940 -750 1956 1168 -747 -1543
1594 -1543 577 1062 671 -1442 -1497 713 919 -226 -2037 -462 1215 652 -1245 -1456 576 1669 314
1611 314 -1401 -287 1067 1488 -188 -1595 135 786 853 -1589 -1747 286 981 -899 -2277 -988 334
1628 334 624 -1356 -1695 -143 931 400 -1082 -889 526 1717 -34 -794 -40 1680 774 -764 -746
1645 -746 344 1241 15 -1150 -1051 565 684 -683 -1226 -656 1301 662 -683 -787 819 1774 696
1662 696 -186 290 1717 1473 719 -245 148 1444 798 -458 -1059 44 578 -50 -1591 -853 456 145
1680 145 -426 -1126 73 574 437 -344 -584 782 1041 711 -619 -104 681 1228 -356 -1190 -372 627 275
1699 275 -1599 -1597 -876 82 -447 -1672 -1245 115 436 -629 -1090 -220 1247 860 -349 -417 677 1309 252
1718 252 -479 -703 862 820 -553 -1160 -688 1051 228 -745 -1311 115 1053 67 -869 -609 1174 1347 476
1737 476 -552 511 1951 1325 -133 -621 1270 1673 339 -1347 -578 1011 719 -756 -1750 -8 1003
1754 1003 203 -1476 -1122 574 594 -144 -1198 -36 1300 1022 -569 -778 958 1527 432 -1422 -552
1771 -552 906 918 -474 -1589 -504 628 130 -1740 -1741 -251 860 -742 -1592 -853 648 826 -933
1788 -933 -864 -227 1321 298 -788 -500 696 1500 -45 -763 -180 1065 799 -856 -705 97 1162 248
1806 248 -968 -681 694 772 -167 -483 -229 1324 824 -65 -432 642 1338 644 -205 -251 990 1177 477
1825 477 -743 131 1234 593 -336 -1102 274 585 260 -1083 -794 641 620 -409 -917 177 590 593 -493
1844 -493 -592 286 613 387 -956 -513 414 884 -357 -1123 -150 496 211 -899 -895 -34 646 28 -943 -896
1864 -896 147 869 -235 -767 -259 912 871 -431 -730 744 1263 12 -394 -550 983 958 -231 -925
1882 -925 -117 1158 216 -629 -820 323 887 -146 -945 -590 1006 627 153 -759 331 1088 811 -272
1900 -272 -597 710 1069 193 -901 -202 604 717 -579 -1268 -89 423 -43 -1233 -1150 578 591 -160 -1336
1919 -1336 -431 532 818 -899 -942 348 999 208 -1180 -307 555 525 -641 -954 -291 724 347 -955
1937 -955 -1011 -42 873 -367 -1108 -252 325 769 -340 -748 300 976 511 -404 -418 459 1317 -49 -671
1956 -671 -261 747 642 -827 -823 97 572 -148 -407 -758 771 614 -511 -354 -115 902 559 -445 -385
1975 -385 523 541 284 -520 -336 648 5 -40 -810 -524 334 -88 -638 -1042 -558 161 -113 -1436 -862 94
1995 94 278 -145 -1012 -167 500 360 -340 -857 -43 694 -143 -879 -138 -170 626 -516 -1018 -151 240 -20
2015 -20 -614 -551 62 853 -95 -181 -445 690 1181 -334 -204 153 990 910 -67 -109 517 1023 144 -33 -516
2036 -516 898 757 -31 -401 4 1147 417 -232 -214 1141 1313 458 -633 77 1373 905 251 -526 255
2055 255 1168 650 -309 -37 517 826 9 -1019 267 709 446 -291 -1091 532 708 -15 -710 -309 476
2074 476 1004 -224 -815 -24 590 960 -560 -351 160 338 209 -1350 -833 369 456 -913 -969 -9 560
2093 560 479 -747 -469 248 1103 283 -402 192 931 987 -1 -93 388 1145 238 -181 -245 46 705 -229 -775
2114 -775 -441 628 244 -439 -430 -132 1000 341 -162 -163 610 858 211 -437 56 985 455 0 -698 390
2134 390 588 125 -598 -717 521 309 -217 -1016 -46 327 332 -458 -632 316 567 550 -517 36 451 316
2154 316 -174 -422 -69 299 647 -690 -684 118 130 -54 -748 -202 75 572 -422 -388 93 618 466 -176 -141
2175 -141 324 1274 345 -284 72 739 839 -32 49 -84 686 397 -385 -551 164 806 148 -668 -494 741
2195 741 466 151 -554 93 811 215 -124 -278 336 953 323 -702 -366 762 285 47 -809 52 436
2214 436 189 -863 -713 390 388 -245 -562 -188 323 331 -674 -692 -40 591 60 -827 -373 228 228 -21 -859
2235 -859 -192 333 253 -1071 -579 -15 295 96 -740 -277 280 475 -427 -326 -190 756 268 -453 -421 1
2255 1 782 201 -301 -95 322 662 -171 -18 91 682 249 -194 -375 262 512 25 -249 -320 382 218 -224
2276 -224 -494 89 418 26 -296 -385 576 531 -331 -708 -240 293 245 -129 -735 190 484 -106 -541 -482 67
2297 67 156 -87 -1145 -379 152 21 -376 -382 -13 197 330 -437 -399 268 653 211 -275 -188 279 735 -527
2318 -527 -286 245 536 -5 -512 -406 -38 510 -343 -510 -162 682 79 -323 -322 249 719 132 -370 -125 608
2339 608 748 -37 -218 198 684 353 -115 -325 272 639 -103 -301 -397 474 414 -57 -641 -43 505 269 -162
2360 -162 -529 259 148 59 -822 -379 253 270 -545 -761 16 282 254 -681 -637 162 145 -91 -766 -262 104 225
2382 225 -420 -505 -71 621 20 -783 112 258 308 76 -448 -60 522 356 -48 -288 52 742 219 -213 111
2403 111 346 317 -272 -395 -19 602 409 -440 -144 374 607 112 -142 -99 709 825 -135 -283 160 786 112
2424 112 -33 -60 289 373 250 -423 -244 479 343 97 -346 134 480 236 -90 -254 440 184 226 -394 -142
2445 -142 453 292 150 -369 146 193 107 -522 -220 356 305 20 -580 43 434 111 -370 -422 -29 321 64
2466 64 -498 -29 157 504 -199 -225 -67 258 236 -367 -239 214 623 81 -117 -367 408 478 306 -162 -266
2487 -266 681 366 -381 -164 -9 512 182 -274 -79 85 172 -140 -248 -53 826 45 -286 -383 41 379 -131
2508 -131 -237 -86 315 346 -28 -406 4 501 -19 -37 -636 101 126 124 -410 -307 251 -9 -374 -503 181 333
2530 333 666 -430 -400 419 807 176 -251 -64 386 532 -131 -88 246 451 151 -352 167 284 243 -105 -378
2551 -378 44 383 271 -103 -39 64 816 261 -126 -11 422 607 107 52 85 541 466 8 -368 51 281
2572 281 -269 -112 -250 87 90 27 -353 -81 381 -80 56 -484 388 297 -174 -603 -364 467 130 -172 -439
2593 -439 0 302 56 -587 -350 200 -140 -208 -620 -297 -139 -42 -233 -171 -133 9 -127 -286 -158 -3 315
2614 315 74 -600 -57 216 164 -257 -308 -76 495 37 -252 -325 134 302 -75 -196 32 97 216 -102 -217
2635 -217 9 365 250 -228 -235 506 335 248 -101 23 392 146 -348 -243 40 293 6 -421 -452 289 135
2656 135 -158 -279 -117 279 144 -162 -324 245 259 -51 -247 -204 -282 125 -148 -642 122 30 -95 -320 -501
2677 -501 185 190 6 -391 -45 238 500 -35 -285 73 306 401 -223 -153 372 289 178 -395 100 351 263 -157
2699 -157 -281 -45 246 -154 -246 -165 269 178 40 -105 -111 474 361 -220 11 28 261 133 -147 -124 405 388 51
2722 51 -106 -165 124 228 -269 -310 4 148 -197 -128 -79 367 237 -6 -464 -138 330 34 -209 -455 116 -40
2744 -40 -206 -537 -329 230 148 11 -226 -194 11 116 -209 -186 -9 68 -25 -366 -291 98 91 66 -548 211 193 183
2768 183 -219 -3 109 557 196 -119 -26 153 86 -18 46 -282 207 185 -111 -101 222 104 -12 -331 -191 448
2790 448 14 -43 -129 -52 385 193 -39 -67 205 401 64 -176 53 234 160 -176 -220 59 379 -115 -209 -277 341
2813 341 242 66 -215 -204 -32 223 -211 -348 204 -62 -246 -389 -209 240 181 -270 -367 268 174 93 -441 -185
2835 -185 68 192 -50 -420 -179 244 246 -144 -322 24 66 282 -480 55 6 344 34 -281 228 101 398
2856 398 -61 -238 177 228 -10 -283 -170 271 490 16 -42 213 340 123 11 -9 -102 259 -21 63 -249 24
2878 24 7 -100 -351 -2 221 -49 -239 -344 -62 -24 62 -506 37 109 -93 -198 -327 -252 371 -145 -384 -378 -310
2901 -310 174 -133 -587 -166 156 49 -275 -459 125 61 206 -379 -341 89 0 16 -241 245 -85 130 67 -88
2923 -88 389 138 148 -157 90 203 155 149 -105 -22 169 303 -44 130 -43 270 286 -34 -58 17 523 235 -141
2946 -141 -67 370 222 -131 -42 183 271 20 -263 -35 -72 2 -157 -293 -285 84 -206 -177 -356 -89 209 -15 -32
2969 -32 -126 128 129 -90 -480 -32 -43 76 -229 -453 -11 113 -236 -224 -238 143 28 -62 -482 -10 156 260 -311
2992 -311 98 120 -34 -39 -310 -68 116 207 -124 -18 24 511 -103 -397 124 156 62 3 -80 -90 -21 268 -305 -245
3016 -245 -78 332 -5 -393 -263 -138 261 -191 -118 -42 39 14 -199 -441 -46 122 -66 -367 -281 59 256 -71
3038 -71 -117 -126 54 -83 -309 -335 82 190 -19 -278 -148 112 35 190 -343 -280 9 -104 -127 2 -38 1 96 -154
3062 -154 -173 351 132 -157 -307 7 115 325 -147 -272 168 165 159 -90 -94 -198 275 -51 207 116 408 193 -221
3085 -221 -135 -73 272 -97 17 -307 174 -23 -210 -89 121 316 319 -68 -48 236 273 -118 25 -77 99 19
3107 19 -276 -149 142 347 -15 -158 -235 283 249 28 -315 -229 466 27 -88 -311 24 -39 -89 -235 -142 145
3129 145 335 17 -268 -228 117 -38 -17 -172 184 12 -165 -438 -164 -8 206 -63 -33 108 273 93 -175
3150 -175 57 325 245 -34 -222 -89 263 93 87 -65 -338 179 383 2 -126 -136 75 -156 -132 -141 126 10
3172 10 -336 100 144 422 49 -77 -24 216 88 -1 -162 12 0 -121 -256 -351 -104 86 -51 -217 -199 -64
3194 -64 322 -130 -165 -214 119 -38 -260 -309 -280 51 40 -323 100 -56 187 -18 -319 -25 182 22 -139 -312
3216 -312 69 81 62 -269 -84 191 116 46 -134 11 225 287 -20 42 181 175 5 -306 31 92 291 -141 -11
3239 -11 103 332 -1 -4 -24 119 40 -103 -59 -33 33 -147 31 -302 137 110 153 -297 -82 49 15 -8 203 -195
3263 -195 -40 119 -128 -120 92 145 -187 -39 -225 78 -60 96 -161 -51 58 85 -85 -203 -2 220 -83
3284 -83 -209 -72 77 102 236 -180 -59 73 149 -203 -239 -13 290 328 -218 111 104 134 -98 -247 -85 90 41
3307 41 89 6 250 295 -129 -157 44 45 305 5 -210 -54 58 10 70 -130 102 119 -149 -149 -208 0 142 147 -204
3332 -204 -18 -212 103 -190 -96 -38 233 -68 55 -248 183 -169 99 -61 -45 81 97 215 -410 38 64 256
3354 256 -110 -309 178 165 -62 -67 -72 76 45 31 -31 232 116 -95 69 38 178 110 -261 -146 189 69 9 72
3378 72 176 99 384 33 96 96 25 292 -43 37 -9 94 80 -85 -186 44 24 -125 -417 -218 -52 -179 -171 -31
3402 -31 -54 321 51 1 -96 65 213 90 25 -65 167 58 357 34 -42 101 32 14 -116 222 75 88 -140
3425 -140 -199 -49 -179 4 -157 141 -156 -6 155 -154 407 -4 -103 0 -61 177 236 -198 -6 8 181 107
3447 107 -116 278 103 -51 -270 8 35 -32 81 143 171 87 34 -90 99 194 -4 45 72 134 104 22 152 73
3471 73 175 3 238 96 -126 -204 126 -69 -63 -162 144 124 75 -202 -154 24 123 -182 -246 -13 129 87 -210 -177
3495 -177 -118 -143 -108 28 -288 50 -171 19 158 -20 -69 -43 -108 -204 -96 181 -26 -85 257 132 138 -176 16
3518 16 -15 -123 193 -150 -97 -314 200 -123 -33 115 85 266 -138 -58 62 2 289 -161 183 -95 345 96
3540 96 0 57 4 136 -209 34 -104 135 -17 -26 23 -2 232 -110 -50 -240 -12 189 -350 43 -207 191 -56
3563 -56 72 22 -122 231 -201 -94 -89 174 -205 -98 -289 -72 -36 -219 -26 -216 1 -337 -215 -268 33 188
3585 188 116 -48 36 111 -86 -58 -233 -179 34 195 0 -61 42 151 57 -172 -68 -70 9 -37 -232 22 100 -136
3609 -136 -65 -40 -64 164 -119 183 193 142 -72 60 61 46 69 66 245 316 -360 140 68 -117 -78 104 19 -45 6 -146
3635 -146 108 -88 -40 -75 28 68 4 189 -276 -192 50 -11 -164 -96 22 -62 25 -57 -7 34 -130 -200 -54 -121 -23
3660 -23 255 -34 119 50 225 -55 -207 84 104 203 -228 187 -7 243 -173 -134 -213 -54 22 -131 150 108 255
3683 255 10 -165 129 84 216 26 -27 191 -1 -18 -148 -94 -6 -12 15 -57 82 -87 -155 181 -178 -4 47 -235
3707 -235 -46 80 204 2 -179 -148 -89 -151 -123 35 -86 10 -72 63 -273 -42 49 -99 85 -179 -201 -61 -83
3730 -83 -121 -127 -16 -114 -258 -54 -131 57 6 -8 -18 -54 13 24 181 -58 -202 22 107 -292 48 192 121 81 100
3755 100 61 82 44 -30 113 -120 87 47 19 -274 95 -49 -65 93 175 164 -22 111 -71 20 245 -30 -22 207
3779 207 46 -46 24 -103 -51 169 100 22 -42 -68 -192 175 -74 71 169 -60 -69 -20 -42 -42 23 -127 10 334 12
3804 12 -168 -138 -157 -43 -155 -109 95 159 -125 -126 63 90 23 -99 155 13 -48 72 65 110 147 -13 -88 180 -195
3829 -195 -117 17 -131 -245 -71 59 48 69 48 57 64 -139 104 23 -367 206 47 -53 -66 -66 256 -130 -194 10
3853 10 109 -65 -40 -67 -141 -23 -83 -208 -86 14 173 -103 36 -10 119 -127 -272 -260 -235 -173 -169 103 -8 -19
3877 -19 -148 -115 -11 -138 238 134 -25 -155 58 -147 -5 120 -83 144 92 -4 140 58 19 205 119 80 230
3900 230 -5 328 20 119 2 -151 5 -264 45 192 31 -209 3 67 201 -114 104 -61 -84 44 276
3921 276 -196 -43 115 149 129 -284 -292 -182 9 -1 68 12 44 -6 211 -255 7 -131 -200 -10 195 28 -236
3944 -236 89 -167 -185 -127 -167 19 25 98 -11 207 -4 50 -102 117 15 95 29 -134 128 -8 -154 264 2
3967 2 -60 175 201 71 59 -186 -58 -118 -6 239 24 107 106 -98 -51 -108 347 172 165 235 170 28 12 -147 -51 280
3993 280 24 45 -154 -62 -53 47 192 -150 -292 141 201 55 -49 103 134 54 -48 29 330 -143 -205 136 -138
4016 -138 -3 -139 3 19 52 43 -210 173 -78 -9 -199 -16 99 -111 106 97 22 78 28 -250 -194 -14 126 67
4040 67 -77 88 127 21 152 -63 -76 38 -91 -47 13 69 -31 -124 38 -156 -13 41 -95 319 30 -135 4
4063 4 5 92 -26 -40 31 32 -27 -49 -33 141 215 -238 0 -65 35 142 45 -73 -3 10 -208 -19 -161 123 -70 73
4089 73 -155 -129 -103 -113 -208 -428 -48 -19 18 -55 -168 -198 -103 -57 -140 -47 128 179 13 285 -57 19 71 49 67 -73
4115 -73 -136 -93 75 12 -62 71 15 -162 -211 42 -128 -240 -220 -11 10 28 195 74 5 -69 96 -222 -191 -51
4139 -51 -17 132 92 -42 15 20 -147 -72 -59 87 -83 -137 28 104 83 -105 -101 -117 -31 126 -94 -64 236 -189 -95 65
4165 65 -69 73 -176 -58 -42 196 110 -4 112 12 -90 244 -8 24 82 -76 169 126 -77 128 -158 -23
4187 -23 140 -138 -86 -10 -53 36 -14 314 -136 -101 64 83 -41 -122 -69 -117 83 -32 53 -68 310 117 50 -39 20
4212 20 46 381 25 -84 126 -22 -188 -5 -107 -75 92 -195 -84 -91 -109 -144 23 119 117 -44 -20 91 -198 -18
4236 -18 -21 201 -183 -16 208 -134 -100 226 77 -41 207 -137 34 193 -44 -118 -38 118 30 -49 148 -115 -10
4259 -10 -120 -48 101 -37 -122 -101 -160 40 -151 62 157 -238 -4 140 -116 -11 -250 -24 -78 15 51 -14 215
4282 215 48 -60 116 91 -1 -125 77 -120 -21 112 198 -14 34 -145 133 -77 64 2 39 153 215 78 -82
4305 -82 -109 -80 -75 -20 -182 -127 -151 -187 1 34 240 -38 114 -248 -12 -70 -5 190 -297 106 -108 174 141 86 107
4330 107 0 -88 -54 194 -97 188 111 201 55 -205 43 -53 -220 -102 -58 -30 162 -119 -141 -228 -13 -69 39
4353 39 158 5 -181 58 140 -26 -127 128 132 -241 -53 -120 -94 -181 -52 -11 255 -129 -69 232 74 103 -146
4376 -146 24 -121 -8 -211 -161 53 -292 -85 -55 1 -41 -113 265 -7 -229 -122 65 -126 -158 -139 -36 -233
4398 -233 15 33 -256 121 -71 -91 317 183 -98 -13 -38 -196 -131 276 120 -64 37 49 243 -53 58 86
4420 86 -10 43 -100 -111 -76 -162 8 105 -159 -146 -194 -56 195 186 -195 -84 51 137 122 -10 -161 -7 91 -51 156
4445 156 -90 102 161 -107 162 95 -38 -109 209 -91 -6 42 16 28 -12 -198 -1 -34 -40 -112 -13 93 163 157 -73
4470 -73 13 -206 -38 -10 -46 -17 23 -185 -185 237 62 -163 -38 -76 70 32 39 77 -369 129 34 96 134 -18 -110 50
4496 50 -98 -108 -130 110 -338 -96 -95 69 124 12 -41 -195 75 -68 -94 -86 151 -206 97 104 115 70 -19 75 62 60
4522 60 -69 -207 -155 30 35 98 -54 122 -138 0 -96 46 -54 120 -90 4 20 -33 54 -56 -85 -84 -13 -203 14
4547 14 159 66 -219 121 -27 -197 -40 -43 -106 -190 -203 5 -101 89 -196 -97 -24 -50 228 129 111 96 43 -47 3
4572 3 -69 87 -177 -59 -19 73 -27 18 -5 40 112 104 255 28 -40 115 80 -5 101 131 -114 -208 139 156 61 -53
4598 -53 -35 -118 -20 207 92 -90 -248 -160 -86 -9 0 -106 -110 55 66 166 -102 -17 -29 47 38 62 51 93 22 169 20
4625 20 -25 142 8 15 318 136 57 112 27 -199 100 129 -58 90 -104 -152 64 120 168 188 -92 198 27 -154
4649 -154 43 -88 35 27 99 58 -310 205 -94 7 -116 202 -36 -28 61 -113 -289 -142 -84 205 -2 84 196
4672 196 95 -20 134 29 98 131 -43 24 -179 -203 -147 -35 -133 -4 -75 84 -155 6 -27 -124 -202 170 -136
4695 -136 68 188 -6 -82 51 -69 -192 -52 9 -6 141 191 -7 30 130 -14 -124 -187 151 -48 -214 5
4717 5 39 42 -42 183 -147 90 -106 -210 41 -42 -6 -98 -31 37 -95 -36 78 -99 196 -151 5 109 153 179 193
4742 193 235 0 -84 -72 47 52 25 -229 -86 40 99 -59 -75 -158 -100 64 89 128 200 10 -111 37 274 -89
4766 -89 -163 65 -10 48 225 -14 191 42 27 239 -156 -11 -13 -151 -34 14 -139 93 -142 51 -86 136 20
4789 20 20 106 47 185 -123 6 99 -84 154 175 -37 -11 -172 -143 -31 -55 -217 -79 10 85 464 -252 -127 10
4813 10 88 167 55 -75 -243 194 56 141 177 -35 -90 -164 -40 -40 -143 37 -77 -107 -11 -195 -155 59 15 4 80
4838 80 -75 -89 -116 -178 18 82 -63 105 111 -302 189 49 -100 -40 31 10 -24 -71 30 -28 98 -54 59 -75
4862 -75 53 -115 67 -338 -73 29 -21 199 -67 -10 97 93 -6 347 -3 -102 -277 35 40 -224 149 -248 -74
4885 -74 -23 15 292 164 25 51 214 139 -82 -57 -85 -73 14 209 16 86 34 -83 -276 -69 209 -112 -95 -217
4909 -217 62 102 -144 -20 -132 -221 0 -46 143 -48 63 -25 96 9 151 50 39 170 -167 102 143 91 -70
4932 -70 -70 -87 39 116 -87 -99 -76 40 107 66 -29 -28 -78 -128 -157 -75 -45 -288 134 13 143 147 347 -78 143 -42
4958 -42 -349 -128 -237 37 186 -10 -51 -47 -203 -86 4 9 -3 0 -33 -19 8 -62 -9 63 49 -80 0 14 231 45
4984 45 151 -95 -115 212 -98 -8 116 -67 -160 203 48 -28 -144 5 123 -125 -71 120 102 -256 -33 35 75
5007 75 132 350 -140 388 28 -12 -237 -81 13 81 80 1 98 -83 187 31 -26 -171 -123 95 114 81 34 -100 -31
5032 -31 -64 170 290 -259 -79 108 -146 -58 132 -143 66 372 80 -161 -2 -70 74 -79 161 -41 8 -202
5054 -202 -117 -73 -54 238 -40 -27 169 123 -32 76 -49 -5 -394 -139 166 -25 -83 55 76 -76 -322 -54 -308
5077 -308 -59 161 -128 77 98 -8 168 -217 35 192 346 -6 -2 -76 -79 -150 35 72 25 -54 16 -2 164 -56
5101 -56 60 10 56 -73 28 332 -14 185 75 -369 75 -50 -116 -35 -158 -181 60 -35 -158 -207 63 -76 32
5124 32 -22 8 33 125 -149 239 156 -44 32 -232 -165 -115 -62 67 -4 -115 101 -35 244 203 -296 -86 97 -40
5148 -40 -64 169 -233 -112 -34 23 264 39 -93 -216 -26 168 82 25 37 0 -22 214 50 -209 -30 -19 -16 -90
5172 -90 226 52 61 63 72 -57 0 87 -188 79 -34 83 59 -143 -28 -34 77 133 -43 33 102 -221 75 51 -323
5197 -323 169 -46 -222 76 -150 187 203 -22 88 234 196 94 -115 -33 6 -46 82 -71 66 -175 -299 -208
5219 -208 77 107 -36 -68 -144 52 -226 68 -4 -87 -43 107 8 -35 217 -72 33 -196 104 -24 -263 92 -53
5242 -53 -1 212 -392 -38 10 18 216 -278 -50 -92 86 -163 -445 125 -102 0 19 -33 -140 -1 51 48 -181 -162
5266 -162 44 -48 -238 88 -123 40 228 -131 7 -178 -183 63 -132 103 196 138 99 -43 78 -26 -3 165
5288 165 6 -181 56 -60 -18 49 63 -154 -330 125 -161 -92 165 -5 17 17 -78 35 83 5 -83 114 150 63
5312 63 176 -112 20 -161 139 -204 -57 36 20 -78 -35 -60 138 64 -43 191 -48 -92 -159 -129 -100 459 109 -98
5336 -98 -106 50 70 200 7 -189 -149 117 158 -38 -10 -65 135 -116 42 55 -231 -179 -43 237 -49 88 125 141
5360 141 -180 -101 34 0 123 42 13 -72 -143 150 -39 -47 -48 175 -3 120 139 -165 -59 -121 98 -67 -139 -30
5384 -30 81 -89 38 -6 -50 -226 245 -42 -61 -54 184 40 88 7 -268 88 9 -62 182 235 -50 -36 37 -251
5408 -251 -33 46 -22 101 36 -108 -66 -185 -62 112 34 -206 0 -131 -51 1 17 -80 -2 107 26 -51 -184 52
5432 52 -56 -68 -3 29 -20 190 -7 162 106 -35 -88 -22 55 23 31 6 -154 -148 136 17 272 41 53 100 90 19
5458 19 -57 120 -168 160 -117 230 6 -43 102 -218 -70 152 -154 47 -115 123 -88 80 86 -180 -45 -69
5480 -69 16 -62 88 -240 351 132 24 63 283 28 51 47 -249 47 -155 103 -115 -37 -53 71 -242 -37 103
5503 103 -411 62 -220 75 -54 -86 -118 -22 -32 -67 -101 186 -152 -109 218 -137 9 120 -136 -21 76 96 -7
5526 -7 -43 98 -1 87 107 57 -70 66 21 -47 -156 -94 82 26 -119 -99 -72 31 -18 -27 -19 191 79 58 74 50 68
5553 68 1 -171 24 6 -193 39 -13 -163 -154 180 -193 171 210 262 37 -128 37 116 -257 -236 -104 121 195 124
5577 124 15 50 132 -200 -246 -166 -93 -206 -158 -85 -48 24 187 29 4 61 151 -134 -144 59 0 168 22 108 201
5602 201 -64 165 71 114 116 -221 -54 68 172 -82 -82 -161 51 54 -83 -81 60 -4 -172 158 -204 163 124 36 -76
5627 -76 -77 -141 72 86 285 52 -259 232 205 180 172 -86 -110 63 -154 -150 132 199 -216 143 -119 -92 -18 -121 -177
5652 -177 -76 54 -55 46 -106 -154 -138 -41 -116 7 32 -86 103 -81 -165 -117 71 78 -138 28 162 138 98 113
5676 113 -170 133 0 -86 223 -317 -76 -156 -73 70 -140 -47 118 98 58 153 111 15 83 -20 295 131 98 -233
5700 -233 -163 -17 42 195 -10 30 -22 75 -116 -7 4 -31 -13 -52 231 -145 46 59 -55 203 90 -156 64
5723 64 -166 -21 33 -44 -140 57 -87 -151 67 95 -12 -248 -22 19 -3 138 -53 -224 -144 -88 17 77 -165 97
5747 97 -8 -276 20 -48 9 125 2 107 136 105 -104 94 180 -43 -52 35 -113 236 3 -106 -139 -87 -243 -81
5771 -81 -4 228 190 -37 251 147 95 -83 132 -243 101 -223 -241 153 245 43 -82 -47 -38 3 -55 59 -136 -162
5795 -162 128 74 -17 -30 -113 -17 -24 254 -55 -151 -61 7 124 -17 88 -136 51 -107 32 -89 88 -103 -122 181
5819 181 10 -12 151 -141 30 -30 52 -192 53 9 181 -91 44 174 -197 -113 -153 -190 -54 -2 82 73 27 -125
5843 -125 -73 -242 -229 148 -119 -59 107 -107 -146 49 -11 79 3 192 -35 97 -304 184 204 1 45 -124 78
5866 78 -51 95 -95 254 -98 64 -104 16 -55 113 -56 -85 10 -36 143 59 -218 -9 143 -71 -215 -75
5888 -75 -79 -70 -59 130 -105 48 -87 44 -57 91 45 -6 98 -28 -120 -144 105 -14 -29 160 321 80 76 95 86
5913 86 55 154 -192 -128 71 254 183 -59 -18 -42 -36 -233 -115 -8 55 -110 -33 70 215 -65 204 -20 -2 -281
5937 -281 79 -4 -80 101 -169 102 -56 -119 -163 -82 -182 78 215 -303 -133 123 -34 80 -13 -130 -67 20 -167
5960 -167 -159 30 -227 -127 -131 -6 -112 -64 -86 152 -10 145 5 -33 43 72 -59 82 -5 -41 28 -55 132 -139
5984 -139 -35 130 25 -21 71 -199 126 -20 -106 18 3 63 25 74 1 -5 -131 -192 -84 -49 -228 24 0 99 159
6009 159 -4 89 -255 -11 116 33 40 -105 81 148 -20 -63 -12 100 -173 -16 116 150 64 178 58 -65 -56 -73
6033 -73 121 -62 53 -37 37 207 74 162 85 -30 90 2 -130 -49 -89 169 -102 -48 308 171 193 291 -169 156
6057 156 109 -104 -20 181 62 -132 56 -201 -32 -33 -151 38 148 329 3 157 280 19 243 18 -106
6078 -106 -126 -78 18 -5 157 34 -77 46 45 37 -167 93 -58 -127 131 0 141 147 -79 55 4 46 -68 -192
6102 -192 65 91 160 -65 64 86 -73 -38 22 -32 100 290 -126 -38 117 293 -45 -92 -60 29 -186 -283 8 -143
6126 -143 -108 110 132 127 208 -117 -12 144 -42 190 -53 -312 -183 -213 60 92 267 -21 -8 -299 -43 -292 -81
6149 -81 -80 -33 30 -20 161 199 88 -16 191 69 -7 -118 34 -116 264 -56 -139 -36 95 2 118 -68 -87 -56
6173 -56 -191 -176 87 -135 140 60 -195 -93 -190 -162 115 -94 -109 9 -30 -18 214 -140 -40 2 208 26 -105
6196 -105 -47 200 75 73 -24 -170 -130 -119 -10 -37 32 51 -274 0 -93 -120 142 92 -85 -49 -11 -336 29 -107 -165
6221 -165 -17 175 56 51 82 209 -1 -56 -38 -77 0 225 137 -102 -82 -119 -85 -54 -3 -170 -202 -57 -138 -67 6 -61
6247 -61 -4 -42 -262 -264 92 -28 21 -42 -258 -1 314 101 9 119 82 31 -95 17 121 -205 -43 90 13 -21
6271 -21 -78 -278 16 -22 -36 -128 -85 -114 57 -80 -127 -103 107 143 23 83 -245 -371 33 -196 -59 -116 -120 90 28
6296 28 50 22 -196 -38 84 -74 -113 84 -163 153 96 172 -3 -222 6 -192 -152 -189 -252 -16 11 71 -126 134
6320 134 42 -266 83 -23 108 -139 -112 95 -12 89 37 -20 131 112 73 -60 -173 32 148 257 0 124
6342 124 -17 205 -154 -50 -174 48 3 -50 151 -72 -98 17 23 27 -136 23 167 89 -185 12 -115 -266 70
6365 70 -93 -37 -67 -89 -99 -23 -174 1 -165 8 116 -182 -13 135 -68 10 -68 -136 20 146 150 -42 68 1
6389 1 -223 37 28 5 29 -28 -105 147 -26 -8 -75 139 62 -48 61 81 -205 -262 -73 -126 -108 -59 -106 -138 263 -5
6415 -5 -252 42 31 -48 -23 -27 -75 130 -264 -30 122 -23 -123 -140 131 150 124 -167 -107 4 -42 64 38 -168 -83
6440 -83 -15 -124 403 63 -31 99 213 -26 89 161 -68 128 -101 0 -98 29 7 68 -131 43 61 -6 -90
6463 -90 91 -33 145 67 -279 -138 -110 -6 -61 -28 -54 -2 -26 192 -222 -126 260 -102 -58 91 -9 80 116 -116
6487 -116 13 81 99 93 131 128 -165 -209 169 33 55 -108 -57 71 0 87 230 98 148 173 -67 105 12 -67 -100 29
6513 29 86 119 2 -30 -51 136 125 63 -84 200 206 163 -95 45 56 -23 -11 -162 94 -42 -38 48 -95 -144 -68 -256
6539 -256 -50 36 43 -30 -9 208 -19 194 -209 155 -27 -109 -220 -12 -51 -241 156 -178 5 100 -188 -131 18
6562 18 34 26 -119 -112 -168 -39 28 41 -8 143 119 -27 -125 -13 -75 64 192 -98 -32 -35 20 -11 -58 -38 6 77 9 88
6590 88 -54 -126 -82 -48 97 120 -65 -85 189 -3 183 60 -183 -107 -195 28 -169 146 -129 78 -135 -232 -232 -210
6614 -210 -55 -192 -116 196 260 168 31 35 155 5 -97 285 -176 159 -160 113 398 -4 106 117 -176 21
6636 21 25 -111 -13 31 91 -159 38 394 105 -14 -101 -45 160 -14 -48 -138 176 -154 145 42 -21 -122 131 16
6660 16 189 41 24 195 -55 23 20 -32 3 -9 -153 -236 -124 25 152 -61 -43 15 -20 18 143 -53 -122 -70 13
6685 13 43 120 -6 56 140 89 -50 -24 173 31 184 20 196 37 170 -44 49 23 199 -176 -337 -59 68
6708 68 -367 128 47 -69 56 148 84 -174 139 212 -9 -44 33 -146 -20 19 -114 16 -147 18 40 -268 -98
6731 -98 89 -245 264 39 57 29 -103 64 -191 -73 -72 -15 -198 201 200 -188 101 86 10 107 -19 -220 99 46
6755 46 151 40 187 25 108 69 -66 134 8 -162 -79 -86 -37 -26 -66 -225 34 -3 38 -30 143 -171 60 -83
6779 -83 -183 305 -51 167 -80 231 206 -45 125 -45 -52 60 -29 56 64 5 -124 -11 1 -49 57 121 270 -35
6803 -35 -30 -59 -4 270 -74 -32 211 86 139 186 3 12 297 37 -95 -63 76 -79 18 76 -177 84 236 -123
6827 -123 24 -18 -136 -71 40 -107 -245 -140 -84 -57 -23 -119 52 -3 148 124 12 -35 157 145 3 44 -42 -113
6851 -113 -38 -115 -10 -107 -9 -64 -48 -87 -33 -100 46 -73 -29 16 128 53 -7 115 53 -136 -96 -45 -84 -4 -8 296 123
6878 123 -24 77 -62 -54 -26 127 141 85 111 -46 -29 -11 -94 23 -163 162 58 -33 -67 -43 51 4 -3 -172 -139 -35
6904 -35 70 -104 176 11 155 117 63 -26 -108 -48 33 73 -243 -90 -176 86 357 -41 -51 -9 -103 -168 -53 -80 73
6929 73 -5 140 -207 -209 140 -93 -16 -12 -103 28 -92 58 194 135 364 -44 -54 299 -14 -351 -77 -68 -55 135
6953 135 -63 72 -21 239 -8 204 56 -324 -194 -1 10 -16 171 20 -78 104 28 175 -96 -91 -112 76 90
6976 90 16 -175 -67 74 98 171 157 -91 -148 -73 -118 -37 15 3 75 27 -116 -154 3 -170 43 -219 -73 -44 -64
7001 -64 -60 -76 -4 66 -154 122 -24 50 -161 -168 -103 -39 81 -75 80 -213 149 34 158 -38 133 85 5 -93 -192
7026 -192 46 105 -75 69 -222 -239 -42 -87 -12 -48 -94 28 -83 21 -113 -175 -11 296 -140 15 -33 72 274
7049 274 -27 -36 87 -168 246 30 -7 -25 -140 48 -46 147 -118 54 -71 -3 109 -142 27 -37 38 23 40
7072 40 -204 -145 2 70 8 251 -137 -71 -29 -97 8 -78 -89 79 -99 -213 127 -201 -263 65 156 40 86 -72
7096 -72 -36 72 -49 74 10 24 282 -14 -134 81 -114 293 -155 -50 16 -57 8 0 -15 54 -135 57 223 111
7120 111 243 -15 72 -254 -278 245 144 -125 201 -130 148 -27 -172 42 -4 29 53 43 492 -74 -245 58
7142 58 -101 80 125 182 -309 -16 -52 57 -104 -53 -163 -76 -135 54 -293 83 57 124 -114 -11 13 -99 -124 -28
7166 -28 154 77 154 -42 -23 -56 83 -126 -86 95 -53 152 162 -233 69 -94 -38 -48 -49 74 -42 -93 205 87
7190 87 -8 75 100 30 125 69 34 70 -134 -203 13 -235 -94 216 -96 4 7 111 130 54 108 56 -44 140 357
7215 357 -313 -48 -139 -136 -198 0 152 217 70 -157 -122 -8 168 139 -18 -77 32 -202 163 -152 -227 -6 20
7238 20 15 165 271 138 96 -30 -98 12 28 169 -21 58 56 -265 3 87 -68 81 -262 116 -61 -181 17
7261 17 318 -126 -107 -4 0 -46 -70 -11 117 -35 -85 94 -159 -136 -171 66 163 -104 -45 -27 362 -239 -299 12 -23
7286 -23 -92 -151 -105 36 -91 53 -74 -129 -3 37 137 8 -200 118 90 55 66 123 -31 43 -163 200 107 -22
7310 -22 28 147 -29 2 135 -66 139 133 230 2 49 -239 166 60 -95 -174 -226 -179 256 -305 5 -108 291
7333 291 193 57 -15 -1 -173 -32 70 -155 155 28 75 198 32 -5 49 42 8 -178 -108 -86 -156 -41 -156 -85
7357 -85 36 -28 -119 -238 148 -55 59 46 174 82 91 89 -25 286 97 -318 51 -44 -75 227 -150 -181 58 253
7381 253 -112 -19 135 -82 172 -2 -173 132 -22 26 348 -182 301 223 -6 83 31 12 -80 76 89 222 92
7404 92 -140 0 61 -85 -30 237 134 -208 -39 -224 105 -17 -117 99 63 24 -111 -149 -42 13 83 84 -270
7427 -270 -96 72 -143 185 0 -213 -47 -18 138 -76 155 -192 -158 -33 -32 -119 245 161 6 132 58 -31 -28
7450 -28 -235 -82 190 140 -63 39 239 -14 65 170 -350 -10 -90 -97 -36 -11 148 -162 12 -205 -152 4 129
7473 129 -8 -79 -89 209 -111 -51 -187 -56 -116 -147 106 -258 -51 83 130 -110 -118 -82 -178 23 102 -111 -211 -103
7497 -103 -38 15 -126 74 -38 -18 49 -23 24 -9 35 -59 -88 -230 64 297 108 23 -23 -23 17 -129 -225 -47 0 -203
7523 -203 59 -58 89 -124 221 42 47 -93 -16 -14 -124 -8 -196 -57 -87 12 124 2 -103 262 37 -20 -110
7546 -110 324 -242 -180 -213 23 78 -126 -111 -54 81 70 134 59 24 -122 196 -160 130 -166 -223 24 -130 192
7569 192 -25 20 114 -29 112 174 128 -27 7 -344 107 51 -257 8 -49 -168 -239 -56 118 -22 -164 -90 -10
7592 -10 135 -41 -10 -43 -55 299 -87 -247 39 -195 28 -170 -121 47 -36 127 34 19 -46 30 -200 361 55
7615 55 -60 -115 105 -176 -98 216 134 38 101 -30 210 -30 125 -38 82 27 -108 199 220 -70 -24 334 -51
7638 -51 -36 95 -89 -138 -227 -3 -35 7 138 -181 -79 -128 -41 -162 26 -32 -64 -51 249 119 36 -75 1 19 6
7663 6 -52 41 -240 -5 95 -61 159 16 219 -175 -70 56 36 110 123 123 -35 -141 -256 44 -78 74 -34
7686 -34 -292 86 -103 145 -66 44 8 34 -19 82 -99 -56 -20 31 -58 -147 9 56 162 130 -82 -355 -18 -9
7710 -9 -74 117 -16 -76 -85 104 98 -217 -24 78 -76 293 -44 242 -8 -64 36 -87 -53 -156 -22 15 -46 62
7734 62 -29 137 102 -140 -227 -133 179 -13 -163 209 -86 17 10 -162 -131 -18 82 123 31 91 21 287 -151 69
7758 69 198 175 194 45 69 60 -40 126 275 58 26 -75 -149 -162 -110 79 58 -120 141 263 -162 -58 -21 -14 29
7783 29 -79 20 -209 95 -100 -45 -220 -153 175 38 -78 -1 170 -9 -218 -83 -26 -10 21 -165 174 114 305
7806 305 -2 -46 -9 116 -183 73 -130 19 24 -56 -75 -50 97 -4 9 -284 -134 48 215 4 -162 58 -300
7829 -300 62 -89 60 49 -99 -36 -28 37 94 120 -115 117 10 -125 -25 -140 145 133 -69 11 96 -81 -135 92
7853 92 173 -260 124 86 33 175 -130 228 71 157 -65 -49 96 202 166 146 -89 115 43 63 68 -16 223 -44
7877 -44 170 91 -100 -6 -138 103 -65 256 139 37 -13 36 -5 -90 -13 69 103 -122 -19 -91 -48 -63 71 91 417
7902 417 -173 212 208 20 111 75 -63 63 38 283 303 -214 95 229 -46 143 -31 76 -90 -133 51 -32 172
7925 172 -65 19 -23 165 56 -222 10 -233 32 -14 -158 -215 41 86 25 56 -5 81 -46 -22 -68 284 58 168
7949 168 258 50 71 148 46 -12 108 56 70 63 25 8 -164 6 -65 -20 -215 20 10 -117 64 149 -121 55 69
7974 69 -40 120 -296 -223 97 -114 89 181 -38 -190 -72 21 -75 -187 -378 -62 -175 -90 -89 127 -8 -31 -34 -48
7998 -48 139 135 4 -7 11 49 308 -95 -110 -11 -38 -17 -50 3 -116 100 282 142 -340 -109 -54 -185 -285 -202 -106
8023 -106 -27 -152 -39 127 -88 -10 -137 5 86 -220 93 -31 13 14 -83 178 -27 162 -349 156 -28 20 115
8046 115 -297 14 46 5 133 19 -101 -166 -37 22 -141 -2 -93 300 -138 -61 187 33 24 100 16 52 91 -159
8070 -159 -40 -18 -221 -30 -207 -91 176 208 84 275 46 -24 1 -3 72 -99 44 67 79 92 -13 -157 13
8093 13 -106 -50 -214 22 -49 -19 -66 -90 138 276 47 79 -230 -3 -321 16 -92 -173 -117 -148 228 125 -104
8116 -104 -127 142 -2 -135 96 37 -38 -48 -164 129 115 -215 308 121 -1 50 124 52 -59 60 145 63 176
8139 176 -168 -86 172 18 159 -97 51 -71 -7 37 76 71 -147 166 232 32 159 180 -58 137 104 -158 27
8162 27 -95 -68 159 -12 -105 -32 117 -130 -186 -145 -39 83 74 -56 207 -228 0 115 -118 52 -100 37 47
8185 47 -76 -186 89 150 -201 -96
8191i6
$$ Imaginary data points
##PAGE= N=2
##DATA TABLE= (X++(I..I)), XYDATA
0 0 0 0 0 0 0 0 0 0 0 0 0 0 -8 8 -8 8 -15 16 -16 24 -24 32 -40 47 -54 63 -72 80 -96 108 -123 142 -160 182
34 182 -205 230 -256 288 -322 360 -400 444 -493 545 -604 666 -734 809 -892 984 -1081 1191
52 1191 -1314 1451 -1604 1772 -1970 2196 -2459 2771 -3143 3603 -4185 4947 -5991 7524 -9976
67 -9976 14551 -25961 116581 132998 -95421 42841 88555 46864 21744 -9094 14060 67512
79 67512 -38208 -31371 36385 -31212 -34482 44030 -32065 -69579 28708 21829 -18766 4553 -14467
92 -14467 22653 58489 -7998 -6565 62409 20201 23729 39241 -21399 23324 70775 -12503 -31127
105 -31127 26525 14863 1163 -18110 -29771 19941 10459 -34845 -14186 9666 -13315 4045
117 4045 11743 -27641 -9221 25954 4429 -20367 -7064 1772 10449 -14243 -32015 6324 -952
130 -952 -28472 -12821 -6544 -27394 -10879 4295 -12827 -22502 -8682 20928 5377 -18410 1249
143 1249 29571 14408 -9673 7825 25184 10892 -8123 10619 11452 -9900 -7890 3725 -1178
156 -1178 -22752 -19567 -3486 -1281 -24835 -29321 -2257 4823 -16262 -25177 -1619 7337 4104 -9407
170 -9407 -10157 14538 14757 -2344 -1338 8975 4803 9704 4278 -5930 -495 2898 6358 -3713
184 -3713 -16122 -9440 13421 1854 -24521 -14116 8116 10304 -11562 -18165 -2789 16362 4515
197 4515 -15812 -8595 7317 15936 -1348 -15981 -5609 18160 9612 -14972 -13296 4529 15832
210 15832 -2452 -17120 -8214 9848 9387 -6551 -14278 -4199 16775 8548 -10833 -10717 10959
223 10959 18383 733 -11282 -1953 18709 12109 -5813 -12513 3205 17423 5388 -15669 -15768
236 -15768 11950 14569 -11164 -23496 167 15873 -1948 -17826 -9704 11527 6487 -6834 -8868
249 -8868 -149 8106 6815 -1238 -11166 729 12781 7663 -12526 -11328 8884 10607 -5379 -16490
263 -16490 -1397 9007 628 -12683 -9013 3209 5544 -1209 -12023 -2657 8208 7095 -4309
276 -4309 -7245 4420 10305 4698 -5242 670 5682 6952 1665 -2794 919 3265 5112 -1903 -2930
291 -2930 -1304 4689 2766 -4298 -3723 2092 6547 -321 -1039 -1497 4274 8049 1743 -919 1480 6714
307 6714 4731 3124 -2526 847 5439 2346 -571 -4458 -503 2235 2638 -6850 -7401 2163 4838 -2371
323 -2371 -9183 -1522 4991 5939 -4710 -6322 3971 7446 3777 -3820 -3261 2763 9755 -938 -8997
338 -8997 -3115 5072 4532 -9931 -11535 -1430 6469 -3822 -14528 -8382 3839 6306 -7875 -12172
352 -12172 -2288 11501 4937 -8405 -5056 8006 13980 1302 -6277 1228 14100 9054 -2893
365 -2893 -5556 2972 14439 3322 -10113 -7429 9233 10714 -4750 -13450 -967 14758 3683
378 3683 -9452 -6783 8954 10749 -1079 -6463 -1187 10833 6948 -4896 -9139 2289 8900 1863
392 1863 -11303 -11240 7702 8065 -7050 -13343 -392 10616 4063 -7328 -4920 10006 10103 2943 -3598
407 -3598 3013 11387 8854 769 -5819 2978 9402 2608 -10701 -8016 1561 2249 -8154 -16455 -5598
422 -5598 73 -3804 -11301 -9158 -629 2934 -1152 -5154 406 6180 9403 2198 573 7061 10661
437 10661 9326 1594 2080 6094 8779 3659 -1087 -900 4113 5423 -1571 -2077 -1136 4732 2707 -2542
453 -2542 -43 2992 3588 1743 2004 -387 2518 3578 3251 -758 -4051 2214 3251 -402 -7289 -3200
469 -3200 3580 1652 -5094 -4353 1987 3093 3633 -1474 804 6680 7817 5794 1387 3786 9039 10261
485 10261 970 -2413 3033 8364 1672 -8684 -6167 -488 1668 -7824 -13968 -7300 -391 -3077 -11148
500 -11148 -10165 -3529 3389 -2586 -7461 -4068 4953 8404 -1995 -5232 1558 10860 6287 -4833 -5608
515 -5608 5734 9641 -1937 -8283 -4105 6464 3049 -7228 -9048 -875 6730 -1458 -10353 -6903
529 -6903 5415 4259 -5910 -10765 -1808 7854 -1442 -9690 -8117 818 2335 -4791 -10560 -6930 1452
544 1452 -86 -7169 -11359 -1509 3981 -1110 -8258 -6856 5438 5802 -3017 -6832 859 6348 5047
559 5047 -3784 -6515 3049 5883 824 -9490 -5114 4325 1925 -7696 -9916 -798 2694 -3359 -10014
574 -10014 -3914 695 731 -1871 -5955 -1145 3075 3715 -1485 -3069 1649 6121 2618 -2292 869 2902
590 2902 5486 628 -892 1214 2771 4771 177 -2625 925 6265 1556 -2119 -1808 3710 4564 -2012
606 -2012 -881 338 1970 1343 -369 -1557 -1123 876 1792 -236 -5045 194 3004 523 -3751 -3375
622 -3375 2815 2146 -1151 -3820 -1332 2460 3273 -3008 -4495 1249 2559 1889 -4684 -3540 2309 2357
638 2357 -1816 -3704 -2220 638 3142 -2583 -5184 -1758 4763 2163 -6650 -4549 3041 6257 -2466
653 -2466 -7385 -304 6471 1099 -4163 -2554 266 5942 877 -4673 -3154 4078 6141 -2126 -5976
668 -5976 1100 8798 1588 -4962 -2431 5585 5962 -1442 -2770 -675 5331 4930 -1081 -4921 988 7411
684 7411 2474 -5409 -4519 6416 5089 -3231 -5890 765 6419 1439 -4502 -4557 2892 5449 592 -6848
700 -6848 -2715 6324 3635 -4240 -6429 2676 4674 -1806 -5167 -1313 1624 772 -1402 -5011 -2420
715 -2420 1334 2829 -3194 -7642 -370 5628 504 -8137 -2392 4881 2574 -3737 -3764 1714 2444 603
731 603 -3206 -1114 1002 2197 712 -3454 -2247 2678 3404 -3812 -3085 734 2633 873 -2656 -1228
747 -1228 1067 2559 -123 -1202 -1597 1523 3375 -420 -2838 -145 3926 309 -1744 -1317 689 1964
763 1964 -597 -1751 -1993 961 1317 705 -3337 -1772 3033 1748 -1564 -3017 1244 2402 1146 -1934
779 -1934 -1032 1592 1772 921 -2471 -1666 1369 3453 -1907 -4714 -287 3059 888 -5116 -3418 1354
795 1354 2764 -2733 -4844 -1222 1369 2050 -2800 -3924 123 4250 990 -3180 -1864 2420 5504
810 5504 -364 -3452 -55 6362 3744 -2610 -2437 2203 6530 1091 -3942 -1945 5009 3901 -2337
825 -2337 -3888 -79 5003 666 -3975 -3743 2508 3847 -1514 -4783 -2137 4672 2430 -3325 -5267
840 -5267 1278 4839 184 -4531 -2935 3737 3167 -1592 -4647 215 4593 1300 -3695 -3780 2721 3453
856 3453 -321 -4864 -1693 4127 2618 -2055 -4346 1121 3677 1580 -4350 -3358 2035 2589 -1637 -5445
872 -5445 -929 1581 367 -3907 -4614 -138 1979 -733 -4841 -1826 1556 3092 -1140 -2806 986
887 986 3861 3446 -1267 177 2901 4346 1995 -430 627 2950 3729 -778 -1628 -446 2598 784
903 784 -3072 -2944 -72 1345 -1664 -2718 -2309 624 700 -1085 -2102 -1719 2168 948 -1182 -2067 464
920 464 1898 507 -2009 -2226 1468 759 -557 -3524 -2031 1023 514 -1765 -4411 -1018 2239 322
936 322 -3747 -1854 1373 1823 -264 -3080 -45 1498 1522 -1392 -3162 -862 1809 627 -3949 -3817
952 -3817 2 2765 -2637 -4878 -1424 1188 1468 -2321 -3008 409 3708 1535 -920 -1564 3507 6513
968 6513 430 -2037 1220 6435 3389 -2696 -1565 3480 4186 -394 -3280 -1922 3259 1722 -2314
983 -2314 -3504 -1235 3931 837 -3334 -2470 2708 3656 -445 -3109 275 4432 2175 -831 -2786 1356
999 1356 4764 764 -3540 -2867 2636 3092 -1853 -5400 -70 3174 399 -3617 -3174 1943 1691 -513
1015 -513 -2958 -1093 2940 2797 -1601 -3534 1327 3626 1578 -3719 -1935 2450 2146 -1417 -3327 -341
1031 -341 1612 155 -2549 -2101 -118 2074 415 -3017 -188 1835 2795 -155 -1731 1123 3188 1859
1047 1859 -654 -536 680 3077 273 -1198 -903 1079 2435 -1612 -2120 -357 1628 550 -1825 -2085
1063 -2085 665 1947 -285 -886 -1621 1573 2205 -349 -1411 -550 2357 1208 -1014 -1777 590 449
1079 449 8 -1655 -2018 400 225 -152 -2441 -1683 686 1392 -1197 -2853 -96 2095 1687 -2518 -1111
1096 -1111 1057 1920 473 -2789 -227 2166 1479 -1591 -2162 -124 2539 518 -3283 -1198 1009 2453
1112 2453 -942 -2224 -100 2060 2339 -1162 -1919 884 3870 1035 -1760 -1494 2411 3540 -1110 -2375
1128 -2375 -164 3029 1291 -2697 -2436 969 2502 -725 -2871 -1965 3022 2013 -1608 -3028 66
1143 66 3577 954 -2640 -2093 2549 2283 -843 -3162 -707 2615 641 -1965 -3253 341 2433 -565
1159 -565 -3660 -2125 1844 1464 -1504 -3836 197 2468 643 -2427 -2036 1705 2173 -33 -2444 -684
1175 -684 2101 2036 -1539 -2395 817 2158 1046 -2830 -1505 1683 2207 -737 -2288 391 2145 1930
1191 1930 -1001 -550 1145 2844 1363 -1367 448 1858 2388 -77 -1084 499 2147 943 -1397
1206 -1397 -752 50 1415 -258 -1362 -1408 841 1336 -379 -1237 -686 1831 1000 -386 -1289 716 1827
1223 1827 199 -589 -807 1044 943 -438 -2103 -1237 886 107 -1340 -2763 -276 375 -146 -1841 -2044
1240 -2044 211 615 -192 -2064 -645 868 1554 -385 -1928 356 1835 1055 -1986 -1085 656 1600
1256 1600 -445 -2351 -758 1254 1330 -1747 -1593 -243 2235 785 -1424 -971 1871 3175 147 -1204
1272 -1204 267 3101 2284 -1018 -1582 762 2856 94 -2151 -1563 1644 1991 -1085 -2379 -410 2394
1288 2394 528 -1552 -1739 1118 2305 313 -1520 -1020 2769 1887 -801 -2212 697 2789 580 -2214
1304 -2214 -2002 1486 1333 -1105 -2859 -972 1300 391 -1748 -2533 371 1668 515 -2659 -1193 1919
1320 1919 1798 -471 -2286 883 2389 1192 -1639 -1217 1417 1769 71 -2143 -730 1219 1231 -1460
1336 -1460 -1936 553 1277 517 -2133 -789 1302 1624 -292 -1142 342 1694 1865 -651 -977 403 2277
1353 2277 878 -1350 -231 1238 1114 -946 -1333 -339 1341 124 -1175 -1016 -214 1167 -247 -961
1369 -961 -1448 850 1482 -347 -1272 -667 1300 318 -437 -1479 -39 860 -192 -1049 -1419 131 594 -322
1387 -322 -1942 -894 752 492 -727 -1625 184 771 451 -1284 -1093 616 1218 328 -1263 -177 721
1404 721 1843 -452 -1286 291 1392 939 -1149 -996 856 1892 -99 -1327 -626 1604 1624 -1363 -895
1421 -895 162 2162 1077 -1613 -842 1825 1900 -235 -1099 -91 2398 912 -874 -1114 233 2117
1437 2117 -249 -1638 -899 1014 1192 -754 -2289 -719 1870 248 -1323 -2138 356 1800 -561 -1887
1453 -1887 -700 1522 1094 -994 -2452 299 1680 353 -1621 -2175 1317 1246 -951 -2350 -769 1198
1469 1198 888 -2049 -1970 836 1061 113 -2122 -492 1506 857 -404 -1676 291 1985 1104 -1552 -602
1486 -602 575 1940 487 -1730 -114 1261 1268 -393 -1289 98 1751 534 -713 -427 574 2460
1502 2460 45 -978 423 1273 1678 -630 -898 582 1836 181 -862 -1069 661 1206 -826 -1050
1518 -1050 -725 812 613 -1324 -1003 133 572 74 -783 -1299 1110 638 8 -733 -710 1049 480 -534
1536 -534 -1385 -577 445 65 -1623 -1481 45 97 -129 -1569 -786 480 309 -310 -1557 -125 1337 842
1554 842 -1319 -389 842 1562 -25 -1416 416 934 951 -282 -1105 228 1014 -4 -1002 -728 268 1566
1572 1566 -349 -1233 -238 1114 1777 -472 -666 512 1857 983 -770 -950 1092 2196 -468 -1307 -752
1589 -752 1401 946 -1128 -1413 143 1183 -572 -1437 -1393 1022 798 -358 -1548 -309 1812 559 -929
1606 -929 -1174 1024 1554 -32 -1408 -406 1207 419 -776 -1814 198 646 62 -1531 -1817 537 1027
1623 1027 -713 -1934 -70 1261 1063 -938 -964 1178 1808 832 -1026 -122 1399 1197 82 -1352 183
1640 183 1218 810 -1495 -1266 260 818 -211 -1890 -498 634 955 -815 -848 226 1576 1061 -702
1657 -702 -315 1044 1478 105 -567 188 798 499 -681 -1228 -437 253 -636 -1691 -1602 -292 405 -906
1675 -906 -1504 -887 536 189 -537 -1242 161 1076 25 -485 -1106 636 574 -77 -1143 -837 244 89
1693 89 -775 -1719 -613 106 -189 -1461 -1254 81 304 -9 -872 178 1050 1069 7 -483 713 1106 1116
1712 1116 -503 -289 735 1044 -55 -1307 -594 55 629 -1190 -1307 -369 1077 136 -1063 -391 545
1729 545 1533 61 -575 418 1709 1590 -369 -352 482 1649 688 -973 -995 679 776 -922 -1450 -1228 444
1748 444 92 -1229 -1944 -45 956 -525 -1228 -813 1166 845 -466 -1411 69 1318 488 -908 -1220
1765 -1220 479 860 37 -1575 -876 968 445 -839 -1584 -3 720 295 -1074 -748 836 1022 -96
1782 -96 -901 363 1425 1242 -400 -699 980 1335 556 -834 -492 847 1147 -286 -1191 61 1031 687
1800 687 -849 -828 594 1253 12 -927 -187 894 1087 -484 -359 217 1097 975 -339 -523 685 1165
1818 1165 16 -938 -435 587 584 -910 -823 -535 613 -202 -944 -899 -253 520 -292 -1121 -757 555 268
1837 268 -499 -936 392 767 -9 -667 -664 660 656 -68 -990 -519 443 236 -367 -1343 180 729 70 -948
1857 -948 -744 590 656 165 -693 215 651 843 -145 -284 744 1332 879 -730 -312 864 1050 -290 -766
1876 -766 -240 757 822 -577 -851 -257 905 142 -830 -446 505 878 -197 -781 -31 1317 385 -338 -600
1895 -600 332 982 224 -619 -916 467 435 -640 -1261 -665 847 137 -983 -1454 363 855 -228 -771
1913 -771 -768 989 810 -51 -1084 82 948 560 -965 -1064 823 694 84 -1376 -448 842 183 -1088
1931 -1088 -1358 -97 862 354 -1084 -485 914 1067 257 -761 309 993 846 -31 -566 706 1079 350
1949 350 -730 -229 544 1113 -72 -1190 -236 479 510 -1091 -979 234 726 -273 -1054 -333 650 735 -852
1968 -852 -416 -133 649 399 -691 -546 336 761 -476 -890 -700 255 -88 -801 -1059 -855 574 -3 -692
1987 -692 -946 30 553 -82 -1031 -288 751 314 116 -979 15 765 286 -499 -706 254 897 -22 -1050
2006 -1050 172 455 651 -317 -1058 577 702 334 -332 -202 674 873 442 -371 290 812 1386 -321 -326
2025 -326 430 748 420 -537 -580 360 608 -320 -486 -692 387 554 -748 -600 -336 744 319 -505 -584 459
2045 459 623 -210 -970 -302 958 94 -795 -781 -374 572 -320 -1346 -974 320 -190 -865 -1303 -378 457
2064 457 -278 -494 -905 419 774 -204 -609 -322 484 496 -149 -1100 89 498 183 -1083 -1000 424 173
2083 173 -506 -1155 -572 461 229 -565 -617 339 640 771 -651 -411 919 763 23 -628 -113 528 586 -343
2103 -343 -537 -108 642 -67 -911 -400 44 568 -175 -886 38 670 511 -369 -99 343 1235 222 -487 -5
2123 -5 568 722 -255 -397 -239 396 65 -696 -763 -61 494 -581 -715 -526 516 472 -385 -422 444 873 288
2144 288 -52 -141 688 764 410 -222 19 1011 451 -170 -568 351 389 425 -289 -468 476 575 232 -590 52 759
2166 759 952 269 -299 522 679 406 -431 -59 742 861 283 -546 42 450 749 -448 -778 -80 732 231
2186 231 -657 -408 232 732 -325 -392 -69 369 439 -180 -517 -272 1011 88 -567 -357 243 420 -408 -966
2206 -966 -412 329 81 -484 -772 -156 266 -398 -537 -517 423 419 -204 -621 198 827 300 -141 -706 352 500
2227 500 130 -422 -106 648 499 -257 -825 288 518 356 -419 -513 473 437 296 -583 -22 566 395 -317
2247 -317 -305 193 764 651 -437 -134 368 670 46 -706 -243 475 337 -281 -318 29 297 -84 -711 -9
2267 -9 -20 512 -396 -474 -145 284 411 -515 -139 -38 587 -103 -196 -480 57 638 -219 -405 -127 206 184 -491
2289 -491 -313 42 338 -156 -551 -491 281 68 -478 -643 -318 628 262 7 -244 496 585 277 -325 -93 360
2310 360 290 -24 -595 40 618 609 -304 -355 381 466 341 -368 53 365 457 -58 -144 178 540 632 -693 -325
2332 -325 23 565 158 -431 -152 426 328 -422 -780 51 599 -205 -569 -511 -49 429 -310 -334 -368 226 300 -617
2354 -617 -519 -294 391 -282 -445 -428 464 340 -201 -432 -380 433 69 -589 -629 183 366 -46 -473 -437 661
2375 661 427 -195 -337 148 538 254 -219 -465 186 492 148 -644 -110 386 209 95 -178 414 449 -10
2395 -10 -195 -161 247 550 557 -593 167 383 245 -216 -449 123 389 275 -346 -200 315 437 -224 -437 -393
2416 -393 76 428 -597 -480 -13 268 -74 -445 -242 423 67 -344 -433 -466 103 218 -441 -394 -379 386 64
2437 64 -511 -412 115 259 -187 -549 -351 401 19 -59 -436 -200 571 -76 -469 -254 431 292 40 -703 490
2458 490 669 207 -160 -390 246 102 272 -363 -128 146 328 -94 -506 139 358 373 -55 -28 463 227 239
2479 239 -73 -4 401 644 39 -501 -133 317 467 -515 -310 92 130 -217 -479 -230 400 392 -342 -181 -112 457
2501 457 67 -122 -266 193 603 -301 -370 -293 445 450 -176 -386 -65 474 -144 1 -125 303 500 190 -76
2522 -76 61 630 577 198 -72 732 715 423 142 -210 662 394 445 -350 223 569 498 -295 -73 502 551 142
2544 142 -520 91 669 409 121 -251 483 532 486 -56 172 199 527 452 -370 91 414 437 -148 -239 -56 368
2566 368 179 -288 -223 -24 300 -124 -402 -201 116 135 -494 -220 -92 279 -103 -384 -441 358 298 -317 -266 -324
2588 -324 127 116 -454 -304 -71 -8 -143 -186 -527 200 118 -53 -210 -110 491 310 -45 -142 362 640 365 -185
2610 -185 -109 588 361 -107 -432 15 349 184 -386 -286 83 409 60 -401 63 365 410 55 -5 79 208
2631 208 361 -225 -165 215 319 0 -23 -21 128 329 -180 -418 -225 262 19 -323 -204 -78 124 -284 -252 -234
2653 -234 283 244 -158 -147 -307 540 87 -289 -265 246 235 -324 -176 -446 340 -14 -293 -292 -118 319 -48 -163
2675 -163 -348 358 229 109 -296 -192 305 241 -164 -31 53 381 190 -322 -12 470 186 -8 -317 70 255
2696 255 326 -171 -411 32 387 -13 -322 -95 19 356 -213 -280 -36 274 647 -219 29 267 290 92 -367
2717 -367 -424 44 308 -455 -360 -170 276 171 -227 -340 -120 412 -166 -196 -303 11 200 -194 -132 -413 234
2738 234 149 -314 -133 -39 274 -101 -86 157 438 59 -369 -290 53 184 119 -145 -157 167 172 190 -164 256 358
2761 358 192 186 -361 116 202 220 -212 79 351 87 -31 -275 241 378 269 34 -122 157 29 -23 -402 -5
2783 -5 175 252 -205 -268 12 -81 199 -420 -218 36 118 -82 -436 -61 -14 251 -229 -426 -137 -113 85 -194 -223
2806 -223 -1 138 -322 37 24 386 202 -224 -125 -255 171 -88 -107 -305 149 159 -498 -48 -33 400 124 -47
2828 -47 -94 127 323 42 -63 -70 407 163 -69 -178 115 426 118 -31 -186 133 543 300 -346 138 187 480
2850 480 54 -317 121 197 342 -159 -94 22 460 12 -76 -121 74 400 -364 -104 -19 -52 255 -271 -82 -48
2872 -48 213 50 -448 -124 -11 106 -485 -64 -228 123 66 -191 -157 84 285 20 -176 -144 409 175 228 -203
2894 -203 -176 425 -23 -152 44 166 265 120 -266 -15 83 171 39 -115 193 632 95 -39 2 180 343 -19
2916 -19 -85 281 318 163 253 -123 311 75 157 -83 -114 93 141 44 -353 155 168 341 -291 -248 -44 -138 342 -333
2940 -333 5 136 28 74 -419 -224 190 287 -53 -134 -207 106 -150 -406 -185 169 129 -72 -129 -35 423 -306
2962 -306 5 -200 13 377 76 -180 -285 48 -1 -190 -228 -107 238 -248 -202 -206 -63 -34 -344 -121 -119 204 78
2985 78 -38 -196 159 448 8 -4 -169 213 -35 216 -284 -7 266 200 -26 -206 354 50 40 -366 -108
3006 -108 411 272 -88 -308 -66 167 -143 -371 -447 139 -19 57 17 24 -15 51 -128 -381 -204 -75 222 -340
3028 -340 -252 -48 337 -280 -78 -128 43 53 -155 -172 -84 406 120 -120 -54 234 235 -21 -169 -318 168 -221 -206
3051 -206 -62 -234 241 -129 36 -154 98 100 91 70 -266 212 312 165 -132 258 359 158 117 43 140 88 90 -224
3075 -224 63 240 -74 -49 -235 24 -86 152 -117 -202 119 -22 -134 -209 26 -4 -36 -62 -120 130 22 8 -299
3098 -299 -114 -340 216 -256 -229 83 8 -155 -230 -220 -42 34 -207 -250 -226 316 163 -270 78 68 17 -103 -7
3121 -7 -96 97 385 178 -246 74 141 -59 -274 -257 51 156 151 32 -16 186 264 -11 -108 -6 413 305 146
3144 146 63 99 125 145 -40 47 -66 236 165 -183 -73 223 193 -214 -269 145 -5 89 -305 -85 351 228 -226
3167 -226 -190 70 228 208 -112 -307 69 144 104 -182 -136 -46 -55 6 -107 9 -93 -37 -290 59 25 131 -83 -127
3191 -127 -308 117 -51 -192 -64 -173 150 -259 -9 151 252 61 -122 -131 8 -57 202 179 -118 73 155 13
3213 13 -23 -108 171 -81 -239 -185 16 177 57 131 -80 186 56 46 122 39 143 75 67 -189 -94 186 212 -85
3237 -85 -260 196 383 -96 -173 46 -12 284 201 -191 50 225 170 -37 -46 -212 59 169 -238 6 -48 -98 -184
3260 -184 -61 -164 27 8 -39 -214 250 315 41 -391 -7 85 276 -11 -268 -132 335 64 -162 -3 260
3281 260 304 188 -34 22 128 231 180 25 85 277 179 -71 -175 141 -53 195 122 95 364 253 34 -187
3303 -187 248 141 222 -111 195 296 -140 -154 -355 -226 -67 -6 -295 -191 -203 -200 -39 -198 23 141 103 56 -143
3326 -143 -164 0 73 -288 34 125 -111 51 -300 25 -106 -21 -82 -260 19 316 88 1 55 53 35 -33 29 155
3350 155 190 76 18 -179 124 256 -31 -63 -127 -63 80 -286 36 37 276 242 -96 -85 6 217 78 -143 -91 106
3374 106 67 11 23 96 73 299 63 -164 194 35 13 -86 71 -139 144 -70 -250 -66 -141 189 -28 -132 133
3397 133 79 -258 -102 -44 -175 172 -193 -412 170 -25 18 -83 -233 122 271 -125 2 -252 203 174 -159
3418 -159 -22 8 -66 -233 97 -59 -49 547 66 121 1 57 66 167 19 72 63 146 -137 -43 3 9 40 -119 48
3443 48 294 261 -321 52 -28 198 223 -188 -32 92 279 8 -80 210 -57 165 33 -108 140 -51 -21 -133
3465 -133 5 -346 17 -91 -256 59 7 5 -25 -58 -27 54 84 -104 -76 -83 154 -167 -71 -19 -83 333 -15 -189 -102
3490 -102 89 11 -79 -34 53 181 -242 -4 111 149 269 -188 -7 -25 -81 -171 -156 102 371 253 168 181 125 191
3514 191 18 -9 -166 53 276 181 61 63 63 79 79 -133 77 74 33 110 -118 -8 87 -109 -125 -76 224 36 -89
3539 -89 39 -59 -78 194 -306 -55 -182 103 170 -95 374 36 70 -57 -117 -8 -216 243 -272 -3 124 -174
3561 -174 -50 -37 -21 -195 -237 5 -125 -99 275 142 10 -185 -41 146 -319 -51 15 74 80 23 1 2 168 36
3585 36 -18 72 225 104 -32 23 66 25 -275 12 -224 155 204 177 -85 -268 40 -102 123 -22 16 78 -68
3608 -68 -83 48 186 67 53 -226 22 68 72 -109 -198 33 41 -77 -287 -17 56 63 82 -50 -49 182 61 3 -23 -11
3634 -11 123 154 70 -38 -134 52 -149 89 -249 121 -123 -76 -130 -125 63 -105 44 -18 -109 -4 127 -24 -226
3657 -226 249 -80 -3 22 -95 249 155 44 185 186 -228 49 0 48 189 11 17 -119 71 225 21 -168 -125
3680 -125 -40 29 40 -144 232 -32 101 -22 -187 178 114 144 -22 71 105 -46 -99 64 -15 166 193 45 27 -45
3704 -45 67 -8 -136 -186 91 141 -156 -157 -46 -49 -35 -164 -76 -90 108 57 -93 -22 185 -98 -205 4 9 99 -91
3729 -91 -2 15 194 98 -86 -119 163 285 268 153 171 41 -26 -113 -21 89 -12 98 -98 14 -19 73 -124 24
3753 24 -94 34 124 -173 36 186 15 172 -121 -20 95 70 138 -86 31 -144 54 26 -4 -24 40 152 -6
3776 -6 -79 99 25 1 -322 50 -141 -133 108 -179 -5 -139 -1 -252 -81 -197 253 51 -106 -198 -16 -36 132
3799 132 166 31 233 252 -72 -47 100 58 165 -33 -17 272 172 -189 259 -125 176 37 -112 -57 32 -70
3821 -70 -31 -10 10 -90 124 137 -328 -181 26 179 -77 -349 59 119 158 -2 100 59 114 -239 -187 -4 -50 -91
3845 -91 41 -165 -133 -54 -166 -169 -146 160 73 124 28 138 13 129 97 56 186 146 -253 -20 59 -79 -32 -229 -14
3870 -14 -251 141 -33 24 152 -172 -104 -104 -211 -18 -190 174 -131 -28 -99 -97 -103 45 84 347 164 165 214 147 85
3895 85 -43 3 -226 4 -155 35 -173 -121 275 28 0 -207 101 91 -145 122 -7 72 -81 67 -162 165
3917 165 83 59 -211 -191 -208 -176 55 -98 44 -305 70 23 -211 104 -171 0 -26 -72 147 -110 54 -118 47
3940 47 -23 124 -129 -80 -16 39 259 -194 7 38 349 105 -27 -9 88 86 206 162 285 43 135 92 -200 92
3964 92 123 -266 148 58 153 185 -110 112 -96 67 -8 63 1 59 82 137 91 -131 12 112 52 10 23 203 124
3989 124 -231 -46 104 -103 -84 -4 -278 -88 229 161 -336 -196 -74 -31 -173 25 152 -28 209 -214 -144 108
4011 108 36 -15 -116 -107 19 288 -38 -164 161 147 -111 -149 141 302 89 -194 55 56 163 162 107 103 -10 163
4035 163 -168 205 128 215 14 -56 -128 256 173 101 28 -343 -12 161 -3 -154 -7 28 -196 -76 -222 -56 233
4058 233 170 -165 -292 232 42 62 -203 -315 57 -57 -25 -143 169 -79 -146 -193 -172 10 79 -96 171 163 56
4081 56 45 -248 71 -191 -103 -138 98 105 -179 161 61 -65 -115 210 -81 -111 145 2 114 65 -115 -54 177
4104 177 357 47 -35 -76 -128 -104 -113 -151 -8 39 -81 86 45 -108 59 173 67 66 9 66 0 61 -13 -162 -128 90
4130 90 -210 -11 -76 139 -124 -46 19 -99 -112 81 77 -64 -76 -176 -117 -244 174 58 -104 110 -13 7 -212
4153 -212 -41 -14 -87 158 187 -94 -246 11 197 112 51 -90 256 87 56 -120 -15 87 -26 -16 161 161 41
4176 41 -175 100 52 8 30 -213 -101 -186 85 38 46 111 -149 34 1 71 -7 35 9 160 201 -7 165 -31 24
4201 24 -71 118 -97 -51 45 60 162 -175 -83 170 144 188 -113 67 189 -44 -31 60 -5 -191 49 70 -98 -61
4225 -61 -36 137 55 -4 31 -18 -90 -157 105 -24 -272 -137 58 133 38 9 124 -46 -277 -68 32 57 90 358
4249 358 142 -156 51 107 -17 -22 22 28 210 199 31 -64 120 -130 106 83 -25 -79 -35 -34 34 130 -20 -93 38
4274 38 -119 117 30 235 76 -149 -4 -283 10 -36 -2 135 39 -380 -119 137 242 -135 -88 197 34 -87
4296 -87 142 95 -49 4 0 -64 80 -230 90 46 -71 93 93 -105 76 -4 -72 -67 -46 -50 42 110 -24 -93 63 -33 -163
4323 -163 -30 94 -227 -93 66 -24 121 177 254 -151 153 62 144 227 198 190 -20 -40 -37 33 -64 138 11 -65 -70 74
4349 74 -115 -88 66 -66 54 40 83 6 -10 133 7 3 223 -43 -18 -18 45 -113 71 86 -91 -216 -116 -15
4373 -15 212 76 30 9 -95 40 196 114 186 -115 148 161 280 -246 39 -133 -91 226 -54 108 -3 -60 80
4396 80 -239 139 -87 173 -48 64 -14 54 36 156 72 126 -11 12 20 -246 -90 94 113 3 165 88 -84 69
4420 69 105 134 247 310 -49 88 65 -211 -145 37 -69 374 -76 76 64 -228 -163 1 -132 140 122 -60 44
4443 44 -15 62 -100 -176 116 97 5 51 201 -56 -26 47 -221 111 -22 71 8 -23 -41 223 26 54 40 -35 197
4468 197 -188 -189 3 121 -162 57 -217 -109 74 196 -72 12 131 26 -4 -225 -206 202 -99 119 -214 -19
4490 -19 116 -27 -7 23 241 76 -157 -141 84 -43 -100 -81 42 -39 -130 -5 12 -231 4 -85 -63 -52 128 316
4514 316 105 -144 -137 -99 -18 11 -371 6 173 21 -231 217 44 -92 -63 76 108 -69 38 -174 384 161
4536 161 12 170 -49 168 77 -97 -134 3 78 128 -31 -50 -25 12 -61 49 -15 -203 281 65 -36 7 20 134
4560 134 -98 -231 29 119 -105 247 -27 43 19 205 33 -31 -27 -30 18 -16 148 311 -206 -144 -32 -17 64 -61
4584 -61 150 -19 -173 -91 -144 -10 -12 161 38 187 -77 -135 -71 -122 79 -122 -89 -176 -8 44 -31 143 10 140
4608 140 52 -94 101 -58 -101 104 -55 42 69 10 -51 91 -79 0 30 -77 142 176 -27 58 4 126 39 98
4632 98 84 29 -73 -7 -69 -20 85 21 -177 28 321 -32 92 157 -139 -51 -121 142 -169 151 163 61 -72 86
4656 86 -198 37 52 14 -49 123 46 -223 -199 -24 133 79 -231 -22 185 -115 93 -309 -141 96 7 -147 -250
4679 -250 164 152 -93 128 58 -20 -15 309 -71 80 -55 51 -192 -161 1 -47 33 113 -34 12 65 93 100 68 67 38
4705 38 -7 -87 -133 -3 148 20 -112 360 -49 -13 -149 -236 121 -194 337 -6 -167 -154 -176 -369 65 -218 -93
4728 -93 -115 -76 115 16 182 -35 -175 -32 -85 -31 -61 -67 250 46 -99 -156 -248 30 -265 -35 -33 -57 152 -51 46
4753 46 -80 -66 -372 -48 144 161 266 27 167 148 -117 -20 338 69 102 -62 -27 -47 190 21 278 -144 29
4776 29 25 36 85 -92 54 -184 125 26 -290 -240 30 146 -29 -109 109 -277 -54 -13 -169 131 -63 39 47 206
4800 206 17 -93 -109 87 54 -63 -186 -98 -27 238 -22 -93 -48 143 123 -99 83 -202 212 -102 157 126 -109
4823 -109 82 22 48 -164 -82 165 -137 61 -56 185 -84 4 181 -127 -93 40 3 65 70 200 20 46 291
4846 291 -26 -134 -267 -228 -42 136 -152 -180 316 -189 -132 239 -147 53 -140 78 -27 164 -45 -13 91
4867 91 166 144 -10 -357 -196 35 -151 -254 -47 -106 -234 -138 84 -43 -27 -18 -5 14 -242 -122 -46 48 -35 138
4891 138 -239 64 189 131 -27 60 -92 31 -221 -241 105 11 -123 107 -295 -186 98 -187 -184 430 8 58
4913 58 7 -148 232 -68 205 -201 -112 31 213 -86 -2 192 -185 -145 112 185 -148 -157 50 73 -55 -34 23 -65
4937 -65 -173 175 19 58 156 274 50 94 -138 39 -101 -96 2 -59 190 -104 -45 -32 47 -50 -217 96 12 68 -61
4962 -61 59 -30 22 -131 75 -221 -60 -22 -19 -100 -46 127 -92 280 170 107 -5 72 -179 -28 214 128 -4 63
4986 63 -40 241 -130 293 80 -26 24 275 250 -81 17 189 -158 227 98 -125 -18 -45 -143 -36 -18 -37 139
5009 139 87 -214 2 -100 -92 78 102 178 -100 -66 1 46 -40 -142 -49 141 34 -159 -78 -69 -92 184 113 -96 42
5034 42 48 19 32 -96 179 195 -57 -20 35 96 -103 38 -4 86 -80 -11 99 32 -145 -272 16 -174 -67 25 -61
5059 -61 23 -282 118 320 -142 -171 -77 -159 -45 131 -72 64 -148 237 89 -45 264 -37 91 -75 -70 30
5081 30 5 78 -97 178 -54 -115 90 178 71 -148 261 -167 383 -93 155 24 -78 151 194 279 32 18 -58
5104 -58 76 -14 -98 61 -185 28 158 -320 147 -118 -47 -145 -120 -142 -177 -62 -84 21 -59 -11 -122 62 30 11
5128 11 -123 -220 -103 -18 -165 117 20 -159 -25 151 -83 136 76 165 -205 84 -27 -66 21 28 11 84 48 -171
5152 -171 221 -179 54 -140 -165 -233 99 131 67 195 64 -55 -205 -83 -34 244 1 -66 -28 -135 -25 -107 65
5175 65 -69 -51 -74 -153 64 40 96 -188 6 40 119 -74 46 36 -313 241 -153 106 -96 -218 -86 -37 -47 -40
5199 -40 117 -34 19 -256 -122 42 11 135 55 126 265 -152 125 0 106 -44 -15 -77 55 58 -47 2 16 -99
5223 -99 11 -31 115 -30 -99 -40 24 -198 -85 -324 -281 -70 32 10 -99 54 -156 -29 97 -254 -63 66
5245 66 -38 14 88 -30 106 -43 239 -41 -79 3 -22 -117 24 86 42 33 -53 58 -53 155 -103 -132 44 157
5269 157 39 24 222 -112 -156 -43 -51 192 87 244 -63 -232 -138 -3 409 -11 100 8 -177 -168 -68 -113 -272
5292 -272 75 -263 195 85 -37 240 -237 -133 -23 -53 24 59 -82 61 90 298 -116 -47 -150 -3 209 82
5314 82 -334 112 105 210 117 -170 -115 -33 -203 73 70 -118 -87 -51 -78 -91 98 -221 63 -46 52 1 94 86 44 -125
5340 -125 80 77 -61 -92 63 -42 264 -29 171 62 9 61 106 -115 -226 35 -197 -39 31 -74 -6 -49 -34
5363 -34 -79 174 184 108 216 113 -81 -217 -12 81 119 -138 275 -262 -211 284 -54 322 -270 83 -158 57
5385 57 14 44 58 160 -97 138 60 39 131 -20 -151 16 -231 20 -13 29 50 -7 -150 -67 144 -89 -126 34
5409 34 -54 -128 7 17 26 160 -94 -105 104 9 17 28 4 93 -34 -166 -31 -49 -96 -110 -90 -39 -103 125 116 -52 -375
5436 -375 33 -18 -55 120 -14 33 -237 3 -73 -137 84 115 86 66 -4 185 -175 -220 -4 82 47 126 83 56 -123
5461 -123 -105 -42 128 86 -22 99 -15 -60 -18 -43 181 40 -105 96 68 32 37 34 -143 -93 -171 23 -172 -113 -2
5486 -2 -82 38 209 56 -108 -127 -33 -231 100 -176 -24 -58 -123 22 109 171 -257 0 -20 38 -30 -219 16 -12
5510 -12 -8 -43 -53 -114 -36 189 26 -73 44 -156 73 -24 -32 171 63 -81 -80 71 -54 22 128 228 -13 -33 153
5535 153 -61 142 242 86 125 66 32 86 -105 -163 236 -194 168 -55 -73 -12 76 -219 -241 -10 -19 -60 46 185
5559 185 156 218 110 -53 -97 47 85 -69 -321 134 52 83 -99 -77 -114 -33 107 41 209 187 48 50 129 29 103
5584 103 6 90 104 253 -50 220 -93 -112 150 -147 -62 14 -4 118 4 37 -195 13 -254 -108 41 -156 176
5607 176 26 -198 -43 146 -28 178 109 103 -84 -84 94 -18 84 120 132 54 122 -59 27 83 -95 -5 100 210
5631 210 99 84 93 84 -21 147 -43 -310 -111 -118 -161 166 189 -64 -116 256 -362 117 -110 229 -36 -89 109 -175
5655 -175 -77 -138 -70 -118 -3 -135 0 224 -54 -43 131 115 -227 142 -43 -79 195 55 -89 -81 117 132 -183
5678 -183 -64 -18 -368 -122 146 -103 -78 -135 -151 -36 92 -227 -90 253 -100 89 -219 133 -81 68 67 107
5700 107 -95 3 -51 -63 63 -33 -163 17 -52 10 -88 72 -14 70 -1 125 -114 10 -21 -1 -251 -105 15 3
5724 3 -82 -312 85 7 29 76 -127 214 171 219 84 61 166 20 58 -156 238 -37 -177 -227 183 -141 -165 -117
5748 -117 3 -128 -127 -163 170 85 -86 288 67 -51 76 -77 174 105 -11 70 -38 100 155 28 -110 57
5770 57 -65 -51 -134 76 49 101 -15 -198 12 -84 -96 -39 -87 -173 131 -64 -158 -4 -24 159 -32 286 -176 21
5794 21 117 -148 19 188 122 39 -146 -38 1 -225 -123 -182 -106 -315 24 -73 253 -228 -2 -70 -276 199 -7
5817 -7 26 -94 -99 -125 -6 30 -44 103 -301 88 66 139 75 34 70 -49 21 118 85 82 4 -15 -43 -128 -144 -93 -2 -54 62
5846 62 -130 -37 84 -16 210 169 -30 200 55 -248 -76 174 85 101 178 -130 5 67 -211 82 -162 117
5868 117 161 -74 -144 24 -123 368 -131 97 218 110 -164 -72 -144 -54 123 85 132 -38 24 168 92 19 0 119
5892 119 19 -7 49 -17 219 -66 -88 74 -15 -43 106 192 -92 13 244 -47 -88 -59 -2 248 85 -266 -225 73
5916 73 23 -304 29 69 5 105 9 -172 63 43 72 -177 251 -223 159 3 -141 149 -30 269 -120 74
5938 74 112 -93 -28 -117 122 21 111 -148 128 26 -51 1 171 83 84 127 -22 -126 -129 241 -102 86 -165 -149 277
5963 277 61 100 322 24 24 -137 168 169 -39 -133 43 -26 210 -74 -153 -28 118 -54 -147 -93 -12 -12 41 -123 199
5988 199 99 99 -253 -93 -111 -77 238 -84 1 -102 -1 -226 109 -113 42 82 142 -165 54 -159 -92 160 245
6011 245 305 -43 -218 -96 -110 -73 -155 152 -182 -72 91 42 -45 150 138 -154 174 151 53 -150 68 123 -109
6034 -109 81 176 -52 31 -13 6 54 -48 -136 -117 -18 135 108 73 118 28 -11 -14 46 74 -121 -62 245 -30 1 -241
6060 -241 -104 220 57 -25 -136 -213 -57 50 121 86 -52 70 -142 19 103 -246 182 56 83 -212 -187 -70
6082 -70 -138 154 -144 10 110 121 -176 -191 122 65 31 -58 160 -180 -88 -317 -6 -128 -88 -103 -4 -4 -33 -1 90
6107 90 -123 118 15 -107 -33 145 117 192 71 60 -105 126 121 144 147 -143 297 287 -188 -13 154 140 46 143 17
6132 17 -98 6 40 -137 -7 164 175 59 -86 42 -57 -26 127 -35 -7 -197 47 -105 -34 -34 283 39 -111
6155 -111 -141 94 -87 -68 -42 273 -120 -102 37 106 -167 -18 -108 -55 -86 -95 72 160 -52 -80 -97 86 44 137 4
6180 4 -225 -99 84 -25 59 85 251 292 -57 116 10 -82 -50 -171 -27 -197 15 121 177 -37 262 -179 91
6203 91 164 -8 245 -217 48 -4 55 55 136 139 202 -41 122 -223 -2 32 38 -309 -63 -1 98 -107 109 109 -10 -37
6229 -37 -48 -16 -195 1 -113 5 135 -125 -23 -102 -42 -136 -115 118 247 26 53 45 151 31 -63 -125 34 -110
6253 -110 -8 40 262 -122 8 -176 -149 12 -23 -78 -36 93 -166 -21 -266 103 55 -31 -54 22 1 -18 -70 39
6277 39 96 -117 -201 148 -1 87 -83 3 -92 238 127 216 -103 8 -7 155 114 40 52 -213 -83 104 53 -54
6301 -54 57 -47 87 -212 124 162 -127 -82 41 -54 -310 13 152 36 -166 -126 -1 125 21 166 -104 26
6323 26 -244 52 69 16 229 -6 -53 -72 110 9 213 17 19 -173 16 -97 -10 -83 72 -11 -64 128 -88 -181
6347 -181 -68 95 -148 -99 27 -128 -104 14 -192 -213 21 -88 -220 124 102 -71 -157 -55 59 30 92 69 129
6370 129 61 48 79 210 237 105 19 -95 -209 113 -238 26 -120 152 256 -199 103 63 -8 -64 -18 82 -38
6393 -38 16 -125 99 20 236 23 296 160 60 -56 -155 83 64 31 -13 -4 163 197 -163 18 -122 -84 164 11
6417 11 -103 -10 51 -63 51 83 63 -38 -156 18 -53 77 -19 31 228 10 40 -229 158 -295 46 58 348
6440 348 129 -187 209 -125 209 12 -160 79 -62 48 -89 -32 107 -143 -41 -97 -217 -219 180 50 -31 87
6462 87 -98 -73 -64 53 -7 27 55 100 241 151 -137 -66 -74 -55 -104 -40 -108 112 241 -183 -10 31 69 -24 -88 37 -25
6489 -25 -14 -15 -99 -107 179 -80 151 278 -24 -71 -156 146 -47 -105 -63 92 58 -71 -72 -51 -199 -69 -53 249 -105
6514 -105 -6 135 -65 149 -135 -135 -266 -57 -24 -2 14 -1 -168 -115 46 5 101 -105 -33 267 -27 84 -87 -11
6538 -11 47 -81 -59 36 -49 -94 50 35 -173 -4 71 35 25 86 89 98 -48 -179 43 30 161 -23 67 -62 -75 24
6564 24 -50 146 21 -31 14 -75 38 -49 -242 -140 76 -106 169 286 5 56 -114 242 -49 -99 55 -4 -27
6587 -27 -29 -32 10 -48 87 22 44 -55 -173 -189 56 -108 -34 40 -58 21 79 -74 -3 41 -362 91 -94 62 135 188 -184
6614 -184 280 113 44 5 -62 32 185 -52 -21 28 89 240 -58 133 53 7 -188 30 -208 127 111 -171 54
6637 54 20 -229 -113 81 24 -128 -6 -143 -13 136 -12 -180 154 -43 -135 104 -64 231 -119 147 103 -55
6659 -55 117 -129 127 72 203 -81 41 92 -65 -23 -86 -77 75 -110 -185 -75 183 33 -21 -332 -146 154 93
6682 93 -12 120 114 115 -115 239 72 -233 97 15 67 -47 110 3 125 -135 24 41 -120 -63 -39 -166 -78 187
6706 187 29 -235 5 -96 14 -126 396 -29 -33 184 49 282 121 -135 -180 -45 -68 -370 83 157 -40 -359
6728 -359 -7 -186 5 5 -139 -14 -42 222 -49 202 20 95 -30 16 -173 -108 193 -10 136 -31 58 -45
6750 -45 -126 -48 -42 -250 -9 -33 35 168 103 -191 -4 160 -147 -15 -19 49 20 -201 -42 -6 -65 -23 -33 51 189 184
6776 184 -83 113 -42 156 31 -132 -64 -140 62 0 -33 -12 179 -112 189 58 30 66 80 -42 -18 -128 -59
6799 -59 -45 167 -78 17 69 253 119 -294 -12 11 135 -146 -10 -67 -97 -15 -17 25 97 -31 -123 117 59 44 -213
6824 -213 -171 261 15 -78 -125 69 17 -117 57 137 -76 -66 28 105 207 216 -322 93 175 -103 91 -74 -129 22
6848 22 -32 127 -67 -111 -258 78 -16 -35 -80 -91 -18 -119 27 95 118 -101 234 42 -235 52 -103 4 219
6871 219 43 -135 -51 -48 10 39 1 3 14 -70 153 205 -107 28 -111 86 45 -235 -308 -67 -254 -28 -14 -66 11
6896 11 -24 -6 -95 -310 90 49 205 -11 -3 20 167 12 187 16 71 -45 -37 -54 45 182 -145 -55 62 -80 -166
6921 -166 -119 -116 117 -59 -99 184 -57 -196 99 15 8 -173 75 103 89 -44 -109 23 76 79 -166 -74 186 106 19
6946 19 -88 -7 128 165 -44 -84 -43 -284 5 -58 19 11 -139 -106 197 -98 35 -6 67 164 -78 -162 182 136 208
6971 208 24 -69 94 -59 -124 25 -280 181 -5 2 119 -8 100 -303 109 34 -90 127 -182 -155 -52 212
6993 212 261 30 92 -297 51 -149 -61 -32 126 52 111 232 -29 -15 77 195 -107 -88 -163 36 98 250 -35 44
7017 44 128 -126 36 0 17 277 163 -122 134 242 -237 -24 -255 59 78 -39 231 100 314 2 -53 -35
7039 -35 -112 -2 -123 162 -183 125 161 119 251 23 -33 -151 136 -190 127 -188 -57 -42 -38 -81 78 -287 189
7062 189 -157 -220 -49 -3 -172 34 273 -113 92 -55 -82 282 -116 -45 -129 -71 -27 -182 14 150 -10 76 8
7085 8 -175 -40 -106 88 159 -49 -36 208 27 77 -13 78 -57 50 -156 -65 -88 -86 -146 3 33 -23 -3 55 49 -314
7111 -314 40 52 -14 -53 -31 -110 48 -159 66 -12 -118 143 -42 76 -42 84 -49 44 -4 -1 -99 -115 121 160
7135 160 -85 -28 -101 195 -72 110 2 -93 75 31 67 -48 151 136 -85 1 37 -129 115 31 14 211 123 264
7159 264 48 121 -66 -186 224 -70 109 -2 -21 -37 336 149 228 134 47 110 230 115 -25 -153 -54 162 -7
7182 -7 -10 -112 54 -77 39 68 15 57 105 -89 195 13 -81 -152 40 -148 -4 244 -149 -341 -123 28 4 -88
7206 -88 -54 -162 70 87 -119 91 214 -151 -16 -51 -96 -107 -183 195 141 -140 -64 31 53 31 -89 74 -250 140
7230 140 217 146 -9 209 147 303 -204 136 -49 -35 -13 -102 28 -136 -141 -196 -15 -71 74 -51 167 -90 204
7253 204 -59 -189 84 105 129 -30 14 -130 162 156 5 41 -62 -58 13 8 204 56 -218 -81 171 -77 53 178
7277 178 -225 99 68 34 133 29 -212 -9 -44 -127 -38 -145 37 88 -74 -32 63 312 281 -58 -10 -56 -202 -66
7301 -66 -57 -10 216 -219 10 -261 -64 -101 -169 -104 -200 -107 18 97 86 -70 177 -66 -137 211 -11 -75 -112 5 -100
7326 -100 55 124 -36 -210 175 14 44 -112 2 88 68 -28 201 -38 -200 -40 -60 119 65 52 -91 -165 35
7349 35 103 -77 89 360 42 -240 159 218 -156 102 80 121 77 -110 21 77 25 37 9 -238 69 -26 -197 108
7373 108 97 -77 -57 -12 -40 -86 229 -117 61 25 69 -142 -97 -114 64 65 -18 102 -151 -76 -85 129 11 -38 52 43
7399 43 -13 -1 -1 -65 189 222 36 -185 64 -178 186 165 146 62 64 143 -114 27 77 -9 -58 -78 30 29 -140 145
7425 145 -92 -12 6 -83 -27 109 171 230 -10 113 87 -12 -160 -422 8 93 -16 21 119 -163 70 60 -80 104
7449 104 -8 154 -39 -83 -28 -52 242 -162 -191 -90 153 -17 -103 -40 198 -248 33 31 -122 73 -227 -174 74
7472 74 74 279 -214 197 152 -27 107 -32 -132 -15 -59 -11 -62 -40 -57 -163 120 87 280 20 -16 -197 53 187
7496 187 -67 -4 -43 -158 54 -255 -95 91 -47 6 87 29 -156 28 -183 51 57 -40 -3 -234 -85 77 78 -133
7520 -133 60 -22 -156 -22 180 -116 79 58 170 45 58 -18 0 219 -68 -55 399 -86 -23 -75 94 -59 -153
7543 -153 56 5 -46 58 271 -2 114 -26 140 58 94 -123 66 -273 -40 96 -108 64 -76 -47 5 -26
7565 -26 -181 35 187 23 96 -101 -82 147 -39 62 -67 53 -188 -278 15 65 31 72 -18 -282 133 71 155
7588 155 -63 -194 71 32 -92 -166 67 -137 55 -315 80 133 160 21 18 -105 119 89 -42 103 -100 -7 118
7611 118 -92 -35 52 -50 -107 -26 122 233 -183 22 69 40 156 173 29 25 -116 60 81 -223 -213 46 9 -46
7635 -46 128 -164 -127 63 145 -215 -59 -143 15 113 -75 -1 -131 81 2 32 -207 -140 -188 -95 -213 -125 41 178
7659 178 156 -326 28 85 15 -21 19 -64 245 -161 -62 46 61 -47 160 118 68 -54 -200 -110 -55 -73 -100 96 -143
7684 -143 -19 -161 8 -84 55 -132 -123 -111 -38 29 34 17 -106 -320 -27 23 -68 98 -145 2 0 -90 62 -111 84
7709 84 -3 13 -51 48 -62 114 -19 -6 37 112 1 1 -81 75 -108 -313 91 -88 58 -50 30 2 -104 20
7733 20 106 -22 67 130 -173 17 47 -5 85 -150 149 -129 -83 157 -86 49 -93 188 129 49 128 27 -61 44
7757 44 -185 -109 67 67 -88 62 8 197 14 -103 93 -45 -21 -171 -104 -69 -80 -209 -7 98 2 168 -139
7780 -139 -20 250 -21 143 -4 -263 -38 201 58 -4 -119 -49 -33 -77 82 -26 -26 75 -113 137 135 225 82
7803 82 -36 -48 331 70 51 158 212 15 -9 216 173 19 -36 -175 -53 67 149 77 247 72 89 176 135 127 -51
7828 -51 -42 94 -202 278 -51 33 26 152 -156 49 -166 -111 28 19 -65 -81 49 -33 135 -58 101 -187 -127 100
7852 100 18 70 -70 199 -38 101 -196 -7 32 -181 196 -135 -111 65 -98 104 11 -104 -68 36 126 -53
7874 -53 18 31 -123 241 -112 3 -17 -140 -129 88 -249 51 206 -30 -18 -154 -71 -129 160 -166 -163 -39 80
7897 80 120 -155 18 -95 19 -18 17 205 -49 3 -50 135 77 -58 -122 55 -139 -46 -83 22 106 -198 -197 -40
7921 -40 -123 -139 219 -34 -112 42 -148 -9 218 118 -121 -7 3 124 48 179 9 -37 38 72 209 136 16
7944 16 22 42 -5 -3 -89 25 149 -29 24 207 -41 59 41 47 104 20 -34 3 -203 79 -20 -105 -135 -47 236 -171 155
7971 155 -304 -164 -279 -230 -217 -109 -164 -17 -32 87 190 -17 -86 122 -273 2 64 -71 -98 -119 -144 -27 129
7994 129 61 126 185 -202 42 -67 91 -21 31 95 81 85 114 -245 -144 16 67 226 -81 -148 60 22 7 71 122
8019 122 16 0 18 -39 83 90 161 -155 68 -203 -51 -107 -37 151 -125 -174 41 135 -76 -171 65 -42 -153 -42
8043 -42 306 -184 286 -89 -10 108 187 194 95 -109 51 -252 123 159 97 -103 -161 154 -31 -65 22 -37 -227 -53
8067 -53 -47 9 -129 -39 158 89 43 169 119 103 -68 -205 14 5 -201 -107 52 -184 -16 7 -38 93 14 -141 -90
8092 -90 79 92 135 120 35 105 202 191 -23 -136 -284 -2 80 -317 -100 -120 157 380 -138 -101 28 20 38 -4 -107
8117 -107 -88 97 -136 13 -60 45 -187 -68 -174 -59 -143 78 34 195 156 -22 151 -46 32 155 -12 109
8139 109 275 260 142 159 -35 -115 140 -58 57 -36 51 116 -235 -252 53 49 31 -269 -366 -92 30 -32 35 56 124
8164 124 -106 182 -117 -30 13 28 -52 15 -1 -12 57 66 -130 -99 72 -84 -138 119 -82 127 -117 -23 -98 113 44
8189 44 -61 255
8191B55
##END NTUPLES=NMR FID
##END=
