##TITLE=1H_Ser 6-8-i
 CDCl3
 8 sc, 
 15.04.2022
##JCAMPDX= 6.0         $$ Bruker NMR JCAMP-DX V2.0
##DATA TYPE= NMR FID
##DATA CLASS= NTUPLES
##ORIGIN= UXNMR, Bruker Analytische Messtechnik GmbH
##OWNER= root
$$ XWIN-NMR		Version 3.5
$$ Fri Apr 15 14:36:55 2022 Russian Standard Time (UT+4h)  she@DPX200
##.OBSERVE FREQUENCY= 200.13135
##.OBSERVE NUCLEUS= ^1H
##.DELAY= (6, 6)
##.ACQUISITION MODE= SIMULTANEOUS
##.ACQUISITION SCHEME= undefined
##.AVERAGES= 8
##.DIGITISER RES= 18
##SPECTROMETER/DATA SYSTEM= spect
##.PULSE SEQUENCE= zg30
##.SOLVENT NAME= CDCl3
##.SHIFT REFERENCE= (INTERNAL, CDCl3, 0, 15.7039)
##AUDIT TRAIL= $$ (NUMBER, WHEN, WHO, WHERE, WHAT)
$$ ##TITLE= Audit trail, XWIN-NMR		Version 3.5
$$ ##JCAMPDX= 5.01
$$ ##ORIGIN= Bruker BioSpin GmbH
$$ ##OWNER= she
$$ F:/spectra/data/she/nmr/H-F/1/audita.txt
$$ ##AUDIT TRAIL=  $$ (NUMBER, WHEN, WHO, WHERE, WHAT)
(   1,<2022-04-15 14:35:54.34 +0400>,<she>,<DPX200>,
      <created by zg, POWCHK disabled, PULCHK disabled
       configuration hash MD5:
       00 E9 B6 7A A2 85 ED C7 34 08 36 98 17 FE 4E 26
       data hash MD5: 16K
       03 35 BD 22 E9 26 DB 23 DD DD 64 EC 84 99 5A 4D>)
$$ ##END=
$$ 
$$ hash MD5
$$ 41 CD CB D5 17 38 DB 41 D8 D6 31 F6 75 29 F6 1C
##$RELAX= 
##$RELAX= 
##$RELAX= 
##$RELAX= 
##$RELAX= 
##$RELAX= 
$$ Bruker specific parameters
$$ --------------------------
##$DU= <F:/spectra>
##$EXPNO= 1
##$NAME= <H-F>
##$PROCNO= 1
##$TYPE= <nmr>
##$USER= <she>
##$AMP= (0..31)
100 100 100 100 100 100 100 100 100 100 100 100 100 100 100 100 100 100 
100 100 100 100 100 100 100 100 100 100 100 100 100 100 
##$AQSEQ= 0
##$AQ_mod= 1
##$AUNM= <au_zg>
##$AUTOPOS= <>
##$BF1= 200.13
##$BF2= 200.13
##$BF3= 200.13
##$BF4= 200.13
##$BF5= 200.13
##$BF6= 200.13
##$BF7= 200.13
##$BF8= 200.13
##$BYTORDA= 1
##$CFDGTYP= 0
##$CFRGTYP= 5
##$CHEMSTR= <none>
##$CNST= (0..31)
1 1 145 1 1 1 1 1 1 1 1 1 1 1 1 1 1 1 1 1 1 1 1 1 1 1 1 1 1 1 1 1 
##$CPDPRG= <>
##$CPDPRG1= <>
##$CPDPRG2= <>
##$CPDPRG3= <>
##$CPDPRG4= <mlev>
##$CPDPRG5= <mlev>
##$CPDPRG6= <mlev>
##$CPDPRG7= <mlev>
##$CPDPRG8= <mlev>
##$CPDPRGB= <>
##$CPDPRGT= <>
##$D= (0..31)
0 1.2 0 0 0 0 0 0 0 0.06 0 0.03 0 0 0 0 0.0002 0 0 0 0 0 0 0 0 0 0 0 0 
0 0 0 
##$DATE= 1650018953
##$DBL= (0..7)
120 120 120 120 120 120 120 120 
##$DBP= (0..7)
150 150 150 150 150 150 150 150 
##$DBP07= 0
##$DBPNAM0= <>
##$DBPNAM1= <>
##$DBPNAM2= <>
##$DBPNAM3= <>
##$DBPNAM4= <>
##$DBPNAM5= <>
##$DBPNAM6= <>
##$DBPNAM7= <>
##$DBPOAL= (0..7)
0.5 0.5 0.5 0.5 0.5 0.5 0.5 0.5 
##$DBPOFFS= (0..7)
0 0 0 0 0 0 0 0 
##$DE= 6
##$DECBNUC= <off>
##$DECIM= 32
##$DECNUC= <off>
##$DECSTAT= 4
##$DIGMOD= 1
##$DIGTYP= 9
##$DL= (0..7)
0 120 120 120 120 120 120 120 
##$DP= (0..7)
150 150 150 150 150 150 150 150 
##$DP07= 0
##$DPNAME0= <>
##$DPNAME1= <>
##$DPNAME2= <>
##$DPNAME3= <>
##$DPNAME4= <>
##$DPNAME5= <>
##$DPNAME6= <>
##$DPNAME7= <>
##$DPOAL= (0..7)
0.5 0.5 0.5 0.5 0.5 0.5 0.5 0.5 
##$DPOFFS= (0..7)
0 0 0 0 0 0 0 0 
##$DQDMODE= 0
##$DR= 18
##$DS= 0
##$DSLIST= <SSSSSSSSSSSSSSS>
$$ [...]
##$SUBNAM2= <"">
##$SUBNAM3= <"">
##$SUBNAM4= <"">
##$SUBNAM5= <"">
##$SUBNAM6= <"">
##$SUBNAM7= <"">
##$SUBNAM8= <"">
##$SUBNAM9= <"">
##$SW= 18.05172834244
##$SWIBOX= (0..15)
0 0 2 0 0 0 0 0 0 0 0 0 0 0 0 0 
##$SW_h= 3612.71676300578
##$TD= 16384
##$TD0= 1
##$TE= 0
##$TE2= 300
##$TE3= 300
##$TEG= 300
##$TL= (0..7)
0 120 120 120 120 120 120 120 
##$TP= (0..7)
150 150 150 150 150 150 150 150 
##$TP07= 0
##$TPNAME0= <>
##$TPNAME1= <>
##$TPNAME2= <>
##$TPNAME3= <>
##$TPNAME4= <>
##$TPNAME5= <>
##$TPNAME6= <>
##$TPNAME7= <>
##$TPOAL= (0..7)
0.5 0.5 0.5 0.5 0.5 0.5 0.5 0.5 
##$TPOFFS= (0..7)
0 0 0 0 0 0 0 0 
##$TUNHIN= 0
##$TUNHOUT= 0
##$TUNXOUT= 0
##$USERA1= <user>
##$USERA2= <user>
##$USERA3= <user>
##$USERA4= <user>
##$USERA5= <user>
##$V9= 5
##$VALIST= <valist>
##$VCLIST= <CCCCCCCCCCCCCCC>
##$VD= 0
##$VDLIST= <DDDDDDDDDDDDDDD>
##$VPLIST= <PPPPPPPPPPPPPPP>
##$VTLIST= <TTTTTTTTTTTTTTT>
##$WBST= 1024
##$WBSW= 4
##$XGAIN= (0..3)
0 0 0 0 
##$XL= 0
##$YL= 0
##$YMAX_a= 224400
##$YMIN_a= -300018
##$ZGOPTNS= <>
##$ZL1= 120
##$ZL2= 120
##$ZL3= 120
##$ZL4= 120
##$ABSF1= 10
##$ABSF2= 0
##$ABSG= 5
##$ABSL= 3
##$ALPHA= 0
##$AQORDER= 0
##$ASSFAC= 0
##$ASSFACI= 0
##$ASSFACX= 0
##$ASSWID= 0
##$AUNMP= <proc_1d>
##$AZFE= 0.1
##$AZFW= 0.1
##$BCFW= 1
##$BC_mod= 2
##$BYTORDP= 1
##$COROFFS= 0
##$CY= 11.3945322036743
##$DATMOD= 1
##$DC= 2
##$DFILT= <>
##$DTYPP= 0
##$F1P= 2.36226072786647
##$F2P= -0.459571619588291
##$FCOR= 0.5
##$FTSIZE= 0
##$FT_mod= 4
##$GAMMA= 1
##$GB= 0.15
##$INTBC= 1
##$INTSCL= 1
##$ISEN= 128
##$LB= 0.24
##$LEV0= 0
##$LPBIN= 0
##$MAXI= 10000
##$MC2= 0
##$MEAN= 0
##$ME_mod= 0
##$MI= 1.114404
##$NCOEF= 0
##$NC_proc= 0
##$NLEV= 6
##$NOISF1= 3.799351
##$NOISF2= 2.8
##$NSP= 1
##$NTH_PI= 0
##$NZP= 0
##$OFFSET= 15.70392
##$PC= 1
##$PHC0= -18393.14
##$PHC1= 15.20075
##$PH_mod= 1
##$PKNL= yes
##$PPARMOD= 0
##$PSCAL= 0
##$PSIGN= 0
##$REVERSE= no
##$SF= 200.130013532006
##$SI= 16384
##$SIGF1= 3
##$SIGF2= 2
##$SINO= 400
##$SIOLD= 16384
##$SREGLST= <1H.CDCl3>
##$SSB= 0
##$STSI= 0
##$STSR= 0
##$SW_p= 3612.71676300578
##$SYMM= 0
##$S_DEV= 0
##$TDeff= 0
##$TDoff= 0
##$TI= <>
##$TILT= no
##$TM1= 0
##$TM2= 0
##$TOPLEV= 0
##$USERP1= <user>
##$USERP2= <user>
##$USERP3= <user>
##$USERP4= <user>
##$USERP5= <user>
##$WDW= 1
##$XDIM= 8192
##$YMAX_p= 0
##$YMIN_p= 0
$$ End of Bruker specific parameters
$$ ---------------------------------
##NTUPLES= NMR FID
##VAR_NAME=  TIME,          FID/REAL,        FID/IMAG
##SYMBOL=    X,             R,               I
##VAR_TYPE=  INDEPENDENT,   DEPENDENT,       DEPENDENT
##VAR_FORM=  AFFN,          ASDF,            ASDF
##VAR_DIM=   8192,          8192,            8192
##UNITS=     SECONDS,       ARBITRARY UNITS, ARBITRARY UNITS
##FACTOR=    0.0002768,     1,               1
##FIRST=     0,             0,               0
##LAST=      2.2672688,     0,               0
##MIN=       0,             -300018,         0
##MAX=       2.2672688,     224400,          0
$$ Real data points
##PAGE= N=1
##DATA TABLE= (X++(R..R)), XYDATA
0 0 0 0 0 0 0 0 0 0 0 0 0 8 -8 8 -11 16 -17 24 -32 33 -40 49 -64 72 -83 97 -113 133 -153 175 -201 229 -259
33 -259 294 -332 374 -420 471 -527 588 -654 727 -807 894 -988 1091 -1207 1330 -1466 1614
50 1614 -1779 1959 -2159 2381 -2633 2913 -3231 3598 -4021 4521 -5119 5849 -6762 7945 -9549
65 -9549 11849 -15446 21892 -37024 151432 -35785 -216669 224400 90842 -172969 58731
76 58731 159025 -200393 -118749 173760 -8708 -185254 76880 87315 -138347 -20276 142460
87 142460 -58584 -106361 86546 31750 -108219 42968 91346 -91637 -40894 139924 16893
98 16893 -91499 65334 72436 -98800 -18943 111760 -30463 -109434 35352 30772 -76929
109 -76929 12436 77307 -55019 -65943 76786 59333 -47099 -8184 40710 -15481 -15138 36765
121 36765 -10755 -55981 9998 30370 -40066 -25161 40206 -7390 -47774 33468 44508 -41015
133 -41015 -6914 55339 -26066 -41997 73287 36649 -84927 -3807 86896 -21171 -49995
144 -49995 62736 17840 -84021 7901 69774 -48075 -67132 36205 5575 -63937 13944
155 13944 50618 -42823 -32370 68199 34324 -39204 14115 46129 -17612 -9979 42637 -11630
167 -11630 -51060 23169 27703 -51102 -16136 48416 -16812 -49676 31684 28755 -43238 -437
179 -437 44021 -32001 -37627 56052 24613 -62186 179 60748 -17981 -36212 45664 15743 -56024
192 -56024 11668 52717 -38417 -42160 44787 4796 -53620 22541 38498 -50410 -16448 62388
204 62388 -7327 -45225 40230 23731 -49422 16003 50142 -44552 -29488 61514 -3310 -63776
216 -63776 31486 41913 -57023 -16277 56359 -23233 -49296 45632 20896 -61835 6067 60333
228 60333 -28102 -38674 49984 19228 -43759 18059 41103 -33629 -17099 46618 -5465 -44406
240 -44406 22409 23203 -42318 -7708 37213 -20951 -32049 32578 11279 -38017 10289 34957
252 34957 -24561 -17686 38605 3089 -36653 17227 30760 -29323 -17394 34565 807 -33570
264 -33570 12987 23825 -25595 -9209 33043 -6060 -31411 21040 23634 -28095 -8007 29397
276 29397 -9075 -21406 23570 7687 -31705 7568 27360 -23487 -16756 28770 -2790 -31331
288 -31331 16392 19632 -29915 -7477 31333 -10035 -25122 24696 15836 -28407 3519 32270
300 32270 -11434 -17900 26614 10586 -26167 5606 23374 -17670 -16244 19277 -2930 -25741
312 -25741 7765 12512 -23062 -9408 21449 -4617 -19052 15029 12858 -16738 3380 22533
324 22533 -7839 -12378 20769 8571 -21111 2919 20233 -12880 -14843 17774 2738 -21567
336 -21567 6493 17558 -16420 -11168 21871 981 -21670 10280 15351 -19636 -6075 22040
348 22040 -6569 -20607 14581 10905 -21225 572 21029 -12554 -15563 20896 5004 -23033
360 -23033 6365 18755 -16277 -8855 23528 -332 -19842 15023 17032 -18764 -2329 23786
372 23786 -8155 -19659 16551 8963 -24418 -1497 18915 -14402 -16404 18919 2517 -24279
384 -24279 6394 18278 -17291 -10735 21605 -619 -20638 14285 17872 -17996 -1343 26407
396 26407 -4470 -16160 20619 11052 -23512 1366 19854 -17631 -17992 19416 -991 -27997 7859
409 7859 17687 -20415 -6446 25968 -4899 -20718 18992 15020 -23086 -2028 21808 -12244 -16375
422 -16375 20132 5318 -22858 7259 21718 -11611 -8118 21403 259 -19363 11083 13846
434 13846 -20009 -8272 16757 -6503 -16654 13987 9270 -19414 601 21509 -6968 -13988
446 -13988 14222 3494 -20430 2627 15209 -14222 -13874 15540 4818 -14555 8970 17053 -11352
459 -11352 -5201 21825 3346 -17379 6777 12132 -16423 -6383 18450 -7183 -21454 12910
471 12910 12113 -20621 -1936 20001 -12879 -18471 19379 5691 -25768 5056 20342 -16242 -7487
484 -7487 27623 1343 -19397 17100 18948 -17262 -2556 20602 -11310 -20472 14190 4628 -24734
497 -24734 -1462 15682 -12162 -9940 20360 5023 -17939 8279 18810 -11737 -7957 16059
509 16059 -4160 -18980 9904 12320 -17199 -5732 17785 -2172 -12565 13776 10211 -16991
521 -16991 -2192 16377 -6040 -14654 8897 4908 -15651 1801 18392 -6285 -13142 15293 10508
534 10508 -14125 2273 14884 -14068 -14810 17734 2579 -24734 3381 16423 -16970 -6958
546 -6958 25879 -2574 -21780 17421 17326 -21152 -1253 23016 -12867 -17751 22128 5502 -26118
559 -26118 6121 20423 -16634 -8488 22526 -3420 -22306 12909 14620 -20106 -4417 19149
571 19149 -9452 -15981 19230 10843 -19560 1210 18754 -9226 -10948 16996 722 -22075 4162
584 4162 13788 -14232 -9584 15074 20 -12833 10630 13145 -10499 -2313 17109 649 -11342
597 -11342 6707 6532 -13481 -4493 13219 -3473 -16359 5613 9632 -13175 -3289 17023 -5185
610 -5185 -17591 11595 10500 -17772 -816 19123 -10940 -15387 20193 7713 -19885 7862 19025
623 19025 -14836 -6555 22244 -3854 -19527 14825 11369 -21569 -2166 18182 -12330 -14199 18636
636 18636 3187 -21841 4482 15411 -14250 -6929 19395 -2636 -19875 9736 13539 -13858
648 -13858 -2815 16130 -5646 -12192 13406 8482 -13913 1152 13215 -6709 -7091 11482 1655
661 1655 -11410 4420 10079 -7383 -7058 7335 1189 -8127 2816 6191 -9461 -8032 8825 3797
675 3797 -10473 401 9877 -6667 -7325 13486 4927 -12781 4998 12998 -10821 -6054 17134
688 17134 -880 -15902 9488 10069 -16558 -1605 16970 -8229 -12598 14593 3198 -18170 5155
701 5155 13960 -13364 -7439 15787 -3537 -16796 10046 10012 -14974 -1476 15040 -6906 -10550
714 -10550 14751 6658 -13740 3655 13598 -9156 -6643 13812 827 -13089 5231 7571 -10840
727 -10840 -2956 11018 -4055 -9971 6872 4536 -8871 -317 7880 -3702 -5296 5875 2425
740 2425 -7199 -155 7347 -2715 -6432 4638 3462 -6794 -45 9427 -2216 -7216 7337 5368
754 5368 -8604 1688 10386 -6419 -7642 9948 1662 -11873 3772 8501 -10748 -5087 11619
767 11619 -2884 -11070 8076 5792 -11541 332 11081 -6304 -7442 11000 2456 -11061 4018
780 4018 9234 -7770 -3186 11445 -997 -8502 7631 6170 -9409 -364 9501 -5157 -7871 7120
794 7120 1032 -9889 2383 5849 -7646 -4129 7277 -530 -6267 4078 3980 -5517 -417 6396
808 6396 -803 -4028 3049 2730 -2824 -194 4207 -570 -3639 2796 3665 -3735 -1773 4293 -586 -4481
824 -4481 3199 3180 -5277 -1287 5856 -2658 -5843 4799 1351 -7813 586 5671 -5394 -4756 6608
839 6608 689 -6157 4695 6293 -5126 -99 8743 -1279 -5155 6021 2942 -6870 914 5397
853 5397 -5404 -4485 6015 -596 -6795 3638 4277 -6279 -948 6258 -3483 -5621 4777 1516
867 1516 -7321 618 4690 -4616 -2232 6348 650 -4324 4244 5003 -3004 -329 4751 -1031 -3165
882 -3165 2833 1374 -4095 -550 2676 -1297 -2287 2335 802 -3336 324 2725 -2234 -3008 2279 -44
898 -44 -3826 775 2857 -2815 -2167 4030 899 -3573 2527 3027 -3164 -715 4772 -949 -3651 3100
914 3100 2651 -3681 534 4916 -1832 -2661 4570 1076 -4552 757 2797 -4227 -2929 3160 -1805 -4946
930 -4946 2536 2422 -4156 44 4842 -1419 -2275 4393 1293 -4582 1080 3992 -3393 -2750 4628 276
946 276 -3880 2936 4251 -2988 -476 5327 -559 -4358 2164 1562 -5596 -1084 3243 -3744 -4124 3044
962 3044 818 -4190 1522 3965 -2710 -1455 5024 296 -4114 2750 2761 -4356 -426 5083 -1466 -3664
978 -3664 4374 2694 -4297 1189 4782 -2542 -2882 4799 356 -5492 1483 3704 -4306 -3215 4254
993 4254 -863 -4891 2155 2293 -4626 -844 4146 -1548 -3140 3224 1863 -2817 1296 4172 -1549
1008 -1549 -1274 4440 1689 -3017 901 2649 -2807 -2168 3426 -465 -5518 654 3757 -3419 -2519 4333
1024 4333 -135 -4979 2117 4343 -4854 -2807 5015 -1236 -5288 3850 3295 -5508 -7 6638 -1505
1039 -1505 -2973 5512 1335 -5382 2909 5232 -5399 -2748 5276 -1535 -5527 3763 2850 -6805 -551
1054 -551 6841 -2688 -5440 5362 1758 -6824 1412 5883 -4539 -4130 6220 720 -5591 2861 4233
1069 4233 -4389 -937 6000 -503 -3597 4008 2444 -3582 421 3825 -1431 -3041 2170 502 -3673
1084 -3673 196 2543 -2400 -3595 2543 1972 -4188 -507 4352 -2240 -3636 4696 2283 -5479 742
1099 742 5914 -2962 -3519 5910 1087 -6797 2554 6085 -5274 -2308 6319 -872 -5569 4543 3804
1114 3804 -6686 -864 6067 -3311 -4981 5527 352 -7789 1885 5611 -5519 -3255 6182 -869
1128 -869 -5704 4956 4374 -6685 -272 7661 -2403 -4755 5504 1735 -5772 2142 5183 -4303
1142 -4303 -2927 5091 -120 -4133 2462 2630 -3590 -1587 2982 -587 -3177 448 1524 -2670 -1972
1157 -1972 2065 383 -3241 790 3070 -1952 -1905 4349 1504 -4005 2374 4566 -3820 -1584 6069
1172 6069 -390 -5108 3757 3221 -6373 -381 6489 -3353 -5801 5418 1507 -7168 1210 5806 -5044
1187 -5044 -3649 6482 -570 -7317 3334 4522 -5957 -1139 6356 -2915 -4587 6429 2856 -5876
1201 -5876 2320 5747 -4681 -1992 6755 -773 -6099 3824 2624 -6003 -417 4997 -2860 -3814 3656
1216 3656 487 -4610 1040 3362 -2336 -1811 2069 256 -2106 278 2064 -259 -1987 917 1749
1231 1749 -1401 -607 2968 389 -2400 1647 2576 -2790 -98 4327 -1517 -3950 2803 828 -5076
1246 -5076 735 4001 -4277 -3748 4742 -125 -5544 2822 3776 -5169 -1223 6220 -1481 -4543 4971
1261 4971 2806 -5654 535 5368 -3454 -3136 6246 310 -5857 2774 3810 -4691 -277 5768 -2577
1276 -2577 -4462 4275 1118 -5003 1362 3019 -4384 -2215 3649 -1317 -3105 2317 1607 -2885 86
1291 86 2716 -521 -880 1932 949 -1188 -407 1047 330 -894 395 1406 -704 -1452 1868 1218 -1963
1308 -1963 224 2158 -1500 -2157 2049 438 -3169 997 1859 -3472 -1316 3106 -899 -3004 2883
1323 2883 1442 -3822 525 4519 -1514 -2296 3846 466 -3865 2235 3379 -3616 -1437 4169 -1428
1338 -1428 -3820 2889 1306 -4346 815 3338 -3375 -1984 3568 -313 -3061 2154 1188 -3510 223
1353 223 2776 -1700 -1315 2263 -166 -1874 1946 1924 -1304 292 1642 -342 -206 847 709 -686
1369 -686 -71 516 9 -505 -633 103 -220 -1129 -106 719 -1092 -544 1290 -48 -1537 637 1109 -1618
1387 -1618 -174 1484 -764 -1387 1786 585 -1862 1254 2174 -1343 -380 2488 -136 -1560 1844 964
1403 964 -2711 134 1941 -1847 -1668 1682 -892 -2990 1305 1586 -2338 -101 2210 -1194 -917 2479
1419 2479 380 -2110 1469 1400 -1330 175 1707 -1097 -615 1997 123 -1194 1209 1044 -1018 660
1435 660 914 -639 -578 611 -443 -746 -86 98 -1249 -482 200 -325 -544 65 -208 82 -45 92 521
1454 521 253 247 351 641 14 162 331 148 -358 -39 280 -160 62 185 -497 -80 565 -51 -841 226
1474 226 15 -949 -32 495 -1595 -951 1138 -30 -1235 916 423 -1076 890 1299 -316 -390 1509
1491 1509 220 -630 1151 702 -1269 78 1297 -531 -648 909 -370 -1429 621 723 -1640 -309
1507 -309 994 -781 -893 742 1 -1709 89 983 -1043 -587 1056 55 -1134 992 1190 -708
1523 -708 -164 1753 336 -595 984 802 -850 31 1195 -553 -1097 634 357 -1127 -261 689 -749
1540 -749 -875 888 220 -1157 550 1152 -1250 -679 1414 -234 -1174 884 909 -1329 -29 1631 -382
1557 -382 -867 1242 698 -1057 781 1503 -771 -645 701 318 -1574 70 719 -1093 -1042 1084 9
1574 9 -1240 -112 1020 -852 -725 1378 8 -1233 706 1128 -731 -142 1337 -216 -1311 1394
1590 1394 892 -1449 90 1921 -539 -1288 1298 649 -1992 -148 1417 -1412 -1647 1593 129 -2483
1606 -2483 257 1684 -1767 -720 2199 -203 -1902 1525 1396 -1855 320 2165 -1292 -1075 2361
1621 2361 514 -2264 1019 2048 -1824 -677 2205 -775 -1926 1437 1078 -1761 -166 1245 -848
1636 -848 -1288 1160 211 -1613 -309 917 -394 -865 891 567 -1212 182 1725 21 -772 1005
1652 1005 1062 -851 277 1309 -805 -1103 1098 439 -1785 -140 1102 -1368 -1249 1524 152 -2291
1668 -2291 577 1765 -1953 -1443 2200 -467 -2623 1513 1482 -2391 -412 2864 -1149 -1926 2514 1207
1684 1207 -2393 1156 2139 -1791 -626 3249 -240 -2168 1926 1062 -2574 9 1907 -1902 -1750 1920
1700 1920 -44 -2217 703 1055 -1239 -505 1350 -141 -1062 651 968 -608 -184 1178 41 -795
1716 -795 641 1057 -111 -766 772 515 -952 366 1245 -791 -1373 1177 423 -1907 -61 1223 -1374
1733 -1374 -1284 1390 -34 -2112 649 1626 -1877 -799 2357 -442 -1630 2140 1201 -2414 617 2801
1749 2801 -1704 -1611 2800 165 -2712 1562 2047 -2803 -324 2589 -1422 -1963 2046 221 -2537 560
1765 560 1588 -2191 -1404 1623 -846 -1327 1232 567 -1484 442 1506 -443 -479 1270 420 -1018 21
1782 21 605 -323 -240 333 364 -371 -483 479 188 -348 219 946 -673 -810 737 410 -1328 -142 572 -1415
1802 -1415 -1112 1400 20 -1910 870 1341 -1541 -314 2232 -467 -1534 1842 839 -2294 724
1817 724 2342 -1687 -838 2458 -606 -2412 1940 1249 -2555 161 1963 -1884 -1551 2316 -220 -2422
1833 -2422 1079 1342 -2441 -227 2122 -905 -1031 1563 -37 -1426 795 1204 -768 211 1068 -524
1849 -524 -170 792 482 -130 8 60 -198 -284 171 -70 -430 -276 -210 155 -355 -439 636 641 -697 29 714
1870 714 -648 -654 1275 323 -1038 487 949 -963 -109 1769 -432 -1279 1428 702 -1397 856 1622
1887 1622 -1656 -702 1382 -879 -1913 1283 336 -1862 189 1422 -1600 -570 1697 -458 -1572
1902 -1572 1186 862 -1164 764 1368 -684 -453 1204 -248 -675 879 350 -958 95 441 -212 -317
1919 -317 577 -140 -283 -140 -136 -240 3 -194 -493 -115 -154 -306 169 283 -511 205 127 -190 23 877 -154
1940 -154 -274 1090 323 -582 327 541 -818 3 1040 -538 -934 979 418 -1270 466 735 -1130
1957 -1130 -294 1142 -503 -1045 857 -179 -1192 267 706 -1016 -299 1017 -634 -687 551 338 -760
1974 -760 765 576 -597 237 810 -89 -151 579 -128 -653 412 89 -551 -50 134 -430 -284 413 -319
1993 -319 -360 454 -260 -247 418 89 -475 244 372 -527 -72 411 -170 -48 775 160 -507 630 615 -399
2013 -399 193 140 -451 -230 421 -109 -499 19 233 -567 45 209 -608 -408 638 -266 -414 400 -137 -662
2033 -662 41 605 -332 -98 556 16 -106 422 40 -129 637 54 -155 347 261 -271 181 21 -430 -542
2053 -542 198 -106 -486 205 -168 -522 -47 453 -477 32 732 17 -404 501 72 -249 294 562 -400 -222
2073 -222 490 126 -200 590 253 -242 149 587 -204 -394 219 -127 -577 142 15 -503 -150 88 -104 -539
2093 -539 229 43 -397 293 402 121 29 93 352 -133 148 361 -60 -95 197 425 -368 -237 -37 -383 -399
2114 -399 223 83 -382 -29 599 -282 -307 299 72 -231 -85 535 -384 -327 331 -119 -427 112 458 -209 -175
2135 -175 588 39 -179 351 319 -504 -19 388 227 -355 235 97 -449 95 500 107 -589 366 11 -522
2155 -522 -122 266 -453 -598 398 200 -539 114 511 -315 -367 964 267 -832 348 528 -487 -194 886
2174 886 -237 -694 576 161 -701 13 363 -619 -589 258 -397 -850 -66 334 -404 -218 567 -188 -627 518
2194 518 62 -487 103 554 -199 -371 542 350 -414 28 444 -260 23 415 256 -270 -17 374 57 -293
2214 -293 -31 45 -440 -351 343 -187 -433 148 109 -429 -227 680 -88 -603 689 393 -667 431 900 -435
2234 -435 -266 1007 695 -583 234 780 -878 -285 941 -340 -1030 603 183 -1166 20 312 -1049
2251 -1049 -464 943 -2 -669 406 474 -999 -33 937 41 -622 733 449 -704 130 585 -337 -294 559
2270 559 -112 -284 -13 277 -418 -107 179 25 -202 -50 -60 -259 -443 29 252 -450 -178 287 -34 -552
2290 -552 279 386 -650 54 1061 -42 -692 713 1050 -674 140 866 -723 -587 1063 -123 -1220
2307 -1220 676 192 -1002 -89 1200 -701 -892 858 156 -933 738 760 -905 11 1066 -231 -714
2324 -714 815 270 -776 -3 885 -309 -130 911 165 -389 197 123 -475 -223 374 -277 -390 121 272
2343 272 -399 117 -75 -172 -7 -10 -179 -95 35 52 202 -162 22 262 126 -417 -74 292 -533 -206 527 199
2365 199 -685 511 440 -886 104 974 -517 -463 840 -167 -788 438 700 -1395 -185 920 -690
2382 -690 -562 770 225 -885 533 508 -783 66 960 -389 -440 740 0 -669 422 639 -511 -134
2400 -134 504 -126 -396 582 22 -635 -219 -53 -51 -206 285 -236 -496 -160 -144 -232 7 306 -115 11 129
2421 129 -434 562 25 -270 195 380 -356 48 468 -267 -153 504 -274 -881 490 361 -756 78 552
2440 552 -557 -675 717 -125 -756 456 107 -848 -170 449 -500 -617 792 -130 -718 600 401 -443
2458 -443 -7 836 -162 -209 555 119 -506 -27 385 -535 -333 341 -379 -113 294 189 -587 240 59 155 -207
2479 -207 142 -127 38 322 -10 178 237 -289 -58 300 -104 -75 330 139 -344 151 71 -240 -108 438 -389
2500 -389 -585 295 5 -681 132 -24 -565 -31 455 -444 -481 441 -257 -511 223 222 -527 327 788 -382 -225
2521 -225 546 -89 -214 589 312 -513 175 354 -247 4 435 -104 -497 5 -66 -354 155 143 -210 -269 114
2542 114 150 -226 265 64 -132 309 -12 -61 99 -184 -83 165 211 -213 16 286 217 -260 391 119 -269
2563 -269 142 198 -450 -228 223 -207 -239 360 -343 -287 -11 94 -444 -297 306 -316 -192 274 104 -249 379
2584 379 542 -82 297 521 -140 77 281 -123 -211 262 156 -327 -7 73 -446 -142 244 -125 -337 100 217
2605 217 -419 -104 125 -85 -243 103 -28 -59 -10 0 -127 221 316 -288 310 -35 -33 189 -194 -57 -186 459
2627 459 -68 -247 261 -59 -261 -58 53 -236 -188 118 -185 -20 155 -190 -122 133 203 10 -51 315 93
2648 93 -115 205 51 -373 65 286 -170 -78 136 -65 -49 25 119 -270 -173 -150 194 -242 -77 117 -120 24
2670 24 31 -100 28 5 75 -31 -2 -31 273 -185 130 267 151 -254 297 72 -176 59 171 117 -163 365 -114
2693 -114 -432 47 80 -231 -183 50 144 -168 115 75 -394 -33 210 -36 2 107 258 -111 24 289 -73 -28
2715 -28 50 106 -54 328 110 -34 -336 83 -132 -90 -142 -100 -175 -244 311 -178 -292 119 12 -298 -144 49 18
2738 18 -395 282 381 -78 -269 359 175 29 -76 139 -46 163 287 -222 -262 212 332 -254 76 162 -172
2759 -172 11 144 -228 -81 124 25 -299 130 148 -250 -105 -144 -110 45 8 19 243 -83 359 213 -107 -116 541
2782 541 153 90 140 165 -86 -156 83 -73 -484 340 160 -220 -180 182 -235 -49 300 164 -297 -62 229 -311
2804 -311 -463 289 -21 -403 486 358 -147 104 296 -34 -272 350 63 -353 231 132 -85 -7 254 4 -154
2825 -154 15 76 -341 -252 50 -3 -189 -94 46 -79 -51 302 -95 153 -165 253 82 -178 39 2 -17 -101 147
2848 147 99 -207 387 125 -69 255 223 -221 -319 167 14 -390 138 258 -494 -120 406 -227 -314 256 191 -59
2870 -59 105 160 -183 -298 451 -120 -449 194 399 -236 93 361 -266 -116 170 80 -355 -150 33 -328 48
2891 48 285 -120 -66 303 -129 -138 -57 120 -215 -171 317 119 -131 337 119 -101 205 -77 106 -83 -123 81
2913 81 110 -414 -64 281 22 -265 -95 145 -270 88 310 -136 -267 78 137 -468 249 -28 -531 -113 557
2934 557 -18 -304 318 116 -48 39 260 -451 -162 394 -100 -496 231 252 -51 -154 243 -378 -427 194 -289
2955 -289 -291 256 163 -399 -118 203 -88 -142 104 -280 -259 -93 149 -354 97 -200 17 -55 250 269 -53 184
2977 184 -179 16 244 19 -234 44 -177 -105 143 -10 -390 -70 101 -184 33 243 -41 6 -14 216 -199
2998 -199 62 341 -269 162 198 -48 56 480 122 -370 208 442 -260 58 175 -108 -125 79 134 -517 105
3019 105 10 -385 -25 370 -192 -251 181 -161 -101 175 169 -67 -141 205 212 -88 108 78 -283 -152 -84 -28 107 27
3043 27 -63 -157 -19 97 110 77 -194 29 60 93 -16 54 147 -206 67 59 -386 11 167 -115 -42 352 91 -127
3067 -127 170 271 -73 119 85 -260 -215 142 -6 -282 142 -13 -174 -229 20 -188 -177 321 -29 -279 122
3088 122 24 -327 -132 72 -191 244 128 23 -121 39 45 -133 108 340 -144 65 6 -80 -7 21 -41 -21 -77
3111 -77 130 -281 -211 -19 -241 -8 176 -44 45 135 -137 -145 -17 47 -149 -43 183 -57 74 143 -49 166 236
3134 236 -117 -138 26 83 55 -121 12 102 -68 367 190 -143 40 3 -271 -9 72 -141 207 102 -34 -106
3156 -106 62 139 -203 -2 345 -7 29 -7 -115 35 73 171 -177 115 124 -9 106 -134 16 -92 390 -156
3178 -156 -131 -181 86 -134 286 112 -261 -171 -72 -146 -172 38 178 -158 164 48 44 327 394 28 -274 82 -278
3201 -278 -82 199 168 -17 97 165 -83 -252 145 -130 -254 110 242 -311 -131 160 -158 -51 47 -52 -142 18
3223 18 -52 22 -72 141 -66 33 135 -280 89 -148 133 -103 9 -178 53 195 134 -27 96 -116 64 -31
3245 -31 15 -169 -22 -12 -265 -44 -54 -76 -64 77 327 44 -140 192 80 -202 -101 259 84 -39 85 -99
3267 -99 -226 196 293 140 54 -226 -143 -56 -185 -158 -45 -15 105 -266 -23 33 -52 138 94 -7 -46 -132 -166 -18
3291 -18 -107 -10 -83 -44 14 144 35 45 236 169 97 -112 52 -148 -413 -74 -58 -139 -14 29 -52 -312 163 24
3315 24 65 165 -257 -214 76 -81 -32 61 7 249 64 -24 173 -12 -73 -11 -97 38 -71 284 226 40 -50 -3
3339 -3 -39 132 6 184 -281 -96 -100 107 127 232 36 16 52 -113 -193 32 -103 -118 -135 54 -36 -168 -42 37
3363 37 15 37 156 8 -271 0 274 -57 140 91 -304 -91 -24 -113 -397 -141 62 -371 -59 -34 -84 31 427
3386 427 -71 -66 22 15 -253 -169 17 17 -205 33 -170 -37 233 -265 -16 155 -168 256 9 7 -24 -122 -286 -22
3410 -22 108 -80 -130 -39 -127 -53 258 187 -27 35 31 -205 -183 -242 285 101 9 93 -242 -143 219 251 31 -116 261
3435 261 65 18 -12 45 -56 -26 250 176 -124 36 -199 -207 250 246 -274 334 278 -156 -81 29 363 228 155 138
3459 138 98 -68 -35 31 -104 298 72 -12 189 -177 34 -119 -370 10 -108 -115 4 86 50 69 105 159 -164 273
3483 273 290 -106 -165 91 -93 -96 399 121 -119 49 -150 -186 -106 -106 9 -111 87 -14 -242 -376 185 -202 -202
3506 -202 286 74 -40 -14 133 -14 -189 22 57 -66 448 22 -299 -124 -83 67 101 -65 143 -50 149
3527 149 -28 -301 106 107 -118 -126 3 -42 -5 -276 -71 -29 84 103 99 72 -174 -187 295 100 -36 125 233 -144
3551 -144 -4 71 -18 114 -108 35 -71 -124 180 -90 57 134 -259 -272 298 134 -81 -103 -54 -109 -49 243 -165
3574 -165 19 181 -81 -233 187 391 5 130 156 83 -177 188 -246 43 10 128 -42 -32 124 -79 9 6
3596 6 -80 -217 -107 -237 -93 -9 37 -41 -106 -222 41 -15 -18 20 77 -86 -147 108 129 -171 -19 38 162 -11 71
3621 71 172 -158 -174 252 -24 -24 -224 98 -21 -180 110 -382 -156 124 180 -255 -295 199 -63 229 279 -70
3643 -70 2 23 157 -88 -98 147 -68 51 110 -51 -161 152 -62 69 25 160 -137 -105 64 134 -45 -134 -137 256
3667 256 133 -52 173 -60 -38 -187 -17 -20 -79 13 -58 -21 -156 122 -149 -191 23 5 -299 277 -49 -101 56
3690 56 58 -68 -99 352 -282 -145 98 149 73 74 121 203 -42 83 100 -82 453 169 -82 92 209 103 37 239
3714 239 41 108 103 256 49 9 117 -103 -108 174 -235 -48 252 -44 -164 88 15 -144 -250 -45 -196 -202 96
3737 96 -82 -230 -2 -44 -105 130 77 50 28 163 55 -23 95 -28 -6 153 -100 -263 220 188 -23 -140 50
3760 50 -101 24 -31 -15 -182 -322 35 11 -166 125 -127 -6 123 98 -136 6 -161 24 236 100 -86 -114
3782 -114 182 -5 -20 356 11 53 28 364 108 -207 -42 -8 -27 6 186 -85 -40 -177 -33 231 -285 89
3804 89 91 188 -26 35 160 -21 -69 -141 164 73 104 -225 -146 -185 279 6 -29 78 -245 -1 25 -184 214 204 -140
3829 -140 105 133 224 46 -46 -47 50 121 3 221 -54 -91 55 9 -26 -3 -299 56 -49 -23 -172 11 -63 -102 336
3854 336 -56 -110 -31 -129 -22 -31 -111 -77 39 61 -97 10 29 27 -127 93 -47 -153 32 68 -30 49 87 -38 28
3879 28 -24 -86 -99 -73 200 -138 -103 -20 174 -49 -127 4 1 -137 -45 125 95 -22 94 176 -150 64 16 90 -24
3904 -24 103 61 -37 -160 120 89 184 -3 139 -200 40 -241 -222 -14 -14 47 -79 -84 145 -127 -101 -93 -174 -77 -110 82
3930 82 -316 48 84 -37 -44 -70 64 172 56 50 -144 89 -30 -161 -45 47 143 156 91 98 -171 -14 90 -129
3954 -129 -111 -54 32 -77 -83 46 -121 35 26 168 -20 -91 98 248 -132 -185 -92 20 -23 -26 4 -162 199 121 -17
3979 -17 -39 159 13 -61 33 -27 177 -130 -18 9 -158 56 -26 61 -120 45 -185 192 51 33 293 167 -61
4002 -61 -212 6 217 -50 33 359 -11 -222 121 65 -210 -259 -8 98 -137 108 -27 -145 -146 78 78 -162 -82
4025 -82 195 -61 128 -173 -22 106 27 147 268 0 -8 81 192 -342 -7 96 -75 28 -189 -246 221 128
4047 128 -235 -125 -215 -26 -46 114 133 132 -63 138 -17 35 290 29 105 -10 75 -69 -90 -49 -3 22 -102 -97 -20
4072 -20 75 68 91 -87 15 95 -60 48 19 -314 -11 73 -127 -298 -130 -69 -191 8 -82 -192 -132 34 -198 -155
4096 -155 151 -113 -270 -35 -55 -194 -4 -10 82 -3 41 82 -112 5 -24 -68 33 53 232 52 27 -104 54 -40
4120 -40 17 -15 30 174 -208 271 16 -52 91 285 -32 -186 163 25 -97 294 62 -220 6 242 118 -89
4142 -89 -34 -186 -377 -63 -22 111 73 43 74 75 61 110 17 -21 97 171 120 -6 143 178 -23 -4 114 165 -98 -306
4168 -306 -34 33 -90 155 60 -22 26 242 341 175 211 -324 -35 27 55 48 171 61 -101 120 137 -265 51 34
4192 34 -33 -86 11 -47 -58 73 50 -193 4 -49 111 116 -11 110 -296 -196 -9 6 -198 -140 190 122 183 -88 -103
4217 -103 -122 -67 -65 -179 -33 -198 127 -90 -231 -57 -23 -21 -25 37 149 172 -150 -24 46 213 -83 50 -179 121
4241 121 -95 15 68 51 -73 28 121 -120 -35 186 61 88 77 -25 -136 186 81 -73 170 201 160 203 -45
4264 -45 -18 -63 161 -59 -35 65 248 -36 -271 -97 -15 88 -210 -147 -100 14 -40 27 306 292 252 -429 -183 -105
4288 -105 -25 -32 15 -37 -125 -97 -36 -170 -47 -37 -13 -50 238 18 -75 -200 -181 -40 110 56 -14 157 -133 15 112
4313 112 -153 -18 -6 158 -274 103 163 154 -169 -139 -100 -166 -35 39 127 -111 -126 191 178 103 -323 27 207 230
4337 230 52 30 196 -156 219 -43 -187 -2 -32 -38 15 223 7 102 -9 -185 15 -256 -45 -118 165 44
4359 44 0 -167 58 11 147 18 119 -117 -232 -246 2 13 -74 -158 -272 84 175 -95 85 177 63 -175 51
4382 51 143 -201 348 -14 38 90 22 291 -103 77 90 -9 -72 -5 -27 -137 43 -7 -222 69 -197 142 28 88
4406 88 176 100 32 -138 -21 62 -202 39 257 -26 306 57 -4 -235 180 -149 215 63 51 41 -45 203 11
4429 11 -230 20 -28 -319 -65 58 -37 2 130 106 -34 134 -199 -97 130 143 186 -95 124 -82 57 188
4451 188 118 -49 -332 122 -205 -20 33 -42 -199 -93 56 74 102 -49 209 -41 -28 -1 115 -40 -172 -12
4473 -12 -162 249 -79 22 -47 -109 -31 -138 42 30 -62 -13 225 38 -78 3 -349 -167 144 130 68 -179 238
4496 238 -18 103 -340 -80 -44 73 29 178 -31 102 -18 -73 34 -154 -94 -49 242 77 46 112 -80 -199
4518 -199 173 -88 16 -46 139 96 3 -59 -27 87 10 -56 22 -16 -139 83 -14 -175 -130 -152 3 8 8 261 -176
4543 -176 30 -107 119 -204 -59 -83 41 185 36 -51 194 -70 -150 13 57 -105 -166 -185 -183 14 -44 193 -20
4566 -20 89 80 170 7 -22 236 -74 62 -222 240 -158 76 168 -111 -55 52 118 57 157 -22 103 94 -165 -58
4590 -58 99 -72 201 -50 -90 13 63 25 59 -11 -35 -87 -66 -57 -6 3 49 51 -124 99 173 -72 -71 211 3 -82 161
4617 161 89 92 -98 35 53 93 -36 5 -90 23 156 84 45 -297 -54 73 -143 -99 -43 54 18 -97 41 181
4641 181 -39 -132 -54 196 29 272 -152 71 137 -19 -46 135 65 -160 191 -21 124 228 -218 -131 -208 -123 81
4664 81 -105 -70 -169 -160 108 -125 154 46 -143 -94 -149 -166 -145 -132 -99 79 207 -71 93 -66 -64 80 24 209 -141
4689 -141 -45 11 56 -39 -124 -34 152 -12 83 -304 119 65 137 -3 -130 -152 58 -137 57 49 232 71 -149 29
4713 29 -138 169 27 64 13 0 23 -148 195 -31 16 -139 -163 -147 51 -258 -211 16 82 -6 -181 -27 102 71
4737 71 -59 181 28 -15 141 -164 -119 -162 166 101 -19 -165 -203 147 95 -57 -115 -138 31 -69 85 156 40
4760 40 -78 67 86 16 -60 -2 -3 114 76 -75 -126 -36 -134 52 61 -16 111 -52 146 -14 -34 -53 115 131 56 -115
4786 -115 8 210 55 -206 -218 155 1 -44 -93 -113 107 209 212 -50 79 -180 -188 68 -3 -94 53 55 -52 -135
4810 -135 211 -117 -177 21 214 -136 186 247 -32 212 -125 21 -149 -86 91 -62 -126 -48 156 37 39 -137
4832 -137 35 178 69 23 -7 76 -126 100 -40 -86 293 80 -122 -81 69 -31 -91 -241 74 -48 128 -99
4854 -99 142 47 160 74 4 -50 -227 109 -61 -8 108 -128 120 169 10 -93 -145 92 45 -122 -160 -272 -128
4877 -128 -129 22 51 -18 -82 151 -18 -151 66 113 -66 -42 -138 169 144 -56 213 12 299 32 52 -113 113
4900 113 280 -69 51 -88 -211 44 96 -156 -107 61 152 158 -61 -6 -162 29 5 -211 -242 -88 54 -151 -267
4923 -267 -89 -209 -55 69 19 -58 -81 -62 -186 72 -143 5 -18 30 81 -212 -92 -131 126 -58 -153 393 -224
4946 -224 209 245 145 265 40 39 96 -133 11 -239 12 171 150 115 55 60 -104 -25 -103 64 -144 55 66 -115
4970 -115 105 1 27 -88 93 102 101 -67 240 -96 -8 169 27 -172 -82 -179 -73 -142 -182 210 34 87 23 -58
4994 -58 -41 -45 -127 58 160 168 173 -200 193 -106 -14 -93 230 -186 81 -41 -51 102 -182 86 -30 65 -34 -63 -163
5019 -163 35 -74 52 101 189 144 201 44 277 -253 -5 -27 50 -180 -12 -38 -47 -62 -139 40 -151 110 -53 -266
5043 -266 -134 110 -100 121 -146 -63 60 -49 144 134 102 289 164 64 238 -83 -91 85 -48 75 9 -130
5065 -130 187 -88 83 9 -51 103 27 -3 9 -109 133 50 46 295 299 34 -123 278 -221 16 -19 141 -282 185
5089 185 6 -16 103 91 96 -23 -72 165 8 167 149 -77 -67 -104 19 9 62 -204 21 -99 62 -72 192
5112 192 23 179 209 234 -117 -131 215 -129 67 -97 -47 36 244 -39 -20 289 106 6 -383 88 130 80 -53
5135 -53 81 -14 170 32 -142 68 211 27 -55 7 318 497 -171 68 -4 -293 -10 17 -138 -223 126 115 56
5158 56 126 35 117 86 -110 83 96 99 152 -90 40 -184 -65 65 -334 -31 -148 -70 99 237 12 -131 -108 125
5182 125 130 6 -73 214 192 -8 123 209 -75 108 -151 -59 -147 -400 64 73 -288 -104 135 -19 23 239 -82
5205 -82 -171 -138 1 13 5 -162 -150 -91 -95 -5 6 21 158 -3 93 -15 -174 3 60 245 286 -81 -277 -15 -190
5230 -190 -188 -242 219 226 399 -2 11 168 -35 -72 78 126 36 45 179 66 -168 -313 -19 69 104 126 45 116 -34
5255 -34 -80 145 -211 22 -166 54 30 118 85 68 -173 -64 31 69 -40 -85 91 -177 -122 120 -127 -167 18 -111
5279 -111 161 -43 287 58 -77 85 -52 62 217 -127 -21 -8 36 -17 83 255 87 115 -55 215 -145
5300 -145 -44 9 -104 -335 134 -29 -291 58 -108 -143 124 -191 -184 -37 101 72 5 -88 42 -35 76 118 -108
5323 -108 265 -34 -70 -186 -154 122 125 144 138 -154 13 32 -12 -87 -16 -15 260 -56 -213 -266 14 28 37 31 -48 -21 147
5350 147 18 -51 -271 189 40 -7 149 -70 34 12 58 -65 75 123 -113 -155 39 -416 104 -30 -6 -214
5372 -214 12 -252 -22 98 -99 -29 -69 -111 -75 -144 -32 -79 160 -169 111 -17 -100 -23 112 -131 -118 197 50
5395 50 -45 27 48 209 -80 -56 124 192 -75 -188 -34 -14 166 104 122 -141 -47 30 230 95 80 256 101 259
5419 259 195 113 -90 160 -62 -74 134 30 10 -213 7 -134 97 -46 6 -175 100 30 -35 118 -148 78
5441 78 167 -100 -137 -186 -77 79 -15 157 -91 -1 36 -47 -9 79 -230 174 -44 -242 34 136 -146 -128 -51 -75
5465 -75 40 93 -49 255 -72 -44 -76 125 -116 -131 242 -10 -26 -167 112 59 -22 39 -212 -246 92 184 -111 212
5489 212 129 -85 49 29 -212 -13 -131 17 58 31 -71 20 84 80 0 -99 117 -134 -138 -54 195 217 48 -363 -75
5514 -75 -29 213 -14 -90 -133 -130 -282 196 57 19 7 -175 -70 -100 84 76 -47 57 -113 62 100 158 -154 2
5538 2 30 -357 -32 117 -91 140 -99 -118 129 31 -169 5 114 -222 64 -66 237 -189 0 81 -216 -69
5560 -69 157 147 99 6 108 43 198 11 42 62 121 -66 135 -49 141 23 285 -115 10 74 -10 39 -117 99
5584 99 -268 188 24 43 38 22 193 -4 316 23 84 197 125 -109 102 -19 -69 106 -230 21 -91 -70 -88
5607 -88 25 123 -35 -36 66 92 -258 174 192 204 232 34 32 -127 35 -63 31 -4 -124 135 77 -79 -114 -93 -102 122
5633 122 -111 -183 -65 -138 16 187 -68 245 -65 -33 111 215 -85 -99 -44 -278 -34 12 -246 -136 29 62
5655 62 -140 178 91 -96 -165 13 268 107 -19 0 -22 -3 168 -106 -34 -77 269 41 84 55 -14 209 11 93
5679 93 37 -66 54 274 -13 260 93 191 106 -96 14 -36 -138 135 -89 -58 24 -252 134 -8 174 32
5701 32 -63 -49 129 -61 279 -23 165 191 -98 -225 24 214 242 37 153 -175 -8 -87 50 92 -198 -240 126
5724 126 60 -41 8 -23 221 -98 -207 34 227 -301 -191 92 15 120 -124 -37 227 111 1 -19 -50 7 -105
5747 -105 35 144 -83 169 203 42 -80 54 -254 136 124 -278 260 154 -21 -187 -74 115 298 92 134
5768 134 42 -118 312 133 61 -77 -76 152 -103 -19 -1 -26 59 -5 -76 -4 46 -16 119 188 28 111 61 -67 12 -8
5794 -8 -217 -147 165 208 240 328 -230 -127 33 -79 -244 -39 -50 16 87 -81 -169 62 221 126 -77 -184 -15 132
5818 132 -60 1 102 54 145 -12 252 -22 -37 -142 209 105 120 1 -43 -262 -19 2 67 183 -240 83 -126
5841 -126 -154 42 -101 102 -27 -41 78 109 93 -24 -225 134 50 0 150 -79 -142 -50 21 -62 128 -52 470
5864 470 22 95 -177 -13 -19 -223 -79 70 -40 170 27 191 -36 57 168 0 -38 56 -207 -224 170 -143
5886 -143 -45 -35 333 23 181 96 15 1 107 65 -90 -236 166 -57 -180 -107 160 -141 -240 76 36 67 233
5909 233 -22 -31 32 -346 -79 99 174 -120 208 37 -1 281 -19 -138 297 60 -66 115 -26 97 10 120
5931 120 165 32 260 228 -164 -48 126 -8 -48 -55 -32 -244 39 -130 -296 -118 269 200 -40 -31 73 -124 -87
5954 -87 -68 202 -151 32 -45 222 119 43 160 -38 83 224 -195 117 159 -23 -17 -81 -167 -225 114 -23 -107 99
5978 99 -159 94 -24 -46 180 -67 204 114 47 193 15 -22 118 28 52 112 -65 -101 153 183 -43 95 -57
6001 -57 49 140 112 -65 -126 -113 -164 92 -92 -183 -139 -173 -111 0 81 -66 -31 -10 13 -120 30 14 28 -118 61
6026 61 -74 -62 83 -286 56 -111 177 77 -99 172 163 -18 94 -6 -43 -47 -268 -83 13 129 -113 -31 -12
6049 -12 33 142 -207 -122 -29 -11 -45 45 -31 88 -123 -197 -200 67 -9 -27 53 -168 -119 -55 83 -160 41 127 -43 22
6075 22 2 21 99 212 67 -102 77 78 -46 36 131 2 -164 80 -177 -133 23 12 -136 -113 -2 10 -12 -61 34
6100 34 -88 5 45 -43 -93 -100 32 59 115 145 -33 -45 42 23 -3 -30 -61 205 17 -231 130 -56 98 37 -91 165
6126 165 71 131 -57 -228 -25 141 -42 19 -13 79 -117 -15 15 146 205 51 -309 25 -165 25 -224 -78
6148 -78 -204 75 68 3 149 58 141 -95 -97 -83 -228 -50 42 -135 4 77 -130 146 -240 191 -116 138 137 164 -226
6173 -226 48 -161 -159 -278 273 -47 95 33 137 63 -73 -94 31 -13 266 75 9 -39 111 -274 116 -192 24
6196 24 -177 15 -19 136 -166 62 -158 88 135 -58 -89 81 -45 61 -38 174 -3 168 39 -178 158 211
6218 211 -218 -53 78 48 64 -25 -220 -64 -244 -88 -120 132 -39 -157 80 -37 -120 -169 -22 155 83 -148
6240 -148 37 18 22 -35 90 171 46 151 -6 141 88 107 -53 -89 -67 41 -83 291 -210 -40 233 10 109
6263 109 118 2 -61 -33 -162 -113 132 -46 -56 63 -119 -32 127 18 133 -197 -65 46 117 -37 8 58 115 237
6287 237 6 253 139 161 -103 -27 -136 -68 0 191 166 215 47 -114 93 276 37 162 -59 8 -54 -37 -40 -21
6311 -21 -95 -22 -57 298 -10 -80 70 125 -8 181 384 -143 -36 -50 -120 49 29 -70 31 246 -4 -84 203 -222
6335 -222 -131 -49 226 -121 -157 -75 99 -21 -222 83 42 189 -199 -61 83 -281 13 103 2 167 -196 230
6357 230 -22 -232 12 -148 39 93 -24 28 70 -275 57 141 22 58 -209 -9 -105 11 -59 -33 244 52 -216
6380 -216 11 115 31 73 148 -116 171 -202 -182 -48 173 41 10 -95 -63 -208 -27 -8 93 54 129 301 -17
6403 -17 -28 123 52 64 72 -196 23 62 19 127 -154 -35 -138 30 -220 -129 -74 65 123 -124 123 65 37 -148
6427 -148 -27 -146 27 -97 -23 -97 -66 133 -209 137 66 55 269 -56 128 159 -86 208 2 -51 63 95 -478
6450 -478 -34 240 114 -93 159 -52 -148 55 -202 103 142 -77 118 285 80 -55 90 94 -6 -109 -105 164
6472 164 126 -119 85 83 -6 148 -327 -89 190 -66 97 -71 -180 78 21 -152 196 165 -110 182 -132 -91
6494 -91 215 35 40 -98 -81 135 183 100 -138 41 33 69 -214 102 124 -17 -122 -50 76 -92 71 22 -10 -183
6518 -183 -82 -23 -25 -112 46 107 -21 45 -24 101 -140 29 40 34 -261 -180 169 -133 -82 -116 130 -33 12 155 15
6543 15 -66 62 -204 108 28 -93 -188 164 -198 -101 76 -152 43 -300 -94 -129 -140 -131 347 29 -136 190 124
6566 124 -91 -183 16 117 170 16 -139 110 -83 -82 308 -175 -181 -118 147 58 148 -37 -84 24 -181 -375 -166
6589 -166 -2 86 90 121 109 178 -9 -13 104 -126 -102 -45 -26 -79 -98 89 69 -36 38 -40 84 151 264 -107 -56 -266
6615 -266 7 205 147 159 -58 -317 87 82 44 -68 174 -55 89 490 16 235 -65 122 0 17 30 -91
6637 -91 -114 -158 10 -87 325 -178 181 36 -51 188 68 59 17 -93 -60 1 73 121 234 -3 110 126 20 83 78
6662 78 80 186 117 -19 136 -136 -125 183 49 -200 -73 156 -1 -93 102 3 -144 -36 29 199 -127 32 135
6685 135 -10 99 253 -58 -9 -155 4 180 59 66 148 -50 -48 224 173 -116 -22 -5 -29 -18 -3 127 42 5 -75
6710 -75 51 215 37 209 56 -10 166 -124 226 -66 176 -113 -55 160 -108 -265 -177 50 -96 -149 142 159
6732 159 101 -281 2 -17 -54 -142 -51 32 -121 173 107 -18 116 170 -79 -48 79 -47 -11 -16 58 83 44 30 2 -26
6758 -26 -487 -85 255 24 -334 81 -125 141 119 25 -36 129 -12 -58 -124 52 -40 -106 10 -55 -88 57 -55
6781 -55 -154 303 69 79 -5 94 36 -132 186 -33 288 61 -101 -108 -22 1 206 -96 17 178 -84 44 -162
6804 -162 -16 -88 -11 -10 9 -1 -59 -78 -177 99 -36 56 -40 -24 20 -8 -115 -259 110 -183 -46 -29 -8 65 -76 -76
6830 -76 -59 -31 -219 52 -91 142 17 -237 204 217 33 -11 -21 -123 -198 173 -4 11 -87 -150 113 -59 35 -11
6854 -11 -23 85 55 -193 177 -120 241 6 -26 -95 -11 -71 139 -210 256 103 97 -94 234 -115 -2 -29 123
6877 123 -49 100 54 -64 -98 -77 -71 -30 74 -178 222 14 25 -27 -239 -158 -145 -45 -114 -80 0 19 -36 -51 279
6902 279 -140 150 217 -118 -5 72 -136 115 13 28 -199 -97 -9 -74 124 176 192 -98 -48 192 -185 -137 167
6925 167 209 -56 -77 -187 -73 -80 -67 284 -66 11 -165 -21 138 -42 -17 -60 -145 52 153 67 -8 171 -76 -215
6949 -215 -21 -328 97 -33 88 -40 -188 194 18 -11 201 80 -15 6 8 210 59 -88 -92 -32 -79 78 -164
6972 -164 -57 192 -76 307 -151 39 142 26 139 -23 -46 -46 -5 -275 -19 -151 52 -35 -158 103 260 107
6994 107 -192 -76 -13 -21 82 -173 -57 3 53 124 141 -54 73 -15 -354 -59 49 4 -277 -72 192 -220 -141
7017 -141 -62 -66 -154 186 103 -149 110 -77 -66 -2 7 285 -178 -57 164 -47 -5 205 18 -69 115 -60 -125 45
7041 45 214 367 -8 -94 -95 136 124 -77 28 -93 33 -14 -42 80 3 -214 -72 112 9 265 -190 -28 51
7064 51 -90 122 190 89 194 -17 -171 -210 105 -11 -222 181 54 44 -280 67 20 37 -158 -99 54 -68
7086 -68 -88 -32 -48 -214 129 38 -120 90 131 86 -66 -55 -127 -163 43 -68 98 179 -214 -288 83 33 106 57 117
7111 117 127 -84 59 47 38 116 36 -41 8 -64 101 16 -161 27 -85 14 -251 40 -33 27 163 -36 -55 191 -4
7136 -4 36 -18 -5 243 -160 36 -109 -50 -175 -53 0 -29 -14 51 -85 -154 -30 -164 44 -17 -45 78 184 197 33
7161 33 27 -109 19 -111 -93 -284 -93 -171 -241 55 7 43 161 46 -16 116 90 -90 84 -141 -283 154 130 254
7185 254 -33 -126 -86 71 142 -64 -25 -65 -60 -7 98 -309 -75 -132 -192 -48 281 96 40 -136 -34 -26 -102 -375 50
7210 50 110 -66 -169 230 125 -88 38 0 87 91 164 285 -186 -67 213 -20 -43 6 -36 -166 -131 35 38 -19 122
7235 122 -167 -7 162 165 42 433 -112 -222 -109 -50 -16 -106 134 13 -93 -57 10 -6 91 226 7 60 205
7258 205 -85 28 -97 356 87 83 60 -36 240 -97 180 28 -2 18 70 -180 17 -469 -145 -73 -214 137 134
7281 134 -5 -244 -58 22 289 -14 144 20 17 115 -58 -21 -76 31 -122 -35 142 -121 -299 23 95 -261 -43
7304 -43 1 63 146 74 50 88 102 57 -12 -10 71 22 -197 11 -66 -212 -5 -73 219 271 -101 26 169 -177 -27 -31
7330 -31 100 77 100 81 -37 -146 116 23 -40 1 -32 -166 -78 108 -84 -166 126 355 -149 -152 -4 -205 56 -50
7354 -50 121 20 88 125 20 36 103 -130 -61 -116 -73 82 -223 -26 -192 58 92 11 27 -57 71 -13 33 65 -17
7379 -17 -66 -59 11 28 -201 182 197 42 172 105 28 -159 91 189 13 255 -300 -85 -77 -81 -100 12 58 -137 -25
7404 -25 -31 -67 -67 -205 -121 125 -195 -127 109 -115 200 -20 -11 109 -119 -28 83 -42 -88 97 -28 26 -283 148
7428 148 -8 -115 -2 -7 40 254 31 -103 -239 -109 -71 229 99 -43 61 -188 143 -81 45 -117 119
7449 119 4 106 -203 -19 42 -73 -54 -1 -199 -75 152 -19 150 -198 70 -142 74 71 -65 17 178 167
7471 167 63 -170 -5 -111 -27 2 65 -250 -40 217 -10 -80 -29 120 203 -16 -135 -11 22 -197 148 -37
7493 -37 11 -146 34 -158 101 -10 -42 -45 -116 79 83 -21 65 -247 -83 2 67 -80 -217 218 -77 21 -141 130
7517 130 -84 -12 120 115 300 -235 37 13 158 -43 -106 -4 68 57 -24 109 13 43 161 30 -135 91 -37
7540 -37 -37 -1 -132 99 115 37 265 51 110 -155 17 -9 -91 -289 103 33 76 18 65 -287 61 -105 14 242
7564 242 57 -63 -25 94 -35 108 -129 -38 -168 68 22 140 68 4 17 -118 -7 140 -37 -140 67 -123
7586 -123 -45 -104 121 -85 82 203 -85 12 242 118 53 4 153 209 130 -306 79 -137 -105 60 -51 -70 -135
7609 -135 120 105 19 126 187 -15 51 -72 20 68 73 -83 9 18 -75 82 -3 -29 -10 370 164 18 135 36 -71
7634 -71 -102 41 52 -71 49 -170 -52 -59 -11 -94 -3 102 101 -243 73 -13 83 -212 -159 43 93 149 -92 -10 0 -84
7660 -84 -164 -63 -73 -85 -3 -72 311 107 23 -143 89 -16 82 -192 -40 34 -103 205 18 197 66 -6 104
7683 104 180 -132 327 162 -67 142 46 -54 9 107 62 -52 32 -154 -1 29 144 108 5 265 -159 -106 219
7706 219 -77 52 96 51 31 17 74 160 48 203 -121 0 -48 152 40 -71 25 -159 21 -37 -142 -12 119
7729 119 -151 -24 -39 33 211 -50 -48 30 68 -151 -111 22 82 27 -131 149 -181 76 -14 -55 -266 -39 -83 -79 -145
7754 -145 -48 138 39 120 -136 -44 27 16 103 -186 162 25 54 -119 87 -77 60 -81 122 13 51 98 -147
7777 -147 -58 -92 -56 -235 -4 10 -110 -54 18 -78 -177 88 210 -26 -206 107 -157 43 -171 -31 28 117 -95
7800 -95 0 87 87 -167 184 202 17 229 -21 9 -59 -10 52 41 1 -109 -102 -20 -184 -151 -46 88 -185 -18 -256
7825 -256 -168 23 -3 30 156 38 -286 -152 -22 138 35 291 6 111 103 13 -43 -81 22 21 -15 134 -118 143
7849 143 -221 -19 -174 74 92 -75 -303 37 -122 97 231 -13 -167 98 205 -196 -24 -193 -20 -102 77
7870 77 -86 -102 -21 128 55 18 -152 46 -43 192 7 42 107 -105 -13 65 234 25 -1 228 -20 -155 -194 70
7894 70 76 -77 -15 -40 -89 21 -26 38 162 252 -224 7 186 73 10 29 40 -12 -228 122 -130 18 -18 -11 64 118
7920 118 8 -40 -25 -94 90 -168 -73 269 119 -185 -96 -124 183 -33 -102 -41 -96 -6 -154 130 -128 -175 -185 167
7944 167 -55 -27 -43 100 -70 -4 -84 -76 178 300 -85 -74 26 174 -139 138 -156 -135 -102 65 -58 -34 188
7967 188 -121 54 21 133 -97 51 97 -3 219 170 -73 161 -96 132 -145 189 -204 31 116 -60 -115 -176
7989 -176 -18 -40 144 -66 20 91 -117 -111 45 -1 129 -70 182 9 -87 143 76 180 -7 45 94 -53 160
8012 160 36 78 -200 6 -164 -143 22 23 -80 20 20 -242 275 -226 95 175 259 -7 37 76 -136 -114 -1 -104
8036 -104 -226 -328 129 51 -32 238 187 -63 -196 -30 33 -12 -40 81 66 121 240 60 -13 57 -79 -6 -116 264
8060 264 -172 -62 -207 -17 40 -167 -108 -56 -72 -30 -172 30 196 68 -11 -143 -138 -90 71 -105 17 119 18
8083 18 153 130 -87 66 14 61 60 26 -84 -204 -8 123 -103 19 -81 72 -222 -15 98 -92 -111 -185 -44
8106 -44 320 85 41 30 -128 -99 115 -308 44 107 -25 -81 97 -192 -29 213 -170 115 172 -147 29 -14 165
8129 165 -30 146 14 -142 135 -63 -30 -146 84 -255 -150 154 199 61 45 -32 43 -149 147 -154 53 -192
8151 -192 132 96 312 0 119 440 79 -36 -53 185 -65 31 -36 -270 -156 36 -82 -33 25 -99 81 -22
8173 -22 254 58 98 58 78 93 58 312 -172 -124 -135 55 106 161 -138 -88 72 146
8191A46
$$ Imaginary data points
##PAGE= N=2
##DATA TABLE= (X++(I..I)), XYDATA
0 0 0 0 0 0 0 0 0 0 0 0 0 0 0 -4 8 -8 8 -8 13 -16 16 -24 24 -31 32 -40 48 -53 61 -69 80 -89 101 -114 129
35 129 -146 163 -181 201 -224 249 -276 305 -338 373 -411 453 -500 552 -608 667 -737 813 -897
54 -897 995 -1103 1229 -1375 1546 -1754 2004 -2322 2730 -3284 4070 -5272 7310 -11403 22622
69 22622 -114436 -300018 165159 177937 -158558 27320 219969 -100032 -108749 214114 66313
80 66313 -189079 39565 127512 -124027 -67092 135631 -31383 -134038 70967 65763 -111121
91 -111121 -5930 88435 -83203 -79606 112247 23851 -121115 29762 96319 -68097 -27214
102 -27214 126439 7397 -103877 42221 74614 -61972 -18384 65138 -50992 -85863 59073
113 59073 56832 -68221 -33165 51222 6334 -15419 39260 11866 -39540 17647 48459 -26736
125 -26736 -35214 31344 -843 -54557 12279 39541 -46318 -33265 47486 -8343 -48676 52273
137 52273 40949 -81412 -19358 92566 -4204 -66238 48466 42799 -64405 8829 91650
148 91650 -19977 -64610 45702 35257 -58728 -8378 40041 -49889 -60667 42178 22518
159 22518 -62970 -12641 47640 -6666 -15260 45827 12090 -37843 26605 47541 -34808 -23174
171 -23174 47307 -5454 -55043 22404 38656 -41147 -18007 42928 -17343 -42670 43704 28799
183 28799 -64926 -16202 61190 -9357 -48894 33732 28930 -47932 3997 62589 -21081 -46688
195 -46688 44102 24327 -51780 6617 43403 -43583 -34486 54522 2219 -58173 23544 35611
207 35611 -45479 -948 56287 -27213 -38529 57699 16847 -61871 20884 56925 -45604 -30115
219 -30115 58848 -3568 -55230 33579 32440 -60358 -11401 59388 -21914 -55622 36481 26963
231 26963 -49243 1214 46442 -24075 -26266 47181 12348 -40752 19562 38137 -32045 -15028
243 -15028 41523 -8074 -38945 23332 17776 -40536 -3189 35525 -20268 -28973 32047 11161
255 11161 -37372 8972 35594 -23738 -23568 34448 10870 -34525 5511 28434 -20224 -16860 30309
268 30309 1074 -34090 13501 28638 -24430 -15243 29962 -579 -25813 17948 17010 -27575 490
281 490 30898 -15751 -21774 28678 7886 -31495 8924 25418 -24304 -15037 29371 -4584 -32760
294 -32760 15126 18962 -29445 -8228 29165 -8902 -25258 21829 17940 -23838 903 29475
306 29475 -7210 -15527 23566 9798 -22012 6217 19967 -17010 -13896 18561 -2402 -25970
318 -25970 6173 12890 -19811 -8356 18420 -5900 -16683 16654 12834 -19417 -429 24083
330 24083 -5048 -15796 16523 9027 -20325 2198 20391 -12572 -15705 18724 6102 -21871
342 -21871 5724 19394 -15646 -11127 22110 393 -21797 10185 15122 -19188 -5663 21553
354 21553 -7227 -19762 16278 9918 -23050 885 21013 -13478 -16119 18678 3476 -23107
366 -23107 7364 18718 -17411 -8481 24894 322 -19308 15353 17284 -18374 -3095 23622
378 23622 -6612 -18969 16020 8764 -23516 535 19896 -14544 -17194 18428 3222 -24713
390 -24713 4393 16633 -18958 -11216 22438 -1382 -20954 15491 18415 -17110 555 27246
402 27246 -5690 -16481 21498 9958 -25760 1532 19981 -18651 -15850 21264 -1353 -25603
414 -25603 11793 19161 -20234 -7015 24707 -5601 -20668 16054 9785 -24362 -1525 20783
426 20783 -11163 -15399 18904 6605 -18610 8639 20557 -12864 -8991 19821 -98 -19427
438 -19427 8365 11473 -19081 -6146 19827 -3970 -16909 13525 11553 -15890 795 18464
450 18464 -9563 -16633 12119 5212 -20304 -1906 13592 -11468 -11629 18177 6458 -16668 6204
463 6204 19772 -8113 -7388 19209 268 -20349 10121 16781 -18465 -7873 21616 -4706 -19069
476 -19069 16519 11019 -25542 -2864 20881 -15141 -19229 18438 1613 -25144 9057 22231
488 22231 -14232 -6212 25931 1746 -15431 17004 14539 -20485 -5051 18329 -9622 -18329 11815
501 11815 3714 -21491 1991 20127 -8701 -11717 17440 4863 -16161 7712 15405 -15830 -11745
514 -11745 16259 118 -17165 7501 11970 -14093 -3770 19682 -64 -15115 7559 9309
526 9309 -13837 -3764 14339 -7112 -18159 10671 13387 -13000 -2115 18075 -4778 -11560 19041
539 19041 10177 -23006 -2096 18998 -13459 -15641 18477 -654 -26806 10026 21328 -18335
551 -18335 -7832 24420 -4440 -19071 19574 12232 -26034 -334 23459 -11782 -14627 20725
563 20725 2741 -22507 9863 20287 -16333 -10204 18987 -4140 -19510 13716 12572 -21229
575 -21229 -5772 20463 -3212 -12755 16108 7949 -18839 2767 19106 -10105 -14459 11970 730
588 730 -17948 2758 11445 -12492 -8588 15164 4019 -11107 6650 12270 -7542 -3076 15707
601 15707 1592 -15366 3337 12014 -10782 -7296 14881 -1734 -18989 8010 14734 -15083 -6107
614 -6107 17700 -7228 -19677 14560 10596 -21944 -944 19563 -11779 -11823 21397 3353 -19730
627 -19730 11506 18101 -17072 -5505 21808 -5229 -17355 15918 8696 -21881 30 18545
639 18545 -10375 -12069 16919 1587 -21491 5559 16570 -12820 -9042 14749 -2450 -15469
651 -15469 9757 10995 -13666 -3607 14016 -3926 -9785 10701 5355 -11290 1756 11553 -5302
664 -5302 -7300 8876 5080 -7170 1507 7785 -5666 -7188 8263 5052 -11148 -3401 8944 -5164
678 -5164 -10803 8915 5363 -14346 -110 13412 -7886 -9450 15824 4410 -15850 5775 13945
691 13945 -13191 -5378 18570 -3014 -15279 11989 8213 -16392 1974 16995 -9641 -11317 15130
704 15130 1752 -16734 6709 12579 -14093 -7099 14272 -3546 -14479 9839 8008 -15067 -1392
717 -1392 14921 -6017 -9495 13614 5474 -12525 3699 11203 -7843 -4582 11793 -400 -11196
730 -11196 4844 6970 -8848 -2705 8525 -1910 -7229 4546 3935 -6499 -799 7276 -1661 -7558
744 -7558 3282 4779 -6331 -2955 7431 -1790 -8897 4834 6628 -8165 -1788 10781 -2774
757 -2774 -7844 9444 5703 -10624 1991 11579 -7104 -7252 10846 612 -11920 5307 7928
770 7928 -11070 -3710 11102 -3676 -9900 8332 4377 -12114 242 10169 -6432 -6668 9581
783 9581 487 -10136 5318 8572 -7713 -2405 11245 -885 -7469 7711 5021 -8995 850
796 850 8316 -5318 -5941 6634 572 -8292 1879 4489 -5945 -3197 5432 -258 -5045 1985 3067
811 3067 -3311 -1441 3837 468 -3223 2118 4103 -2657 -2136 5035 1217 -4418 1713 4391 -3791
826 -3791 -2171 6353 -496 -6049 4110 4346 -6129 -625 6499 -3781 -6456 5219 1410 -8671
840 -8671 246 5057 -6414 -3554 7289 -362 -6403 5016 6082 -4712 73 7433 -2580 -4854
854 -4854 6213 1911 -7169 1512 5177 -4862 -2323 6849 -1063 -6047 4727 3977 -6295 -935
868 -935 4975 -4504 -5167 4069 240 -6595 1026 4040 -3518 -1684 5065 835 -3016 3089 3464 -2483
884 -2483 -284 3540 -777 -2873 2186 1838 -2653 -229 3219 -805 -2368 2740 1709 -3447 -320
899 -320 2944 -2497 -3098 2637 521 -4577 440 3414 -2562 -2299 3839 49 -4132 2283 3371 -3610
915 -3610 -1751 3940 -759 -3024 4227 2841 -3661 990 5141 -1546 -2278 3696 169 -4979 1544
930 1544 2715 -5185 -2789 3818 -1496 -3707 3283 1983 -4555 60 4684 -2030 -3569 3378 477
945 477 -4971 1136 4069 -3219 -1999 5011 1374 -3171 3363 4439 -3016 -790 4903 -972 -4269
960 -4269 2271 1262 -5469 -770 3672 -2957 -3675 3677 838 -4484 1727 3783 -3620 -1865 4412
975 4412 -724 -4817 2472 2725 -4846 -576 5444 -1331 -3429 4626 2644 -4071 1503 5309 -2846
990 -2846 -3486 4384 826 -4629 1171 3023 -4294 -2007 4254 -1023 -4739 1251 1696 -4016 -808 3052
1006 3052 -2373 -3207 3145 2371 -2565 939 3948 -1104 -1364 4267 1640 -4261 427 4117 -2425 -3404
1022 -3404 3641 978 -5209 1085 5041 -3521 -3571 4852 247 -5848 2224 3801 -5901 -2808 5402
1037 5402 -1601 -5129 3875 2704 -5231 1546 6536 -3011 -3075 6614 1194 -5562 2832 4725 -5506
1052 -5506 -2190 6532 -1498 -6288 4245 3601 -6322 -169 6511 -3403 -5212 5295 1965 -6748 594
1067 594 4881 -4124 -3197 5078 -533 -4639 2737 3572 -3390 -544 4511 -150 -2469 3013 2546 -2729
1083 -2729 171 3410 -994 -2961 2190 2103 -4079 -1863 3633 -1645 -5028 2744 2653 -5284 -980 5876
1099 5876 -2259 -5082 5145 2534 -6402 1013 6698 -4199 -4243 6441 1191 -6073 3300 5138 -5284
1114 -5284 -1594 7258 -854 -5616 4805 3254 -6705 761 6387 -4647 -5163 5597 746 -7483
1128 -7483 1821 4623 -6519 -2208 7433 -1620 -6355 4374 3703 -5321 670 5970 -3185 -3881 5131
1143 5131 1787 -4608 1350 3825 -2594 -1564 3695 779 -2912 738 2649 -1596 -1761 2020 463
1158 463 -3261 -534 2540 -2005 -3560 2295 1368 -4288 491 4355 -3125 -3133 5605 1576 -4890 2794
1174 2794 4627 -4867 -1435 7256 -1075 -6100 4472 3876 -6313 463 6869 -3472 -4938 5690
1188 5690 1585 -6969 1772 5587 -5617 -3710 5824 -1627 -6459 4095 3342 -6485 -318 6406 -3324
1203 -3324 -3768 6425 1704 -5450 3249 4691 -4672 -958 6119 -1138 -4627 3069 1744 -4268 279
1218 279 3741 -2061 -2906 1814 891 -1997 -139 1872 -708 -2731 223 1678 -1474 -1389 2108 304
1234 304 -2820 1261 2726 -1998 -1017 4296 274 -3508 2679 3055 -3428 573 5113 -2424 -4261 4095
1250 4095 1640 -5491 1092 4239 -4895 -3538 5376 -576 -5529 3109 3697 -5770 -1308 5832 -1853
1265 -1853 -4213 5071 1825 -6064 1352 5228 -3882 -1912 5489 -774 -4683 4174 2907 -4686 489
1280 489 4401 -2930 -2759 3849 -7 -4075 1611 1782 -3690 -1446 2232 -809 -1715 1266 1061 -1698
1296 -1698 -636 1646 998 -689 -198 1011 -429 -1303 1479 1488 -2044 -656 2114 -134 -1708 2111
1312 2111 1402 -2723 503 2907 -2306 -2066 2945 -213 -3581 1265 1744 -3959 -900 3780 -1466 -3567
1328 -3567 2870 1675 -3954 1128 4394 -2740 -2169 4348 233 -3893 2779 2981 -3708 -492 3860
1343 3860 -1932 -2865 3666 803 -4085 1322 2416 -2908 -900 3202 -1374 -2818 2047 543 -2696
1358 -2696 495 1126 -1830 -968 1370 -17 -878 724 1075 67 636 892 546 78 257 929 225 -698
1376 -698 -216 732 -892 -856 788 -228 -2003 300 1182 -1446 -1083 1392 -590 -1539 1208 881 -2340
1393 -2340 64 1975 -1254 -1332 2149 506 -1932 1540 2060 -1660 78 2697 -686 -1657 2392 681
1409 681 -2353 702 1789 -2235 -1109 2083 -1098 -2191 1624 470 -2354 531 1426 -1805 -769
1424 -769 1815 -450 -1627 1272 498 -1513 936 1381 -842 -20 1308 -232 -259 1343 453 -645 706
1441 706 632 -450 -122 456 -438 -566 204 -108 -465 -479 -695 -407 17 -469 -107 93 -134 -129 536 640 -396
1462 -396 42 784 97 27 806 -256 -253 637 466 -378 389 428 -687 291 690 -581 -659 759 -437 -1333
1482 -1333 308 181 -1279 -347 806 -852 -1046 892 335 -1260 739 1297 -573 86 1736 126
1498 126 -428 1102 416 -1027 424 1076 -1077 -403 1180 113 -1184 790 763 -1419 77 1055 -938
1515 -938 -1412 669 280 -1491 -51 577 -1288 -535 1179 122 -1245 471 845 -345 88 1536 -214
1532 -214 -683 988 860 -1026 -195 1268 -446 -1029 665 292 -1531 -89 914 -722 -805 840 -125
1549 -125 -1554 506 821 -1430 -779 984 -584 -1328 998 720 -1295 83 1688 -299 -438 1413
1565 1413 843 -952 232 1327 -124 -759 478 245 -1373 -28 1068 -1113 -1069 690 -226 -1225 368
1582 368 1012 -1136 -921 1310 131 -1060 683 677 -1615 -382 2002 -105 -1640 1253 1137 -1332 -65
1599 -65 2245 -787 -1471 1902 1311 -1707 -63 1647 -1263 -1403 1691 8 -2572 573 1495 -1977
1615 -1977 -548 1920 -648 -2145 1981 1249 -1976 399 2038 -1342 -1015 2683 64 -2067 1198
1630 1198 1680 -1577 -240 1780 -229 -1379 1283 794 -1288 -340 1252 -311 -1361 549 464 -1437
1646 -1437 -692 1049 -80 -1462 529 1056 -1016 -152 1409 -323 -797 1243 1011 -1191 170 1846
1662 1846 -608 -1296 1469 574 -1836 266 2174 -1231 -1859 1954 742 -2407 817 1778 -2276 -1137
1678 -1137 2573 -520 -2939 1481 1216 -2874 -98 2560 -1797 -1475 2808 581 -2061 1628 2235 -2000
1694 -2000 -16 2786 -629 -1673 1710 352 -2308 309 1414 -1584 -1322 1185 37 -1512 371
1709 371 819 -757 -767 650 72 -998 172 1076 -510 -831 837 891 -667 -125 1522 -7 -880 1227
1727 1227 968 -1224 42 1817 -759 -1294 1385 362 -2059 269 1888 -1628 -1634 2052 -131 -2377
1743 -2377 1426 1585 -2550 -708 2783 -1073 -2187 2296 900 -2889 934 2620 -2001 -1067 3281
1758 3281 -130 -2238 1891 1337 -2363 490 2385 -1442 -1531 1924 -11 -2033 905 709 -1806 -476
1774 -476 1287 -643 -932 772 171 -918 354 858 -193 -299 541 265 -519 -491 483 274 -485 -27
1792 -27 707 -163 -786 1084 788 -969 -57 1291 -552 -1004 1264 385 -1856 -19 1271 -1393 -1271
1809 -1271 1494 -64 -1898 911 1042 -2313 88 2782 -982 -1351 2418 286 -2315 1551 2046 -2231
1825 -2231 -849 2702 -876 -1832 2532 693 -2345 417 1688 -1729 -607 2202 -724 -1544 1254
1840 1254 665 -1813 19 992 -1044 -880 850 -393 -898 710 640 -382 -7 435 -56 78 281 630
1858 630 -268 -498 86 187 51 -386 322 302 -743 -318 580 -226 -790 909 24 -1255 -38 1110 -954
1877 -954 -719 1379 -492 -1344 1110 1088 -1335 -62 2016 -716 -733 2042 552 -1674 1272 1215 -1763
1894 -1763 -195 1557 -1206 -1003 1564 -187 -2094 460 1087 -1497 -187 1352 -880 -1069 1062 186
1910 186 -737 508 628 -709 -204 868 102 -368 633 202 -62 662 272 47 147 328 -68 135 -55
1929 -55 -180 67 -39 -556 -341 17 -724 -480 565 -227 -653 656 218 -614 332 753 -249 -452 1146
1948 1146 -119 -837 878 792 -998 -97 1026 -863 -465 1460 -78 -1234 837 954 -992 -62 1011
1965 1011 -892 -708 810 -300 -1232 299 324 -802 88 818 -581 -276 994 201 -504 720 110
1982 110 -242 564 664 -525 -64 187 -635 -202 336 18 -264 116 -69 -363 3 -90 -536 -78 292 -637
2002 -637 -373 429 -282 -623 367 266 -679 6 791 -24 149 739 195 -73 720 632 -364 482 276 -284
2022 -284 -128 682 -413 -254 688 -20 -709 48 191 -359 -51 339 -487 -464 526 56 -296 4 -82 -159 208
2043 208 114 -44 265 220 102 433 387 16 -113 268 270 -379 139 174 -521 30 423 -513 -382 205 30 -464
2065 -464 504 256 -367 97 718 -441 -324 151 -110 -425 366 412 -672 20 673 -226 -294 571 470 -355
2085 -355 250 526 -172 107 303 -175 -406 44 363 -428 -425 223 -68 -367 -225 208 35 -332 232 162 -304
2106 -304 126 440 -81 -20 419 130 99 6 91 -149 -17 448 28 -416 379 526 -325 75 315 -561 -352
2127 -352 370 310 -389 -74 343 -426 -447 564 175 -495 371 363 -168 -43 545 108 -126 268 353 -156 -98 308
2149 308 -39 -310 615 296 -414 91 523 -98 -534 193 101 -934 -402 432 -503 -575 175 35 -916 31
2169 31 544 -580 -219 597 359 -515 460 726 -424 -105 775 -265 -394 693 362 -694 69 188 -486
2188 -486 -390 260 208 -712 363 554 -660 -87 409 -233 -531 35 192 -467 -118 445 -27 -381 255 341
2208 341 15 288 350 137 -3 333 522 -95 -186 292 45 -404 -56 307 -594 -704 423 105 -627 137
2228 137 359 -743 -477 736 -335 -732 616 279 -1021 320 1115 -384 -289 1008 -82 -658 601
2245 601 470 -893 -393 1047 -513 -560 577 20 -1036 14 550 -1065 -397 781 -101 -746 202 566
2263 566 -824 -154 335 -38 -298 650 404 -214 190 504 12 -74 175 320 17 25 355 -74 -152 64 332
2284 332 -227 -280 165 -91 -434 -38 45 -639 -205 394 144 -667 364 676 -931 -94 1169 -294 -547
2303 -547 847 310 -912 257 578 -730 -616 957 -102 -934 710 329 -802 29 880 -931 -419
2320 -419 938 -129 -989 412 367 -891 -76 567 -165 -672 389 283 -431 -20 287 -8 -170 359 76
2339 76 -296 85 271 -296 -218 120 82 -85 39 37 -55 -465 -221 264 -48 -140 109 163 -371 20 438 -437 -565
2362 -565 582 166 -802 174 321 -807 154 933 -294 -419 802 461 -912 442 1072 -1086 -654 992
2380 992 -503 -861 945 391 -1193 5 737 -834 -362 748 -41 -661 458 364 -769 95 644 -387
2398 -387 -672 577 224 -557 200 256 -505 -387 533 -86 -130 272 233 -408 109 -29 -142 -235 -35 -32 -155 -314
2420 -314 -469 76 80 -184 92 125 -432 141 632 -10 -438 514 198 -784 223 722 -512 -286 489 -229
2440 -229 -699 816 402 -867 265 625 -820 -385 793 -142 -541 302 69 -1123 475 827 -398
2457 -398 -349 588 -116 -232 492 417 -449 239 375 -266 -52 584 -97 -383 277 84 -392 20 313 -204 8
2478 8 119 19 -127 183 129 -86 -58 -224 -24 280 -268 -89 280 -7 -193 16 234 -280 -89 596 -129
2499 -129 -105 184 215 -448 43 509 -652 -259 509 -401 -314 376 -33 -599 141 395 -593 81 460 -281 -666
2520 -666 528 89 -346 216 414 -470 -335 657 66 -275 330 78 -488 120 490 -141 -156 435 -189 -336
2540 -336 -43 -119 -250 -27 75 -40 19 -79 -172 -31 -31 -262 -3 518 -159 -214 376 119 -445 82 93 -42 131
2563 131 130 -230 -124 443 -250 -403 497 165 -145 112 476 -589 -92 541 -81 -545 360 110 -451 70
2583 70 164 -344 -251 302 -32 -247 403 172 -282 308 460 -249 -37 291 -436 -154 224 -118 -291 108 86
2604 86 -192 -71 -76 -192 -109 58 -32 -201 88 -184 -115 -72 -80 -6 9 -179 -108 27 143 -230 -50 407 168 -20
2628 -20 255 312 -63 143 276 -129 -249 148 -179 -305 -18 -54 -108 -90 149 -268 -442 300 3 -117 25 47
2650 47 -254 39 240 -98 46 116 155 -113 248 181 15 89 488 -176 10 -130 88 -165 3 -284 125 -99
2672 -99 -225 290 161 -5 7 -13 -123 -173 -30 113 -52 14 271 45 74 316 299 -123 210 369 -159 15
2694 15 76 96 -93 177 255 -42 -10 229 131 -564 63 -160 -250 20 59 -80 81 233 44 -162 32 -122 -50
2717 -50 70 269 -82 -196 236 327 -301 -122 53 -227 -303 244 64 0 -27 205 -103 -34 174 70 -222 -149
2739 -149 251 34 -154 175 -33 -211 272 134 -151 116 193 -237 -8 170 -39 -382 33 148 -57 -90 140
2760 140 237 -186 105 56 -160 -192 96 -75 76 61 97 -76 -220 144 -26 -202 -21 167 -20 -290 84 -133
2782 -133 -139 29 289 220 -128 54 49 -168 335 305 18 -162 266 -59 -102 200 292 -500 -123 -36 122 -474 57
2805 57 -86 -258 283 228 33 -75 377 -86 -375 228 268 -363 38 194 -76 -38 322 33 -168 135 98 96
2827 96 -121 282 -161 -290 91 -111 -430 -279 148 -47 -22 -31 45 188 10 -65 59 -90 -205 191 33 -30
2849 -30 118 113 -192 179 432 -282 -168 86 31 -144 218 357 -103 -278 244 105 -283 494 156 -309 -110
2870 -110 334 -324 -274 454 -28 -330 344 311 -364 336 260 -170 -189 451 -141 -318 -29 74 -222 -204 481 33
2892 33 -461 82 100 -218 -16 269 -227 65 33 -151 -53 -25 -330 206 -14 116 98 43 122 -71 196 -69 -80
2915 -80 137 13 25 -83 255 -319 -256 256 -167 -234 472 214 -201 196 276 -472 -324 180 85 -389 211 32
2937 32 -284 -151 378 -428 -105 389 36 -391 220 495 -452 -172 384 -253 -173 463 19 -390 154 76 -122
2958 -122 12 39 -88 -368 14 -13 -367 -98 273 30 -76 144 -140 -123 275 -64 -203 156 122 -88 133
2979 133 56 -45 323 -85 -406 99 -193 -80 -12 197 56 -220 -267 -398 -243 80 150 -164 -51 402 -246
3000 -246 115 272 -48 -299 101 -6 -353 131 142 -28 -19 484 -6 -317 357 233 -34 -116 189 -89 -42 24
3022 24 -161 -375 48 260 -394 -54 227 55 -249 48 48 -248 83 57 64 49 88 -98 -97 -9 33 263 238 40
3046 40 -141 149 270 185 87 -98 -200 50 139 -93 117 374 -399 -106 14 -163 -514 242 -60 -374 210
3067 210 179 -254 -360 138 10 -375 110 210 -49 57 45 -126 -239 116 -73 -151 80 131 3 -142 135
3088 135 -121 -251 372 -145 -27 153 -37 -230 -50 311 -282 -165 42 -68 66 144 226 -4 430 212 -27
3109 -27 116 204 -50 -113 160 -11 165 -161 184 -238 -1 340 -348 -41 148 -92 85 117 -23 51 367 82
3131 82 -146 349 -52 -137 -59 360 -49 -216 -64 -70 -329 5 263 76 124 309 140 1 133 -12 -109 120
3153 120 261 -216 -59 107 -153 -48 -12 141 39 -151 139 -4 188 350 17 -322 98 -38 -52 52 125
3174 125 -1 149 -44 31 182 -142 184 203 -93 -255 77 363 -213 -156 39 48 -356 38 -169 -166 -80 367 -173
3197 -173 -199 110 -30 -18 93 136 -243 182 99 -250 -75 63 230 111 133 382 145 172 247 -201 30 -135
3219 -135 -271 -114 48 -137 -246 194 171 -21 -255 217 136 180 215 -27 82 -38 -86 -29 83 140 -192 -104 145
3242 145 57 -49 44 -214 -94 58 -109 -32 130 9 -231 -274 91 -405 11 213 -30 -45 264 -192 -236 -87
3264 -87 -155 -163 -259 202 -83 -293 144 95 94 -121 268 67 -172 -101 -137 -220 28 -163 188 -111 -60 126 -205 239
3288 239 200 -60 45 297 -168 -195 -101 165 101 60 57 83 13 -282 350 -84 -82 129 278 -137 -80 -104 91 -69
3312 -69 -83 -141 -312 -152 -78 -74 -154 -39 63 -120 21 69 -50 185 29 185 52 -147 -3 83 16 142 -49
3335 -49 233 46 32 -6 -119 106 -11 118 123 176 22 -23 142 -170 -106 -213 157 -194 48 22 94 252 197 -48
3359 -48 -45 12 98 223 166 171 -127 176 -34 -79 -14 149 237 -47 -107 120 -5 82 125 77 -176 36 34 -268 -125 -13
3385 -13 15 -322 239 -62 -49 -158 22 68 -224 135 122 -228 -123 38 -54 -125 -224 97 -26 30 5 392 -136
3408 -136 108 69 109 -127 60 -83 -439 -44 -117 -102 -102 183 30 -55 -205 44 27 -39 227 142 -102 -81 111 -95
3432 -95 -123 157 169 -178 141 212 -207 82 49 -165 -225 260 -59 -100 25 21 4 111 27 46 -144 -165 -119 -89 -36
3457 -36 -149 -235 -148 -79 -51 -199 -10 15 178 89 108 11 -21 55 182 -71 -55 158 133 -97 -181 32 -37 -184 -163
3482 -163 215 -6 99 81 -118 -224 127 157 38 -46 181 52 -362 46 7 -56 241 119 56 -126 182 -65
3504 -65 4 234 -61 -85 271 297 -19 -159 -122 -110 -13 80 -74 -149 111 -38 -144 55 36 -48 126 54 111 -144
3528 -144 42 -33 -116 194 -28 -31 -430 -103 -107 192 66 145 195 -20 -95 -235 5 -88 -294 95 209 -160 -219 137
3552 137 -66 -210 173 -113 97 91 122 5 -96 141 99 -4 37 -35 -176 159 178 -43 -17 214 -109 -171 74
3575 74 -202 -343 80 303 -369 -252 -146 96 -117 -37 -66 -146 159 -213 -244 -65 125 -42 -25 98 191 -75
3597 -75 -209 305 91 166 77 -84 -72 65 78 -161 200 117 -27 36 -5 -254 -12 -40 -80 -51 109 -192 199 -4
3621 -4 308 -20 49 47 -98 116 172 -86 -106 162 98 -151 43 -147 -156 -286 16 -272 -44 106 -243 104 26 153
3645 153 73 -80 33 12 -122 237 -82 -48 116 140 -27 152 96 38 -288 291 200 -48 -120 -63 -83 -11 -51 20
3669 20 -60 -44 -27 72 -145 140 -124 -13 -166 -66 92 -175 5 230 96 141 -307 189 4 38 -112 -168 -142
3692 -142 15 -24 3 115 121 135 -156 -127 136 -37 24 106 -198 -39 -43 -5 -200 -105 -96 -35 -208 18 -61 102 -47
3717 -47 -67 -209 -14 -16 -202 152 -77 -166 275 25 248 87 -191 56 -172 -56 9 -16 41 -213 -84 127 -46
3740 -46 -281 2 487 -215 0 -106 -206 60 -37 42 -39 79 21 -14 81 244 -107 90 -22 -356 -38 64
3762 64 43 -108 -94 77 38 -4 144 3 -231 -51 254 4 63 43 -72 -337 -47 27 -41 115 -258 -131 -95
3785 -95 37 19 -277 5 52 125 -174 117 81 44 86 26 51 190 124 32 -102 -83 -120 -172 66 -275 -73 218 -25
3810 -25 142 -51 -234 154 7 103 40 -39 30 -11 345 159 -127 -41 -137 -48 -85 206 233 -257 109 69 -41 -88
3834 -88 -114 -55 213 6 -45 9 -42 253 -127 30 -94 246 -96 -273 158 42 -136 -81 -43 -302 -1 -19 17
3857 17 -177 300 -10 -15 134 -165 118 61 95 -39 -117 234 263 38 -284 -172 -32 -56 -92 -249 177 45 59
3880 59 296 -79 53 169 -34 -75 139 69 -177 137 -320 -224 4 -174 -1 63 -72 157 -46 -114 56 28
3902 28 87 -18 -94 224 -269 241 -47 -184 81 -101 101 15 179 -105 -230 61 -281 -173 -64 -101 -10 -144
3924 -144 123 112 -112 -8 -165 -153 127 65 -198 175 95 114 -97 231 258 -60 37 2 160 -273 -92 -96 46
3947 46 53 119 19 192 -113 -58 -9 -37 253 -270 -122 115 -189 -51 43 17 -182 -216 232 -96 86 -84 -86 -146
3971 -146 200 -28 -231 -145 136 -149 221 -120 28 23 -18 -124 174 319 123 82 30 90 -21 -87 82 46 -4
3994 -4 -14 -56 42 -108 -218 34 257 -83 9 104 -289 -39 -21 -37 -82 -12 -110 -160 98 62 -23 -177 236 -99 -114
4019 -114 10 283 -12 -134 -92 -164 49 65 -309 -58 -48 28 286 98 161 -40 85 -37 4 268 272 39 -193
4042 -193 150 44 128 124 99 35 -174 -29 -194 -177 -86 156 -89 197 -194 -204 -54 125 -193 36 158 -138 6
4065 6 104 -271 26 1 112 113 -86 15 14 -193 -121 8 -115 262 128 121 -51 -72 31 105 227 72 198 -42
4089 -42 -173 30 -10 335 18 -67 -3 67 317 -130 175 57 19 109 -144 125 24 -26 40 179 -42 -40 -116 32
4113 32 264 -19 -177 -154 0 -81 89 43 -107 25 -86 132 240 -19 11 -101 -97 46 203 39 283 -67
4135 -67 -139 145 -122 -147 -53 12 23 -86 48 -44 58 374 8 145 66 -21 122 144 -79 16 267 -126 -53 -91
4159 -91 -10 -46 77 -8 40 96 -55 -9 59 -95 2 -48 29 -116 73 82 14 29 142 -38 -24 -51 -74 -132 161 249 -146
4186 -146 -184 -88 80 -64 70 274 -26 -58 229 184 58 298 19 -157 15 -153 244 97 -27 100 218
4207 218 183 -369 43 -162 -97 -191 -128 12 -65 -21 37 -7 87 191 -210 293 128 39 51 42 70 -104 -165 133 -110
4232 -110 60 226 -88 140 14 -51 -44 195 382 -20 -16 -107 -238 45 137 -21 -363 165 -62 -46 25 38 -65
4255 -65 -42 189 55 -184 -92 39 151 14 -201 -85 -318 257 41 103 -27 346 -82 -137 121 372 -108 100
4277 100 -49 4 177 -168 -36 -71 107 -51 189 218 -136 -73 -126 155 348 334 114 160 250 -125 80 -35 68
4300 68 170 -103 -125 -221 36 190 112 27 -59 141 -358 -35 -10 136 -196 57 -154 -73 121 54 73 -232 167
4323 167 -80 -96 241 79 -18 198 -123 -22 211 73 79 35 110 -55 -117 125 -253 -169 93 137 -206 57 297
4346 297 -24 -283 -22 -66 76 -32 138 -60 50 68 -163 -224 -100 42 -194 -185 73 -29 106 -157 -228 -56
4368 -56 168 5 -49 16 -82 -27 57 -99 -7 0 -113 138 -9 -127 -82 -39 76 73 -225 76 1 -8 -161 189 -107
4393 -107 103 22 93 -158 -40 -209 25 -226 174 116 -222 8 91 -3 49 -25 -152 316 32 211 -65 -118 56
4416 56 1 -48 -251 134 -117 -44 -111 -30 -46 92 75 -124 209 -29 78 -124 74 -141 -139 253 -18 -129 -329
4439 -329 86 -140 210 -42 126 -152 69 -195 -14 -141 52 391 -251 19 -106 93 -340 108 122 -139
4459 -139 -107 235 -100 -30 214 20 80 -151 9 0 -23 -26 -200 205 -81 96 16 -236 -74 -34 73 -31 2 38
4483 38 -18 150 -156 -166 59 -114 -74 -81 -83 -77 73 -168 160 -211 -43 108 -222 -1 109 -73 -201 -167 13 130
4507 130 127 -51 1 -9 106 173 -52 38 230 -18 -85 -43 62 -357 -106 -6 34 -100 -145 -2 49 -168 -148 -107
4531 -107 96 27 -33 -72 4 -70 -99 -8 -179 204 129 -13 -79 193 -146 5 153 -86 -146 -8 -16 230 30 147
4555 147 -19 271 -111 -90 222 95 64 270 121 -144 -176 -89 -69 41 -108 117 27 -108 -179 69 -235 97
4577 97 -57 -119 -81 30 47 -245 7 -29 120 -3 213 -215 -222 193 -281 180 -148 48 52 -216 39 -129 -122 -49
4601 -49 4 -34 -39 -133 346 254 -122 -60 74 -344 -19 2 -50 37 -45 -98 248 -134 319 113 30 136 52 -106 60
4626 60 258 -192 27 68 -93 -208 53 81 22 -118 -50 -133 -329 -44 -89 111 93 -47 -46 -21 5 1 35 -111 56
4651 56 80 -14 105 -270 139 -151 -58 -108 -237 148 -131 76 -342 152 -122 -155 -28 268 -122 -54 48 -84
4673 -84 -123 339 -10 -167 66 168 97 -23 73 8 -239 -129 94 -49 39 -48 -48 -138 81 -188 -187 -49 -229 -118
4697 -118 99 40 58 -82 -12 38 69 141 -87 -27 30 79 -10 -190 37 238 155 -13 55 -71 7 84 8 71 -255
4722 -255 -200 149 38 -106 -33 121 176 113 218 151 42 74 -29 -31 55 272 221 -178 30 104 -237 -72 -144 -64
4746 -64 314 47 -285 149 -1 -85 -52 -40 -38 -145 126 -63 -200 -96 118 -186 -9 23 -37 43 -9 -107 35 -355
4770 -355 222 -77 -110 99 -83 67 -24 -54 -10 -42 -51 24 67 -79 118 -231 134 100 -24 -139 -198 0 -331 116
4794 116 -33 89 -42 99 -115 212 -86 -77 -48 163 62 88 141 -14 -15 73 -78 -84 45 277 8 -24 -89 -29
4818 -29 36 30 -97 -39 155 -40 64 48 424 43 44 160 -94 -50 92 251 -228 10 209 107 43 152 -12
4841 -12 -49 40 174 -86 201 142 -162 187 35 17 -39 111 -70 -33 242 119 27 -131 107 96 39 -91 -90 -11
4865 -11 -105 338 81 405 -79 -96 124 -48 136 97 41 -8 -7 166 82 -135 147 321 21 108 -77 -129 -232 40
4889 40 97 -94 167 -64 203 -110 130 -97 13 -32 25 -173 199 -15 -276 317 -53 -22 -2 325 -48 104
4911 104 -18 88 30 3 -136 -41 -121 159 -222 161 -49 183 -36 58 118 166 73 -57 130 -214 192 -5 20
4934 20 -40 -82 -118 20 -58 193 -146 39 -78 -16 132 -67 137 -101 -64 99 -25 119 -52 3 56 -29 98
4957 98 -111 -73 87 134 -79 4 63 -78 -91 -47 57 95 -137 33 -201 -119 -41 97 218 41 -94 -57 -227 -20
4981 -20 -22 26 -162 158 -86 -180 165 -55 117 30 295 111 77 -100 -58 166 -160 30 -214 -73 -9 -68 252
5004 252 96 150 -25 -316 -121 143 235 168 -134 -135 49 -38 71 48 -257 17 -52 -183 18 -55 -113 106 55 -179
5028 -179 74 -8 -62 49 -88 -107 -140 -26 141 -269 -144 100 -56 14 165 65 -70 183 24 -148 51 51
5050 51 -104 -59 -214 -228 -265 38 -194 211 9 -281 10 -195 143 -38 -186 -98 -228 10 101 5 19 11 -16 71
5074 71 161 102 -237 92 15 47 -107 -177 -109 80 -74 -99 -89 102 -46 117 -171 -39 -5 -335 -1 -67 -16 -85
5098 -85 -144 50 -31 37 -423 -37 55 -247 -1 -82 54 130 35 219 -16 -122 -243 133 14 -319 -55 27 -33
5121 -33 -74 -71 46 238 7 68 164 -219 -34 -14 -173 111 9 29 187 -20 -40 -27 -219 231 -46 -22 -51 97
5145 97 -134 -37 200 -76 39 -159 -97 -50 -116 -2 109 -143 -63 -110 147 107 159 144 342 166 101 128 87 1 -46
5170 -46 109 47 74 118 76 -156 -20 139 -142 -180 176 -139 32 -12 159 -193 -46 -95 -160 -46 -67 245 66
5193 66 -74 394 293 -139 245 -220 242 104 80 65 -215 298 74 43 25 92 -2 21 7 -76 180 -159 -101 68
5217 68 -15 -94 -85 333 -56 25 -229 -101 47 213 -65 21 -27 27 7 -189 117 62 -92 -32 -125 -210 -86 -5 -54
5242 -54 -38 162 -100 136 -142 -180 54 157 100 128 -32 116 240 -127 68 79 -92 -76 57 -86 24 -139
5264 -139 23 15 61 -35 -25 -316 97 -131 74 283 -246 134 -80 111 4 -129 89 208 -139 -12 159 -59
5286 -59 191 11 -27 6 85 135 -21 194 25 -51 -140 -127 181 -166 -11 151 -69 -181 -133 16 -41 -169 353
5309 353 42 -38 -76 -118 39 91 -256 -136 -201 -117 122 68 264 -52 -38 -116 -126 -115 332 -201 -101 202 51 -26
5333 -26 -53 -45 -129 66 143 131 117 353 126 39 117 168 30 148 -54 57 -102 -142 142 202 -154 -36 -102 -52 -6
5358 -6 198 -77 11 -37 29 65 1 -101 115 -100 -86 -53 -132 -458 42 136 -85 32 161 103 148 -113 -42 -280 31
5383 31 -50 -71 38 -331 -8 83 214 134 79 -48 9 61 51 10 -68 -186 -6 -91 -45 -77 -258 85 -113 174 -186
5408 -186 -89 253 -242 55 -112 16 142 -117 -266 6 12 24 -83 0 -59 -102 -103 39 -125 6 -21 220 24
5431 24 250 179 -178 -157 -88 35 -99 29 -58 -414 50 -29 -158 -139 148 82 42 206 100 -116 -61 -108 201 -5
5455 -5 78 130 -108 -144 -68 118 -75 -45 -105 80 66 -82 -102 1 58 -35 102 0 78 -97 61 -83 365 33
5479 33 -49 255 50 43 132 -145 -123 -20 160 96 7 -180 275 -124 47 -207 -2 -140 30 -134 -47 87 -102
5502 -102 162 200 30 73 -217 -121 165 -1 137 -13 41 231 212 3 -132 118 -87 -22 113 -73 174 54
5524 54 98 70 92 -8 59 228 -217 -229 21 18 -41 99 29 -129 38 -65 -152 -7 -46 0 60 41 85 194 52
5549 52 28 -28 53 29 -35 -56 162 9 -6 -92 -293 -182 -15 124 -29 17 56 40 -88 -21 143 -64 35 74 53
5574 53 47 64 27 65 81 -91 106 -99 78 378 215 107 135 -55 -137 -83 -55 60 -5 -34 -158 92 38 215 -246
5599 -246 102 -11 36 -134 -277 176 33 66 3 -135 -107 45 -47 -219 -174 68 89 155 96 -40 -43 26 -67 44
5623 44 219 63 163 -109 -46 -228 -159 -114 30 40 -24 159 -14 181 -161 -62 -70 107 69 170 -120 -255 245
5646 245 -199 -182 -35 156 113 -65 26 156 43 -22 -109 -38 227 -62 211 -28 143 -100 -29 -79 -44 103 14
5669 14 94 0 -41 -207 -71 -84 101 -167 -129 -12 0 4 -126 90 -159 3 -83 137 -79 -213 -127 -51 -90 -232
5693 -232 -39 152 177 30 -216 147 -65 -172 155 15 22 -29 196 -70 -104 157 40 297 -178 95 60 -191
5715 -191 185 163 108 -118 58 199 329 82 142 97 -83 113 -130 139 14 -180 121 0 -43 -166 247 -135
5737 -135 20 97 -2 -14 -164 -198 -95 148 -169 -24 -5 -103 15 -144 -47 43 247 -45 62 346 -168 53 -84
5760 -84 1 123 230 206 51 -58 -232 -40 -46 35 -141 -11 1 -38 77 192 130 87 27 -89 82 -35 4 27
5784 27 -190 9 -161 -294 -141 76 -111 75 -96 -127 -102 143 43 17 39 -78 73 126 -227 -77 -182 71
5806 71 78 0 69 145 18 6 21 93 111 133 -157 -143 88 -49 205 -132 42 -367 71 -30 -240 -60 69 140
5830 140 174 -237 -24 169 91 -18 90 -137 -45 -100 121 -64 -59 30 -258 19 -49 20 128 -301 -93 -27 41 -55
5854 -55 458 -38 -213 80 135 -116 -236 -28 17 159 2 43 -117 131 -174 94 -62 -180 -110 -328 75 200
5876 200 -117 3 -7 -34 -66 174 -48 151 -120 -190 -67 227 -221 -95 86 -59 -14 -124 225 -92 -90 49
5898 49 -96 -116 -195 -95 -245 83 164 -136 78 19 26 -107 139 148 -222 96 -129 -308 -23 -237 -98 -21 238
5921 238 -114 167 -127 44 122 -236 248 72 67 66 10 108 174 -96 41 114 68 -235 101 -42 -233 -263 218 -27
5945 -27 -225 -179 -53 -86 -44 -245 -4 168 154 13 -107 87 42 125 54 -138 -133 60 59 -165 -149 -80 -240 -217 -49
5970 -49 30 146 24 -60 -28 -6 60 -55 -78 -18 51 -53 -17 47 -184 242 76 19 -57 -140 -53 81 49 168 -57
5995 -57 117 200 -144 -128 -83 -21 95 54 -140 79 23 -57 1 -192 119 138 189 92 58 -13 -87 43 32 -60 -227 -74
6021 -74 -42 149 -112 -68 20 -3 -70 -23 7 36 -187 -91 -80 -160 187 -75 -102 -26 -37 299 -255 -125 -238 131 24
6046 24 -24 152 10 -128 50 15 -85 22 -102 -108 36 -27 199 140 100 126 -78 3 58 -70 -3 -194 -73 -116
6070 -116 134 -16 -65 -113 -160 57 -39 -132 -22 -454 -79 222 61 79 -59 138 -42 20 -31 86 -28 -97 -134
6093 -134 -26 -4 -211 19 -203 -35 72 -131 9 24 2 -78 82 176 -16 -81 -55 177 34 -159 -57 235
6115 235 -35 150 125 6 80 122 -47 -6 -18 75 -10 58 -27 -124 -165 36 53 95 -112 69 -79 -45 -79 -53 202
6140 202 101 -278 2 100 150 145 -40 -28 66 -75 0 -40 19 349 -88 10 67 68 -144 108 -156 -14 204 -100
6164 -100 -59 -76 -342 -119 -34 -55 60 -121 -156 33 -96 -256 -29 99 -11 44 -96 200 65 94 -78 61
6186 61 -32 77 -506 -178 8 209 155 76 -184 76 46 -37 -31 29 32 134 70 -193 -207 -10 193 -63 -39 72 205
6211 205 -208 -195 2 151 73 220 -259 208 -31 47 -49 11 211 -113 87 326 127 -86 242 -242 -204 17
6233 17 -154 -158 -40 -104 -105 28 -117 21 94 164 36 -126 27 -154 -221 -43 23 46 18 55 43 -8 142 99 -201
6258 -201 -21 -157 32 -141 -12 -12 54 103 -155 188 110 -248 -121 -75 -103 21 231 -193 33 37 65 6 -31 180
6282 180 89 -160 92 -46 -161 58 -46 173 -44 -111 46 -141 132 -139 -23 -412 -241 99 54 -73 26
6303 26 220 -291 88 -3 -29 -149 160 58 150 98 167 -208 -203 125 224 -20 -101 202 -5 73 -25 30 -25 -82 158
6328 158 308 0 180 57 -214 121 78 113 76 -47 -123 1 -100 36 22 -143 -247 -138 137 -94 -3 -198
6350 -198 52 -228 -266 18 -353 -112 -39 250 190 -106 27 -29 -287 -26 -153 165 -25 92 233 -158 -68 32
6372 32 -203 -39 109 40 -125 48 -44 -103 -15 66 109 177 80 -119 176 179 -79 -12 59 37 -29 245 -57 93 -46
6397 -46 -209 278 -127 -284 104 74 -22 111 -326 54 88 15 118 155 -2 67 422 192 47 -263 -127 -10
6419 -10 158 -71 106 115 61 112 -24 102 -68 156 -60 -18 60 101 115 141 124 -125 285 -69 206 21 81 195
6443 195 -102 -109 13 170 -96 -176 -111 139 -118 8 83 29 -56 35 -43 -5 246 -123 -159 -161 96 -194 66 1 70
6468 70 -6 6 102 -46 -12 -353 -30 45 -199 88 -92 -110 -131 -326 130 40 53 181 -79 83 235 -121 -160 161
6492 161 53 153 -57 -23 118 127 -81 252 -123 -44 -80 212 -172 -189 -6 -217 8 -109 18 36 -34 -96 -123
6515 -123 -371 -61 -125 -50 -51 -86 42 -200 303 -163 -31 -16 -118 -13 55 -342 62 -29 90 143 19 234 -105
6538 -105 -38 -49 -115 -210 -66 -238 156 -4 -75 -200 -34 33 191 364 40 -61 -47 33 -64 -110 -158 136 -31 324
6562 324 -53 -155 62 16 -120 122 2 -10 127 -132 -164 28 38 -83 -12 -85 -49 -4 -107 -35 -40 42 -24 3 -25
6587 -25 100 119 41 208 -6 172 -257 -165 166 124 52 50 -18 134 202 -149 -50 -36 -31 -65 22 90 -95 88 -22 -17
6613 -17 52 175 136 19 43 -42 120 240 -29 95 -143 97 38 -224 -27 -145 -63 0 0 101 -19 -25 -165 222
6637 222 70 39 153 28 -168 54 128 -64 68 198 -57 92 103 113 -76 -123 22 -131 -129 -121 10 -19 -25 246
6661 246 -34 11 -18 -56 -81 25 -66 1 -39 -122 -109 -67 25 -82 79 -21 -61 -91 177 -7 21 35 -71 -81 -126 80
6687 80 -144 186 204 -190 55 108 61 54 38 -110 -242 -38 60 131 -56 66 -22 125 -6 156 79 -162 -1 -157
6711 -157 -125 -24 -14 -89 -150 63 -68 -169 174 21 103 145 273 301 -19 109 -49 26 190 54 -24 -56 -52 56
6735 56 41 -188 162 83 18 86 -26 183 -51 190 -136 19 -69 -179 -34 -102 -231 9 -71 -33 12 -212 -358
6758 -358 83 225 108 -37 -125 63 -63 285 -57 -64 -43 -25 -246 110 -168 -134 -15 134 214 128 111 -153 -210
6781 -210 -76 36 -196 85 12 -34 103 -240 -164 -58 -105 -7 -3 65 -10 -174 -55 -21 254 103 -29 87 -29
6804 -29 62 33 -139 53 -164 -163 -71 5 -187 -101 90 -61 213 -82 -135 60 -45 72 78 61 22 98 -48 198 99
6829 99 5 144 71 102 -2 85 48 -176 -13 69 -139 -168 103 -66 -34 52 -46 38 -289 161 -35 130 168 -110
6853 -110 -47 -29 -169 -93 -56 188 -101 90 -125 191 -71 -126 127 -220 -50 117 -47 -4 135 -129 -230 -100
6875 -100 -2 196 -30 -167 127 -2 0 -145 88 -193 12 -247 -147 -34 -44 93 -15 -192 97 -32 5 -15
6897 -15 -64 -185 -144 33 197 124 14 35 81 -127 -134 -38 69 27 -122 31 163 -159 -31 246 71 29 -217 89
6921 89 -63 -31 -89 -141 -101 91 -103 -202 206 0 -343 -61 -121 144 41 190 -59 -12 -10 -178 43 109 -48 187
6945 187 177 -71 75 -407 57 -132 72 -149 -21 88 -216 131 -13 -88 127 -54 -13 -55 78 199 -263
6966 -263 -81 -90 -112 -74 81 -33 18 -186 112 30 85 -97 182 29 -174 57 -21 -285 -110 321 168 78 -99
6989 -99 -49 105 215 -31 -238 -70 307 -75 14 -88 103 190 -154 102 54 197 40 28 3 -124 11 -12 -264
7012 -264 -330 -261 -65 214 239 -75 -97 -194 -14 -50 -250 12 9 -125 473 -66 -36 -49 -15 27 -147 111 -119 87
7036 87 3 -43 241 74 -89 -5 -120 84 -94 170 -108 20 -61 -66 69 -44 -162 -62 -117 -137 -48 70 -7 -121
7060 -121 26 -67 -10 124 174 -171 99 91 -131 150 -26 36 -312 186 -71 155 78 71 31 102 -127 -107 41 -14
7084 -14 -168 76 -144 138 -67 -117 -41 121 -26 107 178 -156 -292 -245 88 -27 24 51 -28 -180 -154 36 93
7107 93 28 27 -264 44 -58 -104 -15 2 -31 82 -68 127 111 -86 160 138 -81 -106 125 -31 -176 -9 35 90
7131 90 81 139 -55 223 56 71 9 116 126 -6 111 11 -33 -152 4 -49 285 -135 137 -49 -94 133 41 220
7155 220 71 -109 57 29 -58 -1 178 -49 -73 -45 -20 15 125 -86 101 237 -284 -176 14 -206 -170 115 77
7178 77 131 32 -47 -107 89 -53 3 -101 187 -48 -148 -166 75 -183 173 -57 169 -99 -79 50 -36 151 57
7201 57 -189 40 10 -5 62 -18 167 -43 56 -184 -111 175 -62 3 110 16 27 71 -259 118 -17 -280 205 207
7225 207 -100 305 164 9 61 61 -204 129 163 -16 76 24 -37 30 68 -113 -134 9 -45 -121 119 -42 98 -129
7249 -129 -150 -97 -37 11 -89 -110 110 10 -33 -202 21 -202 -99 26 55 5 -49 90 -95 45 50 -4 173 79
7273 79 92 0 -6 -176 49 275 -122 -166 -15 -52 112 79 105 28 289 11 -20 -48 -82 -95 53 -131 209 116 -187
7298 -187 41 -203 -257 -155 220 -191 -3 110 204 -196 -113 -232 125 160 -71 72 -93 142 -8 266 253 80
7320 80 83 -120 -212 62 131 42 -144 2 11 -43 154 154 141 -323 -232 37 132 55 67 -72 82 135 -81 22 78 74 -82
7347 -82 -39 34 205 56 -18 187 67 -10 159 113 171 112 155 -13 124 390 175 -48 107 -91 -171 63 143 -119
7371 -119 79 58 -96 70 38 -259 -132 51 -92 144 -80 -42 281 -22 -249 203 -22 -120 -82 -160 84 45
7393 45 -180 -200 -103 -78 -80 -72 17 201 11 13 136 65 74 -38 16 -44 130 53 108 -22 69 -40 146 -19 151 55 -100
7420 -100 84 6 -193 -28 -73 14 -46 97 68 -206 -75 -80 -190 -79 -38 46 -2 -102 -88 -89 -7 74 -200 -167 -141 19
7446 19 15 133 -28 -80 77 -3 122 -223 186 40 33 197 -171 68 28 -30 -5 37 -147 -157 -19 1 -128 -161 71
7471 71 -8 -15 -43 95 -43 149 39 -8 172 58 -50 -168 -33 -211 58 -70 -157 19 134 52 -162 -21 112
7494 112 12 38 -112 -253 -169 31 102 -74 39 19 -65 276 -49 -200 55 -223 48 -138 -184 193 258 -6
7516 -6 160 30 89 98 139 -103 -40 72 -66 335 90 -81 -69 -82 -19 -95 -244 -107 22 -256 -100 198 134 -76
7540 -76 136 -67 45 44 36 -86 68 73 219 -266 -55 -15 28 112 -64 -72 12 -207 -92 -59 21 15 60 -22 -86 219 -65
7567 -65 224 -377 -2 -68 -175 -176 11 109 13 234 50 202 -105 -23 -184 38 -91 -193 -43 -106 18 14 -72 -112
7591 -112 70 56 55 134 -54 3 157 -35 -217 -5 126 62 114 154 -97 -80 136 14 148 56 68 45 280 -152
7615 -152 -29 138 85 68 62 -47 -186 -139 16 142 8 18 -128 163 120 -73 74 179 5 188 13 -143
7637 -143 -33 234 -161 18 -135 42 -29 -222 45 150 -91 -15 -179 -10 -42 84 -131 -89 -19 72 -122 16
7659 16 -15 -5 -40 -267 -24 -230 -199 -44 -31 -418 -87 35 -18 -4 -104 -7 -31 74 55 -49 110 31 65 -196
7683 -196 -70 -32 34 -169 -73 -42 58 26 -35 18 232 98 -33 2 127 18 150 289 -104 42 -207 -50 132
7706 132 -65 -92 -25 36 201 22 -34 -80 -170 204 212 -135 90 -38 168 265 -83 -100 -127 175 -27 -70 179 277
7730 277 -97 -64 -92 324 -167 -5 96 130 -71 119 220 -111 147 99 45 -51 42 87 -58 -138 85 102 -114
7753 -114 -190 94 -192 72 79 22 -34 -14 328 106 67 -44 48 -32 110 157 23 -110 10 -214 186 15 204
7776 204 -119 74 93 -274 -32 -24 -104 35 188 -117 -165 108 -33 11 -79 -32 -100 -319 275 18 -73 57 41 125
7800 125 89 -173 -99 -422 -183 -97 -55 -102 96 162 -192 -39 163 -59 -69 -77 -178 -64 2 64 -118 152 2 197
7824 197 -35 142 72 53 -28 64 -73 87 35 -61 -201 -80 43 98 52 78 2 -243 249 -27 -26 34 47 -11 20
7849 20 41 35 111 103 -109 62 6 -57 -38 -195 -101 -153 -62 -39 198 32 34 114 28 235 228 3 -110 196 -93 166 96
7876 96 -211 238 -4 -52 -107 -68 -81 -10 -175 -209 -59 -134 -244 -25 -107 -59 69 -157 261 -14 106 -209 79
7899 79 357 153 -289 -8 311 -14 -37 -178 134 105 151 42 -228 -17 37 149 -71 -169 -207 -3 -13 53 -180
7922 -180 -59 -150 61 123 -28 -292 138 -74 -100 -60 23 -110 -244 -5 231 36 -6 -273 8 -12 -104 -2 17
7945 17 175 45 -208 -65 -16 -74 191 -15 -37 109 -38 224 38 37 -83 -257 133 -54 206 -12 114 48
7967 48 -44 -11 -83 -110 -388 -148 -81 237 -17 126 32 126 113 98 -92 59 0 -174 -152 119 -123 -139 100 8 1
7992 1 11 -21 -12 134 3 65 23 54 -14 -210 61 3 94 119 67 -167 133 252 -93 267 160 262 157 -127 -172
8017 -172 -125 -116 62 113 136 266 -200 -228 -191 21 45 35 -46 82 -61 68 278 -53 -195 -62 7 -111 28 20
8041 20 192 -198 111 -82 119 66 -213 43 58 102 22 -101 70 -55 402 16 -10 128 147 -226 214 -47
8063 -47 68 -292 -42 -155 -67 152 29 281 14 -56 -25 -265 -136 47 56 90 -30 -117 -87 140 59 -12 66 -61
8087 -61 179 -122 -13 157 -206 128 -10 -5 10 -62 -161 120 -86 -231 79 -20 -130 35 3 45 -30 197 -131
8110 -131 -228 -84 -48 302 283 -86 351 -260 116 207 16 29 -141 20 9 79 219 34 -173 197 -31 101
8132 101 80 70 169 -92 122 37 49 57 148 -137 -10 -71 -60 148 221 10 -70 -124 73 165 -274 42 -35 -29 170 -31
8158 -31 73 47 54 21 66 -295 46 255 -411 -101 -133 166 -36 -10 150 204 -58 177 166 169 43 39 8 -46 -79 152
8184 152 -1 36 56 -50 0 -57 -199
8191a99
##END NTUPLES=NMR FID
##END=
