##TITLE=1H_Ser 6-8-i-H
 CDCl3
 8 sc, 
 12.05.2022
##JCAMPDX= 6.0         $$ Bruker NMR JCAMP-DX V2.0
##DATA TYPE= NMR FID
##DATA CLASS= NTUPLES
##ORIGIN= UXNMR, Bruker Analytische Messtechnik GmbH
##OWNER= root
$$ XWIN-NMR		Version 3.5
$$ Thu May 12 10:57:36 2022 Russian Standard Time (UT+4h)  she@DPX200
##.OBSERVE FREQUENCY= 200.1313499996
##.OBSERVE NUCLEUS= ^1H
##.DELAY= (6, 6)
##.ACQUISITION MODE= SIMULTANEOUS
##.ACQUISITION SCHEME= undefined
##.AVERAGES= 8
##.DIGITISER RES= 18
##SPECTROMETER/DATA SYSTEM= spect
##.PULSE SEQUENCE= zg30
##.SOLVENT NAME= Pyr
##.SHIFT REFERENCE= (INTERNAL, Pyr, 0, 15.7039)
##AUDIT TRAIL= $$ (NUMBER, WHEN, WHO, WHERE, WHAT)
$$ ##TITLE= Audit trail, XWIN-NMR		Version 3.5
$$ ##JCAMPDX= 5.01
$$ ##ORIGIN= Bruker BioSpin GmbH
$$ ##OWNER= she
$$ F:/spectra/data/she/nmr/H-F/1/audita.txt
$$ ##AUDIT TRAIL=  $$ (NUMBER, WHEN, WHO, WHERE, WHAT)
(   1,<2022-05-12 10:56:26.87 +0400>,<she>,<DPX200>,
      <created by zg, POWCHK disabled, PULCHK disabled
       configuration hash MD5:
       00 E9 B6 7A A2 85 ED C7 34 08 36 98 17 FE 4E 26
       data hash MD5: 16K
       59 2C 93 C9 CE 36 05 46 A1 D1 85 F7 7B A9 B5 43>)
$$ ##END=
$$ 
$$ hash MD5
$$ 4D 0C D7 10 F3 7F 27 06 3A 27 A9 24 ED FA 84 56
##$RELAX= 
##$RELAX= 
##$RELAX= 
##$RELAX= 
##$RELAX= 
##$RELAX= 
$$ Bruker specific parameters
$$ --------------------------
##$DU= <F:/spectra>
##$EXPNO= 1
##$NAME= <H-F>
##$PROCNO= 1
##$TYPE= <nmr>
##$USER= <she>
##$AMP= (0..31)
100 100 100 100 100 100 100 100 100 100 100 100 100 100 100 100 100 100 
100 100 100 100 100 100 100 100 100 100 100 100 100 100 
##$AQSEQ= 0
##$AQ_mod= 1
##$AUNM= <au_zg>
##$AUTOPOS= <>
##$BF1= 200.13
##$BF2= 200.13
##$BF3= 200.13
##$BF4= 200.13
##$BF5= 200.13
##$BF6= 200.13
##$BF7= 200.13
##$BF8= 200.13
##$BYTORDA= 1
##$CFDGTYP= 0
##$CFRGTYP= 5
##$CHEMSTR= <none>
##$CNST= (0..31)
1 1 145 1 1 1 1 1 1 1 1 1 1 1 1 1 1 1 1 1 1 1 1 1 1 1 1 1 1 1 1 1 
##$CPDPRG= <>
##$CPDPRG1= <>
##$CPDPRG2= <>
##$CPDPRG3= <>
##$CPDPRG4= <mlev>
##$CPDPRG5= <mlev>
##$CPDPRG6= <mlev>
##$CPDPRG7= <mlev>
##$CPDPRG8= <mlev>
##$CPDPRGB= <>
##$CPDPRGT= <>
##$D= (0..31)
0 1.2 0 0 0 0 0 0 0 0.06 0 0.03 0 0 0 0 0.0002 0 0 0 0 0 0 0 0 0 0 0 0 
0 0 0 
##$DATE= 1652338586
##$DBL= (0..7)
120 120 120 120 120 120 120 120 
##$DBP= (0..7)
150 150 150 150 150 150 150 150 
##$DBP07= 0
##$DBPNAM0= <>
##$DBPNAM1= <>
##$DBPNAM2= <>
##$DBPNAM3= <>
##$DBPNAM4= <>
##$DBPNAM5= <>
##$DBPNAM6= <>
##$DBPNAM7= <>
##$DBPOAL= (0..7)
0.5 0.5 0.5 0.5 0.5 0.5 0.5 0.5 
##$DBPOFFS= (0..7)
0 0 0 0 0 0 0 0 
##$DE= 6
##$DECBNUC= <off>
##$DECIM= 32
##$DECNUC= <off>
##$DECSTAT= 4
##$DIGMOD= 1
##$DIGTYP= 9
##$DL= (0..7)
0 120 120 120 120 120 120 120 
##$DP= (0..7)
150 150 150 150 150 150 150 150 
##$DP07= 0
##$DPNAME0= <>
##$DPNAME1= <>
##$DPNAME2= <>
##$DPNAME3= <>
##$DPNAME4= <>
##$DPNAME5= <>
##$DPNAME6= <>
##$DPNAME7= <>
##$DPOAL= (0..7)
0.5 0.5 0.5 0.5 0.5 0.5 0.5 0.5 
##$DPOFFS= (0..7)
0 0 0 0 0 0 0 0 
##$DQDMODE= 0
##$DR= 18
##$DS= 0
##$DSLIST= <SSSSSSSSSSSSSSS>
$$ [...]
##$SUBNAM2= <"">
##$SUBNAM3= <"">
##$SUBNAM4= <"">
##$SUBNAM5= <"">
##$SUBNAM6= <"">
##$SUBNAM7= <"">
##$SUBNAM8= <"">
##$SUBNAM9= <"">
##$SW= 18.0517283424761
##$SWIBOX= (0..15)
0 0 2 0 0 0 0 0 0 0 0 0 0 0 0 0 
##$SW_h= 3612.71676300578
##$TD= 16384
##$TD0= 1
##$TE= 0
##$TE2= 300
##$TE3= 300
##$TEG= 300
##$TL= (0..7)
0 120 120 120 120 120 120 120 
##$TP= (0..7)
150 150 150 150 150 150 150 150 
##$TP07= 0
##$TPNAME0= <>
##$TPNAME1= <>
##$TPNAME2= <>
##$TPNAME3= <>
##$TPNAME4= <>
##$TPNAME5= <>
##$TPNAME6= <>
##$TPNAME7= <>
##$TPOAL= (0..7)
0.5 0.5 0.5 0.5 0.5 0.5 0.5 0.5 
##$TPOFFS= (0..7)
0 0 0 0 0 0 0 0 
##$TUNHIN= 0
##$TUNHOUT= 0
##$TUNXOUT= 0
##$USERA1= <user>
##$USERA2= <user>
##$USERA3= <user>
##$USERA4= <user>
##$USERA5= <user>
##$V9= 5
##$VALIST= <valist>
##$VCLIST= <CCCCCCCCCCCCCCC>
##$VD= 0
##$VDLIST= <DDDDDDDDDDDDDDD>
##$VPLIST= <PPPPPPPPPPPPPPP>
##$VTLIST= <TTTTTTTTTTTTTTT>
##$WBST= 1024
##$WBSW= 4
##$XGAIN= (0..3)
0 0 0 0 
##$XL= 0
##$YL= 0
##$YMAX_a= 470144
##$YMIN_a= -713460
##$ZGOPTNS= <>
##$ZL1= 120
##$ZL2= 120
##$ZL3= 120
##$ZL4= 120
##$ABSF1= 10
##$ABSF2= 0
##$ABSG= 5
##$ABSL= 3
##$ALPHA= 0
##$AQORDER= 0
##$ASSFAC= 0
##$ASSFACI= 0
##$ASSFACX= 0
##$ASSWID= 0
##$AUNMP= <proc_1d>
##$AZFE= 0.1
##$AZFW= 0.1
##$BCFW= 1
##$BC_mod= 2
##$BYTORDP= 1
##$COROFFS= 0
##$CY= 11.3945322036743
##$DATMOD= 1
##$DC= 2
##$DFILT= <>
##$DTYPP= 0
##$F1P= 2.36226072786647
##$F2P= -0.459571619588291
##$FCOR= 0.5
##$FTSIZE= 0
##$FT_mod= 4
##$GAMMA= 1
##$GB= 0.15
##$INTBC= 1
##$INTSCL= 1
##$ISEN= 128
##$LB= 0.24
##$LEV0= 0
##$LPBIN= 0
##$MAXI= 10000
##$MC2= 0
##$MEAN= 0
##$ME_mod= 0
##$MI= 1.114404
##$NCOEF= 0
##$NC_proc= 0
##$NLEV= 6
##$NOISF1= 3.799351
##$NOISF2= 2.8
##$NSP= 1
##$NTH_PI= 0
##$NZP= 0
##$OFFSET= 15.70392
##$PC= 1
##$PHC0= -17672.42
##$PHC1= 13.60075
##$PH_mod= 1
##$PKNL= yes
##$PPARMOD= 0
##$PSCAL= 0
##$PSIGN= 0
##$REVERSE= no
##$SF= 200.130013532006
##$SI= 16384
##$SIGF1= 3
##$SIGF2= 2
##$SINO= 400
##$SIOLD= 16384
##$SREGLST= <1H.CDCl3>
##$SSB= 0
##$STSI= 0
##$STSR= 0
##$SW_p= 3612.71676300578
##$SYMM= 0
##$S_DEV= 0
##$TDeff= 0
##$TDoff= 0
##$TI= <>
##$TILT= no
##$TM1= 0
##$TM2= 0
##$TOPLEV= 0
##$USERP1= <user>
##$USERP2= <user>
##$USERP3= <user>
##$USERP4= <user>
##$USERP5= <user>
##$WDW= 1
##$XDIM= 8192
##$YMAX_p= 0
##$YMIN_p= 0
$$ End of Bruker specific parameters
$$ ---------------------------------
##NTUPLES= NMR FID
##VAR_NAME=  TIME,          FID/REAL,        FID/IMAG
##SYMBOL=    X,             R,               I
##VAR_TYPE=  INDEPENDENT,   DEPENDENT,       DEPENDENT
##VAR_FORM=  AFFN,          ASDF,            ASDF
##VAR_DIM=   8192,          8192,            8192
##UNITS=     SECONDS,       ARBITRARY UNITS, ARBITRARY UNITS
##FACTOR=    0.0002768,     1,               1
##FIRST=     0,             0,               0
##LAST=      2.2672688,     0,               0
##MIN=       0,             -713460,         0
##MAX=       2.2672688,     470144,          0
$$ Real data points
##PAGE= N=1
##DATA TABLE= (X++(R..R)), XYDATA
0@%%%%%%%Qj6J6j6K4l2M0m8N6p8J02j20J44j76K11k52K98l51M12m80N59o46P40
30C95q48R72j109J256j418J601j803K021k261K525k813L130l477L855m267M717
46B476n211N749o335O979p688Q469r333J0294j1363J2563j3923J5475j7263J9352
60A0241k1834K4836k8554L3301l9600M8411o1706Q4302j32626M14160m35582m24961
72e29612R99756k24491n50989L75075K50102o02894R8525M90225l07091k80280
82b81674M62686j01887l46762L31120J43113m29712P9711L43570k37918k35187
92b72940M04384L4438m59828K05609L92035l63952j56676L86079l0372l11553
102a72776J56470J89807k32321m2999K19751j74317r5008L26467p7980l09083
$$ plain form
0 0 0 0 0 0 0 0 0 8 -8 8 -8 16 -16 24 -24 32 -46 56 -64 80 -96 115 -137 161 -190 222 -258 301 -345 395
30 395 -453 519 -590 666 -752 849 -954 1067 -1194 1331 -1482 1648 -1829 2026 -2241 2476
46 2476 -2735 3014 -3321 3658 -4030 4439 -4894 5400 -5963 6600 -7323 8152 -9111 10241
60 10241 -11593 13243 -15311 17990 -21610 26801 -34905 49397 -83229 330931 -104651 -529612
72 -529612 470144 245653 -305336 69739 319841 -283053 -184528 305697 -1394 -281674
82 -281674 181012 79125 -267637 63483 206596 -223116 -143405 200165 -37753 -272940
92 -272940 131444 165882 -293946 -88337 303698 -60254 -216930 169149 138777 -172776
102 -172776 -16306 173501 -58820 -101819 117932 -56385 -151393 175074 97094 -211989
112b11989K21029K23087k34360j27357K05508K0225j87585P5643R5335j67077
122h7541N126J52560m7646p1062M1327L6454j8293k90M1301o2879l0958J13619
134G1718p2290j17029J70248O2070k23926k5367K51743n878k70008R0197K36238
145A67716j98986j36362K33374K7276j96955J5266J40738k8547o8159Q9255q189
156C6427j03678J15653O4209j41266K1874Q3482r9530l1119J40425k6999j97421
167a37943J01237K03925k04283j16285K61544j0621k18928R1231J22308j24811
177c2626l5736J26686p1312j00741J72098M0j95220J40168J19495k18655O77K28540
189A33414q3629k03465J45451J53723k07085n0288K25834o6202j50838J37814
$$ plain form
112 -211989 9040 232127 -2233 -129590 75918 96143 -91442 -15799 79536 -87541
122 -87541 -82415 70145 22499 -48563 -7236 29218 10925 10635 51936 -10943 -41901 71718
134 71718 -572 -117601 52647 114717 -109209 -134576 117167 111289 -158719 -68522 167716
145 167716 -31270 -167632 65742 93018 -103937 -88671 52067 23520 -44639 44616 36427
156 36427 -67251 48402 112611 -28655 -6781 76701 -22829 -53948 86477 59478 -137943
167 -137943 -36706 167219 -37064 -153349 108195 97574 -121354 -30123 92185 -32626
177 -32626 -68362 58324 -12988 -113729 58369 58409 -136811 3357 122852 -95803 -95126 133414
189 133414 49785 -153680 -8229 145494 -61591 -111879 113955 47753 -103085 34729
199C4729N4000j21699J7876Q6457o0047m6331R3279m4099r5867J49610P995k19205
211a43302J02613J97703j74109j33264K00912O0838k20926L2505K10808j38277
221d499j34414J86451K2378j50048N1448Q1823o9304k4229P9180k8059o4744J05021
233E1004L691j47715R0212J18189j48570n2268J57916l650j60338N6779J56381
244A21631j25099j03560J62911K175j28863P2146M8304r1476J2913P9315o1729
255a1332n4649J22566n671j56799J00968J21520j63885l3452J65968l8619j44833
266i8218Q3351J29786j26567r3113J47592J3987j12557N2430L3515o4996K2573
277a2217M0518m8841j2343P7044l4625r9252J14445P2723j73673R168J69984q1275
$$ plain form
199 34729 88729 -32970 -15094 71363 11316 -35015 58264 14165 -81702 67908 75903 -143302
211 -143302 -40689 157014 -17095 -150359 50553 111391 -109535 -77030 133778 -4499
221 -4499 -138913 47538 69916 -80132 -28684 53139 -16165 -40394 38786 10727 -54017 51004
233 51004 54695 -93020 -2808 115381 -33189 -85457 72459 68809 -91529 -34750 121631
244 121631 -3468 -107028 55883 58058 -70805 1341 49645 -41831 -28918 50397 -11332
255 -11332 -65981 56585 50914 -105885 -4917 116603 -47282 -80734 85234 46615 -98218
266 -98218 -14867 114919 -11648 -104761 42831 56818 -55739 -3309 30206 -34790 -12217
277 -12217 28301 -20540 -32883 44161 9536 -89716 24729 97452 -76221 -67053 102931 21656
289B1656j21863J21064Q2707j42434l7017J53957k9866j18009Q7219L6918q7125
300c2793K6763M0083m8399j202M8517l7591n6615R0384L0989j40366L3961J35775
312H9506r7929r0026J17029M9908j13395j7220J14595k9531q9840Q3227L0455
323D6779q4057L1638L9101m7036J2762M0353m5355l7768Q2195J9827j17572L7937
335b1196J11187j08156o4303J33273J4508j26030R989J12232m0728r0238P9594
346A0132L3952q6791K8123M3716m8497J3895L2378m9246j5114P7826j93j03825
358f3644N0701J00171j11978m5518J38625j8802j20472N1085R1585p0520o6836
369f5603Q9762J7322r0140L9302M1656n9552K0878L2534n5259J910O3984k9078
$$ plain form
289 21656 -100207 20857 103564 -38870 -75887 78070 48204 -69805 17414 54332 -32793
300 -32793 -6030 34053 -14346 -15548 32969 -4622 -61237 29147 60136 -80230 -46269 89506
312 89506 -8423 -98449 18580 68488 -44907 -62127 52468 22937 -66903 16324 46779
323 46779 -37278 -5640 33461 -13575 -813 39540 -5815 -43583 38612 58439 -59133 -21196
335 -21196 89991 -18165 -82468 50805 65313 -60717 -50728 61504 20776 -69462 10132
346 10132 44084 -42707 -14584 29132 -19365 -5470 26908 -22338 -37452 40374 40181 -63644
358 -63644 -12943 87228 -24750 -70268 68357 49555 -70917 -19832 71753 1233 -65603
369 -65603 24159 41481 -48659 -9357 32299 -27253 -6375 26159 -29100 -27190 36794 7716
381G716p1759O8171O5007j16206j5218J37670m2866j03085P6686O1751p5944l0045
393c8122P8870j676p5276L7998L1420n3521K5749K1404n9033J8419N3245m3811
405d334m3403O5352K7996j02758Q748J18781o3115r1643Q9743M3654p8573p766
417c7318P1343q993o0873L6480L4619m4942J4455J2922m6792L0536L6772n5277
429a7068j7668O2919M988p7964K4180R3449o8325p2169R3685K5073q7255K437
441c3718O4044j6978n4965L5265L6821m6611Q476K8587l9647J9985L4817n3078
453a7002j0254O1186j2013p2346L5192P9935p3374n5088J04064N377r2872L1645
465a5550O0777m1663m3943L7333K3421m1012O309K1157l3732K4445L0063n0851
$$ plain form
381 7716 -64043 4128 69135 -47071 -62289 75381 32515 -70570 6116 67867 -8077 -38122
393 -38122 40748 39072 -36204 1794 33214 -20307 5442 26846 -32187 -13768 39477 -4334
405 -4334 -47737 17615 45611 -57147 -48399 70382 7267 -84376 5367 49021 -29552 -37318
417 -37318 34025 25032 -35841 639 35258 -9684 4771 17693 -29099 1437 38209 -17068
429 -17068 -34736 28183 33171 -44793 -20613 72836 4511 -67658 26027 51100 -36155 -33718
441 -33718 30326 13348 -41617 -6352 30469 -16142 -7666 20921 -18726 1259 36076 -17002
453 -17002 -27256 33930 21917 -50429 -15237 64698 -8676 -63764 40300 45677 -47195 -15550
465 -15550 45227 3564 -40379 -3046 20375 -20637 -14328 6829 -26903 -2458 27605 -23246
477b3246Q961N8366l2753n2085N0897N2704p9207l8069R9925r832q9685N0502
489c522N1802n6608k0703M5388Q588l6663Q843J5934l0073J7892J5419m8865K2081
502a0487M3324n1337k0163O0561J3160o5693m376P7833k3896p2726N0675L8673
514C5548n3937j4538L6831J1405k3387K013K1462j4281P444J6441l4875J6132
526F258L5520n3367j7808N9211r49o1479P533O5318l0519n7756O0058K8570o6177
539b5587k773M2298j742k7906m339K1092n428n979J3340j5235J0864K6214m0351
552a5532p745N5316p226n6977J1195O0732k8481o0395N9853L1739p0745R864N4283
565C5881k2424k6518J6561J3009j5405l432Q738j8654J1441J9808m6156M275N6423
$$ plain form
477 -23246 -14285 44081 11328 -40757 10140 62844 -16363 -54432 45493 35661 -54024 -3522
489 -3522 48280 -8328 -29031 16357 24945 -11718 -2875 13059 -17014 878 16297 -32568 -10487
502 -10487 32837 -18500 -38663 21898 35058 -30635 -35011 42822 18926 -53800 -3125 35548
514 35548 -18389 -32927 3904 15309 -8078 -6065 15397 1116 8560 25001 -9874 6258
526 6258 41778 -11589 -29397 29814 28865 -32614 -25081 40237 9718 -48038 12020 40590 -25587
539 -25587 -28360 13938 12196 -15710 -20049 1043 -4385 -10364 2976 -12259 -1395 24819 -15532
552 -15532 -23277 32039 24813 -32164 -20969 39763 11282 -49113 10740 42479 -28266 -18402 35881
565 35881 13457 -13061 3500 16509 1104 -2328 6410 -12244 -803 19005 -27151 -22876 33547
578C3547l0489m1955M2578L5518m6817l3187O4245J5881p3823J3964N3320k8056
590D726k3889K0050Q817j0718l030P582r644Q646J2520m1749N759N1649l8394
603g675l3535N1217J2237m7080K76N5437o518n5986K6476M1758l1283j3024J4884
616G184K648j701j1640M007J2447m098p159j5585J5765L0812l8872k6173M5630
629A3265P225m3006l685M2307l514n2520K2324M5804l7860j8212L1372K487j1591
642e604m172Q091R609q467k961o92R722J7481k7970j1314M4596m760m0397J0937
656e901L6681j1371m6334K1504M2199m2701k1472M1194k944k5034M331J1191J171
669B514o875l31n979N202K2911k7101j7502M8119r094m5278L0672L3010l2017
$$ plain form
578 33547 3058 -38897 3681 39199 -7618 -40805 23440 39321 -34502 -20538 32782 4726
590 4726 -19163 887 9704 -1014 -4044 3538 -6106 2540 15060 -26689 -20930 30719 -7675
603 -7675 -41210 10007 22244 -24836 -24560 30877 24359 -31627 -5151 36607 5324 -7700 7184
616 7184 9832 8131 -3509 498 12945 8847 1688 -13897 1868 32680 -6192 -32365 13265
629 13265 20490 -22516 -26201 16106 12592 -39928 -17604 28200 -9660 -27872 3500 5987 -5604
642 -5604 -9776 -1685 7924 -543 -3504 -4196 5526 23007 -4963 -16277 28319 23559 -16838 -5901
656 -5901 30780 19409 -26925 -5421 36778 -5923 -27395 13799 10855 -14179 -9848 1343 2514
669 2514 -4361 -4692 -10671 -5469 17442 -9659 -27161 20958 11864 -33414 -2742 30268 -1749
682a749k8273L5910K5626m3869p055M0770j2320k1552J0036P663N375j0660j1554
695a1652R602J1661J401k3581k875L9968j7648l8457L7623K2926m0878j3361L7866
708A2595J3239m1769j487M0080j5887k0093J5279L717J362o177j2198J5138P221
721A1020j3886r828J0472J9486k3620k1221L6837Q811l6067k080K7905P415l0875
734a5631m088M0149j2463l1240K2687J5126j0867q806j45J4745j68r982M65L944
748C726J2755j4119j9685L4106P747m1205L806L0218m480k9024K692L2510j7585
761A462k8845K7789J1836k0968m862O604J0840l270j1165M471N969P669r768j6403
775a8641L2413R053m3392J0785L7960j8170k7909J7944K7179k5308k2115L2136
$$ plain form
682 -1749 -30022 5888 31514 -12355 -19410 21360 9040 -12512 -2476 5187 10562 -98 -11652
695 -11652 -2050 9611 11012 -12569 -15444 24524 6876 -31581 6042 28968 -11910 -25271 12595
708 12595 25834 -15935 -17422 22658 6771 -13322 1957 5674 7036 859 -11339 3799 11020
721 11020 -2866 -12694 -2222 17264 -6356 -27577 9260 18071 -17996 -20076 7829 15244 -15631
734 -15631 -19719 20430 7967 -23273 -586 14540 3673 -5133 -5278 9467 9299 -683 -218 3726
748 3726 16481 2362 -17323 16783 24530 -16675 -12869 17349 12869 -16155 -13463 19047 1462
761 1462 -27383 406 12242 -8726 -13588 -6984 3856 586 -10579 -6108 -139 7530 -2238 -18641
775 -18641 13772 22825 -20567 -9782 28178 10008 -17901 43 27222 1914 -20201 11935
787A1935M448k3792L956L019M434J455j6140M544J4170n657j4069q19K5626m417
801H693l4296J9823K6144k5661j3458K1461J4957k1902j6659L1499P396k7610
813i613M266J0930Q17k226j2058Q228J2207j3510r395P554J6683q342k7223J9836
827a846K2290k7843r153K1521O619j7775j2724K6917R074l0755L702K1506n113
840F420r341k482J2868M123j6629R73R740M048o450j9057J6306K1328l1009r968
854a9130L0704J199k6076l640K9171m44l2932J2836K1679j7125o677O718O129
867B412K850j2418P36J2625J587o097j1482J4151J5981k9287l534L2570r185k5903
881a4994Q295K4583p587k7562J5865J9231k1955m606J0905J66N0j1532r98J6087
$$ plain form
787 11935 16383 -7409 -3453 -434 4000 5455 -10685 -6141 8029 2372 -11697 -12516 13110 8693
801 8693 -25603 -5780 20364 -5297 -18755 2706 17663 -4239 -20898 10601 17997 -9613
813 -9613 -5347 5583 6400 4174 -7884 344 12551 -959 -10354 -2800 13883 5541 -21682 -1846
827 -1846 20444 -7399 -16552 4969 11588 -6187 -18911 8006 17080 -13675 -9973 11533 6420
840 6420 -2921 -5403 7465 11588 -5041 -4068 5672 9720 3270 -15787 519 21847 -9162 -19130
854 -19130 11574 12773 -13303 -16943 12228 11784 -21148 -8312 13367 -3758 -10435 -3717 2412
867 2412 5262 -7156 -6420 6205 7792 1695 -9787 4364 20345 -8942 -12476 20094 10909 -14994
881 -14994 -6699 17884 10297 -17265 -1400 17831 -4124 -8730 2175 2341 2391 -9141 -10139 5948
895E948j856j3140l403J5834R186k5874J859L0114j4633k0528J5730J5768r782
908E223j9917J3937J9033k0559p266J6624O83n162q281L575J4452j1300j0958
921i916O479Q832l76j9325L176K7665j6250k1101K0639J4862j4535j6144J7033
934A039J7949k5607o663K5156l449j2853K78O653Q104r407o550Q858K719j718
948D509j1953K211K1866j7046k1519K5187J0973k2770q321K0679R119k6080l80
961a3525K7630j1512j4583R755M375K484n678o983R550N739m227r195N086K0538
975A9454j7780j9629L0959N749k9510J313K1242j239k3618M094K4203j4611j4398
988a3771J3879K573j295m565o872J2703L138j2847k306J0725J0166j7864j0234
$$ plain form
895 5948 4092 -9048 -12451 3383 12569 -13305 -11446 18668 4035 -16493 -763 15005 5223
908 5223 -14694 -757 18276 -2283 -9549 7075 7758 2596 -5685 -2110 12342 1042 -9916
921 -9916 -3437 5395 5019 -14306 -11130 16535 285 -20816 -177 14685 150 -15994 1039
934 1039 18988 -6619 -13282 11874 8425 -4428 -4150 2503 10607 1200 -5350 3508 6227 4509
948 4509 -7444 -5233 16633 -413 -21932 3255 14228 -8542 -16863 3816 12935 -13145 -13525
961 -13525 14105 2593 -11990 -2235 2140 4624 -1054 -8037 1513 7252 3025 -6170 -1084 19454
975 19454 1674 -17955 13004 18753 -10757 -9444 11798 10559 -13059 -8965 15238 627 -13771
988 -13771 108 2681 1386 -3179 -10051 2652 5790 -7057 -9363 1362 11528 -6336 -16570
1001a6570K9945k52k7780J0339J9258q463j7740P636K0817j5488j5507J7599K661
1014F455p862p22k242Q414J18j1380L817Q029J303j2566n740K3457k247k6157
1028a7323J3008J8448j2852j3209J0411J7654j5106j5487K1852L463j5010K907
1040a244J879L062R1r460L714P557m16j1762m371K2650l102k9910J7464K0775
1054A6927k3327j0973J9062J0183j9148q421K4523o40j7717P959N254m22N80q491
1068d651N491J0279p038r974L093J7512p561k4083K0689J6839k9714m510K4537
1081A0909r81k0649p92K1328o393j7263J2361L873o503L204o446M085J1653j1130
1095b744q348J0941J1082j0403j5161K0750J0403k7373L156K2888p099j5362K666
$$ plain form
1001 -16570 13375 13123 -14657 -4318 14940 6477 -11263 -3627 17190 1702 -13805 3794 6455
1014 6455 -1407 -2129 -4371 4043 4161 -7219 -3402 4627 5930 -6636 -12376 11081 8834 -17323
1028 -17323 -4315 14133 1281 -11928 -1517 16137 1031 -14456 7396 10859 -4151 -1244
1040 -1244 635 3697 3788 -5672 -1958 5599 5183 -6579 -10950 11700 8598 -21312 -3848 16927
1054 16927 -6400 -17373 1689 11872 -7276 -15697 8826 8186 -9531 -1572 3682 3260 3840 -4651
1068 -4651 840 11119 4081 -5893 -2800 14712 7151 -16932 3757 20596 -9118 -13628 10909
1081 10909 9928 -10721 -11513 9815 3422 -13841 -1480 2393 -4110 -906 -7352 -3267 8386 -2744
1095 -2744 -11092 -151 10931 528 -14633 6117 16520 -10853 -7697 15191 8092 -7270 -4604
1108d604J6789m421j7475J0913O914r817J319j879R21Q085j0300o055J1363N638
1122G391j1398j0653J9763Q510k9303N173K6463j3105j6340J0821J3968q030j4831
1135a1571J3386Q576j3335K17M033K34M697r748l166J2652k4j0966m144J6430
1149G271L612k7312Q237K7476j9931j6627K0234Q310j5370o138J6638K031j5765
1162g334O325N877m907O109p537n860J6764j506j5488K623J5159l694k1316J1256
1176c529K1052k2415j1221K1977J319j5044j509J2343J305j3428N194P333n589
1189b212M030m628m363J6210l582j5966R893J4114j0015j6200J6085J6651k5533
1202e516o240K5768m814j6735M985R861j271j2514K041R941n225k605j871j121
$$ plain form
1108 -4604 12185 7764 -9711 1202 8116 -1701 -382 -2261 -1340 6745 -3555 -9610 1753 7391
1122 7391 -4007 -14660 5103 13613 -15690 -10517 15946 2841 -13499 -2678 11290 3260 -11571
1135 -11571 1815 10391 -2944 -2727 1306 1540 6237 -3511 -6677 5975 5951 -5015 -9159 7271
1149 7271 10883 -16429 -8192 19284 -647 -17274 2960 11270 -4100 -10238 6400 8431 -7334
1162 -7334 -1009 4868 -39 6070 -1467 -7327 9437 7931 -7557 -4934 10225 6531 -14785 -3529
1176 -3529 17523 -4892 -16113 5864 7183 -7861 -9370 2973 4278 -9150 -3956 3377 -2212
1189 -2212 1818 -2810 -7173 9037 5455 -10511 -618 13496 3481 -12719 3366 20017 -5516
1202 -5516 -11756 14012 9198 -7537 -2552 7309 6038 -6476 -4435 5506 281 -2324 -4195 -5316
1216e316J0623o298j1636J2885O785j1188q397J4198J1948k2624m824K7846o982
1229G020j9347J1708J1454q064r344P276Q892q889j372K493k986P823m374j1962
1243i672J3587N887j6273k978J5119M997k1307j518K6023r947k0043J6617R160
1256I652j2554n395R209N696r172o41O026m177N944k073j1966J4565O630k0818
1270i074J266J9391m154k0644P074K2360j6897j5688K2072L236j6357J937P109
1283A631J932n432k676N320q8J768l042o473J4400J394j9112P502J6377r558j4117
1298a0174R638J5720j6431j2132K2275N65j8747N366Q545k480m856k426N215P78
1312H56k322k185k334J0966j430j6603J1284J3383j4149q212J2678R591j3640
$$ plain form
1216 -5316 5307 -991 -12627 258 7043 -4145 -12542 1656 13604 -9020 -13844 14002 7020
1229 7020 -12327 -619 10835 2771 -6573 703 9595 706 -666 1827 -1159 6664 2290 -9672
1243 -9672 3915 9802 -6471 -9449 5670 10667 -10640 -12158 13865 3918 -16125 492 9652
1256 9652 -2902 -8297 912 6608 -2564 -3205 2821 -1356 4588 2515 -9451 5114 11744 -9074
1270 -9074 -7808 11583 7429 -13215 -6141 16219 -678 -16366 5706 8942 -7415 -5478 1631
1283 1631 3563 -1869 -4545 775 687 2455 -587 -7060 7340 8734 -10378 -2876 13501 3943 -10174
1298 -10174 -536 15184 -1247 -13379 8896 9461 -9286 -3920 4625 2145 -2711 -5137 78 856
1312 856 -1466 -3651 -5985 4981 3551 -13052 -1768 11615 -2534 -10746 1932 11523 -2117
1325b117r148K0762J167j9328O482J1415n706n595M30O612j801m580J149j805
1339b063N982m9j4919R359J3186j7120p379J6964M543j7342l295K1908l531k0731
1353a4487J2656J1567j1330k654M835L075j374l918K050J129K912r46j1557R895
1367A853J2130j9885l835J9556k402j7457L622J8131q777j7962J6272Q009j5902
1380f647J791O952k644O65j898r38L850K541m313p422J2484P043k0196K235K0115
1395A3618j0121j3615R885J1632j0091j2090J3959O230j5085J237P156k846J06
1408b5l466J09O013j687m982k027R487K923j6093M469J7609j2736j0396J3948
1422C146P332j1518p834J3811N600j5564J708J0315m943k633j259K074M682n062
$$ plain form
1325 -2117 -11265 9497 10664 -8664 -2182 9233 3527 -2068 -1638 4974 3173 -1407 -258 -2063
1339 -2063 3919 3870 -11049 -1690 11496 -5624 -13003 3961 8504 -8838 -12133 9775 6244 -14487
1353 -14487 -1831 9736 -1594 -4248 587 3662 2288 -1630 420 1549 4461 3515 -8042 1853
1367 1853 13983 -5902 -9737 9819 7417 -10040 -6418 11713 2936 -15026 1246 9255 -6647
1380 -6647 -4856 2096 -548 117 -1781 -2719 1131 3672 -641 -8063 4421 11464 -8732 -6497 13618
1395 13618 3497 -10118 -233 11399 1308 -10782 3177 9407 -5678 -4441 2715 -131 -25
1408 -25 -3491 -3382 2631 944 -4038 -6065 3422 6345 -9748 -5279 12330 -406 -10802 3146
1422 3146 10478 -1040 -8874 4937 10537 -5027 -3319 6996 2053 -580 -1839 235 4917 -145
1436a45m551K689N570J9j2603M076J5837j3006j0832J6079N359j4098m333J5252
1450E313K251j6258M819J2373q682k709M596q50K814k132m421L497M806k510j0271
1465g364O271J3459j5521q990K0328l14j7355K606J3966l134j4343P078J0725
1478G412j0670j767O201k286K983j194n830O358N095o202o621R210Q972j6814
1492e153l735K0885n974j5981Q923R953p799r045P767P536j0691k180P426k202
1506b70P97k126m775Q400K344r358m14R147K325j2999K62J8096p825j4220J1949
1521A333P903r040n477P253O227r479k830Q672j928k553m43k645O366q2q829J883
1537c669P583j544r667J513J4684q174j3594J4155P067j2830k521R621M036j0134
$$ plain form
1436 -145 -4696 -2007 3563 3582 -9021 -4945 10892 -2114 -12946 3133 8492 -5606 -9939 5313
1450 5313 7564 -8694 -3875 8498 -184 -2893 1703 853 3667 1535 -2886 611 5417 2907 -7364
1465 -7364 -1093 12366 -3155 -12145 8183 7869 -9486 -6880 7086 3952 -10391 -3313 7412
1478 7412 -3258 -5025 1176 -1110 1873 679 -5151 1207 6302 100 -6521 2689 11661 -5153
1492 -5153 -8888 11997 6023 -9958 -1035 8918 1119 -7926 -159 7377 -3314 -5494 1932 -270
1506 -270 527 -1599 -6374 2026 4370 -4988 -5402 3745 6070 -6929 -6667 11429 3604 -10616 1333
1521 1333 9236 196 -5281 1972 8199 -1280 -4110 4562 2634 81 -362 -3007 3359 3277 -5552 -3669
1537 -3669 3914 2370 -7297 -5784 8900 726 -12868 1287 8354 -4476 -6997 2624 6660 -3474
1551c474j926J0723k651m365K471j510M402O42q648L392P735m642q477M042J2135
1566I849r681j2229J5559M938j5895J510J0929j954r069J773R369m639m728M639
1580C71j567K995J177q865N527Q331q336o047Q852P015j1679o648J6332L81j6261
1595h422N589R547n806n581K366O087l513m885L933M67O54j20o759O517O629j0256
1611c553k554J0186K144j0395k066J4094j796j4393Q151R009q435m431M281M717
1625D959l108o023M084K920k178j504l665N576L708j0667K63R998j909q703M21
1640e828J1402k131j3360Q499R889j0322l873P849L161m807m104N974K281m700
1654g0M96j070L193K841r241P07J0587n620q317M655Q674n640j1025R891P679
$$ plain form
1551 -3474 -5400 5323 2672 -1693 778 -732 3670 4312 -4336 -944 6791 2149 -6328 -2286 9849
1566 9849 168 -12061 3498 8436 -7459 -5949 4980 3026 -6043 -4270 5099 460 -4268 371
1580 371 -1196 1799 2976 -5889 -362 7969 -367 -6414 2438 9453 -2226 -8874 7458 7839 -8422
1595 -8422 -2833 6714 908 -4673 -2307 3780 267 -4618 -685 -218 436 316 -6443 74 6703 -3553
1611 -3553 -6107 4079 6223 -4172 -6238 7856 6060 -8333 -182 8827 392 -4039 242 4959
1625 4959 1851 -4172 -88 2832 654 -850 -4515 1061 4769 -5898 -5635 4363 2454 -6249 -5828
1640 -5828 5574 3443 -9917 -1418 8471 -1851 -5724 2125 5286 479 -3625 2349 4630 -70
1654 -70 426 -644 2549 5390 -3851 -3144 7443 1823 -6494 -1839 6835 1195 -9830 61 7740
1669G740j3033j643R601m5n450j490N356J762m983Q89R25J652K701q012J148J1096
1685H214o526q386Q024O544p914p353J0897M806j3700Q73J0332m434m651J287
1699a987K733J520m645j096L654J707j417o100M078Q896r268n297J0932K254q890
1714b926j988R473K127j1951J810J0758n569n208L136K477L96m849n6M556j033
1729A153k681k582L936N626r179l281J1207q76q908J819Q002l66r597K749J0392
1744G414o145n946N696K912j518m470J067N713k737l542K74K436L324o718l314
1759e554J0574j698j0185L569Q078l258r364N059R195q458m619Q265M87l316q99
1774b124J019M268k037m092L007K920P54o032p13J0401l957r647P162O265o825
$$ plain form
1669 7740 -5293 -6936 2665 2620 -2830 -4320 1036 2798 -2185 -1296 -371 1281 3982 -4030 -2882 8214
1685 8214 1688 -6698 1326 7870 -44 -7397 3500 8306 -5394 -4521 5811 1377 -3274 -1987
1699 -1987 746 2266 -2379 -3475 179 1886 469 -5631 -1553 7343 -1925 -7222 3710 5964 -2926
1714 -2926 -4914 4559 6686 -5265 -3455 7303 1734 -3474 -338 2139 2535 -2314 -2370 2186 1153
1729 1153 -1528 -4110 -174 5452 -3727 -7008 4199 3323 -5585 -3766 4236 3870 -5727 -2978 7414
1744 7414 1269 -4677 1019 3931 2413 -2057 -990 4723 1986 -1556 -1282 1154 4478 -2240 -5554
1759 -5554 5020 3322 -6863 -3294 4784 1526 -7838 -2779 6416 -2042 -6661 1604 2091 -1225 -2124
1774 -2124 -1105 3163 1126 -2966 41 2961 3715 -2317 -3030 7371 3414 -6233 929 7194 369
1789C69o000N804O809q997l789R022j112n106Q56P95L023j643m565L551L634k118
1805E33m906J892Q489n505p948J0170L324q340j100N990K807o679k915Q589r29
1820C472n955J444J918J865l200l968N339K462n194j912L027M990n275n937R252
1835B328K490r350O73O626J093o539j175Q569j445p174L728K952l85k520k853
1850b982N683J323o366J50L666J683m901l747Q326J528r946J797P500j863o424
1865d573M81Q504k869p349N465L706l485r04m97L881J270n767J112M587m91m462
1881a391j637P760q3j0320M459P106n602m614L274M943l689n825N676K811m815
1896a947m34N38K973N20n728J866O104l147m316J701O633j907q528O127O273p302
$$ plain form
1789 369 -5631 173 6982 -2015 -5804 3218 2106 -3000 -2144 -1349 1674 31 -4534 -983 2651 533
1805 533 -4373 -2481 6008 503 -7445 2725 6049 -2291 -3391 2599 5406 -1273 -4188 4401 3472
1820 3472 -2483 -1039 879 2744 -456 -4424 915 3377 -1817 -3729 -702 4288 -987 -6924 2328
1835 2328 4818 -4532 -3859 2767 3860 -2679 -3854 4715 3270 -3904 -176 2776 2391 -129 -2982
1850 -2982 2701 4024 -2342 -2192 1474 3157 -1744 -5491 2835 4363 -5583 -3786 3714 1851 -4573
1865 -4573 -4092 4412 1543 -5806 -341 3365 -120 -1024 -1521 2360 3630 -2137 -1025 3562 3071 -1391
1881 -1391 -3028 4732 4649 -5671 -1212 5894 292 -4322 -1048 3895 206 -5619 57 2868 -1947
1896 -1947 -2381 -1843 1130 1650 -4078 -2212 3892 745 -3571 -1870 4763 2856 -5672 455 6728 -574
1912e74k912N265K350l293m240M526L278n463j095J966K228r25n836L635N251
1927D161o042k553M229K842k761n450N463N104p326j454N976J273l838l245N644
1942B023L040p160J6M761k02k144k752K802M139n881k144M905J279l376l773M722
1958B55M225q001j216P528p94n010n38N341K014p410J096O104k454k146l49K563
1974A208K903n359j635O315j54m435k047N708K006p865k52Q640l751n665K830
1989a553L486n71n354J278N509k697k744P97K409K055n376o50P211j788n196K009
2005a175M424J60o370J448P276m528m823M122K636j551m516J461N316l737l755
2020c612L168J965l83m483N57O754l873m900M384K805j780m062K223N818m283
$$ plain form
1912 -574 -3486 1779 4129 836 -3404 1122 4400 -1063 -2158 -192 2036 1111 -4725 -1090 4161
1927 4161 -1881 -4434 -205 2637 -124 -5574 -111 4993 -2333 -3787 2189 3462 -376 -3621 2023
1942 2023 5063 -2097 -2081 2680 2478 334 -2418 384 4523 -1358 -3502 1403 2682 -694 -4467 255
1958 255 4480 -3521 -4737 2791 1997 -3013 -3551 1790 3804 -3606 -2510 3594 1140 -1006 -1355 1208
1974 1208 4111 -1248 -2883 3432 3278 -1157 -3204 2504 4510 -3355 -3607 5033 1282 -4383 -1553
1989 -1553 1933 1362 -3992 -2714 2795 98 -2646 -1849 560 2615 -2761 -3411 3800 2012 -3184 -1175
2005 -1175 3249 3409 -2961 -1513 5763 1235 -3588 534 3170 1619 -2897 -1436 3880 143 -3612
2020 -3612 -444 1521 1138 -3345 -2788 3966 93 -4807 -423 2382 602 -3460 -1237 4581 298
2035B98m479N179K437k578l316K379N211m747m074N614J052k765k189J165M624
2050C811l827m297M809J873l110k669J869N122m270n090P164J925n193j357L771
2065E31L423n152k243O492p2m263N32J365L361l656l535N139J711m684j367K992
2081E74L275n070l767P889q0o459J147L364P01l850j743O219o77m460J185K386
2097F34J801l009l051O153R03o043J154M008N75m144j794O717q23o213K917K940
2113B725j070k828j621N292n97n813K176L515r40l153r57N521n78o007L319L499
2129B483j517l001j07N115l03o313L094M256k487l177O43M859j478n747L622L539
2145C481l482j977Q48L320p91n242L074L392k895k263N62M095p43o168M141M688
$$ plain form
2035 298 -4181 998 3435 857 -2459 -80 5131 384 -3690 1924 2976 211 -1978 -813 3811
2050 3811 -16 -4313 496 2369 -741 -3410 -1541 3581 -689 -5779 1385 3310 -1883 -3240 531
2065 531 3954 -1198 -3441 3051 2979 -1284 -752 613 3974 318 -3217 1922 3633 -1051 -2418 574
2081 574 3849 -1221 -4988 2901 2821 -3638 -2491 873 1574 -2276 -4019 2200 1523 -2937 -1752 634
2097 634 2435 -574 -3625 2528 3431 -2612 -1458 2550 3125 -1019 -2813 3904 3081 -3132 -215 2725
2113 2725 1655 -1173 -2794 2498 1901 -3912 -1736 1779 839 -2314 -3271 2250 1672 -4335 -1016 2483
2129 2483 966 -2035 -2142 2973 2670 -3643 -549 3707 1220 -1957 -1314 3545 2067 -3680 -58 3481
2145 3481 -1 -1978 -1130 2190 1399 -3843 -769 2623 -272 -2535 -1973 2122 1379 -4789 -648 4040
2161D040m946j978K780L333k524m369M832K626m783m2J784J462p95m274K782L919
2177C847m476k234K355L140k272m896M540L655o223r91M526L74k400k487M058
2192E16K434m786R9L084P44j544k896L159L518n119j194M244M98k580k879M153
2208A451K481o388rM868n65l223j545L661J789n660K98M498j051j983j298L130
2224D54K184m881k11M739p77k636r17L589K230n775K11N507j582l533P8L580P04
2241B964n588J160M921l038k487J041J767Q40m087p9M854j703k934J64L353J197
2257B345n480P55O636l613l853L212K647j157l653J603M468l594j815K004R77
2272A482K14l443n0M808k150l796J998K874q60m684J781N681m450l528M724J251
$$ plain form
2161 4040 -906 -2884 -104 3229 705 -3664 1168 3794 -989 -1031 753 2215 1420 -2854 -72 3847
2177 3847 -629 -2863 -508 2632 360 -4536 4 3659 -2564 -3555 971 1345 -1055 -3542 516
2192 516 2950 -1836 -1737 1347 2091 547 -2349 810 4328 -791 -1985 2259 2757 177 -2702 1451
2208 1451 3932 -2456 -2465 2403 1838 -1385 -2930 731 2520 -3140 -2842 1656 605 -1378 -2676 454
2224 454 2638 -2243 -2454 2285 1508 -1128 -2045 1544 3774 -2001 -1790 3717 2135 -1398 -1320 2260 2964
2241 2964 -2624 -1464 3457 419 -2068 -1027 740 1580 -2507 -2586 2268 565 -2369 -2205 1148 2345
2257 2345 -3135 -2380 4256 643 -3210 2 2649 1492 -2161 -558 3910 316 -1499 505 1482
2272 1482 1696 -1747 -1797 3011 861 -2935 -937 1937 1077 -3607 -1826 3855 -595 -4123 601 1852
2288A852k367j662J643L444l182j995L195R48q87k491O82M753l077l845M027J765
2304B803k589k639K297L798m574l079N281N66l452p86K143K173l238k030M119
2319G93K44k116n72R55L181k660k580M185J489l295j287K532L094m224k672N683
2335B750J2m196K84K888N89l608j463N014j024l700J481P65J496k076k442M127
2351H97R75l921j90L306J292l886j758O285o99n230K815K897j635k213j98L882
2367B619j104l253J713J287K25j818k312M553L77n132R99L575p95l555K40N096
2383B715j507n357L918K387k511j016O71K830r36l074J940J943j160j250j188
2398a595L852J31n167K283L737k943k590J414L517k339l823L876J822l410p90
$$ plain form
2288 1852 -515 -2177 -534 2910 -272 -2267 928 1876 989 -1502 -820 3933 856 -2989 1038 2803
2304 2803 214 -2425 -128 3670 -904 -3983 1298 1864 -1588 -2374 -231 1942 -1296 -3326 793
2319 793 1037 -1079 -1651 -696 2485 -175 -2755 1430 2919 -376 -1663 869 3963 -261 -2933 2750
2335 2750 2762 -1434 -1150 1738 2327 -1281 -2744 2270 1246 -2454 -973 -208 1288 -788 -3230 897
2351 897 1872 -2049 -2239 1067 2359 -1527 -3285 3000 2301 -2929 -114 2783 1148 -1065 -1263 2619
2367 2619 1515 -1738 -25 1262 1487 -331 -2643 1910 2287 -2845 -1846 1729 934 -2621 -2381 2715
2383 2715 1208 -4149 -231 2156 -355 -1371 -700 2130 1194 -1880 60 2003 843 -407 -1595
2398 -1595 2257 2388 -2779 -496 3241 298 -2292 -878 2639 300 -3523 353 2175 -1235 -2025
2413b025J674J684r02l328K726K158k353q50N22K515m10m145K643L712l485j886
2429a750K086K575k099l841L908K220m906L16J930N19j200k199K639J649l439
2444a592j64J678R99p97l219K842L270m044j462L294J380k588k166M046J986n480
2460b017J095L537j250j607q03K055J209k933n10K151N9q88k726K665L118n315
2476b160q93M742m06l202m48L653O43m885J583L750k226j078O10J405R77l196
2492a131K88K773l67j830j163K436J910m973q2N065k017l322J166L000q65l684
2508b796J502L770k959j584J574J189K17k624L48L392j311k190R14J888Q34l751
2524a587M11M455k171l171K171K065j298l148J581L747l586j766K970O7j047j411
$$ plain form
2413 -2025 -351 1333 431 -2897 -171 1987 -366 -1216 -694 1821 1411 -2734 -91 3621 136 -1750
2429 -1750 336 2911 812 -3029 879 3099 -1807 -1491 439 958 -242 -2441 198 1847 -1592
2444 -1592 -1756 -78 921 124 -3095 -253 3017 -1027 -2489 805 2185 -403 -2569 1477 3463 -2017
2460 -2017 -922 2615 1365 -242 -1045 1010 2219 -714 -1224 927 986 98 -2628 37 3155 -2160
2476 -2160 -3053 1689 1283 -1919 -2367 1286 1929 -2956 -1373 2377 151 -927 -317 1088 2065 -1131
2492 -1131 -843 1930 1563 -267 -1430 1006 2916 -2057 -2139 2926 909 -2413 -1247 1753 888 -2796
2508 -2796 -1294 2476 -483 -2067 -493 696 913 -1711 -1363 2029 718 -1472 -558 1330 2164 -1587
2524 -1587 -1176 3279 1108 -2063 108 2173 875 -2273 -692 3055 -531 -2297 673 740 -307 -1718
2540a718M88K706j847j668J581J303j35k832N01M373k411l370L752J611k269j697
2556a632J939K955l877j241L434l59j460l79L51J957j489k071K047J090j530j973
2572b238J219L579l379k692M286J351l607n72K664J353l204m76L405p04j696M83
2588b28M32J112p84j997K633R83k710r55J732K181l263k061M915j23m134N75K553
2605H61j26k374o2L120q41k557J534Q71N00j678j004K979P07l172N36J873P62
2622A929k507j354M373l84m315J969K514j259k397M0L174j172k997K082R61n77
2638H0j032p32K618J20l023Q06K534m90k135n53M183o60m325K775K634k499j383
2655a082J216J876j516k251K550O93j526n32m07J871M6k924J044K664j443k362
$$ plain form
2540 -1718 -1230 1476 -371 -2039 -458 845 710 -2122 -1621 2752 341 -3029 723 2334 65 -1632
2556 -1632 307 3262 -615 -1856 1578 1219 -241 -620 -269 1688 199 -1872 175 1265 -265 -2238
2572 -2238 -1019 2560 -819 -3511 775 2126 -1481 -2053 611 1964 -1240 -1716 1689 985 -711 -228
2588 -228 204 1316 532 -1465 1168 2151 -559 -1514 218 2399 -864 -2925 1990 1867 -2267 -1692 861
2605 861 735 -1639 -1701 1419 578 -1979 -445 426 926 -752 -1756 1223 1930 -1242 -706 1167 1929
2622 1929 -578 -1932 2441 2057 -2258 -289 2225 966 -1431 -1391 1783 611 -2386 -304 657 80
2638 80 -952 -1684 934 1054 -1969 -1163 1371 881 -1254 -1807 2376 1716 -2609 166 2800 301 -1082
2655 -1082 134 2010 494 -1757 793 1486 -40 -572 -979 892 938 -1986 -942 1722 279 -2083
2671b083O42L321j444l646L103K527l686m21K323O61j254j585K228Q95j837J27
2687a29J80J133R5k846J361K854k800j684J784K042j905k917L169J657l818K66
2703a558K431k62j345p91J748R29k198j66J428P83k82k343J874K524l135j111
2719a474K597R27k174j589K891J328m029M0L109j004j385n10J588O56k474K72
2735a231J937n27n58j243J301K228l109o08L016J45k173m63K659Q06l813R47L451
2752B765k079j749R68J257K7k157M49J817j202o67n08J077J306k821o55L795j048
2769E75k502M70K590k8l221J081L349k461j542K069N45l68j203M45J776q66j181
2786d72L15R15Q55k513n17L634j597l140K265J630j415k095J467K827l159r08
$$ plain form
2671 -2083 -1441 1880 436 -3210 -107 2420 -1266 -1687 636 1297 43 -1542 686 1581 -256 -129
2687 -129 51 1184 1279 -1567 -206 2648 -152 -1836 -52 1990 85 -2832 337 1994 -1824 -1558
2703 -1558 873 611 -734 -1525 223 1152 -1046 -1212 216 999 717 -1626 248 2772 -363 -1474
2719 -1474 1123 2050 -124 -1713 1178 2506 -1523 -1483 1626 622 -763 -1273 315 971 -1503 -1231
2735 -1231 706 179 -379 -1622 -321 1907 -1202 -1810 1206 1351 -822 -1285 1374 2180 -1633 -686 2765
2752 2765 686 -1063 -95 1162 1189 -968 -519 1298 96 -571 -1079 -2 1304 -1517 -2172 1623 575
2769 575 -1927 -1457 1133 1105 -2116 -1035 2314 -147 -1689 380 925 557 -646 -201 1575 709 -472
2786 -472 -157 758 1613 -900 -1417 2217 620 -2520 -255 1375 -40 -2135 -668 2159 -1000 -1908
2802a908K213O5n51r02Q17J274o47j743J441J017j64k026L53L281j921k501K857
2819I55J079k041j305J556J848k405j421K743k94j269k71L92J657j586j531K122
2835B29O32j550l76M60K428j766k606L489Q17k530j66J507J708k759r71L300o98
2852A148j871L65Q74L95j098j256K212J77j813l22Q26J599j294k514L530M84l200
2869a758L52K396L27k454k10L017o14k383J273J094n29l47p20J523L74k144M20
2886c83J150O22k007j546L325M9l472J240K239r59k158P42K104p52k237K061O09
2903F27p82k31o41K123M44k331Q4K139m85j274p34L190n93l670K252J913j953
2920G8j296P96J726j008k074J991M94j194l30K98J035Q6k357J123J876j179j355
$$ plain form
2802 -1908 305 370 -181 -1083 -266 1008 361 -1382 59 1076 912 -1114 -761 2520 599 -1902 955
2819 955 2034 -7 -1312 244 2092 -313 -1734 1009 715 -554 -825 -433 1224 -362 -1893 229
2835 229 861 -689 -1065 -605 1823 57 -2549 940 1757 -773 -939 568 2276 -483 -1454 1846 1148
2852 1148 -723 -358 516 911 -187 -1443 769 946 -867 -1189 -363 1236 -58 -2572 958 1442 -1758
2869 -1758 -1406 990 1317 -1137 -1347 1670 1056 -1327 -54 1040 511 164 -556 967 1341 -803 -383
2886 -383 767 1389 -618 -2164 1161 1210 -2262 -1022 1217 258 -1900 -1158 946 194 -2043 18 627
2903 627 -155 -386 -1027 1096 1540 -791 -707 1432 947 -327 -1061 2129 1536 -2134 118 2031 78
2920 78 -1218 -422 1304 296 -1778 213 707 -487 -817 -519 516 602 -1755 -632 1244 65 -1290
2937a290Q63J762l86k978K049K228k572n79J406P48r55j549J669J238k414J09
2953f51O89K43J24j872R95J883j827j018R70J443p35k387J986K338l232m27K439
2970I61K27j413j072J995O22k065M59J320n52J01j328O26J712j770j208J854N46
2987A015j146j479J815J567l166m87L006o06j799K03J284O78k183P69J401k87
3003E85m19p59J070J221j900j005K275K9j398p97K253M94k963N25K513j494j203
3020i73L70Q96J28j539nJ708o75p09k9P38J009j748n58K679n27j918N52J672J68
3039A239k459M86K525j370j675J339R80m86j364K20J845j542p19O16O47L08j608
3056a018k38K538r90k109J262J189n94j485O53K844j896j834K289M00q01q88N26
$$ plain form
2937 -1290 -427 1335 949 -2029 20 2248 -324 -903 503 1251 296 -1253 416 1654 -760 -651
2953 -651 38 281 405 -1467 -472 1411 -416 -1434 -464 979 244 -2143 -157 2181 -1051 -1478 961
2970 961 1188 -225 -1297 698 1320 -745 -286 1034 482 583 -745 -119 1593 -177 -1385 469 1015
2987 1015 -131 -1610 205 1772 -1394 -1881 1125 519 -1280 -1077 207 885 -1298 -529 872 585
3003 585 166 -593 477 1698 -202 -1207 1068 1097 -301 -1098 1155 1649 -1314 -789 1724 230 -973
3020 -973 -603 293 421 -1118 -1123 585 -90 -799 -828 -90 919 -829 -1387 1292 765 -1153 -601 1071 1239
3039 1239 -1220 -734 1791 421 -1254 85 1065 579 -785 -565 1280 -262 -981 -365 282 590 -1018
3056 -1018 -1256 1282 292 -1817 -555 634 40 -1445 -792 2052 156 -1678 611 1011 210 -678 -152
3073a52J807j364j139J282K15J3j137l96K248r38k318J815J187j472r52P11K022
3090A432j911j228K485R8j660K58L83R57q42r27J522L55o26p77L60K054j480j910
3108a457K232P58k048n99J745Q53j796r16K208m42j614M15P75L74q91j028J595
3125A64N35j546Q3M26J351j430j237K361P64k503M71J475J42j247q07K497l99
3142A100k375J276R01l60j091j29J243L18j990N56Q59J29q55j202K298L31k708
3159a699Q14J731m90r96q2J968n04j994J246J323j056o90J9J281J8j689N85Q51
3177F36l55n89o69J770J28k509J248J251q77j227O02J604q99j626J584J332j718
3194c14l32N12P33J4j280N21J466r88q83R4J564j06k283J262J986k200p18J196
$$ plain form
3073 -152 1655 291 -848 434 649 662 -475 -871 1377 439 -1879 -64 1123 -349 -1301 -590 1432
3090 1432 -479 -1707 778 876 -784 -526 -143 814 -28 -955 567 922 296 -481 -121 1933 453 -1457
3108 -1457 775 1533 -515 -1114 631 1484 -312 -1228 980 538 -1076 -661 114 488 -403 -1431 164
3125 164 699 -847 -764 -338 1013 -417 -1654 707 1471 -1032 -561 914 1056 -191 -998 1499 1100
3142 1100 -1275 1 902 542 -549 -678 565 883 -1107 -551 308 437 -418 -1620 678 1009 -1699
3159 -1699 -885 846 356 -640 -722 1246 742 -1252 -6 1317 261 -429 -410 871 889 -800 -215 636
3177 636 281 -308 -977 793 921 -1588 -340 911 34 -1193 -591 1013 114 -1512 72 1404 -314
3194 -314 -646 -134 599 613 -667 -146 1320 332 -551 -457 1107 1001 -1282 -20 1966 -234 -952 244
3212B44O44p99j749J571R58j654nN47O40k88j504R49J610j460j071J474Q36m93
3230D50j795J634J633k428m94J919L00j119q55J190J107k067j12J404n48l02r60
3247a043O89J387j589o55J430K06p77r57J227J665k847n0K072J40j371j62J004
3264C69J025k034K00J701o13o15k68P05Q70j765l65J474j18r87m04J016R90k042
3282h61l76K429r73j089j8J115M30j592J54K124j017j164M47P89O31j541l08J921
3300A101m05j357K52J102L06j841Q2K242r01j877J044O22m16r22L07J421p15j221
3318a176J132L41J45j127l07K150p74j261P23J223n57j213O29J561q51j865J512
3335B85P66q67p39K95J059o94j067J166J79l81j121L41J745r30j545J237J237
$$ plain form
3212 244 888 89 -1660 -89 869 -785 -790 -243 397 109 -1395 -446 1164 -296 -1367 107 943 450
3230 450 -1345 289 1922 -506 -1000 919 1219 100 -755 435 1542 -525 -637 767 219 -83 -1043
3247 -1043 -354 1033 -556 -1211 219 425 -352 -1309 -82 1583 -1264 -1314 758 898 -473 -635 369
3264 369 1394 -640 -440 1261 648 33 -235 470 1340 -425 -790 684 566 -421 -825 191 1181 -861
3282 -861 -1237 1192 219 -870 -888 227 657 -935 -781 1343 326 -838 -391 398 1029 -512 -820 1101
3300 1101 696 -661 -409 693 999 -842 -760 1482 581 -1296 -252 370 -46 -968 -661 760 45 -1176
3318 -1176 -44 297 442 -685 -992 1158 384 -877 -154 1069 512 -701 -72 1489 638 -1227 285
3335 285 1051 184 -555 -260 799 105 -962 204 383 2 -1119 -778 967 37 -1508 -271 966
3352I66j048j108P07J558r62j393J671N87j384p2N88R97p84j261J597L82j216
3369a75l11K72J294r91j185J433M14j244n41Q58J019j144j329K162K78j743P9
3386h54J124L42q81q42J706L27j537J52O36P74o87j254J614M59j655K36P61M58
3404H79j483m83J702R7j965N49J291n21n90n21J627J71j782P49M66M12r29n34
3422h65J457N98k294O72J370k79q86n86J849j18j939O97J385r31k02m91J022K30
3440F89j741N60J198m72r35k42J557j47j584O30J404o31r30L55J152j90j621P58
3458a90J399j129n84O30P10k82j619J128J257j462o14M49Q34J14j633N56J597
3475A161j324r62J008Q44q07j236Q91J720j663o34J319L07m73j052J010J072j366
$$ plain form
3352 966 -82 -1190 -483 1075 113 -1280 391 978 -406 -478 110 1107 323 -938 659 1041 -175
3369 -175 -486 -214 1080 89 -1096 337 751 -493 -1034 -176 843 -301 -1630 532 810 -933 -854
3386 -854 270 612 -269 -1111 595 922 -615 -463 173 947 260 -994 620 1079 -576 -340 421 879
3404 879 -604 -1087 615 712 -1253 -704 587 66 -524 -1045 582 753 -1029 -280 186 598 -331 -865
3422 -865 592 1190 -1104 -432 938 659 -227 -813 1036 918 -1021 -324 1061 130 -72 -563 459 689
3440 689 -1052 -492 706 234 -701 -943 614 467 -1117 -487 917 286 -644 -289 863 673 -948 -190
3458 -190 1209 80 -504 126 836 554 -1065 63 1320 -142 -756 -307 527 641 -992 -436 1161
3475 1161 -163 -1125 -117 727 -80 -1316 -425 1295 -368 -1002 317 624 151 -901 109 1181 -185
3492a85k41Q31L14l06j405J063J300j838n68J541M27r02j240J036J112j809l31
3509a201J509J75q01o08O07J227j204q27J437N92j224n40J146J142j825m72J982
3526A115l66j122k35J001Q77j720l34J779o43r98J43K22J047j414n40J829k51
3543C90j105J49P91O88j687k73K168n25j195K75Q50M75j293l89J921n55j309M81
3561a43O24L18j322l00K052n41j836O78J198l94j040n88K140n91j283O77J262
3578I11m01j200O7J745p65j142P59J069m85j028J80J463o67j309R44P87n74r02
3596e48k11J714p77j513J181J315j037j168Q11J343j154j382J294N36p30l48L58
3613c16J443p46j523J303Q49q32o63L27J475r44j366J199O52j206l17O50J066
$$ plain form
3492 -185 -426 405 719 413 -992 71 1371 -467 -1035 506 933 31 -1209 -173 939 -870 -1201
3509 -1201 308 483 -318 -926 -319 908 -296 -1123 314 906 -318 -858 288 1430 -395 -867 1115
3526 1115 749 -373 -608 393 1270 -450 -784 995 352 -646 -503 -281 766 -648 -1188 641 390
3543 390 -715 -566 225 913 -774 -1047 1121 596 -599 -324 526 1001 -292 -681 1240 685 -624 -143
3561 -143 481 799 -523 -823 1229 688 -1148 -470 728 334 -706 -1294 846 255 -1028 -351 911
3578 911 510 -690 -623 1122 357 -785 -26 1043 558 -470 -290 1173 506 -803 141 928 354 -548
3596 -548 -759 955 178 -1335 -154 1161 124 -1044 -233 1110 -44 -1426 -132 404 -326 -674 -316
3613 -316 1127 381 -1142 161 1010 178 -485 -158 1317 373 -993 206 858 -348 -665 -15 1051
3630A051j149j103J483M62j364o1L07R35o67j431K000L44j387k85J042P23p05
3647A95j434J738M93j163j68J013K78o04j244J218P76j754J00R65K22o11j106
3664a086J340M73j637M6J163Kr61o07J609O73j967K41J262J56r96o71J401O14
3682A055k067P38J276l98p17k07J102L09k055M11J489n25r67l51J601J39j904
3699a071J68J589p29o35N6J091K00j952O51J615j064o51N68J025j79j614M33J600
3717A101q70j008N51R95Jj726O64J669j086j226Q95P51k80j553N80J610j217j010
3735a159Q24Q00j16j419P01J586j116j059J154P73n66j358J011J315j499m98J058
3752D32N16m21j389R36J103j257q76J172M69q29q94J322O27j573n39J292M31p34
$$ plain form
3630 1051 -98 -1201 282 744 -620 -681 -374 561 -106 -1537 463 807 -580 -865 177 900 195
3647 195 -1239 499 992 -171 -339 674 952 348 -896 322 1098 -656 -556 409 631 20 -1086
3664 -1086 254 727 -910 -864 299 301 -660 -1267 342 1015 -952 -711 551 707 -289 -960 441 1055
3682 1055 -1012 -274 1002 604 -113 -320 782 1091 -964 -553 936 411 -556 -907 694 833 -1071
3699 -1071 -903 686 -43 -678 -622 469 669 -1283 -632 983 -81 -732 -164 861 682 -932 -499 1101
3717 1101 231 -777 -226 769 770 -956 -292 1377 291 -935 -40 711 431 -1122 -542 1068 -149 -1159
3735 -1159 -335 465 349 -1070 -369 1217 101 -958 196 969 403 -955 56 1371 -128 -626 432
3752 432 948 527 -862 74 1177 -80 -956 216 685 -144 -1038 284 911 -662 -1201 91 522 -212
3770b12q19Q24J258j428o24J521K60r58o29R95J487k175m90J852L5j109l42R14
3788C60N06j278n86J606k5j111l36J060Q73j592j084K270pj805L16J055N93j235
3806d20l09J587j74j209J74P37N36j154o38J693K00j824L70J097%j469k29K092
3824A060m95j638N01J061j96j232J0J836o44j431R05O83J7j107L0J418o27r76
3842h25P49J017l38j029l80J824n87j436J204Q41r37p41K46J535q51j712J160
3859b60Q59p91p62M00J355o93j302J099J070j031o70K12J484p56j447J430R58
3876A155j260o60Q70J086r42j364J517N91j187m18P85M60o24j354J495Q06j076
3893a20n30N04R61j036j178J442J389j967l67R79O72j073o63J461Q27j803K28
$$ plain form
3770 -212 -1031 -207 1051 -377 -1001 520 780 -178 -807 188 1675 -500 -990 862 897 -212 -554 360
3788 360 866 -412 -998 608 583 -528 -864 196 1069 -523 -1607 663 656 -1149 -833 222 815 -420
3806 -420 -729 858 684 -525 -351 386 922 -232 -870 823 1023 -801 -431 666 666 -803 -1032 1060
3824 1060 565 -1073 -572 489 293 -939 -929 907 263 -1168 -263 420 437 -670 -640 778 151 -825
3842 -825 -76 941 603 -426 -806 1018 431 -1005 199 1040 103 -638 -392 1143 292 -1420 -260
3859 -260 599 -192 -954 -554 801 108 -1194 -95 975 -56 -726 -514 970 214 -1233 197 1155
3876 1155 -105 -765 105 1191 249 -1115 402 993 -194 -612 173 633 9 -1345 150 956 -120
3893 -120 -650 -146 815 -221 -1399 43 1432 -535 -902 77 749 -324 -987 474 1301 -502 -274
3910b74O78M34p34r58J242Q88j909k91J594L12j047j203J877J48j613j94J393
3927C43J83j193m67J816J54j621j39J420J98q80o05J233M62j548K64J220m2j089
3945b91l84J442N21k276N44J292n10j157J75J162K53j657M90J190n77q20K6J016
3963D39J34j736O63J539o14j130J26J304N9j779N93J831j086j318P49J156n84
3980C46j352O81J516j123j007Q43O23K8j459L46J778j150j210R51Q32m32j353
3997a142P85J928j597j118J311Q48q78q86R01J072j324p19J108K81k13j318P99
4014a62J483j339j078J115Q78j079q49R88J140j531q50J534M18r93n31J084Q16
4031A044j431o92J603Q7o33o00O96J241j421q95J581O32j530l01J069N46j661
$$ plain form
3910 -274 404 838 104 -854 388 1276 -633 -924 670 982 -65 -1268 609 757 -856 -1050 343
3927 343 526 -667 -1134 682 836 -785 -924 496 694 -186 -791 442 904 -644 -380 840 798 -291
3945 -291 -675 767 1288 -988 -444 848 338 -819 -644 518 771 -886 -396 794 217 -603 -577 439
3963 439 573 -1163 -500 1039 425 -705 -579 725 784 -995 -402 1429 343 -975 -226 930 346
3980 346 -1006 -325 1191 68 -939 -96 527 555 -904 -558 1220 70 -1140 -189 643 211 -1142
3997 -1142 -357 1571 -26 -1144 167 1015 137 -749 152 1224 -100 -819 289 570 357 -961 -162
4014 -162 1321 -18 -1096 19 897 -182 -1031 -43 1097 -434 -1284 250 668 -325 -856 228 1044
4031 1044 -387 -1079 524 611 -22 -622 74 1315 -106 -1001 580 1212 -318 -619 450 996 -665
4048f65m17J789L46j578l41J114N38j273m44J694l27j146k00J377M87j428o14
4065a088J984M4j754J62J247O15j805j65J765l59j537P69P44j82j137N2J461m41
4083C75j374N18P04L09j202m86K021n81j495Q51J164m88j173R4J925n64j689R42
4101a49Q98l40r91M04J229l99j539P26J225n23j174k86J646k29j992J408J052
4118I66j003j172Q87J219j168j197J669P75j163o95O75J106l85j521J354O97j053
4135io05L11J556q68j466J202J198j649k45O28P13p13j343J460R64j755k50Q99
4153B8N24o25j091J463N54j404k79P95O79p04j074J507Q46j653m91J440N17j166
4171a34q99J758M96j780p1J217j14p62p51J192P00j623J8J061L79j043p24J621
$$ plain form
4048 -665 -1082 707 1053 -525 -866 248 786 -487 -931 763 436 -710 -910 467 954 -474 -1088
4065 -1088 896 940 -814 -652 595 1210 -595 -760 1005 646 -891 -122 622 440 -697 -645 816 375
4083 375 -999 -481 223 532 -670 -1156 865 284 -1211 -360 804 316 -857 -763 1162 598 -1091 -149
4101 -149 749 409 -582 -178 1051 652 -887 -161 1064 541 -633 -919 727 498 -1494 -86 966
4118 966 -37 -1209 -322 897 -271 -1468 201 976 -187 -882 -207 899 514 -1007 347 1044 -9
4135 -9 -614 -303 1253 385 -1081 121 1319 -330 -575 53 766 53 -1290 170 1134 -621 -871 28
4153 28 552 -73 -1164 299 853 -551 -830 -35 644 -60 -1134 373 1219 -434 -925 515 1032 -134
4171 -134 -1033 725 1221 -559 -630 587 473 -289 -1040 152 852 -771 -753 308 687 -356 -1080 541
4189E41M36j846j22J831j45j210m54J880J01j942M79J442m04n82m45J137L91j669
4207e81j06J605l71j047k46J308N25k410P06J727j083r06L59J245o3j635N53J805
4225A385j418o97K21J054K63j609M56J416p20q61J14J216Lj982Q67J486j250r46
4243a002J068Q33r19j196J039J273j323r17J235M15l89j150Q24J467j319o05P06
4260D0Q50l25j677J115J453j539r72J410Q48j020j303J119J331j615q19J433J16
4277D45q24o53O64J290j486n03J197O47r39r67J062J141j532p93K016J73j346
4294d08m17J502N67j539n67J635j45j020J6O47O36j192q38J615M07j327n93J153
4312A32R75j930m69K252l06j653M87J224jj518J57J858o77j509P96P45L92j473
$$ plain form
4189 541 977 -869 -991 840 695 -515 -969 911 1012 -930 -451 991 587 5 -440 697 1088 -581
4207 -581 -687 918 547 -500 -746 562 1087 -1323 -617 1110 27 -879 -520 725 662 -973 -420 1385
4225 1385 -33 -730 -509 545 808 -801 -345 1071 351 -510 -396 820 823 -1159 -292 1194 -56 -1002
4243 -1002 66 899 -20 -1216 -177 1096 -227 -1144 91 506 117 -1033 -209 1258 -61 -666 40
4260 40 890 565 -1112 3 1456 -83 -1055 355 1203 183 -1120 -1 1330 -285 -1104 329 445
4277 445 -379 -1032 -368 922 -564 -1067 130 777 -162 -1129 -67 1074 -458 -1251 765 938 -408
4294 -408 -825 677 1244 -295 -862 773 628 -392 -376 271 907 -285 -1123 492 899 -428 -1021 132
4312 132 1107 -823 -1292 960 654 -999 -512 712 711 -807 -650 1208 531 -978 -182 563 955 -518
4330e18l58J975j56j741L79J505l06j348m60K088o02j601O87J168m31j202K90
4347f31J690q06j300O64R92k78j072J19J572m45j523J089R07m40j166O3J963j047
4365C51j567J285R29j049q90O30J225q18j644J406P88q04o82M83J236m45j649
4382a215J464Q11r65j055P14J397p52j987J885Q45j446m29J036P54r76j077J435
4399D39N54j276q0L37P72q88j198J436Q98j171p10J031J155j462j301J771Q43
4416A150k037Q0J457K0r16o56J576M91j702K41R00M45q92j130J681N82k016O7
4434f59J210N50j631l71J821J51k135O70J105l84q23n26J508K10j598J96J238
4451E32P4q64o53J710L03j910O65J246k73j244k29J414L04j990N27J598j149q65
$$ plain form
4330 -518 -876 1099 943 -798 -419 1086 780 -568 -1028 1060 458 -1143 -456 712 281 -921 -631
4347 -631 1059 253 -1047 -383 609 331 -741 -622 950 505 -1018 71 978 538 -628 -565 1398 351
4365 351 -1216 69 998 -51 -941 -311 914 96 -1548 -142 646 -158 -840 -357 879 434 -1215
4382 -1215 249 1060 95 -960 -246 1151 399 -1588 297 1142 -304 -733 303 1057 81 -996 439
4399 439 993 -283 -363 -26 746 -142 -1340 96 994 -177 -887 144 1299 -163 -1464 307 1150
4416 1150 -887 -807 650 670 -246 -902 674 1165 -537 -296 604 1049 157 -973 708 1290 -726 -659
4434 -659 551 1101 -530 -901 920 1071 -1064 -394 711 327 -496 -1022 486 696 -902 -706 532
4451 532 606 -258 -911 799 1102 -808 -143 1103 830 -414 -643 771 1075 -915 -388 1210 61 -804
4469h04K91R61j3j647Q24J176q34r92M91R50R8j554M67J747p61j243Q21J255o26
4488F07j922J163J777j682o23Q02Q60n18j598R28J453j279r83Q07O96j80j350
4505a042N37J583j438j082J466P78o21j300J196J681k204m62J294N00n74j029
4521g17R12J296j749l95J171L17q83j065Q64J530j390j011J616M33j278p85J572
4538D38Q36j870m25J693j90j092l33R57J213j543n42J391L61j175n00J093J219
4555A531k135m78J879O1j396j01J009P47j933k33K188o73j200L06P82N17j626
4572g55l85J658J65j271m8J315L62j667n17K334j85j800M09J220n2j528j22K007
4590A140l80j678P59J009k63j234k06J758m48j483O83Q20R6j472l35K382p15j768
$$ plain form
4469 -804 -513 448 435 -1212 -388 788 -46 -1038 -547 403 501 -1053 -586 1161 400 -843 -22 1233 607
4488 607 -1315 -152 1625 -57 -680 122 982 464 -1134 -206 1247 -32 -1015 -208 488 308 -1042
4505 -1042 -505 1078 -360 -1442 24 802 181 -1119 77 1758 -446 -908 386 886 312 -717
4521 -717 195 1491 -258 -653 518 835 -48 -1113 -249 1281 -109 -1120 496 929 -349 -1134 438
4538 438 1274 -596 -1021 672 482 -610 -943 14 1227 -316 -858 533 894 -281 -781 312 1531
4555 1531 -604 -1082 797 858 -538 -639 370 1117 -816 -1049 1139 466 -734 -428 354 871 -755
4572 -755 -1140 518 683 -588 -636 679 1041 -626 -1143 1191 1006 -794 -385 835 783 -745 -867 1140
4590 1140 760 -918 -159 850 587 -647 -853 905 457 -1026 -343 477 573 -899 -1234 1148 433 -1335
4608a335J012J225p30j066L03K022j227j478J479P38p67o53K89J429n73j791J525
4625D02N54q87r94O98J363p21j871J734Q04j362p06N80J257j044j025J432O58
4642H72j214m50Q27O01l33j354J481N72j125n16P99J173j331j320J752J114k176
4659f28l9P98R13j116j085J504O96j856m5J135L60q60q23J462O41j607j95J038
4677B93N37q31j119J913N85k472M15J483oj063p67J844K07j848J99J582m52j016
4695e16n83J630M96k277N56J346k72r93l96J786L31k522P65J649n84j274J97J749
4713A088k72j881Q89J445q51q73K43J046J06j832M78J484q91p21K3J527l16k218
4731a526R81J814j295j073Q74J147l71j828J100J226r89o88N55P37k82j414R37
$$ plain form
4608 -1335 -323 902 172 -894 -591 1431 204 -1274 205 943 176 -477 -188 1241 668 -1123 402
4625 402 956 69 -925 -227 1136 415 -1456 278 1082 -280 -986 -406 851 -193 -1218 214 872
4642 872 -342 -792 35 636 303 -1051 430 1002 -123 -639 160 1333 2 -1318 434 1548 -628
4659 -628 -667 131 1044 -72 -1157 347 1043 -813 -858 277 637 -223 -1046 416 1057 -550 -745 293
4677 293 830 -1 -1120 793 1378 -1094 -679 804 798 -265 -1032 812 1019 -829 -630 952 500 -516
4695 -516 -1099 531 1027 -1250 -694 652 380 -613 -1009 777 1108 -1414 -649 1000 416 -858 -661 1088
4713 1088 816 -1065 -176 1269 418 -455 -212 834 940 -892 -414 1070 179 -542 -519 1008 692 -1526
4731 -1526 -545 1269 -26 -1099 -225 922 551 -1277 -177 1049 60 -628 -73 664 382 -1032 -95
4748i5J329r60r58M89J289p11j374Q65J469j465r15J345M57n49j473R83J459j568
4766c83n10Q44Q73q86j072J147J083j248q46J342P65q41j244R55J736j969o89
4783i43J407O26j339m25J033P54j587n92J812j28j260j8Q60P92j662m62J720K6
4801F14j382m28J569J010k161l92J905N0j228LQ38P09j564m39J852n2j129j65
4819c90Q79O83j741n83K077j16j519j23J214M62j781m11K463m30j770N87J092
4836E93J29j518m8J942p91j403O52J133n6j447J27K233q14j758Q90Q88j79j487
4854i14q0K212q33j847J383P64n14j091L72J796j137j425J292N68k07j298M49
4871e10J576p49j455J372N79n56q55L84J621j147j331J356R35j103p59O14J017
$$ plain form
4748 -95 1234 274 -684 -195 1094 383 -991 -126 1343 -122 -1037 308 765 216 -1257 -274 1185 -383
4766 -383 -893 -49 824 -62 -1134 13 1096 -152 -998 344 1109 268 -976 -21 1715 -254 -943
4783 -943 464 1090 -249 -674 359 1113 -474 -1066 746 618 -642 -660 200 992 -670 -1132 588 614
4801 614 -768 -1196 373 1383 -778 -1170 735 785 -443 -440 398 1107 -457 -896 956 904 -225 -390
4819 -390 489 1172 -569 -1152 925 809 -710 -833 381 843 -938 -1349 1114 684 -1086 -499 593
4836 593 722 -796 -844 1098 307 -1096 -444 689 633 -814 -687 1546 732 -1026 -136 752 573 -914
4854 -914 -994 1218 385 -1462 -79 685 171 -920 -548 1248 111 -1314 -22 546 339 -959 -510
4871 -510 1066 317 -1138 234 813 257 -598 -214 1407 260 -1071 285 1220 117 -642 -28 989
4888I89r74j333J582O25j191n67M34J312r15j359J651R53j387n47P27J340j403
4905f3j171J773N60j488j54J094L85q80j060J399O30j619j77J208M59r40j156
4922a200J817K96j653j67J055M36j042q93K105Q0j865L43J346K03j216o70K047
4939A022j16j590L17J152J2q99p44J627K93j978K36J343p7j093n97J854L61k317
4957a194P65J290o43j001N0J504k0j985P65J486p83j173M47J312M4j957R66J152
4975A025o92j027J34J500l36j845R20J552r10j351O40J304m00j702Q88J229j075
4992a46j051O13J333o4k066J000J663j198q51O79J180m83j561P47J545j232j286
5009a178J358P03p58j128R51J269j466q83J110P01n49j297R84J501j793o76J330
$$ plain form
4888 989 15 -1318 264 889 -302 -869 -435 877 -38 -1397 254 1207 -180 -727 0 1340 -63
4905 -63 -1234 539 1099 -389 -543 551 936 56 -1004 395 1025 -594 -771 437 896 -44 -1200
4922 -1200 617 913 -740 -907 148 584 -458 -1351 754 834 -1031 -688 658 861 -355 -1025 1022
4939 1022 906 -684 -367 785 797 -102 -846 781 1074 -904 -668 675 598 -495 -1092 762 1123 -1194
4957 -1194 -429 861 218 -783 -733 771 751 -1234 -469 1017 234 -939 -492 820 864 -1093 -127 1025
4975 1025 333 -694 -560 940 604 -1241 -321 1231 321 -1030 -390 914 514 -1188 -300 929 -146
4992 -146 -1197 -584 749 685 -1381 -381 1282 84 -767 -88 1092 609 -952 -205 1340 108 -1178
5009 -1178 180 883 125 -1003 -52 1217 -249 -1132 -22 679 130 -1167 -183 1318 -475 -1151 179
5026A79Q73j270j033J226J172j523n90J594J31j002n20J068J037j546r38J274
5042A32O32p68r56J206J216j711o69J468Q5p79p76R59J101k051L6J624j8j631
5060i00p3J309P31j729l93K083m61j130J76P27P15j526m66K153n04j533J26J318
5078F23L62j678l10K192q09j060K76Q63P0j432K02J765p79j272N71Q33l8j222
5096h43q1K144q35j280L21J168j22j444L76J858r27j287Q10J152m63j128J15J688
5114A222j068j481J222R71q43q78M39J687j090j694J347J103r59q52P96J442j128
5131B36j597J528Q96j081o59N49J443j322j060J297Q92j252q03P43J107r48j326
5148a357J413Q81j243n87O62J432j451j114J856K80j395k02J165N95r85r88J979
$$ plain form
5026 179 1052 -218 -1251 -25 1147 -376 -966 628 759 -243 -763 305 1342 -204 -1142 132
5042 132 764 -4 -960 246 1462 -249 -918 550 635 -144 -920 39 1140 -911 -875 749 731 -900
5060 -900 -973 336 1067 -662 -1055 1028 567 -563 -387 340 1055 -471 -937 1216 712 -821 -695 623
5078 623 985 -693 -1003 1189 380 -680 -404 459 529 -903 -701 1064 285 -987 -416 417 379 -843
5096 -843 -924 1220 385 -895 -574 594 472 -972 -596 1262 335 -952 -142 1010 547 -581 -466 1222
5114 1222 154 -1327 -105 866 23 -855 -416 1271 181 -1513 -166 937 -22 -874 -78 1364 236
5131 236 -1361 167 1063 -18 -677 -128 1315 -7 -1067 230 1122 -130 -933 -190 917 -31 -1357
5148 -1357 56 937 -306 -893 -231 1201 -250 -1364 492 772 -623 -825 340 935 -50 -1038 941
5165I41M7j316l11R93O80q60j111J646L36j652k5Q07R19j268j230J998L36j868
5183i38K08J058L25j218n79J657J89j562K35J151J02j218l31J639L49j868J06
5200f95J615n8j363k56J633n7j869O98J277o88r70k50J839j06j773O39J175m38
5218C53r35m38J575J65k024R82J165o77j033L10J457Qk222J376J346j135q26J2
5236e41J567o23j569J079J205q81q60L78Q43r3j632Q77J428j269q67Q71Q94m25
5254C82j744J258J362j565n78R68P55o05j144J144R24j223p18R01R58p40j256
5271i21J107J175j602p45J093N61q09r51J124J225j998l14J588J06o78r45J138
5288A54R37j550k76J459M7p35r10J215J023j850n49J567M0p59o92J207P57j672
$$ plain form
5165 941 988 -328 -639 354 1034 174 -937 709 1045 -607 -632 175 1094 -174 -1404 594 930 -938
5183 -938 -730 328 653 -565 -1144 513 702 -860 -625 526 628 -590 -921 718 1067 -801 -695
5200 -695 920 862 -501 -757 876 819 -1050 -352 925 237 -733 -983 856 750 -1023 -384 791 353
5218 353 -582 -1020 555 720 -1304 -322 843 166 -867 -557 900 908 -1314 62 1408 273 -553 -541
5236 -541 1026 403 -1166 -87 1118 237 -623 -245 598 505 -1127 -250 1178 -91 -958 -87 807 382
5254 382 -1362 -104 1258 -307 -885 83 838 233 -911 233 1157 -66 -784 117 1075 335 -921
5271 -921 186 1361 -241 -986 107 668 -141 -1092 32 1257 -741 -1055 533 639 -39 -984 154
5288 154 1091 -459 -735 724 771 36 -874 341 1364 -486 -1035 532 572 -187 -879 328 1085 -587
5306e87k78J419L8j041m88R98P59j723n0J751k20r66m35R90P36j691j2J678l92
5325D86j212K78J083M55j781P4J765p04j103N00R30j62j197l24J719p36q16L04
5343d41Q94O6j651J41J951n35j505P20J142k95j360M53J473r10j187J019N85J74
5361G34j286o6J745r44j198R12Q15m30r55M2J794j012j617J512Q75p43j056O05
5379b73J412j376j036J495M28p04o09M69J459j124j120J352L70q27o63N97J193
5396A043j038j048J359P77j530l45P01J068j186q78J550J6j058j89O41Q16q78
5413a79j221J679O40j380j57R04O86j193q67J749K94j307L8Q13N15j281o58J958
5431A033j23j507N39M27L57r21p08J200M14j557m9J255K19j210o67K083l1j740
$$ plain form
5306 -587 -865 554 592 -449 -937 61 820 -903 -953 798 578 -388 -823 167 903 -788 -800 878 486
5325 486 -726 -448 635 1090 -691 -617 1148 444 -659 -159 771 609 -588 -912 807 71 -745 -441
5343 -441 453 519 -1132 -991 960 425 -1080 -360 782 487 -873 -420 1053 143 -1044 -25 560 734
5361 734 -552 -618 1127 183 -1015 -103 712 282 -673 -631 1163 151 -1466 46 921 178 -878 -273
5379 -273 1139 -237 -1273 222 650 -54 -663 -194 1265 141 -979 373 743 -84 -747 -150 1043
5396 1043 5 -1043 316 1093 -437 -782 -81 987 -199 -1077 473 489 -569 -758 -117 699 -179
5413 -179 -1400 279 919 -461 -618 286 972 -221 -1088 661 955 -352 -314 499 1014 -267 -925 1033
5431 1033 910 -597 -58 369 726 -195 -903 297 711 -846 -895 360 579 -631 -1298 785 754 -986
5449i86L58J213j33j042j32J516L0j757Q64O50J61p78n78J387N8j604N18Q44l41
5468B48j004p7J624k4k107J072R28q59p69K83J466l71j845J243Q06p25l27J9J379
5487I60j84j859J027J136q32q37K12J394n64j462R87J366j507p11O55J028p29
5504H0j106P76J335j690j23Q32M29m29j182J013J156j375n14J021O10k87j872
5521a326J389J193j580n89J589P5o45q49Q73R51j756o9J128J15m30r02R79J007
5539A153j806k86J079L46n64q42J154Q29j698k16J421p6p81l67R44J025j962J16
5557e31J076Q5r28l49P77R43j602l63J647l38r64k23J368K20j853J6J957n29j347
5576i38L59J029L76j549K07J600q26p88R2Q94M81j316m06K058p40r73L5J156J32
$$ plain form
5449 -986 -628 585 452 -590 -722 794 824 -933 -69 581 742 -36 -614 773 831 -773 -255 589 248
5468 248 -756 -833 791 767 -1340 -268 660 -199 -968 -685 781 410 -1435 -192 614 -111 -438 -419 960
5487 960 776 -1083 -56 1080 248 -589 -377 1017 453 -1009 -22 1344 -163 -874 -219 809 80
5504 80 -1026 -250 1085 -605 -728 104 533 104 -1078 -65 1091 -284 -798 223 833 546 -1326
5521 -1326 63 1256 -324 -913 676 751 106 -743 130 1081 -675 -744 384 499 69 -833 146 1153
5539 1153 -653 -939 140 486 -78 -920 234 1063 -635 -851 570 494 -287 -654 290 1315 -647 -531
5557 -531 545 630 -298 -647 130 1073 -529 -892 755 417 -547 -770 598 818 -1035 -1019 938 409 -938
5576 -938 -579 450 826 -723 -516 1084 258 -530 -438 456 937 -379 -785 1273 533 -440 -405 751 883
5595H83j987K73J924j063q36Q30N52l31j150K92J429p98j012P70Q03j22j342J99
5613f86J916n90j502O40Q85j19j207O90J466j319j353J513K36m40o41L22J109
5630I20j030r25Q08P27m68j112O54J639j303j181J196O71o95n50O72J229j565
5647c13j014J788K18q20k97M17R68j066p88J562M8o18n62K95J062j121j095J850
5665E14K06r93n04P42N96j077n07J695j89j087J12Q30M71j033m86J437Lj445M58
5684b57P57M29r33q84J701r5j708N00J080M14j425o34J958k03j906O70P62k0r21
5703g15n7J338k30j268O56Q63k5q45l96J436J76j561N59O54L0j152OJ243k28j535
5723a051J213M64l14o77j78J292l18j442P15J126o27q32J12J317n02j580J112
$$ plain form
5595 883 -1104 -831 1093 30 -806 24 576 245 -905 -613 816 18 -994 -224 579 457 -885 -686
5613 -686 1230 640 -862 -222 663 544 -663 27 1493 174 -1179 334 570 130 -511 -189 920
5630 920 -110 -1035 -227 500 32 -1080 -426 1213 -90 -1271 -75 596 -99 -649 23 1252 -313
5647 -313 -1327 461 679 -141 -438 -21 947 -119 -907 655 703 85 -477 -182 880 -241 -1336 514
5665 514 720 -273 -777 -35 561 -516 -1023 672 483 -604 -492 338 809 -224 -710 727 730 -715 -257
5684 -257 500 929 -4 -888 813 718 -990 -490 590 1004 -421 -1055 903 700 -1206 -536 226 206 -715
5703 -715 -772 566 336 -932 -276 587 562 -283 -679 757 933 -628 -69 585 615 -537 -531 712 484 -1051
5723 -1051 162 626 312 -365 -543 749 431 -1011 -296 830 203 -629 -517 800 298 -1282 -170
5740a70J233j143m61L10J126m69j429J071Q46r78l77M45P80l77j366R16R45j112
5758b10k02L76Q32o60j225J093Q76j159p01J047P01q60j129J215R96j530RN56
5776B5O58q94q89J234Q80j220l29Q71L75n95j044J195N01j236l79J075L38q81
5794c15o59J053J006j830J13J129m11l30l54J026N83j521o5J140j57o06m42J216
5812E76M91j791J27J700m96j127J38Q03Mj270M45J045m42n89k88R90K60j191Q9
5831e26J145m98p68rR39L42j376J23J576o12j135N66P64o0j175M06J506j101k50
5850a43J27P27r4j072R2J268p21r40M66P10o7j315L99J428j053p23J054M38l21
5869B60j331P80J271j123o63R49L64k97o99N13Q72p40j177J149N91m24r77O37
$$ plain form
5740 -170 1063 -80 -541 -231 895 426 -1003 68 914 -64 -441 4 784 407 -959 -43 902 -210
5758 -210 -412 -36 796 136 -1089 4 880 -279 -980 67 768 -92 -1221 -6 990 -540 -531 25
5776 25 683 -211 -1100 134 1014 -206 -535 336 711 116 -928 267 768 -468 -847 228 566 -315
5794 -315 -974 79 1085 -745 -632 497 86 -244 -598 428 1011 -510 -575 565 408 -198 -640 576
5812 576 1067 -724 -597 1103 607 -520 -382 421 425 -845 -400 645 203 -386 -674 316 576 -615 -526
5831 -526 619 121 -647 -656 283 625 -751 -628 948 336 -799 -233 531 471 -704 -298 1208 107 -143
5850 -143 -16 711 617 -455 -363 905 184 -756 -290 420 353 -962 -563 865 -188 -911 143 581 260
5869 260 -1071 -291 980 -143 -806 143 507 210 -489 24 896 156 -1021 128 719 295 -682 -45
5887d5J097j154q82J292J31p42m10M56J096j352l40J278k12m25k20M47P74p94
5905er66J362K67p39o39O67J219j457o16J475L42j436k83J370L09j237n85J486
5923E34J0j073N7N83N16r09o71J367J45j097lP86N31j178l01J875o18j105L68
5942a83O00J63p67l90J366k83j179N54N77j66o65m45J465j94j185L95O13j36o74
5961e34k82J436k37j348O02J115n33p96L13J121o89r23N40Q65k86o67o2J139j95
5980E79j269O75P12l33r58K97J151o73j644J467P59j282j43L47Q34n49j278J483
5998A75L33o17m31L25Q39l68j022O65Q90q61l88M13O91m65r61J056P42j137l25
6017d46M19O11o77o86P66P39j125k04O50L59n70q35J369L04j018l30Q84M64p90
$$ plain form
5887 -45 1052 -102 -984 308 439 -303 -713 -257 839 -513 -853 425 213 -212 -432 15 789 -5
5905 -5 -971 391 658 -81 -720 -53 1166 -291 -907 568 910 -526 -809 561 870 -367 -952 534
5923 534 544 -529 -472 111 627 -282 -953 414 559 -538 -541 245 776 -402 -703 1172 554 -551 -183
5942 -183 417 580 -187 -577 789 506 -673 -119 458 292 -373 -818 647 453 -732 -337 276 140 -534
5961 -534 -816 620 383 -965 -363 752 219 -577 -264 857 168 -755 -215 650 364 -303 -365 774 579
5980 579 -690 -15 697 364 -594 -297 854 181 -1463 4 763 -519 -662 -315 519 -30 -1308 175
5998 175 508 -109 -540 -215 624 256 -766 -101 789 -72 -460 -47 644 179 -782 274 1016 -121 -446
6017 -446 -27 584 -93 -779 -13 726 -399 -603 47 406 -164 -999 370 674 -344 -674 210 674 -116
6036a16o52J004P58j419J34P27j62l38o69J146L90j250KP75J63o20n14J127J62
6055F48j493L66P09J91q08m38J339P3j214k26J594m44p61j20J208J54j348M38
6073a32Q12k94p16O7M41L79j132jJ205m06p53k4J063j56j210M60J264j114l93
6092f40K36P52J88j376O67O70n60m74N47O53p7j301M81J189p77m31R4P79q5j407
6112h72O25J263j128o29R02N12p80o78O24J039j202k27N59L72k25j137O22J304
6130I44j108n03J010N28r96m58P12R97j356k25J134o9m24p09N84Q02j276k17J129
6149D99j2p11l57P16N09q80p16J334J22p01o45R48O33q98n27J169K14j005j41
6168d49N90P79j227m26J343j08p08j79N77N36r13n81J183J16r00J55O07M8j033
$$ plain form
6036 -116 -768 236 994 -425 -291 436 274 -64 -733 413 803 -447 -445 330 493 -127 -641 486 648
6055 648 -845 -479 230 421 -387 -825 514 587 -627 -853 741 297 -464 -584 624 778 -570 -132
6073 -132 680 386 -330 -263 178 557 -575 -576 629 223 -530 -554 509 353 -857 -397 867 -247 -640
6092 -640 -404 348 536 -840 -173 497 -63 -537 10 663 586 -715 -234 955 178 -253 -159 620 535 -872
6112 -872 -247 1016 -112 -741 161 673 -107 -785 -161 878 -324 -551 8 380 155 -982 -360 944
6130 944 -164 -667 343 871 -125 -583 129 1126 -230 -455 679 610 186 -523 61 863 -413 -630 499
6149 499 487 -224 -581 135 644 -236 -952 382 504 -197 -842 106 739 -159 -686 483 697 -308 -449
6168 -449 141 920 -307 -733 610 502 -206 -385 192 728 -185 -766 417 533 -367 -212 395 443 -590
6187e90p9J172j25r90M02L54M85j077n8J070j58o61J36N01K89j100j98J636l83
6206F26j369M71O65J0q54p1J360q69j072R21Q15m52o61L37Q46m52j138Q10M79
6225D02n65l47J01J209l29j157Q14O18n98q66N15J258o79j019R49K30m51m89L90
6244a4M11k16j032P22O05p85j89K75N82l67j028J054P97j027l58N01J070q66q35
6263g00R49K55q05j7M59O98q78n70J162O6r40k03O70L79r22m76J108K59j066o0
6283f32P66L88n30q41J566j67j199L56M28L8j10m75Q11N57j376O9O09L70q10m51
6303f33J253K42j639M80Q53j08q63o1N82N73j297J35R15m50k34j06O87J88j171
6322f54K31Q21l27j59l01R52o2j213P30O30l95o13mJ058k18j235O26J027r61m19
$$ plain form
6187 -590 -669 503 378 -612 -210 144 629 -448 -506 564 406 -255 -119 382 671 -429 -627 1009 626
6206 626 -743 -272 393 403 -451 -522 838 -31 -1103 -182 633 181 -480 -143 703 251 -887 -77 402
6225 402 -163 -510 -409 800 471 -686 128 746 148 -718 -203 1055 376 -643 306 536 85 -404 -14
6244 -14 397 181 -851 -129 476 -309 -498 -223 359 -8 -1036 18 815 -212 -570 -69 1001 135 -700
6263 -700 249 504 -301 -318 141 839 -39 -609 553 619 -321 -524 146 525 -397 -873 235 494 -572 -632
6283 -632 134 522 -8 -849 717 550 -649 -293 135 173 63 -412 399 956 -420 -351 258 628 -182 -633
6303 -633 620 862 -777 -297 556 448 -415 -476 106 679 -618 -483 432 -18 -252 -358 329 517 -654
6322 -654 -423 398 71 -88 -389 563 501 -712 18 648 253 -360 -364 694 476 -759 -133 894 -67 -486
6342d86m0Q98k29q99M75R18p49n83M79O00k33q11N96Q06r11l30O10M34n59q52
6362h66R75Q04o64q16O67L82j2j033M84R87q82n25N37J05M5j069O44J061r92n14
6382f82P44K42n00m87O69R06j331j84R57j93j00n36N52O93q92m10R48L9l34n12
6402d11N60N72j029k39J084l65p11K60M83L60j303L81N08j05j97l89O12O40j101
6421c90j58J114j20o31q3N61M39j234j74J415k77n38l15P07J66j016j64J046j71
6440A77p82J39M50L67r28L9R91j83q66K96N92K97j142lJ441o50o88M83L51j66
6460B15o13J65R48n90m72O9Q18l31n05k12J171n73q21Q50L00r1r76K90J000o87
6480d5q04R47K86l39n55K89R76q20o84J263r3l22j62j1R94n88j012Q68L55m82
$$ plain form
6342 -486 -526 372 143 -756 -281 637 -112 -695 -216 384 151 -660 -64 742 -169 -499 111 545 -14 -866
6362 -866 109 913 249 -567 100 482 470 -563 -79 908 26 -499 38 143 188 -881 -237 824 -168 -682
6382 -682 62 304 -196 -683 -14 892 -439 -623 334 141 41 -495 57 750 -142 -552 396 435 101 -411
6402 -411 149 721 -308 -547 537 172 -539 -279 204 564 -739 -358 150 45 -152 -541 71 711 -390
6421 -390 -548 566 446 -185 -268 293 732 -502 -676 739 462 -76 -391 316 482 -534 -698 348 177
6440 177 -605 -466 -16 351 -577 -538 453 270 -596 -300 292 589 -553 -556 885 235 -453 30 381 215
6460 215 -398 -233 715 125 -347 -278 540 209 -296 -508 663 90 -731 119 419 328 -648 -358 642 -45
6480 -45 -849 98 384 45 -510 -221 755 -65 -749 514 421 99 -63 -74 920 332 -680 188 543 61
6500F1o93O01N01n30p06Q62L19q28l92N56Q63j033m16J145L18q69R5J11Q91p12
6520A44q37Q63N63p73j85M56O50r19o31J425j42q37j04N76L50p85q62J523%j210
6540g35K31O66N5m96m16J052J02r77K42N01M68q62l24J092J44j450M68O14j66
6559B09m84j81J321n28p05K53O14k07l64n17J022j30q96L31P41m94o05J73P39
6578B92R4j166N85P63n78m13K33L60J28n39Q4O87m63m57K50N35M6p38N4Q51n99
6599Il13p6P59j06p72K2Q13k55o80M35M09j78q08P33M79n42l88L21N81J87j168
6620e38O68O55p30k81M97K58l02o67M39R33j440o8Q13J33n43n11O28O62j045Q
6640d31N65P6m24l37O14N62r36j26P43K56n16n26N21P01j026m20J148n51M7j37
$$ plain form
6500 61 -632 -31 470 -60 -766 96 415 -413 -805 -249 614 -419 -835 310 628 -241 -146 -35 856 144
6520 144 -693 170 733 -40 -225 231 881 -38 -669 756 614 -223 -327 249 599 -186 -1048 475 475 -735
6540 -735 -504 162 217 -279 -695 357 459 -518 -276 225 693 -169 -493 599 743 -707 -239 375 209
6559 209 -275 -456 865 337 -368 -115 499 292 -72 -589 433 303 -593 -262 479 -15 -620 -447 292
6578 292 386 -780 -195 568 -10 -423 -190 170 298 -241 -157 530 67 -390 -140 395 441 -297 -243 608 9
6599 9 -304 -380 379 273 -499 -477 336 81 -599 -164 245 67 -741 -8 471 -71 -459 -138 443 630 -538
6620 -538 130 785 55 -226 271 529 227 -440 -1 932 -508 -576 237 370 -173 -684 -56 606 -439 -431
6640 -431 134 210 -214 -551 63 625 -311 -437 306 562 46 -480 41 742 -284 -704 444 -107 -60 -197
6660a97K59P19j057j53Q91k71m92m5L46M01r59J35J178l61o88k18P58J90r82J91
6680c55J022n55l94K07L74K43p72M1J003n55m61qM70K81j165K29R74m26o60L18
6700a89N57K01q97R0O60m55l58K97M09l41o19K76R54q51J70Q8L50Q8o49l17J153
6721F17n01p24N81L02J40p91K40R96p21p77Q24p8j14n30l9J052m04o81O86J19
6741A97K2q78M17R64n88n33L71M87m19j24R3Q85j030l35Q26j45l50j1L14N21p65
6762h1l63P66J09q78J44p4P44n35n26P68P7n51j10R08P6o31l38J225l73q01M78
6783C4N09M6m78n57P06K97q21K03K84K78r62j0P98P4q81L5O12Q6o45m01J316l31
6805A92q92Q33K24j7o65k18J091n6q73L20M09n1n63k13Q40J27j004L78N74m41
$$ plain form
6660 -197 62 781 -276 -429 462 191 -301 -346 0 401 -558 -423 755 394 -294 -512 246 436 -546 -355
6680 -355 667 112 -282 -75 299 542 -230 -189 814 259 -202 -210 260 541 -624 -395 579 153 -507 -189
6700 -189 368 569 -328 -238 422 -33 -391 -94 315 -26 -645 -369 585 -266 -96 -8 342 430 -219 -536 617
6721 617 116 -608 -27 275 415 -376 -136 860 139 -638 186 108 -6 -536 -575 477 73 -608 78 197
6741 197 219 -659 -242 722 134 -399 -28 459 40 -84 9 894 -136 -471 355 210 -140 -151 163 684 -81
6762 -81 -444 322 431 -447 -303 -377 367 -168 -694 74 151 -400 -510 398 474 -157 -495 730 357 -444 34
6783 34 543 589 111 -446 260 557 -264 -61 223 501 -461 -471 327 401 -480 -445 167 253 -392 -793 523 192
6805 192 -700 133 357 340 -325 -543 548 492 -381 -61 348 297 -266 -479 361 488 -516 -138 436 -5
6825el94mQ08m33q46N44N58k15m02K9R34m33r93O12P01k09l73K35M17r4j101R94
6847C30M40n87n28M76L00j44r39M79P82p79l24L46M34J3r06N64L01m80k30L53
6867i9L86N9j022O15O64p74j63K38O62m50n53N97O22q68Q5M09J75m81o86J086
6887E02K40r66j09M15L23k75o27O18N28j019j93O78K65l98n67P86M36j025p8O65
6907A99J08m27k97O33K64o72k3Q13m50j81l46P00L13q45J53M59j57l09l06M82
6927A11L42n86q9O26m93l81J81L79J63p46p6J101n29j20j55L67K12q64L10J068
6947H21n88n09Q3J68K31n38l9Q77m64p40M64M35K67r50J94P68l21p03O05K29J17
6968D07q63L10P82o56m63M96L02k27m25K45O49j67p16M66K93k32o07R7J268j093
$$ plain form
6825 -5 -399 -403 405 -28 -874 -330 228 13 -389 -360 574 141 -852 -240 461 252 -121 114 531 437 -664 330
6847 330 770 183 -345 131 431 287 -652 -173 609 -170 -494 -148 286 299 -607 -43 258 -222 -452 -99
6867 -99 287 346 -676 -61 603 -171 -334 -96 566 116 -437 160 782 -86 -1 408 583 102 -584 502
6887 502 742 -224 -333 82 405 130 -497 121 649 -370 -563 115 380 -18 -585 201 637 -388 -466 199
6907 199 307 -120 -417 216 480 -192 -215 598 148 -33 -379 321 634 -211 -58 401 244 -65 -371 111
6927 111 453 -133 -222 404 -89 -470 -289 90 253 -493 -569 532 3 -117 -272 95 307 -557 -247 821
6947 821 233 -276 -193 -25 206 -332 -371 506 42 -698 -234 201 468 -482 -288 480 159 -544 61 290 407
6968 407 -456 -146 636 -20 -483 13 315 88 -337 -92 557 390 -326 140 433 201 -406 -309 959 -134
6988a34l35M64N13q32l11O69N25o64n87Q54L97p10l13M85N98p82k91O26L53o82
7008a57j00K12O76o37p98J246j62l31l57M27M72o15q16J075L89j072K34L43K55
7027B84o09j52P38J24q06K44L27K66o20m45J183p1n11j40L47M42o42m96Q71n5
7047B79o83J24N67j08o75J70R29m85p16K09O94j04n16j80O73p9o83J72P62j75
7067A75m77k40J059m44p27J018R9k27l49k74O44k03o13N06J83j44qk99N63kp93
7088e53L99L19L2k96j81L77r3p33O02M94l49j24n3O29m5q06L82N10n03l26J06
7109b12Q29k88q79K98R89q65j66K89L01k21q88P28O89r16r6J90M25l91n56R00
7129A60K71m95k51M3O35k91n65N32M80o20q7K51N13m36p14N59L36o78J52K79J4
$$ plain form
6988 -134 -469 -5 508 -324 -635 34 559 -105 -692 162 559 -151 -464 21 619 -163 -454 172 525 -157
7008 -157 -257 -45 631 -6 -804 442 280 -51 -408 19 491 -124 -940 135 524 -548 -314 29 284
7027 284 -325 -477 261 385 -421 -177 150 416 -204 -649 534 463 -48 -188 159 601 -41 -537 334 279
7047 279 -404 -280 287 179 -496 -326 603 118 -598 -389 305 201 -315 -495 178 99 -584 -412 350 175
7067 175 -302 -542 517 73 -654 364 463 236 -113 -387 257 54 -559 -53 130 -14 -22 -321 242 240 -553
7088 -553 -154 165 197 -99 -280 97 4 -729 -127 367 18 -106 -159 470 425 -381 1 511 8 -318 -212
7109 -212 617 329 -550 -252 737 -128 -294 -5 296 75 -813 -85 604 -312 -408 -218 207 -184 -740 160
7129 160 431 -64 -315 -272 363 72 -493 39 519 -101 -188 63 576 140 -574 -15 321 -357 -205 74 88
7150H8l14m55R17M55r30j76M07j44L3l5M64l5p53R5Q65m75p7j63O63n7q70M88
7172iM22l24j89L6L07M84q76K1L42q3j49k78L35M20r60J37N01k84j93j18Q04L0
7194C76r21L87N25k81k03p2N53k77l55K39Q06p61j99K94K56P0j026L15P93m79
7214D0n96N23K02q5m62m9J027n68m96J93L72J38o59L41O37o74k98O79j55J27n02
7235b65P0Q43p51k84P04j1l50k25K87O55r13j41O05n8j40m02J40P04n53n33Q18
7256B00k19j40k91J79P79n65m50Q76M5k12l37L00P18j106j61P93m01k37j44L18
7276e5L98n13M1L85j51m12q9K84M89p47k09Q67K9o84K45J15L48l21m43R65m9o92
7298a99k1M13K32j37n50N38o1l44N3L69j39j48m59P20k08k74j22N77l44m35O9
$$ plain form
7150 88 -226 -681 236 691 -239 -415 -8 -152 -119 -154 310 275 -478 -383 482 7 -70 -233 430 373 -497 -9
7172 -9 413 89 -100 -64 243 727 -149 -128 214 131 -18 -296 39 459 -501 -364 137 -147 -340 -458 346 376
7194 376 -545 -158 367 86 -117 -189 364 87 -268 -29 777 16 -183 111 367 437 -589 -274 519 40
7214 40 -556 -33 169 84 -378 -427 600 32 -464 -271 101 239 -420 -79 558 -116 -414 265 110 237 -265
7235 -265 -195 648 -103 -387 317 306 -44 -269 18 673 -240 -381 224 166 26 -376 -236 468 -85 -618 200
7256 200 -19 -159 -450 -271 508 -57 -507 369 414 202 -135 165 883 -223 -384 409 8 -229 -373 -55
7276 -55 343 -170 -129 256 105 -307 -396 -112 377 -370 -579 288 317 -367 -122 -7 341 20 -423 542 493 -199
7298 -199 -220 193 425 288 -262 276 215 -129 -76 293 154 6 -453 267 59 -215 -337 240 -104 -539 -470
7319d70J070l68o72K72L58q4l58o8O77J07p62L40J90L14n16N9J67J45q96O62J75
7340C42l96J65j39K70m2o32M64L2j52l26j5P24k80n45M89M44o06J66q0N63n4p52
7362c60N75L21n03m48L51N72m16l65L56M58n37k15N16k43N6n39P06Q9m45j25j3
7383b09M50l87k94N29L12p65K12L21K02l92m14N80K56o30J52K06L75m69k84N65
7403C16K31o38k78L07J63r3l78K59O94r19J86J89l6P5l50M08K78o99K34M09j40
7424B18j43l11L26L07n12j10O76l06k11r7O09R9j000J55L23J42l89P4L71J90q65
7445d54p8P52k81j45R8J79j30j37k64O06O0m84K20J99K27p06L87K79k46k14j28
7466b60M26J53n75QO74n36PJ21o3J58n24J96N91o02j61K02M49k13o20M74M39m95
$$ plain form
7319 -470 600 232 -440 -168 190 106 -252 -320 357 464 -298 42 232 546 30 89 256 401 -495 167 342
7340 342 -54 111 -28 242 200 -432 32 64 -88 -414 -429 295 15 -530 -41 403 -203 -37 -117 446 392 -360
7362 -360 215 536 33 -415 -64 508 92 -273 83 541 4 -211 305 62 118 -421 285 374 -71 -196 -209
7383 -209 241 -146 -440 89 401 -364 -152 169 371 -21 -435 145 401 -229 -77 129 504 35 -249 316
7403 316 547 -91 -369 -62 101 8 -370 -111 583 -336 -150 39 3 78 -272 136 414 -285 -51 358 218
7424 218 75 -236 90 397 -115 -225 451 145 -66 -163 446 545 -455 -300 23 165 -224 -150 221 411 -454
7445 -454 -532 220 -61 -206 -108 71 -59 -196 -460 146 206 -278 -58 141 368 -338 49 328 82 -132 -260
7466 -260 166 319 -256 -248 426 -110 -103 18 -45 113 -411 -215 376 -226 -387 -185 264 51 -569 -95 344 -151
7488a51k61M63NOk17J38L99p33N0O13k70m5k44K3N44l86l33M74l0k22J2L6O76
7511E47o45l36M19J3P9k71l4Q89o58l55Q37k82m0k2N0J89l79l70P10P1n52n1M12
7534B21J27l76l68M61J63m81K03O7J30k99j53M18J35n21K27M8K73l02n22J072
7554E23k98n87O37l50N10n50OM76j84n50O34j0K00n76j59N74J22o11K11n2K13
7575A79m74k97Q43k87j34J05q9J02k9k02O60j66n88K07K00J72k86k38Q84k52n95
7596b85N06K4l11l8k32Q20l57n69M03l8j7jj28N69m51m81M69K35k12Q2j17K99
7618A70j66l45M04K42n01J21m8K83K41p97M92J85l36j80l0M38O3q18O85Q3o33
7639d47J64M41K13l12m25M04J41k12L9j78K99K28p70L56N48o42J27J60K45k80
$$ plain form
7488 -151 -412 51 56 62 -155 -17 382 -351 -301 312 42 -3 -247 -224 320 -66 -399 75 45 -177 -165 -129 547
7511 547 -98 -434 -15 -2 77 -194 -228 661 3 -352 485 203 163 141 191 380 1 -369 341 412 -140 -191 221
7534 221 348 -28 -396 65 228 -253 -50 17 147 -152 -305 113 248 -273 -46 2 275 -27 -549 523
7554 523 225 -362 275 -75 435 -115 -109 367 183 -367 267 257 457 -119 -278 296 418 -193 18 -34 179
7575 179 -295 -592 251 -36 -170 -65 -154 -52 -81 -283 377 211 -377 -170 30 202 -84 -322 562 310 -285
7596 -285 221 245 -66 -104 -336 484 127 -442 -39 -77 -94 -95 -223 346 -105 -586 -117 118 -94 -12 -129 170
7618 170 4 -341 63 305 -196 -75 -123 160 401 -396 96 281 -55 -235 -265 173 236 -582 103 186 -447
7639 -447 -283 158 371 59 -366 38 179 -33 6 -172 127 355 -415 -59 489 -153 -26 134 379 99
7659I9m61P24J36o34LL38R6k68k81M25J64n55k9L99J62n30RJ54J16j55l6L63P0
7682C09o00J42K08K78l30j49M25j81p5j44L44j1m32M9L61j08p9k33M01N9p92P7
7704d81O79k40k19P6J57O8o40N69N61o30j72L58J8J43l25J47K88l01m16K81J81
7725A02J42m37J18L22k86l55L64L57r1n87R6N08m59k02M15M0M1l71j1O01n13J09
7747i7J12J41Mm78K95K29j6n53L58P3J1l35j30Q02m03l03M15J47k04p4l8K25m81
7770c00j25M35L1j91p3J70K29k96m0N43p9l11p7J90Q2j87l20O59k04l51M04l00
7792a11L77l96m9M93m1o92K49J55N02o80l21N30j50k4K8J14L09k85m59M15K79
7813B43o53K72L92R2m21k5J60J9l28K02m3J61p9k47O65k84n42M03o1K91l13j18
$$ plain form
7659 99 -362 362 498 -136 -133 205 301 33 -248 177 341 -214 -243 156 318 -212 -203 -49 67 -88 -124 239 309
7682 309 -291 -149 59 337 7 -142 283 102 27 -117 227 216 -216 -167 194 86 7 -226 175 234 -558 -481
7704 -481 198 -42 -261 -185 -28 40 -600 -31 530 -100 -272 86 104 247 -78 69 357 56 -360 -79 102
7725 102 244 -193 -75 247 -39 -394 -30 327 236 -351 -255 253 -206 -408 7 47 88 -283 -294 307 -206 -97
7747 -97 15 156 160 -318 -23 206 190 -363 -5 68 79 -256 -386 416 13 -290 125 272 68 -6 -44 181 -300
7770 -300 -425 10 41 -150 -223 -53 176 -120 -160 383 304 -7 -84 106 188 1 -319 340 136 -215 189 -111
7792 -111 266 -130 -179 314 273 -419 -170 -15 487 -193 -514 16 -134 -158 -130 -16 293 8 -451 -36 243
7813 243 -410 -138 254 346 -75 -100 60 79 -249 -47 -90 71 -8 -255 410 126 -416 -13 -74 217 -96 -214
7835b14L89K0p88P89j08j0j04k94N92p3m75L35J36m6k17k33N10p5l37J57R6R5
7857A45m10O5L16K46n87J31K34j42j07K9M76n85j89L09K80j32k97J00M70m94k90
7878d32M78R3j89J39j25L90j78n27M70J29m46j17J46L43O9m04J2L61j39k65J07
7899h5J84J7o85O58J33m59K3K28K16Mm79K61N29q19J07M09j40J12m26K02K03p6
7921A17k97L44l7o5m90L51P1k00m2K55p7K6p9R3J94n50M15j45O1M9p2PM21q06
7945d56M06K59J79n2k80j82M40n50J72K59l37K64l47K10J17m01O1J49k6P7k30
7966b68K72q5r8K61P7pm07K67K43J26n34K67M5M8l12L57k37K67l56K06J75k59
7988D8j51J3J24K7l35J02M18m02l14O15j60J49l05k2N17l10m5M0R2J18m82K22
$$ plain form
7835 -214 175 195 -593 196 88 78 -26 -320 272 199 -276 59 195 149 -68 -301 209 134 -203 -46 50 145
7857 145 -265 -200 116 362 -225 -94 140 -2 -109 -80 396 -189 -378 -69 211 79 -218 -118 352 -142 -432
7878 -432 46 139 -50 89 -36 354 176 -351 119 248 -198 -315 -169 174 243 -161 -149 212 73 -192 -85
7899 -85 99 116 -569 89 222 -237 -214 14 230 234 -245 16 545 -274 -167 242 102 214 -212 -10 193 117
7921 117 -180 164 127 62 -428 -77 -6 -206 -248 7 -70 -44 -123 -30 164 -386 29 -116 -55 -6 -78 -71 350 -456
7945 -456 -50 209 388 336 56 -126 314 -236 -64 195 -142 122 -225 -15 102 -299 -238 -89 -115 -38 -268
7966 -268 4 -81 -179 82 159 152 -255 12 255 381 -153 114 159 207 -105 252 15 282 -74 132 307 48
7988 48 -103 -90 34 61 -274 -172 246 -156 -470 145 -15 134 -171 -193 324 14 -31 9 101 219 -263 -41
8010d1M81o57J96J04K03m00N2J30J90k69o0J73K32m54k2q0M67m94j22K12J41J3
8032ej82J33J95k92k34O95k55l76M13KL20l47k13L04j5l45J90J35L27l89l26N09
8054B44L0j64O9o2R3m12k43N94l06N5k8L13p0j66j59L11K2k91J52L55J12o28k79
8077d58O13j49j37J61l7M89n37j30M89k30r7j92J00M20m27j5J04J85l73O1L91
8098B31O6n32j55O37j35j61L4L47j58k76j74M15j7l09J95j5j33L54l63R2M55o74
8120b76K72Q7O7j69k8K37Rj35n07O06j06j95o2J11J64oj19L55m07J58j40K73J0
8143A99l23L68j34r4l45J37M50j03l12K8M00k41l47N89o30O50n06J8K05k50J13
8164a28J55r4K42j20J31P2j71k11M43L4k03l39K00O9j69j1K00J66j18k51O5L33
$$ plain form
8010 -41 440 -217 -21 83 286 -114 -62 68 258 -11 -71 102 334 -120 -142 -222 245 -249 -371 -159 -18 -5
8032 -5 -187 -54 141 -151 -385 310 55 -321 92 94 414 67 -146 158 143 -202 -12 123 450 61 -265 244
8054 244 274 110 179 117 210 -202 -445 149 -157 -102 -130 183 113 -53 -212 99 121 -170 -18 337 449 -179 -458
8077 -458 155 6 -131 30 -7 482 -55 -185 304 74 -23 -215 -115 305 -122 -137 -33 152 -221 -160 231
8098 231 297 -235 -390 247 112 -49 -15 332 174 -102 -276 139 122 -187 8 -7 -140 214 -149 -57 398 -276
8120 -276 -4 83 150 -19 -47 190 199 64 -443 163 57 -138 -200 -89 75 69 -50 305 -102 56 -84 189 199
8143 199 -124 244 110 16 -329 -192 258 155 -157 -129 271 30 -317 272 -358 292 -214 -196 9 -241 -128
8164 -128 27 -67 175 55 186 258 87 -124 319 353 150 -189 11 80 -89 -100 100 266 148 -103 -38 295
8186B95m83K13J06j32K9
$$ plain form
8186 295 -188 25 131 -1 28
8191B8
$$ Imaginary data points
##PAGE= N=2
##DATA TABLE= (X++(I..I)), XYDATA
0@%%%%%%%%%%Qj6J6j6K0k8L7m5N3o1P2q8J04j22J44j70J98k28K60k95L38l87M38
33B32m94N56o26P04p85Q73r73J083j202J330j470J626j796J980k180K399k643
50a386K913l210L537l905M322m792N328n948O677p544Q593r897J1567j3780J6861
65I336k1442K8924m3096P8517l15383m50316J060135O3348p33116L08793M18239
76D03939n28740o7638N47081k18385m28421M06109Q0266m23900K37486K62340
86B70137m02096j9732L91604j66089l10312L13561J28203m58829P6741M47006
96B70194k99935k71876M02802O8051l45325J11248K57680k00932j30811K31307
106I2403p4648j80657K59749O130l35494J68826K79352k26796j61224K31543Q3558
$$ plain form
0 0 0 0 0 0 0 0 0 0 0 0 8 -8 8 -8 12 -16 21 -24 29 -32 40 -48 56 -66 78 -92 106 -122 138 -157 181 -206 232
33 232 -262 294 -332 372 -413 460 -513 570 -632 698 -772 854 -942 1038 -1142 1257 -1386
50 -1386 1527 -1683 1854 -2051 2271 -2521 2807 -3141 3536 -4008 4585 -5312 6255 -7525 9336
65 9336 -12106 16818 -26278 52239 -263144 -713460 346675 410023 -323093 -14300 403939
76 403939 -124801 -192439 354642 136257 -292164 113945 194211 -229689 7797 270137
86 270137 -131959 -151691 239913 73824 -236488 77073 205276 -253553 -176812 270194
96 270194 -29741 -301617 101185 169236 -176089 -64841 192839 -8093 -138904 92403
106 92403 17755 -162902 96847 102977 -232517 -63691 215661 -11135 -172359 59184 142742
117A42742j95931K5725J43372j39613n3423J61670m6556j18558M6812M9849j9486
128c397j2307L7117j8932l9318R7753j2699j26566J22031Q5008k09284m4985K35883
140A10304J3138k61443M3908K66670j44983j91134K26546P1619k28284p183J59180
151E8338k7546j11962N3660L5255r8689P3286J03326j29991j1966J26795n9903
162A0603n2541J19424p80j74826N3622K06763j56130j72011K45747N4122k47508
173a13515O2486J75391j11094p9332J25648j9376j26138J21283N4874k00923O9375
184d1321J67281j89713n6668K32171m6088k17325J14050J82229j79623j10990
194a45997K24330j2181j98388J13688J03532j33414p633J09607l4843o4230Q1290
$$ plain form
117 142742 -53189 -27464 115908 -23705 -77128 84542 37986 -80572 -33760 16089 -3397
128 -3397 -15704 21413 2481 -36837 60916 48217 -78349 43682 128690 -80594 -125579 110304
140 110304 123442 -138001 -94093 172577 27594 -163540 63006 134625 -93659 -100842 58338
151 58338 30792 -81170 -27510 7745 -90944 -17658 85668 -44323 -56289 70506 10603
162 10603 -41938 77486 76706 -98120 -44498 162265 6135 -165876 79871 133993 -113515
173 -113515 -51029 124362 13268 -66064 59584 40208 -85930 35353 90227 -110696 -41321
184 -41321 125960 -63753 -120421 111750 65662 -151663 -37613 144616 -35007 -145997
194 -145997 78333 66152 -132236 -18548 84984 -48430 -56063 53544 18701 -45529 35761
205C5761R884j01793R6927N9363j96688M6695K15308j47808j68820J89209R7856
216A35894k11323j7768K22303q7663j82250J71227P5763j78979K0056J13480o5840
227e100n2353P4597J460p5893O7440M3373j32874M5120J42746j25865q5142J56823
239E4332K2689j57809K8882J62420q9791j37056J52463N5567j54688M1885Q8991
250F7885q8946j5327Q4626l8070p0855Q9934L0076j47059N2700J49437j39127
261b4726p8767J72357n975j54104O3063J38350j04286j17003J43264N6842j38324
272d9309K4677P3662o6146j503N3182l8427k8118O0051p600r2856P1872R3893
284I3378j51094l5190J80096m9167j47712J05410J01067j31444o0949J52725P294
$$ plain form
205 35761 45645 -56148 40779 100142 -96546 -49851 165457 17649 -151171 38038 135894
216 135894 -75429 -93197 129106 41443 -140807 30420 106183 -72796 -52740 60740 -5100
227 -5100 -57453 17144 18604 -57289 10151 53524 -79350 -34230 108516 -17349 -102491 54332
239 54332 77021 -80788 -51906 110514 20723 -116333 36130 91697 -62991 -21106 67885
250 67885 -21061 -36388 48238 10168 -60687 29247 59323 -87736 -35036 114401 -24726
261 -24726 -103493 68864 62889 -91215 -28152 110198 5912 -111091 32173 89015 -49309
272 -49309 -24632 49030 -17116 -18619 34563 -3864 -31982 28069 20469 -72387 -515 93378
284 93378 -57716 -92906 87190 38023 -109689 -4279 96788 -34656 -95605 57120 64414
295F4414j42123O5809Q1970r4204J666O6527m1895j8143M7815j7056n3722O0813
307B1871M9339j20286l621J44805p1530j16506J11146O6073j17331l5387J12948
318D1521m087j07982N9247O3728r1624N541O6150m4224r982M4908k8959l6902
330d2665O3091L4752j01105N235J22324p5352r0278J27582L6838j32321r46J17902
342F5057k4237j05195O0025O5084r0581n08O9719m5402j3506M1698l4925k3445
354c6216O3228R523r2588K1655J08776q1505p6415J33254J2690j32065M0304J06315
366G6956o0634q0655P9753M5004r5645J1933P0251n6537r205M9454m2857j4398
378b6580O0153j6732o8879M4110P0782r4535m5918J32210j5647j25023O5358Q3100
$$ plain form
295 64414 -77709 -11900 70070 -24134 -22468 44059 2164 -15979 31836 14780 -38942 21871
307 21871 71210 -49076 -52697 92108 20578 -95928 15218 81291 -36040 -71427 41521
318 41521 37434 -70548 -11301 52427 -39197 -33656 32494 -11730 -21712 23196 -5763 -42665
330 -42665 20426 55178 -45927 -40692 81632 6280 -83998 43584 80422 -51899 -52845 65057
342 65057 40820 -64375 -4350 60734 -29847 -30355 39364 -6038 -19544 22154 -12771 -36216
354 -36216 27012 36535 -56053 -34398 74378 -7127 -83542 49712 62402 -69663 -29359 76956
366 76956 16322 -64333 15420 60424 -35221 -23288 46963 -9574 -18779 30675 -12182 -26580
378 -26580 33573 16841 -52038 -7928 62854 -31681 -77599 54611 38964 -86059 -20701 62399
390F2399p5690m2071P9320J8143p8156K2183N9204n0924j522M1273m8998n59N8832
403D3434l3042m8054N2789L7469q3337j4335J14783l8430j12631P8670O4986q8738
415b6436k4432P2537m29o5717K4558N4255m2702q112L5410l4865R956M4808m7873
428i042k8156N7645J0620o9110O735Q9950m3683q5952Q7400N0217r3673q043P3576
441C8484j2428o1154K2687M6805m4874j6474M3313k6971l655M4150l8719k1433
453c0269N9673k177o6753K0512P6765n4079p2950R2578L2729j01976J9280P9109
465E2442l7815m9398L8832L3842m2041j3554L1379k6095k639L4817m2038j1445
477c3713N8773k0384n1793M4478N5140o1513m8183R2468J5389j00886L2437P0711
$$ plain form
390 62399 -13291 -55362 23958 42101 -36055 -13872 45332 -5592 -7114 34159 -14839 -15398 43434
403 43434 10392 -37662 15127 52596 -30741 -45076 69707 31277 -81354 -2684 62302 -26436
415 -26436 -50868 21669 21240 -44477 -19919 34336 -8366 -16478 18932 -15933 -5977 38831 -9042
428 -9042 -37198 20447 31067 -38043 -31308 58642 14959 -70993 16407 66624 -27049 -35092 38484
441 38484 26056 -35098 -12411 34394 -10480 -26954 16359 -10612 -14267 29883 -8836 -30269
453 -30269 29404 27227 -39526 -19014 57751 3672 -69278 23300 56029 -45947 -26667 52442
465 52442 14627 -34771 4061 37903 -4138 -17692 13687 -12408 -15047 19770 -22268 -33713
477 -33713 25060 4676 -47117 -2639 52501 -9012 -57195 35273 50662 -50224 -17787 52924
489E2924n8703l3052N2193J5576l9125O41L0030k0454J07K6593l8632l0M7833
502C5901m2002l2882N6777J5390o0952r271P4206o136p8149L9564N6179n8457
514i832k6953M3134Q232l0909q015K3429p098o542K2316j9564J434M2532l5039
527b875k5777N9259O191o1266K239O1632j6988o4665M6606M5278o6276j2224N6471
540B7605k254l3988m082K1959j646j8269J0073o364n260K4702k5822j6995N2660
553B2319K47n5147J0578N8034j8281o3948M1923M8239p0371r825O5751j8870l7214
566b6565K3046K1109j2825p678J4199p508k356K0996l1888j2456N3263k0723n1459
579d0845L8327L7877m3086l3682N5824K8088p1594l19O6590k4665l8238K5333
$$ plain form
489 52924 -5779 -38831 13362 28938 -10187 -9546 20484 30 137 26730 -11902 -11932 35901
502 35901 -6101 -38983 17794 33184 -27768 -37039 37167 31031 -47118 -7554 48625 -9832
514 -9832 -36785 6349 14581 -16328 -24343 -914 -8012 -14554 7762 -11802 -10368 32164 -2875
527 -2875 -28652 30607 36798 -24468 -22229 39403 22415 -42250 4356 49634 -16642 -28866 27605
540 27605 25351 -8637 -12719 9240 7594 -10675 -602 -6966 -12226 12476 -13346 -30341 22319
553 22319 22566 -32581 -22003 36031 17750 -46198 -4275 43964 -26407 -36232 29519 10649 -26565
566 -26565 -3519 17590 4765 -2913 11286 3778 1422 22418 -9470 -21926 31337 10614 -40845
579 -40845 -2518 35359 -7727 -41409 14415 42503 -29091 -29410 37180 12515 -25723 -390
591c90J4169j4011n820J0457j675j125J4327k5052p117M9622k4956m7732M5849
604F546J8890n1503n720M9435k089n6526J7878N3708k9884k5219K6298N825n356
617B283n998J721J3849n619q947l473R661K6568k6016l1024M5522J6666m5311
630a0118n571L9950K1n0087J0081N0888l3966l3977L6545O975k1252j838P389
643d960P993r411p104N590L983J0835j7349j6385L9862M448m1994J1593L8738
656B5839r115l9458J5259M7778l2998l4086M5082O346l4941N611J5706k110r593
669f80k114R26M20J5434j5135k4342L9276M467m9687K2023L8486l2709k9425L2975
683h5K8770l9303j8017M5480l823l1479J4608J2476k312p665j0363J1536J1268
$$ plain form
591 -390 13779 -232 -6052 4405 2730 1605 15932 -9120 -16237 33385 8429 -39303 6546
604 6546 25436 -26067 -31787 17648 15559 -40967 -23089 30619 735 -24484 1814 7639 2283
617 2283 -3715 -1994 11855 6236 -2711 -6184 3477 30045 4029 -26995 18527 35193 -10118
630 -10118 -15689 24261 24282 -25805 -15724 35164 1198 -32779 3766 10741 -10511 -12349 -4960
643 -4960 3033 -6378 -13482 -7892 -3909 6926 -10423 -26808 13054 17502 -24492 -12899 25839
656 25839 16724 -22734 -7475 40303 7305 -26781 18301 24647 -10294 -4683 11023 8913 -680
669 -680 -2794 -1868 -1448 13986 -1149 -25491 13785 18252 -31435 -9412 29074 -3635 -33060 -85
683 -85 28685 -10618 -28635 16845 13022 -18457 -3849 8627 6315 -1350 -11713 -177 11091
696A1091m161j6060n050L2710n613m2691K9733L0744m1393j6603L8582J3700l9302
709a4313r399M3049p381l1465J9022J0494p012k113q921J1819J1189j5987o862
722g880J0920J4321j5509k2875L0718J4961l9468m001L0633L541k8274q426L6372
735A5033m298l7669J9773K2503j8256r903M038J2149J115j2809K004O913O222
748F815n829j7073K5456J5963l9221l83L6839m984k7598K037L0480r573l2942
761b0013K3434J9616k7144p073J2021N813l882j3336L913P642j20n831j3707K0395
775A728J5519l9858J637M2945j5509l0948J8790K8021j9584k5722L0695J4588
787B2302k9987K073J3177j435J783j2152P75J6350p770j2955J885J8395k97l2079
$$ plain form
696 11091 6930 -9130 -14180 18530 12917 -29774 -41 30703 -10690 -27293 11289 24989 -14313
709 -14313 -23712 19337 11956 -19509 -487 10007 2995 882 -8039 3780 14969 -1018 -7880
722 -7880 3040 17361 1852 -21023 9695 24656 -14812 -18813 11820 15361 -12913 -21339 15033
735 15033 10735 -26934 -7161 15342 -2914 -12817 -8779 3370 4485 -8324 -6320 593 6815
748 6815 986 -16087 9369 25332 -13889 -14272 22567 17583 -10015 -7978 22502 12929 -20013
761 -20013 3421 23037 -4107 -11180 841 6654 2772 -10564 -6651 991 871 -4960 -18667 1728
775 1728 17247 -22611 -20974 21971 6462 -24486 -5696 22325 2741 -22981 7714 22302
787 22302 -7685 -5612 7565 6130 7913 -4239 -3464 12886 5116 -7839 -5954 12441 12144 -19935
801a9935J1554L1774k5578j9172K3660J2537k0428j6719K7198J3553l1516R7K0393
814G418l337l458o829M754J4031j2219r926J0754J1761o377k3185J3149K6792
827B3328k5558j5747K5185N854j8707j0737K1239J2404l1135k631K7477o087j4101
840i216J840J0494N311j5271l29J4787J13o110j1324R577K2879k4956j6745L2479
854A3529L848k8278j878K6301L095l2453N895K8587j7428j4374J2368L599r55
867A856j0186k147J4190j011q318n521Q959J6638k1541j0520L2850l377k9036
880a7164J0136K3910o509k6266J1149K6038k0433j1059J8102Om766n309k917J5070
894I988k189j6029k06J1803P200k1190n254L0247r215k5803J7183J7320j2480
$$ plain form
801 -19935 -8381 23393 -2185 -21357 2303 14840 -5588 -22307 4891 18444 -13072 -12975 7418
814 7418 4081 623 -6206 -1452 12579 360 -9566 1188 12949 6572 -16613 -3464 23328
827 23328 -2230 -17977 7208 13062 -5645 -16382 4857 17261 -13874 -16505 10972 4885 -9216
840 -9216 -7376 3118 8429 -6842 -7171 7616 7729 1619 -9705 -128 22751 -2205 -18950 13529
854 13529 17377 -10901 -12779 13522 16617 -15836 -9941 18646 1218 -13156 -788 2811 1856
867 1856 -8330 -10477 3713 2702 -5616 -11137 -2178 14460 -7081 -17601 15249 11872 -17164
880 -17164 -7028 16882 10373 -15893 -4744 21294 861 -10198 7904 7910 3144 -2165 -5082 9988
894 9988 7799 -8230 -8436 3367 10567 -10623 -15877 14370 5155 -20648 -3465 13855 1375
907A375j7199J0713K1636j8142j3787K0880K507r991k516L494J3078p148j3477
920h577J0340P899k872j3703j239K4177j0834k6375J9685J7144j8456j4160J4425
933b546J8390k1269j3231K7544K87j9250L809Q002N093p520p658J1147M269m605
947B462n284K76J8117q522k4120K2390J5219k5494r228J9631R207k3678o261K8639
961A3354o472k2741J2638Q179m061m008o281P905O080p454n941L328J6230r718
975A038k1049K6775J3627l0890n01K5273j475k1820J637K4660j0008k0846J5973
988B394O950q104k128m886Q821N461j4262j832J0455N081j3169j2359K4427O122
1002A2971l0403P176K4148r772j6716P369K0027j0490j9473J8265Q645j4433J79
$$ plain form
907 1375 -15824 -5111 16525 -1617 -15404 5476 7983 -2008 -4524 -1030 12048 4900 -8577
920 -8577 1763 9662 6790 -6913 -8152 16025 5191 -21184 -1499 15645 -2811 -16971 -2546
933 -2546 15844 -5425 -18656 8888 9175 -10075 -6266 1736 6829 -691 -8349 2798 7067 2462
947 2462 -2822 -2546 15571 7049 -17071 5319 20538 -4956 -14184 5447 14654 -9024 -15285 13354
961 13354 6882 -15859 -3221 4958 897 -3111 -9392 -1487 4593 -2861 -8802 -5474 10756 1038
975 1038 -20011 6764 20391 -10499 -11000 14273 12798 -9022 -7385 17275 7267 -13579 2394
988 2394 9344 1240 -888 -5774 3047 8508 -5754 -7586 2869 7950 -5219 -17578 6849 12971
1002 12971 -17432 -10256 13892 4120 -12596 -5227 14800 4310 -15163 3102 11747 -2686 -2507
1015b507J288M267K344j0986K685R416k010r063m768J7997K717k7096P898K2512
1029A4694j4219j4637J1014J5114j1258j7989K0189J0106j9683J768Q496q30O63
1042C428o921K019R019l182q083k247J6267K648k8501J0416K6469k2418j5861
1055a6947K0941R133j8968j0465K1554M218k2692N908J1555n660Rm535K194J1138
1069G383o531r317N198J3394k775k1859J4099K2241k6441r690K7879P05k1759
1082g473k64K0472k314k1210R886J0221j1707J035o45j378J0150q890j0137J1316
1096i38Q741r478j3878J4883J4585k4994l369K6700o143j8224N734J6173k246
1109G546j7571Q087J3672j1746j802M518j661O131o493p678J1787M182j0958q458
$$ plain form
1015 -2507 -1219 3048 5392 -5594 -2909 6507 4497 -4566 -9334 8663 11380 -15716 -7818 14694
1029 14694 475 -14162 -3148 11966 708 -17281 2908 13014 -6669 -4901 3595 2765 3428
1042 3428 -3493 -1474 7545 4363 -3720 -5967 10300 12948 -15553 -5137 21332 -1086 -16947
1055 -16947 3994 13127 -5841 -16306 5248 9466 -13226 -7318 4237 -1423 -1414 -5949 -3755 7383
1069 7383 852 -8465 -3267 10127 7352 -14507 -408 21833 -4608 -14298 13581 14286 -7473
1082 -7473 -7737 12735 10421 -10789 -903 9318 -2389 -1354 -1999 -3377 6773 -2117 -12254 -938
1096 -938 7803 -1675 -15553 -670 13915 -11079 -14448 12252 6109 -12115 -6381 9792 7546
1109 7546 -10025 -1938 11734 -12 -1814 2704 1043 7174 681 -6997 4790 8972 -1986 -10444
1123a0444J4425J0687k5899k528K9298j0425k1368J2838J3969q658j4670J0671
1135b104J3243j4574l637R827j150J820m734n140J2607Q81j1729j522J2344N008
1149A1140k2481J092K9065j5210k2920K1225J0830j7360p323J5508N260j7300
1161h474K283J2315p459J579k63p627J3983K302j6287L234J4976k781j8027O616
1175c630K2921j8048j7067K3849M973j9034r79J2008K047j3836R71J1354p049
1188a520j288J123o418J1152J267j7191P963J4657r721j4131J2563J7705k0595
1201d434j2199K7792K69k1236O938J2137k357j0480P26J2135m425o737K589n60
1215A58O128k790j2509J0245P841j2999o384J1187J0019j8097r777K6501j184
$$ plain form
1123 -10444 3981 14668 -11231 -13759 15539 5114 -16254 -3416 10553 1895 -12775 -2104
1135 -2104 11139 -3435 -7072 2755 1605 3425 -1309 -6449 6158 7039 -4690 -6212 6132 11140
1149 11140 -11341 -10249 18816 3606 -19314 1911 12741 -4619 -11942 3566 8826 -8474
1161 -8474 -6191 6124 -1335 244 -19 -7646 6337 8639 -7648 -4414 10562 7781 -10246 -3630
1175 -3630 19291 1243 -15824 8025 12998 -6036 -7015 4993 7040 -6796 -5825 5529 -1520
1188 -1520 -2808 -1685 -8103 3049 4316 -12875 -4912 9745 24 -14107 -1544 16161 -4434
1201 -4434 -16633 11159 11428 -9808 -2870 9267 6910 -3570 -2844 9291 4866 -1871 718 158
1215 158 6286 3496 -9013 1232 9073 -3926 -10310 877 10896 -7201 -16978 9523 8339
1228H339k4759J1072J4882r996r186P154J0480q168n440P855j639K603J026j1469
1242g246R636R713j6042l825J5237L943j7944m668K4337m377k4593J4522J3864
1255A2557j5398o485J0232N654r294l829Q975k721j12K750j0497R042J0723j8811
1269g214j947K0581l044j9388M890K1850j1651k0347K0362R300k0569Q37J0773
1282D433n74n784l384N913P55k431j67n341Q327N694j7873L586J8445r107j3862
$$ plain form
1228 8339 -16420 -5348 9534 -462 -9648 -2494 7986 -182 -5622 2233 594 3197 4223 -7246
1242 -7246 2390 12103 -3939 -7764 7473 11416 -6528 -11196 13141 8764 -15829 -1307 12557
1255 12557 -2841 -9326 906 6560 -2734 -6563 2412 -309 -421 2329 -8168 874 11597 -7214
1269 -7214 -9161 11420 8376 -11012 -6122 15728 4077 -16270 4092 13392 -7177 -6340 4433
1282 4433 3859 -1925 -5309 604 1359 -1072 -1239 -6580 1747 7441 -10432 -6846 11599 2492 -11370
$$ [...]
8191a09
##END NTUPLES=NMR FID
##END=
